##TITLE=1H_LY-DMAA.Per.2.6
 CDCl3
 8 sc, 
 9.02.2022
##JCAMPDX= 6.0         $$ Bruker NMR JCAMP-DX V2.0
##DATA TYPE= NMR FID
##DATA CLASS= NTUPLES
##ORIGIN= UXNMR, Bruker Analytische Messtechnik GmbH
##OWNER= root
$$ XWIN-NMR		Version 3.5
$$ Wed Feb  9 13:35:31 2022 Russian Standard Time (UT+4h)  she@DPX200
##.OBSERVE FREQUENCY= 200.131346
##.OBSERVE NUCLEUS= ^1H
##.DELAY= (6, 6)
##.ACQUISITION MODE= SIMULTANEOUS
##.ACQUISITION SCHEME= undefined
##.AVERAGES= 8
##.DIGITISER RES= 18
##SPECTROMETER/DATA SYSTEM= spect
##.PULSE SEQUENCE= zg30
##.SOLVENT NAME= D2O
##.SHIFT REFERENCE= (INTERNAL, D2O, 0, 15.7039)
##AUDIT TRAIL= $$ (NUMBER, WHEN, WHO, WHERE, WHAT)
$$ ##TITLE= Audit trail, XWIN-NMR		Version 3.5
$$ ##JCAMPDX= 5.01
$$ ##ORIGIN= Bruker BioSpin GmbH
$$ ##OWNER= she
$$ F:/spectra/data/she/nmr/H-F/1/audita.txt
$$ ##AUDIT TRAIL=  $$ (NUMBER, WHEN, WHO, WHERE, WHAT)
(   1,<2022-02-09 13:34:19.90 +0400>,<she>,<DPX200>,
      <created by zg, POWCHK disabled, PULCHK disabled
       configuration hash MD5:
       00 E9 B6 7A A2 85 ED C7 34 08 36 98 17 FE 4E 26
       data hash MD5: 16K
       24 24 E9 2A 01 F6 26 2D F9 D1 D3 BC C7 B2 1A C5>)
$$ ##END=
$$ 
$$ hash MD5
$$ 3A 3A E1 52 33 29 63 D0 E3 C1 83 22 90 CC EB 0D
##$RELAX= 
##$RELAX= 
##$RELAX= 
##$RELAX= 
##$RELAX= 
##$RELAX= 
$$ Bruker specific parameters
$$ --------------------------
##$DU= <F:/spectra>
##$EXPNO= 1
##$NAME= <H-F>
##$PROCNO= 1
##$TYPE= <nmr>
##$USER= <she>
##$AMP= (0..31)
100 100 100 100 100 100 100 100 100 100 100 100 100 100 100 100 100 100 
100 100 100 100 100 100 100 100 100 100 100 100 100 100 
##$AQSEQ= 0
##$AQ_mod= 1
##$AUNM= <au_zg>
##$AUTOPOS= <>
##$BF1= 200.13
##$BF2= 200.13
##$BF3= 200.13
##$BF4= 200.13
##$BF5= 200.13
##$BF6= 200.13
##$BF7= 200.13
##$BF8= 200.13
##$BYTORDA= 1
##$CFDGTYP= 0
##$CFRGTYP= 5
##$CHEMSTR= <none>
##$CNST= (0..31)
1 1 145 1 1 1 1 1 1 1 1 1 1 1 1 1 1 1 1 1 1 1 1 1 1 1 1 1 1 1 1 1 
##$CPDPRG= <>
##$CPDPRG1= <>
##$CPDPRG2= <>
##$CPDPRG3= <>
##$CPDPRG4= <mlev>
##$CPDPRG5= <mlev>
##$CPDPRG6= <mlev>
##$CPDPRG7= <mlev>
##$CPDPRG8= <mlev>
##$CPDPRGB= <>
##$CPDPRGT= <>
##$D= (0..31)
0 1.2 0 0 0 0 0 0 0 0.06 0 0.03 0 0 0 0 0.0002 0 0 0 0 0 0 0 0 0 0 0 0 
0 0 0 
##$DATE= 1644399259
##$DBL= (0..7)
120 120 120 120 120 120 120 120 
##$DBP= (0..7)
150 150 150 150 150 150 150 150 
##$DBP07= 0
##$DBPNAM0= <>
##$DBPNAM1= <>
##$DBPNAM2= <>
##$DBPNAM3= <>
##$DBPNAM4= <>
##$DBPNAM5= <>
##$DBPNAM6= <>
##$DBPNAM7= <>
##$DBPOAL= (0..7)
0.5 0.5 0.5 0.5 0.5 0.5 0.5 0.5 
##$DBPOFFS= (0..7)
0 0 0 0 0 0 0 0 
##$DE= 6
##$DECBNUC= <off>
##$DECIM= 32
##$DECNUC= <off>
##$DECSTAT= 4
##$DIGMOD= 1
##$DIGTYP= 9
##$DL= (0..7)
0 120 120 120 120 120 120 120 
##$DP= (0..7)
150 150 150 150 150 150 150 150 
##$DP07= 0
##$DPNAME0= <>
##$DPNAME1= <>
##$DPNAME2= <>
##$DPNAME3= <>
##$DPNAME4= <>
##$DPNAME5= <>
##$DPNAME6= <>
##$DPNAME7= <>
##$DPOAL= (0..7)
0.5 0.5 0.5 0.5 0.5 0.5 0.5 0.5 
##$DPOFFS= (0..7)
0 0 0 0 0 0 0 0 
##$DQDMODE= 0
##$DR= 18
##$DS= 0
##$DSLIST= <SSSSSSSSSSSSSSS>
$$ [...]
##$SUBNAM2= <"">
##$SUBNAM3= <"">
##$SUBNAM4= <"">
##$SUBNAM5= <"">
##$SUBNAM6= <"">
##$SUBNAM7= <"">
##$SUBNAM8= <"">
##$SUBNAM9= <"">
##$SW= 18.0517287032376
##$SWIBOX= (0..15)
0 0 2 0 0 0 0 0 0 0 0 0 0 0 0 0 
##$SW_h= 3612.71676300578
##$TD= 16384
##$TD0= 1
##$TE= 0
##$TE2= 300
##$TE3= 300
##$TEG= 300
##$TL= (0..7)
0 120 120 120 120 120 120 120 
##$TP= (0..7)
150 150 150 150 150 150 150 150 
##$TP07= 0
##$TPNAME0= <>
##$TPNAME1= <>
##$TPNAME2= <>
##$TPNAME3= <>
##$TPNAME4= <>
##$TPNAME5= <>
##$TPNAME6= <>
##$TPNAME7= <>
##$TPOAL= (0..7)
0.5 0.5 0.5 0.5 0.5 0.5 0.5 0.5 
##$TPOFFS= (0..7)
0 0 0 0 0 0 0 0 
##$TUNHIN= 0
##$TUNHOUT= 0
##$TUNXOUT= 0
##$USERA1= <user>
##$USERA2= <user>
##$USERA3= <user>
##$USERA4= <user>
##$USERA5= <user>
##$V9= 5
##$VALIST= <valist>
##$VCLIST= <CCCCCCCCCCCCCCC>
##$VD= 0
##$VDLIST= <DDDDDDDDDDDDDDD>
##$VPLIST= <PPPPPPPPPPPPPPP>
##$VTLIST= <TTTTTTTTTTTTTTT>
##$WBST= 1024
##$WBSW= 4
##$XGAIN= (0..3)
0 0 0 0 
##$XL= 0
##$YL= 0
##$YMAX_a= 42858
##$YMIN_a= -41708
##$ZGOPTNS= <>
##$ZL1= 120
##$ZL2= 120
##$ZL3= 120
##$ZL4= 120
##$ABSF1= 10
##$ABSF2= 0
##$ABSG= 5
##$ABSL= 3
##$ALPHA= 0
##$AQORDER= 0
##$ASSFAC= 0
##$ASSFACI= 0
##$ASSFACX= 0
##$ASSWID= 0
##$AUNMP= <proc_1d>
##$AZFE= 0.1
##$AZFW= 0.1
##$BCFW= 1
##$BC_mod= 2
##$BYTORDP= 1
##$COROFFS= 0
##$CY= 11.3945322036743
##$DATMOD= 1
##$DC= 2
##$DFILT= <>
##$DTYPP= 0
##$F1P= 2.36226072786647
##$F2P= -0.459571619588291
##$FCOR= 0.5
##$FTSIZE= 0
##$FT_mod= 4
##$GAMMA= 1
##$GB= 0.15
##$INTBC= 1
##$INTSCL= 1
##$ISEN= 128
##$LB= 0.24
##$LEV0= 0
##$LPBIN= 0
##$MAXI= 10000
##$MC2= 0
##$MEAN= 0
##$ME_mod= 0
##$MI= 1.114404
##$NCOEF= 0
##$NC_proc= 0
##$NLEV= 6
##$NOISF1= 3.799351
##$NOISF2= 2.8
##$NSP= 1
##$NTH_PI= 0
##$NZP= 0
##$OFFSET= 15.70392
##$PC= 1
##$PHC0= -15950.12
##$PHC1= 10.80078
##$PH_mod= 1
##$PKNL= yes
##$PPARMOD= 0
##$PSCAL= 0
##$PSIGN= 0
##$REVERSE= no
##$SF= 200.130013532006
##$SI= 16384
##$SIGF1= 3
##$SIGF2= 2
##$SINO= 400
##$SIOLD= 16384
##$SREGLST= <1H.CDCl3>
##$SSB= 0
##$STSI= 0
##$STSR= 0
##$SW_p= 3612.71676300578
##$SYMM= 0
##$S_DEV= 0
##$TDeff= 0
##$TDoff= 0
##$TI= <>
##$TILT= no
##$TM1= 0
##$TM2= 0
##$TOPLEV= 0
##$USERP1= <user>
##$USERP2= <user>
##$USERP3= <user>
##$USERP4= <user>
##$USERP5= <user>
##$WDW= 1
##$XDIM= 8192
##$YMAX_p= 0
##$YMIN_p= 0
$$ End of Bruker specific parameters
$$ ---------------------------------
##NTUPLES= NMR FID
##VAR_NAME=  TIME,          FID/REAL,        FID/IMAG
##SYMBOL=    X,             R,               I
##VAR_TYPE=  INDEPENDENT,   DEPENDENT,       DEPENDENT
##VAR_FORM=  AFFN,          ASDF,            ASDF
##VAR_DIM=   8192,          8192,            8192
##UNITS=     SECONDS,       ARBITRARY UNITS, ARBITRARY UNITS
##FACTOR=    0.0002768,     1,               1
##FIRST=     0,             0,               0
##LAST=      2.2672688,     0,               0
##MIN=       0,             -41708,          0
##MAX=       2.2672688,     42858,           0
$$ Real data points
##PAGE= N=1
##DATA TABLE= (X++(R..R)), XYDATA
0 0 0 0 0 0 0 0 0 0 0 0 0 0 0 0 0 0 0 0 0 0 0 0 0 0 0 0 0 0 0 0 6 -8 8 -8 8 -8 8 -8 8 -10 16 -16 16 -16 18 -22 24 -24
48 -24 27 -32 34 -38 41 -46 50 -57 62 -71 81 -91 105 -124 147 -179 227 -304 438 -728 1599 -9283
70 -9283 -41708 -3402 37385 11078 -28016 -15303 15491 16054 -1745 -12166 -11134 4982 21313
83 21313 5036 -27211 -15384 28301 24367 -25198 -30230 18722 31993 -10708 -29450 2272 22532
96 22532 4391 -12608 -8514 1016 9135 10258 -6737 -19721 1944 26282 4199 -28975 -10135
109 -10135 28023 14882 -23546 -16911 17046 16077 -9504 -12171 2460 5977 3118 1519 -6674 -9308
123 -9308 7728 15956 -6906 -20756 4496 22755 -1772 -22209 -707 19201 2113 -14497
135 -14497 -2073 9025 682 -3474 2022 -1207 -5116 4867 8381 -7003 -10813 8048 12215 -8138
149 -8138 -12246 7751 10942 -7337 -8660 7029 5576 -7199 -2500 7487 -475 -7979 2761 8088
163 8088 -4496 -7728 5598 6645 -6261 -4750 6870 2369 -7363 477 8244 -3056 -9133 5279
177 5279 10102 -6588 -10652 6996 10558 -6502 -9536 5273 7296 -3881 -4115 2541 1 -1902
191 -1902 4313 1919 -8494 -2908 11814 4494 -13776 -6325 14158 8002 -12729 -8778 10004 8484
205 8484 -6146 -6557 2124 3333 1650 1157 -4327 -6158 5578 11060 -5289 -15103 3487 17424
219 17424 -850 -17832 -2200 15873 4666 -12071 -6092 6794 5906 -924 -3970 -4590 569 9151
233 9151 3955 -11799 -8594 12564 12790 -11179 -15466 8322 16314 -4470 -14870 538 11359
246 11359 2677 -6271 -4670 246 4916 5692 -3591 -10923 804 14458 2712 -16017 -6334 15387
260 15387 9272 -12771 -10790 8849 10659 -4134 -8516 -298 4887 4008 -42 -6204 -5065 6820
274 6820 9867 -5829 -13474 3592 15309 -786 -15266 -2051 13220 4085 -9775 -5022 5292
287 5292 4504 -700 -2714 -3474 -134 6568 3502 -8273 -6688 8658 9317 -7661 -10662 5895 10747
302 10747 -3658 -9333 1613 6792 -44 -3501 -761 -170 634 3534 139 -6273 -1477 7983 2834
317 2834 -8731 -4022 8383 4613 -7304 -4461 5724 3567 -3962 -1944 2473 11 -1216 2193
331 2193 492 -4006 -75 5505 11 -6283 37 6436 -193 -6037 542 5146 -1220 -4124 2061
346 2061 2992 -3072 -2045 3900 1202 -4527 -549 4751 17 -4491 605 3880 -1256 -2870 2201
361 2201 1824 -3187 -715 4302 -95 -5262 619 5996 -755 -6290 602 5938 -381 -5033 133
376 133 3495 -218 -1600 593 -519 -1469 2441 2672 -3913 -3989 4772 5333 -4845 -6224 4320 6609
392 6609 -3146 -6087 1800 4829 -427 -2782 -573 229 1016 2484 -816 -4961 -42 6804 1269 -7882
408 -7882 -2743 7869 3967 -6955 -4738 5182 4733 -2939 -3883 603 2268 1532 91 -2984 -2647 3669
424 3669 5198 -3424 -7186 2511 8438 -1034 -8593 -560 7679 1949 -5817 -2804 3271 2853 -491
439 -491 -2149 -2242 607 4328 1312 -5650 -3412 6023 5252 -5469 -6460 4238 6858 -2518 -6231 835
455 835 4793 677 -2615 -1587 119 1871 2453 -1430 -4581 438 6048 806 -6751 -2137 6502 3141
471 3141 -5564 -3679 3995 3516 -2239 -2756 475 1380 1005 397 -1928 -2196 2352 3859 -2115 -4985 1595
488 1595 5610 -770 -5465 38 4725 538 -3538 -742 2008 501 -471 40 -966 -918 1971 1774
504 1774 -2662 -2597 2836 3066 -2705 -3220 2369 3011 -1920 -2356 1554 1496 -1220 -427 1149 -557 -1117 1472
522 1472 1218 -2078 -1284 2461 1283 -2562 -1131 2455 753 -2252 -277 1953 -374 -1737 985 1512
538 1512 -1562 -1395 1951 1282 -2118 -1100 2097 876 -1815 -418 1500 -101 -1035 846 717 -1554
554 -1554 -443 2266 379 -2782 -413 3054 545 -3037 -680 2641 676 -2017 -553 1152 158
569 158 -260 429 -596 -1196 1246 2027 -1561 -2742 1637 3309 -1340 -3474 921 3327 -327 -2715
585 -2715 -134 1783 467 -590 -501 -701 225 1829 294 -2742 -1027 3202 1730 -3275 -2356 2877
601 2877 2700 -2168 -2680 1260 2250 -294 -1383 -484 299 1063 977 -1196 -2144 1071 3134 -570 -3682
618 -3682 -37 3817 691 -3470 -1215 2702 1451 -1690 -1395 495 939 593 -229 -1510 -707 2071
634 2071 1654 -2253 -2474 2085 3041 -1595 -3207 985 3017 -267 -2363 -267 1473 632 -352 -666 -746
651 -746 454 1709 -12 -2405 -574 2733 1102 -2740 -1561 2370 1739 -1814 -1678 1120 1295 -434
667 -434 -695 -100 -59 516 883 -643 -1568 634 2135 -434 -2375 216 2413 56 -2142 -189 1679
684 1679 214 -1103 -105 456 -195 97 524 -590 -925 872 1215 -1041 -1429 1049 1487 -963 -1353 884
702 884 1103 -759 -693 740 300 -702 154 752 -514 -786 790 800 -945 -785 1003 628 -1018 -437
720 -437 943 117 -913 185 853 -549 -858 804 847 -990 -818 1086 761 -1029 -612 921 415 -702
738 -702 -62 511 -292 -312 741 211 -1140 -173 1457 201 -1658 -299 1657 361 -1527 -430 1189
755 1189 369 -773 -244 244 -72 210 457 -573 -881 829 1320 -862 -1619 806 1810 -553 -1770
772 -1770 309 1551 -23 -1104 -154 521 225 112 -153 -768 -90 1251 401 -1619 -783 1717 1106 -1632
790 -1632 -1325 1341 1391 -909 -1215 446 881 41 -325 -360 -282 593 942 -565 -1477 431 1881 -168 -2035
809 -2035 -162 1948 428 -1653 -640 1158 650 -582 -521 -45 190 555 227 -939 -690 1153 1147 -1128
827 -1128 -1447 999 1632 -713 -1570 417 1362 -100 -923 -97 416 208 170 -169 -694 5 1122 200 -1404
846 -1404 -474 1477 675 -1413 -802 1188 814 -879 -675 531 423 -177 -37 -59 -325 265 754 -298
864 -298 -1021 315 1249 -208 -1298 130 1228 -53 -1040 25 750 -72 -436 162 110 -329 149 486
882 486 -377 -629 505 740 -577 -769 596 736 -564 -576 572 428 -515 -186 535 -21 -529 239 529
901 529 -403 -524 519 476 -580 -393 581 231 -600 -90 548 -128 -555 326 549 -490 -533 643 530 -678
921 -678 -477 694 422 -593 -274 503 118 -348 128 243 -373 -135 624 91 -838 -78 976 106 -1038
940 -1038 -166 972 184 -838 -200 587 122 -295 4 5 -188 263 443 -450 -670 578 908 -558 -1038
959 -1038 510 1094 -354 -1005 191 803 -53 -500 -56 117 40 274 -3 -649 -156 903 327 -1066 -535
978 -535 1081 689 -972 -746 763 732 -466 -551 195 325 87 34 -223 -375 337 742 -295 -1012 209
997 209 1169 -64 -1217 -108 1098 226 -876 -314 549 284 -190 -161 -158 -40 447 293 -629 -535 749 785
1017 785 -706 -904 612 968 -424 -866 257 689 -67 -376 -15 63 50 273 -22 -571 -78 766 199
1036 199 -893 -323 894 400 -815 -425 649 387 -454 -266 252 96 -56 158 -53 -350 146 561 -160
1055 -160 -678 167 770 -123 -736 93 654 -80 -519 84 342 -139 -152 208 -26 -307 163 380 -273 -436
1075 -436 351 484 -355 -421 389 386 -342 -241 366 132 -344 26 361 -143 -373 244 353 -325 -338 341 266 -365
1097 -365 -199 337 69 -336 49 304 -193 -306 319 309 -400 -285 470 313 -455 -254 433 222 -335 -120
1117 -120 257 -8 -141 164 71 -316 -11 460 -23 -593 8 640 12 -669 -43 579 67 -457 -55 278
1137 278 21 -80 87 -93 -185 264 333 -367 -462 434 570 -395 -621 349 612 -246 -533 129 371 -44 -170
1158 -170 -25 -65 20 294 6 -505 -92 641 179 -698 -270 673 359 -577 -365 439 341 -239 -229 68 65 108
1180 108 144 -194 -344 256 530 -245 -661 181 729 -119 -715 14 601 44 -438 -86 227 71 -5 3 -192
1201 -192 -98 373 245 -463 -329 537 447 -489 -483 431 496 -313 -399 208 270 -93 -98 15 -93 16 273 -18 -441
1224 -441 -10 556 59 -602 -99 576 133 -507 -124 407 108 -255 -7 133 -66 17 208 -83 -301 179
1244 179 399 -195 -445 211 459 -198 -423 186 342 -192 -247 186 128 -207 1 226 -116 -245 197 262 -270
1265 -270 -242 322 248 -313 -167 352 130 -304 -26 313 -51 -281 155 281 -200 -225 260 199 -295 -156 311
1286 311 91 -297 -11 260 -81 -229 179 214 -265 -175 365 173 -395 -135 424 134 -381 -84 342 53 -248
1307 -248 52 168 -143 -61 245 -18 -353 78 437 -99 -498 101 519 -101 -489 79 418 -54 -289 54
1327 54 158 -65 30 143 -154 -185 316 285 -389 -358 436 425 -401 -436 360 412 -264 -334 166 207 -79 -24 11 -157
1351 -157 14 343 -8 -481 -37 593 113 -625 -148 599 215 -493 -197 369 171 -193 -73 43 -56 108
1371 108 213 -210 -359 263 501 -277 -595 241 619 -182 -592 99 486 -35 -336 -6 139 -2 66 50 -247
1392 -247 -116 387 231 -463 -306 517 400 -475 -394 408 389 -291 -294 193 168 -89 -7 27 -173 10 330 -13
1414 -13 -468 -20 543 44 -575 -73 548 99 -461 -80 349 50 -212 54 86 -134 27 250 -117 -326 179
1435 179 415 -200 -445 199 447 -198 -401 173 313 -158 -205 169 83 -184 38 228 -138 -248 241 280 -268
1456 -268 -267 310 259 -298 -196 310 124 -288 -30 277 -57 -255 148 242 -223 -225 274 192 -308 -153 321 93
1478 93 -297 -22 270 -65 -230 169 216 -233 -182 330 177 -355 -150 385 117 -352 -90 314 52 -241 39
1499 39 167 -120 -96 231 23 -349 7 402 -50 -471 39 474 -31 -440 17 384 -16 -248 40 134 -70
1520 -70 27 178 -133 -239 261 340 -292 -395 322 455 -292 -448 240 406 -172 -303 102 156 -52 7 30 -172
1542 -172 -60 335 85 -459 -157 516 230 -511 -265 466 288 -356 -254 242 167 -103 -46 -3 -98 95 264
1563 264 -131 -409 113 501 -80 -565 11 553 32 -478 -70 365 84 -211 -57 50 -18 110 130 -220 -229
1584 -229 306 357 -309 -419 305 455 -248 -441 174 384 -107 -254 51 106 -33 45 24 -206 -80 323 133
1605 133 -395 -180 433 233 -413 -241 355 234 -253 -161 193 91 -81 49 32 -156 6 262 -10 -355 7
1626 7 406 8 -405 -23 360 17 -298 1 212 -44 -126 109 36 -164 35 234 -76 -279 113 321 -113
1647 -113 -297 132 287 -132 -211 135 142 -137 -50 168 -30 -209 93 222 -150 -254 155 237 -183 -230 163 172 -166
1670 -166 -109 148 15 -155 75 163 -144 -167 215 208 -218 -197 239 214 -212 -168 179 116 -131 -39 98 -50 -64 146
1694 146 55 -237 -53 294 79 -329 -87 340 123 -296 -110 238 85 -141 -30 71 -37 19 131 -76 -218
1715 -218 113 304 -110 -349 78 377 -50 -354 3 278 34 -190 -23 74 3 42 42 -134 -99 224 193 -246
1737 -246 -232 260 298 -212 -304 166 281 -97 -198 29 118 13 9 -32 -126 15 222 20 -307 -72 332 114 -326
1760 -326 -157 282 171 -215 -144 130 113 -29 -25 -24 -56 91 164 -98 -229 106 306 -52 -316 36 318 15 -258
1783 -258 -34 178 44 -93 -27 -4 -16 78 72 -141 -141 164 181 -177 -221 149 232 -111 -211 83 171 -29 -79 33
1807 33 14 -17 76 35 -132 -59 193 85 -196 -100 201 117 -170 -118 142 86 -90 -36 43 -21 -23 83 14 -129 -3
1832 -3 175 21 -184 -26 194 37 -164 -37 115 22 -76 17 38 -57 21 93 -29 -124 36 163 -35 -180 28
1855 28 162 -17 -130 10 109 -6 -35 39 -7 -41 75 88 -84 -104 105 142 -92 -135 94 153 -51 -113 31 72
1879 72 -21 -17 -4 -41 -16 92 36 -135 -45 153 80 -167 -97 142 106 -101 -94 56 71 1 -28 -21 -8 59 77 -41 -116 45
1907 45 176 -17 -179 -14 173 43 -137 -55 96 66 -32 -37 -18 10 67 27 -88 -75 104 115 -97 -143 72 156 -50
1932 -50 -140 25 117 16 -59 -29 15 44 51 -19 -94 -4 130 33 -133 -66 137 79 -103 -97 79 82 -29 -53 1 27 29 18
1960 18 -49 -68 56 102 -25 -124 5 131 -3 -122 -29 107 30 -53 -27 11 21 13 17 -43 -28 68 76 -58 -79 60 94
1987 94 -43 -85 38 98 6 -47 16 17 8 19 5 -37 -11 58 28 -80 -40 74 41 -72 -62 43 46 -44 -38 9 -6 -4 24 -10
2017 -10 -46 3 80 -3 -77 0 86 5 -63 -12 53 21 -27 4 11 -7 21 32 -29 -45 43 68 -41 -74 27 77 -19 -63 15 46
2047 46 2 -21 -10 -10 -12 39 5 -54 -33 67 34 -81 -58 64 59 -52 -54 33 44 -1 -17 5 -3 10 29 -10 -64 13 78 -5 -80
2078 -80 -15 99 10 -81 -33 56 35 -27 -12 4 11 30 24 -40 -38 56 65 -47 -84 48 89 -36 -83 22 61 -5 -51 -7 20 7
2108 7 27 -7 -42 -2 61 17 -70 -36 88 53 -59 -48 64 49 -37 -35 25 31 -8 0 -8 -32 8 59 -20 -77 20 87 -14 -97 1
2139 1 83 3 -75 -3 42 0 -16 5 -2 -12 30 41 -38 -39 61 67 -56 -69 61 64 -34 -47 26 48 -23 -18 14 5 -27 21 22 -50 -30
2172 -30 57 25 -60 -30 58 25 -60 -25 55 8 -45 1 26 -17 -10 30 16 -52 -1 65 3 -54 13 64 5 -55 16 59 -19 -34 21
2203 21 27 -26 -4 51 3 -45 24 51 -23 -58 32 48 -28 -42 34 40 -35 -14 36 -5 -35 16 35 -44 -51 35 53 -46 -55 51 50 -46
2235 -46 -31 45 35 -20 -7 28 -13 -11 37 32 -54 -20 68 31 -71 -26 74 31 -58 -31 42 8 -34 1 14 -19 -15 37 -4 -62 13
2266 13 83 -12 -78 0 92 -9 -75 12 68 11 -34 -1 21 -1 26 40 -24 -41 61 56 -64 -65 55 73 -46 -67 38 69
2294 69 -30 -50 7 15 -8 10 -1 -34 -20 58 26 -76 -31 71 44 -73 -34 75 52 -41 -35 38 22 -12 8 9 -14 18 55 -10
2324 -10 -68 9 88 -2 -85 3 88 -2 -65 0 52 10 -25 -3 -6 -5 24 26 -49 -48 48 52 -49 -70 43 76 -29 -56 21 47 -13
2355 -13 -26 8 4 -20 22 18 -36 -19 71 37 -52 -25 69 56 -49 -28 43 32 -27 -12 22 -12 -4 37 14 -45 4 55 10 -70 -9
2386 -9 59 7 -67 -4 46 6 -24 5 16 -23 13 38 -5 -32 17 60 -9 -48 30 70 -3 -48 14 46 4 -18 18 2 -17 11 27
2417 27 -34 -44 37 46 -36 -66 25 48 -35 -50 17 33 -15 -24 13 -5 -13 21 20 -42 -28 52 24 -52 -44 56 44 -39 -33 44 32 -14 -10
2450 -10 10 -11 14 30 0 -44 10 68 -4 -70 -13 76 16 -58 -21 32 14 -24 -13 5 0 10 13 -33 -38 37 46 -34 -59 29 66 -16
2482 -16 -63 24 48 5 -30 1 15 12 19 -1 -35 -16 62 32 -57 -38 57 47 -48 -49 37 44 -15 -39 -2 7 2 5 -17 -34 7 45 -6 -73
2516 -73 -1 66 21 -61 -21 55 26 -38 -19 24 13 3 6 -14 -10 25 42 -25 -42 33 61 -1 -53 29 46 7 -38 -7 15 -2 -3 -4
2548 -4 -17 -8 23 25 -31 -28 33 45 -35 -33 27 38 -14 -38 12 25 -6 10 -7 -8 9 44 11 -42 -11 49 18 -45 -14 37 27 -26 -19 27
2582 27 16 -3 4 -2 -15 16 36 -8 -24 12 43 5 -53 -7 51 11 -39 -6 9 5 -5 -10 -17 -13 24 17 -25 -50 27 45 -22 -49 7 35
2616 35 2 -32 -7 16 10 16 -1 -10 -2 32 10 -34 -18 42 31 -35 -33 24 35 -32 -37 -4 14 2 -12 -16 -17 7 22 -5 -38 11 50 1
2650 1 -50 -15 43 27 -26 -16 19 14 15 -10 -16 5 13 32 -23 -35 26 39 -17 -39 8 43 -1 -33 -26 24 1 -8 -8 -23 4 22 3 -47
2684 -47 -11 39 16 -33 -27 30 43 -22 -33 14 22 1 -5 -5 1 11 20 0 -25 11 39 -4 -49 -20 33 12 -25 -19 26 18 0 -19 -2 -7 11
2719 11 9 -16 -24 15 26 -31 -30 1 37 -4 -37 -6 21 3 -6 -19 -10 -2 10 6 -22 1 37 21 -29 -22 26 30 -4 -23 15 29 7 -13 -2
2754 -2 -1 7 5 -10 -31 -2 24 -5 -33 -14 27 13 -28 -25 12 11 -9 0 -3 2 21 19 -5 -19 18 27 5 -28 12 32 11 -20 1 29 11 -5
2790 -5 -7 -8 -2 14 1 -14 -20 28 21 -25 -42 11 34 -21 -26 1 20 1 -21 -9 0 -2 11 1 -15 1 32 18 -25 -9 34 25 -17 -13 31 27
2826 27 7 -9 1 12 16 15 -18 -7 16 38 5 -27 -9 40 12 -25 -6 24 16 -16 -16 0 4 7 2 -7 -19 30 31 -29 -29 27 40 -2 -24
2861 -24 19 40 8 -13 6 5 13 11 11 5 14 28 15 -14 -17 28 23 -23 -26 13 25 -5 -16 0 9 7 7 -7 -13 13 14 -1 -37 1 32 9 -24
2898 -24 -8 24 15 -13 -14 17 17 2 8 5 6 20 23 0 -6 18 43 -5 -23 6 34 8 -15 -9 11 7 -1 -7 -7 2 20 16 -13 3 22 20 -12 -21 11
2937 11 19 -9 -9 5 14 7 15 2 8 18 19 11 -23 15 34 14 -2 1 17 12 -19 4 12 24 4 -3 -1 -5 16 26 -4 -26 0 32 4 -32 -5
2974 -5 29 2 -11 -4 8 20 10 -6 5 2 25 11 0 3 17 26 -5 -26 19 37 16 -14 5 26 3 10 1 0 13 16 -1 -18 -10 32 13
3009 13 -24 -12 25 16 -15 -9 12 13 6 8 -1 8 10 18 1 -10 20 37 18 -7 12 40 25 -9 -9 30 23 1 5 12 10 19 15 2 -2 15 22 -11 -18 12
3049 12 23 -5 -19 -4 17 3 -9 -2 3 13 18 3 2 -11 23 12 -9 -7 23 22 -2 -6 20 26 6 -7 1 8 12 10 -1 -12 13 17 0 -21 -10
3086 -10 23 3 -15 -18 10 7 -11 -10 -6 3 5 0 -8 -15 9 12 -11 -14 5 21 14 -19 -5 17 8 -4 0 10 13 10 7 2 10 19 15 3 -8 17 27 -4 -11
3127 -11 1 25 -1 -5 2 -4 3 -8 -12 -14 -9 10 5 -20 -15 7 8 -24 -10 10 10 -13 -17 6 2 13 4 3 -4 16 23 0 -4 11 34 15 -5 1 28 12
3167 12 -3 -5 0 6 -2 -6 -12 -11 8 0 -2 -16 4 10 4 -14 2 6 10 -7 -9 -3 12 12 6 -10 14 24 9 1 4 19 23 -2 -10 25 30 16 -10 2 20
3208 20 9 6 -7 -13 7 12 -16 -8 1 23 4 -15 -4 16 14 -9 -9 6 16 9 -2 -6 -1 9 20 -9 -14 11 21 4 -22 5 22 14 -6 2 9
3245 9 21 4 -3 0 5 7 12 -9 -3 13 12 -7 -28 11 18 -9 -7 -13 3 1 -6 -6 -12 -4 -5 -13 -15 -3 7 7 -6 -5 13 21 -2 -8 16 23 2 5 1 5 16 23
3289 23 -8 -3 14 26 9 -20 4 11 1 -6 -5 5 11 -3 -3 -16 0 13 -2 -13 -14 10 11 -12 -12 7 21 -5 -7 5 11 14 5 10 4 15 14 6 -14
3328 -14 10 19 14 -1 -4 18 22 0 0 5 11 9 -16 -12 0 11 9 -11 -6 1 11 4 -15 0 12 5 -9 -13 9 9 2 3 4 7 18 6 -1 15 9 20 -3
3369 -3 -12 18 20 0 13 10 5 4 9 2 1 12 2 2 -19 1 2 -3 -5 -18 11 -2 -13 -17 -3 8 -10 -7 -13 -7 6 -6 -2 -11 10 22 6 -5 9 18
3409 18 16 5 3 13 23 10 -7 7 11 6 3 -2 -8 8 3 -7 -7 6 16 -17 -21 -7 6 8 13 4 -14 -4 3 -5 -6 -1 -1 5 -5 -6 24 12 0 1 8
3450 8 18 7 5 9 14 2 9 0 -4 8 13 3 -8 5 22 4 -7 -5 4 3 -4 -9 -5 2 4 1 12 -9 5 5 -6 -13 11 6 6 -12 6 11 15 -9 -2 19
3492 19 5 7 6 -4 2 7 6 -8 -4 19 14 -1 -6 3 17 15 2 9 0 1 2 5 -6 -1 1 -2 -10 5 9 3 -12 4 23 -1 3 -11 8 9 3 13 7 6 10 18
3536 18 11 0 14 12 7 -10 6 9 8 0 -2 8 3 4 -4 2 -10 1 6 -4 -5 6 11 -4 -10 -4 13 1 -8 -6 8 13 3 -2 12 10 8 7 4 9 23 19 -3
3579 -3 3 16 14 4 0 2 3 3 -3 2 3 10 1 7 -9 6 11 -3 -6 -3 11 -3 -2 4 11 4 -11 -2 -13 0 5 9 -1 -4 4 14 -1 -3 11 16 10 1 4 21 24 7
3625 7 3 12 13 13 0 1 -7 8 10 -3 -13 1 9 -1 -9 -1 0 -6 -16 -7 -8 -8 -4 -2 -12 -2 17 14 0 8 7 8 4 1 9 17 -1 7 -2 8 -1 -4 3 -1 13 15 3
3672 3 -6 4 20 3 -15 -5 -5 1 -4 -6 -9 -5 -6 -3 -11 0 9 4 7 2 5 13 1 -3 13 9 12 -1 -1 5 13 7 3 -3 5 17 1 -3 4 16 7 -11 -5 8 6 -2 -14
3719 -14 2 13 -2 4 -7 -3 7 8 -3 -7 3 9 5 -16 3 6 10 -9 3 9 3 12 5 3 4 10 10 3 11 5 14 -2 0 15 23 4 6 2 -3 11 -3 -4 -15
3762 -15 -11 5 -8 -7 -7 2 7 -12 -12 0 9 1 -1 -3 12 0 8 -3 -3 11 8 6 8 9 22 9 -2 5 12 9 -2 0 9 0 9 -5 3 -8 11 1 -13 -17 0
3805 0 -7 -8 -18 -1 14 1 -6 0 13 -4 3 -4 -5 6 12 6 -7 4 13 19 -11 -2 14 21 15 -9 6 10 5 6 -1 -3 14 13 -4 -7 0 7 3 -11 -9 1 0 -3
3849 -3 -10 -1 -7 -3 -11 -8 3 -6 1 -14 -9 7 4 -7 -13 -2 7 9 -9 -6 2 8 -7 6 -1 8 6 6 0 2 9 5 5 -10 -8 3 -11 -19 -9 14 16 -1 -16 0 -11
3894 -11 7 -3 -17 -7 4 1 -9 -13 5 14 -8 -3 -4 16 7 3 13 2 13 1 4 1 6 9 -3 6 7 5 2 -13 -4 8 8 2 0 -10 -3 0 -2 -13 -6 -3
3936 -3 3 0 -7 1 2 -8 0 5 8 10 -1 -4 11 11 15 3 6 9 16 21 10 0 6 19 -2 -11 -8 5 2 -10 0 -6 9 -1 -5 -5 7 4 0 -12 -9 8 1 -5 -17
3981 -17 -2 5 -11 -9 -12 12 -10 2 -7 2 7 5 2 -5 -2 20 11 -6 13 4 12 0 0 -4 0 1 -11 -11 -3 0 3 -8 -21 -3 0 3 -17 -16 1 -4 0 -11 -9 1
4025 1 4 -7 -8 1 1 -4 5 -9 15 16 -6 1 16 28 11 0 -1 20 10 7 3 0 3 3 5 -2 -6 -2 -2 -10 -10 -2 -8 -9 -6 -8 -6 2 -4 -17 -7 -2 0 -12 -4 -4 8
4072 8 1 4 -5 14 11 14 -4 10 11 1 -3 2 5 -1 -3 -9 -2 -1 6 -5 -17 -6 -2 -8 -5 -10 -10 2 -10 -8 -12 -2 4 -3 -9 -9 2 12 -6 -13 3 1 -1 -11 10
4117 10 6 5 -6 -2 -2 7 11 -4 2 8 1 -11 -4 -4 10 -1 -9 -16 -5 5 2 -1 -10 -7 4 -8 -17 -10 3 -3 -16 -14 -3 -2 -5 -8 0 5 8 16 -4 -1 10 20 12
4162 12 14 5 7 9 -4 -10 2 6 1 7 9 -2 4 4 -1 -6 -1 4 -19 -12 -15 -9 -13 -13 -15 8 8 2 -12 -5 8 5 4 -1 3 -2 7 3 1 7 9 1 6 -5 14 -2 3 -2 10
4211 10 16 -4 -4 3 6 -6 -7 -8 -6 -6 3 0 -13 4 3 -7 -7 3 -5 -6 1 -2 -2 2 6 -7 8 3 18 -1 3 0 14 9 8 -1 -1 6 -3 -2 8 11 12 8 4 11 13 13
4259 13 8 12 -7 -1 2 -13 0 6 -6 -9 -16 -11 -8 -11 6 -6 -9 8 7 3 -15 5 5 2 7 -1 11 18 14 4 13 0 6 7 7 -2 -1 15 -12 -9 3 14 -4
4302 -4 -12 -7 -5 -5 4 -7 -8 7 0 -9 -9 1 4 2 -15 2 -2 -3 4 6 0 12 3 -4 9 8 7 8 5 4 8 13 4 0 7 5 7 -4 1 -6 5 5 -7 -11 7 -10 -3 -12 -14
4351 -14 -3 -2 -6 -1 1 1 0 -6 -10 0 0 0 -7 -3 3 0 -2 -9 -3 20 0 6 7 6 6 6 3 4 13 3 10 3 4 14 9 -5 4 9 6 -3 -8 -4 -2 -11 -18 0 -16 3 -2 -2
4401 -2 -7 5 3 -1 -5 7 15 -5 -3 5 12 2 3 2 2 8 13 -8 3 6 16 11 4 8 1 10 1 -12 -1 -2 -4 -6 -9 -10 12 3 -15 -7 1 0 -12 -7 -2 6 -2 3 -2 6 7
4450 7 4 1 -3 6 16 4 12 5 18 13 7 -12 3 14 2 -4 -1 4 -4 6 -11 -3 -6 5 -5 -5 -5 -3 0 -3 -10 3 -11 -10 -8 2 8 3 -1 -3 7 6 -1 7 13 3
4496 3 9 18 1 -1 -1 10 -1 -2 2 3 2 -1 -2 0 -6 4 -3 -1 -6 0 -5 -9 -10 -9 -12 -24 -1 -1 -1 2 -10 -4 1 3 -3 -3 2 3 1 -1 -2 9 3 5 8 3 7 9 7 -2 1 8 2
4549 2 2 -7 -5 0 9 -1 -1 0 -1 -1 -9 -12 5 -1 -8 -6 -4 2 -10 0 -7 2 12 -7 -4 7 9 20 10 -3 -4 8 0 0 3 5 0 9 8 11 -5 8 8 -6 -15 -4
4595 -4 -6 -5 -6 5 -1 1 -2 -8 -1 0 -5 -10 2 -1 -4 -5 -6 -5 0 11 -1 -2 6 2 4 5 13 2 13 2 8 9 5 8 12 5 6 9 13 7 6 13 8 4 -3 9 -4 -8 -9 -2 6 5
4647 5 -3 -10 1 -6 -9 -12 -4 -4 4 -7 9 9 8 1 13 1 9 9 6 13 -1 7 13 1 2 2 12 14 1 4 3 5 -4 4 -7 11 -4 -2 -8 -4 -2 4 0 -6 -8 -1 0 -4 8
4696 8 2 -7 -1 4 -4 7 10 -1 6 8 2 7 11 4 -2 16 -2 -9 -4 5 -2 3 -1 -2 1 -2 -7 -14 -2 2 -10 -3 -3 -4 -7 -2 -6 -4 0 -8 -3 0 -2 6 -6 0 -6 -3 3 -7 9 1
4748 1 -1 6 3 6 11 7 0 -1 6 5 1 -8 -4 -3 0 -7 7 2 5 -8 -9 -10 -3 -1 -2 -14 -2 -11 -3 0 -2 -1 6 2 -3 3 -3 6 11 8 3 5 7 3 9 11 11 10 0 8 1 16 9 -2
4802 -2 -1 1 2 3 -8 -10 -4 -7 -8 1 -14 -8 -16 3 -8 -6 5 -5 -1 0 2 1 1 0 6 -2 1 10 9 7 9 12 14 8 2 4 0 7 3 3 8 6 5 1 4 -9 -9 6 -6 2 -10
4853 -10 4 -13 -3 0 1 -2 -7 -12 0 -13 -5 3 6 8 12 -6 2 18 8 4 4 9 -9 10 5 10 8 6 11 10 15 7 11 1 9 3 3 -2 1 6 -9 -4 -3 -1 5 5 -5
4900 -5 -3 6 5 1 4 -1 -2 -5 -2 -7 7 7 11 2 3 9 -8 4 0 8 5 15 11 -6 4 4 0 7 3 -1 0 -1 -2 -2 -10 5 -11 -6 5 -2 -2 -2 -1 -2 -2 3 -8 -3 3 8 5
4951 5 5 -7 1 -3 2 7 -2 6 8 -1 10 9 10 13 6 -1 12 1 -5 0 0 -1 1 -12 -4 -7 2 6 -3 -3 -5 -2 5 -6 -5 0 9 7 -2 6 8 7 3 5 6 8 15 13 11 9 9 17 4 17
5005 17 4 11 16 12 18 12 6 5 7 -4 -5 -2 -1 5 1 6 -7 -6 -3 0 -7 2 -14 1 6 -6 6 -1 -2 3 10 9 15 9 4 8 15 4 1 10 12 10 7 7 10 14 5 9 1 4 5 5
5057 5 0 -7 -10 -7 -2 -7 -4 5 -13 -10 1 -1 5 -1 0 -4 5 4 -2 6 10 8 18 5 9 15 9 5 10 14 5 8 13 -2 6 13 5 3 7 2 8 2 8 3 -8 4 -6 -6 -3 -4 -7 2 -8
5110 -8 -9 2 -1 -4 -6 1 1 4 -1 9 15 4 5 1 13 8 8 11 4 13 3 6 1 1 14 8 7 6 5 6 2 8 -8 8 0 -2 0 0 1 0 1 -8 1 -7 2 -10 -8 13 0 4
5160 4 10 5 9 8 -2 6 5 5 16 8 3 7 0 6 6 6 3 5 -2 -3 -4 0 -4 7 -2 -8 12 -7 -16 -2 -10 -8 -5 4 -7 -13 4 -1 -1 1 11 10 -5 1 6 5 9 -2 8
5209 8 9 6 7 5 19 10 1 -2 6 2 5 2 -4 0 -8 -2 -6 4 7 -2 1 -8 3 -10 -9 -1 -3 -8 7 -3 3 5 4 -3 -3 11 6 9 6 -6 20 6 11 9 4 1 2 2 1 5 10
5260 10 9 -2 10 6 1 -3 -5 3 -6 12 -6 -7 1 -8 0 0 -9 0 -10 0 -5 0 0 -2 -5 1 6 -3 14 7 1 3 4 10 2 5 5 6 5 17 13 9 -1 -2 -3 6 -12 -6 -1 -8
5310 -8 2 -10 -10 -1 0 -8 -15 5 -8 -3 2 -1 0 -4 -2 4 0 0 2 1 6 13 5 12 14 14 10 4 -3 8 8 -2 7 -5 9 2 -5 -6 -1 3 -5 -4 0 1 1 -5 -3 1 -11 3 8
5361 8 -7 -4 -8 6 -12 1 2 5 5 5 -1 8 13 5 3 11 11 10 -5 2 12 12 11 -1 19 0 -6 4 -1 8 -1 1 -1 -5 5 0 -5 -1 -2 -13 -8 -11 -7 -6 -3 0 -2 2 0
5410 0 -2 -6 -1 13 1 12 3 4 4 2 8 5 -7 7 11 -2 0 4 1 -5 1 -14 -5 -3 -7 -2 -4 -4 -6 -14 -8 -3 5 -14 -8 -4 0 -2 -8 -1 -2 -8 -11 -3 -1 10 8 1 9 7 5 11
5462 11 11 0 -3 3 1 -4 10 0 -10 9 -6 2 -5 -12 -8 -4 -7 -11 -5 -9 -11 -19 -15 -10 1 -5 0 -1 -10 0 -5 -1 -1 -2 2 5 -3 4 8 16 -2 10 0 -4 1 1 -4 0 -5
5511 -5 -4 7 3 -6 -8 -9 -4 -5 -8 2 -9 -4 1 -17 -12 -2 -12 -5 2 -11 -9 -7 3 4 0 4 -1 -7 -4 9 3 4 3 -1 9 16 1 -4 2 3 -1 -7 2 -2 -3 -4 -10 -13 -3
5560 -3 -6 0 -11 -6 -6 -1 -16 -5 -5 1 4 -2 -4 7 11 -3 -8 -2 -9 4 -11 3 11 5 7 1 9 19 0 4 6 20 9 -2 7 1 -3 -10 -9 -8 2 6 6 -2 -14 -5
5606 -5 -2 -4 1 -12 3 -1 -4 -8 -6 3 1 -5 1 5 -3 -1 6 8 9 -9 -1 3 11 16 8 3 17 21 6 2 -2 2 0 7 -5 2 0 6 1 -12 -6 -6 -9 -8 -15 -6 -9 2 -16 -7 -4 -4
5658 -4 -10 -6 -9 -2 2 2 -1 -3 11 -5 -2 -8 7 4 11 4 7 2 6 13 -2 3 -2 3 6 -3 -2 -7 -3 1 0 -1 -8 -9 -10 -13 -9 -4 -8 -13 -7 -8 -17 -1 1 -3 -9 -3 9 5 10 0 4 -2
5712 -2 14 -3 -1 8 -5 -3 0 -6 -3 -3 4 -11 -2 -6 3 -11 5 -2 -8 -14 -6 -5 -15 0 -9 -11 -5 2 -4 -6 -8 11 4 4 -5 2 0 -8 15 -1 11 -7 -1 8 7 -7 5
5759 5 2 -1 -1 -4 6 1 7 1 -1 -9 -9 -12 -13 -5 -8 -8 -16 -2 -4 0 -9 -7 6 -5 -15 -1 6 -3 -14 -8 -2 -10 0 4 14 2 3 12 -3 -7 -9 2 1 6 -1 -7 -1 -10 -11
5808 -11 0 2 -5 -7 -8 -6 -3 -8 -11 -1 1 -7 -13 -4 -4 -11 10 5 4 -3 2 1 10 -3 -7 -6 -4 0 5 5 16 1 2 7 0 6 -2 -2 0 -4 7 5 -1 -1 -3 4 -1 -9 -10 -4 -8 -4 -9
5861 -9 -16 -13 3 2 -1 2 -15 6 -4 -4 3 4 1 5 3 4 3 4 15 10 11 3 4 -3 0 4 11 3 2 8 -2 -15 -12 2 -8 -10 -2 -12 -4 -13 -20 -8 -12 -20 -13 -6 -7 -2 -2 -1
5911 -1 -9 -2 5 1 10 2 10 -1 -2 7 7 5 10 9 8 -7 1 -9 -3 -4 -15 8 -4 -8 2 -1 4 3 -13 -3 -7 -10 -10 -9 -2 -13 -14 0 -1 -7 5 -2 -3 2 11 -3 10
5958 10 12 -3 11 2 5 6 17 -8 -1 -4 -4 -5 0 -3 -2 -6 -5 2 2 4 -8 0 -11 -16 -9 -13 -9 -12 -11 -8 -3 -11 -7 -13 -4 6 -9 -1 -1 -5 8 -3 8 3 11 3 -2 5 3
6007 3 12 14 -4 -5 6 1 4 1 -2 -2 -6 -5 -4 -1 6 -17 0 2 -8 -15 -4 -12 -2 0 1 -4 3 5 0 3 -3 -1 -6 4 5 8 4 13 9 8 2 6 3 11 2 0 6 -3 -2 2 4 -9
6059 -9 1 -9 0 -10 10 -5 -5 -2 3 11 -12 -5 -3 -9 4 -3 -1 3 15 2 1 -2 5 2 -2 2 1 6 6 12 4 11 6 11 0 10 8 2 2 6 9 -8 4 -5 -3 -7 -5 -2
6107 -2 -9 -7 -14 -2 -20 -4 -7 -1 -5 -6 -9 -2 -5 -2 -2 -6 4 2 2 2 -5 9 -4 2 2 3 8 -5 0 5 8 -1 -6 -1 -1 -9 -2 -7 -9 1 0 -11 -12 -13 -5 -6 -3 -5 -9 -3 -2 -5
6159 -5 -5 4 -8 -1 -1 -9 -4 1 -2 -5 -1 8 6 -1 1 7 9 1 -1 11 9 -6 -2 -9 1 -4 -2 -4 0 2 4 -11 -20 -6 -14 -7 -9 -2 -6 -1 -9 -7 -7 -9 5 -6 -3 11 -6 1 4
6210 4 5 12 10 5 7 9 6 4 -2 -4 -4 2 9 2 -6 -8 -7 1 -3 -6 -5 -2 -16 -3 -7 -3 -6 -13 -6 -7 -2 2 1 -5 5 11 -1 2 3 5 12 19 9 17 9 1 16 1 15 15 7 13 7
6263 7 8 5 -7 3 -1 -3 8 3 1 -1 -5 -3 6 -3 2 -4 -14 -11 3 -8 -12 5 2 2 -3 1 -4 3 6 9 15 10 11 7 11 4 1 5 0 8 6 13 5 4 -13 -5 1 -6 -3 -4 -8 -10 3
6316 3 -4 -17 -8 -14 -4 -8 -5 -1 -2 4 -7 -6 1 2 2 11 1 1 8 6 4 17 2 4 -5 11 6 1 8 -1 12 7 2 3 2 -1 11 11 -5 -5 8 -4 5 -6 -11 -10 1
6363 1 0 -3 4 6 3 -1 -1 2 7 8 5 19 15 11 1 -4 2 8 2 7 5 5 14 2 -3 7 -5 -5 3 3 3 2 10 -9 -12 -4 -12 -12 -9 -11 -3 -3 -8 -1 1 -3 -5 -2 13 -8 8 -3
6415 -3 8 -1 4 -2 5 -3 5 0 4 9 5 5 11 19 -3 2 -5 -10 9 3 -4 10 1 4 2 -6 3 -8 -8 1 -2 -10 -6 -1 -3 -6 -2 5 3 0 4 7 -5 7 -5 -2 -8 -3 -7 8 8 0
6467 0 6 -9 8 -4 0 5 -8 -1 3 -6 -2 2 -9 -2 3 -3 -3 1 3 2 -5 -8 -12 -9 1 -10 -6 1 -3 3 0 1 13 8 0 1 4 -1 6 2 -1 4 7 8 2 1 13 -4 -5 -6 0
6518 0 -1 3 -2 -4 -11 -9 -10 -8 -5 -4 -6 -13 -10 -7 -5 -8 -15 -8 -3 5 7 -5 1 1 0 6 1 -6 4 -10 4 5 0 -1 14 1 -3 0 6 2 -5 0 -12 2 -2 -3 -17 3 -7 -2
6568 -2 -6 -1 -6 -2 -12 -2 -5 -5 -5 -8 -8 -2 -4 -4 -7 2 -4 -3 1 -1 6 -5 -1 4 -8 -3 -4 4 9 -13 -4 -6 10 -2 -10 -3 -12 -8 -10 -13 -5 -12 -13 -3 -10 -6 -4 -15 -10 -17 -7
6619 -7 -13 -20 -7 -13 -5 -3 -9 -17 3 -2 1 -3 2 -3 -4 4 -4 -5 -1 -5 -2 -5 -3 -10 2 -8 -6 -3 -8 -15 -4 -14 -4 -3 -7 -4 -16 -14 -13 -11 -4 -13 -8 -14 -3 -13 -9 4 -11
6668 -11 -5 9 -11 -1 3 4 8 9 2 -2 1 -10 -3 0 2 2 -2 7 -5 -11 -5 -9 -5 -4 -12 -7 -2 -4 -13 -1 -1 -5 -7 -4 0 -12 0 2 -7 -2 2 -13 -1 3 4 9 2 7 15 7
6718 7 -1 5 -2 2 -2 -11 -5 -2 2 -6 -3 -7 -7 -7 -2 -12 -13 -6 -8 -7 -10 0 -8 -10 -3 8 6 -4 1 1 2 -4 3 10 3 3 -2 0 2 -2 4 15 8 10 2 9 5 18 5 15 0 -16
6770 -16 -4 -8 -4 -5 -4 -1 -4 -10 -13 -12 -19 -9 -9 -5 -3 -6 -11 -6 -2 0 -12 -6 0 7 -3 -6 -1 8 4 4 3 -11 7 11 5 7 -6 -1 8 2 8 -2 -3 -11 -7 -3 -13 -8 -4 -4 -10
6821 -10 -19 -13 -11 -14 -8 -13 -6 -14 4 -3 -11 -1 -8 3 -7 8 7 12 7 -7 3 4 3 12 -6 1 3 -5 1 7 -11 -2 -8 -11 6 -4 -3 -1 2 -3 -8 3 -16 -8 3 -12
6867 -12 4 -9 -10 -7 -10 -7 -14 -4 -3 -8 -1 6 -8 10 3 -1 -3 3 -3 4 4 6 4 5 -3 5 2 -4 5 -4 -3 -20 4 4 1 -6 -8 -9 3 2 1 -14 2 -9 -18 0 -2 2
6915 2 2 -5 4 0 2 5 -7 1 13 4 2 15 5 9 -2 10 8 -5 2 -6 -6 5 -10 4 -5 1 -5 3 0 -5 -4 -5 3 -8 -5 -3 -5 -2 -3 1 8 4 -1 8 5 15 8 8 5
6964 5 13 0 6 7 4 11 2 8 8 6 8 7 9 -3 -7 1 1 0 0 9 9 -2 -7 2 3 7 -2 -4 3 5 2 -3 0 -1 8 5 2 -4 13 11 4 8 6 21 11 16 8 12 7 13 14 13 -2 3
7018 3 10 10 7 8 8 5 -2 5 4 -8 1 -10 -3 6 -7 -5 -12 -2 7 2 -3 4 0 -1 0 7 20 11 -1 8 8 8 8 6 3 7 14 3 10 3 6 -1 1 1 13 6 5 1 -5 -3 -5 -3 -5
7071 -5 -6 -8 -11 -3 -13 -9 -3 8 3 3 1 -9 -1 4 -4 -2 7 -1 8 13 0 15 2 7 10 10 6 2 5 7 0 4 1 -1 2 5 6 5 -4 -2 -4 -5 -5 -3 -2 6 3 7 1 2 0 0 -1 0 2
7126 2 -2 0 2 12 13 6 11 3 0 0 9 5 14 7 4 7 -1 2 1 4 -9 -3 3 -1 5 3 2 -7 -4 -9 -5 -7 0 3 5 3 -4 5 -4 7 -1 -9 4 -6 0 4 7 -15 2 12 3 25
7178 25 12 -1 5 7 20 8 13 9 16 -4 -3 -5 7 -7 -5 4 2 -2 -8 3 3 2 -6 -1 2 0 -9 -4 -3 -3 9 9 -6 6 -3 13 11 15 6 7 5 1 16 11 12 8 6
7225 6 11 6 10 3 4 -2 11 -2 -10 4 2 -4 4 -3 -2 6 -2 2 1 2 0 0 -6 9 5 -6 3 -1 10 14 8 3 2 6 -1 0 3 7 11 -3 7 9 -8 9 5 6 6 10 -5 1
7275 1 1 0 -3 -5 -3 -5 1 4 3 -2 -1 2 -5 1 0 6 11 0 2 11 7 10 6 1 10 5 10 -5 3 -1 -3 6 2 2 16 -6 -7 9 -1 14 4 -5 -1 4 -6 -1 1 -10 2 -4
7325 -4 -5 -5 2 1 -9 -5 -4 2 -2 0 -4 2 1 -4 -8 -10 7 11 -5 0 8 0 -4 7 4 3 -7 -6 -4 -2 -4 -6 -4 5 -4 4 3 3 -5 5 -3 9 -12 -2 -2 -2 -1 4 -2 6 0 5
7377 5 3 3 14 7 -4 0 -3 3 14 13 13 8 7 -1 8 -2 0 4 -7 0 -4 -3 -5 -5 -5 4 0 0 5 0 8 -7 -14 9 -11 -10 1 -11 -1 -6 -6 4 -4 -7 5 3 12 -2
7425 -2 14 3 6 1 10 8 8 -1 8 4 6 9 2 4 10 2 -5 -2 -4 -1 -15 -9 -2 1 -3 -7 -12 -3 1 -1 -3 9 4 1 3 6 -3 1 9 10 -7 12 8 1 7 -5 10 9 7 7 -4 3
7477 3 14 10 11 3 10 -1 -9 -1 -5 2 5 -3 -3 0 -2 6 -6 -4 -4 -3 -1 5 -8 2 3 5 6 2 -3 -2 -2 16 7 19 9 15 7 9 8 -2 13 13 13 11 8 -14 7 -3
7525 -3 1 5 -6 3 1 -5 -3 -11 -6 -11 8 -6 3 9 -5 -9 0 0 7 8 2 -4 2 8 3 12 7 7 4 4 1 1 8 6 -3 5 -8 7 0 -1 -8 -10 0 -4 3 2 4 -2 0 -8 -8 -1 0 -11
7579 -11 -1 1 2 4 5 -2 -1 -1 3 6 -3 -1 8 7 -2 11 2 11 6 9 4 6 7 3 7 3 -6 8 3 -5 -8 -9 1 4 4 1 0 4 -2 0 12 3 -4 2 4 8 6 10 17 0 3 4 5 8
7633 8 22 15 9 6 11 0 19 3 2 8 3 7 12 4 5 0 3 -1 0 -4 0 9 9 0 3 1 1 2 11 2 0 5 8 -1 -2 12 -6 -3 7 11 9 10 5 4 13 8 3 12 18 4 10 11 7
7686 7 10 10 4 5 11 5 10 12 2 -3 -2 7 0 -11 -5 0 7 5 1 1 -6 6 13 6 5 -2 7 8 2 10 -1 2 10 8 19 13 4 7 9 13 8 9 9 9 12 -2 2 2 1 5 -4 2 3 2 1
7741 1 -4 2 -7 -3 -5 7 -6 1 -1 1 10 -2 3 12 13 2 13 10 14 4 13 10 6 12 10 10 9 0 6 1 2 11 5 2 8 -2 -1 -5 5 4 -1 -3 -1 -2 4 1 16 4 3 -6 2
7792 2 3 2 12 10 5 3 9 3 22 8 14 15 6 15 12 23 3 13 2 4 15 9 3 -1 5 1 11 12 4 -2 6 4 2 2 7 3 -6 -12 -7 -1 8 4 6 -4 14 5 5 11 9 6
7842 6 8 8 11 15 7 4 10 8 7 4 16 12 4 3 10 7 8 -1 13 5 2 -4 -7 6 1 3 1 -2 10 16 5 6 2 -1 -3 4 9 4 9 14 11 8 3 0 7 5 21 10 11 9 15 0 2
7895 2 -2 8 9 4 7 2 12 -1 -7 5 -2 -4 4 0 -3 2 -4 -2 2 3 4 -3 7 0 1 -1 0 8 3 3 6 9 6 10 16 17 12 1 15 -1 1 7 2 5 6 3 0 2 8 3 4 5 6
7948 6 0 -2 5 -2 8 5 3 -6 4 6 7 9 8 -2 1 1 2 10 2 8 10 9 2 -1 5 0 8 12 12 9 8 2 0 1 12 10 -1 4 -1 -2 -3 2 -1 4 -13 7 -1 -3 1 -1 4 9 0 5
8002 5 2 6 3 11 5 1 -2 1 11 5 7 -3 6 2 10 1 -2 7 6 9 9 5 -1 0 -3 -5 -4 7 -8 -4 -4 -4 -1 7 4 -6 3 -2 7 -4 -1 3 5 -1 4 15 8 3 21 6 5 9
8054 9 4 11 15 13 0 4 11 17 -3 13 8 13 5 8 12 1 7 3 5 5 11 16 16 2 1 3 -5 2 10 7 8 0 1 -3 15 14 17 5 2 14 10 10 -3 1 5 4 8 6 7 8 8 1
8106 1 10 10 6 1 10 -4 -2 1 2 11 6 -1 1 -2 2 8 6 7 3 6 6 10 7 -2 8 1 14 10 4 14 6 17 12 17 7 3 4 9 1 1 17 5 15 8 2 13 6 6 14 -6
8156 -6 3 10 7 -2 4 1 -2 12 9 -1 5 2 3 2 -5 5 9 5 0 6 10 12 11 9 15 5 -5 4 8 4 7 15 12 2 3
8191C
$$ Imaginary data points
##PAGE= N=2
##DATA TABLE= (X++(I..I)), XYDATA
0 0 0 0 0 0 0 0 0 0 0 0 0 0 0 0 0 0 0 0 0 0 8 -8 8 -8 8 -8 10 -16 16 -16 24 -24 25 -32 33 -40 45 -49 56 -64 70
41 70 -77 85 -96 105 -113 129 -140 153 -170 186 -206 227 -250 279 -307 342 -380 424 -480 544 -619
62 -619 718 -847 1022 -1277 1676 -2412 4196 -17680 -3376 42858 5713 -31953 -14740 22843
76 22843 15443 -8024 -15165 -4414 8594 17108 -453 -24485 -10476 28675 20005 -26948 -27876
89 -27876 22512 31547 -14667 -31386 6531 26359 1423 -17990 -6829 6763 9243 4628 -8315
102 -8315 -15411 4552 23333 1027 -28177 -7260 28920 12784 -26154 -16204 20528 16937 -13258
115 -13258 -14392 5916 9376 614 -2294 -5142 -5407 7507 12857 -7529 -18663 5790 22072 -3162
129 -3162 -22850 376 20893 1509 -17076 -2331 11761 1503 -6220 528 975 -3555 3217
142 3217 6806 -6066 -9683 7697 11719 -8118 -12349 8040 11797 -7484 -9867 7176 7189 -7057
156 -7057 -4032 7317 928 -7776 1660 8041 -3756 -8038 5066 7226 -6021 -5833 6537 3593
170 3593 -7096 -966 7773 -1789 -8643 4292 9676 -6006 -10389 6969 10767 -6799 -10127 5990
184 5990 8598 -4573 -5809 3162 2132 -2152 2146 1782 -6509 -2349 10239 3587 -13031 -5443 14146
199 14146 7190 -13695 -8535 11527 8811 -8149 -7692 4150 5137 -101 -1175 -3100 -3577 5201 8731
214 8731 -5586 -13216 4566 16516 -2237 -17897 -699 17100 3505 -14219 -5595 9533 6170
227 6170 -3919 -5169 -1981 2403 7025 1579 -10730 -6303 12456 10840 -12086 -14325 9942 16201
241 16201 -6421 -15813 2508 13397 1238 -8950 -3849 3333 5006 2784 -4472 -8487 2325
254 2325 12893 854 -15543 -4603 15919 7896 -14341 -10270 10912 10938 -6534 -9819 1856
267 1856 6899 2311 -2567 -5260 -2474 6773 7619 -6457 -11811 4862 14652 -2190 -15530 -668
281 -668 14480 3181 -11669 -4734 7567 4910 -3022 -3776 -1529 1353 5122 1752 -7633 -5185 8627
296 8627 8114 -8289 -10154 6873 10907 -4766 -10169 2617 8221 -701 -5159 -415 1719 819 1931
311 1931 -296 -4971 -765 7254 2154 -8516 -3515 8648 4374 -7953 -4667 6513 4081 -4862
325 -4862 -2844 3180 1015 -1795 1110 813 -3151 -213 4855 53 -5924 63 6485 -61 -6262
340 -6262 356 5658 -825 -4635 1623 3559 -2576 -2512 3490 1580 -4273 -884 4657 250 -4704 274
356 274 4220 -935 -3424 1707 2361 -2659 -1229 3776 299 -4769 435 5721 -687 -6171 737 6225
372 6225 -470 -5544 249 4318 -132 -2594 345 516 -1007 1487 1995 -3270 -3336 4408 4672 -4926
388 -4926 -5863 4657 6508 -3775 -6439 2504 5568 -1075 -3849 -99 1587 920 1164 -968 -3761
403 -3761 478 5995 631 -7459 -2011 8005 3384 -7535 -4446 6135 4798 -4115 -4444 1740 3160
418 3160 502 -1189 -2363 -1368 3418 3949 -3634 -6258 3056 7947 -1789 -8625 259 8292 1335 -6826
434 -6826 -2440 4623 2951 -1882 -2606 -917 1443 3371 310 -5118 -2409 5934 4360 -5879 -5980
449 -5980 4904 6757 -3424 -6665 1644 5618 -25 -3784 -1206 1406 1841 1219 -1702 -3578 1010
464 1010 5436 190 -6488 -1489 6738 2684 -6113 -3505 4820 3666 -3158 -3228 1315 2109 286 -544
480 -544 -1561 -1319 2208 3079 -2304 -4494 1906 5389 -1181 -5596 412 5193 304 -4153 -656 2811
496 2811 702 -1207 -264 -281 -441 1524 1342 -2378 -2214 2771 2856 -2838 -3226 2540 3124 -2179 -2740 1709
514 1709 1936 -1378 -966 1169 -72 -1100 1061 1175 -1785 -1236 2338 1312 -2531 -1203 2561 982
530 982 -2350 -524 2110 -38 -1836 670 1600 -1311 -1478 1749 1324 -2086 -1232 2113 983 -1995
546 -1995 -664 1666 161 -1257 476 888 -1191 -543 1949 423 -2528 -367 2981 506 -3069 -602
562 -602 2890 714 -2364 -647 1587 369 -716 104 -201 -820 919 1583 -1453 -2420 1624 3046 -1522
579 -1522 -3438 1155 3469 -615 -3059 118 2297 356 -1181 -509 -35 429 1305 17 -2311 -628
595 -628 3032 1385 -3310 -2085 3122 2555 -2581 -2761 1708 2493 -787 -1878 -134 868 808 338 -1179
612 -1179 -1576 1183 2689 -832 -3437 303 3822 396 -3673 -962 3142 1384 -2213 -1468 1096 1204
628 1204 49 -637 -1101 -229 1822 1147 -2237 -2110 2199 2781 -1887 -3186 1300 3159 -628 -2730 -2
645 -2 1971 500 -899 -667 -190 616 1290 -226 -2084 -250 2632 846 -2766 -1357 2576 1679 -2133
662 -2133 -1765 1463 1497 -795 -1045 128 301 314 460 -621 -1242 670 1874 -547 -2273 324 2435
679 2435 -51 -2283 -124 1942 246 -1390 -170 786 -13 -167 350 -350 -720 740 1064 -983 -1360
696 -1360 1046 1462 -1043 -1455 911 1229 -818 -926 739 498 -698 -54 730 -338 -761 680 824
713 824 -856 -778 1005 728 -1000 -534 991 303 -921 29 878 -375 -858 664 834 -922 -846 1043
731 1043 785 -1073 -706 980 523 -811 -237 608 -87 -388 543 276 -929 -158 1338 189 -1560 -238
749 -238 1698 338 -1606 -409 1367 416 -993 -331 495 90 -37 238 -423 -675 717 1102 -867 -1488
767 -1488 861 1742 -683 -1820 449 1709 -142 -1336 -60 842 230 -188 -191 -440 53 1025 224 -1468
785 -1468 -598 1693 945 -1721 -1253 1494 1363 -1162 -1350 659 1063 -201 -618 -222 22 490 621 -590
803 -590 -1205 534 1716 -283 -1958 16 2037 319 -1820 -527 1424 654 -876 -611 259 375 304
820 304 -7 -776 -463 1046 909 -1169 -1308 1076 1558 -867 -1609 559 1486 -244 -1156 6 694 196
838 196 -113 -172 -416 114 934 102 -1268 -326 1472 580 -1482 -761 1320 817 -1054 -770 699 552 -361
857 -361 -248 48 -158 161 543 -289 -897 315 1169 -250 -1275 183 1288 -82 -1133 41 914 -33
875 -33 -594 104 265 -240 21 402 -281 -584 438 682 -560 -775 580 749 -597 -669 565 518 -546
894 -546 -302 537 102 -510 148 550 -315 -518 476 512 -537 -431 599 325 -593 -168 577 -35 -562 223
914 223 534 -437 -547 563 512 -686 -512 683 442 -656 -343 557 208 -417 9 303 -231 -180 505 119
934 119 -722 -60 925 106 -1005 -134 1022 189 -924 -199 714 170 -464 -87 147 -109 115 296 -371
953 -371 -568 515 790 -573 -977 554 1088 -430 -1054 292 936 -103 -654 -10 313 83 84 -29 -466
972 -466 -74 773 239 -1001 -443 1083 599 -1034 -738 869 746 -634 -668 332 454 -54 -142 -156 -209 301
992 301 580 -318 -885 271 1124 -126 -1205 -16 1178 189 -1000 -279 711 304 -377 -242 2 73 293
1011 293 154 -565 -431 698 649 -739 -852 661 961 -502 -922 357 807 -151 -530 37 231 68 122
1030 122 -28 -422 -23 687 137 -850 -263 908 362 -872 -426 729 407 -565 -334 330 160 -166 22
1049 22 -1 -252 100 465 -160 -619 186 743 -142 -752 130 723 -80 -589 93 429 -106 -235 173 55 -254
1070 -254 92 336 -228 -437 301 449 -360 -460 360 411 -364 -311 354 202 -351 -51 355 -69 -356 198 375
1091 375 -276 -325 345 310 -353 -227 363 139 -342 -13 314 -132 -310 245 304 -371 -305 438 299 -466 -279
1112 -279 450 252 -383 -154 312 77 -197 90 126 -231 -29 396 7 -520 18 629 1 -665 -39 634
1132 634 45 -542 -74 363 36 -185 24 -15 -136 186 272 -321 -401 408 529 -411 -590 386 640 -286 -575
1153 -575 194 469 -57 -266 20 59 35 188 -16 -401 -50 572 131 -690 -243 699 311 -641 -383 511 360
1174 360 -342 -298 152 160 23 30 -142 -221 249 454 -258 -598 243 717 -155 -729 67 665 20 -530 -70 344
1196 344 78 -129 -46 -120 -57 285 158 -440 -297 505 399 -519 -475 459 497 -371 -448 261 357 -140 -187 60 14
1219 14 11 189 -17 -363 19 505 39 -585 -78 596 107 -559 -135 447 112 -332 -68 196 -16 -53 144
1240 144 -40 -250 147 371 -176 -410 213 464 -193 -439 209 409 -174 -306 182 189 -197 -69 220 -65 -245
1261 -245 156 237 -254 -267 278 245 -314 -210 338 161 -321 -73 323 -1 -286 112 281 -162 -227 257 228 -271
1283 -271 -176 311 128 -295 -59 274 -49 -262 123 220 -241 -204 308 173 -383 -165 412 131 -410 -98 370
1304 370 63 -294 10 206 -84 -100 199 34 -295 52 414 -81 -471 125 526 -93 -511 86 459 -65
1324 -65 -358 44 222 -59 -67 91 -94 -164 230 235 -359 -329 420 407 -417 -431 394 442 -307 -378 217 284 -120 -111 50
1349 50 -63 -5 246 -3 -424 -29 550 66 -623 -143 626 183 -566 -205 449 195 -278 -117 116 21 50
1370 50 135 -165 -277 256 440 -268 -548 269 610 -215 -619 123 543 -70 -421 5 239 -6 -49 19 -158
1391 -158 -97 315 177 -434 -271 510 365 -502 -403 450 413 -339 -345 255 244 -140 -89 63 -76 -4 251 -15 -412
1414 -412 -1 509 22 -575 -71 555 72 -520 -95 389 66 -292 -5 151 -94 -16 188 -74 -286 161
1434 161 384 -186 -436 200 459 -195 -422 187 357 -170 -255 167 137 -190 -24 194 -101 -237 181 253 -260
1455 -260 -290 301 266 -315 -237 305 169 -298 -82 291 -9 -270 111 256 -191 -235 259 216 -303 -181 311 118
1477 118 -308 -62 278 -33 -261 109 225 -213 -201 285 183 -350 -165 383 143 -380 -116 354 76 -280
1497 -280 3 208 -75 -125 183 65 -271 2 371 -48 -449 40 472 -40 -472 20 400 -16 -318 11
1517 11 187 -64 -52 119 -81 -195 201 292 -276 -359 324 424 -299 -449 270 427 -199 -359 132 239 -72
1538 -72 -85 41 -102 -41 264 63 -400 -137 483 192 -527 -264 491 290 -411 -281 310 226 -163 -122 54 -15
1560 -15 57 190 -99 -323 138 481 -93 -554 65 578 10 -526 -61 436 90 -291 -82 129 19 41 73
1581 73 -180 -186 265 292 -319 -389 328 452 -279 -463 215 414 -138 -319 82 183 -23 -14 33 -130 -62 267 101
1604 101 -373 -154 414 208 -421 -239 379 228 -312 -207 217 123 -138 -13 69 -93 -14 218 -1 -317 3
1625 3 382 9 -407 -25 386 22 -343 -11 262 -26 -179 68 67 -140 -14 197 -70 -263 90 300 -122
1646 -122 -309 124 296 -131 -250 133 187 -125 -80 165 15 -176 71 223 -112 -243 158 249 -179 -233 166
1667 166 192 -175 -148 143 51 -151 24 146 -124 -179 168 172 -223 -207 236 198 -230 -192 207 151 -152 -72 115 -2
1691 -2 -65 107 60 -188 -50 275 64 -319 -89 337 94 -329 -117 262 95 -195 -67 94 -6 -21 73 -56
1713 -56 -172 97 266 -116 -324 95 362 -65 -366 29 319 14 -238 -35 133 29 -19 21 -100 -70 182
1734 182 144 -237 -208 267 276 -235 -297 194 299 -124 -243 68 165 -3 -49 -19 -54 32 171 -8 -270 -41 329
1757 329 95 -344 -134 312 162 -264 -179 167 131 -86 -78 0 -17 67 101 -104 -194 95 280 -77 -308 48 327
1780 327 2 -285 -29 222 40 -136 -33 45 3 42 52 -116 -120 153 173 -187 -217 156 223 -147 -237 82 185
1803 185 -66 -132 17 51 -20 25 11 -96 -37 162 65 -191 -96 200 116 -197 -117 146 95 -108 -58 66 7 -39 43
1828 43 13 -108 -8 148 -3 -190 -26 180 29 -178 -37 139 20 -101 -8 47 -28 -14 73 -12 -111 35 143
1851 143 -42 -169 26 160 -30 -163 10 108 -10 -66 14 21 -34 39 69 -80 -90 104 126 -109 -136 91 156 -63
1875 -63 -116 44 100 -20 -49 3 -21 -4 69 5 -119 -39 149 69 -158 -95 146 102 -119 -109 82 96 -38 -44 -2 7 34
1902 34 57 -46 -104 38 158 -26 -175 15 176 17 -158 -53 119 55 -61 -41 -1 17 34 -8 -85 -52 88 94
1926 94 -111 -146 98 149 -72 -145 37 141 9 -81 -25 42 31 25 -20 -73 11 124 25 -134 -50 142 80 -122 -89 88
1952 88 100 -62 -79 15 56 10 -10 -43 -42 46 86 -39 -119 22 129 -3 -132 -17 117 34 -83 -32 45 32 7 -1 -33
1979 -33 -14 58 46 -72 -66 67 95 -62 -91 34 88 -10 -58 11 36 14 4 2 -33 -8 51 23 -82 -23 83 41 -79 -54
2007 -54 58 34 -47 -46 23 12 -6 10 -15 -43 4 65 -3 -70 -1 78 15 -78 -20 62 27 -46 -10 14 7 19 34 -22 -28 39 59
2038 59 -39 -78 31 76 -36 -72 1 59 -2 -37 -10 -12 -8 10 1 -50 -18 53 26 -65 -49 69 71 -61 -54 42 54 -22 -31 7 16 11
2070 11 17 -21 -59 14 76 -8 -86 0 98 19 -93 -21 76 18 -54 -33 15 5 10 1 -48 -30 40 61 -59 -72 50 90 -41 -94
2100 -94 35 69 -9 -58 3 27 0 5 -5 -26 3 52 5 -68 -35 85 37 -87 -50 80 55 -59 -53 32 25 -13 -7 -10 -22 9
2130 9 44 -11 -62 17 66 -23 -91 -1 91 1 -73 -7 57 1 -37 -1 9 -13 5 37 -33 -27 52 60 -43 -62 65 81 -37 -43 42
2161 42 44 -9 -21 34 22 -11 16 18 -39 -28 46 20 -71 -33 66 17 -76 -28 62 16 -53 -12 32 -5 -26 20 17 -37 -10 58 12 -61
2193 -61 6 74 5 -55 11 65 -10 -49 10 24 -38 -11 33 0 -54 6 53 -22 -73 25 57 -32 -66 25 38 -42 -33 31 7 -33 7
2224 7 41 -28 -43 32 43 -48 -50 48 56 -38 -43 43 24 -32 -11 27 -2 -22 37 36 -41 -33 56 22 -71 -23 72 29 -72 -36 54 18 -41
2257 -41 -4 19 -11 -11 31 4 -54 10 72 -12 -85 10 88 -8 -74 0 79 7 -41 11 34 3 3 26 -12 -27 55 52 -38 -59 57
2288 57 83 -53 -67 46 80 -35 -56 21 35 -20 -8 7 -27 -19 30 8 -76 -37 73 30 -86 -41 80 44 -64 -36 43
2315 43 34 -21 -6 13 -7 24 47 -5 -48 16 83 -5 -83 0 92 4 -84 -3 64 8 -30 4 5 -11 10 13 -43 -56 45 57 -45
2346 -45 -62 42 65 -44 -64 28 56 -11 -29 11 15 -5 21 11 -27 -19 59 25 -65 -29 57 51 -52 -39 57 31 -39 -20 32 0
2376 0 -4 30 4 -38 3 51 11 -57 -7 73 7 -73 -16 58 7 -49 -6 25 -15 -12 28 -7 -46 20 59 -10 -54 22 61 -6 -56 12
2408 12 55 4 -30 12 18 -3 8 28 -28 -35 32 50 -42 -49 37 52 -33 -62 13 32 -26 -31 12 7 -9 9 20 -33 -17 44 26 -60 -22
2441 -22 61 43 -44 -28 48 34 -17 -15 17 13 9 20 -9 -41 3 67 -10 -78 7 68 15 -84 -18 56 12 -41 -15 18 7 0 4 -25 -23
2474 -23 38 51 -31 -56 36 70 -22 -63 22 57 0 -28 15 32 6 0 -2 -18 3 49 31 -56 -25 66 42 -49 -42 45 45 -26 -44 3
2506 3 27 -4 -9 -6 -16 6 39 -12 -43 -2 58 12 -65 -12 54 17 -51 -20 28 14 2 -1 -5 5 22 37 -14 -26 42 57 -16 -55 12
2539 12 64 -2 -51 1 24 6 -16 -10 -23 -1 22 1 -44 -29 44 47 -52 -48 41 42 -25 -43 23 35 -2 -10 8 -5 7 38 10 -32 -5
2572 -5 54 28 -40 -18 46 31 -32 -13 22 16 -1 2 -5 -2 10 25 -16 -42 16 43 -10 -54 -18 53 10 -33 -18 23 8 -7 4 -9 6
2605 6 22 20 -20 -28 27 43 -18 -40 24 54 -4 -34 9 28 12 -7 4 -9 2 24 2 -38 -20 48 27 -39 -25 43 21 -32 -34 18
2637 18 19 0 -4 -13 -3 16 20 -18 -29 19 44 14 -44 2 38 18 -29 -21 35 33 1 -6 0 9 21 21 -16 -17 36 34 -25 -44 17 54 -7 -33
2673 -33 -2 22 16 -12 -17 -15 3 16 -3 -43 -8 44 13 -39 -26 34 30 -17 -33 10 17 7 -13 -9 14 15 12 -18 -18 1 32 -5 -38 -13 39
2708 39 8 -43 -17 24 7 -21 -24 -6 0 7 2 -23 -28 8 20 -20 -46 13 44 -12 -32 0 31 -7 -20 -6 -1 9 13 0 -7 -13 21 12 -18
2743 -18 -16 27 30 -14 -23 10 22 -8 -12 3 -3 11 8 -7 -16 -5 30 8 -33 4 36 15 -30 -22 25 8 -17 -13 -2 5 16 9 -10 -14 7 27
2779 27 -12 -26 4 42 -1 -25 1 35 12 -5 -8 4 12 1 3 -4 -14 27 13 -24 -25 10 17 -24 -33 -4 15 -7 -27 4 9 -8 2 -6 -13
2814 -13 2 26 8 -27 -6 33 18 -30 -24 22 21 -16 -12 17 10 7 -1 -5 -27 3 28 -15 -40 2 26 -2 -32 -10 33 -2 -21 -27 2 -9
2848 -9 6 -6 -16 -9 6 14 -11 -18 25 35 3 -39 1 34 0 -10 -1 21 16 4 -10 -13 7 17 5 -21 -7 31 19 -35 -23 21 20 -12
2882 -12 -26 5 9 7 -1 -5 -9 2 12 -21 -31 -5 22 -11 -37 -5 31 12 -17 -8 6 15 3 0 -6 7 11 18 -8 -11 12 38 -8 -25 3 33
2918 33 1 -18 6 11 5 -4 -9 -17 -12 7 -9 -28 -17 19 9 -30 -21 16 31 -10 -24 10 7 -3 3 0 -13 18 20 8 -21 5 18 12 -23 5
2954 5 28 15 -20 -5 10 12 1 -10 -2 8 0 14 -12 -25 -6 14 -9 -34 -4 17 0 -28 -9 7 3 -7 0 -7 -4 10 11 -12 -1 16 19
2989 19 -7 -16 7 21 3 -18 11 13 1 -2 1 -2 2 11 -8 -19 -4 23 13 -17 -18 14 15 -13 -17 9 13 -5 -10 -17 -3 9 4 -14 -22 -3 26 -3
3027 -3 -26 -4 12 -1 -30 -13 24 20 -6 -7 -1 10 7 -4 -13 -14 21 18 -7 -29 8 11 -4 -27 6 22 -5 -18 -12 -8 7 -2 -5 -16 -7 13 -2
3064 -2 -23 -13 18 20 -9 -26 11 20 -2 -5 3 21 7 4 3 -5 7 12 -8 -21 3 22 6 -32 -12 18 3 -11 -17 1 5 -1 -1 -14 -3 0 8 -7
3102 -7 -20 11 24 -4 -18 8 21 12 5 -8 17 9 5 3 -11 13 22 14 -2 -6 23 33 -11 -22 15 21 4 -5 10 15 11 0 -4 -7 3 20 3 -17
3140 -17 -8 20 11 -12 -17 14 14 -1 -11 7 4 1 1 1 -4 11 10 -4 -20 16 24 9 -10 0 24 17 -3 -3 13 9 10 -2 -9 2 7 18 -7 -15 14
3179 14 21 -11 -22 -4 24 4 -12 -12 -3 -1 14 0 4 11 23 22 -4 6 27 15 -5 -4 20 19 6 -7 3 16 11 -5 0 4 17 12 -15 -17 9
3216 9 19 -6 -22 -14 18 9 -18 -19 4 9 2 -5 -8 10 17 2 -11 -8 12 23 -5 -13 5 24 17 -8 2 7 6 2 -3 -1 10 23 5 -11 0 13 9
3255 9 -16 -6 14 8 4 -11 0 13 13 -12 0 -5 7 8 -4 -11 -1 22 8 -16 -3 20 9 -10 -6 8 6 -5 5 0 17 10 6 -1 -12 -2 12
3292 12 5 -14 -1 17 7 -16 -2 0 -4 -5 -13 -8 -4 4 -3 -7 -1 18 9 -13 -15 13 5 1 -6 2 2 11 8 0 14 5 14 2 -4 12 20 9 0 10 30 3 1 -7
3336 -7 4 12 7 -6 -3 5 0 1 -13 -25 -1 3 -6 -12 -3 5 0 4 -5 5 12 -9 -7 -1 1 10 0 -11 -5 8 5 0 -1 12 11 -6 -6 -2 9 4 -5 -5 -2 -1 12 -1
3382 -1 -13 -8 1 9 -17 -6 16 9 -7 -3 1 5 -2 -7 -3 -8 10 -6 -1 -14 -10 11 -2 -14 1 21 9 -14 1 15 10 8 -4 6 4 14 -7 -7 4
3421 4 17 5 0 -7 0 13 -5 -13 -6 11 -1 -11 -9 5 0 6 -9 -8 -5 7 7 -8 -6 16 10 7 -7 15 21 20 7 6 3 8 2 5 6 -1 22 0 -2 -2 21
3464 21 16 0 -7 10 -4 -21 -8 0 11 7 -9 4 1 16 16 -6 -5 7 16 2 -12 3 13 1 -6 3 -1 16 2 13 -2 0 16 4 -6 1 4
3501 4 2 -3 -8 2 8 -1 -11 5 4 0 -4 -7 -10 0 -2 1 -9 -14 12 -4 -12 -11 5 10 -7 -3 8 5 -4 -4 -1 7 5 8 1 -11 7 20 12 -6 11 6 13 -5 -11
3546 -11 10 -7 -3 5 5 -3 -5 0 -13 -8 2 3 -13 -6 3 12 4 -5 -3 14 4 2 0 2 1 10 -4 -4 1 13 18 0 -2 20 19 0 -7 6 6 4 -2 -6 -2 4 0 -7 -14
3593 -14 -4 4 6 -8 -7 8 -13 -24 -8 0 10 5 -3 0 8 6 18 12 -6 12 16 -2 3 8 14 4 0 -5 19 4 -3 -7 -4 -1 7 8 2 2 13 8 -5 -8 10
3636 10 13 3 -20 -13 -5 -3 -14 -8 -12 -4 6 -8 1 -7 -4 -6 -8 3 16 5 -5 -8 12 4 2 -7 10 8 7 4 -9 -2 10 11 2 -8 -4 17 -7 -2 -7 12 2
3679 2 -13 -12 -3 3 -6 -1 -16 -14 5 -5 -1 -12 3 22 -10 -13 11 14 6 -4 5 7 0 10 0 1 -1 4 6 -1 2 11 7 2 -8 3 4 -4 -9 7 1 -2 -14 -9 4
3724 4 -4 9 -9 -16 5 12 -1 -8 -3 12 12 0 2 5 3 1 -7 5 8 7 0 3 -12 20 16 7 -15 -5 12 7 0 5 7 4 -5 1 1 -6 -3 4 -5 9 11 9 2 0 11
3771 11 11 3 -10 2 6 2 3 2 5 20 1 2 -4 14 17 9 -1 -4 22 15 11 10 12 12 -1 6 6 13 1 -4 -3 0 0 9 3 0 3 11 3 -16 -16 -2 1 -6 8 1 -2 13
3819 13 -2 -2 0 8 5 4 6 6 20 5 -2 14 4 8 5 10 6 4 1 -5 -6 4 12 7 -14 -4 13 16 -4 -9 -3 14 1 5 8 3 3 6 -12 -6 9 17 -5 -5 2
3864 2 10 17 2 7 9 19 8 -3 12 10 11 4 2 14 9 11 3 -4 3 12 -6 -7 5 12 7 9 5 -12 8 -5 0 -15 -1 13 10 -3 4 11 6 -4 -3 11 16 11
3908 11 3 0 13 22 18 9 10 6 16 4 0 5 13 8 -9 -6 -2 17 5 -6 -14 2 5 -5 -1 -7 -3 11 -4 -2 14 18 -3 -3 7 17 9 3 1 20 17 12 6 8
3952 8 19 17 19 -4 -7 22 18 17 4 7 20 29 12 -1 13 4 -2 2 8 19 7 1 2 0 14 3 -1 0 4 22 12 0 1 10 7 14 2 7 22 29 1 2 9
3995 9 20 2 4 1 11 7 -1 2 8 8 19 4 6 7 4 7 9 -1 8 9 -1 -6 1 9 5 6 -9 0 8 7 -9 -4 12 9 5 0 4 3 5 5 6 13 12 15 -1 -4 17 14 7
4044 7 5 0 2 8 -13 -6 5 0 7 -5 -9 2 9 1 -6 -14 4 3 -8 -14 -2 14 9 -3 -2 13 5 10 -1 6 7 -4 9 4 16 3 9 4 6 5 12 6 -1 2 18
4089 18 12 -4 -2 3 13 0 -1 -9 3 7 9 2 -5 12 8 6 -4 1 20 9 2 8 16 21 4 14 9 21 18 5 -2 16 10 -1 -4 4 14 18 8 7 8 15 -1
4132 -1 3 0 8 14 10 -10 4 9 14 5 1 -11 -1 1 -4 -7 0 11 7 1 6 8 -7 2 0 0 13 13 3 7 5 9 11 12 9 6 15 6 -2 12 13 7 -3 -1 -10 0 0 -12 -3
4181 -3 -1 7 -6 -14 -7 12 13 0 5 3 4 2 1 7 17 16 6 8 14 20 13 1 1 5 15 -1 10 -3 0 -4 4 7 9 10 8 -14 -14 -3 8 4 -4 -9 6 10 7 -12
4227 -12 -1 3 0 -5 -1 12 10 14 -5 -3 11 2 11 -2 9 14 17 7 4 2 13 20 0 2 5 13 8 6 17 2 7 13 8 5 3 -4 2 -5 -3 9 -2 -4 3 7 5 -5
4273 -5 3 -1 8 12 6 7 7 17 10 10 -2 11 15 -1 7 16 15 6 6 2 20 20 7 6 -3 0 -2 11 0 1 8 -11 7 1 3 12 -14 -5 9 1 -2 -7 -1 7 13 10 5 5 13
4322 13 4 0 13 12 15 13 2 5 6 17 18 2 6 3 -3 5 -2 8 4 9 5 -5 6 3 5 4 5 -2 9 4 -11 7 2 11 -6 -8 -4 11 3 0 4 6 2 -3 9 -1
4368 -1 -3 9 10 15 10 0 -1 6 1 13 8 -1 -3 7 7 -3 -1 -5 3 -1 2 -3 -6 -6 3 -11 -13 1 -5 4 7 4 -6 5 12 3 -2 7 14 4 0 4 5 17 -5 2 0 6 5
4417 5 1 -3 1 3 1 8 0 -4 5 2 -3 5 -2 3 3 -3 -1 1 -5 0 -4 3 0 2 -8 3 3 4 1 3 0 7 -5 4 -9 5 11 -4 5 8 -2 3 -3 -1 10 7 4 -5 12 3 2 3
4469 3 -8 -19 5 4 -4 -5 0 6 6 -9 -4 2 8 -7 -8 2 0 10 1 2 2 -1 -1 0 8 6 4 7 2 10 4 -4 4 -4 4 8 0 -7 1 -6 3 -5 -11 -6 1 5 -13 -12 -4 -3 -2 -10 -11
4522 -11 3 -4 -6 2 -5 2 11 0 4 0 5 3 3 17 18 -2 8 10 4 9 19 4 0 1 4 10 -5 10 6 6 -1 -2 8 -1 8 2 -2 -10 -4 -11 -8 -12 -1 1 -11 1 2
4569 2 5 -3 -5 -3 14 12 7 0 -4 13 10 10 5 4 14 12 -4 -3 8 16 -1 -4 -6 1 0 -3 7 1 -8 0 -7 7 -10 4 -6 -13 5 -13 0 -1 -6 1 -6 9 1 5
4615 5 16 7 7 1 11 9 3 11 3 4 14 6 9 6 10 -7 -6 -1 3 5 0 -6 7 -7 -5 1 -4 -9 -6 -7 5 3 -4 -17 -4 -1 0 -7 11 1 2 -2 3 6 0 7 6 -1 13
4664 13 -1 0 -1 3 3 -13 4 -5 2 3 -2 0 9 -10 5 -2 4 -1 -2 -14 1 -5 -6 3 -5 -3 -1 -8 -2 -6 -5 2 2 -3 9 5 16 14 -5 6 13 1 3 4 2 -1 4 6
4712 6 1 -6 0 -4 -12 -7 -5 -4 -3 -14 -13 -6 8 -4 -2 2 2 -2 -2 -3 4 -4 2 -3 -10 -2 -3 2 -4 3 14 5 -1 -1 9 6 5 2 1 10 2 9 -11 5 9 -10 -2 0 9 -1 -3 -3
4764 -3 3 6 3 6 1 -2 -6 -2 -11 -2 2 -8 -6 -7 -5 6 3 -2 -3 -3 -2 2 2 1 -4 10 6 -5 7 8 8 4 6 2 1 7 3 -5 -8 0 5 -3 -8 -6 2 -5 4 -5 -3 0 -7 -1 -1 9 -5
4819 -5 -8 -4 7 11 -7 -1 6 2 -2 2 10 13 6 13 4 4 6 5 -1 4 22 1 10 0 2 -2 0 2 -10 -12 -1 5 -2 -6 1 -6 -5 3 -5 -6 5 -8 -1 0 1 1 5 -1 12 7 0
4870 0 5 17 10 2 3 14 7 -6 9 2 7 -2 3 -1 -1 7 4 0 6 -8 2 0 -3 -1 -4 5 -6 0 -8 0 2 0 -2 -10 -3 -3 6 4 -6 6 14 12 -1 0 1 3 11 -4 7
4919 7 7 0 6 -1 1 6 4 1 -6 1 -5 -3 -6 -11 7 -13 -3 -10 -24 -3 -5 -7 -4 -2 -7 0 -1 -5 -1 0 6 -5 2 9 0 7 1 0 7 7 8 6 13 4 6 -1 0 3 6 -4 3 4 -7
4972 -7 -8 -9 -12 -4 -8 -5 0 -15 -3 -8 -6 2 2 -1 1 -3 4 -8 2 -2 3 1 10 6 4 4 0 1 -3 -1 -1 1 7 9 -1 -3 -5 -1 -2 -10 -6 0 1 1 1 -12 -5 -1 -7 -11 8 4 -3 -14
5026 -14 0 0 3 -4 7 2 2 4 3 10 7 2 1 0 7 5 7 8 4 2 10 0 13 4 -7 -7 0 4 6 7 3 5 -5 -7 -8 -11 -12 -8 -5 -7 -10 -11 -4 -1 -1 -9 1 1 10 5 3 -2 -2
5079 -2 -4 2 1 3 -2 0 -1 0 4 4 3 -1 -6 1 4 1 -1 -5 0 -4 -3 6 1 -1 0 -8 -5 -2 -2 -3 6 -7 -4 13 3 9 5 12 13 -2 13 15 6 4 7 7 8 3 9 7 6 5 -3 -2 3 -3
5135 -3 2 -1 -8 1 1 -10 -9 -1 -11 9 0 0 4 -1 3 -5 -6 4 -7 2 -1 0 8 0 -8 4 3 4 -3 -2 3 0 -1 -2 3 14 4 -1 6 0 -3 -7 1 7 7 7 -1 8 7 -1 -7 5
5187 5 13 1 -3 -7 8 -2 1 10 11 3 7 11 -1 1 6 7 6 10 7 7 7 11 6 3 6 -6 8 2 3 1 6 -1 7 2 -6 1 -4 -7 -3 -5 -5 -10 -7 -9 4 -1 -11 -5 -10 -3 -4 -9 -3
5240 -3 -7 2 4 -6 8 16 11 -3 1 -10 3 -1 2 -2 -1 4 0 -6 3 0 -4 7 -11 -4 -5 -4 -13 0 -1 0 -1 2 -6 -4 -4 -3 -2 -12 6 -4 3 -1 0 6 2 7 8 10 3 11
5290 11 -2 6 2 -5 -1 6 7 -1 8 4 2 5 2 0 9 6 0 7 0 -3 -13 8 -2 3 1 0 0 -2 -4 -7 4 7 6 2 0 3 13 6 12 1 -1 11 0 10 4 9 4 12 9 -3
5340 -3 2 5 -4 -11 -4 0 -5 -15 -2 -3 1 -1 -1 -5 -7 -3 -1 2 -10 -14 12 0 4 8 1 -2 1 8 1 3 8 6 6 6 -2 -1 6 11 7 11 -1 11 3 5 2 -4 8 4 2 4 -1 -4 1
5393 1 -2 -1 -8 2 3 -3 -2 -5 -6 -8 1 5 4 5 -8 3 2 6 13 9 8 18 2 0 11 18 11 3 9 -3 0 11 -2 -4 -3 3 7 6 -1 -3 3 -1 8 -4 -8 2 0 -3 0 4
5443 4 -3 6 5 8 0 -4 14 3 1 4 13 9 2 14 7 15 11 6 11 8 9 3 8 7 -1 6 -3 6 1 2 8 -3 0 1 2 4 -8 -2 -6 -2 -7 4 -6 1 6 6 6 -2 -5 17 6 1
5495 1 3 5 4 6 15 10 0 -2 10 9 5 3 14 -1 -2 -4 -1 1 -2 5 -1 -8 -7 -9 -4 1 -8 -6 -9 -10 -12 -2 -12 -4 -6 -10 3 2 -1 2 17 5 4 2 2 4 4 -5 7 12 2
5546 2 10 11 2 -1 -8 2 -3 8 6 -10 4 -7 2 -1 -6 -1 -4 -3 2 -7 1 0 3 1 2 -6 2 -7 -9 -6 1 -3 14 8 -7 7 1 4 4 8 1 7 9 3 4 3 -1 9 0 -1 -9 -4
5598 -4 -4 -7 -6 2 -11 1 2 -2 7 -7 1 -4 0 -2 0 -3 11 10 6 2 -2 0 -3 17 6 3 9 6 4 5 10 -12 0 2 5 -3 6 6 -3 11 2 -3 1 -6 11 -2 -3 -1 7 4
5648 4 -9 -1 -1 -1 -4 2 0 0 5 1 2 -1 8 13 0 -5 -4 -2 0 5 -2 0 -4 -3 6 19 9 2 -2 -3 0 4 5 -2 -4 3 0 -2 -2 -8 4 5 -4 -7 -2 -3 -2 -1 -4 -3 0 -3 -6 3 -8
5703 -8 2 6 -1 2 10 0 5 12 -6 5 -1 -9 -2 3 3 -4 -1 9 2 4 8 -2 1 -3 -12 3 1 -6 0 2 -7 2 -3 8 -8 3 -10 -5 -2 -4 -2 3 6 -7 -6 -4 13 10
5751 10 9 -7 3 11 -2 10 8 5 1 6 2 -3 5 -2 8 -10 -2 -1 12 -8 -12 1 -6 -11 -15 -7 -2 6 -3 -1 -2 -2 -4 -1 1 4 10 4 -5 6 2 5 -8 1 8 1 10 6 5
5800 5 0 -1 3 -4 -2 8 10 -6 -7 14 7 -12 3 -4 -4 -15 -10 -9 -11 -8 4 -7 -13 -4 0 -7 -6 -3 -2 10 -1 8 10 7 2 0 10 -2 3 -2 8 4 3 4 -1 0 3 -3
5848 -3 -6 -1 1 1 -17 -9 1 -3 -7 2 -5 -2 6 -1 -10 -3 10 -1 2 8 -2 12 0 9 4 0 -1 6 9 5 -6 0 6 1 11 2 5 4 5 -4 2 0 2 3 1 -10 -6 0 -4 -11 -5
5899 -5 -1 -9 -7 4 -1 -4 -3 -5 -1 -1 0 -5 3 -2 13 14 17 -2 4 7 6 3 11 7 9 -2 2 -4 13 0 2 12 -6 8 -2 -6 7 5 -9 5 1 8 4 -1 -1 5 3 -5
5947 -5 -1 -3 8 -8 -1 3 4 6 11 8 5 11 3 8 5 11 10 17 18 10 7 10 2 2 9 -9 -2 6 5 17 3 3 -1 -2 7 3 -3 -2 1 7 1 -11 2 1 0 9 6 9 1 1 3 8 1 12
6001 12 9 16 -2 8 10 2 6 3 2 12 13 8 0 6 5 6 4 4 0 9 -2 -7 -3 -3 2 3 -1 3 1 6 9 -7 -5 6 15 6 4 2 -5 -4 2 -4 5 0 6 5 3 0 9 3 7 7 11 8
6055 8 2 -10 0 -6 -8 7 -1 7 -6 1 4 1 -3 8 -2 -6 1 0 10 -2 -5 1 0 8 -3 6 5 11 4 16 3 -3 13 9 4 -1 10 6 6 4 2 2 -1 2 8 9 -2
6102 -2 7 -7 1 3 -2 -6 7 3 -9 3 3 0 2 3 8 5 5 5 11 16 7 8 3 -2 9 -6 6 12 9 4 8 6 0 9 9 5 10 4 10 5 0 2 -4 -4 -6 1 -5 1 -9 4 7 -6
6154 -6 4 0 -2 5 16 -5 5 4 1 6 5 -2 3 -3 4 5 -8 -1 4 1 0 -1 14 5 8 3 2 2 3 -3 0 -6 1 3 3 8 1 9 9 9 -1 2 7 -1 -1 3 1 1 2 8 5 4 5 3
6208 3 0 7 14 18 15 2 8 5 -2 9 -1 2 3 11 4 6 3 0 14 -2 3 4 0 6 7 4 0 0 4 7 11 6 5 2 0 -10 -1 15 2 4 1 11 6 -5 8 3 5 4 12 -2
6258 -2 14 10 4 0 -5 0 -6 -5 -8 -3 0 0 -2 -6 1 0 -3 -8 1 3 5 7 0 3 0 -1 8 8 -3 10 1 2 14 -4 7 4 8 10 12 12 2 0 9 3 -4 0 14 5 3 3 -1 -4 5
6311 5 -1 4 -5 4 -1 -3 -1 2 2 8 -3 -2 0 6 3 7 4 1 -7 10 7 4 9 9 -2 14 0 6 8 -1 3 9 24 2 9 16 12 5 9 0 6 2 -2 -4 -1 -6 3 -4 -5 1 3 -9 -1
6364 -1 -8 -1 -6 0 -3 -3 4 7 3 1 5 4 -8 -1 -5 9 12 -1 6 9 14 -2 -3 1 9 8 7 -5 5 10 2 4 2 4 -3 0 -4 -5 -1 3 8 -7 -13 0 3 1 4 1 4 12 1 3
6416 3 3 9 -1 -3 8 7 2 6 12 3 13 1 10 4 -4 7 0 1 2 -2 -9 -4 3 2 2 -2 -5 8 -12 -7 -2 6 -6 -6 3 5 5 -3 9 4 4 -1 10 5 5 14 0 10 8
6465 8 10 5 2 8 -5 -9 7 -3 10 -8 5 -1 2 8 -5 3 -6 1 -3 0 -13 -4 -5 -5 2 6 5 3 -2 1 0 -2 -2 -8 4 5 7 -1 0 4 2 -1 3 6 11 4 -2 6 0 5 8 -8
6517 -8 2 7 -2 7 -6 0 -2 -3 -1 4 -4 -5 1 -11 -4 -4 1 -1 2 -2 9 7 -3 4 4 10 7 1 4 5 7 1 8 10 -2 -1 4 -7 5 -2 -4 -1 10 2 1 -10 4 1 -9
6566 -9 -8 1 9 1 -3 7 -1 7 -10 3 14 -7 9 -2 15 7 3 5 4 7 12 7 8 7 6 5 7 8 1 0 2 0 1 -4 3 0 3 3 11 10 4 -3 -3 -3 -9 7 -2 3 4 13 4 1
6618 1 1 7 6 9 11 7 1 9 4 7 6 13 12 16 13 4 14 5 6 -4 5 10 5 6 9 0 1 2 4 10 6 0 -1 6 6 -2 -7 -11 -1 -15 -8 -1 6 -4 1 1 13 -1 3 2 5 1 9 4
6672 4 16 5 12 8 7 2 12 12 8 11 8 12 10 3 12 6 7 8 -2 -1 1 2 7 1 -2 -4 -3 2 3 12 12 3 6 3 6 16 16 6 1 19 -4 6 2 8 10 17 3 11 6 -2 -2
6723 -2 6 4 4 4 8 13 5 -7 2 -3 3 -2 9 0 -5 5 0 2 -7 8 1 6 8 5 7 -3 12 16 13 15 2 6 20 8 4 8 12 10 7 -3 11 9 17 6 2 -3 6 -7
6771 -7 2 4 1 1 -3 1 4 -7 4 14 0 1 -1 4 0 5 14 7 12 6 9 -1 -3 9 19 17 9 14 8 7 26 10 10 12 8 18 10 11 -3 8 7 7 2 7 11 5 9 9 1
6820 1 9 0 -9 5 -7 5 -6 4 10 11 7 4 4 11 3 8 6 13 12 5 14 3 7 7 0 6 10 12 3 4 1 9 3 4 4 10 -1 3 -5 -1 -4 2 -5 -1 4 -8 -1 1 1 2 6 3 4
6873 4 9 4 2 0 -3 1 2 3 7 6 5 0 7 8 6 15 5 5 8 4 13 -3 2 -1 -2 -3 -4 -6 -3 -8 8 -5 -5 0 6 1 -4 4 -4 4 -1 9 5 -2 4 -3 0 8 2 12 3 9 -1 10
6927 10 14 -3 4 10 7 8 7 6 8 3 5 8 3 4 9 3 4 -2 -2 0 9 3 8 -2 -10 6 0 5 3 8 8 5 5 7 3 5 9 4 7 6 11 22 15 5 15 14 5 -1 13 15 10 8 7
6980 7 1 1 -1 6 -1 11 5 3 3 2 -8 -1 5 6 9 -3 2 4 8 10 12 11 8 6 5 15 10 5 -3 10 14 14 18 14 2 -1 7 17 9 3 5 5 -3 2 4 -12 8 2 1 -2 10
7031 10 21 6 11 8 11 4 12 7 6 3 10 17 23 14 13 22 9 10 6 2 10 14 5 20 4 10 6 0 5 7 2 3 -1 12 -2 8 9 2 8 -1 -5 2 4 -3 3 7 10 7 9 6 10 7
7083 7 7 10 9 14 14 4 15 17 13 8 10 8 1 4 8 11 7 -1 3 4 -4 19 13 4 -4 -6 -2 2 4 1 3 -1 -5 -3 5 20 8 3 2 13 5 6 5 9 14 -1 7 5 9 11 13 15 7 11
7137 11 9 -1 6 0 -4 2 16 9 -1 0 -7 12 6 -1 3 -7 -5 5 11 3 0 -2 13 7 1 6 10 -6 4 9 6 11 8 8 7 10 14 7 0 3 17 14 19 11 4 7 6 4 -1 1
7187 1 6 11 2 -3 9 -1 1 -7 -6 3 0 -17 -3 -3 -10 3 -1 3 -2 9 8 16 1 8 19 9 7 0 12 8 11 20 6 10 11 15 5 17 2 0 -2 4 6 4 3 -5 2
7234 2 -1 0 15 8 -1 2 13 -2 -14 4 -5 -4 -1 -1 -1 4 10 0 1 10 4 10 13 -3 -1 5 5 15 9 5 1 6 2 6 -1 -3 -7 3 -1 1 -4 -9 9 0 -8 -5 7 1 2 -3
7284 -3 -2 -2 -5 0 7 -7 -8 -4 -4 5 -6 10 1 8 7 -6 5 1 8 9 -3 0 -1 3 3 6 -10 6 2 6 0 1 1 15 -1 -4 -1 -14 -4 -14 0 -8 -2 0 -7 -6 5
7331 5 2 9 3 1 -5 13 8 -4 7 8 -1 9 6 6 5 3 0 -2 3 12 5 14 2 -3 7 -3 5 1 -2 3 3 9 -8 -1 9 7 5 0 -8 0 -5 -7 8 -8 1 8 -5 13
7379 13 8 6 2 -1 11 5 6 8 4 1 1 9 -1 5 8 3 6 1 6 -6 1 -4 7 -7 -3 1 -4 -4 -2 4 1 -1 6 -7 4 0 -1 0 -10 -3 4 3 -8 -2 5 -6 5 9 0
7428 0 10 2 2 10 0 -5 2 1 1 1 3 -2 -6 -4 2 -2 -9 -5 9 3 -6 -7 6 19 -4 3 -1 2 0 3 2 -4 3 3 -2 5 8 3 8 13 13 6 4 11 -3 10 0 4 5 1 13
7479 13 6 -2 -4 -3 -3 3 0 4 1 -1 0 -3 2 1 -4 -1 4 5 -3 3 6 13 -1 4 8 8 -4 3 6 12 -1 5 9 9 11 9 -2 2 -4 -1 -2 -1 -1 12 -3 5 4 0 2 1 -3 0 1 6
7533 6 -4 3 3 -4 3 10 9 6 -2 -9 4 2 2 0 5 -2 3 9 8 2 14 -3 3 9 13 -3 5 8 0 -2 8 6 4 6 -3 4 -3 2 0 0 5 11 2 1 -4 2 -6 8 1 3 5 8 14 1
7587 1 7 7 -4 21 8 5 14 9 9 7 10 -4 -1 0 4 6 8 7 -1 10 -4 4 -4 2 -1 -3 -12 -6 -2 -2 7 6 9 0 -3 1 11 -8 11 4 6 15 0 2 3 3 -4 6 8 0
7637 0 6 1 10 3 5 15 8 16 10 0 -8 -3 2 6 -5 -7 6 1 -9 9 3 4 3 4 2 5 -1 10 0 -1 5 6 11 -1 11 14 13 15 9 15 10 -1 6 8 12 11 10 5 17
7686 17 0 12 5 12 11 1 -5 -1 15 11 7 9 14 8 7 -3 5 3 3 -6 6 -1 3 10 12 7 13 2 5 4 3 10 10 6 4 8 10 15 8 0 4 -8 15 13 5 0 2 12 9 4
7736 4 12 2 6 9 6 0 2 8 3 9 0 17 7 7 -1 -5 10 5 8 -2 8 9 2 5 4 4 9 9 -2 4 7 17 2 1 5 16 12 9 10 2 10 10 14 2 8 8 5 -3 6 -1
7786 -1 3 13 -5 6 -1 1 4 6 0 12 3 5 6 13 24 8 1 0 10 14 3 6 1 12 11 11 6 3 2 2 12 1 -2 2 6 -2 13 5 -1 3 2 3 -10 13 -1 4
7832 4 5 2 7 9 12 2 10 10 10 3 2 3 15 7 15 7 18 10 2 5 10 6 -1 4 6 13 1 10 12 -5 12 -4 -8 6 9 15 6 0 9 1 2 2 7 0 -2 5 10 10 12 13 8 5 13
7885 13 14 6 13 -9 6 8 -2 15 4 1 7 3 6 4 -1 11 7 2 3 0 1 10 4 7 0 12 3 0 6 1 5 9 4 8 13 1 6 -3 8 5 -2 1 4 -2 -2 2 2 18 7
7934 7 3 -1 0 0 1 -3 0 -2 -7 4 3 7 -2 -4 -1 -1 -1 -3 -4 -1 6 -7 0 2 -1 -4 2 6 7 8 5 7 1 13 3 -2 14 2 5 4 11 2 7 5 2 7 -2 4 -3 -6 -1 7 5 -6
7988 -6 9 9 3 -3 -3 5 1 -3 -10 1 -12 -2 7 5 10 5 1 -1 -4 8 3 5 14 5 12 2 6 13 7 6 -1 7 -2 3 4 -3 1 6 2 1 5 0 3 -1 -4 -3 1 5 7 3 0 -11 2
8041 2 -5 2 8 4 16 -2 2 1 -7 14 13 15 8 3 17 14 15 9 20 14 -7 4 7 -4 2 3 2 4 -1 -3 -9 7 -1 -1 0 3 3 2 3 7 -5 4 8 -1 2 9 0 4 16 15
8091 15 7 3 2 8 3 5 4 0 6 7 9 1 4 15 4 -2 -10 -1 -2 1 5 2 -7 8 8 3 10 1 11 0 5 -4 -3 -11 6 1 0 -3 4 9 8 4 12 1 8 7 -3 2 6 -3 8
8142 8 8 6 4 6 -1 2 3 3 2 -14 -3 2 8 7 -1 -1 1 -9 -9 -2 -2 6 -4 -9 -5 6 6 2 8 9 -3 -2 1 -3 5 3 15 5 9 2 4 2 -2 11 4 4 7 6 -11
8191a1
##END NTUPLES=NMR FID
##END=
