##TITLE=1H_LY-DMAA.Per.2.5
 CDCl3
 8 sc, 
 8.02.2022
##JCAMPDX= 6.0         $$ Bruker NMR JCAMP-DX V2.0
##DATA TYPE= NMR FID
##DATA CLASS= NTUPLES
##ORIGIN= UXNMR, Bruker Analytische Messtechnik GmbH
##OWNER= root
$$ XWIN-NMR		Version 3.5
$$ Tue Feb  8 13:29:12 2022 Russian Standard Time (UT+4h)  she@DPX200
##.OBSERVE FREQUENCY= 200.131346
##.OBSERVE NUCLEUS= ^1H
##.DELAY= (6, 6)
##.ACQUISITION MODE= SIMULTANEOUS
##.ACQUISITION SCHEME= undefined
##.AVERAGES= 8
##.DIGITISER RES= 18
##SPECTROMETER/DATA SYSTEM= spect
##.PULSE SEQUENCE= zg30
##.SOLVENT NAME= CDCl3
##.SHIFT REFERENCE= (INTERNAL, CDCl3, 0, 15.7039)
##AUDIT TRAIL= $$ (NUMBER, WHEN, WHO, WHERE, WHAT)
$$ ##TITLE= Audit trail, XWIN-NMR		Version 3.5
$$ ##JCAMPDX= 5.01
$$ ##ORIGIN= Bruker BioSpin GmbH
$$ ##OWNER= she
$$ F:/spectra/data/she/nmr/H-F/1/audita.txt
$$ ##AUDIT TRAIL=  $$ (NUMBER, WHEN, WHO, WHERE, WHAT)
(   1,<2022-02-08 13:27:51.12 +0400>,<she>,<DPX200>,
      <created by zg, POWCHK disabled, PULCHK disabled
       configuration hash MD5:
       00 E9 B6 7A A2 85 ED C7 34 08 36 98 17 FE 4E 26
       data hash MD5: 16K
       27 29 3D A9 08 93 23 5B BC 10 2A F1 27 B7 D3 27>)
$$ ##END=
$$ 
$$ hash MD5
$$ 62 20 8E 09 A9 BB 80 96 4F B3 1F F7 0F E5 B8 80
##$RELAX= 
##$RELAX= 
##$RELAX= 
##$RELAX= 
##$RELAX= 
##$RELAX= 
$$ Bruker specific parameters
$$ --------------------------
##$DU= <F:/spectra>
##$EXPNO= 1
##$NAME= <H-F>
##$PROCNO= 1
##$TYPE= <nmr>
##$USER= <she>
##$AMP= (0..31)
100 100 100 100 100 100 100 100 100 100 100 100 100 100 100 100 100 100 
100 100 100 100 100 100 100 100 100 100 100 100 100 100 
##$AQSEQ= 0
##$AQ_mod= 1
##$AUNM= <au_zg>
##$AUTOPOS= <>
##$BF1= 200.13
##$BF2= 200.13
##$BF3= 200.13
##$BF4= 200.13
##$BF5= 200.13
##$BF6= 200.13
##$BF7= 200.13
##$BF8= 200.13
##$BYTORDA= 1
##$CFDGTYP= 0
##$CFRGTYP= 5
##$CHEMSTR= <none>
##$CNST= (0..31)
1 1 145 1 1 1 1 1 1 1 1 1 1 1 1 1 1 1 1 1 1 1 1 1 1 1 1 1 1 1 1 1 
##$CPDPRG= <>
##$CPDPRG1= <>
##$CPDPRG2= <>
##$CPDPRG3= <>
##$CPDPRG4= <mlev>
##$CPDPRG5= <mlev>
##$CPDPRG6= <mlev>
##$CPDPRG7= <mlev>
##$CPDPRG8= <mlev>
##$CPDPRGB= <>
##$CPDPRGT= <>
##$D= (0..31)
0 1.2 0 0 0 0 0 0 0 0.06 0 0.03 0 0 0 0 0.0002 0 0 0 0 0 0 0 0 0 0 0 0 
0 0 0 
##$DATE= 1644312470
##$DBL= (0..7)
120 120 120 120 120 120 120 120 
##$DBP= (0..7)
150 150 150 150 150 150 150 150 
##$DBP07= 0
##$DBPNAM0= <>
##$DBPNAM1= <>
##$DBPNAM2= <>
##$DBPNAM3= <>
##$DBPNAM4= <>
##$DBPNAM5= <>
##$DBPNAM6= <>
##$DBPNAM7= <>
##$DBPOAL= (0..7)
0.5 0.5 0.5 0.5 0.5 0.5 0.5 0.5 
##$DBPOFFS= (0..7)
0 0 0 0 0 0 0 0 
##$DE= 6
##$DECBNUC= <off>
##$DECIM= 32
##$DECNUC= <off>
##$DECSTAT= 4
##$DIGMOD= 1
##$DIGTYP= 9
##$DL= (0..7)
0 120 120 120 120 120 120 120 
##$DP= (0..7)
150 150 150 150 150 150 150 150 
##$DP07= 0
##$DPNAME0= <>
##$DPNAME1= <>
##$DPNAME2= <>
##$DPNAME3= <>
##$DPNAME4= <>
##$DPNAME5= <>
##$DPNAME6= <>
##$DPNAME7= <>
##$DPOAL= (0..7)
0.5 0.5 0.5 0.5 0.5 0.5 0.5 0.5 
##$DPOFFS= (0..7)
0 0 0 0 0 0 0 0 
##$DQDMODE= 0
##$DR= 18
##$DS= 0
##$DSLIST= <SSSSSSSSSSSSSSS>
$$ [...]
##$SUBNAM2= <"">
##$SUBNAM3= <"">
##$SUBNAM4= <"">
##$SUBNAM5= <"">
##$SUBNAM6= <"">
##$SUBNAM7= <"">
##$SUBNAM8= <"">
##$SUBNAM9= <"">
##$SW= 18.0517287032376
##$SWIBOX= (0..15)
0 0 2 0 0 0 0 0 0 0 0 0 0 0 0 0 
##$SW_h= 3612.71676300578
##$TD= 16384
##$TD0= 1
##$TE= 0
##$TE2= 300
##$TE3= 300
##$TEG= 300
##$TL= (0..7)
0 120 120 120 120 120 120 120 
##$TP= (0..7)
150 150 150 150 150 150 150 150 
##$TP07= 0
##$TPNAME0= <>
##$TPNAME1= <>
##$TPNAME2= <>
##$TPNAME3= <>
##$TPNAME4= <>
##$TPNAME5= <>
##$TPNAME6= <>
##$TPNAME7= <>
##$TPOAL= (0..7)
0.5 0.5 0.5 0.5 0.5 0.5 0.5 0.5 
##$TPOFFS= (0..7)
0 0 0 0 0 0 0 0 
##$TUNHIN= 0
##$TUNHOUT= 0
##$TUNXOUT= 0
##$USERA1= <user>
##$USERA2= <user>
##$USERA3= <user>
##$USERA4= <user>
##$USERA5= <user>
##$V9= 5
##$VALIST= <valist>
##$VCLIST= <CCCCCCCCCCCCCCC>
##$VD= 0
##$VDLIST= <DDDDDDDDDDDDDDD>
##$VPLIST= <PPPPPPPPPPPPPPP>
##$VTLIST= <TTTTTTTTTTTTTTT>
##$WBST= 1024
##$WBSW= 4
##$XGAIN= (0..3)
0 0 0 0 
##$XL= 0
##$YL= 0
##$YMAX_a= 60196
##$YMIN_a= -58217
##$ZGOPTNS= <>
##$ZL1= 120
##$ZL2= 120
##$ZL3= 120
##$ZL4= 120
##$ABSF1= 10
##$ABSF2= 0
##$ABSG= 5
##$ABSL= 3
##$ALPHA= 0
##$AQORDER= 0
##$ASSFAC= 0
##$ASSFACI= 0
##$ASSFACX= 0
##$ASSWID= 0
##$AUNMP= <proc_1d>
##$AZFE= 0.1
##$AZFW= 0.1
##$BCFW= 1
##$BC_mod= 2
##$BYTORDP= 1
##$COROFFS= 0
##$CY= 11.3945322036743
##$DATMOD= 1
##$DC= 2
##$DFILT= <>
##$DTYPP= 0
##$F1P= 2.36226072786647
##$F2P= -0.459571619588291
##$FCOR= 0.5
##$FTSIZE= 0
##$FT_mod= 4
##$GAMMA= 1
##$GB= 0.15
##$INTBC= 1
##$INTSCL= 1
##$ISEN= 128
##$LB= 0.24
##$LEV0= 0
##$LPBIN= 0
##$MAXI= 10000
##$MC2= 0
##$MEAN= 0
##$ME_mod= 0
##$MI= 1.114404
##$NCOEF= 0
##$NC_proc= 0
##$NLEV= 6
##$NOISF1= 3.799351
##$NOISF2= 2.8
##$NSP= 1
##$NTH_PI= 0
##$NZP= 0
##$OFFSET= 15.70392
##$PC= 1
##$PHC0= -15950.78
##$PHC1= 13.80078
##$PH_mod= 1
##$PKNL= yes
##$PPARMOD= 0
##$PSCAL= 0
##$PSIGN= 0
##$REVERSE= no
##$SF= 200.130013532006
##$SI= 16384
##$SIGF1= 3
##$SIGF2= 2
##$SINO= 400
##$SIOLD= 16384
##$SREGLST= <1H.CDCl3>
##$SSB= 0
##$STSI= 0
##$STSR= 0
##$SW_p= 3612.71676300578
##$SYMM= 0
##$S_DEV= 0
##$TDeff= 0
##$TDoff= 0
##$TI= <>
##$TILT= no
##$TM1= 0
##$TM2= 0
##$TOPLEV= 0
##$USERP1= <user>
##$USERP2= <user>
##$USERP3= <user>
##$USERP4= <user>
##$USERP5= <user>
##$WDW= 1
##$XDIM= 8192
##$YMAX_p= 0
##$YMIN_p= 0
$$ End of Bruker specific parameters
$$ ---------------------------------
##NTUPLES= NMR FID
##VAR_NAME=  TIME,          FID/REAL,        FID/IMAG
##SYMBOL=    X,             R,               I
##VAR_TYPE=  INDEPENDENT,   DEPENDENT,       DEPENDENT
##VAR_FORM=  AFFN,          ASDF,            ASDF
##VAR_DIM=   8192,          8192,            8192
##UNITS=     SECONDS,       ARBITRARY UNITS, ARBITRARY UNITS
##FACTOR=    0.0002768,     1,               1
##FIRST=     0,             0,               0
##LAST=      2.2672688,     0,               0
##MIN=       0,             -58217,          0
##MAX=       2.2672688,     60196,           0
$$ Real data points
##PAGE= N=1
##DATA TABLE= (X++(R..R)), XYDATA
$$ [...]
82A3919J4194l4512l4250L8334N0376l6805o1256L1050O5136k2160o1866J2064
94b5776N1626k278l6067n574J6898J0856L542j2867k3011J1798L9375q190n0860
107c0528L225N6527K012n6092o385M9936Q921l9130r058K5213O631j0047k157
120i32m701l729J7529R984k7363j5505L3453J9339l5745k0714L4646J9343l0756
133e151j5319K5055R150j8384j585J1614o216n347J3344j28j8905M693K2207q427
147F601k2982J1449K1170j3984j7270J6127J1822j7899n696J9200l88j9801N735
160e916J9373r750j7593J2228J4321j3149r433J2771L203j1418L975R654j1442
173c176p940J8454O532k4125n602K7682N040k8589m728K6550M237k1706l270J4463
$$ y = [13919, 28113, -6399, -40649, -2315, 48061, 11256, -50000, -18950, 46186, 24026, -37840, -25776, 25850, 23572, -12495, -18069, -1171, 9685, 13227, 360, -22651, -10853, 28522, 20332, -30528, -27303, 29224, 31236, -24856, -31241, 18695, 27616, -11514, -20572, 4641, 11272, 1225, -932, -5633, -9362, 8167, 18151, -9212, -24717, 8736, 28075, -7670, -28384, 6262, 25605, -5151, -20470, 4585, 13735, -4649, -6234, 5380, -836, -6183, 7161, 7033, -11872, -7179, 15028, 6601, -16381, -4932, 16238, 2254, -15016, 1111, 12933, -4966, -10662, 8538, 8150, -11651, -5916, 13457, 3707, -13886, -1658, 12663, -486, -9919, 2852, 6055, -5363, -1388, 8266, -3176, -11116, 7338, 13870, -10255, -15857, 11825, 16865, -11724, -16452, 10098, 14335, -7371, -10641, 3822]
187C822J519n699J138l600m660J2405Q861j9705j3177K4653J7063k6645j9842
200b3867K5623K0929k1704j9875J5545J6474p982j0825lL365P332N164j3197j3940
214a6961J6886K1843j8072k7908J6735L1252j3308l1305Q450K7904k941k1316
226h741k233J2222O362j600q851r300R471J9258q207k7101N403L1940j648l3272
240a6297k351L0966N851k5443q231J7317R056p706q121k316N519J1626j651j9178
254a0959k978K4279P663k6455j1641K5712J4296k2247j5166J6736J4035r928j0916
267g569K691O212M016m13r613n730J3505J1386j5454j5894J5472J8582j3869j9126
281a5804J1079J7445p646j3746M137Q541r91k459j434l681K958R291l651j3645
$$ y = [3822, 5341, -358, 780, -2820, -7480, 4925, 13786, -5919, -19096, 5557, 22620, -4025, -23867, 1756, 22685, 981, -18894, -3349, 13125, 5143, -5682, -5685, -2320, 5012, 10176, -3021, -16961, -75, 21768, 3696, -24212, -7477, 23775, 10467, -20838, -12388, 15516, 12575, -8741, -10974, 1248, 7610, 6010, -2841, -12141, -2670, 16588, 8381, -18720, -13317, 18623, 16975, -16297, -18648, 12318, 18169, -7274, -15505, 1812, 10868, 3162, -4959, -7275, -1756, 9870, 8219, -10959, -13937, 10342, 18005, -8450, -20091, 5621, 19917, -2330, -17496, -760, 13275, 3347, -7569, -4878, 1334, 5350, 4937, -4676, -10406, 3099, 14485, -969, -16863, -1391, 17191, 3322, -15804, -4725, 12720, 5074, -8672, -4535, 4006, 3015, 556, -878, -4559, -1601, 7690, 4039, -9606]
295i606L664J6389l271j7250K722J6257k258j3727K107R986k325n669K889J165
309A073l674L004M357o369m873Q784M937j0122m385J0479L183r936j354Q765q47
324C022p200L244N479n459l758P206K163q248o85Q347p08p497J997N812l350l474
340c109M743P09o080K021P289m376q275O086Q832o962q730O940P895o089o208
355e314M616L782k739p10P79k749J003O157k276r237K910J1590k912j2903K292
370e711J2912j263j1595R1Q968J017n373j752J102J939L350j470p419M08J0753
385E957J064j2847k705J3539M238j2727n339J0543N733p281n315L342M052P66
399C020k021m582n51P612L322r652n934J0452Q008j0018r249Q502R434o113q495
$$ y = [-9606, -5942, 10447, 7176, -10074, -7352, 8905, 6647, -7080, -4973, 5013, 2688, -2981, -92, 1073, -2601, 403, 4760, -1609, -6482, 2302, 7239, -2883, -7268, 3211, 6394, -3542, -4896, 3869, 3022, -4178, -934, 4545, -914, -4672, 2534, 4697, -3551, -4236, 4111, 3403, -4094, -2097, 3715, 365, -3109, 1634, 2343, -3737, -1716, 5573, 1197, -7078, -992, 7840, 878, -7852, -912, 6983, 894, -5314, -698, 3084, 345, -365, 414, -2335, -1332, 4825, 2549, -6688, -3778, 7812, 4900, -8003, -5711, 7201, 5938, -5657, -5566, 3402, 4419, -954, -2706, -1604, 335, 3685, 2215, -5204, -4796, 5957, 7021, -5826, -8531, 5008, 9246, -3481, -8820, 1723, 7456, 175, -5140, -1798, 2254, 3020, 999, -3583, -4134, 3478, 6800, -2852, -8786, 1666, 9674, -344, -9593, -1091, 8343, 2230, -6265]
414f265L283O543l60l709k298L89M337L085n544o303N914Q840n466j0410M326
429c638J0826k805j0038J100Q149M34n406j672K170K328J270k424m410K000O930
444D814j165q583J77R238Q09q861j545P583J936n625j907L262J406p14n60j650
460a385n39L577J665m967k611N657L266n747l506N269L294m384k632L250J574
475A781j984k87Q09j070K28K311j020l248J560L810j868l899J997L550k051k805
491b186K045J750k046n84K046n81k035J567J983k303j814K683J514k726j027K478
507G64L61j986M89J350j373o94K258J09l006L51L520o23l726P08L543o71l011
524a637N49K089l95r36L03l87l01J699L99k828o16L658R39m103j238M093J489
$$ y = [-6265, -2982, 3561, 3201, -508, -2806, -2417, 1920, 5005, -539, -6842, -928, 7912, 2446, -7964, -3638, 7188, 4383, -5655, -4555, 3594, 4028, -1378, -3050, -880, 1448, 2718, 294, -4116, -2116, 4814, 3649, -4934, -4757, 4481, 5290, -3571, -5116, 2467, 4403, -1222, -3129, 133, 1539, 825, 265, -1385, -1924, 1653, 3318, -1649, -4260, 1397, 4663, -1084, -4590, 679, 3973, -411, -3043, 207, 1781, -203, -490, 319, -751, -523, 1788, 768, -2480, -920, 2890, 1022, -2877, -880, 2670, 619, -2186, -141, 1609, -437, -1021, 1025, 444, -1591, -24, 1959, -344, -2158, 525, 2039, -687, -1714, 764, 1125, -861, -372, 978, -395, -1089, 1169, 1278, -1728, -1377, 2143, 1520, -2206, -1498, 2045, 1374, -1637, -1088, 1001, 606, -330, -27, -414, -715, 984, 1383, -1445, -2061, 1597, 2536, -1567, -2805, 1288, 2777]
541B777l615j593K767J501j598j184L04O27R89J06k115r53K926J783l382k500
557c160L411K957l046l133K356K930j445k361M20J515N35m16j342p50J926J887
573B284k190k829K156L492j844l765J331L610o77l081J8K198N46j076r88j42J189
590B32J320j184k339R75L067o16l435J78L420K51l038n79K342Q15j437q51M30
607d49P33N68m66j434J14K062K87k449o57K534R21k365j040J946J007j372q34
624h94P04N09m0j06n32l16R78P36j280j035J415J220j373j247J230J112r80q48
642g47O95M65m02m6J48l98N6P56k19j002L11J119l71j101L85R57m16o87M38L63
662C04m56j2M99l01n29N61N64p43n19P99M41p38l23O05J49m23Q1J99l58J9O05
$$ y = [2777, -838, -2431, 336, 1837, 239, -945, -641, -14, 975, 1081, -1034, -1987, 939, 2722, -660, -3160, 251, 3208, 162, -2971, -615, 2315, 870, -1491, -1071, 444, 979, 563, -779, -1529, 397, 2284, 94, -2735, -579, 2913, 1069, -2696, -1365, 2245, 1568, -1513, -1495, 703, 1249, 173, -815, -957, 232, 1552, 368, -1971, -996, 2071, 1455, -1980, -1802, 1618, 1869, -1169, -1748, 594, 1409, -28, -879, -449, 284, 852, 386, -1048, -934, 1128, 1415, -1034, -1691, 843, 1764, -601, -1641, 305, 1312, -60, -894, -190, 319, 279, 173, -359, -675, 303, 1039, -241, -1276, 139, 1359, -14, -1261, -31, 1081, 101, -747, -52, 413, 11, -35, 113, -285, -229, 527, 308, -694, -383, 736, 365, -736, -351, 606, 190, -497, -59, 304, -152, -164, 335, 34, -495, 66, 630, -113, -632, 167, 608, -130, -453, 152, 301, -122, -41, 158, -200, -181, 424]
683D24k15q35L44R85m18j041M03R94l27q37K24N76p8k50k5j18J21N18j81q48J83
704d01J130j56j261O6J267J8j144j32Q84K13n33k56J03K48L14j98o97Q4J025O5
724F39j247j83J296L50j252m29J044M95p38m64L56L83O8k55m61N1Q04J46j048
743d45l74J182N49j199o56J066P06q38o79N42N54j86l46j69J10M77J72p17m16
762f67Q70O41r19q09Q83Q65p46q47N62O98l26m92Q8K06J36P6l22l66M59O10n40
783F0p94N67Q86n32q79M70P98l72o11K54L87j37j08M3j83M7M48j27o51J55P86
804E07j97q43K43P86k67o89K81N06k90k91L05O1k97J47L02l52k37M94J78n77r0
825c20O20k6n87J40N26k64m32L94L03n08j62N47M3n71Q7N12j88m16K68K66l52
$$ y = [424, 209, -626, -282, 703, 285, -756, -353, 641, 314, -523, -299, 277, 199, -51, -76, -194, -73, 445, 264, -584, -401, 729, 573, -688, -622, 645, 663, -481, -613, 271, 484, -49, -305, -202, 46, 360, 162, -535, -451, 574, 639, -608, -791, 505, 855, -397, -826, 218, 713, -25, -489, -133, 250, 318, 63, -398, -347, 457, 603, -445, -819, 363, 912, -287, -943, 123, 829, -9, -688, -146, 408, 222, -124, -293, -183, 294, 466, -251, -667, 203, 844, -75, -884, -1, 864, 118, -729, -167, 531, 205, -287, -199, 7, 143, 219, -103, -469, -10, 600, 60, -734, -167, 719, 187, -692, -222, 576, 204, -407, -153, 234, 97, -11, 32, -151, -104, 344, 217, -434, -279, 507, 310, -533, -290, 496, 229, -460, -179, 327, 37, -254, 51, 112, -185, -38, 264, -88, -325, 169, 347, -230, -320, 300, 274, -313, -173, 353, 89, -343, 51, 354, -154, -316, 231, 274, -297, -210, 302, 114, -302, -34, 232, -120]
846a20o8M09j47m51L63M75n47m55O68M65p60l90P35L33o57k17M90Q9k84O8N0k76
868b27J95M58m23o30N90P68p03q48P41Q44o70p75N42O26l67l88J59R8O3K36k57
889C2n64M13Q62m89j118N13J258m75j275L82J164k57r39J00N85N2j67j68k85K20
909a56P34k31j113J99J390j10j538PJ534J09j364j80J058K25o21k37J53J58L45
928C62n9q09j08J177K89j440m40J512N67j454o40J250O47r53n18N33L47r1r5l06
948b29k09O92N17r76p80J147R79j195j101J138J080r62r44P07O96m25l71J49m1
967a28J00M52l28q24N03J103n94j273O19J333o05j233N46J035m76p17L91L52l32
986g6O9K65m60k01P87J40j032r5J190j1j213J03J127k07r74L39P50m68m68N90
$$ y = [-120, -188, 221, 74, -377, -14, 461, -86, -541, 127, 592, -168, -558, 177, 510, -147, -364, 126, 215, -69, -1, 49, -227, -32, 426, 3, -627, -37, 731, 28, -820, -79, 765, 95, -680, -138, 488, 121, -267, -108, -10, 53, 289, 32, -532, -119, 743, 254, -864, -351, 907, 432, -843, -461, 703, 446, -493, -393, 192, 244, 77, -91, -376, -156, 578, 347, -766, -567, 823, 713, -825, -818, 716, 825, -539, -719, 339, 564, -57, -294, -141, 17, 362, 303, -506, -614, 563, 852, -588, -1028, 484, 1051, -403, -1043, 207, 854, -99, -617, -84, 263, 172, 77, -229, -438, 254, 771, -205, -985, 162, 1141, -54, -1155, -17, 1063, 101, -843, -136, 560, 135, -236, -87, -128, -28, 424, 96, -728, -225, 878, 284, -989, -370, 963, 358, -875, -329, 706, 230, -487, -96, 256, -76, -7, 258, -202, -403, 384, 524, -508, -603, 587, 576, -637, -534, 593, 386, -588, -249, 501, 33, -435, 155]
1006A55J70o57J08P10l80o71N90N69p33m07Q44J90r04N3R14l28q68N69P72p73
1026g7o48Q74N14r19l14Q44R4p11J69M88m17k42P11l4r36K73J149m63j286N89
1046c42J328o34j237O03J034n20p35L78L30k38J34J03o40J2J085n8j476P8J707
1065I12l0j803k3J705R9j432j47J008J76m78j05j09l6P21K10j227m22J600O38
1084A257j805q46J830R38j635r68J294Q46q16o19K78K74K58J51p33o07J112J029
1102A238j311j392J371J624j256j700J032J581p12j296L49Q54J0k96k99l30N06
1119b7R31o25j443O12J814n16j982L34J970j71j711KJ294J13p38j47J12J12N08
1138D42Nj053j41J451K95j677m65J749N48j643n41J362M64r95k99N44O5r4K07
$$ y = [155, 325, -332, -224, 486, 106, -565, 25, 594, -139, -546, 298, 488, -416, -363, 551, 223, -645, -76, 696, -77, -725, 149, 663, -256, -570, 274, 368, -343, -174, 314, -103, -345, 366, 332, -604, -331, 818, 355, -931, -342, 986, 352, -885, -282, 752, 232, -503, -125, 205, -33, 101, 204, -436, -424, 661, 603, -873, -795, 912, 882, -921, -944, 761, 860, -572, -719, 289, 465, -13, -118, -227, -263, 458, 668, -559, -981, 619, 1257, -548, -1394, 436, 1374, -261, -1229, 65, 911, 95, -524, -246, 28, 286, 437, -296, -903, 209, 1238, -73, -1465, -94, 1530, 274, -1426, -394, 1187, 475, -821, -472, 382, 392, 96, -203, -533, -27, 904, 279, -1164, -552, 1262, 746, -1236, -902, 1068, 897, -814, -812, 482, 595, -143, -290, -178, -66, 442, 447, -606, -747, 704, 999, -678, -1143, 606, 1154, -489, -1030, 332, 796, -199, -498, 46, 111, 17, 224]
1157B24l07n08O57P69q87r62J018J054j039j021R82Q81q42o38O82K98m97O2L40
1176B66m25k02P37P6r82L7J102j37j106K27R91l42p79M50N15n66k25O98o5p78
1196e08L09Q17m89p90O04O98o52n04O23K65n81M7N07l81m21O73L52r33k96J091
1216D31K64j165k32J110J82r45r1O62pl11J47o8l23M29N33p28p18R32Q75j015
1236c8r71R87R69q32q75O00O51l23l53L5j7K17M31m13q39N30J176n58j392N00
1256e15J472l58j408K01J164J3q20j57L63K34J44k49o29J81J049o8j337j16J504
1275F68K83j499m32J308N39j003n52N88M66j19k94l14M1O97K45r73n19J116P67
1294A013j117r30R93R87p62r18M76P34j87m31j10P0L28K99m77o51N44R24n04j123
$$ y = [224, -83, -591, 66, 835, -52, -1014, 4, 1058, 19, -1002, -20, 861, 19, -619, 63, 361, -136, -74, 266, -159, -361, 376, 452, -530, -493, 609, 472, -634, -407, 584, 242, -537, -87, 428, -138, -363, 335, 270, -508, -199, 618, 129, -661, -57, 641, -11, -515, 108, 373, -208, -161, 346, -35, -456, 217, 569, -364, -660, 431, 695, -470, -702, 408, 590, -355, -446, 216, 209, -102, 45, -23, -346, 83, 616, -112, -830, 102, 977, -38, -1009, -22, 947, 115, -760, -160, 491, 168, -185, -150, -167, 50, 481, 68, -771, -241, 935, 377, -1015, -515, 957, 599, -809, -608, 556, 569, -251, -408, -45, 189, 333, 84, -545, -364, 685, 617, -720, -836, 668, 951, -548, -980, 328, 867, -136, -688, -100, 366, 247, -47, -361, -320, 377, 622, -351, -870, 246, 1013, -104, -1034, -41, 946, 184, -734, -258, 476, 289, -142, -252, -182, 146, 445, -32, -683, -139, 785, 281, -842]
1314h42M21J168l03j070J50Q75j3n72p6K29J17J37j00m64L3P28N5q88j54R47K32
1335F10r04k79P46K79n33k22L03P6m3P6j61k54L33M04m39n23M70N80m40n63L96
1356h8M58k86l21K03J16j22J04Q4l26n5M78N6n78o8O06P8n61q6M58M8k76j9J09
1379A2p1P3J79k24k81L39L73l84m48L82M81l15m55K19L55j11k11nN1P7J54j39
1401E1l51J51M83r7o12N6O16M4n81j06M58J67k78j92R2J67J21j00l10J2M53J02
1423C46n36k22N53L16m97l74L71L80k07l64M5K53J33j34k59k9L35K03l78l37L58
1444d4M46k67m93J60M68k6m00p9K76J73j11k34n6K36K22k11l48J44M07l9m43n7
1466b76L97J40l08k05J95K30n2k23p4J66K02r1k68j1L04J03k90j88K53K29j77
$$ y = [-842, -421, 747, 444, -626, -476, 399, 386, -186, -262, -33, 84, 221, 121, -343, -310, 418, 473, -415, -569, 378, 610, -294, -573, 173, 452, -81, -303, 0, 76, 33, 109, -52, -306, 27, 431, -8, -531, -61, 519, 79, -484, -88, 370, 84, -237, -34, 82, -40, 64, 148, -178, -233, 245, 301, -277, -345, 261, 339, -222, -308, 150, 198, -78, -97, 12, -59, 14, 193, -31, -312, 27, 400, 16, -432, -50, 431, 116, -339, -120, 235, 124, -87, -92, -41, 36, 190, 51, -300, -149, 334, 237, -375, -319, 297, 341, -240, -346, 112, 279, 1, -191, -99, 68, 189, 89, -221, -209, 244, 346, -190, -412, 141, 457, -40, -414, -43, 337, 130, -234, -189, 64, 197, 63, -196, -225, 110, 313, -65, -402, -44, 402, 135, -358, -198, 270, 244, -156, -235, 41, 214, 103, -131, -187, 49, 271, 60, -288, -144, 263, 224, -219, -276, 121, 261, -47, -252, -57, 173, 121, -102, -176, -10, 192, 101, -167, -178, 126, 229, -61, -249, 4, 233, 56]
1487E6k20N7K14L7j66j19P9J91qk17p8J99J58j52k06Q5K07Oj80p8J50R7n0j64
1511a02j1J80Q4j57j42J14J65l6j83l0J49R3j05j34L5J57M6j61j34J60J57r2k07
1534a54M6K04J7j68o4J23R0l6j20m2J26J25r6k01O6K37j3k55k3K23N9j72r7R9
1558b6J16m6p1o3N1J29k2j88k9K35P5k33j06K10J39j79j38J43J16p0r3J8L6N8
1582F2J3j20p7J54J30j59j84J81J79j66j85J41J66j04j35P9P5m6Jk0l9L9J03m4
1606D4j86R6K14j03k26R5K29r5k14R6J71q2j20P4M4m6J3L3r1j6J51Lk02J3K55
1631A50l4k64L7K58m2k41N5K05o2j23O1L1o5L8P2j17p7J97O9k49p3K85N1k82l7
1656a57K62J4k14J1J62l8q7O2K8j04M8J38j30j55J93J60k16j64K30J50k34j10
$$ y = [56, -164, -107, 107, 144, -22, -141, -62, 129, 121, -96, -174, 25, 183, 31, -175, -90, 117, 123, -57, -135, 15, 112, 62, -102, -113, 67, 151, -6, -148, -34, 131, 95, -88, -118, 31, 124, 19, -115, -80, 77, 123, -38, -172, -12, 145, 53, -154, -108, 96, 113, -55, -119, 4, 94, 58, -62, -104, 22, 147, 51, -150, -84, 153, 140, -115, -138, 85, 144, -28, -125, -26, 90, 44, -27, -90, -39, 90, 68, -120, -149, 86, 161, -72, -178, 32, 171, -8, -146, -3, 113, 43, -50, -32, 4, 62, 75, -45, -122, 32, 162, 3, -181, 0, 179, 13, -172, -31, 135, 31, -104, -25, 50, 4, 5, -15, -54, -15, 88, 44, -142, -46, 168, 65, -161, -66, 163, 68, -146, -50, 121, 39, -81, -7, 37, -9, 4, 37, -54, -70, 81, 84, -118, -105, 150, 116, -148, -111, 147, 105, -136, -81, 124, 62, -61, 0, 31, -34, 4, 76, -41, -118, 79, 148, -101, -174, 111, 162, -120, -157, 105, 119, -95, -84, 78, 40, -47, 15, 43, -61, -13, 125, -5, -160, 33, 193, -23, -187, 43, 193, -41, -151]
1678a51K07P3j96pJ32m5q3J03M2j68JK12n9k27J09K16j31j99J65J56j74j18K04
1701F2M5j87K2J73p3j66J40J22j77p9J93K9j97K8J91j03j62J54J37k04j11K43
1723H0P0k71j3K55j2k23M2J74p3r9R4L0j21M9J60j33j98K14K14k71k19K99J94
1746B42k65j80K14J30j65n7P9mlR4o6j87J39K75j90l37K00L69j85l66J49L47j11
1769A22k76O6J40Rj7m3j16M8K46n0l62L8M35j1m73j9M52O5l86q0K76J01j50p1
1793e6qL2J55K1k80r1L87J40m17j96M19K32l85k48K94K20j93j61P0P3O7J4j62
1816g3j28K30K44k81l06K64L88k48l93K04L45j27k67O3J46Nk1m4j11O8K36q6l21
1839b13M9L94m5m06L1L67ll15oK28kj05J3k5l4J26Q5k18j14K70J44k88j59K90
$$ y = [-151, 56, 129, -67, -74, 58, 13, -70, 33, 75, -93, -92, 120, 61, -166, -57, 159, 28, -171, -6, 150, -24, -142, 62, 107, -80, -58, 115, 42, -124, 16, 138, -39, -118, 75, 104, -93, -65, 126, 23, -139, 15, 152, -52, -163, 80, 150, -121, -134, 121, 109, -114, -72, 102, 29, -70, 24, 54, -67, -18, 142, 9, -189, 25, 239, -32, -251, 48, 242, -23, -203, 11, 141, -24, -81, -2, -6, -9, 85, 19, -168, -29, 246, 56, -281, -81, 288, 103, -263, -114, 233, 122, -154, -88, 52, 61, 44, 1, -115, -67, 179, 129, -233, -195, 240, 229, -244, -263, 189, 254, -132, -212, 64, 165, 15, -56, -64, -32, 123, 144, -136, -227, 160, 300, -117, -313, 106, 338, -47, -295, -1, 219, 26, -135, -65, 8, 75, 89, -73, -201, 29, 273, -8, -314, -50, 338, 90, -303, -99, 246, 119, -148, -85, 61, 66, 45, 1, -110, -42, 194, 108, -213, -164, 230, 185, -221, -190, 177, 174, -141, -147, 81, 79, -26, -13, -38, -72, 54, 139, -79, -193, 77, 221, -67, -226, 64]
1863F4J54k58j18K01M7j29J5O7q8kJ60n3k15P7K57j01k58J01K37q9j88R1R6p8
1887a0k6J05q1j06J67J12k24j31K49J47k56j34K26J06j72o3Q8J7l0P1m3j41J10
1910a9K01j44k65J63K94j33l18J21K74p8j94L2R9J1J2m0j27M5K43m9l29jL96K9
1934B23l98p7L60Q6k67j06J65J07m4p1j07L7K33K6l07j11L61J87l72k36L42K63
1956B94k72k54J57K21n0j33o0M2J48P2k33j72K52K80k64l47K29L68j58l70R6K99
1978A45j3j89o2Q0R2N9j01k02J10L16r9l70M9M01Ol96k6L16O5k29q5J09Q0J4n6
2003A4j14JK13N4k90r9L23J41l17j56K62J69j89j37J10Q7l3j3m8n9R5J41j47k01
2027a93J54K46j59k50J35K24r5j73O0J10m9j3L4p4j7J54K6k25k1K46M0k44m3K06
$$ y = [64, 218, -40, -158, 43, 90, -39, -24, 43, -45, -47, 113, 60, -155, -78, 179, 78, -180, -79, 158, 69, -119, -28, 68, -10, -36, 69, -12, -118, 49, 161, -63, -194, 55, 202, -54, -188, 38, 144, -28, -91, -3, 14, -16, 55, 12, -129, -19, 182, 38, -227, -64, 230, 97, -221, -100, 174, 96, -98, -66, 33, 44, 56, 16, -111, -66, 177, 128, -201, -202, 194, 223, -175, -252, 108, 194, -73, -179, -14, 93, 49, -22, -129, -92, 141, 167, -140, -251, 110, 297, -75, -311, 31, 294, 22, -232, -75, 146, 96, -37, -97, -55, 93, 165, -68, -240, 12, 292, 28, -319, -90, 278, 120, -250, -154, 145, 132, -57, -119, -39, 53, 112, 11, -191, -81, 235, 136, -234, -185, 216, 222, -174, -200, 116, 181, -48, -133, -24, 56, 70, 14, -100, -99, 114, 168, -122, -221, 102, 243, -74, -230, 32, 201, 12, -125, -15, 72, 39, 26, -22, -81, 14, 155, 8, -193, -39, 207, 48, -202, -67, 157, 62, -111, -51, 59, 10, -3, 31, -43, -60, 94, 120, -105, -126, 120, 160, -84, -127, 79]
2051G9L9j66j6J06k6k3O3n3j08J01J49j45j83J61J98j51k00J28J71q8j13N6M7
2074B6l1N3lj50L8K23l6k74K5K92j1k90pK43N2j89m3Q4L4K0j3j33k4K21O8k72
2100i7j23L03J50l02j70K70J81k02j46P9J24Lm6q9l5J50J36k13k13K43K69k20
2122E2l22J88L17j17k98N9K28J4j31o4KJ02J24j17k29J10L02o2l79L3L81Ql44
2145a43m9K78P2j75p9M7P7P2m5j86nK75N0l37r9L61J31l11j72K68J70j83j40Q8
2169c5R7j0j2r3n4J64J28k14j89K30K42k13k73J81K50j43k06Q4J43m4m1j6n1M4
2193c1J47n7k18M6K85m1k94L3K66Mk43RJ74j6q2K2j1m6R0P5j52j04J98J19k20
2218d7j26K18J14j85j00J35O0r1J6L7q2J2J40l3k04N1K37n6k38N2K30o4j71N7
$$ y = [79, 118, -48, -64, 42, 16, -7, 56, 3, -105, -4, 145, 0, -183, -22, 176, 25, -175, -47, 124, 36, -77, -21, 26, -5, 48, 45, -105, -67, 156, 120, -154, -129, 163, 152, -138, -145, 98, 150, -39, -82, 2, 36, 56, 43, -90, -114, 107, 175, -97, -220, 83, 233, -69, -239, 31, 212, 10, -136, -57, 67, 70, 24, -65, -100, 50, 186, -27, -240, 3, 272, 52, -270, -82, 235, 118, -180, -121, 107, 121, -10, -74, -72, 30, 154, 37, -192, -82, 220, 158, -221, -188, 193, 201, -143, -192, 86, 158, -17, -96, -49, 28, 100, 55, -131, -136, 139, 189, -148, -247, 114, 245, -66, -238, 30, 200, 17, -123, -35, 62, 52, 40, -53, -107, 57, 185, -29, -218, 12, 254, 41, -232, -51, 199, 56, -150, -66, 77, 33, -8, -24, -75, -31, 116, 59, -159, -113, 172, 131, -163, -130, 136, 140, -103, -94, 80, 64, -18, 4, -7, -53, 37, 112, -40, -144, 54, 173, -47, -173, 45, 159, -26, -126, 9, 69, -22, -6, 31, -51, -39, 101, 68, -136, -85, 152, 96, -142, -90, 140, 76, -95, -38]
2242c8J00m2k3M3o1o3J39Q3k10r3K38J22k59j22K37J16j89q7J03N7m7J2l1o9R1
2267GJ48j51k07J70K56j76k69J44K68j02k34O2J65op8m5l1O8J50p7k39N5L19l0
2291A67l51NL48L4l15o6K45R1j38q2PO0J06j3k19l1K74J03l27j58L21K12l03k14
2315b44K35K01j35j70L8J00O5j8j43p8J95J74k19k55K20L09j97l19J41L11p6k59
2337a24J0J43O3n5p9o6Q2J94q6k82P4L22j2l63j3L23N3k77o5J83P0p5n7k6K0J29
2363H6K5k01p8K47J26k65j69K60J79k21j53J31J44q0o4J8k2N4Q1q8j55R9K18r8
2387G4k61J02K50p5k25N1J71k5j05K3LpQ0Oj57l4K12P4k44q8K33J09k08q6J52
2412B5N8p5k6J0k7N3Q7j12j34J25K10j42k31J23K29r7j93N4J46k9p5j5k5M7J14
$$ y = [-38, 62, 20, -3, 40, -21, -84, 55, 138, -72, -165, 73, 195, -64, -186, 51, 167, -22, -109, -6, 51, 4, 16, -15, -84, 7, 155, 4, -203, -33, 223, 47, -222, -78, 190, 88, -146, -84, 81, 75, -3, -48, -79, -11, 139, 62, -177, -122, 197, 167, -184, -179, 169, 203, -112, -178, 67, 158, 20, -62, -55, 5, 111, 98, -121, -152, 122, 225, -102, -260, 61, 273, -30, -244, -9, 192, 57, -113, -75, 25, 90, 72, -71, -149, 46, 220, 1, -254, -34, 275, 78, -241, -100, 211, 135, -124, -114, 29, 92, 37, -42, -108, -26, 168, 82, -200, -126, 196, 184, -179, -192, 131, 184, -93, -158, 25, 95, 20, -37, -63, -43, 86, 111, -90, -168, 79, 205, -60, -229, 31, 210, -11, -164, -33, 111, 31, -33, -15, -37, 17, 98, 10, -145, -46, 172, 74, -187, -85, 165, 90, -135, -84, 87, 62, -43, -20, -17, -24, 56, 62, -95, -129, 83, 157, -87, -175, 58, 167, -41, -127, 25, 83, 8, -18, -8, -35, 18, 105, -7, -141, -16, 194, 52, -179, -56, 173, 76, -117, -63, 83, 54, -21, -36, -61, -14, 100]
2437A00m5j87K2K61nk94k7K89N6k49p6J82R0r6p5oN2R7Mj74o5K25J40k65j80K53
2463B7K03k13k14J37K08o9j45l4R2Q7Oj32j27J68K11j65k66J34L05q4l19M2K78
2486A30J7k00p8J13R9Qj07j16Q5K23o1k88RL23M7l22r7K84J24k10j33R7J39Or2
2511@j04K3J95L0k29j10K48J78k41k20K00K35j34k22O0J63J9r8o4nJ15R9j45j64
2535a71J28K25r9k68O9K62j0k23l1J61O1q4p7LO0R8m9j71J7K12M4k48q2K31J13
2560A71j96j20J32J09n9q3j2K9P3L6j08j07J42J55j46j90J27J88o5j80L6J43k
2583G3p5l8J1N1P8o6j42M1J96j9k13k9K17M2j71q5J30P9n2o1l0L4R6Qj54n1J83
2610E3J15k00j43J81J67j34j79Q1J51qj11o5N0R1M3j19j11J34J67j18k20Q1K44
$$ y = [100, 55, -132, -110, 151, 146, -148, -175, 114, 170, -79, -155, 27, 117, 21, -54, -60, -8, 89, 93, -81, -146, 79, 219, -46, -226, 27, 230, 17, -197, -60, 148, 79, -66, -100, -8, 79, 85, -47, -174, -6, 205, 40, -226, -92, 213, 129, -190, -148, 130, 147, -53, -131, -18, 81, 89, -18, -134, -49, 174, 113, -175, -166, 157, 204, -118, -215, 69, 193, -17, -150, -53, 86, 92, 0, -104, -81, 114, 144, -85, -195, 53, 231, -10, -230, -30, 205, 71, -151, -91, 72, 91, -7, -71, -76, 39, 138, -7, -171, -43, 182, 83, -185, -116, 146, 136, -87, -118, 43, 104, 20, -57, -54, 6, 104, 55, -116, -99, 113, 157, -91, -173, 58, 171, -25, -145, -13, 96, 37, -46, -58, -29, 44, 80, -28, -135, 7, 162, 16, -174, -47, 141, 76, -104, -68, 75, 73, -2, -40, -29, 22, 100, 34, -108, -67, 129, 110, -103, -132, 85, 127, -44, -129, 1, 80, 28, -33, -63, -29, 67, 75, -79, -130, 53, 168, -32, -175, 6, 173, 39, -140, -59, 92, 84, -27, -92, -42, 49, 92, -27, -138, -4, 163, 45, -175, -94, 150]
2633A50k7k41nJ82O4j19j04M1J14M2q8j32O7K00k9k40k6K47P2k23j14J65J45j08
2657C3j26J0J12P3q1j20LJ62P4j94j23J96J70j67j96J06K11n4j65k2J18P1m5j12
2681f6m0J27J20j29j69Q1K25n0k34J2K15K7j84n5J15Q3l6q7n0Q2J19m3j67jJ94
2706H9M3j98q6J88J05j38j13Q7J03k4p9m2K8Q9K5j22r1J40J30j32j60J02J72o1
2730E5j57J9J24J6n3n6mP1P1o9j26M8J70j4j90j3J66M6j40n4R6O2l1p1j7L0P7
2757E6Lj29l5J55P3j52j12J49J08r7j26O1J06no9l6J4Q5L4j13q7R7J44q4j80O0
2783h0J80k4j52j8J26O4p9p3%P6O5n9j26M1J65j1j90l2J98O1j64j01J27R3m7j08
2809f8mQ4O6m1j22k0J56O6j60j13J54J40j13j61O8J65k1j25k7Q2O3qr9o4J24J08
$$ y = [150, 123, -118, -123, 59, 123, 4, -100, -59, 55, 97, 9, -123, -56, 144, 115, -125, -151, 96, 168, -55, -169, -4, 141, 33, -93, -83, 29, 102, 21, -99, -96, 66, 140, -54, -177, 19, 189, 22, -174, -68, 143, 89, -76, -98, 20, 91, 46, -66, -106, 21, 141, 12, -157, -76, 149, 99, -135, -123, 92, 119, -65, -120, -5, 78, 42, -45, -95, -13, 106, 63, -104, -105, 89, 132, -66, -152, 36, 141, 3, -110, -23, 80, 56, -23, -65, -37, 52, 77, -45, -136, 4, 134, 2, -158, -56, 116, 55, -102, -83, 41, 57, 4, -52, -56, 15, 86, 17, -109, -61, 109, 95, -95, -108, 58, 104, -36, -90, 6, 68, 37, -34, -51, -21, 56, 59, -70, -105, 50, 123, -29, -141, 8, 116, 19, -107, -46, 60, 55, -14, -50, -36, 49, 83, -30, -117, -20, 124, 40, -140, -80, 100, 76, -76, -94, 32, 96, 17, -56, -56, 20, 85, 26, -100, -59, 106, 95, -95, -127, 71, 132, -32, -133, -6, 87, 40, -68, -72, 12, 78, 37, -85, -105, 51, 117, -43, -156, -2, 138, 25, -136, -68, 97, 76, -49, -76, 6, 69, 61, -38, -102, 22, 130]
2835A30j11j55P2J97n0j88%J66M7j36p0O5R3pq7o4O0J23l0j59JJ69N5j83p1J47
2861A4J12j19j00N3R0Ro7o6L1J13Qj31o8J44J07j30j25R0J32l9j40NJ17K0m9o0
2887d9oP4O2p7j02N3J43m2j51J5J60Nj27m4R4N5m8o5oM3P1j8j02k2J36L7j23p6
2915a10J22R9j00r2M3R3j6n4l2L1O0J1p9n0P3R7q6j16O5J32l7j35J0Q7M3p2m6
2942e9K3N2M1o0q2L8J30j1j53rJ36N6j37n3R5O6l8p6oN4N3k3j00jJ08N6j23r1
2970a14J13J13q3j40O1J31j8j04l1O4O7j7q7n3J14P8p7j30O6J53l5j54oJ36M7
2995I4j06o2N1Q1jp7n3N0J11l4j25j4J51M4j51p1J28R4r6r6L1R2K6p1o5K5R6J4
3023F6j12o9J35Q3r4j08N4J30k9j28kJ05M0m9p7KQ6M6q2q8O3J27l0j42LJ36K6
$$ y = [130, 19, -136, -64, 133, 83, -105, -105, 61, 108, -28, -98, -33, 60, 53, -34, -98, -38, 85, 55, -104, -103, 66, 121, -62, -133, 14, 126, 7, -93, -40, 50, 59, -8, -74, -43, 70, 78, -53, -121, 23, 130, 0, -125, -35, 97, 58, -82, -77, 40, 60, 11, -49, -55, 19, 81, 4, -98, -45, 98, 56, -95, -80, 80, 85, -42, -86, 8, 63, 15, -50, -56, -13, 58, 40, -62, -84, 52, 89, -34, -110, 12, 111, 11, -81, -38, 55, 39, -15, -47, -16, 44, 55, -24, -74, -1, 96, 10, -106, -41, 91, 54, -81, -71, 16, 59, -13, -59, -36, 16, 57, -3, -85, -47, 83, 72, -81, -90, 46, 102, -35, -88, 7, 73, 35, -41, -47, 7, 60, 37, -63, -64, 44, 100, -23, -114, -1, 112, 29, -111, -50, 81, 63, -41, -72, -8, 59, 42, -45, -98, 16, 94, 17, -113, -47, 106, 71, -83, -89, 47, 94, -12, -74, -23, 58, 57, -20, -73, -23, 88, 54, -71, -85, 66, 110, -41, -112, 16, 110, 14, -82, -51, 41, 67, -4, -69, -44, 52, 66, -46, -115, 20, 103, 9, -99, -45, 85, 56, -72, -74, 31, 71, 22, -55, -53, 33, 79, -3, -91, -28, 99, 69, -73, -70, 66, 92]
3050I2j18n9Q3O9n0n1l0P5N4m2r7K0J09L0j24o9J22P3q4q8M9Q2Op3l4N2O3j5q2
3079c7k5Q3O3p6j05P5J10l2j14kR7L2p1n0K4O5J2n8o5M8J01l0j14pJ21K4j09n0
3107i0R0P1m7p8J4N9L6m0p4J2J03K5j07o6J03Q2o9r5L2R3Mq8l2O2N1k0q0k3Q2
3136A0P0p7r5M8J27k5j24rJ06M5q9n6L8P1Mp2m8N6Q6l3j03qJ15N0j18o6R5Q2n4
3165B6r3K1P9K0m3p4L1Q6J5r8m9Q9Q3p2j14N5J02kj20j1P1N1l1q5J0Q6L5o9q4
3194h5M9J04rj23j7J22M8r5o4N8P5j3q2j4N0P2m2q7OR9K2r5n5Q3P8n2j07L5Q7
3223D8J2p3n0L8P8j4q5k7Q5O3n1j05M8R9rr2k6R4L9n9o2K2O5K6p7m6N0Q6l3r3
3253d9nJ05K7q6o2O0P1k3p7rO8L8n8n9K6Q3Mp5n7P9O9m7q8K0R6Qr3j6M4O1j9p2
$$ y = [92, -26, -85, -2, 67, 17, -34, -64, 11, 65, 23, -74, -54, 55, 85, -39, -108, 14, 87, 3, -85, -36, 46, 52, -21, -55, -3, 60, 45, -37, -62, 21, 84, 8, -97, -22, 88, 56, -58, -60, 37, 69, -2, -52, -28, 37, 49, -9, -74, -26, 75, 45, -69, -76, 45, 69, -40, -90, 0, 71, 24, -54, -40, 19, 55, 15, -59, -47, 56, 81, -26, -92, 11, 93, 24, -71, -39, 54, 58, -30, -62, 0, 51, 31, -49, -72, 10, 80, 3, -92, -44, 83, 58, -66, -75, 31, 76, -13, -69, -31, 40, 44, -28, -76, -20, 66, 33, -70, -78, 37, 87, -31, -97, -2, 80, 26, -67, -46, 33, 53, 10, -64, -33, 53, 68, -30, -79, 10, 93, 21, -93, -38, 64, 62, -58, -69, 2, 53, 22, -63, -53, 33, 68, -1, -85, -36, 68, 59, -64, -81, 41, 89, -6, -70, -12, 63, 50, -32, -46, 4, 76, 34, -53, -47, 52, 74, -21, -76, 7, 85, 33, -74, -39, 48, 60, -13, -63, -25, 53, 39, -46, -73, 12, 75, 24, -81, -33, 66, 57, -35, -61, 33, 72, 13, -49, -27, 38, 64, -13, -59, -9, 77, 44, -49, -54, 51, 78, -8, -70, -10, 61, 38, -39, -48, 20, 58, 0, -59, -33, 50, 54, -21, -78, 1, 70, 23, -65, -45, 51, 59, -34, -50, -6, 55, 36, -36]
3285c6j6O0O7o1p2K8R2pq6l1Q0O0o9o8L1P5J4p1n3N1O6k0q1nQ7L2q0n3N4P1j9
3316D0q6oP5K7l7n4OO8K6q8l5P7N7m9p3J0Q0L3q8l9N8P1l7p2oP0L1m5o9K7Q2l
3348E1r5pO8M6n8o8J9P9Rp3k4L9O6l1o1j0P5K9o8m7N9O2k4q1ON9K3m8n0L2P2O
3380E5p9k6N8N3l6q3J3Q9lo2l0M3M6k8n6MN2K7l9n7L7O3%p2k3O0M7m9o4M0O4j0
3412C4o6j7N7L4k8m7qP5J3n1m0L4O2k8o1QN3L3n4m3L3M6rn0l1O1M1m3o1K0N5J1
3444C3o8k5P0L6l4m6JN7K2m1m8L1N2j1n5j0N0L6m6m3K5N4kn8k0N2K9l1n4J9M6
3475B1Rm7k1K8M4k6m9RM8L0n1m5L9M6rn3qM6K6j0o7K3M5Mn1j7M1L9k9n5J5N3j
3508B7m0k6K6N5k5m7j1N7J9l5m8L0M8j5l2k5N0L4k7m6J3N0jm5j7K8L9k3m8J5L9
$$ y = [-36, -52, 8, 75, 14, -58, -30, 62, 55, -31, -62, 18, 78, 9, -59, -28, 47, 61, -10, -63, -12, 54, 34, -47, -52, 35, 67, -13, -66, -12, 59, 40, -46, -52, 23, 50, 13, -41, -35, 33, 59, -29, -64, 13, 70, 21, -52, -42, 38, 71, -17, -56, 2, 73, 36, -36, -42, 28, 59, 14, -55, -28, 54, 51, -44, -51, 17, 63, 5, -63, -44, 35, 44, -29, -53, -14, 52, 21, -40, -50, 25, 54, -14, -61, -2, 60, 36, -45, -39, 20, 43, -5, -55, -23, 49, 55, -24, -50, 8, 61, 25, -58, -45, 44, 41, -21, -51, -8, 38, 10, -46, -42, 10, 37, -2, -59, -22, 41, 41, -31, -54, 6, 53, 4, -60, -20, 44, 34, -32, -49, 8, 42, 14, -33, -41, 34, 47, -4, -44, -10, 52, 24, -37, -29, 24, 57, 3, -40, -7, 39, 30, -20, -51, 10, 51, 8, -53, -33, 22, 33, -35, -60, 10, 46, 12, -34, -33, 24, 46, 5, -43, -12, 40, 29, -26, -36, 14, 50, 4, -39, -14, 40, 38, -20, -40, 12, 41, 10, -44, -25, 21, 30, -17, -38, -10, 34, 8, -41, -32, 16, 46, -5, -50, -11, 35, 26, -27, -35, 11, 37, 27, -40, -17, 28, 32, -19, -36, 5, 44, 15, -40, -25, 28, 27, -13, -39, -13, 42, 17, -30, -41, 16, 35, 0, -48, -18, 30, 15, -17, -42, 8, 42, 15, -31, -18, 32, 31, -14, -31, -3, 36, 13, -35, -20, 19]
3539A9J5l4l6L5L3j0l4pL4L3m5l0J9L9J6o9oL5K8l2l0PM0Nm7mK0L2k2k4j3M2J9
3572B8l2m4M0K5%l2nK9K1j1l3J6K9ml2j5K2L4l2k0ML4pk0k1K8J7j5k4kK2J7k0
3605ck6K9J3%k7jL3Lj8l0J3L5Lm4kL4J8j5l6J3L2Ok9k2J6M1k6k9jK4L0l7j6J4
3639eK4Nm2LK2J1k6j4J3J9J1l7kJ9K0j4l1J2J8Kj6j6J6L0pk8KK9J0k1k2J3K6j0
3673A4j5lJ4J3j7k5J4L4j4k9j1L1J1ok6j1M2lj9k3K2K6k3j5lL2Npl2K2K4ok6r
3707a9K8J3j9j6J6J6Ok5pJ9Kj7j1OJ9Nj8k3K4J4j7rjK4Mk2j0K2MJk3j0L3J0j4
3742Ej1jK5Jk8LLK6k2olK0lpqkK5j4j9LJ2J5j4k0J5J3kj2qJ8Pj1j5QQ%j4mJ5J5
3782A3lk2OJ3Nj3nJ6nPk9PJ9Nnj8PJ6lj7lJ1J4oj6QjKmj1J4Njj1%J1Lj5j3QJ3
$$ y = [19, 34, 0, -36, -1, 32, 22, -12, -19, 15, 48, 3, -27, -8, 31, 47, -22, -28, 7, 35, 3, -27, -20, 20, 25, -22, -26, -6, 26, 4, -20, -33, 9, 28, -4, -48, -8, 17, 17, -15, -20, 9, 30, 19, -14, 2, 31, 27, -5, -20, 2, 36, 4, -16, -12, 22, 15, -5, -26, 2, 19, 4, -20, -22, 0, 17, -3, -29, 0, 13, 13, -14, -15, 18, 21, 3, -27, -14, 21, 24, -20, -22, 12, 30, 15, -21, -8, 24, 30, 1, -21, -5, 36, 10, -19, -20, 4, 34, -3, -19, -5, 19, 24, -18, -15, 7, 18, -8, -22, -9, 10, 21, -16, -18, 1, 21, 7, -24, -12, 6, 8, -8, -24, -8, 22, 15, -13, -11, 18, 28, 7, -15, -2, 24, 14, -1, -4, 10, 23, 6, -19, -5, 29, 15, -14, -25, 6, 17, 11, -15, -26, 16, 13, -6, -29, -7, 19, -4, -19, -22, 10, 15, 8, -24, -2, 22, 16, -10, -19, 9, 22, 3, -13, 3, 19, 25, 0, -7, 12, 14, -3, -14, -8, 11, 16, -2, -25, -1, 13, -4, -13, -14, 10, 14, -8, -18, 4, 8, 9, -14, -24, 9, 19, 5, -6, -7, 18, 19, -9, -6, -3, 23, 1, -5, -8, 12, 9, 2, -6, -8, 17, 3, -16, -13, -1, 14, 0, -20, -5, 8, 6, -6, -14, 4, 11, 0, -15, -7, 1, 1, -13, -17, -2, 13, 10, -12, -6, 7, 12, -1, -6, 10, 5, 12, -17, -10, 9, 14, 9, -9, -2, 14, 11, -6, -9, 2, 16, 10, -6, 2, 1, 3, -1, -12, 2, 7, 6, -5, -5, 6, 9, -6, -19, -11, 2]
3823BKj0oJ8Rj0mKK2oj6lPJ3k0nOR%qoJ0Klj0kJ0Rk5OkJ9j2j1QJ4ppJoK8j2kj4
3867a0K1knj0JJ6%j2mMK3j1j1lJ2Rk3LMJ3nj6QKLrpNJ3Qk1kKJ5r%kPop%J3Mj9
3911hJ3rJ3Noj2OJ5j2Jj0J3oMj6JK0j1PojQj2kjJ4Nk0%JRrOoJ0oRkqPQpnJ2%j6
3957dKNK2nk3J0j0MOqJ0Mj1j3J1Pj4J0pnJ9pj6QKj1J2Qj0KJ0j2%Q%jkMPkj1km
4000gPJ8k4JJ7Pj2mpLLj%lQMk5J8j%mJNQj4NkrNNkkpJ0J%J4j2l%kjLOrRJ2j9J
4049AMLkj3NKJQj7RKjj0jQkp%nPkOmJ3oKkKNJJ%koJ2j1jMJ4j5j5J6PLj7kJRrJ
4099cljqOLKMqm%QJKj5J9j3NjjJ5j1nRjQrJPNpjNlJ0nronJ2j7MJK2k8J2PqL%r
4149a0PN%kpOMkJKJ0Jj4MPnLmoJ2qmMLjqKRrK0j2k6J5J0lj1nJ2OrlLmJ1%oNkl
$$ y = [2, 4, -6, -12, 6, 15, 5, 1, 3, 25, 19, 3, 0, 7, 20, 0, -5, 1, 10, 10, 2, -4, 6, 8, 5, -5, -7, 3, 12, -13, -7, -9, 10, -2, -13, -5, 9, 2, -5, -4, -10, 18, 6, 4, -10, 11, 9, 4, -6, -5, 11, 11, -1, -5, -1, 22, 11, 0, -3, 9, 18, -5, -2, 2, 15, 10, -6, 2, 4, 7, -2, -9, -4, 9, 17, -4, -6, -4, 11, 2, 2, 0, 7, 1, -6, -6, 7, 11, -8, 5, -4, 9, 14, 8, -4, 2, 17, 5, 6, -4, 9, 3, 7, -9, -8, 12, 1, 8, 2, 1, 9, -3, -5, -6, 8, 13, -7, -7, -6, 3, -6, 0, -6, 4, -2, 7, 5, -3, 4, 12, 5, 0, 12, 12, -4, -2, 3, 25, 20, -3, 7, -3, 1, 7, -1, 9, 13, 2, -11, 0, 7, -7, 3, -4, -9, 10, 3, -13, -5, -3, -14, -2, 6, -4, -2, 8, -4, -4, 4, 4, 3, 1, 5, 12, 10, -1, -3, -7, 0, 18, -6, -5, 12, 19, 7, 3, -4, -1, 2, 1, 1, -2, 6, 10, -15, 3, 2, 2, -2, -1, 4, 12, -2, 3, 1, -8, -3, 2, 0, -2, -9, 1, 2, 2, 16, 4, 1, 1, -1, -2, 1, 7, -2, 7, 19, 0, 1, 5, 8, 6, -7, -2, 0, 1, 9, -8, 1, 3, 2, -8, -9, -1, -3, -10, -10, -15, -8, -10, -4, -8, 5, -1, 1, -1, 1, 6, 7, 8, 8, 6, 0, 12, 1, 0, 4, 18, 3, -12, 4, 11, 14, -3, -5, -4, 5, -4, -3, -6, -7, -15, -9, -6, -4, 0, -8, -12, -12, -4, -3, -1, -16, 3, -10, -5, -6, -7, 8, -3, -8, 1, 0, 8, -1, 0, 7, 12, 5, 4, 9, 6, 16, 11, 2, -4, -9, 3, -14, -10, -9, 13, -15, -3, 4, -4, -1, -1, -10, -3, 2, 2, 0, -7, -1, 3, 1, 2, 4, 14, 15, 1, 5, 12, 7, 10, 6, 0, 12, 4, 0, 4, 7, 6, -2, 0, 9, 0, 20, 8, -18, -3, 7, 4, -7, -12, 0, 6, -3, -6, -3, -7, 4, 4, -2, 3, 1, -2]
4198bj4J5OlRj9J4kkLkMpRj7J1Rj7J1qJ0MqjrPnkJJMJr%JJ1j3kMJ1Mkj3J4pKk2
4245b0L5j3kLmJ2JJj4KRpJ2j5QjqOrJ5orKLjJLnJNj1KnJ6oMkJjjj1J0Lj0J5nn
4292aJ0Mj1QkNk4J6rJ6j2jKRoNj9OJ0kj2mQPrj2QRJ2nqkQj7J6oJ1pMmMPrMj8J7
4338FPj2lkOMppLJ4rpLQj0joNLOj0lJ5NqkqJ9pj0PL%J0j0PnOloJJ2j0j1NM%kM
4387DpJ5qmoRLnj1RJOj2LQM%j6J2NpJpJ5qOj6J2jLjrPJJj1LJ7qLj2L%K3l2nJ8
4434FpOqJL%jj4J5Llj0qJ2KMnJ6Qjj8j1J3mJ3qlJ3jjj4OJ2oqpNKpkJ0MOk3J0K
4480BqJ2j0LJ4j1%ljMLJj0J2lmMkJ1rmpJ3Mqj3RJ3qmMj3J3n%rJ4oJ0j6MKNLoL
4526CKnrJ0LjljlRj%OLmj4NLOkqN%%%jj0PkkkJ1Roj8MLMQk0MLRlj5J5joJQKJj0
$$ y = [-2, -16, -1, 5, 2, 11, -8, 6, 4, 2, 5, 3, 7, 0, 9, -8, 3, 12, -5, 6, -2, 8, 12, 4, 3, -6, 1, -4, -6, -5, -4, 0, 1, -8, -8, -7, 4, -9, -11, -7, 4, 8, 6, -7, 7, 0, 2, -20, 15, 2, 0, 3, -1, 11, 12, 13, -1, 1, 10, 3, 15, 0, 8, 7, -1, 5, -4, 11, 5, -4, -2, 1, 0, 1, 4, -1, 0, 5, -6, -4, -9, 7, 1, 5, 3, 4, 3, 2, -9, 1, 4, -6, 9, 4, -1, 9, 13, 2, 10, 8, 13, -11, 5, -4, 12, 0, -1, 1, 10, 4, 9, -10, -4, 6, 4, -8, -12, -4, 3, -6, -18, -10, -1, 11, 6, -2, -4, 4, -13, 3, -3, 8, 1, 5, 1, 5, 12, 3, 7, -11, 6, 13, 1, -2, -4, 2, 6, -1, -8, -5, 9, 0, -7, -4, 4, -6, -7, -13, -8, -5, 1, -9, -12, 3, 8, 0, -2, -10, 9, 2, -8, -1, 2, 2, 12, 2, 9, 4, 10, 7, 1, 2, 14, 4, -7, -2, 2, 2, 0, 4, -3, 12, 4, 0, -6, 3, 6, 1, -10, -1, 0, 6, -6, -3, 5, 9, 9, -7, 5, 10, 3, 4, -3, 12, 4, 10, -6, 6, 5, 8, 7, -2, 5, 6, 7, -4, -1, 16, 8, 11, -1, 2, 2, 25, -7, -12, 6, -1, 5, -3, -2, 1, 1, 0, -14, 1, 4, 1, -9, -17, -5, -3, 1, -4, 12, 20, 19, 1, -10, 3, -1, 12, 4, 1, 14, 13, 12, -2, 4, 16, 10, 2, -5, 0, 2, -5, -7, 3, 7, 13, -10, 0, 2, -6, 6, -4, -1, 13, 2, 2, -1, -2, 2, 5, 6, -4, 8, 5, 1, 5, 3, 14, 5, 1, -6, 7, 11, 3, -10, -1, 12, 4, 0, 4, -9, 4, -1, -1, -10, 4, -2, 8, -8, -4, -2, 3, 6, 0, 3, 5, 0, -9, 1, 4, 3, 0, -1, -4, 5, 4, 4, 10, 13, 9, -5, 0, 3, 9, 7, -1, 4, 4, 4, 4, 3, -7, 0, -2, -4, -6, 5, 14, 8, -10, -6, -3, 1, 9, -11, -7, -4, 5, 2, -13, 2, 1, -5, -4, 4, 6, 7, -3]
4579cM%MQqKJ0j1jJ5lj0lJ%JNkj3RRj4MnLMnj2QK%LokPMj5J2M%KrRJmnkJ1%mK
4630GklOKj5K8j2rpRlJ1pJj5OJ4j1JJLKLj0PNr%MpOmOk%Lj0RNqk%%LlnKRnkj1
4681iJ0kmPrN%ljORnKrJ4j1kkRQj0Lj3PPjNKmj%kOOqnPnm%qJ0rRqkQMj2QmJM%
4735DjmJ0kq%LJ6j5qNPJOpKqnJ7j4LMNj0klLOj7J8mj0OjJ1j6P%qJ4LNj7kJ0JL
4782HkoLPj7K0kLk0J1nQKJpjkJRplMklLJ6j6pmJ6mk1J3kJ0j3J0RojmMkOJ0j8J
4829@J2qJOjJ2j2pPlrJ6%j1LMqjJ6qj2kjNOj2jJ3lqlK8j5o%KNNjJj0jJ9jk0J4
4875A1KllmRnOj0MlooJPOqj0J1klMj5KK0Lmj0QMoKjJjPMomQojmQPpnQmQmqJ0o
4928Fn%%NJp%rPKj1J2JnKJ1rPj1kJ5kj0QJJ1lkj0j%JlMKjkKj0Nj0J8j2J3mmlM
$$ y = [-3, 1, 1, 5, 13, 5, 7, 17, 6, 5, 20, 17, 7, 4, 5, 5, 6, 11, 9, -4, 5, 14, 0, 4, -1, 2, 6, 1, -11, -3, -1, -1, 2, -4, -6, 1, 5, -10, 2, 6, 6, 8, -1, 8, 9, 5, 0, -2, 9, 9, 5, 7, 5, 2, 8, 10, -5, 23, 11, 2, -5, 4, 1, 12, 5, 6, -9, -3, 11, 0, 1, 2, 5, 7, 10, 0, 7, 12, 3, 3, 7, 0, 6, 2, 8, 6, 6, 9, -1, 8, 13, 5, 3, 3, 3, 6, 3, -2, 0, 9, 4, 2, -9, 1, -1, -5, 2, -7, -2, -2, -5, -6, 0, 9, 4, 6, -3, 11, 0, -2, -4, 5, 13, 3, 6, -7, 0, 7, 6, 11, 13, 9, 8, 8, 6, 12, 18, 10, 5, 12, 7, 3, 3, -5, 5, -4, 5, -3, -5, 3, 7, -5, 3, -1, 0, 4, 4, 3, -1, 9, 7, -1, -1, 2, 18, 3, -5, 0, 7, 8, 14, 7, 9, 1, -4, 13, -1, 2, 6, 11, 1, -1, -4, -1, 5, -12, 6, 2, -8, -2, -3, 8, -8, -1, -1, -9, 5, 8, 13, -4, -6, 4, 5, 8, 6, 0, 3, 10, -7, 13, 11, 14, -6, 5, 0, 8, 10, 11, 4, 3, 1, 2, 11, 4, 1, 5, 3, 0, 3, 19, 3, -4, -8, 8, 4, -17, -4, -6, 4, -9, 1, 10, 4, 3, -1, 3, 1, 7, 17, -1, 0, 12, 4, 5, 11, 10, 22, 10, 3, 10, 7, -2, 14, 14, 3, 6, 10, 2, 1, 17, 9, -3, -5, -6, -1, 5, -7, -8, 5, 2, -6, -9, 19, 4, -2, -2, 0, 5, 10, 9, 10, 0, -1, 18, 17, -3, 11, 13, 10, 7, 3, 12, 7, 13, 3, 7, 4, -2, -8, -7, 0, 6, -2, -12, -1, -3, -6, -2, -17, -15, 5, 8, 4, -6, 2, 6, 0, 2, 1, 2, 1, 8, 12, 6, 2, 10, 4, 3, -1, 7, 14, 7, 2, 10, 6, 14, 10, 2, 12, 6, 1, 1, 1, 6, 7, 0, 0, -9, -2, 0, -11, 1, 2, -3, -1, 10, 1, 8, -3, -5, 10, 8, -2, 6, 7, 18, 15, 13, 3, 2, 2, 3, 0, 4, 6, 5, 3, 5, -5, 0, -10, 8, -4, 9, 5, 1, -2, 2]
4976BklJmKJ0j1oKOJ2j1MKJjJlOLMj0LLkj7J3jnJnLJNj3NkOkpJ2mMnj%lNrnKJ2
5028aJqJ1nKlKjMQoMokl%PmjNnOMrJmMmmOLjn%LpmRoJJOokP%pJ9lprPNQrKpJK
5087@kJMnJ5j0jqJKpNKM%lq%KOmNJmlnQLjJNrJ7j3OLj2PLpNnMkKMJ1j6j0J0j0
5138hPpJ2k0J5Nj0okMmJ2j1J6pMj1PPjoKONj6J0MLj3%J1Mlj1JMMj6OMoKNj2J9
5183IlrmOjRj8J0mJ2j8KJ8opJ0j5J7noNPNj5OoQPpnK%NJrlQNk1mJ2Oj2LjRoj4
5231a7J7j2J4qJ1j9OROj0NrJ1nOLlkpJ0knQklLoLoJ6mrQjolLkKokRqRKj2jJ2k
5280A%kQjKnkkPjMknJ8j1rMOmOj0J1orJ0%j6J2j2jP%Mj6RnQLnkRloRm%jJ7Jj8
5330bJ2nlNjlQoMLj0mPNlmj3J5j1j%kJ0lj%nRj3J4oOlqQJ3olnlJ4jmnOLnkRkm
$$ y = [2, 0, -3, -2, -6, -4, 6, -5, -11, -9, -3, 9, -2, 2, 4, 5, 4, 5, 2, 8, 11, 15, 5, 8, 11, 9, -8, 5, 4, -1, 0, -5, -2, -1, 4, -9, -4, -6, 0, -2, -9, 3, -1, 3, -2, -3, -3, -6, -1, -10, -15, -13, -1, 0, -8, 3, -2, 0, -3, -1, -2, 2, 10, 4, 8, 2, 0, -3, -3, 4, 0, -1, 4, -1, 5, 9, 0, 1, -3, 1, -3, -7, -1, 2, 1, -4, -4, -1, -8, -12, -3, -9, -8, -7, -1, -7, -9, -2, -2, -9, 10, 7, 0, -9, -2, 3, 11, 2, 4, -3, -2, 0, -2, -1, 3, -2, 13, 3, 2, -6, -5, -3, -10, -5, -3, 1, 1, -2, -10, -10, -8, -2, -6, -1, 0, -4, -7, -12, -4, -1, -2, -1, 4, -5, 12, -1, 5, 8, -4, 3, 6, -1, 4, -1, 3, 1, 3, 7, 18, 2, -8, 2, -8, -1, -8, 4, -16, -1, 4, -6, -12, -14, -10, -14, -2, -13, 3, -4, 0, -11, -4, 3, 2, -4, -2, 4, 9, -7, 3, 7, 10, -3, -3, 8, 12, 9, -2, -1, 3, 7, -9, -3, 1, -5, -3, 2, -10, 9, 6, -3, -7, -1, -2, 7, -11, -1, -5, 7, -11, -9, 9, 3, -4, 6, -9, 8, 3, -3, 2, 9, 14, -1, 5, -1, 7, 14, 7, 2, 4, 4, 9, 10, 1, -2, 6, 11, -10, -14, -2, 4, -8, -5, -6, 3, -3, -17, 0, -12, 2, -6, 5, -14, -8, 1, 7, -3, 2, -7, 4, -1, 5, 8, 5, 3, -4, 6, 4, -1, 7, 5, 2, 5, -1, 2, -4, 12, 8, -1, 7, 6, 0, -3, 0, -2, 0, -6, -8, 1, -7, 2, 4, -8, -9, 3, 1, 1, -1, 7, 6, 8, 3, 1, -1, 6, 5, 9, 7, 2, 20, 9, 0, 4, 10, 6, 12, 2, 13, 7, -2, 8, 8, -8, 4, -8, -9, -2, -2, 2, -14, -5, -10, -2, 1, -4, -6, 3, 0, -6, 3, -1, -1, -2, 15, 16, -2, 10, 5, 2, 7, 6, 3, 11, 5, 9, 12, 2, -2, 5, 10, 7, 3, -10, 5, -6, -7, -7, -9, 1, -2, -3, -3, -8, 1, -12, 2, -4, 2, -1, -9, -1, 12, 6, 3, -2, -5, 9, 8, 4, -1, 5, 8, 3, 1, 10, 8, 4]
5381DNlLmjqjPkNkJpLlj1J5mnNj1J7nJ4j1jJ5j2j5J5mJ8%j0MNj3JNJprQj0OoJ1
5428CjLj0Pn%MoKQoPj3MnNlRjj1OJLj3J4P%j5R%J6j0PrjjmJjKjJqP%lJPKqMmo
5481eJKNq%ONqJ1JnrPqJ5kPjJ%j0PJLj0KoNNj1oJ%p%NkJ0nj7OK3j2pKOkoRJnO
5533ALl%J5j2KOj4J1n%K0j3qQqQj4Nj0NNmLj2MJ5qpJMqNJMjrOKKoMNK%Jjj3J6
5582HoNlQlrJ0ol%pPlpJ3j2lJJ1qnNlJlLJ0rjMoOjQoRlL%J2llorRjLKMklj0KQ
5636HjKj5nJ0%kmjJ3mpPrPkjrJ2RnpnJ1JJoNjKKkPnjrQMrj1J7j0Qj3%LRoj3NQ
5687d%joJkJ0nj0K1j2kNqJ3NkkJ2rj3K0rMNnj4J0n%OpNj1MkLJ0pJ%n%mrPRoMO
5736Ap%moQJ0j1j%J1rjMPKJkqP%%j1LLnMnJPj1PqOLppJ4oJRnLMj4M%KLkRnJKp
$$ y = [4, 9, 6, 9, 5, 4, -4, -5, 2, 0, 5, 3, 4, -3, 0, -3, -14, 1, -3, -8, -3, -14, 3, -2, 12, 1, 0, 15, 3, -12, 3, -1, 17, 17, 7, 11, 16, 3, 4, 9, 10, 3, -6, 2, -8, -2, -8, 3, 2, 5, -5, 2, -3, -3, 1, -5, -3, 5, -1, 6, -7, -3, -8, -3, -6, 3, 2, -9, -3, -2, 1, -12, 2, 9, 9, -6, 3, 3, 19, 9, 16, 7, 6, 5, 1, 2, 1, 3, 2, 3, -5, 2, 2, -1, 0, 7, 9, 1, 5, 1, -5, -4, -2, 3, -5, -5, 1, 6, -2, 9, 10, 5, -4, 3, -5, 10, 8, 15, 14, 15, 15, 5, 12, 13, 16, 6, 8, 2, 7, 12, 1, -5, -4, -4, -11, -11, -6, -8, 2, -3, -20, -14, 9, -3, -10, -8, -2, -4, -10, -1, 0, -5, 1, 4, 1, 1, 16, 4, 6, 12, -2, 9, 4, 4, 24, 11, 3, 11, 3, 11, -3, 2, -8, -3, 2, -2, 1, -11, -7, 8, 0, -7, -6, -2, -10, -5, -4, 0, -1, -10, -4, -2, 0, -6, -2, 3, 5, 5, 6, 5, -8, 8, 2, 7, 4, 12, 9, 0, 10, 4, 1, 1, -6, 1, -2, -9, 4, -8, -11, -10, 1, -7, -12, -7, -10, -9, -12, -9, 1, -8, -9, -5, -11, -5, -6, 2, -4, 5, 2, 5, 5, 17, 14, 11, 5, -4, 5, 4, 7, 9, 13, 11, 8, -2, 0, 8, 7, 9, -6, -11, -1, -1, -3, -7, -8, 5, 1, -6, 1, -8, -1, -3, -4, -13, -1, 8, 3, -4, -9, 2, 3, 4, -2, 3, 2, 4, 6, 4, 11, 6, 5, -4, 4, 8, -1, -12, 5, -5, 3, -10, -10, -7, 2, -4, -17, -12, -4, -4, -5, -11, -10, -12, -2, -7, -17, 4, -8, -10, -5, -13, 0, 5, 3, 1, 13, 4, -9, 11, 2, 6, 11, 6, -8, 2, -3, -3, 3, -4, 1, -10, -6, -8, -5, 5, -2, -1, -1, -6, -6, -10, -19, -12, -3, -9, -5, 1, -6, -6, -10, -16, -8, 2, -9, -10, -10, 1, -8, -9, -5, 2, 4, 5, 3, -5, 2, 2, 2, -9, -6, -3, -8, -4, -9, -8, -1, -12, -5, -13, -7, -4, -11, -18, -4, -10, -9, 0, -5, -2, 2, -12, -8, -8, -6, -3, -5, 4, -1, 0, 2, -5]
5790ekJ4JqOoRpKmqR%omJRNj6JkRj1J0kJp%JMoQJkOj%%mRjj4J1Mpl%J1Kj0Pj8
5842a3J6Qj3MJ0rj4JMKrMNPn%j1PkPKj4J3LllLOrMk%NmOqPlmNoL%mmmPkRnnOp
5895iJojJ4j0JJ8j1oKLnKLJ1mjjJQj0J0j0lRNj4MJ1oJ%j0J4j5MKj1LRpmRoj%%
5942fO%j3J9nkjJPr%J6j5j2J6ljJJ3qJKnjMkmNnjplPJ4nj1QJ3j3nkOO%rJnK1j1
5991Cj1mPRj1J1qJ0nRmMjmnM%JoNlknjJ0LlroJ2ooOjjJ0j3jJ2MKj4NPNKrJ3lj3
6041aJ2j0PJmkqLMr%OQj4kRj0J0mj2J1J5j2pPRqokMRpoJ4%Omj4J5%j1LKOMoKj
6089GOnj2lJ9np%Qj0nLNnOJj0OnQj5QMJj3jJ3NqKK%J6r%njJ1jnLmJ4k4J1Mj8J2
6137DnQqjnMmllMPnNj2NjNjmJLKNllJ9j0j0QkJ1j1mJ2kl%nLkLqj3NJ2Kq%J0no
$$ y = [-5, -7, 7, 8, 0, 6, 0, 9, 2, 4, 0, -8, 1, 1, -5, -9, -8, 1, 6, -10, -9, -11, -2, -13, -3, -5, -4, -11, -11, -10, -6, -12, -4, -3, -5, 1, 0, 0, 0, -4, 5, 4, -10, 1, 5, -2, -5, -5, 6, 8, -2, 5, -13, 3, 11, -2, 2, 12, 3, -11, -10, -6, -4, -13, -9, -4, 3, -2, -2, -13, -6, -8, -1, 1, -13, 0, 3, 0, -3, 0, 6, -3, 1, -1, -1, 4, 0, 6, -2, 5, 2, -2, 3, -3, 0, 0, -4, -8, -12, -5, -7, 2, -3, -8, -2, -9, -8, -14, -15, -1, -11, -10, 8, -3, -9, -7, -4, -9, -7, -4, 7, 3, 2, 1, 2, 10, 0, 10, 0, -3, 6, 11, -3, 1, 12, 6, 7, 7, -3, 11, -4, 0, 2, -9, -6, 3, -4, -8, 1, -5, -6, -6, -6, 0, 0, -13, 6, 1, -1, -2, -1, 6, -3, -3, 13, -2, -14, 2, -1, -2, -1, 12, 4, 5, 7, 2, 1, 5, 3, -1, 4, -1, -2, -9, -12, -5, 9, 4, -7, 1, 14, 1, -4, -6, 0, 6, 6, -3, -2, -7, 14, 3, -8, -12, -5, 4, -7, 4, -4, 6, 1, 10, 6, 10, 9, 5, 0, 4, 4, 5, -1, 4, 1, -1, -6, -7, 3, 6, 3, -6, -12, 0, -6, -12, -6, -7, -8, 2, -11, -12, 0, 4, 6, -8, -3, 4, 9, 11, 2, 15, 12, -1, 11, 1, 8, 9, 5, 3, -5, -2, 2, -7, -7, -1, 7, -7, -9, 0, -10, 0, -4, -16, -5, 10, -2, -9, -2, 7, -1, -7, -9, -5, 4, -3, -9, 5, 5, 11, 7, -7, 8, 8, -3, 0, 2, 8, 12, 6, 8, 7, 13, 8, -4, -7, 12, 7, 0, 0, 8, -2, -7, -4, 1, -4, 2, 3, -7, -1, -6, 2, -13, -5, -1, 0, -13, -14, -1, 4, -4, -2, 0, 0, 16, 7, 7, 2, 1, 12, 11, 6, 9, 5, 19, -5, 6, 10, -8, 4, -1, 7, -1, -2, -7, -3, -7, -10, -13, -9, -2, -7, -2, -14, -9, -10, -5, -6, -10, -9, -6, -4, 1, -2, -5, 14, 4, -6, 2, 0, 11, 0, -4, 8, 6, 3, 3, -2, 1, -1, 2, -6, -19, -14, -2, 0, -8, -8, 2, -3, -9]
6188i%kQoKKNPmj0MRJqJQlpJ1j1PoJ1mKqOjqJ3Mk1%lJ5oMpJ%%LnKLjlKJNJjjm
6242arJ1JNLlkoRj0%KMmmOKJrlJ5j1kpJ1Ppj2jJ0J1qmJ%okK0oj%%pJ5KojPpLP
6293A4%mk%mjkLplJ1mjjK%J%Jj1MLklMqJ9j0OkkN%NonJ1qjKJ0j5J1J%lJ3j1j6
6342fPNKJJlqjkJNj0KJ3qKrQqJ1jnOmJjOnRlOJ1mj6jJ6j1KmjLnJ2j5mJ6j0onJ0
6392@Kj0QPmokKOlj4PJ3L%pPn%LjoJ3rNJk%NJqnOnJ%Qj2oLPLj6MJ1qOj3LJ0Ln
6444AmR%pLNKj3QjLrJ5j5RJJ%j3RjJ0j0KpNlj1J7j3Qkmj5RRMoqJ0Jj0J7%%ojJ2
6492A1mj2JJ4nrN%J3p%jqJ0k%jrqJ6j4J1OlqLj3Qj1J8oJNj2PJNj3QjKQnMj1Q%
6539BjPrPj1PJ0mjlj1J1j0lQpjLJ0j2RkKplOJmO%mMMl%JJ5qoLPj1KJ0Pj3Lj3J0
$$ y = [-9, -9, -11, -3, -9, -7, -5, 0, 7, 3, -7, -3, 6, 7, -1, 0, 8, 5, -2, 9, -2, 5, -1, 10, 6, 8, 0, 6, 5, -3, 10, 14, -7, -7, -10, 5, -1, 3, -4, -3, -3, -3, 0, -5, -3, 0, -1, -4, -2, -1, 4, 5, 4, 3, -1, -10, 1, 2, 7, 10, 7, 5, -1, 8, -2, -2, 0, 4, 0, -4, 2, 4, 5, -4, -7, 8, -3, -5, -12, -1, 6, -1, -13, -14, -4, 7, -1, -5, -4, -4, -10, -12, 8, 2, 1, 1, 1, -6, 9, 11, 5, 4, 11, 4, 7, 14, 14, 10, 8, 8, 4, 3, 1, 4, -3, -6, 5, 1, 0, -1, 1, 1, 2, 2, 3, -8, -4, -1, -3, -6, -2, -10, 9, -1, 5, 3, 1, 6, 6, 11, 5, 0, 11, 3, 2, 4, 14, -1, 10, 11, 11, 8, 21, 10, -6, 1, 6, 8, 9, 10, 7, -1, -2, -4, -3, 2, -8, -6, 7, -1, 1, -8, 0, -8, 3, 2, -3, 3, -1, 0, -1, 5, 0, 9, 6, 12, 23, 19, 3, 2, 18, 7, 9, 5, 4, 7, 2, 14, -1, -5, 11, 1, -5, -10, 0, 2, -8, 0, 7, 3, -3, -5, -3, 3, 0, -14, -7, 6, 9, 9, 2, 9, 4, 4, 7, 6, 0, 13, 4, 9, 10, 8, 8, 13, 14, 6, 1, 7, 2, 3, 3, 11, -1, -7, -4, 3, 6, -10, -6, 5, -3, 3, -10, -7, 3, 6, 1, -3, 6, 6, -1, 2, 7, 9, -4, 4, 3, 6, -3, 12, -3, 6, 7, 8, 8, -5, 4, 3, 13, 3, 5, -2, 3, 0, -11, 6, -7, 1, -1, -5, -20, -11, -2, 2, -4, -12, -2, -1, -11, 6, 6, 6, 0, -1, 11, 7, -5, -4, 10, 5, -4, 1, 1, 14, 7, 7, 6, -2, 8, 6, 6, 5, -4, -12, 4, -10, 1, 7, 4, -4, -1, -14, -6, -17, 1, -5, -4, 1, -11, -4, -3, 2, -11, -3, -4, -2, 6, 1, 5, -6, 2, 2, 1, 8, -1, 6, -5, 2, 12, 8, 7, 4, -7, 4, -6, -9, -1, -8, -9, -6, 4, -8, 1, -1, 1, -6, -9, -3, -2, -6, 0, 0, -4, 0, 4, 1, 1, 2, 17, 9, 3, 6, 13, 2, 4, 14, 21, 8, 11, -2, 8]
6588HKLmqRkj2%JRj6jJ3KLj0oOlKOmKRnj2RjjJ1j1RQoqRj1NqJ6j3kJ6qrOmRmn
6638aJoJ1j1QoJ0qJj2K%MlJ3j0mPKpkPOlKL%oKNKjqoJ6j0LkMKoJlj0JKLlklJ0
6689ekNnj0J1MKkPj2ONqJJ2Lj4JONj2JKJlmQjMkpkKLj4J8m%kkrJ2nLjKj%oKJ0
6740CnpKJ1mjpJ0NNj3MJkpjJ0jnkK%RqrOPmj4qJ9Mknj%Oj1ORKlNkjJ0qNnKqoQ
6793AMLj0KlJJ5j8QrLLj%Qj8OlQkjmLmjoJ5krJ6KoM%jpOPjj1J0jj0J4Jj6J1rO
6842DoNJ1rnj2K0j3kRpj2J7JnKLNmnNqkJ1jMqMj1J2NnKokONlj1J7j3pJ2nOpPj2
6890hJNJj3J3Jpj1J0LJKoO%pPO%jKj0JJ0j1J1qQMLj5KNMpPj1lNKkJnnJ1j0J3j5
6938a0J0kklkKM%nNPMonMKJ0qM%oLnLnL%NmMrj0P%NKJk0J4Oj3J0Rj1j3J1jmML
$$ y = [8, 10, 13, 9, 1, 10, 8, -4, -4, -3, 6, -10, -11, 2, 4, 7, -3, -9, -3, -6, -4, 2, -2, 0, 9, 4, -8, 1, 0, -1, 10, -1, 8, 16, 10, 2, 11, 0, 5, -3, 13, 0, -2, 14, 6, -3, 3, -1, 8, 4, -1, 0, -6, 5, -6, 2, -4, 6, -2, -1, -13, -11, -11, -7, -10, 3, -7, -11, -4, -2, -9, -11, -4, 2, -1, 1, 4, 4, -2, 0, 5, 7, 6, -2, -8, 8, -2, 1, -1, 3, 5, -1, 0, -3, -13, -12, -10, -7, -10, -12, -15, -5, -7, -2, -7, -17, -6, -2, 0, -2, 5, -7, -1, 4, -4, -3, 9, 12, -2, -1, 5, 10, -2, -1, 1, 2, -1, -5, 3, 2, 6, 4, -3, -5, -3, 0, -14, 4, 0, 0, -2, -4, -13, -1, -6, -3, -4, -2, -3, -3, -9, -7, 3, -2, -9, -7, 4, 0, -1, -8, 2, 7, 12, -1, 3, 4, 2, -5, -6, 4, 3, -2, -4, -2, -2, 7, -1, -10, -4, 3, -1, -15, -23, -4, 0, -2, -7, -8, -8, -2, -13, -7, 2, 4, 1, 6, 4, 3, 13, 5, 10, 5, 7, -1, -7, 1, 5, 8, -2, 0, -3, -2, 13, -5, 3, -6, -3, 0, -1, -1, 7, -11, -5, -8, 0, -2, -3, -7, -4, -8, -9, -15, 0, -2, -11, 5, 7, 1, 5, 5, 4, -3, 3, 10, 9, -2, 8, 7, -3, 11, 12, -4, 7, -2, 4, -2, 3, 14, 5, 0, -12, 8, -5, -7, 2, -5, -17, 0, 1, -4, -2, 1, 6, 2, -3, 2, -6, -8, 3, 2, 6, -2, 2, -9, 3, 8, 3, 5, -1, -3, 3, 8, 5, -6, 11, -2, -9, 3, -2, 4, -3, 4, -8, -7, -2, -1, -14, -1, 0, -7, -18, -8, -5, -4, -2, -8, -2, -2, -9, -2, 4, 4, 3, 5, -5, -4, 6, -5, 6, -2, 6, 10, 13, -2, 0, 5, 9, 2, 9, -2, -5, 0, 2, 0, 1, -4, -9, 2, -8, 5, -10, 0, -2, -4, -7, -9, -7, -3, -3, -8, -3, 4, 8, 2, -3, 1, 3, 13, 5, 9, 9, 3, 6, 1, 4, -1, 2, 2, 7, 3, 7, -2, -12, -5, -5, 0, 2, 3, -17, -3, 3, -10, 0, 9, -2, -15, -4, -5, -9, -5, -2]
6988b%jJ1pOjmMNrJ1lj2PkPJql%pjJ7j9PRj0n%PKmMoKJmLJNkpkJ4kmlJ0%jJ2j1
7040FKloOOmRmqOnlMkjj0nRJoKmMj0OJ5JmJj3J0oJ1mmJ3lpJ0j6J5oJ0krOLJj4
7089bOJjpPJlj0NmQmNnj2J1mJ4rnlK3ppjP%Rj3QJjpMRj5KRk%pkJ2oMmomJ5j7Q
7140Al%noJ1kJpjQkqJ9Noj4J4Kn%J%%lJ4nnJ8k0jqJ4kOj2JpMlRljkLJj7J5kkJ
7190dNpmJ3llJ%QmK%KmPo%OkJkMPj0j0J2nkKoPj2NpJ5oqNKj6J6Jj2J1kQk2J3N
7239ApPKkNmjOj%j4K6pnpPLqO%qKnOmNrjKljJRrmKJ4j0%lmJ1mJ1j0RNj0MMlKl
7292CnJ1l%KPk0J0Nj0j0jjJPNk0RPJKj%Rj4%J1j0JJLjPj1J5jnLKMlmkJ%j%oOM
7342HjrNJj%kJjorQkLplJ6nLOqPJj1LJ3j0JJ3qkQpJjNmK%%%Mj7J1Oj4LojOlj1
$$ y = [-2, -2, -3, 8, 1, 7, 6, 2, 6, 11, 2, 13, 10, -2, 5, 3, 10, 11, 3, 0, 0, -7, -8, 9, -10, -3, 6, -4, -9, -9, -2, 0, -4, 0, -6, -4, -3, -7, -4, -3, 2, 0, -7, -9, 5, 3, -1, -4, 6, 6, 5, 17, 6, 8, 5, -1, 5, 11, 7, 16, 12, 4, 10, 5, 2, 6, 4, 3, -7, -12, -3, -2, -8, -6, -10, -6, -16, -10, 5, 6, 2, 3, -10, 0, -6, 5, 1, -3, 10, 7, 0, 10, -6, 9, 3, 13, 11, 2, 8, 11, 12, -2, 4, 5, 4, -3, 4, 5, 2, -8, -3, -7, 1, -3, 2, -3, -15, -4, -8, 6, -3, -8, -11, 12, 5, -2, -3, 4, 4, 13, 0, 8, 9, 8, 1, 5, 14, -1, 1, 10, 8, 8, 1, -1, 11, 5, 9, 5, -1, -5, 10, -7, 1, -2, -2, -7, -13, -2, -4, -3, -10, -11, -3, -5, -13, 6, 11, 5, -9, 5, 7, 2, 2, 3, 3, 3, 0, 14, 9, 4, 22, 2, 1, -7, 7, 5, 11, -1, 0, -7, -3, -6, 3, 0, -1, -3, 0, 1, -16, -1, -3, -5, -4, 1, -6, -10, 3, 0, -3, -2, -2, 6, 2, 4, 4, 6, 2, 9, 3, 3, 9, 7, 8, 6, 10, 17, 7, -3, 9, 4, 2, 4, -2, 5, -7, -2, -9, 6, 0, -8, -3, -1, -17, -1, 0, -12, -1, -3, 5, -17, -4, 1, -6, 1, 3, 1, 6, 2, 1, 7, 6, 6, -8, 18, 11, 6, -1, 6, 9, 1, 7, 7, -1, 1, -4, 2, -2, 3, -6, -7, -5, -8, -9, -8, 1, -8, -12, -10, 4, -6, -6, -9, -13, -2, -6, 5, -5, 4, 9, -1, 3, 7, 4, 6, 3, -2, 9, 6, 6, 8, 15, -5, 5, 10, 0, -10, -11, -12, -11, -4, 1, -19, -10, -3, -2, 0, -1, -1, 8, -6, -6, 5, -5, -4, -3, 0, -1, 6, -5, 10, 9, 4, 7, 9, 13, 10, 6, 4, 5, 5, 4, 4, -2, 4, 8, 7, -2, 3, 4, 3, 3, 1, 2, 1, -5, -14, -6, -8, -5, -12, -15, 1, -4, -1, 5, -3, 4, 5, -6, -3, 10, 0, 1, 14, 6, 4, 12, 5, 6, 5, 10, 6, 8, 8, 8, 8, 12, -5, 6, 12, -2, 1, -5, -6, 0, -3, -14]
7394a4J6oQqMokNN%pOlNj1LJ4LnJj1KKP%j1KMKj0mPMJ0j6OPj1j0J4pM%jqRJLj
7443BrkJ4nKNn%nJ3j1OPj5K3j3lNLkmm%J0r%jLojnmlNMmJPnkmJJ9jpJ%nLJ3j2
7494@J2pmjNJNj3OJ4rnqOoJ0pLLj5J3jj1%J1oqPnlMJ1j3NjJ0jj%Qj7NJJJ2jkj2
7542dONrJ7Lj2kqPnmnLJ1pLmL%mNj2KRLojRnNpJ2rmJ3jkJJ0pKKj1J4j4LRj7QJ
7592FJpnLj0J3LO%k0lNj0J6Jr%MJ0mMMpKnJ1Kj5P%MrMpJ3Mmj0J0mJj1O%KknpJ6
7641DljPp%JpkmMMqN%jJPOj2PL%j%pQJrOjOlOkoQj3nKJ3nj0RoRj3J6j4PlMn%L
7695amQpkJ2mQj1OnJ1j2MJpJ3Kj4KrQLnJ4k0NOkrP%%j0J8j4MkKLNrKOLj1J1j3
7742gMjOpQlJOlOoj2J7pj2MMJ1j2MMj6oROkpKqPJJ2j3PoJ3j7RKpQO%j2QqJ8lK
$$ y = [-14, 2, -4, 4, -4, 0, -6, -8, -3, 2, 2, -5, 1, -2, 3, -8, -5, 9, 12, 7, 8, -3, -1, 1, 8, 8, -3, -1, 3, 5, -5, -9, -2, 2, 12, -4, 2, 9, -2, -12, 2, -5, -1, -1, -2, -10, -1, 0, 3, 2, -7, -9, 5, 0, 2, 7, 2, 2, -3, 10, -1, 5, 12, -3, 20, 7, 4, 9, 12, 10, 6, 2, 2, 12, 3, 3, 2, 5, -1, -2, -7, -11, -14, -9, -5, -9, -8, -1, -6, -8, -12, -11, 8, 7, 0, 1, 1, -4, -1, 12, 0, 12, 5, 1, 0, 5, 6, 11, -2, 4, 18, 9, 4, -4, 2, -4, 6, -1, 2, 5, -10, 3, 2, -9, -9, 2, -4, -12, -5, -10, -13, -9, 2, -11, -6, -7, 3, 2, 1, 1, 9, -8, -3, -2, -1, 11, 10, 8, -4, 2, 7, -2, 15, 18, 6, 4, -4, 3, -2, -6, -11, -8, 3, -4, -1, -5, -2, -2, -6, -1, -13, -11, -2, 1, -5, -6, 3, -2, 3, -4, 8, -1, -5, 8, 7, 5, 6, 16, 9, 11, 13, 2, 16, 2, 5, 14, -3, 5, 6, 7, 0, -5, -2, -12, 1, 4, 10, 10, -10, -13, -8, -18, -2, -1, -10, -10, -6, 4, 0, 4, 8, 1, 3, -2, 9, 11, -4, 3, 3, 7, -2, 2, -5, 8, 12, 8, -2, 8, 4, 5, -6, 0, 0, 2, 0, -5, -12, 4, 1, 0, 7, 0, 0, 1, -6, -8, -12, -8, -4, -12, -7, -7, -8, -7, 0, 6, -6, 1, 4, 4, 3, 3, -4, 4, 5, -4, 2, 1, 7, 4, 10, 8, 2, 10, -3, -8, -6, 7, 2, -8, 1, -5, 4, -9, 7, -7, 0, -3, 1, -4, -4, -1, -5, 3, -4, -6, 6, 2, 10, -1, 5, 0, 11, -1, 3, 4, -3, 10, 12, -2, 0, -9, -1, 2, -3, 11, -9, -4, 2, 0, -9, -2, -2, -2, -12, 6, -8, -4, -6, -4, -1, 4, -5, -3, 3, 6, -5, 6, -7, -3, -4, 2, -5, 3, 0, 1, 7, 4, 10, 4, -8, 9, 2, -10, -6, -2, 9, -3, 1, 5, -11, -17, -8, -2, -4, -11, -9, -17, -10, -9, 3, -10, -3, -9, 4, -13, -4, -2, -9, -1, 5, 5, -7, 1, -7, 11, 8, 10]
7791A0qPnPj6J7j5J0j4J2j4Pj2QlQlknJJpMnJ1%KnJ4m%OmmoNPLj3ORNok%mj0M
7839cJ0mm%Loj0J1LJjqjjJJmMKRj0%NLJj4KLJ3%mlmRMrJ%LJokM%%nPjLj4NKpm
7893a4OJ1j3KKnMpJ4pK%J1pKMPnlJ1j0lPlOj3K1j7LKqnJ0pKNnJnjokJ3mKqPjl
7942gKJ0omPNrjPjKNj3Ok%Oj1J3j0NRmLopNj2jNKpM%NkoJKqJ6qLnJ0J0j7Ol%L
7993BRj0JMjj0KRRj6LjJO%j6KNl%Mj6RjLRj7K2j3JJj3RPj0PNj4RLllPj%MLlqN
8043BjJ1Jj2jMj2J4m%lnKKPrOoQj6J0pkK1j3Pj2PMK%j0K3j9KPJ4j3kQorPjn%J2
8090A3j5lRLppNlj%Rj7J9pK%pM%lQloJ0NpLj3K2j5MoJ3rPJkknRKnOj7J7rMk%j
8140CmKnpJ6qPj0ML%j0J1lQrkJ7q%NLj0Nj3K1rRlpQmj0LpJ0Oj6J4j1oO%LloMj4
$$ y = [10, 2, 9, 4, 11, -5, 12, -3, 7, -7, 5, -9, -2, -14, -6, -9, -1, -4, -6, -11, -10, -9, -16, -12, -17, -6, -6, -4, -9, 5, 1, 1, 7, 3, -1, -7, -2, 5, 8, -5, 1, 10, 15, 9, 7, 7, 3, -7, -3, 7, 3, -1, -1, 2, -4, -14, -3, 0, 1, 0, -8, -9, -10, -9, -8, -12, -8, -6, 3, -7, -7, -2, 1, 2, -12, -10, -7, 6, 6, 2, -1, -5, 4, 8, -1, 0, 0, 3, 4, -2, -4, 0, 0, 0, -5, 2, 1, 4, -10, -5, -3, -10, -14, -8, 3, -10, -8, -6, -11, -7, -14, 0, -7, -5, -5, 6, -1, 1, 5, 12, 7, 4, 15, 5, 2, 9, 6, 12, -1, 20, 3, 6, 8, 0, -5, 5, -2, 0, 5, 0, 1, -4, -5, -11, -13, 0, -4, -2, -10, -3, -4, -7, -5, 5, -1, -5, 2, 7, -2, -3, 4, 3, 5, 10, -3, 3, 1, 1, 7, -4, 9, -1, 4, 13, 9, 12, 6, -1, 4, -8, -9, -4, -2, -9, -5, -5, 0, -2, -8, -7, -5, -13, 3, -5, -2, -7, 3, 13, -4, 2, -1, -1, 2, 11, 1, 2, 6, 5, -5, -3, 6, 15, -1, 2, 1, 2, 8, 8, -8, -6, -1, -4, -4, 0, -16, -7, -8, -5, 4, -13, 9, -4, -3, -2, -15, -6, 1, -9, -2, 3, -11, -2, 1, -2, -5, 2, 1, 1, 5, 8, 5, -3, 2, 1, 12, 13, 1, 0, 4, -8, 6, 2, 2, -1, -6, -4, -2, 5, -4, 2, -4, 4, -12, -2, -9, -11, 10, -3, 4, -8, -1, 3, 5, 5, -5, 18, -1, 1, 8, 22, 9, 7, 15, 9, 0, 7, 6, 1, 1, 13, -2, -5, 4, 7, 0, -7, -2, -5, -6, -6, 3, -14, 5, -2, 0, 0, -7, -3, -3, -6, 2, -1, -7, 3, 8, 1, 4, -9, 13, -2, 2, -4, 9, 0, 7, 8, 6, 4, -1, 8, 10, 5, 11, -6, 11, 2, 6, 4, 4, 3, -1, 1, -4, -11, 5, -3, 4, -6, -2, 1, 1, -9, 2, -1, 7, -2, -4, 13, 5, 5, 10, 13, 3, 8, -5, 16, 7, 16, 13, 6, 14, 10, 0, 3, -4, 6, 12, -4, 10, -1, -7, -1, -1, 2, -1, -7, -3, -17]
8188a7J9oQ
$$ y = [-17, 2, -4, 4]
8191D
$$ Imaginary data points
##PAGE= N=2
##DATA TABLE= (X++(I..I)), XYDATA
0@%%%%%%%%%%%%%%%%%%Qj6J6j6J6j6K4l2L2l3M1m8N6o5P3q5R4j05J20j36J52j69
40h9J86k07K31k56K83l11L45l81M18m61N08n61O19o82P51q31R23j024J143j284
60f80J452j654J904k227K658l267M197n811R385l0923K0616O4546n5741n0419
74d5964L0396N0529j7641l2846m574J8397J7642M903l1677k3621L6257M3662l8858
87F605n5985L3852O4605k7367o4002J6761N7847p345m4135k204K7003Q389o534
100G490j2452j3389J2560L1853j0369m5693N755N4540o51n6982m416N3743P907
113B9896m4978r320L2465Q113j7662m599K525p00J1427O864k2893j2912L0866
126I092J7675l5047k0360L5562K0381l3006j7650K8082J2458k1770n467J4990
$$ y = [0, 0, 0, 0, 0, 0, 0, 0, 0, 0, 0, 0, 0, 0, 0, 0, 0, 0, 0, 8, -8, 8, -8, 8, -8, 16, -16, 16, -17, 24, -24, 32, -33, 40, -45, 49, -56, 64, -72, 80, -89, 97, -110, 121, -135, 148, -163, 182, -199, 219, -242, 266, -295, 324, -358, 393, -438, 485, -539, 604, -680, 772, -882, 1022, -1205, 1453, -1814, 2383, -3428, 5957, -24966, -4350, 60196, 4455, -45964, -15568, 34961, 17320, -15526, -20100, -1703, 15939, 20842, -10835, -34456, 1801, 45463, 6605, -49380, -15528, 49077, 21710, -42292, -25531, 32316, 24971, -19164, -21368, 5635, 14024, 7490, -4962, -18351, -5791, 26062, 15693, -30000, -24245, 30295, 29644, -27338, -31754, 21989, 29896, -15082, -24402, 8063, 16176, -1486, -6085, -3560, -4260, 7167, 14031, -8862, -21774, 9092, 26767, -8280, -28640, 6922, 27303, -5703, -23353, 4729, 17187, -4583, -10050, 4940]
138D940k341q375R922K510j6371K543K0890o666k2918J0019K2365j2772j9439
151a5693J5084J4677j7057q820J8621K572j9608L175J9728p919j8661J1194J6129
164A3422j2881j2057J3106O474j2149L08J0559p704q778J5079P190k1497n975
177a4903K6207N273k8499m886K7943M509k4454l832J8310K495j0262l13J055k812
191d169Q140O711j6331j1033K2516J5233k6056j8604K6525K0627k3978k0691J8882
204b228J8470j1859j3897L966P316L805P88j0487r584J5336J8051j7800k5167
217b3290J7690K9959j5273l1719J0992L0020n708k4976K67J7009M481p029p842
230e419l883R428J4467r043k3495O966K9940l595l3051l51L2560M188k8575p198
$$ y = [4940, 2599, -5776, 4146, 6656, -9715, -7172, 13718, 7052, -15866, -5847, 16518, 3746, -15693, -609, 14068, -2989, -11809, 6812, 9384, -10224, -7049, 12679, 4760, -13901, -2707, 13422, 541, -11516, 1590, 8064, -4085, -3777, 6782, -922, -9700, 5379, 12569, -8928, -14903, 11304, 16577, -11922, -16808, 11135, 15644, -8810, -12642, 5668, 8163, -2099, -2412, -1357, -4169, 3971, 10682, -5649, -16682, 5834, 21067, -4989, -23593, 2932, 23559, -419, -21110, -2228, 16242, 4383, -9514, -5548, 1768, 5573, 6361, -4126, -13710, 1626, 19677, 1877, -23290, -5600, 24359, 9086, -22633, -11641, 18379, 12671, -12305, -12038, 4971, 9452, 2423, -5419, -9302, 126, 14593, 5550, -17945, -10979, 18961, 15366, -17685, -18036, 14524, 18712, -9863, -17061]
244a7061K1637Q844j2639q796K655P008P127l745j5671o20K2061N371k5757r770
258a9356K6446J3170k4278j4987J9717J4856j3430j2699O324Q740P52l374p011
271e130k638J1781Q659j4736j3814J5677J7488j4856j9144J2581J8546r406j5847
284a0839N887J1284k492n593l08o36K300O622l403j1653L749J5256l504j7052
298a0382L000J6990k456j5172K146J1977k170p864K544L415l278R72M045m803
312a036m671P696M947r592m748J0432L854j0305k337R422K80q001K042O357m373
327c3m602O407K955p816j409Q414j0q017J334O752k674m684M023K104n430O83
343b003O703l264p830N320Q594o628q875P069Q415o628p153N425N075l682k324
$$ y = [-17061, 4576, 13420, 781, -8015, -5360, 1648, 8775, 5030, -10641, -11261, 10800, 16171, -9586, -19356, 7090, 20260, -4018, -19005, 712, 15568, 2138, -10561, -4237, 4503, 5255, 1881, -5130, -7768, 4013, 12672, -2064, -15878, -201, 17287, 2431, -16713, -4132, 14414, 5008, -10839, -4952, 6332, 3840, -1753, -2061, -2697, -397, 6225, 2822, -8831, -5082, 10174, 6670, -10382, -7382, 9608, 7152, -8020, -5874, 6103, 3933, -3931, -1387, 2028, -1250, -278, 3767, -1036, -5707, 1989, 6936, -2656, -7404, 3028, 6882, -3423, -5760, 3662, 3942, -4059, -2017, 4340, -33, -4635, 1772, 4727, -3089, -4498, 3916, 3906, -4111, -2777, 3975, 1301, -3383, 640, 2744, -2686, -2003, 4700, 1436, -6394, -1074, 7520, 892, -7983, -914, 7501, 873, -6280, -855, 4220, 538, -1786]
358a786J757r89J72M490j714p757K679J0539k994j2405K678J3067j820j2424O77
373e830J0429M81p276j445L289J911J147j800n468J019R215K70j1967j878J3386
388E483L519j3310m846J1785N638r013n633N370M797j290l113k761P84O228J927
403E565q791m685J0213P058j0402q765R388R474p381r119M738P633j791n225j033
418c123K118L417J362n050m737N853P679n792r762M978J0779l621j0571J953R204
433D687l01o868j101L812K053m44k440k916K247N781j625p868O75R043L33r171
449d103j218Q337J806o676j970M468J739k004r97m83J8K675J115m359k162N389
465A575K980n786l462N577L456m892l017L851K143k641r57J377l86k59J715o63
$$ y = [-1786, -29, -1018, -846, 3644, 1930, -5827, -3148, 7391, 4397, -8008, -5330, 7737, 5917, -6507, -5830, 4599, 5080, -2196, -3641, -352, 1559, 2706, 906, -4562, -3543, 5672, 5942, -6025, -7903, 5483, 9002, -4308, -9154, 2631, 8269, -744, -6377, -1007, 3790, 2500, -613, -3374, -2590, 3638, 5565, -3226, -7911, 2302, 9360, -1042, -9807, -419, 9055, 1674, -7445, -2707, 4926, 3135, -2090, -3123, -1005, 2412, 3774, -1276, -6013, -160, 7519, 1727, -8035, -3057, 7722, 4101, -6470, -4517, 4687, 4386, -2482, -3583, 229, 2282, 1838, -602, -3518, -1271, 4510, 2885, -4983, -4308, 4735, 5068, -4103, -5321, 3016, 4822, -1854, -3824, 644, 2383, 379, -618, -1101, -1083, 1592, 2707, -1652, -3814, 1575, 4555, -1231, -4693, 884, 4340, -552, -3569, 282, 2425, -216, -1173, 204, -182, -441, 1274, 611]
481F11k818J324L606j757l905J967L783k036l207K052K313k050j178K038j2k039
497a308J102K000j977j899K515J693k761j286K628P04k253N8J675r16j018J815
513G72M02k647J38L298m96l673O90L703p07l338O22K588m71j550L43K87k84J037
531G14L13k291m87L287P67l936j097M165J359l898j566L246J584k214j360R51
547d63R36L68k66j579n26K571J375l207k159L442K751l278l079K725L064j913
563G62k686R18J952P6r86r85j58J667J342k103k390K223L212k021l678J606L756
580B507j005l395L50K685K78j668p86M81J121P46j228j859J097K727p98l316M11
597a652L471J7l276m31K733O97j899q49R33Q15R0o09j022L02J780R6k290m80K527
$$ y = [611, -2207, -883, 2723, 966, -2939, -972, 2811, 775, -2432, -380, 1933, -117, -1295, 743, 731, -1308, -206, 1794, -183, -2082, 433, 2126, -635, -1921, 707, 1411, -842, -784, 891, -25, -1043, 772, 1174, -1473, -1335, 1963, 1467, -2206, -1516, 2187, 1480, -1858, -1236, 1352, 881, -669, -326, -39, -323, 714, 1027, -1264, -1751, 1536, 2303, -1633, -2730, 1435, 2794, -1104, -2670, 576, 2160, -54, -1414, -463, 473, 841, 575, -1004, -1530, 1041, 2416, -791, -2950, 492, 3243, -35, -3114, -389, 2675, 762, -1924, -1006, 946, 1022, 36, -949, -1107, 560, 1902, -201, -2591, -368, 2844, 823, -2855, -1249, 2507, 1502, -1893, -1543, 1142, 1420, -248, -1034, -553, 568, 1314, 86, -1773, -676, 2051, 1253, -2063, -1652, 1819, 1836, -1440, -1871, 862, 1559, -340, -1189, -256, 559, 649, 40, -982, -680, 1100, 1196, -1094, -1574, 953]
616I53Q14k468j006K161J060j665r62J047O88l87l31k26j19P63N38j158q96J368
634A74J149j417j251J319J206j118r81Q48O64n46k53K69j81l3N68j53q89K95J061
653G31l54j132L82J043m01q36M19N15m31j94M85j60n14M59N44o60n32P73M96p82
673a49l79O83K50n26j5L04k18j04M90j26p29K95R05l90j030M10J031l87r38K96
693c27P13j55m32K7N7Q6L38j53o95J95J001j71j200J27J287l1j218p2J023J75
713E75p09k48L17K71R1k33n27J40Q80j4j162j30J295K63j293l92J154M79r04m82
733f29N60M25j40l14k50J50O33N1r37k56J131M52j195o18J138P11r75p12P02O19
753E46l64m58mK34L24K8o04l04Q18N51r28p31R30Q45q26q61O56P95m48o09K14
$$ y = [953, 1767, -701, -1707, 454, 1514, -151, -1113, -66, 622, 235, -96, -322, -441, 322, 860, -298, -1194, 174, 1323, -94, -1345, -26, 1180, 62, -919, -71, 593, 47, -206, 63, -118, -151, 417, 264, -625, -330, 731, 377, -755, -373, 670, 269, -567, -148, 367, -64, -258, 227, 67, -447, 12, 556, -104, -636, 137, 633, -149, -528, 155, 405, -121, -136, 168, -50, -154, 336, 210, -519, -224, 681, 291, -739, -329, 702, 315, -623, -327, 386, 231, -201, -174, -117, -31, 307, 154, -541, -346, 655, 484, -716, -589, 698, 667, -551, -623, 400, 575, -134, -382, -65, 206, 297, 64, -463, -323, 557, 543, -619, -749, 546, 809, -484, -876, 278, 757, -147, -629, -69, 356, 216, -98, -348, -198, 435, 486, -451, -707, 424, 876, -319, -937, 201, 912, -63, -775, -73, 546, 182, -276, -280, -46, 278, 306, -298, -602, 216, 767, -161, -892, 38, 883, 57, -804, -148, 647, 199, -410, -196]
774a96L55L0q8k23k22L84N02n19p09N54Q66n73r05N03Q58m29p04L19M99j83k39
795a20Q8m8QL27p3n52J38P30k01q09K26Q09k43p54K70N98k75m25K96J72l05M6
817i7K97k56k79M33K15n34j42N98L9n90Q1N63k09m70L32L83m47k44N38J15n77
838b51PN68j45m81K30L37k98j73L67m6m23K55M59m64m77O30M49p12m34P62L74
859E34p19k72N94J43l90QJ71j82P7L75l15n59N25P02o60q16P26Q60p20q21O14
880a25P03m53n25K67K47l7O0j52m04L35P28m65r99N20J203n18j269M37J242l26
900D69j067J64P71j2m02j08n3J93N14k34r48K45J266j71j484O8J552M4j459j32
920g84J215K28q50k33L76K15J21j11o02k0J002J95j325l75J493N18j510o29J369
$$ y = [-196, 159, 189, 101, -122, -344, 40, 542, 23, -686, -132, 734, 161, -744, -241, 617, 188, -516, -197, 302, 119, -120, -32, -80, -72, 255, 182, -370, -232, 498, 297, -512, -286, 523, 280, -474, -204, 394, 119, -306, -10, 162, -143, -97, 200, -56, -335, 98, 313, -221, -363, 235, 274, -316, -235, 328, 119, -351, -19, 364, -83, -327, 211, 326, -251, -244, 324, 179, -302, -72, 265, -33, -206, 161, 115, -308, -53, 406, -58, -535, 95, 544, -168, -602, 160, 534, -185, -457, 137, 280, -110, -102, 69, -113, -36, 339, 24, -535, -10, 692, 32, -784, -58, 802, 82, -739, -125, 578, 125, -400, -133, 114, 77, 137, -15, -419, -84, 644, 179, -820, -300, 903, 385, -884, -447, 795, 469, -598, -434, 337, 325, -77, -185, -238, -45, 469, 235, -713, -468, 798, 627, -857, -789, 763, 807, -652, -784, 431, 659, -191, -424, -48, 167, 288, 177, -425, -445, 557, 752, -573, -948, 545, 1063, -447, -1076, 293]
939B93O45j105o00P52M33l06k31j07p3N15L75q43o50J080Q94j185j039J170J101
958A119j048j026Q56Q35n88n37K91J72k8K45k40o28M14R76n59j222O16J330o15
977C63j322N94J153n24q79M29N42l64j34L04k61k49O31J89r22j13J119L8j207
996f13M4J189j57j063K83Q62m03o16N25L13o19l3O86k50o73M80O25o65n09P98
1016B04L22q89p0R19j92q87M41Q40o76p35Q34N88r03m19Q80K12p98K9O12k98l55
1037c41N53J09q31J55J062l86j222N53J306o19j287O32J159n72q91M54N37l06
1055F5j04J66l94l3Q56l9j291O1J609o4j768jJ760P0j583j42J238J61p49j22J71
1076a33M2M20J18r73k99J420N47j730p34J837Q91j748r73J490R24j064p60N55
$$ y = [293, 938, -167, -767, -15, 418, 112, -119, -226, -299, 216, 591, -252, -902, 178, 1072, -113, -1152, 18, 1119, 71, -955, -99, 736, 148, -389, -98, 74, 46, 291, 51, -577, -163, 813, 254, -968, -352, 978, 363, -959, -365, 788, 264, -615, -186, 356, -8, -142, 162, -99, -348, 283, 472, -450, -563, 556, 594, -613, -569, 620, 463, -600, -317, 545, 142, -474, 51, 364, -255, -288, 398, 148, -525, -45, 580, -85, -594, 204, 526, -363, -433, 486, 294, -593, -152, 688, 12, -723, 111, 699, -204, -623, 257, 469, -329, -300, 312, 14, -341, 212, 321, -510, -355, 707, 321, -901, -348, 958, 339, -948, -316, 843, 271, -620, -166, 371, 65, -39, 127, -267, -300, 556, 517, -774, -713, 896, 832, -936, -937, 823, 893, -690, -832, 406, 567, -182, -304, -133, -91, 329, 447, -526, -825, 595, 1142, -588, -1322, 515, 1406, -342, -1315, 175, 1099, 35, -725, -170]
1094a70M54j7o9n09l73R26Q11j214j224J354J518j335j667J169J662q84j461N31
1112d98J095j69n71j55m1M26O51n81j208O25J650n62j932M31J997k56j861Q1J523
1131F45O2j030j36M29J34J95n4p88o1J260K27j590l87J752N00j707n68J525N25
1150I33j200l87P72J87l18P3j31l72N13O32p82q70R62J010j037j042J005R71r03
1169A6p59P59M78n87j12M11k42k83O02J38q78j0J055r5j116J85J045k91q92L92
1189a84O62n21l72O40P2p42J87Q12m15q16N62P65o35o13O53L99o22j02N38j89
1209G9m68N23L89q06l32J031K79j164k29J155J90j027j48Q02M3m71O5J18k38K50
1229D1M29n89o22Q41Q04r86r42J023R90r27r36P39P84m81n10J82J59J07K31l37
$$ y = [-170, 284, 267, 198, -311, -684, 242, 1053, -161, -1385, -31, 1487, 152, -1515, -346, 1316, 432, -1029, -498, 597, 428, -143, -298, -339, 87, 738, 157, -1051, -426, 1224, 662, -1270, -839, 1158, 902, -959, -878, 645, 707, -323, -459, -30, 104, 299, 245, -543, -604, 656, 883, -707, -1094, 658, 1158, -549, -1117, 408, 933, -267, -654, 118, 305, -13, 60, -71, -443, 70, 702, -80, -950, 12, 1022, -15, -1057, -52, 919, 16, -743, 16, 494, -93, -205, 206, -36, -319, 283, 421, -457, -467, 588, 493, -623, -438, 607, 316, -576, -184, 478, -43, -415, 225, 297, -445, -258, 554, 139, -677, -115, 650, 15, -598, 55, 454, -168, -270, 268, 79, -389, 134, 523, -283, -615, 416, 695, -469, -698, 457, 647, -380, -528, 274, 317, -154, -89, 29, -209, 41, 470, -119, -741, 100, 904, -82, -1024, -1, 989, 62, -874, -135, 649, 168, -342, -160, -1, 106, 337, 0]
1249@o37M91J007n53j286N22J444m26j457K73J302q3j017p7O04J99j16k48l74
1268d32K26Q41j42j213k2J453J94j515l82J429M92j161n57P90N16l41l98j02J88
1287a36M95J11q41m04J066O59j124q63J071R78q94r71O37Q44l28n99L6K54K13
1306B04J31m27m80N18P99n37j023M65J139l63j135K18R91p7p43k4L96J11n7r9
1326Gl04O5O11J2q13j04R24K08r32k63Q36K79o42k53M21J47j69jo8j73K53L39
1348C80l99m73M54N49m55n76M09N36l48l81K42K03j60nJ10k19m7M02L6n31m3N98
1370B82P6n96r3N20P5l78l3J96k6j7J26j59k22K82L32l67m36M04M80l63m80K68
1392a29M26j64k98N4J39L8N4j13k51J41M34j38n54Q3O18mo21o0N15J35l77j71
$$ y = [0, -637, -146, 861, 308, -978, -456, 988, 562, -895, -622, 680, 597, -420, -497, 107, 306, 190, -58, -432, -206, 635, 493, -720, -742, 711, 905, -610, -992, 437, 929, -232, -789, 1, 517, 176, -222, -324, -136, 359, 470, -371, -775, 291, 950, -174, -1037, 34, 1012, 118, -853, -216, 628, 300, -299, -263, -9, 204, 335, -92, -572, -54, 745, 208, -815, -350, 789, 426, -709, -491, 500, 423, -320, -344, 52, 163, 106, 7, -297, -232, 379, 391, -422, -526, 398, 606, -326, -589, 247, 526, -116, -369, 52, 199, 30, 29, -39, -212, 41, 380, -19, -492, -38, 511, 56, -520, -111, 425, 77, -304, -62, 141, -19, -24, 86, -133, -180, 222, 258, -273, -316, 282, 358, -238, -331, 189, 264, -114, -147, 49, 23, 6, 132, -27, -249, 33, 365, -2, -438, -34, 446, 83, -397, -129, 297, 133, -165, -111, 28, 66, 120, 7, -244, -103, 331, 193, -361, -278, 340, 336, -285, -345, 170, 305, -72, -243]
1414b43J82J84L2j37k34O5L99M2n06j52N50K67n28l38M26L91l07l74J24L16L8
1435A97k07j92M8L10J10l72k72L66M00l18m82K27M97j02m48k2L40J51k03k07K7
1456a52K50J38k21k85J69L96r8m30pM35R4l74j77K59K11j29k16k1J96J35j28k43
1478a98M4L08M5l12j39K72K10k11k37J17K43j1k00q4J41J50m2k05m1K07J26j80
1500Cj81J27J97l3k09l2J50J12j00j58K9J74M4j61j14J36J65p5j90J3J65O5j39
1523a2j15O2J50J4j59q2J46J47j11j98P1J94j1j85m1J42Q7o7j11j0J21R9j08j66
1547a43Q0K20m4k39%K30M8j94q7J30J09o2j08j1P4Q4m7j55kK00O4k40r7K21J36
1572A67k04j28J53J28j03r5L0P3L0j0p4n9J28J20j73j35J62J86j72j86J44J95
$$ y = [-243, -61, 123, 155, 18, -216, -151, 248, 290, -216, -368, 182, 449, -79, -417, 9, 400, 93, -281, -157, 159, 197, -10, -202, -154, 156, 266, -106, -378, -12, 388, 70, -412, -185, 312, 210, -238, -260, 80, 231, 28, -179, -152, 98, 236, 15, -270, -101, 295, 197, -233, -240, 195, 289, -85, -262, -3, 208, 79, -137, -158, 38, 173, 45, -198, -154, 154, 199, -113, -252, 20, 230, 19, -218, -101, 142, 131, -69, -153, -12, 138, 96, -109, -150, 57, 183, 3, -178, -51, 146, 113, -96, -128, 22, 134, 34, -124, -95, 79, 123, -38, -152, -16, 149, 74, -116, -103, 62, 127, -12, -127, -65, 85, 99, -60, -142, 4, 151, 40, -158, -87, 107, 96, -89, -130, 12, 99, 32, -79, -89, 32, 131, 23, -143, -63, 157, 113, -126, -126, 104, 152, -42, -129, 1, 110, 48, -60, -71, 3, 87, 40, -115, -117, 83, 147, -93, -190, 31, 167, -37, -165, -12, 116, 13, -82, -52, 21, 51, 41, -33, -92, 36, 156, -17, -152, 10, 196, 24, -162, -18, 177]
1594A77j46j60J04R7m9n7J9k6K7Q3m8j49Q2J85r2k22J01K33r7k23R0K01q8j49
1618a07R2O7n3j5M8n2l6J25J1j75oK33j9k64L1K66l5k52M6K17o1j46O0P6o3MO1
1645E3p6p8J68O0k17o1K67N2k89o0K87L1k42j5K00k0j34N9N5q4K3J10q7j50J71
1670B3J55k03j63K37J49k36j35K29J02k10l6J66k0j22O9P6j49j3J76l8k08Q0K21
1693A50j09k33J53J87j73j33J89Q4j99KJ89n4j67J04J49j52j09J86O5k06KK05
1715A30p1j84J30J51j76j29K25Q2k58m4K57Rk56L1K03n6j38R2O1j23K8J46j10
1738@j63J71J94k32k07K72K19k92j82K50J56k06j01J25L7n0O3m0j43R3K36j45
1760E5l15J99L51k00l74J62L62j18l07P2K10k6q4k1m3L8J86m7l17N5L95k2m53
$$ y = [177, 31, -129, -25, 72, 23, -34, -15, -41, -14, 69, 21, -128, -46, 139, 47, -175, -74, 159, 62, -161, -71, 130, 42, -107, -15, 52, -1, -16, 32, -20, -56, 69, 80, -95, -101, 132, 113, -151, -120, 146, 111, -141, -95, 122, 61, -85, -25, 51, -12, -8, 53, -23, -101, 67, 127, -90, -151, 116, 168, -121, -181, 106, 137, -105, -120, 80, 60, -74, -15, 40, -44, -21, 89, 2, -148, 23, 178, -25, -188, 49, 198, -38, -173, 56, 158, -52, -88, 78, 58, -64, 5, 81, -68, -81, 95, 57, -151, -71, 150, 41, -192, -39, 148, -25, -158, 31, 115, -84, -82, 107, 53, -114, -10, 139, -13, -122, 64, 129, -77, -75, 130, 59, -125, 5, 156, -20, -149, 76, 158, -100, -144, 113, 122, -134, -103, 100, 44, -94, -2, 59, -64, -36, 110, 0, -163, 8, 202, -30, -237, 35, 254, -38, -220, 30, 186, -20, -121, 4, 41, -9, 54, 14, -129, -36, 200, 55, -260, -61, 290, 90, -284, -122, 240, 122, -185, -113, 97, 71, -13, -34, -77, -39, 147, 100, -217, -162, 233, 211, -242]
1783b42j6M60L9m22o7L41R2k05r2O7M9R5j3k14n2L32J15m07j70M27K28m03k57
1806c15L37K43k48j98J32J27j9j9j12q1J91J84k55k86K87L52k74l82K26L76j71
1827I5l02R1K36k8r9k8l0M9J72o7k77O4L65o3l90L2L78pl41j0K58J0j59PM0k8
1853c2O7N9j74r3K42J24k87j36K86J58k74j26K26R3j68k4R3n6k3J29k7j94Q5K34
1877A82r5k67R7K60r5k14R4J35r5n1Q0k3j04J22J17j97j17K30J38k63j31K41J30
1900A74k19q1J32M5o5M5k5j08P2J83j23k49J56K94j47l13J39K78q9k39O2J48j2
1923E8m9j6q6N2K10n4k96L1L60ll89m5L81P2l29j06K39R5r7r5m1O4J64Nk72p7
1949b24L47J50l77k00L51K53k93k70K29K32j01j96oJ12J05J1j82j44K52K24k56
$$ y = [-242, -258, 202, 241, -181, -248, 93, 185, -20, -112, -45, 4, 99, 86, -128, -180, 152, 267, -140, -310, 117, 345, -58, -315, 22, 265, 17, -181, -49, 78, 59, 40, -72, -153, 38, 222, -33, -319, -32, 320, 46, -336, -110, 266, 95, -207, -116, 120, 92, -7, -35, -65, -16, 156, 89, -188, -124, 241, 178, -212, -180, 198, 191, -150, -160, 98, 108, -51, -44, -4, -32, 35, 94, -80, -173, 69, 193, -94, -230, 56, 214, -60, -186, 40, 133, -35, -59, 34, -22, -45, 84, 57, -137, -52, 182, 87, -180, -83, 177, 82, -132, -38, 97, 2, -49, 31, 8, -96, 26, 143, -54, -171, 59, 197, -66, -197, 44, 174, -45, -126, 6, 51, -14, 31, 6, -102, -30, 153, 30, -219, -63, 231, 84, -229, -90, 188, 99, -140, -78, 70, 58, 9, -7, -93, -41, 169, 115, -181, -150, 210, 207, -182, -227, 154, 226, -103, -209, 30, 125, 28, -67, -108, -44, 120, 125, -147, -224, 123, 273, -104, -304, 47, 300, 7, -263, -34, 198, 97, -99, -105, 7, 112, 123, -59, -203, 49, 273, 17]
1970A7l20K39L64j94l70J17L35n5k41k5J22R2qj11j33J26K59j25l39Q7L87l4l88
1993a98j1L41P3k90p6J82Q3n3o5p4L1J76K7k55p9K96J36l27j60K84J80k36j60
2016a75J58J16p2m9j1k1Q1R7j25j82J63K17j63k52J54K44j18k09Q7J38m8o2L1
2039ak9j8J16J7j72l7K31M1k40n0K43L9k00k2J31Np1M6j7p8P2J21j29j73J62J88
2065A75j64k02J46J89j11j52Q7O3k9J0Mr9K0J85l7k43L6K78qk90jK73J6k08m5
2090a07J33M3k8l6n7j5J71M4k51r7K91J39l13j67K78J82k21j86J47J40m4q1m0
2113g5PJ24Q6j97j67K30K57k20l10K06L20j54l13R3K62k0j75n3P9Q4O3j15j88
2136a76J12K86j05l45M7L88j2l68l3L15O4k22r0J21P8K1p2j31K1K35L3l21p6L41
$$ y = [17, -303, -64, 300, 106, -264, -147, 188, 133, -108, -133, -11, 81, 73, -38, -171, -45, 214, 89, -250, -163, 224, 190, -198, -209, 132, 205, -85, -161, 21, 104, 51, -14, -88, -57, 119, 146, -109, -188, 108, 244, -83, -243, 41, 221, -15, -175, -17, 99, 27, -22, -33, -54, 27, 124, -1, -183, -20, 197, 34, -218, -64, 180, 62, -147, -60, 78, 30, -32, -1, -30, -48, 68, 85, -87, -124, 107, 148, -92, -142, 101, 140, -60, -82, 49, 54, -17, 29, 12, -66, 6, 127, -2, -175, -13, 175, 11, -191, -45, 144, 33, -119, -32, 31, 2, 12, 16, -83, -63, 122, 85, -158, -122, 156, 148, -142, -143, 130, 146, -62, -107, 26, 69, 41, 5, -52, -67, 104, 148, -103, -200, 91, 230, -83, -250, 28, 210, -11, -197, -50, 90, 46, -35, -75, -68, 56, 142, -55, -222, 8, 265, 45, -265, -59, 261, 107, -206, -113, 149, 129, -46, -99, -20, 64, 127, 12, -176, -64, 222, 117, -228, -181, 207, 195, -173, -206, 109, 173, -49, -139, -18, 60, 81, 9, -122, -101, 134, 167, -154, -230, 111]
2160A11J49l62j69L22J65k33j50J45J17m8n8m1k1J36R0j92j67K24K36k28k65J98
2182d1K60j56k34J05J81n2j14QQK4J00n3j91N1K48l6k79K7K89k2k45KK06j0j21
2207d5K4L7m8O5N6j16r8J80J19k20j30K34J25k07j11J64P1j23k0N6m1k9J30k6
2231D7j73L3K36o9k38O3K40o2j98N3J40l5p9M7j1o1J23O6j76q8K27J02k54j25
2255a92K48J28k06j09J42P5p8j9ok8O2J07j34j73J68K22j77k55J56K74j28k38
2277a61P0K02l6j16j2J8M8R0o6j87O5K79m8l40K0L57J3l24n7K81P7j95q2P6P4
2302D6N5n4j45j4K41P1l19j29L30J92l31k21K70K19j81j96Q2J46Ln7r1m2J69J26
2326A70k02k20K37K81k12l19J58L26j05k77M4K07J9j04n6j8R6J26r1k38Q0L00
$$ y = [111, 260, -102, -271, 51, 216, -17, -167, -22, 95, 47, -11, -52, -73, 63, 153, -39, -206, 18, 254, 26, -239, -41, 219, 63, -171, -66, 115, 63, -51, -43, -35, -11, 89, 36, -155, -104, 144, 108, -171, -144, 145, 123, -122, -120, 86, 76, -45, -21, 16, -32, 33, 89, -27, -125, 55, 174, -46, -176, 58, 183, -24, -135, 29, 100, -23, -43, 13, -28, -57, 73, 47, -126, -93, 143, 74, -164, -101, 139, 77, -121, -68, 72, 37, -42, 5, -6, -67, 56, 122, -54, -142, 85, 187, -67, -192, 56, 184, -22, -131, 11, 86, 8, -11, -17, -45, 17, 124, -10, -183, -15, 207, 30, -225, -69, 205, 77, -161, -91, 111, 75, -41, -53, -35, 13, 103, 37, -150, -85, 194, 146, -194, -174, 183, 196, -128, -185, 96, 173, -22, -104, -28, 46, 101, 47, -98, -112, 129, 200, -119, -248, 82, 274, -57, -278, -8, 211, 30, -166, -84, 62, 65, 8, -83, -125, 44, 170, -32, -252, -15, 266, 54, -265, -107, 219, 114, -163, -119, 88, 107, 3, -53, -71, 25, 151, 60, -178, -98, 202]
2348B02m5l42j0L43N4l22o1K27P9j30q3L9L1R6oj67o3K30J27k72j45K60J76k29
2372a1j74J80J54j06j25N8K9L8M0q0j15R8J84j20k49J19K69q9k56O5K04l1j45
2395f3J7M6nM8Oj15m5J87N9k26p7K33J03k19j04J80P5j06m4L7RJ8P1q2j25J11
2421a1J85j43k05J33K29j11k26Q3J70l2j08j0L6L0M8l8j64M1K39k9k66j7K97K9
2445A60k70o2K21Q8j47p9M1O5N3j9j44l7K17J00k40j58K58K02k35k12J58K28r4
2468I4j90J9J09P2m1j27o6J58J63j87k39J58K95j14l17N5L01Nk37o1J66Q2n2j04
2492e8o1R9J71o3k54L2L08K7l34p0K92J19k36j50J65J36m8j23n2P9J28Nk19o7
2516a74K50J36k45j96K22K25j71k33J08J76qj28n1M9R4L8j34j13J30K03j27k42
$$ y = [202, 157, -185, -195, 148, 202, -120, -181, 46, 125, -5, -88, -49, -18, 78, 72, -95, -158, 72, 199, -73, -218, 42, 218, -11, -185, -5, 149, 43, -82, -24, 5, 43, 83, 3, -112, -14, 170, 50, -199, -80, 189, 100, -156, -91, 113, 82, -63, -46, 0, -5, 43, 49, -66, -111, 76, 135, -91, -168, 65, 168, -51, -155, 25, 100, -6, -50, -13, -4, 14, 85, 3, -122, -11, 174, 31, -174, -41, 188, 77, -149, -66, 104, 72, -36, -46, -10, 20, 68, 30, -134, -93, 146, 117, -149, -166, 131, 160, -110, -172, 49, 137, -10, -89, -48, 17, 70, 51, -93, -130, 87, 187, -53, -211, 47, 249, 14, -198, -40, 188, 94, -96, -77, 32, 104, 63, -64, -130, 28, 191, 4, -235, -77, 218, 104, -213, -158, 143, 148, -89, -150, 16, 98, 46, -58, -119, -20, 151, 88, -166, -134, 174, 201, -133, -203, 89, 208, -28, -178, -13, 123, 75, -48, -100, -21, 107, 112, -107, -174, 76, 212, -33, -229, -7, 218, 47, -186, -78, 98, 90, -38, -89, -40, 54, 92, -42, -155, -25, 178, 51, -191]
2538a91Q4K73m1k59LK06L6j22n7M9M7O0n2j31J4J95K7k33o2K34R4k16j17J66J08
2563A15q8r6J0N4N1Pr8p8J31J29j35j89J45J95r6j83N8J56j5j03k3M6N5L7o2j22
2589i9N6J82l3k15mK27L7k16o5J60Q5j03q0K2N8M2j2j33k3J72P0j84j28J89J73
2614A78j49j86J09J50l3j30j9Q1P6j2j10o4J29J43j19k12R0K53n8k46J3K18L6
2637A38j75p3Q1J05Lr9r7R1J63m9k20j8K57N8k48j02K21J24j38j55O8J34K3r8
2661fr6M1J63K1j84j10K03J66j79j89J33K09p8j90J1J44N0p9j06%J30P4j32j48
2685a52J12K00q4k31M0K31J4k08n3J46Q6p5q8j5R1P1n0j43K0J92K8k08n7J85J04
2710A56j55j19J15J04m5r2j1N4O1Pj14o4J39J04j32j50J03J76r4j59M2J39j5p1
$$ y = [-191, -107, 166, 125, -134, -131, 75, 111, -11, -68, -19, 28, 88, 36, -95, -81, 114, 141, -92, -154, 80, 174, -42, -159, 7, 115, 27, -69, -59, -5, 46, 53, -45, -123, 8, 137, 2, -187, -42, 153, 57, -126, -68, 88, 73, -30, -53, -7, 48, 85, 23, -99, -43, 139, 106, -109, -113, 114, 151, -65, -130, 30, 115, 12, -68, -46, 12, 54, 42, -91, -114, 58, 128, -56, -184, 5, 178, 29, -157, -48, 102, 69, -61, -80, 1, 77, 65, -45, -109, 20, 163, 44, -168, -78, 175, 117, -129, -116, 102, 138, -37, -110, -29, 76, 79, -20, -117, -26, 137, 88, -132, -150, 107, 165, -83, -185, 36, 160, 22, -133, -65, 69, 92, -6, -102, -61, 102, 123, -61, -171, 32, 198, 19, -170, -37, 172, 94, -96, -85, 59, 109, 30, -76, -76, 54, 128, -4, -152, -40, 160, 76, -155, -115, 116, 130, -78, -131, 15, 101, 26, -62, -77, 14, 85, 35, -108, -88, 104, 132, -76, -133, 52, 156, 1, -118, -3, 101, 56, -36, -47, 7, 68, 75, -39, -103, 36, 140, 8, -142, -39, 137, 43, -116, -74, 65, 50, -21]
2734b1n4L3P8K2n7j03N4J56l3j78NJ88K6j56n7J18P9q1o6J3N2M3j9r6k1J34M6
2761A05j42q6J40J13j17j29P2J15j4r9j8M1N1K0q4q2J08J29j02j51O8J81m2j68
2785i1qJ62L2r5o7L4Q7J8o6j00N2J62k5j76k8K00N1j77r4J50J09j03r2J0R1M4
2811H0o6q5RJ26M1j61q5J53J30j25j63R2J58l8j37j4J06N6n3q1j5J04R1j09j40
2836a26Q8J83o7j80J2J88J5j48o2J00Q7m9p7l2O7Q8m4j43J6J68K0j81o4J60J10
2861A29j32j10P5J04k0q2k6L8R1qj13m9J42R4j26j25R6J51p2j40L5J17Np8m9K4
2887b9O7L4q4q8P9J17m0j51J8J57Mj47k8J08N5p2n5J6N3L7l1q2PJ15J9j31n0J30
2915B8Q2j20q1P0J02m2p5j6M7N4Mq8l6R1Q7r4j14O2J37m8j37K6J01K1q1m6M3M8
$$ y = [-21, -75, -42, 36, 58, 1, -102, -48, 108, 75, -103, -98, 90, 116, -40, -97, 21, 100, 19, -47, -34, 18, 61, 42, -54, -75, 59, 105, -37, -123, 17, 130, 13, -116, -44, 71, 57, -42, -60, -19, 32, 52, -32, -114, -6, 123, 21, -130, -62, 119, 77, -91, -99, 63, 95, 0, -67, -33, 54, 72, 6, -94, -42, 120, 95, -81, -109, 91, 142, -35, -129, 21, 130, 27, -65, -55, 36, 80, 14, -71, -62, 64, 105, -56, -141, 12, 142, 17, -146, -54, 104, 66, -71, -85, 21, 77, 24, -57, -72, 32, 123, 14, -126, -38, 145, 78, -102, -90, 98, 113, -35, -97, 3, 90, 41, -36, -68, -1, 87, 43, -100, -84, 84, 104, -77, -141, 19, 129, -3, -113, -38, 66, 46, -36, -62, -24, 67, 59, -54, -103, 39, 133, 7, -118, -22, 129, 57, -83, -48, 69, 74, -4, -53, -29, 38, 72, -12, -100, -21, 96, 56, -95, -77, 80, 84, -63, -91, 17, 72, 0, -55, -39, 14, 51, 20, -62, -55, 60, 79, -52, -102, 28, 110, -10, -91, -21, 81, 39, -36, -52, -5, 49, 53, -35, -71, 20, 107, 13, -101, -39, 98, 50, -87, -61, 40, 61, -20, -66, -23, 25]
2943B5J4n5p2N1J20l2j34j3J58K8j32m6R4P2o1p8K8O8K3l8o7lJ16L5j17q8J18
2970A4J04r8j27O6J32l9j13qP7M7l1q7j2Q3P2q6j03O4J39k5j66oJ67J8j13n7Q7
2997aP0k1p7m4P8O7k3j24%J52K3j45o4J22J00j01j03N2R8pp9m0N0P9j6j05n4J34
3025B1Q3j08j14P9J26l5j43J7J09M3q4n9M4O4K4q8p2Q0J23n6j32K2J39Nj28m7
3051h7J21N2p2o9J7O1L8n2p4J9J12Oj31m1J32O1r7r7R1P4k1r4qP2L5j9p6j3Q7
3080B7O0r3q0O6J23n2j17J0J17J8r5k6L3O4j2o7l5N8R3m9j18QJ24K0j29m2R9N2
3108E7o0o3J1P6J3m6m6K0Q0K0j06l3Q7P8p3j01N9J04k3r9j4Q0N2n6o9KQ4N3q5
3137Bq4N4J16m6j16%J07M8j07n7O0P3j2q4j3N2P6m1j06QJ27K1j24o5J06J10r0
$$ y = [25, 39, -16, -88, -37, 83, 51, -83, -96, 62, 90, -42, -88, 6, 78, 17, -61, -33, 35, 58, 20, -47, -50, 66, 101, -16, -104, 14, 118, 20, -107, -41, 91, 52, -61, -69, 8, 55, 24, -63, -75, 8, 80, -6, -109, -45, 94, 69, -97, -103, 64, 82, -31, -88, -1, 69, 48, -29, -73, 5, 72, 49, -75, -75, 77, 100, -45, -109, 13, 113, 12, -91, -39, 59, 52, -27, -67, -17, 62, 46, -59, -113, 21, 104, -4, -118, -39, 87, 52, -91, -74, 35, 78, -6, -65, -21, 43, 67, -21, -93, -13, 110, 54, -78, -56, 83, 88, -40, -87, 34, 86, 14, -55, -38, 23, 61, 9, -65, -46, 66, 72, -59, -100, 32, 93, -4, -101, -10, 64, 43, -51, -59, 13, 48, 29, -47, -60, 27, 87, -6, -86, -20, 103, 51, -66, -56, 61, 79, -16, -42, -9, 55, 43, -24, -59, -1, 92, 43, -75, -67, 57, 77, -52, -94, 5, 57, -3, -66, -55, 21, 34, -12, -58, -38, 42, 62, -44, -77, 10, 88, 15, -86, -27, 77, 54, -45, -59, 21, 73, 17, -52, -50, 34, 87, 2, -82, -28, 88, 42, -74, -74, 33, 81, -26, -83, -23, 50, 38, -46, -59, -7, 69, 28, -78, -70, 57, 78, -46, -111, -5, 105, 15]
3164A5q9L1J06Mq1n3M6P7nq6l2J00O6r0j02O2J15l1j10qR3L7o3p0K6Q4Rp1o2N6
3194b6J01l3j18qJ39J8j02n7P7Q6m7p8rQ1N6o4p3L3R5Rj13m0J05O0p0q6L1R7k
3223F2q9l7O5N1k0q7QO9L9o1r4O2J02l0j07QP8M1o7m9K8P6Kp3l9O0P2l9r0J1J01
3254E3K7j02n3P4P5m2p7KP3L5p0o1M1P3lr1m1P9P1n0r6M4Q9qq1k7O1O2m5o7QO8
3286B1L3o2o2N4P8qj03j3R6K9o2o3N0O6lo6l7N8N4l9p4KJ02J5q6n6N0P3l3q4K0
3317e0P4J8n8m9L3P3op0k9O2P0o9p1L9P6J1q8k5O9M9l7o8J0Q2K7p3n0K8Q6k6q2
3348d4qP4M1o9n1L6P5k6o7j7N8N1m4p6K0P8J3q9k0N8O1l4q2J4P6K8o5m2L7O6k4
3379B8o5k1P0M5n2o4L7P2oq2j1N7N4n5n3J3O7mm6m8L8O8j8q0jP6L2o1n1N1O3l2
$$ y = [15, -74, -43, 63, 67, -14, -67, -21, 56, 51, -35, -67, 33, 99, 9, -93, -31, 84, 53, -57, -65, 28, 65, 2, -68, -42, 42, 51, -20, -82, -26, 75, 42, -76, -84, 55, 73, -29, -86, -9, 77, 30, -48, -57, 24, 80, 16, -57, -24, 71, 80, -33, -73, 32, 92, 22, -64, -33, 64, 62, -27, -64, 1, 52, 32, -55, -47, 22, 61, 0, -94, -32, 70, 40, -67, -59, 19, 60, -7, -56, -28, 48, 50, -23, -62, -2, 70, 31, -59, -48, 53, 80, -22, -75, -1, 74, 32, -45, -43, 30, 65, -5, -66, -25, 48, 45, -46, -87, -8, 63, 13, -83, -39, 50, 42, -39, -66, -5, 57, 12, -55, -47, 21, 54, -8, -70, -16, 62, 54, -49, -62, 34, 63, 1, -62, -12, 54, 51, -15, -52, 6, 60, 21, -53, -51, 51, 66, -20, -76, -26, 47, 14, -70, -50, 24, 42, -16, -65, -32, 41, 35, -35, -64, -2, 68, -1, -72, -33, 43, 54, -34, -59, 10, 59, 22, -46, -36, 46, 73, 0, -50, -22, 64, 38, -44, -52, 22, 63, -6, -57, -21, 54, 28, -39, -56, 2, 53, 9, -67, -47, 31, 44, -45, -65, -7, 54, 20, -62, -48, 28, 56, -9, -51, -14, 52, 28, -37, -58, 12, 57, 5, -59, -22, 50, 44, -38, -49, 8, 62, 7, -46, -33, 34, 30, -16, -64, -26, 42, 24, -56, -57, 19, 51, -10, -61, -10, 53, 21]
3411B1n5j1M6N0m1m5J4N6J4o2k4L5N3k9o8J2O5Rn8l8N1M7j4o6rM7M2m2n8K7O0
3442B9j0m9k9O1L8l8m5J0N6Lm0l4L2O7l6m3oO0K4n0l4K4O7k2o0rM9K7m1m4K2N8
3474C7rn4k8N0M3l1n7J2N7On2k2L0M1j7n0nO2K6m5m1L4N0Ko0j8M8K9l3l3J6M4
3506C2Pn0j1L2K9j8m6pN6Om4l2L7L6j5m6rN0J9l5m0L0L8om2j2M0L5l3l3J2M8k
3539B6l5k8L8L5k1l3kL6K2l4j8J3L9rl7k0L7K4m0k5K4L4j4k7k0M1J3j2m6J1M6
3570A8Nm4j8M1K4j0l8jK9K8l6k3K6L0pk5k0L0K7k0l5PM6j4l9nK5L0k6k1nK4K1
3603B4m4j6K3K7pl5oL2J8l2k5J8L2Kk2j3K6Q%k6J0L6Om9KJ2K7rl8J8K5Rl7j7K6
3638EJ3ll1oK3K4k9k2K3J7kl2OJ6J3k2j6lL8nj9j2K4L7l0k4J2J2J3j7j8J7L1j2
$$ y = [21, -34, -45, 1, 51, 10, -35, -21, 35, 49, -13, -37, -2, 51, 22, -46, -34, 31, 40, -18, -56, -5, 42, 28, -38, -47, 0, 42, 0, -58, -31, 29, 19, -30, -59, 2, 40, 2, -43, -33, 23, 26, -14, -48, -16, 51, 15, -28, -34, 26, 50, 0, -34, -10, 57, 35, -25, -34, 15, 42, 1, -43, -21, 37, 28, -26, -54, -4, 39, 8, -49, -37, 20, 26, -26, -48, -18, 23, 6, -44, -49, 13, 39, -6, -47, -13, 37, 39, -21, -39, 9, 38, 5, -28, -12, 32, 39, -11, -22, 10, 39, 21, -25, -32, 24, 30, -14, -46, -9, 27, 12, -34, -43, 7, 26, -9, -49, -19, 19, 13, -29, -41, -1, 34, 1, -32, -20, 28, 26, -9, -37, 1, 36, 15, -18, -20, 16, 38, 4, -14, -1, 38, 29, -8, -28, 9, 33, -7, -32, -8, 26, 12, -15, -35, 6, 19, 7, -39, -28, 18, 23, -21, -39, 2, 26, 16, -22, -23, 6, 34, -2, -25, 1, 31, 24, -1, -21, 9, 36, 16, -19, -12, 34, 20, -19, -24, 1, 31, 5, -16, -21, 3, 24, -20, -36, -13, 14, 7, -28, -34, -2, 16, -16, -41, -23, 9, 11, -11, -24, 2, 10, 10, -16, -6, 30, 36, -13, -11, 1, 28, 19, -19, -1, 24, 33, -4, -21, 5, 18, 15, -16, -22, 1, 25, -4, -26, -3, 14, 12, -20, -14, 2, 15, -7, -23, -26, 12, 7, -12, -24, 0, 37, 7, -17, -5, 7, 20, 3, -15, 2, 33, 21]
3672B1k7nK6J1j9j8J4K6km0nK4K2k3k1QJ6Pk7j0K2Jkl0J2K8J6m0qRL1pj6j2K3
3707EJ5j8qJ2K3j0j1j9L2J0k1j6NK1jj8k2K2J3k1j0pJ7J3k5nJ3J1ok4RJ7J6j5
3741cjjJ7jk9jK5K2k0j1rK4Rj7j6K6Lqj9jK0Rj3k3K4Nk5MqJ3J2j5pJJ6pj6jJ3
3780iK5k5j1K0J2kj7lQROj1jJ3mmj5J9J9j5pj0J0J0j2j5J5Qprk0J5K1j9KqJ5%
3818Cj6jQJ5j3j2J3J1Kj4jJ4OLj7pJ3Oj0j2QK3rj2qJ3KpMqJ4nk3qK0J2k0JPKO
3859Cj3n%J7pj3J4J4nJqNJ1%nj6J9JmqRmJ2k0PLRj5JMpJ0kkk2K2j6jJP%qNpJ3
3904@l%rMJ7k1%%K1j2MnJ3oJ3j7LJ3pLj5J4Pj7M%J1%j1rMNkqkKRmj6KJ5j2Qj3
3948a7J6nOrMJ6j4nJJ6LolJ1nMOpnMj0KOkNj5rJ2J3j0j3oJ2kj1QjNOmKnjQlJn
$$ y = [21, -6, -11, 15, 26, 7, -11, 3, 29, 27, -13, -18, 6, 28, 5, -16, -8, 8, 15, -12, -22, 0, 1, -1, -31, -19, 9, 25, -15, -23, -14, 17, 10, -6, -18, 5, 20, 2, -6, 6, 29, 19, 8, -11, 21, 31, 10, -6, -1, 20, 19, 1, -21, 1, 14, -7, -17, -24, -7, 6, -19, -24, -11, 0, -6, -30, -21, -4, 12, -3, -4, -5, 12, 11, -18, -19, 6, 28, 8, -3, -12, 12, 21, 4, -12, 14, 17, 9, -10, -11, 9, 18, 5, -18, 6, 11, -14, -10, -18, -5, 7, -8, -15, -14, 2, -5, -21, -22, -9, 16, -9, -20, 0, 12, 10, -7, -10, -2, 7, 13, 2, 1, 14, 10, 6, -9, 10, 29, 14, 7, -3, 7, 17, 5, -10, 5, 13, 6, -3, -23, -8, 13, -6, -4, -12, 3, 3, -13, -14, -6, 9, -4, -16, -3, 8, 10, -4, -5, 9, 15, 18, 1, -6, 7, 13, 3, -9, -1, 22, 13, 1, -7, 6, 8, 1, 5, -3, 11, 6, -17, -25, -5, 7, -13, -12, -5, -3, 3, -10, -15, -15, 2, -5, -18, -4, 10, 5, 6, -2, 3, 14, 14, 9, -7, 12, 13, 9, 1, 10, 6, 18, -2, 5, 8, 17, 2, 3, 7, 0, 10, 8, 6, -16, 6, -10, -11, -10, -3, -3, -11, -6, -13, 0, -3, -3, -12, -8, 9, -12, -12, -12, 9, -3, 1, -4, 9, 3, 16, -1, 2, 15, 8, 11, -4, 10, 17, 0, 4, 4, 15, 15, 4, -5, -1, 4, 2, -6, -8, -6, 3, -1, -17, -15, 0, -12, -4, -17, -1, -6, 0, -9, -5, 11, -3, -8, -7, 9, 12, 6, 3, 14, 9, 13, 19, 12, 7, 11, 1, 3, 9, 7, 12, -3, -12, 0, 13, 3, -10, -16, -4, -6, -17, -9, -10, -5, 1, -3, -1, -6, -7, 1, -2, -1, -6]
3995fJ5nMMOjnrJ0jnjkJ2j0%kPKj0rRKj4OpKJjmJ2r%lRNLj2MmKNqJ2mRJj0L%%
4046CKoQjLqJLnknJ3klnlK%J0omlJ0j8J4%mj1J5jkQrJ2LKj7PJ0lJj1J0nMMqLr
4095cJ8j3nR%%j0jJOj1nJ4rQj0rJ1%Pok%ROj0J3kKlJMkj%L%j1LOJlMqMpKLm%J
4146AmllJ1qJkQLj5JJ4lOj1M%J0qjkJ7rLrJ3oj2LRMmlrJ4joj7QQK8l4Nj1J1mO
4193Cj6OLqOJQLj4j1K1MKj1lJ4Rj9QlPjkj5L1j2kq%OkojPrN%kNJj3M%Nj3QrPJ4
4242Hj3oJ4KnoQPMj6OJ0LqmJJ2oj2JlJ6kj8KoJ8j1j2RjjLj2J1J0Jj9JK7j8j%Q
4286BOpK%J3j0jlkK0ojj6J3J7qj8MKLj5M%J1rm%JOj5Mj0J4kloR%J0j7RQLKj0M
4332DMMj7J5Pn%rJ2kNj7nJ5njrJqLKqkOkjkQLroQOlmKRLoKKRrNj0QRrjKJ0lnn
$$ y = [-6, 9, 4, 8, 12, 18, 17, 12, 3, 13, 12, 7, 6, 4, 16, 6, 6, 4, 11, 13, 3, -6, 3, 5, -9, -3, -10, -8, -7, -8, -12, 0, -9, -9, -12, -3, 2, 5, -7, -3, -7, -5, 0, -8, 4, 0, 9, 10, 0, 3, 3, 3, 5, -1, 7, 6, 9, 1, 2, 5, 0, -2, -7, 6, 4, 1, -4, -7, -5, -5, 5, -1, -5, -8, 2, -16, -2, -2, -6, -17, -2, -3, -5, 3, -6, 6, 9, 11, -6, 1, 11, 8, 9, -2, 8, 3, 7, 11, 3, 6, -3, 15, 2, -3, 6, 6, 6, -4, -5, -4, 2, -9, -14, 0, -9, -1, -11, -20, -9, -9, -2, -8, -10, -10, -1, 5, -5, 8, 6, 8, 5, 6, 10, 8, 7, 7, 10, 10, -1, 2, 8, 9, 6, 10, 2, 6, -1, 1, 4, 0, 0, 1, -3, -6, -9, 2, -6, -5, -7, 1, 4, -11, -10, 4, 1, 7, -4, 0, 0, 10, 2, 1, -1, 16, 7, 10, 1, 14, 8, -4, -1, 8, 12, 8, 5, -4, 10, 9, 3, -14, -6, 2, 30, -4, 1, -10, 1, -3, 3, -13, -7, -4, -12, -6, -5, 3, 6, -8, -19, 2, 6, 8, -3, -6, 8, 17, -2, 6, 3, 10, 9, 7, -8, 23, 11, 9, 1, 1, 7, 5, -1, -2, 5, -4, 1, 1, -1, 4, 5, -8, -4, -4, 1, -12, -4, -13, -6, 8, -5, -11, 3, 5, 0, -6, 2, 9, 13, -3, 3, 13, 16, 8, 4, 5, 17, 11, -1, 0, -3, 13, 11, -7, -5, -11, 7, -4, -16, -7, -8, -9, -6, -18, -7, 3, 4, -15, -14, 13, -5, -6, -6, 2, 8, 1, 3, 3, 16, 6, 5, 2, 0, 20, 14, 13, -3, 10, 27, 19, 1, 5, 7, 10, -5, -1, -1, 10, 1, -3, -3, -2, 4, -11, -7, -17, -3, -5, -8, -14, -5, -5, 5, -12, -3, 5, 8, 10, 0, 4, 8, 12, -5, 10, 17, 12, 12, 3, 15, 13, 18, 1, -4, 11, 6, 5, -4, -3, -11, -8, -6, -14, -16, -10, -12, -13, -15, -7, -4, -13, -19, -11, -5, -8, -12, -10, -1, 2, -4, -2, 0, 9, 0, 5, -5, 3, 12, 3, 2, 4, 14, 11, 6, 1]
4386APJ0j0j9J3J3j0mj2J2Jj0Rj4MknnjK6j0JpJ1Lj0MRJ1kj3%OOKkj1J0LqpjJ8
4429A7j5j9PRMj0oJ3Nmj4nK0j4JKJJjOokJ4%nqPNnPpJ0ooNJ1Kr%rJ3Rj3mj0K0
4475A1lj6kLJ4qj6J1Kj3Qj1J3K%qJ5MkKj8K0JkrjJ6lKj0jJ1j0Pj2J2Rj5kMmJj4
4518a2J5j0J2jj7LjJ2j2%jNOqKkJ3jnKMnJ2jLnJ0j8jJ8noNpQJ3j3lpMlj0QNko
4564bj0J3Qj7kPKkjJkOjnjKRLj2J0JMkNkjmkLp%LlMlmqMKJ%j6J0jLlQjnnPj0K3
4617Gj7J8j8LQJkQQljn%P%j2pJ1j1KmMJ8j4mnQnjnmJ1qJJ%KQqnJ4Klj0J4kNj5
4665h%J7LPj9mJ6oJLPj5Pj1jLLlkpOLj2MJJ0pjnJ0Pj3lKmNkJ1MNk0ROmNj0Qlm
4714aJ5JmmkKplJ3qJpNkmkLJpJNoJ4rrRONj1kOkJ4j2jJ0OqPmKjloNLjnkK%Jmo
$$ y = [1, 8, 18, 8, -11, 2, 15, 5, 1, -11, 1, 2, -8, 1, -13, -9, -11, -16, -21, -22, 4, -6, -5, -12, -1, 2, -8, -4, 5, 16, 14, 1, 1, 7, 13, 15, 13, 2, 12, 15, 7, 0, -1, 17, 2, -17, -10, -1, 3, -7, -13, 0, 5, 1, -13, -18, 2, -12, -11, -9, -8, -7, -8, -2, -8, -10, 4, 4, -1, -9, -2, 3, -2, 5, -2, 8, 2, -4, 1, 12, 14, 5, 5, -4, 9, 18, 5, 1, -9, 11, 8, -8, -10, -7, 7, -1, -17, -6, -4, -17, -9, -20, -7, -5, -5, -13, 2, 6, 4, 6, -12, 8, 9, 7, -2, -3, 13, 10, 12, 2, 1, 12, 2, 9, -3, 9, 18, 3, 1, 5, 1, 2, -12, 3, -7, 5, 4, -13, -10, -11, 1, -11, -11, -12, -7, -1, -9, -7, -9, 4, 3, -2, 0, 4, -1, 11, 10, 13, 8, 18, 0, -1, 17, 12, 6, 11, 4, 12, 25, 12, 9, 2, 6, 3, -7, 1, 6, 4, -2, -12, 1, 9, -8, -10, -3, -1, -3, -4, -3, -5, 1, 0, -5, -6, -4, 5, 8, -4, 6, 7, 11, 9, 14, 12, 11, 7, 5, 8, 1, 1, 4, 1, 5, 2, -2, -10, -6, -4, -3, -3, -19, -9, -10, -7, -10, -2, -3, -8, -13, -6, -16, 7, -10, 8, -10, -7, 1, 2, 0, 8, 16, 13, 12, 7, 7, 14, 14, 2, -5, 6, -5, -3, -7, -3, 15, 1, -3, -8, 0, -5, -6, -11, -15, -4, -12, -11, -10, -10, -8, 0, -8, -13, 1, 3, 0, -10, 4, 2, 7, -8, -8, 9, 12, 19, 0, -4, 12, 6, 7, 10, 17, 2, 9, -2, -3, 0, 3, 0, -2, -9, -3, 0, -12, -8, -7, 3, -4, -5, -10, 0, 7, -6, -9, -7, -11, -6, -8, 3, 7, 12, -8, 1, 7, 3, 8, -2, 6, 3, -1, 14, 15, 11, 7, 5, 7, 0, -3, 10, 2, 3, -4, 1, -1, -5, -7, -4, -3, -10, -9, -4, -10, 4, -5, -14, -5, 1, 6, -5, -7, -1, -3, 11, -1, -2, 8, 14, 6, 13, 9, 11, 10, 7, 1, 6, 9, 8, 3, 1, 3, 3, 4, 0, -6]
4768fJMj5kJ4Ok1QpJ7Kj0NRoknJ3%KJ1j9OmM%pRLJj3J1Kj0PnjoRj1n%J3LqmMK
4816aonJ2LknlNKnJ3oK%kmOkJ2j3LPKlnjPpRppRnrMQjnk2K1j0LpnJ2%j0OPKjK
4868bLLjKj3J4LrMj3J0J4j4J8j3j2K0j0lPnljjJ%nnOkjpRokO%kQj1KLJ2JlMj3
4915gJ4JoQPj2KjPqJ1j0qQj1J0pRj7OqKKMpoKljJ4qQNoMj3PPOnj1NJ0LrJ0j0J1
4963Ij1NpOMkMpJ0qloMp%oRKkokkMKQj2J8kko%MlkJ1%ooJ4K%JJj7QmOLjpLlmJ
5017eQj8mJ0Rlj3J1j3PKoQKJ%qJ4Oqj1PJ3j2nJ1OLqLpLQpkpJ0Oj6RMj2KpKjJk
5065im%KkJOj3J7ooJ3J6j7j1PJ5%j0%QqJ9j4jMNj5J0pJ2j3%jqR%QrlJ3j8j0J7
5108crRj2LkOLmJ2j4J5qQnPlMjjNoKJjJLl%Lj1Pjk0LJ3jj6J6op%NNpQj2J0kmm
$$ y = [-6, -5, -1, -16, -18, -4, 2, -19, -11, -18, -1, 1, -9, -4, 5, -1, -3, -8, 5, 5, 7, 18, -1, 5, 1, 5, 5, -2, 7, 10, 11, -2, 9, 11, 1, 8, 3, 2, -4, 5, -6, -11, -11, 2, 5, -3, -7, -3, -1, -7, -12, 0, 3, 1, -4, -7, -2, 0, -5, 8, 2, 4, 4, 2, -2, 4, 2, 14, 1, 4, 11, 13, 10, 5, 4, 11, 4, 13, 6, -1, 8, 3, -6, -2, 6, 5, 0, -22, -1, -11, -8, -15, -20, -8, -8, -18, -12, -5, -3, -4, -2, 1, 4, 3, 5, -8, 6, 9, 0, 4, -9, 1, 15, 1, 19, 6, -6, 14, 4, 1, 8, 3, 0, -1, -2, -1, -1, -6, -11, -5, -7, -8, -15, -6, -12, -14, -8, -8, -10, -2, -13, -11, -8, 4, 5, 2, 6, -7, 7, 8, 2, 10, 17, 5, 7, 6, 13, 5, 16, 6, -2, 6, -5, 5, -2, 7, -10, -4, -12, -10, -8, -4, -11, -17, -15, -18, -19, -5, -13, -5, 0, -6, -2, -15, -8, -1, 5, 0, -11, -6, 4, 7, -2, 8, -2, 9, -2, 3, -4, 2, 6, 4, 8, 1, 11, 3, 0, -6, -2, -9, -9, -15, -6, -4, -6, -12, -14, -16, -12, -10, -2, -14, 4, 2, 0, -6, -6, -2, -5, -7, 4, 4, -2, -8, 6, 8, 8, 9, 10, -7, 1, -3, 3, 6, 5, -2, 1, -2, -6, -5, 3, -15, -19, -9, 0, -3, -16, -5, -18, -11, -9, -15, -7, -5, -4, -4, -12, 2, 8, 0, -11, -4, 9, -3, -8, 3, 9, 12, 4, 7, 0, 3, 11, 4, 2, -5, 5, 11, -5, 4, 8, -4, -2, -9, -7, -8, -7, -9, -13, -13, -11, -13, -12, -6, -19, -2, -8, -14, -1, 15, -2, -13, -6, 9, 9, -1, -1, 7, -1, 18, 4, 3, 7, 12, -3, 7, 0, 12, -1, -1, -2, -10, -1, -1, 7, -2, -5, 8, -10, -20, -3, -12, -3, -15, -12, -14, -8, -5, -9, 3, -11, 4, -4, 4, -1, 6, 3, 7, 6, 5, 10, 4, 6, 7, 6, 7, 10, 7, 7, 10, -1, 6, 5, -15, -12, 1, 0, -16, 0, -6, -13, -13, -8, -3, -10, -2, -14, -4, -6, -10, -14]
5158a4J3J4j5MKNoLnOMpjJ0k%%j3Rok%Okk0J4m%J1Kj3JKklJMPqJnNj%nQJ7k5J4
5207DrMJ1oJMlLrkJ0OJk0JljJ2j6PNoJ1nmlnmPQjj2J1pkMLKlMlLMj1J3%MoPj3
5257dJ3Lmnj0MPlLnNoLonPJJqj%J1pnOnQK%MLj4LjQnOOj2ROl%rMPj1nJ3kprPr
5311a1J1j0JKMj2NKlQq%QKMlkoJ7j3qJ6JlrK1pNpnKJ1rLpkMj0RrJ0molPokj0J3
5360iKKnjNKKOpMjoNjMNrMOkjj0J8rJ3qj0LJ2k5J2nJ3j0j2J2lkj1LqJ3%mR%lk
5408iKj0J2qJ2N%joqJ1J5j0%NqKJj2nJ8jj2J1j5J1ojMo%J3j3oPOjrpJ8lpJ0kO
5453CKoPmPkkNj2OjkNomOLlkj0J2kJj1Mkjj3jMQjKj3QJ4kj2J0rJ2L%pPJKMj5K4
5503A7orO%kkklJ3kqpJJ3k5LnJ5Rk5J2JJqmQQjj3PJ0j0J0Mj4J4PqnqJ4okONlj
$$ y = [-14, -1, 13, -2, 2, 4, 9, 3, 6, 1, 7, 11, 4, 3, 13, 11, 11, 11, -2, 7, 1, -1, -1, 5, 3, -17, -3, -7, -7, 4, 6, -7, -6, -4, -6, -9, -8, -4, 3, -5, -4, -9, -4, -5, -5, -10, -2, 15, -10, 4, -5, -1, 10, 4, 5, 9, 6, 9, 0, -2, 8, 14, 15, -5, -4, -7, -8, 4, -12, -5, 0, -6, 5, 0, -4, -7, -12, -16, -9, -1, -2, -14, -3, -10, -12, -8, -5, -3, -6, -2, -5, -2, 2, -9, 4, 4, 8, 2, 9, -4, 9, 12, 8, 3, -7, -3, 4, 1, 4, -1, 4, -2, 1, -5, -10, -3, -2, -1, -9, -10, -10, 1, -6, -11, -5, -10, -2, 0, 0, 4, 7, -7, -4, -5, 3, -2, 4, 10, -2, 7, 13, 10, 10, 1, 5, 12, 1, -4, 9, 7, 0, -9, -2, -11, 0, -10, -9, -7, -3, -15, -10, -8, -11, -3, -11, -11, -3, -1, 3, 0, -2, -8, 9, -4, -12, 4, 5, 2, -7, 14, 7, 12, 5, 0, 2, 13, 4, 7, 0, -2, 2, -8, 1, -8, 2, -2, -8, -11, -4, -10, -12, -22, -9, -7, -5, -10, -11, -6, -4, -2, 4, -3, 1, 0, -6, -1, -2, 2, 7, -2, 2, 8, 6, 5, -5, 13, 4, 17, 9, -1, 2, 14, -11, 1, -4, 9, -1, -13, -1, -4, -6, -17, -14, -22, -9, -9, -13, -4, -4, -7, -9, -7, -17, -5, -13, -1, 4, 4, 3, -3, -11, 0, 15, 5, 5, 10, 2, 4, 5, -7, -12, 6, 5, -7, 4, -11, 0, -6, -7, -3, -9, -9, 4, -9, -15, -8, -2, -3, -12, -19, -1, -4, -11, -1, -3, 3, 5, -1, 6, 2, 9, 7, 5, 10, -2, 4, 3, 1, 6, 0, -4, 2, 5, 2, 0, -10, 2, 0, 1, -10, -6, -8, -9, -22, -23, -19, -11, -12, -10, -23, -15, -1, -3, -15, -5, -14, -2, 1, 1, -6, 1, 2, 4, 8, -7, 17, 11, 2, 8, 8, 6, 4, 2, -1, 12, 10, 2, -5, -4, 9, -16, -13, -18, -3, 6, -19, -7, -6, -5, -13, -17, -9, -1, -2, -15, -8, 2, -8, 2, 6, -8, 6, 13, 5, 0, -8, 6, 0, -2, 4, 9, 6, 5]
5550EQj1jJKj2Nk%Pj9J7pJJKkj2KJMOrkJ6J0j9J0J%JJ0j1nJ9k8RMM%MknpORj2
5597aNQk2J1rOLooKLjnkLknJ3qRMlj3J6OoOpNJmLj0QkoOmJ1nkjmJj1J0Qj1lMj3
5648b0J7JprjJ1Lj0OJkJ7qjJ2nqJ1pJ0oJj0J4Lj1pJ3J4j2j8RJKNj3Lj0Rnj0LM
5691a0%jKMPqk0K2PrpOQKKKjj0J2nrJ8Pj8j1J5pRloj0QpmJ2kMrlJJ0lj0OJm%Q
5739dn%%jLKJ0njLLkjlPMj4MlJ1j6J3pKKkjoLRj6MMlnn%Rj0LJ7j5lJ1jNkkMnM
5790aJ2pjM%j1JQPj4OLj2KQmojPj3PrjJ4j5Pj6J5JmjpJ2OJ1j4%KQqPKkNnmJ0l
5838FPomlQjjNlj0JoKQnj1RNlrrJ8Mj0nQRJnK%rPPJn%JrPJ5j0j2J1OMj3jM%pn
5890fJ4lrKllNKlrJ0mqPRpj3QORJNj4j%J5pjlJ8j2LlQrkLOjpj1nJ2JqJ5k2J2J
$$ y = [5, 13, 2, 1, 2, 4, -8, -3, -5, -5, 2, -17, 0, -7, -6, -5, -3, -5, -17, -15, -14, -10, -4, -13, -15, 1, 11, -8, 2, 3, 3, 4, 14, 3, -2, 17, -11, -2, 2, 6, 6, 10, 8, 3, -4, 2, 11, -1, 4, 12, -10, 1, -8, -2, 1, -5, -11, -9, -6, -7, -12, -14, -11, -13, -18, -5, -13, -4, 0, -3, -16, 0, 6, 0, 6, -1, 4, 5, 1, 4, -6, 2, 0, -6, 0, -4, 7, 2, 0, -1, -5, -4, -15, -5, 3, -8, -11, -7, -20, -3, -2, -9, -18, -19, -8, -5, -15, -9, -8, -10, 7, -1, -2, 10, 5, -3, 8, 1, 11, 5, 6, -4, 10, 13, 2, -5, 8, 22, 10, -8, 1, 2, 4, 9, -4, -1, -11, -2, -7, -17, -14, -10, -10, -11, -9, -5, 2, -6, -26, -4, 3, -6, -13, -7, 1, 3, 5, 7, 6, -4, 8, 3, -6, 12, 19, 1, -10, 5, -2, 7, 4, -2, -12, -4, -11, -15, -3, -5, -1, -10, -13, -12, -2, -5, -15, -9, -8, -12, -12, -4, -9, -9, -9, -10, -7, -5, 5, 0, -1, 2, 5, 3, 2, -1, 6, 10, -4, 0, -3, 8, -8, 5, -2, 0, 2, 0, -1, -7, -4, 5, -11, -7, -3, -6, -11, -16, -16, -7, -17, -14, 3, -12, -15, -4, -5, 0, -2, -4, 0, -5, -1, 11, 4, 3, 7, 7, -4, -3, 5, 12, -2, 4, 7, -5, -3, 5, 1, -5, -6, 1, -12, -5, -14, -15, -1, -16, -9, -25, -10, -9, -13, -14, -21, -9, -3, 8, -6, -6, -4, 4, -4, 3, 5, 3, 8, 3, -1, 9, 6, 13, 7, 3, 0, 8, 7, 6, 11, 8, -2, -1, -7, -5, 3, -2, -13, -4, 1, -2, -11, -20, -2, 2, -8, -13, -5, 4, 5, 0, 2, 2, -7, 0, 7, 8, 3, 3, 4, -5, 2, 17, 7, -5, 6, 12, 16, 3, 2, 6, 6, -1, -6, 8, 5, -4, -2, -5, -8, -3, -1, -4, -13, -3, -7, -15, -8, 1, -6, -19, -11, -5, 4, 5, 10, -4, -5, -5, 10, 3, 2, -1, 17, 5, 8, 5, 13, 4, 2, 5, 11, 10, 3, -8, -13, -1, 0, -8, 7, -15, -3, -2]
5939blj2J0lrK0j9J4j0JJ1oJ2j3J3rNJ1mpOQj7J1j1NJ6j3KLkpQj5jL%j3JJ7qq
5981a5J5qMlk%JJ0orJ4JmPnNKKrJ2jm%j2PJ2mppJ1%oQPj4r%KjLNj1RqLMnjJ0q
6031ej2J1J2j2OmJ0Mj0MQj3J5qmJ1kPj7JQj1qJ8qJ1j7kKKmjjMOJj3NMrNrJ6j4
6075a3OlLJ4Oj6NJjK1j2nMJLj4KOMj0Pj0LmOoj5J1%jMlojkK2lj6RJlKJ%mOLkl
6124boJ7kj0J1J4j3qMKoNnLpjL%jn%kLLqLrJ4jkNlnK3j2oNpPKL%JPj4PJLNpjJ
6176IJ1rrLQopJ%L%j0MJpjMrNnOmJ2nLqPJ1j2LRNj1KoPLLj6PQjkk3J0OjlOmjo
6228iOj0J3j0LoRKpLONoj0JJ2k%QqQokMOk%lL%J0j1%NomMoJonRoMKkj0lLJ5j4
6279a2J1j1RjnNlPPlpNLkNmRmpkJRj2jOLj7J1npJ0rMmNlknJ6nMl%NmKMj1J0Rj8
$$ y = [-2, -5, -17, -7, -10, -19, 1, -18, -4, -14, -13, -2, -8, 4, -9, 4, -5, 0, 11, 7, 0, 6, 14, -3, 8, -3, 2, 18, 5, 7, 10, 8, 1, 9, -6, -7, -4, -4, -17, -16, 1, -7, -15, 0, -8, -4, -7, -9, -9, -8, 2, -4, -13, 1, 2, -2, 5, 0, 5, 7, 9, 0, 12, 11, 7, 7, -5, 2, 14, 10, 3, -4, 7, 7, 1, 9, 16, 2, -7, -7, -5, -6, -3, 2, -9, 0, -8, -5, -1, -6, -7, 3, -5, -17, -6, 6, -6, 0, -4, 6, 10, 0, 4, 12, -1, 14, 6, 2, 13, 11, 18, 1, 2, 10, -1, -9, 9, 1, 12, -5, -7, -5, -3, -7, -8, -9, -5, 1, 2, -11, -6, -2, -11, -6, -15, 1, -13, -7, -10, -7, 7, 13, -3, 2, 3, 2, 23, 11, 6, 10, 11, 14, 0, 2, 8, 12, 2, 9, -1, 2, -2, 4, -2, -17, -6, -6, -7, -3, -6, -12, -13, -15, 7, 4, -12, -3, -2, -5, -3, -2, -2, -6, 0, 3, 1, -2, -8, 9, 7, -3, 8, 22, 9, 1, 5, 7, 1, 6, 1, 4, -3, -4, -1, -1, -2, -7, -7, -9, -6, -3, -11, -8, -17, -3, -4, -6, -1, -4, -9, 14, 2, -4, 1, -6, 1, 3, 6, 6, 7, 14, 0, 7, 8, 11, 16, 9, 8, 9, 20, 11, 2, 5, 13, 7, 0, 1, 1, 4, 4, -6, -2, -1, -8, -9, -5, -14, -9, -14, -8, -12, 0, -5, -2, -10, -3, 8, -4, -1, 8, 13, 2, 4, -2, 5, 8, 11, -5, 2, 10, 9, 7, -16, -6, 0, -1, -4, 2, -2, -3, -9, -3, -13, 0, -10, -7, -13, -4, -2, -9, -6, 0, 5, -1, -11, -10, 2, 0, 0, 8, 0, 8, 2, 0, 4, 10, 8, 8, 5, 8, 8, 18, 7, 7, 12, 6, 2, 6, 0, 1, -5, -10, -1, -7, -3, -1, -3, -13, -16, -13, 2, -12, -1, -12, -3, -4, -9, -4, -7, 0, 7, 4, -3, 2, 5, 3, 8, 4, 13, 9, 2, 0, 1, 10, -2, -3, 3, 6, -11, 0, -5, -12, -2, -11, -7, -11, -6, -9, -11, -16, 0, -5, -1, -4, -4, 1, -3, -1, 3, -8, 2, 11, -7]
6330gJ0jOmjJMMnj3J4r%J9j8NnK%j3KkLRlqj2P%J0nkjKNNjPj0lJ0KRj6j%K0j1
6378ELKpNmLj3J5lrKjkLpnPLmnjNlkNOlqmK1kpJ0j2QL%lJ5j0MpQnQpj4NQKmj1
6430gKLmLpMr%PrRjJj3RKpJ4nJ1j3kNRkLJ0j7PkRj1J0mJOj4OMmpQoJKlLrRj3r
6481b0J4JpPj2J0NmJ2pj4PJ5j0rJ9rOnOKqoK0lnMk%kjLJrNqMp%J7j7m%NkpmJ5
6529dqOmMLj0LLJ2jj0OQmpNJ0%k%j1J7j0Jj5MQmnMpR%j1LjmKJpMJ1j0jQqOrQJ4
6579GmmKJ1j1lJ5j0Nj6J6pMMj1JKKoj2J3lMk3J9JkoMQj1JM%JJjJn%J2nPlQmLp
6627BJ2krPo%J0j4j2KJ4KqjOJj8J3nkjLj1J2KrPoPjoJ6mRLpP%rPmoPPkk0J4jM
6676A0qNk%j2KKqJMj0RKrJMKPk0OJRMrOkMLNj%MroJ0J0j1kJJOqJlJ4j1jj1J0o
$$ y = [-7, 3, 2, 8, 4, 3, 4, 8, 12, 7, -6, 8, -1, -1, 18, 0, 5, 0, 2, 2, -11, -9, -11, -8, 1, -2, -10, -22, -15, -15, -5, -10, -12, -13, -11, -6, -1, -2, 5, -5, -8, 2, 4, 13, -3, -4, -4, 16, 5, 8, 10, 3, 8, 4, 7, -6, 9, 6, -3, -1, -2, -4, -1, -8, -13, -6, -3, -7, -12, -13, -8, -11, -13, -8, -2, -5, -13, -17, 4, 2, -5, 5, -7, 1, 4, 4, 1, 16, 6, 10, 3, 11, 6, 14, 7, -7, -2, 6, 8, 4, -7, -5, -2, -6, -3, -10, -6, -15, -15, -8, -17, -8, -9, -8, -21, -12, -10, -17, -3, -8, 3, -10, -12, -7, 2, 0, 3, 13, -4, 3, 1, 10, -1, 9, 5, 6, 12, -2, 4, 8, 4, -3, 5, -1, 0, 2, -1, 2, -7, 2, -11, -20, -6, -5, -12, -5, -17, -7, -2, -6, 6, -1, -15, -8, 7, -3, -12, 7, -2, 4, -1, 5, 7, -1, -7, 13, 10, 5, 9, 7, 7, 5, 4, 7, 8, -1, 4, -4, 0, -7, -7, 10, -7, -11, -11, -6, -8, -15, -19, -4, -12, -6, -10, -6, -3, -13, -10, -7, 5, 4, -6, 0, 8, 4, -3, 2, 12, 12, 10, 10, -1, 16, 6, 7, -8, -4, 4, 0, -5, -1, -8, 1, 1, -10, -7, -8, -12, -10, -9, -16, -12, -1, -11, -12, -4, -12, -6, -15, -7, 7, 3, -1, 1, 12, 1, -2, 13, 3, 8, -8, 8, 1, 5, 9, -2, -1, 1, 3, -3, -15, -2, -5, -1, -24, -5, -4, -6, -12, -8, 0, -11, -10, -6, -6, -5, -4, -5, -4, -9, -9, 3, -2, 5, 2, 10, 6, 9, 2, 14, 12, 3, 10, 4, 4, 14, 0, -12, -10, 4, 6, -2, -3, 3, 4, -14, -1, -6, -8, -9, -6, -17, -5, -3, -12, -5, -11, -4, -5, -11, 5, 1, 10, 13, 6, 13, 13, 4, 11, 7, 1, 8, 15, 13, -7, 7, 6, 10, 2, 7, 5, 5, -7, -5, -3, -11, -10, -6, -16, -7, -5, -14, -13, -9, -7, 0, -20, -14, -13, -4, 0, -9, -3, -5, -1, 2, 7, 6, 6, 10, 1, -5, 5, 15, 4, 2, 3, 4, 10, 2, 3, 0, 14, 3, 2, -9, 1, -5]
6726ejj1MKQpjMopJJ3Nj2kNJJ6%kj5J1mP%mQj1J0LmnQj1Oj0PmJ0j1Pj2j6J3Qn
6772ij0NqJ0JnMJ1jrRJOlJKKj3jJ2LlrJ0pQLn%jj4J1Mj1LJLj0MnPrLmKQk4J3O
6821hMKqQ%nlLONqJKQjNJj3OOj6%J3pLj6J4mNomOrK%rMlOnP%NpJ2r%nJ2llOrJ0
6875ANjj%%j0J3mKKqjkKJ1oojpk%Oj1J0qOln%jJ0OpJ1mrJ2KLkKkQrLNm%LKk1J4
6927DmlN%j3JnRlllMJk%kQrlPJ1mqQoJ1jKlLkLlRjmJ1j1%KoQlj0KlPolJKMj5N
6981a1j0J8knPKjj2J2mJ2nmNnQKMrjJ3j3J1kKlqJPj7MJ3pkj2kNj2J0QPj4pNM%
7027hRj1lOJnJ8rnLRoqQjLPKLj4KjJ7j2rKMMqnjnOJ4j7Mp%OlMLrnJ5qJnJ1jMn
7079eNJJ1j8LMKJ4k0KKLpQJlojNrJjPj3NJlMmOkj1PLJkJnqJ5kJ5jjKoJ1nkNk5
$$ y = [-5, -6, -17, -13, -11, -3, -10, -11, -7, -13, -20, -19, -6, -1, -13, -15, -10, -9, 7, 7, 5, -10, 1, -3, 4, 4, 0, 8, -3, 7, 10, 6, 1, 9, -2, 4, -6, 1, -3, 7, -4, 3, -9, -25, -12, -4, -9, -19, -14, -22, -12, -11, -16, -12, -1, -2, -11, -2, -1, 5, 2, 3, 5, 7, -6, -7, 5, 8, 5, -4, 6, -1, 7, 10, 5, 5, 4, -10, 1, 5, -6, -3, -2, 1, -9, -5, -10, -3, -12, -9, -13, -11, -3, -27, -14, -8, -4, -2, -10, -2, -2, -7, -10, -7, -1, 4, -4, -3, -1, 7, 6, 11, 12, -1, 5, 11, -5, -5, 8, 1, 4, -12, 2, -2, 3, -3, -7, -1, -10, -8, -8, -17, -13, -16, -10, -15, -8, -8, -3, -10, 2, -7, -7, -12, 0, -3, -6, 0, -9, 1, 6, 5, 4, 4, 4, -6, 7, 3, 5, 7, -1, -2, -4, -2, 9, 3, -3, -4, -11, -13, -13, -7, -18, -8, -16, -10, -13, -18, -18, -19, -9, -3, -10, 1, -3, -12, 0, 2, 5, 3, 5, 3, 11, 2, 5, 10, 6, 6, 9, 11, -10, 4, 0, -3, 2, 2, -11, -10, -15, -6, -9, -12, -15, -11, -10, -12, -12, -14, -6, -15, -18, -11, 0, -4, -12, -4, -10, 1, 0, 2, -1, 2, 0, 3, 0, 9, 8, 4, 15, 4, 4, 6, 0, 8, 5, -5, -3, -6, 1, -5, -8, -7, -5, -1, -16, -11, -21, -3, -5, -10, -3, -1, -2, -14, -2, -6, 6, 1, -3, 2, -3, 5, 7, 11, 2, 1, 14, 1, 12, 10, 12, 9, 1, 2, 9, -8, -4, 9, 2, 0, -12, -14, -9, -21, -11, -3, 4, -10, -17, -12, -8, -8, 1, -10, -13, -7, -6, -11, 7, -2, -7, -4, 5, -1, -9, -1, -2, 1, 8, 10, 13, -1, 1, 0, 17, 5, -4, -2, 2, 6, -2, -7, -8, -13, -7, 7, -10, -6, -13, -13, -7, -10, -6, -3, -12, -17, -2, -10, -9, -14, -3, -4, 0, -5, 0, 1, 12, -6, -3, 1, 3, 17, -3, -1, 1, 4, -3, 5, 6, 3, -3, -4, 1, -8, -7, -8, -1, -14, -9, -8, -11, -7, -11, -5, -7, -18, -11, -8, -7, -9, -8, -13, -21, -6, -8, 7, 6, 5, 7, 1, 12, 7, 5, 10, -15]
7130a5J7mJ1qJjj3J2j8RJ0pkJJMrmkM%KKrJ0MMkoPlKLJNpJKj4J5MnmNjoJ0ppQ
7180ApLmjMlj1J3mnJlM%Jj%LPlJ3j1j2J1J1rKmL%JmNrPlJQj0K%%moOjmjKkNj3
7232b1NkoJ0mJ5opMJ2j2OJMjjKJ4nPj3mJ1lKml%Mj6QMkrQnpOkkLonQJ1l%nJqK
7283a4LJ2j5J3KjJP%j0lPjMmQj0J4j1jPj9M%o%QOkj2kJ2oj0RrJ0mKOkmJK0k1O
7329eMKnPLlQkpK%LrkQoJj3QjkLpQnKMj7K0j1J2j2OPqLNmLjj3J6pQPqQr%lJ3q
7381CJ0j3MlKJoNj1oRJnOOj5mJ8j9OKPMj8J2knJ2okO%kLo%PN%MomkLrP%MQoj6
7432a1mJ0rOjOj4J0%nKJlmJQnONqkNNK%mkJ0Qkj2Mj0LNmJ0j3NpmJ4j5J1JmKlJ
7481enmKOKnJJoNPPmqJ7pojLMJnQj3J2j4Q%pJ6j6QjrOJmOj1JjJlnMOkNrJ2p%J0
$$ y = [-15, 2, -2, 9, 1, 2, 1, -12, 0, -18, -9, 1, -6, -8, -7, -6, -2, -11, -15, -17, -13, -13, -11, -9, -18, -8, -4, 0, -2, -8, -1, -4, -2, 1, 2, 7, 0, 1, 3, -11, 4, 8, 3, -1, 4, 3, -3, 7, 0, -7, 1, -6, -3, -7, -8, -4, -7, -18, -5, -9, -14, -13, -16, -12, -12, -11, -12, -12, -9, -2, -5, 8, -3, -15, -4, 7, -2, 0, -4, -1, -1, 0, -4, 1, -8, -1, -4, -3, 5, -5, -3, -3, -3, -7, -13, -7, -8, -12, -13, -11, -13, -8, -21, -16, -18, -24, -14, -18, -3, -9, -16, -12, 0, -12, -6, -5, -1, -2, -3, -1, 13, 8, 15, 2, -2, 9, 6, 8, 4, 1, 1, 5, -11, -3, 1, -1, -10, -2, -7, -14, -8, -10, -12, -9, -15, -20, -12, -1, -4, -4, -9, -8, -16, -14, -11, 1, -14, -1, 1, 0, 1, 8, 8, -2, -5, 2, 1, 5, 1, 9, -1, 13, 2, 1, 8, -11, -7, -7, -13, -13, -5, 1, -1, -13, -15, -3, -9, -19, -10, -19, -9, -13, -11, -5, -7, -11, -10, 10, -11, -5, -1, 1, -4, 3, 6, 3, 11, 9, 2, 4, 4, 7, -2, -4, 4, -2, -1, -14, -6, -7, -9, -6, -13, -5, -10, -8, -4, -21, -1, -12, 0, -12, -6, 1, -7, -4, 1, -3, 0, -1, -14, 2, -5, 3, 10, 2, 10, 1, 1, -2, 11, 3, 13, 0, 4, 1, 3, 4, -2, 3, -8, -14, -5, -4, -9, -3, 3, -12, -16, 2, -17, -11, -9, -2, 2, -16, -4, -6, -11, 1, -5, -7, -1, -1, -3, 0, -6, -6, 1, 6, 6, 10, 4, 0, -2, 1, -8, -1, -1, 3, 11, 5, -11, -15, -5, -14, -8, -9, -3, -17, -7, -7, -12, -10, -9, -12, -16, -15, -7, -12, -6, -1, -9, -11, -6, -1, 1, 1, -3, -5, 5, 13, 11, -1, 3, -7, -4, 1, -3, 7, -6, -1, -8, -12, 2, -13, -2, -1, -5, -3, -6, -5, -10, -14, -12, -6, -4, -9, -8, -7, -13, -8, -1, 6, 2, -6, 11, 4, -2, -3, 0, 4, 5, 0, 8, -5, 7, -7, 1, 1, -6, 10, -6, 2, 1, -8, -2, -1, -5, 1, -10, -9, -10, -9, -12, -17, -13, -7, -9, -4, -13, -1, -8, -8, 2]
7534Blj1KLRkPn%JmMkNj1J6rqoO%J3j8lJ2j0KKj3J7loMjj%nJ0OmPjmJj0J2Pj0
7582bQmPqkJ4qJpr%J4Nj2qkJ0Pj4n%LJ0jlnpQM%MqOj0J4nNkPll%KLrRKRqpkRo
7635AnjOj4LmJ0mnKqOnLJ1ppJ3Jj4J3jpMPLPpqJ2RqnjJkRnj0NN%jMj6lNpLNj1
7686a8PPj0mJ0k%j0NLKQrOOjpQNj2Q%mQOmKpoOJ%MpnqJ7lj1J2j9JJ4j0JL%nLq
7736a7J1j0OnJ0PnkjLKMNjn%LJJj1RpnJ9jplJ2j7qJ7rpKl%mKQpJNj1J4pmJ3km
7785hJ0Pj6MJ%J4j0jJkMOj5J2kj0NPnqlJkljJLjnPKkplLLLLPJpLmJ7j2jJ6j2m
7835cJOoJ0j0LjPnpjJ0r%j%jOnrLKMlj0PlJ1kNmj1OlRnPnNRj3J3pqJ5oRj0J7j3
7885Djn%kmLmjLlJrNj0RJ2okjjKkLMJ1j0LlOPj2J0%Qj1%nlJ2jqlnJ0p%oMjJ1r
$$ y = [2, -1, -12, -10, -7, 2, 0, 7, 2, 2, 3, -1, 3, 1, 6, -5, 11, 2, -6, -12, -6, -6, 7, -11, -14, -2, -12, -10, -8, -21, -4, -7, -13, -9, -10, -11, -11, -16, -6, 0, -4, 3, 2, -2, -1, -11, 1, 8, -2, 6, 2, 9, 1, -1, 13, 5, 6, -1, -10, -10, 4, 9, -3, -11, -13, -3, 4, -10, -15, -15, -12, -2, -3, -6, -11, -18, -10, -6, -6, -2, -10, -4, -14, 0, -5, 0, -2, 5, 2, -1, -1, 1, 4, -5, 4, 6, 15, 7, 0, -2, 7, 1, -4, -5, 1, -13, -10, -14, -4, -8, -13, -11, -19, -13, -18, -15, -4, -11, -18, -5, -4, -18, -5, -6, -13, -9, -2, 1, 8, 1, -7, 5, 14, 6, 1, 0, 1, -1, 8, 3, -7, -2, 3, 3, 2, 6, -10, -13, -8, -15, -12, -7, -18, -11, -4, -14, -18, -8, -10, -10, -20, -15, -12, -10, -2, -11, -5, 1, 0, -7, 1, 6, -6, 2, 2, -2, 6, 12, 8, 10, 3, -3, 3, 4, 4, 8, 1, -4, -12, 5, 2, -9, 3, -16, -15, -1, -11, -10, -7, -7, -12, -9, -17, -6, -16, -10, -15, -5, 2, -3, -5, -6, -3, -1, 3, 8, 7, 2, 2, 5, 6, 7, -4, 5, -2, -7, 12, 11, 4, 1, 13, -4, -12, 5, -4, -11, -9, -12, -12, -16, -14, -6, -13, -12, -7, -18, -4, -11, -15, -2, -4, -8, 2, 9, -7, -3, -2, -2, 12, 2, 1, 2, 0, 4, 10, -5, 7, 5, -5, 0, 7, 2, -6, -9, -8, -10, -13, -14, -13, -10, -11, -16, -9, -7, -9, -16, -19, -16, -13, -10, -7, 0, 1, -6, -3, -7, 10, -2, -3, 13, 1, -3, -2, 4, -2, 8, -2, 1, 0, 7, 2, -5, -6, 4, -5, -5, -6, -6, -7, -1, -6, -15, -12, -10, -6, -9, -19, -12, -15, -4, -6, -1, -5, -16, -10, -13, -4, -9, -2, -7, -2, 7, -6, 7, 0, -8, 7, 1, 10, 0, 17, 4, 3, -2, -2, -4, -8, -5, -9, -10, -7, -10, -9, -18, -13, -23, -14, -2, -8, -10, -11, -12, -10, -12, -9, -5, 6, -4, -1, -4, 2, 9, -3, 7, 7, 15, 4, 4, -1, -4, 8, 7, -1, -4, -9, 1, -6, -6, -12, -8, -9, 2, -7]
7936go%JJ1rp%JkmJ3jPlPjqNjJ7j9J6nmlJ1Mq%nQmKklkjjjolMl%okQJORj9Qll
7990a3J1MpKJjJOOpoOkQj0OKjljKKrLjj2LJ2j4Kk%rJ5pLkJ0j1J3j0%lRPoJ0j1
8038dJ5j5RKJ1j0kKpMJ1jj0Jj0JNn%nOpMqjLjKKmMJ0j3QpJ0llnRJ0rRj6J1KlK
8086DMnKmQj0QrLjpNpPrjmJ5j3JKOnJnJ4pMj1RKJkOkjRqRNlkKNj0%kPkj3KJLO
8140Hmj0jlkJQnOpMQj4PoKNRokJ0oJ0lpJ0Nj1kOMpoKoJ3Lmkp%nkLLKj2%mQK
$$ y = [-7, -13, -13, -12, -1, -10, -17, -17, -16, -18, -22, -9, -10, -3, -6, 1, 0, -8, -3, -4, 13, -6, 10, 5, 1, -2, 9, 13, 5, 5, 0, 8, 4, 6, 4, 1, -1, -2, -3, -4, -10, -13, -9, -12, -12, -18, -20, -12, -11, -5, 4, -15, -7, -10, -13, -2, 2, -5, -3, -2, -3, -2, 4, 10, 3, -3, 3, 1, 9, -1, 5, 7, 6, 3, 2, 4, 6, -3, 0, -1, -13, -10, 2, -12, -10, -12, -12, -21, -6, -13, -10, -12, -2, -13, 0, -10, -10, -13, -4, 3, -3, 7, -4, 11, -4, 5, 7, 18, 8, 6, 8, 1, 5, 16, 15, 5, 6, -4, -3, 2, -3, -3, -8, -2, -9, -5, -13, -14, -11, -12, -10, -8, -12, -8, 2, -11, -3, -10, 0, -3, -6, -11, -2, 8, -1, 8, -8, 3, 5, 2, 4, 8, 3, 5, 1, 9, -1, 7, -2, 1, 0, -7, -2, -9, -2, -11, -12, -16, -1, -14, -13, -11, -5, -10, -9, -14, 0, -7, -3, -14, -5, -3, -2, -4, 2, 0, -1, 8, 0, 9, 14, 11, 9, 11, 16, 6, 6, 4, 11, 9, -4, -2, -1, 2, 8, 4, -6, -7, -10, -12, -11, -3, -8, -2, -9, -5, 3, -11, -4, -10, -8, -3, 6, 0, -2, 8, 2, 12, 9, 2, 12, 17, 6, 4, 10, 14, 7, 1, 3, -3, 10, 13, 9, 7, 0, 0, -5, -7, -4, -1, 1, -11, -11, -15, -7, -5]
8191e
##END NTUPLES=NMR FID
##END=
