##TITLE=1H_LY-DMAA.Per.2.4
 CDCl3
 8 sc, 
 8.02.2022
##JCAMPDX= 6.0         $$ Bruker NMR JCAMP-DX V2.0
##DATA TYPE= NMR FID
##DATA CLASS= NTUPLES
##ORIGIN= UXNMR, Bruker Analytische Messtechnik GmbH
##OWNER= root
$$ XWIN-NMR		Version 3.5
$$ Tue Feb  8 13:20:23 2022 Russian Standard Time (UT+4h)  she@DPX200
##.OBSERVE FREQUENCY= 200.131346
##.OBSERVE NUCLEUS= ^1H
##.DELAY= (6, 6)
##.ACQUISITION MODE= SIMULTANEOUS
##.ACQUISITION SCHEME= undefined
##.AVERAGES= 8
##.DIGITISER RES= 18
##SPECTROMETER/DATA SYSTEM= spect
##.PULSE SEQUENCE= zg30
##.SOLVENT NAME= CDCl3
##.SHIFT REFERENCE= (INTERNAL, CDCl3, 0, 15.7039)
##AUDIT TRAIL= $$ (NUMBER, WHEN, WHO, WHERE, WHAT)
$$ ##TITLE= Audit trail, XWIN-NMR		Version 3.5
$$ ##JCAMPDX= 5.01
$$ ##ORIGIN= Bruker BioSpin GmbH
$$ ##OWNER= she
$$ F:/spectra/data/she/nmr/H-F/1/audita.txt
$$ ##AUDIT TRAIL=  $$ (NUMBER, WHEN, WHO, WHERE, WHAT)
(   1,<2022-02-08 13:18:49.85 +0400>,<she>,<DPX200>,
      <created by zg, POWCHK disabled, PULCHK disabled
       configuration hash MD5:
       00 E9 B6 7A A2 85 ED C7 34 08 36 98 17 FE 4E 26
       data hash MD5: 16K
       17 00 25 E8 99 B9 B3 3C BD DF C4 52 F5 BB 99 23>)
$$ ##END=
$$ 
$$ hash MD5
$$ BC AF 3B A8 2D 41 DA E6 D2 2C 03 AF CF 59 1B D3
##$RELAX= 
##$RELAX= 
##$RELAX= 
##$RELAX= 
##$RELAX= 
##$RELAX= 
$$ Bruker specific parameters
$$ --------------------------
##$DU= <F:/spectra>
##$EXPNO= 1
##$NAME= <H-F>
##$PROCNO= 1
##$TYPE= <nmr>
##$USER= <she>
##$AMP= (0..31)
100 100 100 100 100 100 100 100 100 100 100 100 100 100 100 100 100 100 
100 100 100 100 100 100 100 100 100 100 100 100 100 100 
##$AQSEQ= 0
##$AQ_mod= 1
##$AUNM= <au_zg>
##$AUTOPOS= <>
##$BF1= 200.13
##$BF2= 200.13
##$BF3= 200.13
##$BF4= 200.13
##$BF5= 200.13
##$BF6= 200.13
##$BF7= 200.13
##$BF8= 200.13
##$BYTORDA= 1
##$CFDGTYP= 0
##$CFRGTYP= 5
##$CHEMSTR= <none>
##$CNST= (0..31)
1 1 145 1 1 1 1 1 1 1 1 1 1 1 1 1 1 1 1 1 1 1 1 1 1 1 1 1 1 1 1 1 
##$CPDPRG= <>
##$CPDPRG1= <>
##$CPDPRG2= <>
##$CPDPRG3= <>
##$CPDPRG4= <mlev>
##$CPDPRG5= <mlev>
##$CPDPRG6= <mlev>
##$CPDPRG7= <mlev>
##$CPDPRG8= <mlev>
##$CPDPRGB= <>
##$CPDPRGT= <>
##$D= (0..31)
0 1.2 0 0 0 0 0 0 0 0.06 0 0.03 0 0 0 0 0.0002 0 0 0 0 0 0 0 0 0 0 0 0 
0 0 0 
##$DATE= 1644311929
##$DBL= (0..7)
120 120 120 120 120 120 120 120 
##$DBP= (0..7)
150 150 150 150 150 150 150 150 
##$DBP07= 0
##$DBPNAM0= <>
##$DBPNAM1= <>
##$DBPNAM2= <>
##$DBPNAM3= <>
##$DBPNAM4= <>
##$DBPNAM5= <>
##$DBPNAM6= <>
##$DBPNAM7= <>
##$DBPOAL= (0..7)
0.5 0.5 0.5 0.5 0.5 0.5 0.5 0.5 
##$DBPOFFS= (0..7)
0 0 0 0 0 0 0 0 
##$DE= 6
##$DECBNUC= <off>
##$DECIM= 32
##$DECNUC= <off>
##$DECSTAT= 4
##$DIGMOD= 1
##$DIGTYP= 9
##$DL= (0..7)
0 120 120 120 120 120 120 120 
##$DP= (0..7)
150 150 150 150 150 150 150 150 
##$DP07= 0
##$DPNAME0= <>
##$DPNAME1= <>
##$DPNAME2= <>
##$DPNAME3= <>
##$DPNAME4= <>
##$DPNAME5= <>
##$DPNAME6= <>
##$DPNAME7= <>
##$DPOAL= (0..7)
0.5 0.5 0.5 0.5 0.5 0.5 0.5 0.5 
##$DPOFFS= (0..7)
0 0 0 0 0 0 0 0 
##$DQDMODE= 0
##$DR= 18
##$DS= 0
##$DSLIST= <SSSSSSSSSSSSSSS>
$$ [...]
##$SUBNAM2= <"">
##$SUBNAM3= <"">
##$SUBNAM4= <"">
##$SUBNAM5= <"">
##$SUBNAM6= <"">
##$SUBNAM7= <"">
##$SUBNAM8= <"">
##$SUBNAM9= <"">
##$SW= 18.0517287032376
##$SWIBOX= (0..15)
0 0 2 0 0 0 0 0 0 0 0 0 0 0 0 0 
##$SW_h= 3612.71676300578
##$TD= 16384
##$TD0= 1
##$TE= 0
##$TE2= 300
##$TE3= 300
##$TEG= 300
##$TL= (0..7)
0 120 120 120 120 120 120 120 
##$TP= (0..7)
150 150 150 150 150 150 150 150 
##$TP07= 0
##$TPNAME0= <>
##$TPNAME1= <>
##$TPNAME2= <>
##$TPNAME3= <>
##$TPNAME4= <>
##$TPNAME5= <>
##$TPNAME6= <>
##$TPNAME7= <>
##$TPOAL= (0..7)
0.5 0.5 0.5 0.5 0.5 0.5 0.5 0.5 
##$TPOFFS= (0..7)
0 0 0 0 0 0 0 0 
##$TUNHIN= 0
##$TUNHOUT= 0
##$TUNXOUT= 0
##$USERA1= <user>
##$USERA2= <user>
##$USERA3= <user>
##$USERA4= <user>
##$USERA5= <user>
##$V9= 5
##$VALIST= <valist>
##$VCLIST= <CCCCCCCCCCCCCCC>
##$VD= 0
##$VDLIST= <DDDDDDDDDDDDDDD>
##$VPLIST= <PPPPPPPPPPPPPPP>
##$VTLIST= <TTTTTTTTTTTTTTT>
##$WBST= 1024
##$WBSW= 4
##$XGAIN= (0..3)
0 0 0 0 
##$XL= 0
##$YL= 0
##$YMAX_a= 72005
##$YMIN_a= -69433
##$ZGOPTNS= <>
##$ZL1= 120
##$ZL2= 120
##$ZL3= 120
##$ZL4= 120
##$ABSF1= 10
##$ABSF2= 0
##$ABSG= 5
##$ABSL= 3
##$ALPHA= 0
##$AQORDER= 0
##$ASSFAC= 0
##$ASSFACI= 0
##$ASSFACX= 0
##$ASSWID= 0
##$AUNMP= <proc_1d>
##$AZFE= 0.1
##$AZFW= 0.1
##$BCFW= 1
##$BC_mod= 2
##$BYTORDP= 1
##$COROFFS= 0
##$CY= 11.3945322036743
##$DATMOD= 1
##$DC= 2
##$DFILT= <>
##$DTYPP= 0
##$F1P= 2.36226072786647
##$F2P= -0.459571619588291
##$FCOR= 0.5
##$FTSIZE= 0
##$FT_mod= 4
##$GAMMA= 1
##$GB= 0.15
##$INTBC= 1
##$INTSCL= 1
##$ISEN= 128
##$LB= 0.24
##$LEV0= 0
##$LPBIN= 0
##$MAXI= 10000
##$MC2= 0
##$MEAN= 0
##$ME_mod= 0
##$MI= 1.114404
##$NCOEF= 0
##$NC_proc= 0
##$NLEV= 6
##$NOISF1= 3.799351
##$NOISF2= 2.8
##$NSP= 1
##$NTH_PI= 0
##$NZP= 0
##$OFFSET= 15.70392
##$PC= 1
##$PHC0= -15951.62
##$PHC1= 13.80078
##$PH_mod= 1
##$PKNL= yes
##$PPARMOD= 0
##$PSCAL= 0
##$PSIGN= 0
##$REVERSE= no
##$SF= 200.130013532006
##$SI= 16384
##$SIGF1= 3
##$SIGF2= 2
##$SINO= 400
##$SIOLD= 16384
##$SREGLST= <1H.CDCl3>
##$SSB= 0
##$STSI= 0
##$STSR= 0
##$SW_p= 3612.71676300578
##$SYMM= 0
##$S_DEV= 0
##$TDeff= 0
##$TDoff= 0
##$TI= <>
##$TILT= no
##$TM1= 0
##$TM2= 0
##$TOPLEV= 0
##$USERP1= <user>
##$USERP2= <user>
##$USERP3= <user>
##$USERP4= <user>
##$USERP5= <user>
##$WDW= 1
##$XDIM= 8192
##$YMAX_p= 0
##$YMIN_p= 0
$$ End of Bruker specific parameters
$$ ---------------------------------
##NTUPLES= NMR FID
##VAR_NAME=  TIME,          FID/REAL,        FID/IMAG
##SYMBOL=    X,             R,               I
##VAR_TYPE=  INDEPENDENT,   DEPENDENT,       DEPENDENT
##VAR_FORM=  AFFN,          ASDF,            ASDF
##VAR_DIM=   8192,          8192,            8192
##UNITS=     SECONDS,       ARBITRARY UNITS, ARBITRARY UNITS
##FACTOR=    0.0002768,     1,               1
##FIRST=     0,             0,               0
##LAST=      2.2672688,     0,               0
##MIN=       0,             -69433,          0
##MAX=       2.2672688,     72005,           0
$$ Real data points
##PAGE= N=1
##DATA TABLE= (X++(R..R)), XYDATA
$$ [...]
397F556L78o594j0332K892J9155R77k5982m672L0134P730l1255r888K9292J0944
$$ 6556 6934 340 -9992 -7100 12055 13032 -12950 -17622 12512 20242 -11013 -20901 8391 19335
411A9335k4474j0841J7387R634q748p472n04M681R498j565j7330j539K3253M329
$$ 19335 -5139 -15980 1407 11041 2293 -5179 -5683 -1002 8496 6931 -10399 -11938 11315 15644
425A5644k6749o452K7517P713k5632q007K1294P349j5099n855P713L746P5j309
$$ 15644 -11105 -17557 9960 17673 -7959 -15966 5328 12677 -2422 -8277 -564 3182 3257 1948
439A948p523j092J3871L172j8587m602K1292N208k1800m882K0208L744j6821j893
$$ 1948 -5575 -6667 7204 10376 -8211 -12813 8479 13687 -8113 -12995 7213 10957 -5864 -7757
453g757J2017l00o445K554O40m506M839N767r424o238J2814N672j4721m192J5114
$$ -7757 4260 3960 -2485 69 709 -3797 1042 6809 -2615 -8853 3961 9633 -5088 -9280 5834
468E834J869j4046R89J1763l985q635O759N062q922j423J0178j921j0230M681
$$ 5834 7703 -6343 -5354 6409 2424 -6211 548 5610 -3312 -4735 5443 3522 -6708 -2027
482b027R047o667o605P775L161q034R45P562n303o542R393N156j2780l627J4962
$$ -2027 7020 353 -6252 1523 4684 -3350 -2405 5157 -146 -6688 2705 7861 -4919 -8546 6416
497F416K099j5621p39J4571l88j1850J241P689j831k446K211l369k358R083K469
$$ 6416 8515 -7106 -7845 6726 6338 -5512 -4271 3418 1587 -859 1352 -2017 -4375 4708 7177
512G177j4120k510J7882K591j9922k653J9925K750j7882k796J3856K774q296k594
$$ 7177 -6943 -9453 8429 11020 -8902 -11555 8370 11120 -6762 -9558 4298 7072 -1224 -3818
526c818J667K227N256j589j1857P07J7403L92k1276j684K3087K969k2534m145
$$ -3818 -2151 76 5332 3743 -8114 -7407 9996 10388 -10888 -12572 10515 13484 -9050 -13195
540a3195J9719N040j4839n537Q453N537j149n011o277L964J3127k502j8659P34
$$ -13195 6524 11564 -3275 -8812 -359 5178 4029 -982 -7259 -3295 9832 7330 -11329 -10595
554a0595K2299J124k3724k856K2735M289j9495n277J4307N709p770n533N23M859
$$ -10595 11704 12828 -10896 -13752 8983 13272 -6223 -11500 2807 8516 746 -4787 -4264 595
568E95O685l729j3142K274J8221o44k1403r59K2425K372k1200l456J7915M133
$$ 595 7280 3551 -9591 -7317 10904 10260 -11143 -12102 10323 12695 -8505 -11961 5954 10087
582A0087j2919m339O767M080j48l411o327K449J1916j295j6203J46J8705Q80j9265
$$ 10087 -2832 -7171 -404 3676 3528 117 -6210 -3761 8155 6860 -9343 -9197 9508 10388 -8877
597h877j628J7910K009j4838j986J0457J640n265j033j71K97N295M31r569j017
$$ -8877 -10505 7405 9414 -5424 -7410 3047 4687 -578 -1611 -1782 -1485 3810 4241 -5328 -6345
612f345J2709J272j4416j141J4558O36j3309K07J0791j256p419K368L553l372
$$ -6345 6364 7636 -6780 -7921 6637 7273 -6036 -5829 4962 3706 -3713 -1345 2208 -1164
626a164M25M003m051m106O945L712q926k737R849J242r685O63Q564k723o696M775
$$ -1164 -739 3264 -787 -4893 2052 5764 -3162 -5899 3950 5192 -4493 -3830 4734 2011 -4685 90
642I0M327o495j788P660o29q084K643P646m114o356M928M232n096j483M692j683
$$ 90 4417 -2078 -3866 3794 3165 -4919 -2276 5370 1256 -5100 -172 4060 -1036 -2519 2173 490
658D90l829M924K645p814j412J0106K56j1456O80J1713j304j0723J594Q554j522
$$ 490 -3339 1585 4230 -3584 -4996 5110 5366 -6090 -5410 6303 4999 -5724 -4130 4424 2902
673B902n397J171J514o63K772M4o921N10J0487q84j3183J040J4612r19j4598N24
$$ 2902 -2495 -1324 190 -473 2299 2343 -4578 -4068 6419 5535 -7648 -6608 8004 7085 -7513 -6989
689f989J3077R2j0176q59O198J666j492k334l475K780Q171k877j2138K647J4928
$$ -6989 6088 6180 -3996 -4855 1343 3009 1517 -817 -4292 -1512 6659 3782 -8356 -5709 9219
704I219k046j6252J149J5931m8j4017j129J0664K244o280l169J264L756L858l948
$$ 9219 7173 -9079 -7930 8001 7953 -6064 -7193 3471 5715 -565 -3734 -2470 1286 5144 1196
719A196q584L753J2446l174j5024K267J6110j176j5541k7J3456J202j0009k253
$$ 1196 -7388 -3635 8811 5637 -9387 -7120 8990 7814 -7727 -7754 5702 6904 -3105 -5358
733e358N633L082p51l586m127L707Q553l541j2052L040J4287k319j5031J409J4256
$$ -5358 275 3357 2606 -980 -5107 -1400 7153 3612 -8440 -5400 8887 6568 -8463 -7054 7202
748G202m60j2074m65Q726J278m632j893J94K277M093k381p768K274J0566k050
$$ 7202 6742 -5332 -5797 2929 4207 -425 -2318 -2124 153 4246 1865 -5903 -3629 6937 4887
763D887j2126J701J2412j331j1408R88R310p01o401M62L002l05N44J56l858K0
$$ 4887 -7239 -5538 6874 5543 -5865 -4877 4433 3732 -2669 -2207 795 490 1034 1190 -2668 -2648
779b648O519k58q352N57R250r70r131J482Q047j996o218K500L872k893j242L101
$$ -2648 3871 3613 -4739 -4182 5068 4098 -5033 -3551 4496 2500 -3718 -1218 2654 -239 -1481 1620
795A620j337l028L573K665n244j949O179R34o333K89N791j671m634L058L012m311
$$ 1620 283 -2745 828 3493 -1751 -3700 2479 3413 -2920 -2631 3160 1489 -3145 -87 2925 -1386
811a386j222N299n87n810K102N798l190n242L778M153l823k525L355N18k465J694
$$ -1386 -2608 2691 2104 -3706 -1604 4194 1004 -4238 -460 3693 -130 -2655 700 1218 -1247 447
827D47J311l881l6N773j128p222K054Q047k641q103K789P347k525n843J860L701
$$ 447 1758 -2123 -2159 3614 2486 -4736 -2682 5365 2724 -5379 -2590 4757 2232 -3611 -1751 1950
843A950r18j057k11j831J382M596k368o992L077Q810l423r785L328R804k764q858
$$ 1950 1032 -25 -236 -2067 -685 3911 1543 -5449 -2372 6438 3015 -6770 -3442 6362 3598 -5260
859e260J861P000o70m406o90J354J970J923l071n009L810P600m153r483M027J0426
$$ -5260 -3399 3601 2931 -1475 -2165 -811 1159 3082 11 -4998 -1188 6412 2259 -7224 -3197 7229
875G229l499j0287K537R145j296p098r0M370J503j215k720k095L715N102m266
$$ 7229 3730 -6557 -4020 5125 3829 -3269 -3359 1011 2514 1299 -1421 -3516 199 5301 1035
890A035p614M442R373m192j0153L497R929k489q699J230O638R4l927j439Q60K585
$$ 1035 -6579 -2137 7236 3044 -7109 -3612 6317 3828 -4871 -3641 2997 3091 -836 -2275 -1415 1170
906A170K262l464n071L976P293m115q746L927R221l358q735K518P393j519n321
$$ 1170 3432 -32 -5103 -1127 6166 2051 -6695 -2768 6453 3095 -5640 -3122 4271 2752 -2569
921b569M45K787N98rj538k621K257M844k721o478K954P353k969p414K757O691
$$ -2569 -2124 663 1261 1252 -286 -2907 -650 4194 1473 -5005 -2051 5302 2333 -5081 -2324 4367
937D367k373n344J877L473j302j300O79q82o5K866n21m419J072N384j549n660
$$ 4367 1994 -3350 -1473 2000 698 -602 77 -805 -870 1996 1475 -2944 -1872 3512 1963 -3697
953c697J895N383k212m482K426L079k496j440K469l05k298J934J918l199j415
$$ -3697 -1802 3581 1369 -3113 -687 2392 -104 -1544 925 620 -1678 256 2174 -1025 -2440
968b440M000P70m283RM002q51l240J734K091k544o98L193o83l642J914L836k844
$$ -2440 1560 2330 -1953 -1944 2058 1207 -2033 -299 1792 -752 -1450 1743 1060 -2582 -668 3168 324
985C24l718L369L256l423k467L015J408k219j38J117j248J38K556j353l743K415
$$ 324 -3394 -25 3231 -192 -2659 356 1764 -455 -593 524 -724 -586 1970 617 -3126 -711
1001g11M608l174n090L519N148l427m725K910L833j986k519Q12R00N13Q93j823
$$ -711 3897 723 -4367 -848 4300 873 -3852 -942 2891 905 -1614 -802 98 611 1504 -319
1017c19k644K960M139l730n291M095N955m006o057L458N545k521m495J284K949
$$ -319 -2963 -3 4136 406 -4885 -790 5165 1159 -4898 -1440 4105 1584 -2911 -1627 1322
1032A322J26j087j530r02K767K839l740m435M257N626m350o262L995O298l212
$$ 1322 1448 361 -1169 -2071 696 3535 -205 -4640 -383 5243 893 -5369 -1374 4924 1712
1047A712n700K096M578p70k978o62J084J997R11l115k816L919M370m309n480M261
$$ 1712 -3988 -1892 2686 1916 -1062 -1724 -640 1357 2268 -847 -3663 256 4626 317 -5163 -902
1063i02O045l830n967L002N332j929m115O77K495O19o42j813j234K785K931l452
$$ -902 5143 1313 -4654 -1652 3680 1751 -2364 -1687 808 1427 785 -1028 -2262 523 3454 2
1079Bm236L768N050l716n322L342N017k679m210J820K944q30j411j93k03J101
$$ 2 -4234 -466 4584 868 -4454 -1112 3905 1226 -2984 -1164 1780 950 -461 -654 -857 244
1095B44J738j868l004K417L900k740m304K809M243k641l719K287K804j773j601
$$ 244 1982 114 -2890 -473 3427 687 -3617 -808 3435 794 -2925 -638 2166 393 -1208
1110a208J143K90m86R96j43k124P29K916j186l367J547L368j786k971J890K221
$$ -1208 -65 225 -261 735 592 -1532 -803 2113 927 -2440 -893 2475 689 -2282 -392 1829
1126A829j908j199J800P1j610J045J325j984r71K651N80k950j31K872l33k415
$$ 1829 -79 -1278 522 593 -1017 28 1353 -631 -1602 1049 1629 -1321 -1452 1420 1087 -1328
1142a328Q04J646j249o66J644m26j928J428K116k246k167K782K056k987j788K798
$$ -1328 -524 1122 -127 -793 851 425 -1503 -75 2041 -205 -2372 410 2466 -521 -2309 489
1158D89J366k269q04J451J23m19O06o88j320J726J980k578k498L156K836l366
$$ 489 1855 -414 -1218 233 356 -63 543 -145 -1465 261 2241 -337 -2835 321 3157 -209
1174b09k910L195K716k636k295J778J600o87p21n18k65J673J241k653k133L364
$$ -209 -3119 76 2792 156 -2139 -361 1239 552 -169 -687 -952 721 1962 -691 -2824 540
1190E40K829l700l283L650L409l186l216K395K684j330j873R7Q94J133K09k254
$$ 540 3369 -331 -3614 36 3445 259 -2957 -562 2122 792 -1081 -984 -90 1043 1252 -1002
1206a002j283L144K230l708k964L874L424l666l528L054L295k139k749J028J914
$$ -1002 -2285 859 3089 -619 -3583 291 3715 49 -3479 -425 2870 731 -2018 -990 924
1221I24J96q89j389k09K412J267l148k212L587K885l621l263L333L279k699k955
$$ 924 1120 231 -1158 -1367 1045 2312 -836 -3048 539 3424 -197 -3460 -127 3152 453 -2502
1237b502J836K291q01j407k88M30J250O16k113j548K706K279l025k722L009K874
$$ -2502 -666 1625 824 -583 -871 -441 809 1425 -688 -2236 470 2749 -276 -2998 11 2885
1253B885k748k679K235K197j524j498P25O57J05K52q90j066J529J749j993k174
$$ 2885 137 -2542 -307 1890 366 -1132 -407 250 355 607 -283 -1349 180 1929 -64 -2238
1269b238K222K360k260k255K092J876j734j304J261N62p08J87J74r28L23J544
$$ -2238 -16 2344 84 -2171 -79 1797 63 -1241 20 582 -126 61 235 -693 -370 1174
1285A174p82j912J090K058j290j924J373J537j336r47J225K32j017N03P90j181
$$ 1174 392 -1520 -430 1628 338 -1586 -213 1324 -12 -959 266 498 -519 -16 774 -407
1301d07n41J729K59k039j4K087k08j872L95J421n69p65O83Rp83P85Q36j482q90
$$ -407 -948 781 1040 -999 -1013 1074 866 -1006 -611 810 241 -524 159 168 -615 170 1006 -476 -1366
1320a366K048Q70k360q22K420P33k187n92J697M05r90j67J54j26P44M11j572o97
$$ -1366 682 1552 -808 -1630 790 1523 -664 -1256 441 846 -144 -311 -157 -283 461 872 -700 -1397
1338a397K207R77k634j170K765J283k602j290K153J162j438r34N64N93L93j68
$$ -1397 810 1787 -847 -2017 748 2031 -571 -1861 292 1454 16 -918 -354 239 632 464
1354D64j326k69K118P13k686j096K964J396k952j549K606J581k003j446J177J163
$$ 464 -862 -1131 987 1700 -986 -2082 882 2278 -674 -2223 383 1964 -39 -1485 -308 855
1370H55k25p73p46K76J658K26k386p23K852J156l037j458K880J648k463j633J777
$$ 855 630 -143 -889 -613 1045 1271 -1115 -1838 1014 2170 -867 -2325 555 2203 -260 -1893 -116
1387a16J481r27j157K0O99R05j81j699l52K295Q33k632j232K714J469k508j543
$$ -116 1365 438 -719 -699 0 905 724 -975 -1327 968 1801 -831 -2063 651 2120 -388 -1931
1404a931K048J430j402j188O55P79J66l30r21j58J552O21k018r63K238J217k252
$$ -1931 117 1547 145 -1043 -388 391 557 227 -694 -852 700 1321 -697 -1660 578 1795 -457
1421d57j287K045J213j635r94J085O54m44k69j81j67P55N68j232q71J541J065
$$ -457 -1744 301 1514 -121 -1115 -30 624 180 -89 -270 -437 318 886 -346 -1217 324 1389
1438A389j669j136J636J039j441q16J111M85p04q7K77l30J36P20n04r98P69J167
$$ 1389 -280 -1416 220 1259 -182 -998 113 598 -106 -193 84 -246 -110 610 106 -892 -123 1044
1456A044r36j170R74J033r33p23P89L29o00J23L83n88j61R91l3j289J83J438l03
$$ 1044 108 -1062 -88 945 12 -711 78 407 -193 -70 313 -275 -436 555 522 -767 -584 854 551
1475E51j415L70J207l63q56L29L90k64J54J97o90j23J159R1j529p4J731P3j744
$$ 551 -864 -494 713 350 -506 -177 213 -51 103 300 -390 -513 646 737 -792 -866 865 938 -806
1494h06j16J545J60j183j75O62J97p4j63n57J02J134j8j581j14J892K38j976l69
$$ -806 -922 623 783 -400 -575 87 284 210 47 -510 -408 726 708 -873 -987 905 1143 -833 -1202
1513a202J874M69j542n37J054N58m52m91k33L94Q75k33j454N1J857J57k088l69
$$ -1202 672 1141 -401 -938 116 674 222 -269 -502 -108 767 534 -920 -869 988 1145 -943 -1312
1531a312K102N20j878o52J475P07r05p01K62O08M29m57j064K56J579j2j925k12
$$ -1312 790 1310 -568 -1220 255 962 57 -644 -382 226 655 198 -866 -610 969 957 -968 -1180
1549a180K057M31j976n97J692P13j258p32O83O59m5n23n70L17J121r6j530j52
$$ -1180 877 1308 -668 -1265 427 1140 -118 -850 -167 492 447 -76 -646 -329 792 696 -834 -986
1567i86J771L58j812n27J671O31j377o33R32N85m23m46j11K64O28p8j046j36J362
$$ -986 785 1143 -669 -1196 475 1106 -271 -904 28 613 190 -256 -367 -103 525 447 -599 -735 627
1586F27K87j499m17J475M85j301n01J015M29o22k96J89J20K36O9o00k55Q90M05
$$ 627 914 -585 -1002 473 958 -343 -844 171 600 -22 -318 -129 -9 227 296 -304 -559 331 736
1605G36j069m82J099N31j033m60Q38L40n84j67K82l9RK64k90m58M95N99o35o75
$$ 736 -333 -815 284 815 -218 -678 160 500 -84 -251 31 -8 1 265 -25 -483 12 611 -24 -699
1625f99O78O73o53n59N31L87l74j46K05j50MM10j57o57L03Q38m00q98M07Q79l63
$$ -699 -21 652 -1 -560 -29 358 -16 -162 43 -107 -103 307 150 -507 -204 634 234 -664 -257 622 259
1646B59p39K61N21j30k54K0j06J03M43j99p50K72R63k80j099K36J109j45j004
$$ 259 -480 -219 302 172 -82 -62 -168 -65 378 179 -571 -299 664 384 -715 -479 630 485 -519
1665e19M2P68Q9m55j85P7K66L33l22o90L27R78k72j175J81J269o9j220p1J023
$$ -519 -477 291 380 -75 -260 -183 83 416 94 -596 -269 709 437 -738 -557 712 643 -577 -648 375
1685C75K05p36l10L60L92N8m30m75M07Q49l58j126K57J289j20j321j8J203J69
$$ 375 580 -156 -466 -106 286 344 -86 -561 -154 695 337 -789 -532 757 637 -684 -702 501 670
1704F70r54l07O19L97k12m41k12M38O01l73r22K70J143j47j239pJ203J58j040
$$ 670 -284 -591 28 425 213 -228 -440 -2 599 226 -696 -426 717 570 -669 -676 527 685 -355
1723c55k80P74L56m18l91L1L83L35l42o43K46R03j23j051NJ091J00j000k18Q27
$$ -355 -635 139 495 77 -314 -283 100 435 93 -550 -304 599 476 -575 -570 521 621 -379 -597 230
1743B30K75n70k87K31K83J07k45m00J50O54o5q23l3R03J15q77j78P54K13n41k12
$$ 230 505 -65 -352 -121 162 269 24 -376 -226 428 363 -460 -493 410 525 -352 -530 224 437 -104 -316
1764c16K88J74l1q1k36J0M49Q3n93j61O60K16o58k40N68K27m23j84K48Q3m5K4
$$ -316 -28 146 115 34 -202 -192 257 340 -253 -414 246 462 -196 -436 132 359 -64 -248 0 83 38 62
1786F2j54j23L00K36m14l23M84L61m76l63M16L20l07k18J50J08NK8j30k07K67
$$ 62 -92 -215 85 321 -93 -416 68 429 -47 -410 6 326 19 -199 -49 59 64 92 -38 -245 22
1807B2L26l28m44L61N08l50n05K73M58j90l43N1J94Q2Rj97k11K96L70l21n22L19
$$ 22 348 20 -424 -63 445 95 -410 -137 321 131 -212 -161 33 115 124 -73 -284 12 382 61 -461 -142
1829a42O26k84o35J94N89r0m82j9L00J59j10k56j04L13L17l41n04L27O37k83p01
$$ -142 484 200 -435 -241 348 258 -224 -243 57 216 106 -150 -254 59 376 35 -469 -142 495 212 -489
1850d89K00O97q7o07m6M74J62k72k73M6L29K14l67m14L47N75k94o86J96P27j00
$$ -489 -289 408 321 -286 -332 142 304 32 -241 -195 134 348 -19 -433 -86 489 195 -491 -295 432 332
1871C32o65l0N43J42l64k44J46L04Q5l30k90L18M86k73o04J95O63j00o62lN86
$$ 332 -333 -363 180 322 -42 -286 -140 164 249 -81 -371 -53 433 160 -444 -249 414 314 -348 -351 235
1892B35J00m19j87K41K51n3k72j54K58L43k31m76J61N59r1n80kN47P4m44j38K82
$$ 235 335 -84 -271 -30 221 168 -104 -258 0 343 112 -364 -203 356 265 -315 -317 230 304 -140 -278 4
1914DJ74j01j93p2J84K35j46l54Q8M53l6m85j8M57Q4l87j25K72J33j25j28m2J14
$$ 4 178 77 -116 -188 -4 231 85 -269 -181 272 236 -249 -267 190 274 -113 -238 34 167 42 -86 -128 -14
1937a4J79p0k87oL82L7l77j01L64J30l00j42K05J31r2r7k9N2J36J4k48m8K86J22
$$ -14 165 95 -192 -198 184 221 -156 -257 107 237 -63 -205 0 131 39 -58 -87 -35 101 115 -133 -181 105 227
1961B27l20j61L00J89k37j96J46J70n3j05n4M4J40L6k20j10K63J82k75k31K52
$$ 227 -93 -254 46 235 -2 -198 -52 118 65 -40 -94 -50 90 126 -94 -204 59 241 -34 -265 -13
1982a3K65j89k66J25K15k7j49p9O7J69K9k24j40K60K18k72k71K26L14j80l14J00
$$ -13 252 63 -203 -78 137 110 -39 -118 -51 118 147 -77 -217 43 261 -11 -282 -56 258 78 -236 -136
2004a36K65Nk09q8J24J79k6k24q9K60J97k71k69K36L28j85l28R9L12jk76p1J69
$$ -136 129 134 -75 -163 -39 140 114 -110 -199 61 258 -13 -282 -46 282 97 -231 -132 180 179 -97 -168 1
2027AJ55p1j95n0K29J59k46k51K22L11j73l34R2L14kk88n8K16J20r5j91kK19R9
$$ 1 156 85 -110 -160 69 228 -18 -269 -47 264 91 -243 -151 163 161 -127 -185 31 151 56 -135 -137 82 181
2051A81k10j95J97K68j53l11J02L01k9k73l7K15Q6j23j51M0J68O4j80j43J61K23
$$ 181 -29 -224 -27 241 88 -223 -121 180 151 -122 -159 56 142 19 -132 -92 76 140 -40 -183 -22 201
2073B01j27k78P9K69j3k40n2K11R0j35j29N9J40M0j46j13J09J87q0k33N4K26P
$$ 201 74 -204 -125 144 131 -109 -161 50 140 5 -124 -65 75 115 -31 -144 -35 152 72 -161 -107 119 126
2096A26k22l7J69Q3j20j02M6J04M4j04j14R2J58m6j95J0K03K8j82o7J49R4j01
$$ 126 -96 -133 36 119 -1 -103 -57 47 91 -13 -127 -35 123 77 -118 -108 95 123 -59 -126 23 117 16
2119A6j11L9R1L3p5r1M5J34j1j66j8J65O4j61r4J40J00p7j09K6J03L2q2q4M8J36
$$ 16 -95 -56 35 68 -7 -98 -53 81 70 -96 -114 51 115 -46 -140 0 100 23 -86 -60 43 75 -7 -91 -43 93
2145I3nj57l7J49R4j50j21J26J29p8j28J0J11L7p6r2M2J26j1j36m4J49Q4j32j26
$$ 93 88 -69 -106 43 137 -13 -134 -8 121 43 -85 -75 36 73 -3 -95 -53 73 62 -74 -118 31 115 -17 -143
2170a43J09J35n8j36J7J14N2j04p9O5J07oj34m7J45P3j15j26R1J48m6j51PJ26
$$ -143 -34 101 43 -93 -76 38 90 -14 -93 -28 79 73 -61 -108 37 110 -5 -131 -40 108 62 -89 -82 44
2194D4M0j00p1N7J14k3j27l2J28O8r8j17Q2J27m9j34NJ35L2j03p6P6R1k0j16j7
$$ 44 84 -16 -87 -30 84 61 -66 -98 30 98 0 -117 -35 92 43 -91 -86 49 81 -22 -98 -22 69 49 -67 -84
2220h4J09O0r0r5N9J34m7j30QJ24K9r6o0O7Q8l1r6j3J01M1o8q4M9R5k8j05j7J08
$$ -84 25 85 -5 -100 -41 93 46 -84 -76 48 77 -19 -79 -12 76 45 -51 -64 37 78 10 -74 -25 70 42 -63 -80 28
2248B8M2q4p0O1P8k1q4j9P9M8p1o5M8R4j9r9k2J07M6q2n7M5Q5k6q8LP0L8m6p3
$$ 28 70 -14 -84 -23 55 34 -50 -69 10 58 -13 -78 -30 64 45 -54 -76 31 77 -5 -62 -17 68 42 -46 -43 27 65 19 -54
2278e4K6P7rq6k0Q2M5p4n9M4Q0k9p2oO7L3n8m9M9N8j0o8k4O6N1m9o8L3P6k0o9
$$ -54 -28 49 40 -46 -66 16 61 -13 -72 -28 52 23 -49 -55 12 45 -13 -62 -13 45 35 -33 -57 9 60 11 -57 -24 52 32 -37
2309c7lO9J7m5l7L1L4Pn5l6M9N8n0n8K4O1Pp4jN2K9n4l0K8M5j5l3k2M7L7m0l9
$$ -37 -40 29 46 1 -36 -5 29 36 -19 -55 -6 52 2 -56 -32 29 36 -38 -39 13 42 -12 -42 -14 31 16 -17 -39 8 45 5 -34
2341c4J3N5on4j2N3K0m6j9J2K9J0k3l2J8M7j9l4j3O1J2m5k8M9K4l4l6K9K3rk0
$$ -34 -21 34 28 -26 -38 15 35 -11 -30 -18 11 21 -2 -34 -16 31 12 -22 -35 26 38 -7 -35 14 38 4 -32 -3 20 11 -9
2372ij7J0K4Rm0j4N1J8n3l1N0L5l5l2J2L5jj6j3NK7J5l8k4L8M0m7m2M2M9l5m4
$$ -9 -26 -16 8 17 -23 -37 14 32 -21 -52 -2 33 -2 -34 -22 13 12 -4 -17 -12 15 30 -8 -32 6 46 -1 -43 -1 48 13 -31
2404c1J1M2j4nl3ML4Rl5j9L4L4l9m7M0N5l8n6L1N3j8m1J2K2J4ml3qL5K6l0m4L5
$$ -31 -20 22 8 3 -30 -26 8 17 -18 -37 -3 31 -8 -55 -15 40 2 -54 -23 30 12 -29 -17 5 19 15 -18 -26 9 35 5 -39 -4
2437dM8l3m9J1N8j2m1nM2nj6mj5K6J6k1l7L4L4k5l5J9M3j2m5J5L0j8rKOLRkl0
$$ -4 44 11 -38 -27 31 19 -22 -27 15 10 -6 -10 -25 1 17 -4 -41 -7 27 2 -33 -14 29 17 -28 -13 17 -1 -10 -8 -2 1 10 8 -22
2472b2J1M0j4m1J7L2j4m5K0L3j8j4K4kqjPj9J0J6Ll6PL1j6k6K1J9k3j3J4J2j9
$$ -22 -11 29 15 -26 -9 23 9 -36 -16 17 -1 -15 9 7 -1 -2 5 -14 -4 12 15 -21 -14 17 1 -25 -4 15 -8 -21 -7 5 -14
2505a4%J8qj9K0K0k0k0K3J5k9PJPj5L4j1k5KL9Ln4K3L6k5k2J1J3j9LJ7k7PK0j0
$$ -14 -14 4 -4 -23 -3 17 -3 -23 0 15 -14 -7 -6 1 -14 20 9 -16 -14 25 28 -26 -3 33 8 -14 -3 10 -9 -6 11 -16 -9 11 1
2540Ak3QK8ol5J1L9j5m1J9L0kk9NJ7%K%k8J4K3ok7NM1k0m6K6L7j4m3J9J9mj8J2
$$ 1 -22 -14 14 8 -27 -16 23 8 -33 -14 16 14 -15 -10 7 7 9 9 -19 -5 18 12 -15 -10 31 11 -35 -9 28 14 -29 -10 9 5 -13 -1
2576anj1L3j3m2K5M3j9m0J6M1k1l4RK8pk3J5KNJ1mk6jM4qm5J8L9k2l1K0K8k4j5
$$ -1 -6 -17 16 3 -39 -14 29 10 -30 -14 27 6 -28 -19 9 2 -21 -6 -4 1 12 8 -18 -19 25 17 -28 -10 29 7 -24 -4 24 0 -15
2611a5J8J7k4PQj0oRPk9J0K7j0k8NK7j8pPOj8PL0k9j6J3L4l0oKK7k9RJ4pjK4j5
$$ -15 3 20 -4 3 11 1 -5 4 11 -18 -8 19 9 -19 -14 13 -5 -12 -5 1 -17 -10 20 -9 -25 -12 22 -8 -14 -12 15 -14 -5 9 2 1 25 10
2649A0j5PL2k6l0L0K9l8k3J2L3k4j8J2J%Qj0j5J0L3j8m6K4N0k0m9K4M4j0l1J1
$$ 10 -5 2 34 8 -22 8 37 -1 -24 -12 21 -3 -21 -9 -8 -8 0 -10 -25 -15 18 0 -46 -22 28 8 -41 -17 27 17 -14 -3
2681cJ5Llj9jJM2l4l3L4M1k3p2K8O5k1m0LK6Rk3j1jJ8Rj9k7J6N8l4n5L3N7j6p2
$$ -3 12 15 12 -7 -8 -7 35 1 -32 2 43 20 -52 -24 41 20 -20 -17 9 18 -5 -16 -17 1 10 -9 -36 -20 38 4 -51 -18 39 23 -49
2716d9L2M5ql2oML0Nk8j6K7L4k2n1J5O4j3o9K1L5J2m9kJ6J9Pj7k6J6M0j4n8J8
$$ -49 -17 28 20 -12 -18 -14 16 21 -7 -23 4 38 16 -35 -20 44 31 -38 -17 18 30 -19 -21 -5 14 21 4 -22 -6 34 20 -38 -20
2749b0N6k3n3J3N1ql2nK9kqj1nJL8%m2nO2j3n4ON4kl0rJ9MomjpL0mm2jL9J1n4
$$ -20 36 13 -40 -27 24 16 -16 -21 8 6 -2 -13 -18 -17 21 21 -21 -26 36 23 -31 -25 29 27 -3 -12 7 11 5 1 0 -7 23 19 -23 -24 15 26 -28
2788b8j4N7Nk6k8K1J6%%k4PK3Rl1j9N8J4m7j9L9L0l6k4J3K1orpmK1J3l9l1O5K5
$$ -28 -42 15 20 -6 -34 -13 3 3 3 -21 -14 9 18 -13 -32 26 40 -7 -26 13 43 7 -17 -4 17 11 2 -5 -9 12 25 -14 -45 20 45
2823D5m7n6M6M3j6m5JM6jl4nRL9nm1k1N1M0o1k6M1N6m3n5K5M0pl0j4J9L6mm3j6
$$ 45 -2 -58 -12 31 15 -30 -29 17 16 -18 -23 -14 25 20 -21 -42 9 49 -12 -38 3 59 16 -39 -14 26 19 -11 -25 -6 30 26 -17 -33
2857c3N0K0k9n8M6N8m0o1K9M8mm2k4M3K2k1l5lM8K0n0l5M3O3l5p6K6O1j1n2jM2
$$ -33 17 37 8 -50 -4 54 14 -47 -18 30 26 -16 -40 3 25 4 -31 -34 14 34 -16 -51 -8 55 20 -56 -30 31 20 -32 -33 9
2889IRj0k6oM9J7m6m2N5N4l6p4K7O5j4n5RL0K1l2l1JL0K4l7m0L8M4k5o4K3O6j2
$$ 9 18 8 -18 -24 25 42 -4 -46 9 63 27 -47 -20 45 31 -24 -15 15 36 4 -27 -26 4 28 -9 -49 -11 33 8 -56 -33 33 21
2922B1n7OL8J6k2l0ML0K3k0l1JO5j0p3J1O5Qo4j6N1Pj9k4pL6J7k9m3J1O8j8o1
$$ 21 -36 -30 8 24 2 -28 -24 6 29 9 -22 -21 44 34 -39 -28 37 45 -19 -35 16 23 4 -20 -27 9 26 -3 -46 -35 33 15 -46
2955d6KO3J8n8k1M6K2k8j4MK1J7k0m7J4N9rn6j3P5J2n3k5K9M3k3l5nK7M1l0m1
$$ -46 -44 19 37 -21 -42 4 26 -2 -16 -12 9 26 6 -41 -27 32 23 -33 -46 29 41 -12 -37 -8 35 12 -23 -28 -1 40 10 -31
2987c1jN7J4p4k5Q1L3o9m0M2M8j2o7J0L7K9k8n6K0O6no0k1P2M6q5l8N3N2l7n1
$$ -31 -32 25 39 -35 -60 21 54 -15 -55 -13 35 23 -44 -34 3 32 4 -52 -32 34 29 -31 -52 20 66 -19 -57 -4 48 11 -40
3018d0RO2J6m6l9L1M9ko3k1O9L6p3m7O3N0l0o6J0N7J3m8k5QN5%o9rO2M3p1n1O2
$$ -40 -31 31 47 1 -38 -7 42 40 -23 -44 25 61 -12 -59 4 54 24 -42 -32 25 38 -10 -35 -27 28 28 -41 -50 12 55 -16 -67 -5
3051eN0l2n7J6N7Ln0j6L3K8Qn3k7O4L9o8m4N3O1m2n7J0N7J1n0k8K5M3j5n0lM3
$$ -5 45 13 -44 -28 29 32 -18 -34 -1 27 35 -18 -45 19 58 -10 -54 -1 60 18 -39 -29 28 39 -11 -39 -14 29 14 -36 -39 4
3083DL3m1n1L7O8l2o2K3M5J2m7k1K4L2km0j7M6L5m7n2L6O6k1p2J2N9J3n8j6K8
$$ 4 37 -4 -55 -18 50 18 -44 -21 24 36 -11 -32 -8 24 22 -18 -35 11 46 -1 -53 -17 49 28 -44 -32 27 40 -18 -34 -6
3114fL4qm1j7M5L9m0n2K3N1mp0lP4J3n2l2L2M2j0l4l3M5N0l9o1J7Q5j0o8j5P1
$$ -6 28 20 -21 -38 7 46 6 -46 -23 28 24 -46 -49 25 38 -14 -46 -14 28 18 -16 -49 -4 46 7 -54 -37 48 38 -30 -45 26
3146B6K0n7k7M3K6Jn4j7M5M7l4o4J6O8kp3k5O6K7n0m3M0N2mn7k3N9M1m1n3J4P6
$$ 26 46 -11 -38 5 31 32 -22 -39 6 53 19 -45 -29 39 37 -36 -61 5 32 -18 -61 -21 31 27 -30 -53 6 47 6 -47 -33 43
3178D3Pq2k2O9M5n8n5M3N7k0m4j7M8L1k6n8PP7j1o9j5P0M0p4l8M2N2k1o3%M7L8
$$ 43 50 -32 -54 15 60 2 -53 -10 47 27 -17 -34 14 45 19 -39 -32 45 34 -35 -50 20 60 -14 -52 -10 42 21 -42 -42 5 43
3210D3l4n5J2P6%p9j8P0M1o2n1M6N9k2n1j6O0K1l4m7J3O3Mp0rN4M3n6n4L9O9k8
$$ 43 9 -46 -34 42 42 -37 -55 15 56 -6 -57 -11 48 26 -25 -41 19 40 6 -41 -28 35 39 -31 -40 14 57 1 -53 -14 55 27
3242B7n9j0N3L3m2m0QN7Qo3l3O6L8n4n2L8N9mo4qM7L4l4m7J4N8Po2k1N2N2n0n9
$$ 27 -32 -42 11 44 2 -38 -30 27 35 -28 -61 5 43 -11 -63 -25 34 30 -34 -42 5 39 5 -42 -28 30 37 -25 -46 6 58 8 -51
3275e1L4O6j1p0lN6K2m2n3K1N6J4o9k8N0N4m6n9J6Q4%p5j4N5L3m2l6RO4J3o1m0
$$ -51 -17 49 38 -32 -35 21 43 1 -52 -31 25 39 -30 -58 -8 46 0 -59 -43 41 41 -34 -48 7 40 -2 -38 -29 35 48 -13 -53
3307e3M8O3m6o1K9O1%o6k5O4L2m7m7J1P1J5o6l9N1N8n6n7K5O9Rp7k3N7L9l7n7
$$ -53 -5 58 12 -49 -20 41 41 -25 -50 14 46 -1 -48 -37 34 49 -17 -56 -5 53 -3 -60 -35 34 43 -34 -57 0 39 2 -55
3338e5L0N9Oo3k7M6M7k9o4J1Q2Jp0l2O5N0n3m6J7N1Nm7l6M6O3l6p1K0P0Ko9l8
$$ -55 -25 34 40 -23 -50 -4 43 14 -50 -39 43 44 -26 -58 7 57 4 -42 -25 26 31 -16 -52 -6 57 21 -50 -30 40 42 -27 -65
3370f5P2M0m2n3J7N8rm8k2M2N3l2p0J3O6J5o2l2O3N3n7n1J8P9jo5k9N4N3m4n8
$$ -65 7 47 5 -48 -31 27 18 -30 -52 -10 43 11 -59 -46 20 35 -27 -59 4 57 0 -51 -33 46 45 -20 -49 5 58 14 -44
3401d4J3O3J4p4l2O0N0m2n3K1N7ln7k1M7L8k6o1jP2J4o5k8O1M2m5m7J9O3Ln1l1
$$ -44 -31 32 46 -28 -60 0 50 8 -45 -24 33 30 -27 -48 -1 37 11 -50 -51 21 35 -30 -58 3 45 0 -47 -28 35 38 -13 -44
3433d4L4N4k4o1nQ3J5o9l1O2M4m8n7J4O0K0p5j6M4M5l3n4MN9K0o5m2O4N0l1o7
$$ -44 -10 44 20 -41 -46 37 52 -17 -48 14 58 10 -47 -33 27 47 -28 -44 0 45 12 -42 -38 21 41 -24 -66 -2 48 17 -50
3464e0L1N0Rn7k3L7N4l3n7QO3K1o6m1O3N2l9p0K4O2J3o3k6M7L9k0o4KP1J5o4l4
$$ -50 -19 31 40 -17 -40 -3 51 18 -39 -31 32 53 -13 -54 9 61 22 -48 -24 38 51 -12 -38 9 48 28 -36 -34 37 52 -12 -46
3496d6M8N6m0o6J0P4Kn7l2M7N4l3o2KO5L1o8m1N3O2m3o6PQ6J2o8k6M3M1k5n9R
$$ -46 2 58 18 -48 -38 36 38 -19 -51 -4 50 17 -45 -43 22 53 -15 -56 -3 59 16 -50 -43 43 55 -13 -39 4 45 20 -39 -30
3528c0O8Kl8n0L8O3k7p0KQ3pn0l5M7N1l6m5JN0J9m5m9M8N6l0o2NP3J5p2l2N5N7
$$ -30 38 40 2 -48 -10 53 26 -44 -42 41 34 -16 -51 -4 47 11 -34 -33 17 36 -9 -58 -10 46 16 -46 -41 32 47 -25 -57 -2 55
3561E5l2n9JO5J3m5n4N6N6j8q6OP7J1n5m7N2M9k7o4LP0J6n4l1L0N3k1o5PO3J8
$$ 55 23 -36 -35 30 43 -2 -56 0 56 38 -48 -42 35 46 -9 -56 -4 45 18 -46 -43 27 43 -11 -42 -12 41 20 -45 -38 25 43
3593D3n2l9M0M8j9p0J4O6J2n7k8K9O1j9p0JP0K2n8m7N0M8k9o0JO6J8n9m8M4O2
$$ 43 -9 -48 -8 40 21 -49 -35 31 43 -14 -42 -13 48 29 -41 -40 30 52 -6 -53 -3 45 16 -44 -43 23 41 -18 -66 -22 40
3624D0op0j1N7L0n7m7M9O4j7p2%N9K4m7m9L9P1l0o6oO1L8n3n3L4P3k5o7jO2J7
$$ 40 34 -36 -47 10 40 -17 -64 -15 49 32 -40 -40 19 43 -4 -53 -14 57 27 -39 -45 16 54 1 -52 -18 55 30 -37 -38 24 41
3656D1m9l6J8P3j5o4j6N9L5n3n2L4O6k5o0lO5K6n6l5M0M0np0oP0K3n7m5N3N3j4
$$ 41 -8 -44 -26 47 32 -32 -48 11 46 -7 -59 -25 41 16 -44 -47 18 44 -12 -47 -7 33 28 -42 -48 22 45 -12 -57 -4 49 35
3688C5p3QO0K0n2m6L1O0j1o4j4N8L8n8m0K8O0j1p0qN6L3n6m2L8N0j5m4k2O9K7
$$ 35 -38 -30 30 50 -2 -48 -17 43 32 -32 -46 12 50 -8 -48 -20 40 29 -41 -49 7 40 -16 -58 -20 30 15 -29 -51 18 45
3719D5n7m5M3N8ro6rO8J7n1m1L4N9j0o8pN5L5m7m7K2O3j1n8k6P5L1n8n5M3N2o
$$ 45 -12 -57 -14 44 35 -31 -40 28 45 -6 -47 -13 46 36 -32 -39 16 51 4 -43 -21 42 31 -27 -53 22 53 -5 -60 -17 35 29
3751B9o0j6O1L0m9m2J7P0kp8pP2K1n0n2L4N9ro0j2O3K6l9m7K1N7Kp3qN7L3n6m7
$$ 29 -31 -47 14 44 -5 -47 -30 40 38 -40 -47 25 46 -4 -56 -22 37 28 -32 -44 19 45 6 -41 -20 37 39 -34 -42 15 48 -8 -55
3784e5L6O1j5o7j0O0L8n2n5K7O0j4m8j4O2L0m8m7K3P0qp4jN0L7m6m8K5O4pp1k
$$ -55 -19 42 27 -40 -50 10 48 -4 -59 -32 28 14 -34 -48 14 44 -4 -51 -28 42 34 -40 -41 9 46 0 -48 -23 41 34 -37 -39
3816c9N8K2l7m9L8M8rn5k5O2K0l6m6K5N5qn8j4N3M2m5n3J7O4pn8j3M7L9l6n5L4
$$ -39 19 41 4 -45 -7 41 32 -23 -48 14 34 -2 -48 -23 32 24 -34 -48 5 47 2 -51 -34 30 23 -35 -48 -1 38 2 -53 -19
3848a9N8mo2j7O0L1l7m5KP0lo1j1M8L1l6m8L1M0J3p7j2N7L6m0m9K0N1Pn6k5M4
$$ -19 39 35 -27 -44 16 47 10 -35 -33 37 34 -27 -38 10 41 5 -43 -12 28 41 -36 -48 9 45 5 -44 -24 27 34 -22 -47 -3
3880cM8m3o1L5O5ro1k0N5L7l2o7M5M3On6l0N0L7l7n0K0O5kn3k6M9K6l6m2K2M6
$$ -3 45 2 -59 -24 41 32 -29 -49 6 43 11 -56 -11 32 38 -18 -48 2 39 2 -48 -28 37 35 -18 -44 5 31 -5 -47 -25 21
3912B1J1o3j7N2K9l6n3J3P5oo2j5N1M5l9m9J7N6kn5j7N1L6m1n6K9N9Rp6j3N3L8
$$ 21 32 -31 -48 4 33 -3 -56 -43 32 26 -36 -51 0 45 6 -43 -26 30 28 -27 -44 7 43 2 -54 -25 34 43 -33 -46 7 45
3944D5l6n2J8N7ln3k4M8L4l5m2J7N1J4p8j9N9L6l7n4L2M1Qm6l0M3M1k5m9QN6J1
$$ 45 9 -43 -25 32 29 -24 -48 0 34 -1 -43 -26 25 39 -39 -58 1 37 0 -54 -22 19 27 -19 -49 -6 35 10 -39 -31 25 36
3976C6n7j4M2M0l9m9LO8Jn7j4M0N0m4m1J0N3Lm4l3M4M1l1n5J2O0km7l6N8L5j2
$$ 36 -21 -35 7 47 8 -41 -38 30 31 -26 -40 0 50 6 -35 -25 28 31 -13 -46 -2 39 8 -47 -35 25 23 -24 -60 -2 33 21
4008B1n6J2M4Mm2l6N0M9l8n7K2N3Rm3k7M2L7k1m8nO3Qo3k4M4M2l3m8OO2J0n9k6
$$ 21 -35 -23 21 25 -17 -53 -3 46 8 -49 -27 26 35 -8 -35 7 44 23 -25 -30 33 41 -22 -46 -2 40 7 -41 -35 27 37 -22 -48
4041d8L1M6l0m1J4M7J9p2j6M7N2m9m2OO0Qm2l2L4M5j4n3kN9K3n1k9L5L0k1m6J
$$ -48 -17 29 -1 -42 -28 19 38 -34 -50 -3 49 0 -42 -36 24 32 -10 -42 -8 37 23 -30 -32 27 50 -1 -30 5 35 14 -32 -31
4073c1O1J9n3l5L3L4k2n2J3O0Kn2l4M4N0k0o1MO0J5m9k8M1M7k9n7OO3Qm7l6L7
$$ -31 30 49 -4 -39 -6 28 6 -46 -33 27 29 -23 -57 -13 37 17 -44 -40 20 35 -14 -42 -1 46 17 -40 -34 29 37 -10 -46 -9
4105iN4k9l7k0O8K4o7k2K7N4k9m3j0O2J3n5l4M5M6k1n6mN7J9n3l7M3L9ko2NN5
$$ -9 45 16 -21 -41 27 51 -16 -38 -11 43 14 -29 -39 23 36 -19 -53 -8 38 17 -39 -43 14 33 -20 -57 -14 25 23 -39 -34 21
4137B1J8m5l2K6M8j9n6J1M6L0n2l4L5M4l1m3J9L5K5n9k8L2N3k8m1qN7Kl5l2L1
$$ 21 39 -6 -38 -12 36 17 -39 -28 18 48 -4 -38 -3 41 10 -33 -14 21 46 -13 -41 -9 44 16 -25 -33 24 26 -9 -41 -10
4168a0M4j8m1j3M6J8m0k7L6L8k2l4mN1J9m0m3L8M8k3m0j8N3K6m8k8K7M9j7o2J
$$ -10 34 16 -25 -38 8 26 -14 -41 -5 33 11 -23 -27 24 43 3 -40 -2 46 23 -17 -35 18 44 -4 -32 -5 44 27 -35 -34
4199c4N4J9m2l6L1M3k7l7k0O3K1m2l1K3M9j6m3k2O2K8m8l4K0N4ln5mM7K0m7j9
$$ -34 20 39 -3 -39 -8 35 8 -29 -49 14 35 -7 -38 -15 34 18 -25 -47 15 43 -5 -39 -19 35 32 -23 -27 20 40 -7 -26
4230b6J6O0k1n1lN5K1m4m9M7L3ko6qN6K2l9l8K7L5Lo4kM6L5m2m9L3M4mo0JM8K5
$$ -26 -10 50 29 -22 -25 30 51 7 -42 5 38 36 -30 -38 18 40 1 -37 -10 25 28 -36 -38 8 43 1 -48 -15 29 25 -35 -34 14 39
4264C9m3l3J4O2mn8k1P3J8m0l8K0O1k0n5NK5L1l7m2M1L5rn5oN3J7l2n2L2M1rn0
$$ 39 -4 -37 -23 39 35 -23 -44 29 47 7 -31 -11 50 30 -25 -20 5 36 -1 -43 -2 33 24 -31 -37 16 33 1 -51 -19 22 13 -37
4297c7MM0L7n3k6K0M2Ln7pM4L5l4l8J0M8Pp0%N7K5m0l9K0M3pm4j3M3K6k9l2KM3
$$ -37 -33 7 44 -9 -35 -15 27 30 -27 -34 10 45 11 -27 -17 31 38 -32 -32 25 50 10 -29 -9 34 27 -17 -30 13 39 10 -22 -20 23
4331B3lm4j1M1K9l9l1J0L8Om6nK8L9l7k8J4M8j1m4pL7L3l9k7J6M5j4k3k9M7J6
$$ 23 20 -24 -35 6 35 -4 -35 -25 13 19 -27 -32 -4 35 -2 -30 -16 32 21 -23 -30 7 40 1 -26 -10 35 21 -2 -31 16 32
4363C2k8l6K4L6nm3j2L4K8k8k8J4L9nn0j1L5L7k5m9K0M7Pn4qM1K4l1l7K1M0%m3
$$ 32 4 -32 -8 28 23 -20 -32 2 30 2 -26 -12 27 22 -28 -39 -4 33 8 -41 -21 26 33 -21 -29 12 36 5 -32 -11 29 29 -14
4396a4j6L5L5k2m4J2L6J1m3k0L9L2k8m8J6M8nm1rK2K5k1l8J2M6Jm2k4M2K5k1m2
$$ -14 -30 5 40 18 -26 -14 22 33 -10 -30 9 41 13 -35 -19 29 24 -17 -26 -4 21 0 -38 -26 20 21 -21 -45 -3 22 1 -41
4428d1K6M9jn1j7M3L4m6k4OM6Km4j5N3K1l3l9K3L7ol7j4K9L1k1m2J0M4Pm5j7L8
$$ -41 -15 34 33 -18 -35 8 42 -4 -28 -22 24 26 -18 -33 20 41 8 -31 -8 29 23 -14 -28 1 32 11 -31 -21 23 30 -15 -32 6
4461FJ5j7l2NL9ml6pM1K0k3m0K3L4Ol9rJ7L9k6m1J4M8j0k8j4J9L1k2k5oM1Rl3
$$ 6 21 4 -28 -23 16 12 -24 -31 10 30 7 -33 -10 24 30 -9 -18 -1 38 12 -29 -15 33 23 -5 -19 0 31 9 -16 -22 19 28 -5
4495ek3K1L4j9n3K4M0Rm5k3L7K8j4m6J9L7Ml0k7J9L9nn3RM9Ml5j8L3J9j9l5J5
$$ -5 -28 -7 27 8 -45 -21 19 28 -17 -40 -3 25 11 -35 -16 21 25 -5 -32 -13 26 21 -32 -23 26 30 -5 -23 10 29 10 -25 -10
4528a0K7J5l3j7J8K5nl9jK6J8m6j9L2K9k2l3J2L4Ql2k6K9L9j3n0J2K6J2k6k6M1
$$ -10 17 32 -1 -18 0 25 20 -19 -20 6 24 -22 -41 -9 20 -2 -35 -23 11 19 -13 -39 -10 29 16 -34 -22 4 16 -10 -36 5
4560EL1k6m0MM6Ol1k3L3K5k1l2nN2J1m2l1L4K8j5m3NM3J0m4j7L0M0l3k9lM4J3
$$ 5 36 10 -30 -26 20 26 -5 -28 5 30 9 -23 -28 24 35 -7 -38 -4 24 9 -34 -29 14 24 -20 -37 -7 33 0 -29 -32 12 25
4593B5l4l3L3M2k4l6NM1Rm0j9L4K9j0l3j0M7ll0k1K7L2l0k4lM8jm7j1L0L4j0m2
$$ 25 -9 -42 -9 33 9 -27 -22 19 28 -12 -31 3 32 22 -11 -21 26 23 -7 -28 -1 31 1 -23 -26 22 21 -26 -37 -7 27 17 -25
4626b5rN7Jm7j0K3L7k6l2J7K0J8l8j5K5K9nl3kL6Ol1k4K2L7j2m3J5L4nk6j3K9
$$ -25 -34 23 24 -23 -33 -10 27 1 -31 -14 6 24 -14 -29 -4 25 20 -13 -15 21 27 -4 -28 -6 31 19 -24 -9 25 20 -6 -19 10
4659A0J5om4PK4J6l2k3J5K2jk9JL0J9l5k4L2L7l2k0k0L5K6k3l2K7L0nl7pL9nj5
$$ 10 25 19 -25 -18 6 22 -10 -33 -18 4 3 -26 -25 5 24 -11 -35 -3 34 2 -18 -38 -3 23 0 -32 -5 25 20 -17 -24 15 10 -5
4693ek6K0L6j6k9mM4Pl4k6K3L4j3k5rK9J9l0k6J8L1nl3mK3K0k3k3J1N2j7m2oM2
$$ -5 -31 -11 25 9 -20 -24 20 27 -7 -33 -10 24 11 -14 -23 6 25 -5 -31 -13 18 13 -20 -24 -1 19 -4 -27 -16 36 19 -23 -29 13
4727A3J9l6k8L6J8jl3j0L1K5k9k9K2L2km5pL1J6k5k3J4L8k2k4JJ4K5j8k3PM2j8
$$ 13 32 -4 -32 4 22 21 -12 -22 9 34 5 -24 -2 30 28 -17 -24 7 23 -2 -25 -11 27 5 -19 -18 -4 21 3 -20 -13 29 11
4760A1k3j8M2J7k6k4J6K7j8j7oK6J2k5j6J3M1j2l1j1M2Rl3rJ0K8j9k0mK7Rk9j8
$$ 11 -12 -30 12 29 3 -21 -5 22 4 -13 -19 7 19 -6 -22 -9 32 20 -11 -22 20 29 -4 -13 -3 25 6 -14 -18 9 18 -11 -29
4793b9K0K6j1k7kM1Ok1k0J5K1pk8PK0J6l6oJ7J4Kl4J3K2J0l1j8J1M1ql2JK7jj4
$$ -29 -9 17 6 -21 -23 18 24 3 -17 -2 19 12 -16 -9 11 27 -9 -15 2 16 18 -16 -3 19 29 -2 -20 -9 32 24 -8 -7 20 19 5
4828Ek7J1L2j4k0j3K9K3k6k4QM5j6k4j6L5J6k1k1J0L2%l4lJ9K2k7j3J6K0jk9p
$$ 5 -22 -11 21 7 -13 -26 3 26 0 -24 -16 29 13 -11 -27 8 24 3 -18 -8 24 24 -10 -13 6 28 1 -12 4 24 23 -6 -13
4861a3K3K5k9j9QK2nj5k5L2J9k4k7J4K7lk5pJ8J5mk7QL2Ll6rK3K9j1l8nM7%l3
$$ -13 10 35 6 -13 -5 17 12 -3 -28 4 23 -1 -28 -14 13 10 -15 -22 -4 11 7 -20 -12 20 23 -13 -22 1 30 19 -19 -24 23 23 -10
4896a0j4L7K5k2k7J0L0j1k2rJ9K6k8k3RK3Kk2j6L3Ok2j6MM2pm2JK1J8k1k4J8K4
$$ -10 -24 13 38 16 -11 -1 29 18 -4 -13 6 32 4 -19 -10 13 15 -7 -23 10 16 -6 -22 -18 24 17 -25 -24 -3 15 -6 -30 -12 12
4930A2kk5j2K5K7l1j0QL5pl1j2L3Omk5nM2ml5lK5J6k5k8K0L4k3j4j0RK8j1j9m
$$ 12 10 -15 -27 -2 25 -6 -16 -8 27 20 -11 -23 10 16 12 -13 -18 24 20 -15 -18 7 23 -2 -30 -10 24 1 -13 -23 -14 14 3 -16 -20
4965b0K9Qk9j7K9J2j0j4mM1rk2jJ3J1j7onJ4K2k5k1L0J0k0k4K4L1k4rJPJ7j1k1
$$ -20 9 17 -12 -29 0 12 2 -12 -16 25 16 -6 -7 6 17 0 -6 -11 3 25 0 -21 9 19 -1 -25 -1 30 6 -3 -2 5 22 11 -10
5000a0QPPk8lK0J3j1j4MJ7Pk7kJ6J2j4j0kK5J9l8%KL3k4rpL0Ok8rJ7J6j0k4jK3
$$ -10 -2 5 12 -16 -19 1 14 3 -11 -7 10 17 -10 -12 4 16 2 -8 -10 15 34 -4 -4 -2 31 7 -2 -9 21 27 -1 -10 7 23 13 -11 -12 11
5038A1J4k7j4J1L1k1l4K0J3J7k8k2K1J2jj6nK2Qj4j5J2K1Ml8OM2j0k5oJ8K0k3
$$ 11 25 -2 -16 -5 26 5 -29 -9 4 21 -7 -29 -8 4 3 -13 -18 4 12 -2 -17 -5 16 20 -18 -12 30 20 -5 -11 7 27 4
5071DqnJ7Qok4NK2ll5NL5Nk1k0K8Mnk8J0L0kj6k6K2K2pk4QK1lk2JJ8J3rk5J4O
$$ 4 -4 -9 8 16 10 -14 -9 13 10 -25 -20 15 20 -1 -21 7 11 6 -22 -12 18 16 0 -26 -4 18 11 -13 -5 16 13 -9 -8 10 23 14 -11 3 9
5110IJ5k5j0K2J5j5k5J3K5j0j7nJ7J2k0k4KK4%rj7L2Jrj4oL8lk4jQOqj1NK1Lo
$$ 9 24 -1 -11 11 26 11 -14 -1 24 14 -3 -8 9 21 1 -23 -21 3 3 -6 -23 9 10 1 -13 -19 19 16 -8 -9 -1 5 -3 -14 -9 12 15 9
5148Ij1PPOk4pL3Jj7j4J8Mkk8KK5kj3llQJ7k8nL0nj3j5J7J1j4pPKK7k6oNJ4Pk3
$$ 9 -2 5 12 18 -6 -13 20 21 4 -10 8 12 10 -18 -16 9 7 -6 -9 -12 -4 13 -15 -20 10 5 -8 -23 -6 5 -9 -16 -9 -7 20 -6 -12 -7 7 14 -9
5189inK1Rj5j8J1J9kj7jQRpj2%J3Ok1rJ0J6rj3PK3pj5j6L1Pk6rK2PQk6QKJ7j5
$$ -9 -14 7 16 1 -17 -6 13 11 -6 -7 1 10 3 -9 -9 4 10 -11 -20 -10 6 -3 -16 -9 14 7 -8 -24 7 14 -12 -21 1 8 16 -10 -2 0 17 2
5229BnmK5oj6mJ9llj0OK2k2j2LNJ2j0j6J7J3Ml2oL2J3l1j6J8K4j6j8jK3Qok3J1
$$ 2 -3 -7 18 12 -4 -8 11 8 5 -5 1 23 1 -11 -8 -3 9 -1 -17 0 13 17 -15 -21 11 24 -7 -23 -5 19 3 -15 -16 7 15 9 -14 -3
5267cJ6j1j9PJ3J2pj3MJ2j2KmJK6k3j2MJ9j2j1kJ7Qk6NJJ3jj8J4pJ8lj2P%Nl4
$$ -3 13 2 -17 -10 3 15 8 -5 -1 11 -1 1 -3 -2 24 1 -11 -7 12 0 -11 -13 4 12 -14 -9 -8 5 4 -14 0 -7 11 8 -4 3 3 8 -26
5306b6K2J0%oj1J2J3kj1PnJ3j3njK0oj5nJ6Qjk8OJ7j0pj0K2Kj3j0rK0J8j8qJ7
$$ -26 -4 6 6 0 -11 1 14 12 1 8 3 16 3 -2 -3 17 11 -4 -9 7 15 14 -14 -8 9 -1 -8 -18 4 6 -7 -17 -26 -6 12 -6 -14 3
5344CJ1j6j4J1J1onMLRmj1kJ8J1k0qRJ3j3j5J7PJk9J7oNkoJJ0Rk9jJ3J0qpMJ3
$$ 3 14 -2 -16 -5 6 0 -5 -1 2 11 7 -4 -6 12 23 3 -5 4 17 4 -11 6 13 14 -15 2 -4 1 -1 -7 -6 4 13 -16 -17 -4 6 -2 -9 -5 8
5385HKj6qJ3PokqJ4N%j3J3K2j4k9K2jMj8J0jJ5j5j2J4Rqk0kK0Qk2pMK1j0j0qK1
$$ 8 10 -6 -14 -1 6 0 -2 -10 4 9 9 -4 9 31 17 -12 10 9 13 -5 5 4 19 4 -8 6 15 7 -13 -15 5 13 -9 -16 -12 9 -1 -11 -19 2
5425Bmj2jlL4j4j7mK6jRk0QJ0mk3QK6%j9kOQkjj5J3J4k5rMJ5j1j%J7qj1mMLJj0
$$ 2 -2 -14 -15 -18 16 2 -15 -19 7 6 15 -5 3 13 9 -14 -6 20 20 1 -1 5 13 11 10 -5 8 22 -3 -12 -8 7 -4 -5 -5 12 4 -7 -11 -7 -4 -3 -13
5468a3kJ2PLk2OK4j2pRLMj2jONqJ0j1jJ7j3pmJ4jj1jMK%j2jJ4Kj0j0jJ5Kj1j3
$$ -13 -15 -3 4 7 -15 -9 15 3 -4 5 8 12 0 -1 5 10 2 12 1 0 17 4 -3 -7 7 6 -5 -6 -2 0 0 -12 -13 1 3 -7 -17 -18 -3 -1 -12 -25
5510b5J5J7j5kJ2Nnj7RMJ0pjqJ6lj1OJ5nrj6J4J4Lk1KRKj1j3J2J8lk5mK3Kk1n
$$ -25 -10 7 -8 -10 2 7 2 -15 -6 -2 8 1 0 -8 8 5 -6 0 15 10 1 -15 -1 13 16 -5 -3 6 8 -3 -16 -4 14 11 -14 -18 5 7 -14 -19
5550a9J3J2j5lNQmnLNNrj2J4QRk2qK2J8j4k0PJ3Lk1mNJ1j0j6MJ7Rk4LJ3J1j3j6
$$ -19 -6 6 -9 -12 -7 1 -3 -8 -5 0 5 -4 -16 -2 6 15 -7 -15 7 25 11 -9 -2 11 14 -7 -11 -6 5 -5 -21 -17 0 9 -15 -12 1 12 -1 -17
5590a7J4Lj0%mQPj5Pjj%Oj5K5Rj3rNPolO%Mlj5JJ2Oj8jKJ5rj6J3%LrJ3j0knMq
$$ -17 -3 0 -10 -10 -14 -6 1 -14 -7 -8 -9 -9 -3 -18 7 16 3 -6 -1 6 0 -3 3 3 7 4 -11 -10 2 8 -10 -11 -9 6 -3 -19 -6 -6 -3 -12 1 -9 -11 -16 -12 -20
5636b0RRrKJJ4%rLPj1J%J3qLPoQJj4pPJ1pj7PkJLLp%Rjj7J7lkoQmJ2k3OK3qrm
$$ -20 -11 -2 -11 -9 -8 6 6 -3 0 7 -4 -3 -3 10 2 5 12 6 14 15 1 -6 1 12 5 -12 -5 -7 -6 -3 0 -7 -7 2 1 -16 1 -2 -4 -10 -2 -6 6 -17 -11 12 4 -5 -9
5685iQNqK%kQKj7OK7j1rj2J6Oj0j3J8%jj0%PJ0k4omJ5Kj6PJ3Jj7lJ9Pmk0J0RO
$$ -9 -1 4 -4 -2 -2 -4 4 6 -11 -5 22 11 2 -10 6 12 2 -11 7 7 6 -4 -4 3 13 -11 -17 -21 -6 -4 -20 -13 0 1 -16 -19 0 7 3 -17 -7 2 8
5728Hj0Nj6K6qj6MK1rj0kJJ5pj6J0J7j7jj3J8Nlk2KJ5Jj3nJ5J3k0pK0mRnj9J9
$$ 8 -2 3 -13 13 5 -11 -7 14 5 -5 -7 -6 9 2 -14 -4 13 -4 -5 -18 0 5 2 -20 -18 -3 -2 -15 -20 -5 8 -12 -19 1 -3 6 1 -18 1
5767APpj0MKRj4PRqJ1j7QJ1pj3RJnKnrPRrk%NMj2kJKmMjP%kjMJ4j3nROmnpJ1J2
$$ 1 8 1 -9 -5 -3 6 -8 -1 8 0 11 -6 2 13 6 -7 2 3 -2 0 -5 -14 -7 2 -7 -9 -9 -4 0 -12 -14 -13 -11 -15 -11 -12 -5 -5 -7 -8 -4 10 -3 -8 1 7 3 -2 -9 2 14
5818A4j7Pj1LK%J%Ml%J%%nj4J8jmlnP%olQPKrrK0opMOkPj4J1%JrLKRPk4JJ9jj5
$$ 14 -3 4 -7 -4 -2 -2 -1 -1 3 0 0 1 1 1 -4 -18 0 -1 -5 -8 -13 -6 -6 -12 -15 -7 0 2 -7 -16 4 -2 -9 -5 1 -1 6 -8 3 3 4 -5 -2 0 9 16 -8 -7 12 11 -4
5869dj3K7Jj6qOJ0nj7NO%J3j9PJ0nj9RJ8Lk0JJ5Qoj8MJ1%LpOJ3rj5JJ3Mj1j2J9
$$ -4 -17 10 11 -5 -13 -7 3 -2 -19 -14 -8 -8 5 -14 -7 3 -2 -21 -12 6 9 -11 -10 5 13 7 -11 -7 4 4 7 0 6 19 10 -5 -4 9 13 2 -10 9
5911Iorj0K1pQj0LjkLmoJ6qoMnPj4OJ2%r%kOOlqLLPJmLJ1pnpJ1j7QJKJ1j5kKr
$$ 9 3 -6 -16 5 -2 6 -4 -1 -2 -4 -1 -5 -11 5 -3 -9 -5 -10 -3 -17 -11 1 1 -8 -8 -10 -4 2 -1 -9 -6 -3 4 5 1 4 15 8 3 -4 7 -10 -2 -1 1 12 -3 -5 -3 -12
5961a2NnM%qMlKJ5j4J2j2JJ3lLj0ORj2%J4jjqLJ0rLjnpLn%MJ2rj7J8%ojjkM%j
$$ -12 -7 -12 -8 -8 -16 -12 -15 -13 2 -12 0 -12 -11 2 -1 2 -8 -2 7 -5 -5 9 8 7 -1 2 12 3 6 5 0 -7 -4 -9 -9 -5 7 -2 -19 -1 -1 -7 -8 -9 -11 -7 -7 -8
6009hRjNjj2lJ3n%MlLk%OnLJnJ5kj4n%J6pj3%J3Mj1JMlnK%j0J2j1KJ5Kj7OoJ9
$$ -8 1 0 5 4 -8 -11 2 -3 -3 1 -2 1 -1 -1 5 0 3 4 -1 14 12 -2 -7 -7 9 2 -11 -11 2 6 -5 -4 0 -3 -8 -6 -6 -16 -4 -15 -13 2 4 -13 -7 -13 6
6056FmqMN%j0%J3nO%j5J6Qj6%pK6j5j6J9qJ0j4L%kMq%Rj3%mJ1Jnj1MJ6j5pK0p
$$ 6 2 -6 -2 3 3 -7 -7 6 1 7 7 -8 8 16 0 0 -7 19 4 -12 7 -1 9 -5 -2 -2 -4 0 -8 -8 1 -12 -12 -16 -5 -4 -9 -20 -16 0 -15 -22 -2 -9
6100iKlJ2jKlpN%J1qkQLj5MJJkrjRJnM%jKKmpJ4j6RkKonJ2mOkKj0mQNoMqJ6jq
$$ -9 -7 -10 2 1 3 0 -7 -2 -2 9 1 -1 7 10 -5 -1 0 1 -1 -10 -11 -2 -1 -6 -2 -2 -3 -1 1 -3 -10 4 -12 -3 -5 -3 -9 -14 -2 -6 0 -2 0 -10 -14 -6 -1 -7 -3 -11 5 4 -4
6153dLOj0J0mlPLj4PJLomkMppPkJ0nloQlOoKJ6rqMJ3j4KRj2J3j2oJ2LnLNJ1%k0
$$ -4 -1 5 -5 5 1 -2 5 8 -6 1 2 5 -1 -5 -7 -3 -10 -17 -10 -12 -2 -7 -10 -16 -8 -11 -5 -11 -9 7 -2 -10 -6 7 -7 -5 4 -8 5 -7 -13 -1 2 -3 0 5 16 16 -4
6202dnK3lj4LjJ2j9mjJ4nrRlPMj5oRLoKNJ9j4rMJNkKJ0pqnkJ6Qk3kQK0k8LJ0J2
$$ -4 -9 14 11 -3 0 -1 11 -8 -12 -13 1 -4 -13 -4 -7 0 4 -11 -17 -8 -5 -11 -9 -4 15 1 -8 -4 -3 2 0 2 12 5 -3 -8 -10 6 14 -9 -11 -3 17 -11 -8 2 14
6249A4j2j4JQMpLnLJpj3J3OolPRkrNNkJloJOkKNj%j3J3Kj3rK1ol%MkpkJ4n%j2
$$ 14 2 -12 -11 -3 1 -6 -3 -8 -5 -4 -11 -24 -11 -5 -11 -14 -7 2 0 -9 -4 1 -1 0 -3 -9 -8 -2 -4 -2 3 2 2 -11 2 4 -9 -18 3 -3 -6 -6 -2 -4 -11 -13 1 -4 -4 -16
6299a6%J4j4JPnJ4lj3J0%qjJ6olONrk%J3ml%LkmJ4j8MMjjrJ2Mj1jjRrkRj0MNn
$$ -16 -16 -2 -16 -15 -8 -13 1 -2 -15 -5 -5 -13 -14 2 -4 -7 -1 4 -5 -7 -7 6 2 -1 -1 2 0 -4 10 -8 -4 0 -1 -2 -11 1 5 -6 -7 -8 1 -8 -10 -1 -11 -7 -2 -7
6347gkMJmQnJ3rOk0J5KrJ2kJ2j6MPmLj4ONpJj1J7qJ3j5PkNpjJjJ1k1MJ1qj2J5
$$ -7 -9 -5 -4 -8 0 -5 8 -1 5 -15 0 2 -7 5 3 15 -1 3 10 6 9 -5 1 6 -1 0 -11 6 -2 11 -4 3 1 6 -1 -2 -1 -2 9 -12 -8 3 -5 -17 -2
6392bONrj2J2nPnKoQPj1MjRj5lJ3nolKJ3j4%PJj6QNqNMnkJ9k2J0pKJ4j7J0Jmk
$$ -2 4 9 0 -12 0 -5 2 -3 -1 -7 1 8 -3 1 0 9 -6 -9 4 -1 -7 -10 -8 5 -9 -9 -2 -1 -17 -9 -4 -12 -7 -3 -8 -10 9 -13 -3 -10 -8 6 -11 -1 0 -4 -6
6439fJ0m%lQrRJ1j1Kk0RQj4Q%LJj7J7oNoqJJJ%pJ1J2oKqkOMmmJJ1j3Rj3J3Mn%
$$ -6 4 0 0 -3 5 -4 5 16 5 7 -13 -4 4 -10 -2 -2 1 2 -15 2 -4 1 -5 -13 -12 -11 -10 -10 -17 -6 6 0 2 -6 -8 -2 2 -2 -6 -5 6 -7 2 -11 2 6 1 1
6487AkQj0J4pjMlj0LOJ0k8KJ7Mj6KNj4RPLonM%%JLj1RJ7j6nJNKj2OPLq%J0j2L
$$ 1 -1 7 -3 11 4 3 7 4 -6 -3 3 13 -15 -13 4 8 -8 -6 -1 -15 -6 1 4 -2 -7 -3 -3 -3 -2 1 -10 -1 16 0 -5 -4 1 3 -9 -3 4 7 -1 -1 9 -3 0
6534@LNj1j0NnJ2j%noJ1Klm%nQnmJJ8oj2%J4lj1%PJ3oj1J4KmnJLkljlJ1jj2lJ0
$$ 0 3 8 -3 -13 -8 -13 -1 -2 -2 -7 -13 -2 0 -3 -7 -7 -12 -4 -9 -13 -12 6 0 -12 -12 2 -1 -12 -12 -5 8 2 -9 5 7 3 -2 -1 2 0 -3 -4 -7 4 3 -9 -12 -2
6582bQj0qOPpLMppLLJMllJ0pn%LJ2Jj3Nj0J4lKNloKoLOJj4OMj2PNj3NOjkqPRj3
$$ -2 6 -4 -12 -6 1 -6 -3 1 -6 -13 -10 -7 -6 -2 -5 -8 2 -5 -10 -10 -7 5 6 -7 -2 -12 2 -1 1 6 3 -3 -1 -7 -4 2 3 -11 -5 -1 -13 -6 -1 -14 -9 -3 -4 -6 -14 -7 2 -11
6634a1NJ0j0J3k7J9ljJ4oKnLpOoRl%jnNLKj1J2kmkRojLj1P%pKJ0j3J%%NMj1Mr
$$ -11 -6 4 -6 7 -20 -1 -4 -5 9 3 5 0 3 -4 2 -4 5 2 2 1 -4 1 4 6 -5 7 5 1 -1 8 2 1 4 -7 0 0 -7 -5 5 -8 -7 -7 -7 -2 2 -9 -5 -14
6682a4J3nlJ3JjmjNJj1NOjJrJ5mmmkJJ0loj2K3nj3OJjnMMlj5J4pNmOmOJ0k3QK
$$ -14 -1 -6 -9 4 5 4 0 -1 4 5 -6 -1 5 4 5 -4 11 7 3 -1 -3 -2 8 5 -1 -13 10 5 -8 -2 -1 -2 -7 -3 1 -2 -17 -3 -10 -5 -9 -3 -7 -1 9 -14 -6 -4
6730dNNrPJ2j1rJ3KJj3nPPmlKnJ3j3mKRlqOOj0rPJ8j5Jj0J3pJ5j1MjQlj5J6j2
$$ -4 1 6 -3 4 16 5 -4 9 11 12 -1 -6 1 8 4 1 3 -2 11 -2 -6 -4 5 2 -6 0 6 -4 -13 -6 12 -3 -2 -12 1 -6 9 -2 2 1 9 6 -9 7 -5
6775eQlLNmpjKNlMmkLPj3mNkQPj5J1qLMrnMNKk0J0%RMpNNjlkMKj8J1JNoRj2K%
$$ -5 3 0 3 8 4 -3 -4 -2 3 0 4 0 -2 1 8 -5 -9 -4 -6 2 9 -6 5 -3 0 4 -5 -10 -6 -1 1 -19 -9 -9 0 4 -3 2 7 6 3 1 5 7 -11 0 1 6 0 9 -3 -1 -1
6828aJ%MJ0j5qJ5j1klLmRj3NMJkQnOmPKMNj1j2J3Nj0LLLLj8OPrNMj2QlloORj5
$$ -1 0 0 4 14 -1 -9 6 -5 -7 -10 -7 -11 -2 -15 -10 -6 -5 -7 1 -4 2 -2 5 7 11 16 5 -7 6 11 1 4 7 10 13 -5 1 8 -1 4 8 -4 4 1 -2 -8 -2 7 -8
6877hmPPlj3PNjrnK0knqLNNJ%qK3j4kQjQj8NJkKJQpNj3kPj2lMlKJ0rJ6k0NOLp
$$ -8 -12 -5 2 -1 -14 -7 -2 -3 -12 -17 3 1 -4 -12 -9 -4 1 2 2 -6 17 3 1 9 8 16 -2 3 4 2 4 5 13 6 11 -2 -4 3 -9 -12 -8 -11 -9 1 -8 8 -12 -7 -1 2 -5
6928eKKj3OJ1onONJ3j7kJ2Rj5oPNKmmjjNkrkMJJ%JqMJ0mr%NMjnKnLmJN%kqJ6%
$$ -5 -3 -1 -14 -8 3 -3 -8 -2 3 16 -1 -3 9 18 3 -3 4 9 11 7 3 2 1 6 4 -5 -7 -3 -2 -1 -1 0 -8 -4 6 2 -7 -7 -2 2 1 -4 -2 -7 -4 -8 -7 -2 -2 -4 -12 4 4
6981DqQ%mJ1j6J2JOj7rJ6nnJJmJ0qLjMllKJJqmN%j0J5JljQj3PknROMpoJJ3j0L
$$ 4 -4 4 4 0 11 -5 7 8 14 -3 -12 4 -1 -6 -5 -4 -8 2 -6 -3 -4 0 -3 -6 -4 -3 -2 -10 -14 -9 -9 -19 -4 -3 -6 -7 1 -12 -5 -7 -12 -3 3 7 0 -6 -5 8 -2 1
7031AQjj1jJMK%LojJoj2J9%qrJ3qJ5k2QRlLqPpJ2j7J5MnJlJ2l%j1J1JnJjMpPj2
$$ 1 9 8 -3 -4 -3 1 3 3 6 0 -1 0 -6 -18 1 1 -7 -16 -3 -11 4 -18 -10 -1 -4 -1 -9 -2 -9 3 -14 1 5 0 1 -2 10 7 7 -4 7 8 3 4 3 7 0 7 -5
7080eLqJ5j5J2rJ2j1oJ1j3PJN%olONJ2k2J6j6J1MnRJlnPjrknJ0kKLj4NJP%j4J6
$$ -5 -2 -10 5 -10 2 -7 5 -6 -12 -1 -14 -7 -6 -1 -1 -7 -10 -4 1 13 -9 7 -9 2 6 1 10 11 8 3 10 9 0 -2 -7 3 1 3 6 -8 -3 -2 5 5 -9 7
7126Gj1j2KJOjJnOj0J0LlkRl%krJ0PnJLNllOMj1LQqm%mJ0kknMRj0pK%JjMqOOp
$$ 7 -4 -16 -14 -13 -7 -8 -7 -12 -6 -16 -6 -3 -6 -8 1 -2 -2 -4 -13 -3 4 -1 0 3 8 5 2 8 12 1 4 12 4 0 0 -4 6 4 2 -3 1 10 0 -7 -5 -5 -4 -5 -1 -9 -3 3 -4
7179dqJ0JLj0MjJ0j0kJ6krJRJkj2lRPrjPonPjLKoqNkQj4K%Ojj5J3jkjJ8pQj9M
$$ -4 -12 -2 -1 2 -8 -4 -5 5 -5 -7 9 7 -2 -1 8 9 7 -5 -8 1 8 -1 -2 5 -1 -6 1 0 3 5 -1 -9 -4 -6 2 -12 -10 -10 -4 -5 -20 -7 -8 -10 -11 7 0 8 -11 -7
7229gRJlmMnQkjPRj1jN%Kj6On%jkjNmOpNj4K4k4OKkLNMoLpMLLOj4mPP%jJrJ6n
$$ -7 2 3 0 -4 0 -5 3 1 0 7 16 5 4 9 9 11 -5 1 -4 -4 -5 -7 -8 -3 -7 -1 -8 -3 -17 7 -17 -11 -9 -11 -8 -3 1 -5 -2 -9 -5 -2 1 7 -7 -11 -4 3 3 2 3 -6 10 5
7283Ej3LJ3kpMj1J2nj1J7j4jLqQlRpJ0lOnrN%nKPmmPmLjmJ1pO%j0J2j2J1joQM
$$ 5 -8 -5 8 6 -1 3 -8 4 -1 -12 5 -9 -10 -7 -15 -7 -10 -1 -8 2 -1 5 0 -9 -4 -4 -9 -7 0 -4 -8 -1 -5 -2 -3 -7 4 -3 3 3 -7 5 -7 4 3 -3 5 9
7331Ij3%J2noJL%j0J3mKNprRKjjj3J3qQknJ3Kj3J1qLKMkmRpoRo%MlQj5PKKonj4
$$ 9 -4 -4 8 3 -3 -2 1 1 -9 4 0 2 7 0 -9 0 2 1 0 -13 0 -8 0 -2 -7 6 8 -5 6 -2 1 3 7 5 1 10 3 -3 6 0 0 4 1 9 -6 1 3 5 -1 -6 -20
7382b0J1jKjKlMjj1PjKNkJ1nNqONkknkRpMMrpP%MrJ4k0J4lkMpKmjLQmnj%J3j7
$$ -20 -9 -10 -8 -9 -7 -10 -6 -7 -18 -11 -12 -10 -5 -7 4 -1 4 -4 2 7 5 3 -2 -4 5 -2 2 6 -3 -10 -3 -3 1 -8 6 -14 0 -3 -5 -1 -8 -6 -10 -11 -8 0 -4 -9 -10 -10 3 -14
7434a4MJ1OnJJkkQj0mLRjJKrJKjo%PmMmkLNj3Rr%J2j5KNJpLjJPLlLj0PJ2j2LJ0
$$ -14 -10 1 7 2 3 4 2 0 8 -2 -6 -3 6 5 6 8 -1 0 2 1 -5 -5 2 -2 2 -2 -4 -1 4 -9 0 -9 -9 3 -12 -10 -5 -4 -11 -8 -9 -8 -1 2 -1 2 -8 -1 11 -1 2 12
7486A2j0Rnmk%lJ3kj4OkjnJ5j0OrPoM%JjQnmqOJlOkNpPlMLmmROrrRPKj1lJ3oj
$$ 12 2 11 6 2 0 0 -3 10 8 -6 0 -2 -3 -8 7 -3 3 -6 1 -5 -1 -1 0 -1 7 2 -2 -10 -4 -3 -6 0 -2 3 -4 3 0 4 7 3 -1 8 14 5 -4 5 12 14 3 0 13 7 6
7539FqnLQqjj1JMjR%ojJ9j2Mj1LLNNj7J5jkj0J7Qj2pKkJ4lj4NkJ3j2jM%LrM%n
$$ 6 -2 -7 -4 4 -4 -5 -16 -15 -11 -12 -3 -3 -9 -10 9 -3 1 -10 -7 -4 1 6 -11 4 3 1 -9 8 16 4 -3 -1 -3 11 8 -6 -1 -3 10 -2 -3 1 1 4 -5 -1 -1 -6
7587f%%oNPpkPNj3LllnPJ2pnJ1j%Oj0J5j3Qj1J9rkMloLLj1KmQ%Nj2JnjKJ2j0%
$$ -6 -6 -6 -12 -7 0 -7 -9 -2 3 -10 -7 -10 -13 -18 -11 1 -6 -11 0 -1 -1 5 -5 10 -3 5 -6 13 4 2 6 3 -3 0 3 -8 -6 -10 -2 -2 3 -9 -8 -13 -14 -12 0 -10 -10
7636a0M%pRQj5J1lrJ5j0J4kM%pJkPpKJKmrLNQJk6J8q%NqMmONmokLJ0j6MMPlLl
$$ -10 -6 -6 -13 -4 4 -11 0 -3 -12 3 -7 7 5 9 9 2 3 1 8 1 3 4 6 2 -7 -4 1 9 10 -16 2 -6 -6 -1 -9 -5 -9 -3 2 -2 -8 -10 -7 3 -13 -9 -5 2 -1 2 -1
7687aNj0MjlJ7j2KmMnJ1oLrQkMKKj2J3lojjJ0j1Nj2KJlNNj0OMmPjRj2ORj3LnJ
$$ -1 4 -6 -2 -3 -6 11 -1 1 -3 1 -4 7 1 4 -5 3 1 5 7 9 -3 10 7 1 0 -1 9 -2 3 -9 -7 -6 -9 -4 1 -9 -3 1 -3 4 3 12 0 6 15 2 5 0 1
7736AOmMnlJ2pj0KNK%j1J1LpkljPj0RrQnoRj5J6j1QqONKnQrJ5Kq%Jj5J9nnRlo
$$ 1 7 3 7 2 -1 11 4 -6 -4 1 3 3 -8 3 6 -1 -3 -6 -7 0 -10 -1 -10 -2 -7 -13 -4 -19 -3 -14 -6 -14 -8 -3 -1 -6 2 -7 8 10 2 2 3 -12 7 2 -3 6 3 -3
7786cJNOQj2Pk1J3j1lLoRLj3QKnOJrKNpPJ2j6J0olJ0pKoJ1lkJ8k8J2%Mj3J0Lj1
$$ -3 -2 3 9 17 5 12 -9 4 -7 -10 -7 -13 -4 -1 -14 -6 -4 -9 -3 -2 -11 -9 -4 -11 -4 8 -8 2 -4 -7 3 -4 -2 -8 3 0 -2 16 -12 0 0 4 -9 1 4 -7
7832gLKPpj6RNnKJj%KlmJNKlMJ1nlmNkJ0pnJKqJ1%qPj0J0Kmj5QNj0OJ2kj3OrJ
$$ -7 -4 -2 5 -2 -18 -9 -4 -9 -7 -6 -7 -7 -5 -8 -12 -11 -6 -4 -7 -3 8 3 0 -4 1 -1 9 2 -3 -2 0 -8 3 3 -5 2 -8 2 4 0 -15 -7 -2 -12 -6 6 4 -9 -3 -12 -11
7883a1Nn%NPooJ2j0J7k5J4nKLOnkOJ1j5KLjj4J3OkooLJ4nj6MOj1OoJ1mJ%qJ0p
$$ -11 -6 -11 -11 -6 1 -5 -11 1 -9 8 -17 -3 -8 -6 -3 3 -2 -4 2 13 -2 0 3 2 -12 1 7 5 -1 -7 -4 10 5 -11 -7 -1 -12 -6 -12 -1 -5 -4 -4 -12 -2 -9
7929iqJ5mj2J7qLOOj5PkjmJJJOOmOppRjmKLoJ2nMj1knnJ3lNj1%Qj1LJ1j1NNLm
$$ -9 -17 -2 -6 -18 -1 -9 -6 0 6 -9 -2 -4 -5 -9 -8 -7 -6 0 6 2 8 1 -6 3 2 -2 0 3 -3 9 4 8 -3 -5 -10 -15 -2 -5 0 -11 -11 -3 -14 -11 0 -11 -6 -1 2 -2
7979bLRj9QOjlLoJOjlkJ0j4%J3rlJOqKqRoNmLqMPk4J8KOJJj1MlkPL%lJ4j7LMn
$$ -2 1 10 -9 -1 5 4 1 4 -2 -1 5 4 1 -1 9 -5 -5 8 -1 -4 -3 3 -5 -3 -11 -2 -8 -3 -7 -4 -12 -8 -1 -25 -7 -5 1 2 3 -8 -4 -7 -9 -2 1 1 -2 12 -5 -2 2 -3
8031clOnMrJ5jj6LJ2okjJ0kJj5J7jJOk2NKJKMjj0J0Jn%MoMqMJ3jmpmK%NLljLl
$$ -3 -6 0 -5 -1 -10 5 4 -12 -9 3 -3 -5 -6 4 2 3 -12 5 4 5 11 -11 -6 -4 -3 -1 3 2 -8 2 3 -2 -2 2 -4 0 -8 -4 9 8 4 -3 -7 -5 -5 0 3 0 -1 2 -1
8082alkKLMj2NkMo%J3j2J4krLLMkkKkKoJMkJ0oLPj0Nj4Mk%qJ2nNqMMj3J0pjQl
$$ -1 -4 -6 -4 -1 3 -9 -4 -6 -2 -8 -8 5 -7 7 5 -4 -1 2 6 4 2 4 2 4 -2 -1 3 1 11 5 8 15 5 10 -4 0 -2 -2 -10 2 -3 2 -6 -2 2 -11 -1 -8 -9 -1 -4
8133dQrKNj1J2kLMj1RqLnKlMJRmKmQnj0LmRJ0pj5OjjklQ%KjojRrlMKOqknJ3pN
$$ -4 4 -5 -3 2 -9 3 1 4 8 -3 6 -2 1 -4 -2 -5 -1 0 9 5 7 3 11 6 -4 -1 -5 4 14 7 -8 -2 -3 -4 -6 -9 -1 -1 1 0 -6 -7 2 -7 -10 -6 -4 2 -6 -8 -13 0 -7 -2
8187bKj0J2q
$$ -2 0 -10 2 -6
8191f
$$ Imaginary data points
##PAGE= N=2
##DATA TABLE= (X++(I..I)), XYDATA
0@%%%%%%%%%%%%%%%%%qJ6j6J6j6J6k4L2l2M0m8M9n7O9p7Q8j04J14j23J39j60J82
$$ 0 0 0 0 0 0 0 0 0 0 0 0 0 0 0 0 0 0 -8 8 -8 8 -8 8 -16 16 -16 24 -24 25 -32 37 -40 48 -56 58 -65 74 -86 96
39I6k01K25k49K74l06L38l75M15m58N07n56O12o76P45q22R04j000J111j233J378
$$ 96 -105 120 -129 145 -161 177 -198 217 -241 266 -290 322 -354 391 -431 473 -527 584 -649 729
59G29j547J744j988K291k676L194l925N039o968J1224l6671K6652P4907p1877
$$ 729 -818 926 -1062 1229 -1447 1747 -2178 2861 -4107 7117 -29554 -2902 72005 128
73A28n5907M3823N6054k9343l7279J220K4734J8561l095m2171j2768N6097L1078
$$ 128 -55779 -11956 44098 14755 -22524 -21304 3430 21991 18896 -23275 -36043 20054 51132
86E1132o8014m1804O9806N0599o7661n1416N7036M8880m3231l9840K4402K8331
$$ 51132 -16882 -58686 11120 61719 -5942 -57358 -322 48558 5327 -34513 -10111 18220
98A8220n423j3340j4125j349L0632J5745m4216k7057N2637L5247n6209l8661N4234
$$ 18220 12797 -543 -14668 -16017 14615 30360 -13856 -40913 11724 46971 -9238 -47899 6335
111F335L7756m7646l2345L7059K3664k3909j2660R379R48M915J0170j7841j9354
$$ 6335 44091 -3555 -35900 1159 24823 914 -11746 -2367 -1419 3496 13666 -4175 -23529
124b3529K8282K5509l5612k7989L9308K6629l9493k1794L6418J4241l0666n067
$$ -23529 4753 30262 -5350 -33339 5969 32598 -6895 -28689 7729 21970 -8696 -13763
136a3763K2984m413j4174J2958N152j9464L484K3158j1079k3484J7241K0490k1656
$$ -13763 9221 4808 -9366 3592 8744 -10720 -7236 15922 4843 -18641 -1400 19090 -2566
149b566j4552K4257O454k5079K748K4244j1912k2021J9787J8564k5355j4262K7797
$$ -2566 -17118 7139 13593 -11486 -8738 15506 3594 -18427 1360 19924 -5431 -19693 8104
162H104R268k6747l892K2161j616j4495O977M613j1865O332J6196j7120j9526
$$ 8104 17372 -9375 -13267 8894 7278 -7217 -240 4373 -7492 -1160 15036 -2084 -21610
175b1610K6441K1651l3012k2357L6033K1533l5003j9112K9931J5182k1282j0003
$$ -21610 4831 26482 -6530 -28887 7146 28679 -6324 -25436 4495 19677 -1605 -11608
187a1608R961L868K758K753j5571r425K7041J5479l5842k0466M0984K3889m1855
$$ -11608 -1647 2221 4979 7732 -7839 -17264 9777 25256 -10586 -31052 9932 33821 -8034
200h034k5384L8301K4750l0607k1929J9597J7134o384j0663p673L114K1179M874
$$ -8034 -33418 4883 29633 -974 -22903 -3306 13828 7444 -3219 -10892 -7778 13401 18275
213A8275l2644j2621M0892J9325m5079k4315M4652K7065l9733k7236L0725K4779
$$ 18275 -14369 -26990 13902 33227 -11852 -36167 8485 35550 -4183 -31419 -694 24085
225B4085j8617j9936M661J3167R732n157k3069l268L4041J1267m1501j7976M4788
$$ 24085 5468 -14468 -9807 3360 13092 7935 -15134 -18402 15639 26906 -14595 -32571 12217
238A2217K2744m3579k5074L8107K4814k9029k2026J7311J7068m235j0537q936
$$ 12217 34961 -8618 -33692 4415 29229 200 -21826 -4515 12553 8318 -2219 -11155
250a1155L166K0858M215l0467j0906L6878J6119l9530j9453L8328K0578l3504
$$ -11155 -7989 12869 17084 -13383 -24289 12589 28708 -10822 -30275 8053 28631 -4873
262d873j9436K5691J6270j5682j1475M614N682O480M20j6472o148K4537J0859
$$ -4873 -24309 1382 17652 1970 -9505 -4891 791 7271 7691 -8781 -14929 9608 20467
275B0467k9957j3964L2306J5175l1613j4369K7981J1736k2056p664J4414K761
$$ 20467 -9490 -23454 8852 24027 -7586 -21955 6026 17762 -4294 -11958 2456 5217
287E217o006K299k429o790J0074J0136j6298j1906K0678J1859k2886r983K2924
$$ 5217 -789 1510 -919 -7709 2365 12501 -3797 -15703 4975 16834 -6052 -16035 6889
300F889O624k0970k188J7438k696j2715P329P416j1121k019J3516l014j4160P285
$$ 6889 13513 -7457 -9645 7793 5097 -7618 -289 7127 -3994 -6013 7503 4489 -9671 -2386
314b386J2834j0551r701J2668N018j3618O04J3543o577j2580J2144J0918j6597
$$ -2386 10448 -103 -9804 2864 7882 -5736 -5132 8411 1834 -10746 1398 12316 -4281
327d281q765J9349O315j9890l738J8113J160j4037J330Q103l642q63N668o915
$$ -4281 -13046 6303 12618 -7272 -11010 7103 8263 -5774 -4444 3659 17 -846 4822 -2093
341b093p376J4308Q712k0516r568K4690R892k6351r645K5197Q764k1232p301J4859
$$ -2093 -9469 4839 13551 -6965 -16533 8157 18049 -8302 -17947 7250 16014 -5218 -12519 2340
355B340N283o664k869k422J10J1575K807j9756n637K6057Q228k9801j0271L0501
$$ 2340 7623 959 -1910 -4332 -4222 7353 10160 -9596 -15233 10824 19052 -10749 -21020 9481
369I481J1621k8065j2084K2658J1540j4865j0007N421P542M636m289j4417N85
$$ 9481 21102 -6963 -19047 3611 15151 286 -9721 -4300 3242 7878 3589 -10828 -10243
382a0243K2805L285k8938o928L2200R945l2200j2016K8971J2946k2837j2556J4479
$$ -10243 12562 15847 -13091 -20019 12181 22126 -10074 -22090 6881 19827 -3010 -15566 -1087
395a087J0931m697q242n443M798J4944r50k2869k897K8424O296l1096q958L0654
$$ -1087 9844 5147 -3095 -8538 -3740 11204 10254 -12615 -15512 12912 19208 -11888 -20846 9808
409I808J0558k7212j1064K1183J0353j3203q640M123O161N096l146j3600j3K0579
$$ 9808 20366 -6846 -17910 3273 13626 423 -8217 -4094 2067 7163 4017 -9583 -9596 10983
423A0983K994k5314n480K7493P197k6898p974K3724P797j8391o694J1512M821
$$ 10983 13977 -11337 -16817 10676 17873 -9025 -16999 6725 14522 -3869 -10563 949 5770
436E770l796k557l886Q0J0851K205j6483l972K0198N014k1818n161K1254M413
$$ 5770 1974 -583 -4469 -4389 6462 8667 -7816 -11788 8410 13424 -8394 -13555 7699 12112
450A2112j8710k874J4556Q07r273J440L545l597K189N221p254o122J1299O078
$$ 12112 -6598 -9472 5084 5891 -3382 -1942 1603 -1994 195 5416 -1838 -7960 3339 9417
464I417j3948n065J5092L116j4737m96J3021k477j0301N432O891p951l226R685
$$ 9417 -4531 -9596 5496 8612 -6125 -6621 6400 3923 -6378 -946 5945 -2006 -5232 4453
478D453l12j0349L396R803n779p973P332N012q000j171P882l126p094P412N885
$$ 4453 4141 -6208 -2812 6991 1212 -6761 571 5583 -2417 -3588 4294 1168 -5926 1486 7371
493G371j1210m419J4040K849j5499j401J5308J33j3418Q61R909j577n156K033
$$ 7371 -3839 -8258 5782 8631 -6868 -8269 7039 7172 -6246 -5385 4524 2947 -2209 -176
507a76m45k300O294K404j1702k482J6193K550j9144k614K0212K708j9161k783
$$ -176 -621 -2921 3373 5777 -5925 -8407 7786 10336 -8808 -11422 8790 11498 -7663 -10446
521a0446J6094K798j1230k680N040K461J787j953q650J172J4795j86j9578j030
$$ -10446 5648 8446 -2784 -5464 -424 2037 3824 1871 -6779 -5607 9188 9002 -10576 -11606
535a1606K2444K303k3089l579K1397M632j7524n325J1808N592m845n363k565M558
$$ -11606 10838 13141 -9948 -13527 7870 12502 -5022 -10347 1461 7053 2208 -3155 -5720 -1162
549a162R821l274j6078J634K0744J96k3303k013K3517L639k1393m850J7104N565
$$ -1162 8659 5385 -10693 -9059 11685 11881 -11422 -13435 10082 13721 -7672 -12522 4582 10147
563A0147j1174n694M181N280L111m351j0054L026J5893j470k0071j60K2197J692
$$ 10147 -1027 -6721 -2540 2740 5851 1500 -8554 -5528 10365 8895 -11176 -11336 10861 12553
577A2553k2084k966J9807L845j5586m277R947M236l455l804l128K957R252j876
$$ 12553 -9531 -12497 7310 11155 -4431 -8708 1239 5475 2020 -1784 -4912 -1955 7297 5421
591E421j4282P14J7692L94j9247j284J8806J868j6572k046J2787J851p930j368
$$ 5421 -8861 -8147 9545 9939 -9308 -10592 8214 10082 -6490 -8536 4251 6102 -1828 -3196
605c196K558O81K808P6p542p69J1329J178j3738j261J4674R47j4122k38J2178
$$ -3196 -638 43 2851 2927 -4615 -5384 5945 7123 -6615 -7876 6798 7745 -6377 -6615 5563
620E563p33r177J809N535k911j559L732k306m130N606L970q053l307R537K038
$$ 5563 4830 -4347 -2538 2997 86 -1473 2259 -47 -4177 1429 5399 -2654 -5961 3576 5614
635E614r907l03R227j695p690L793N541n689l050P168N54p971J700P988l459p116
$$ 5614 -4293 -4596 4631 2936 -4754 -961 4580 -1109 -4159 3009 3563 -4408 -2708 5280 1821 -5295
651e295M608N384n100k938M973p7m324L320L248o433k031R056Q12j0913K36J1746
$$ -5295 -687 4697 -403 -3341 1632 1555 -2769 551 3799 -2634 -4665 4391 5203 -5710 -5474 6272
667F272j036j1366J493R776j598p074J391L518r32O14L69m871K56Q770p14j1976
$$ 6272 5236 -6130 -4637 5139 3541 -3533 -2142 1376 444 1058 1427 -3444 -3188 5582 4868 -7108
683g108J004J4055j014j4788P72J4000k46j1804m50Q291J249l895k026j018K604
$$ -7108 -6104 7951 6937 -7851 -7079 6921 6675 -5129 -5579 2712 3961 66 -1960 -2978 -374
698c74N906k881j0273K825J3695k388j5784J631J6305o19j5158n37J2492J692
$$ -374 5532 2651 -7622 -4797 8898 6510 -9274 -7643 8662 8043 -7115 -7652 4840 6532
712F532q565k721L810L510J312l909o312L892J0652l501j3933K763J5773j751
$$ 6532 -2033 -4754 -944 2566 3878 -31 -6343 -2451 8201 4700 -9233 -6470 9303 7552
726G552j6024N70J4684O33j1869j764P932K682l205l374j744L714O450l674j0435
$$ 7552 -8472 -7902 6782 7415 -4454 -6218 1714 4396 1191 -2183 -3927 -213 6237 2563 -7872
741g872L326J3343k712j4851J871J4833r39j3327j7J0506Q74o737j627K425K123
$$ -7872 -4546 8797 6085 -8766 -6895 7938 6999 -6328 -6345 4161 5035 -1702 -3329 -904 1219
756A219K013k361o048K361R297k177j1492J879J2443j520j2046J159J0475q22
$$ 1219 3232 871 -5177 -2816 6481 4304 -7188 -5309 7134 5614 -6432 -5273 5202 4380
770D380p933N77M727l69j220K36k265o7N276j41p543L82Q927p67r306J216Q686
$$ 4380 -3553 -2976 1751 1382 162 398 -1867 -1934 3342 3201 -4342 -3960 4967 4200 -5106 -3890 4796
787D796j739p215K246N113k730k574L031p1l108K530K884m487k338N798J475o335
$$ 4796 3057 -4158 -1912 3201 471 -2103 928 857 -2251 279 3163 -1324 -3662 2136 3611 -2724
803b724l47O152r52n275K361L863l701k133M846K79n596J384N864k715n599L552
$$ -2724 -3071 3081 2129 -3146 -785 3078 -623 -2756 2090 2369 -3227 -1843 4021 1306 -4293 -741
819g41M764l884l382L641J567k954N80J907k810o66M878n67o556J621P707k375
$$ -741 4023 139 -3243 398 1965 -989 -409 1498 -1312 -1978 2900 2333 -4223 -2602 5105 2730
835B730q172K770P830k715o682K234M842j413k440L67l86P98L250j884n870K756
$$ 2730 -5442 -2672 5158 2443 -4239 -2005 2837 1424 -1016 -649 -1035 -237 3013 1129 -4741 -1985
851a985P995l301r406L435R919l110r443K361Q045j294n788j4K950J327L08k565
$$ -1985 6010 2709 -6697 -3262 6657 3547 -5896 -3535 4510 3216 -2572 -2586 364 1691 1999 -566
867e66l500L479O381m040q651M148J0078l823j0489L051R837j936q236O12N825
$$ -566 -4066 -587 5794 1754 -6897 -2749 7329 3506 -6983 -3932 5905 3969 -4267 -3655 2170
882B170Q02k856k126m45L270L623m033o431M419Q604m359r886L877J0194l036
$$ 2170 2972 116 -2010 -2455 815 4438 405 -6026 -1607 6997 2638 -7248 -3371 6823 3787
897C787r429J885P758n66n341p94K435K028P24l073l729L762O262m104q124M066
$$ 3787 -5642 -3757 4001 3435 -1906 -2700 -265 1763 2487 -586 -4315 -553 5709 1605 -6519 -2453
913b453R095l682r095K960Q174k049o421R84M103R0j402j082j338J923L828k540
$$ -2453 6642 2960 -6135 -3175 4999 2950 -3471 -2487 1616 1706 304 -778 -2116 -193 3635 1095
929A095n744K883O995k983p478K885P145k585o081K141M428j581k416R94J92l80
$$ 1095 -4649 -1766 5229 2246 -5232 -2347 4798 2213 -3868 -1727 2701 1120 -1296 -302 -110 -490
945d90J931k59l696Q06M973j307n614J737N588k061m987K322L848k481k290K514
$$ -490 1441 1182 -2514 -1708 3265 1958 -3656 -1919 3669 1608 -3379 -1057 2791 310 -1980 534
961E34N55k400J147K134k623j683L665J100m215l82M203m35l662J292K683k133
$$ 534 1089 -1311 -164 1970 -653 -2336 1329 2429 -1786 -2168 2035 1600 -2062 -770 1913 -220
977b20j406K873%l440J337L781k439l808L161L537l452k911L279J968k656p96
$$ -220 -1626 1247 1247 -2193 -856 2925 486 -3322 -161 3376 -76 -2987 292 2260 -396 -1192
993a192J702n43n08J899p42l200J922M233k850m907L390N173l534m980L191M345
$$ -1192 510 -33 -541 1358 616 -2584 -662 3571 721 -4186 -796 4377 843 -4137 -946 3399
1009C399k484l227J439J734j57Qj196j765K417L444l389m777L970N688m090o094
$$ 3399 915 -2312 -873 861 704 712 -484 -2249 168 3612 223 -4554 -584 5104 1014 -5080
1025e080L795N874l035n098J922L785o00k055q35R1K170J904l314l666M045N086
$$ -5080 -1285 4589 1554 -3544 -1622 2163 1563 -492 -1327 -1236 934 2838 -476 -4142 -97 4989
1041D989m365o021M230O347l654o058K699N211j455l834Q7K047J336p6k585j896
$$ 4989 624 -5397 -1167 5180 1526 -4532 -1833 3378 1923 -1911 -1824 223 1559 1483 -1102 -2998
1057b998L572L621m152m979M336N832m092o083L451N706k497m773J307L356k7
$$ -2998 574 4195 43 -4936 -600 5232 1140 -4943 -1492 4214 1717 -3056 -1749 1607 1580
1072A580j584j242l07K322K129l175l637L665M708l781n261L578N229l033m674
$$ 1580 -4 -1246 -1553 769 2898 -277 -3914 -249 4459 678 -4583 -1005 4224 1191 -3483
1087c483K273L612j321k200L03O18O51R99j521k405K166L502k616m154K809M325
$$ -3483 -1210 2402 1081 -1119 -816 -198 453 1452 -69 -2474 -308 3194 578 -3576 -767 3558
1103C558k743m031K472L307k033k228J459R61q15L62J64j577M30K571r62l194
$$ 3558 815 -3216 -744 2563 530 -1698 -239 722 -93 269 433 -1144 -714 1857 895 -2299
1119b299J380L422j688l235J880K620j921j732J862O36j708M89J484j543j169
$$ -2299 -919 2503 815 -2420 -540 2080 159 -1573 289 925 -783 -294 1190 -353 -1522
1134a522K360P93k852l74K972r0k683N66K064j002j171J434J42j798R23K042j854
$$ -1522 838 1631 -1221 -1595 1377 1287 -1396 -830 1234 232 -939 495 637 -1161 -238 1804 -50
1151e0k161K544K144k934j953K945J590k591j094J882M71r56K46j33r89J226J675
$$ -50 -2211 333 2477 -457 -2410 535 2125 -466 -1560 322 793 -163 83 -50 -1039 187 1862
1168A862k196k251K910K686l304k886L317K851k951k540K245J983j253j181R2
$$ 1862 -334 -2585 325 3011 -293 -3179 138 2989 38 -2502 -257 1726 473 -708 -616
1183f16K35J111P53k192j701L052K518l590l102L720L393l478l344K819K989j893
$$ -616 -381 730 1483 -709 -2410 642 3160 -430 -3532 188 3581 103 -3241 -422 2567 674
1199F74k301P27J396N32l69j712p53K748J773l465k633L848L231l819l501L380
$$ 674 -1627 -900 496 1028 659 -1053 -1806 942 2715 -750 -3383 465 3696 -123 -3624 -244
1215b44L459k629l069J622K348m10j418q11L51J916P48k809j763L406K586l656
$$ -244 3215 586 -2483 -861 1487 1077 -341 -1152 -801 1115 1863 -946 -2709 697 3283 -373
1231c73l115L518L324l037l172K281K671j320j903K68R36P90J16j717j114K430
$$ -373 -3488 30 3354 317 -2855 -574 2097 777 -1126 -858 78 868 984 -733 -1847 583
1247E83J957k905k551L063K832k918k819K516K471j899j864J124J084k95k09n01
$$ 583 2540 -365 -2916 147 2979 61 -2758 -242 2229 330 -1534 -410 674 379 170 -331
1263c31o73J236J427j781j999K159K292k262k334K192K088j919j602J508R48r92
$$ -331 -1004 232 1659 -122 -2121 38 2330 68 -2266 -74 2014 95 -1507 1 949 -43
1279d3j97M50n88R4J252n80j754R41K013j206k020J356J744j364j269J286O06
$$ -43 -240 210 -378 -284 968 388 -1366 -425 1588 382 -1638 -282 1462 98 -1171 115 721
1296G21j126J28R14q46o65J486L92j897j41K099j04k003L10J675m91j105O36M02
$$ 721 -405 -277 637 -209 -874 612 1004 -893 -1034 1065 961 -1042 -732 943 452 -653 -17 385
1314C85p53L77Q25j148q74J787Q75k236q51K428P79k348o60J969N06j371k72N71
$$ 385 -368 9 834 -314 -1188 599 1474 -762 -1613 815 1594 -754 -1414 555 1061 -310 -582 -11
1332a1K0L08K54j154n56J907Q50k454j083K727J250k721j302K405J237j802j072
$$ -11 9 317 571 -583 -1139 768 1618 -836 -1919 808 2058 -663 -1965 440 1677 -125 -1197
1349a197J007P94r7l93q69l8J734M93k431r11K858J274l010j485K824J579k344
$$ -1197 -190 604 507 114 -755 -793 941 1434 -997 -1908 950 2224 -786 -2271 553 2132 -212
1366b12j530J618J328p22r73k83N45J217l8k042m87K654R41k975j331K992J581
$$ -212 -1742 -124 1204 482 -491 -774 -229 988 950 -1092 -1579 1075 2016 -959 -2290 702 2283
1383B283k713j659K142J583j367j321M67R43M70m57j330o5K024O09k507j042K702
$$ 2283 -430 -2089 53 1636 269 -1052 -585 358 828 371 -959 -1024 1000 1609 -898 -1940 762
1400G62J375k641j521K302J508j752j326J031R96k41n76n48O6J253M11j811q14
$$ 762 2137 -504 -2025 277 1785 33 -1293 -262 734 493 -83 -631 -565 688 1099 -712 -1526
1417a526K152J115k293j258K181J264j863j113J372Q50p77m66J46L4M94L67j011
$$ -1526 626 1741 -552 -1810 371 1635 -228 -1341 31 881 104 -362 -216 -182 312 679 -332
1434c32p26J418R73j624j115J684J091j539r54J290O53r21k93M94j25p8N37l28
$$ -332 -1058 360 1333 -291 -1406 278 1369 -170 -1124 166 819 -102 -395 99 -26 -104 433 105
1452A05q84O57J093q61j178R72J111r76q78Q67N37o98j13N00l55k83Q11N7j150
$$ 105 -779 -122 971 110 -1068 -96 1015 39 -839 28 565 -133 -246 254 -101 -384 427 484 -666
1471f66J09J387k54j452L42J327l58j052L37O31k85j19K29m29j50R43J13j381
$$ -666 -557 830 576 -876 -534 793 435 -617 -280 351 66 -53 176 -253 -403 540 653 -728
1489g28p5J656O8j755r5J673J22j379j77R45J83l82j82k39J32Q51o6j374m6J768
$$ -728 -803 853 921 -834 -929 744 866 -513 -690 255 438 56 -126 -365 -233 618 552 -822 -868 900
1509I00J71j957k98J941M22j731n05J327N55p68n22J04M59N63l27j167J46J678
$$ 900 1071 -886 -1184 757 1179 -552 -1057 270 825 57 -465 -361 98 661 334 -833 -687 991
1527I91M8j998k51K110M23k003n95J693O90j208p14N88O52R6n56p52L64J333j29
$$ 991 1039 -959 -1210 900 1323 -680 -1275 418 1108 -100 -814 -226 426 522 -34 -786 -422 911 782
1546G82j780r9K024L31k038n34J861O90j502p29R83O98l58n94k72M26Q59k12j337
$$ 782 -998 -1097 927 1258 -780 -1314 547 1237 -265 -994 -11 687 329 -265 -537 -111 748 536 -801
1565h01k1J657K49j814m44J774N68j538o44J178O02o97n23J55L73L67j59q61j5
$$ -801 -822 835 1084 -730 -1174 600 1168 -370 -1014 164 766 69 -454 -299 74 441 282 -579 -594
1584e94J218K11j444l69J507M77j412n12J185M74q38l66M10K10K3k3m28j63P72
$$ -594 624 835 -609 -978 529 1006 -406 -918 267 741 -97 -463 -53 157 180 157 -271 -434 338
1603C38L23r85m52J097N07j083m82R21M13p08k55M30O4j27J51j54l70L95N46n84
$$ 338 661 -324 -776 321 828 -255 -737 184 597 -111 -366 64 128 1 152 -2 -372 23 569 -15
1623a5o54O78O76o80o27O13M76m80k53K85Jj01K89j00n33K39P48l47q69M02R09
$$ -15 -669 9 685 5 -622 -9 467 -13 -266 19 20 -81 208 108 -425 -186 562 215 -654 -252 657
1644F57l82q33L14O58j99l99P0R1N1K79j86n85K46Q67k90j061K80J117k12j074
$$ 657 275 -558 -244 414 215 -184 -114 -23 28 307 121 -464 -218 649 359 -702 -422 695 483 -591
1664e91J01Q98K2o34j33K69K35J17l04m86L06Q49k88j105K35J241j17j268J2J145
$$ -591 -490 408 430 -204 -337 -68 167 284 -20 -506 -200 649 361 -744 -509 732 615 -653 -641 504
1684E04J30q89k67N53L62j45m20k80M29O79m03r97L00J223j89j320L9J279J03
$$ 504 634 -255 -522 31 393 248 -172 -452 -23 656 253 -744 -444 779 590 -730 -691 588 691
1703F91j085k55P87L66m06m49OM53M12m08p74L31J047k10j209O7J254O5j133k14
$$ 691 -394 -649 138 504 98 -351 -345 108 520 112 -662 -331 716 506 -703 -636 618 683 -450 -664
1723f64R16L21n99l86K35M05J45l56n02K76P98j86r94P1J083O1j071j59R20K46
$$ -664 252 573 -26 -412 -177 228 373 17 -485 -209 589 403 -591 -520 563 624 -447 -606 314 560
1743E60o89l00M05K96q1k66k44J95N23j00p56J8Q76P4r00j49Q11K00o52k02M16
$$ 560 -129 -429 -24 272 191 -75 -319 -124 399 299 -457 -439 437 511 -389 -538 273 473 -179 -381 35
1764C5J94j59j31j09N8L46L6n13j32O44J93o64k37O25K38n11k06L34J52j64m6
$$ 35 229 70 -61 -170 -112 234 270 -243 -375 269 462 -202 -439 186 424 -87 -293 41 193 29 -17
1785a7m9p4K24J80l70k79M55L44m71l72M42L41l56k77K24J78o4k8q4j31K20K82
$$ -17 -66 -140 84 264 -106 -385 70 414 -57 -429 13 354 -2 -279 -55 123 59 31 -53 -184 36 318
1807C18l13l95L64M92l71n17L28M80k29m02J07K60J9r4j32j13K48K84l13m59L39
$$ 318 5 -390 -26 466 95 -422 -94 386 157 -245 -138 122 141 47 -85 -198 50 334 21 -438 -99
1828i9N74l13o36K46O19j45n46L2M11R2k16k02rK94K23l47m14L44N82l08o88K56
$$ -99 475 162 -474 -228 391 246 -300 -268 143 235 19 -183 -192 102 325 -22 -436 -92 490 182 -506 -250
1850b50P05j33o63LN54J11l79k14J47L08Q7l51l08L55N03l26o47K63P21j70p07
$$ -250 455 322 -341 -338 216 327 -52 -266 -119 189 276 -75 -383 -28 475 149 -498 -235 486 316 -391
1871c91N0O11Q2m71j93K67K66k9l27j94L31L96l00n60K47O55j49o87N5O25O7n17
$$ -391 -341 270 352 -119 -312 -45 221 192 -135 -329 2 398 98 -462 -215 440 291 -396 -341 284 351 -166
1893a66j44L44K20j38k71n7K72K63k55m16K00N41j36n82M4N78J6m98j09L72J63
$$ -166 -310 34 254 116 -155 -212 60 323 68 -348 -148 393 257 -325 -281 297 313 -185 -294 78 241
1914B41k15j83J9J81J52j62l11J22M17n3m87J2M79N9m28r5L27J29j83j31K5J23
$$ 241 26 -157 -138 43 195 33 -278 -156 261 208 -279 -267 212 271 -157 -252 75 204 21 -110 -85 38
1936C8J17q4k38K4L43J9l72q7L77J14l37j40K66J34j64j19M4O8Q6j9j89n3K80
$$ 38 155 71 -167 -143 200 219 -153 -240 137 251 -86 -226 40 174 10 -109 -65 3 89 70 -119 -172 108
1959A08J01l17j42L05J80k68j75J82J84j02j44jP7J11j4j81q0K47J65k86k08K74
$$ 108 209 -108 -250 55 235 -33 -208 -26 158 56 -88 -89 -12 99 85 -96 -176 71 236 -50 -258 16
1981A6K41k30k48J51K41o2j90l6J09J28j1j98j02K70J61k68k54K54K99k14l00
$$ 16 257 27 -221 -70 171 109 -81 -117 -8 120 109 -89 -191 79 240 -28 -282 -28 271 57 -243
2002b43J26K87m6k43n0J72J37q3j89l8K48J36k56k33K38L19k07l40J42L38n6k91
$$ -243 -117 170 124 -119 -169 3 140 57 -132 -170 78 214 -42 -275 -37 282 75 -265 -123 215 159 -132
2024a32k4K11J25j23j89J4K22J07k41k10K22K76j86l28J29L36n4l22j8K49Q5j49
$$ -132 -156 55 180 57 -132 -118 104 211 -30 -240 -18 258 72 -256 -127 209 155 -167 -185 64 149 0
2046@j52M3K06N1k15j59K04K49j71k91J20L18n4k92j6K62P8j79j37R3J58K2j80
$$ 0 -152 -109 97 148 -67 -226 -22 227 56 -235 -115 203 149 -143 -159 103 181 2 -135 -42 116 138 -42
2069d2j14J66J92j49k41Q9K85n8k71oK22O3j68j17J07J32qj37r4J48J49r6k05
$$ -42 -156 10 202 53 -188 -99 186 128 -143 -149 73 136 -32 -149 -42 90 82 -55 -149 -1 148 52 -153
2092a53O3K15j1k23l0K06P1j58r4Q8J01mj04p2R8J32o3j73K2K02J4k02n0J86O3
$$ -153 -90 125 114 -109 -139 67 138 -20 -114 -26 75 71 -33 -105 -7 125 62 -111 -89 113 127 -75 -125 61 124
2117A24j28r4O1J07nq3p5P1J15l5j52j2J75M7j74p5J44J00r4j25N8J21Nj03n8
$$ 124 -4 -98 -37 70 65 -18 -93 -22 93 58 -94 -106 69 116 -58 -133 11 111 17 -108 -50 71 76 -27 -85
2142h5N4J13j5j41k5J61P1j53r3J24J24q8j37L9J31Jr0q0P8J04l7j28l4J50P1
$$ -85 -31 82 67 -74 -99 62 133 -20 -113 11 135 47 -90 -51 80 81 -9 -89 -11 93 56 -72 -106 44 115
2167A15j54j01J22J29q1j44K9J36K5j16o2Q1J16m4j19j8J46N2j20j11J20J28p3
$$ 115 -39 -140 -18 111 30 -114 -85 51 76 -40 -102 -21 95 51 -68 -86 60 112 -8 -119 1 129 56
2190E6j37J9J44J6j20o7R2R2n0j08j5J13O8j25q8Q7J17o7j32K7J43Pj13n8R2Q1
$$ 56 -81 -62 82 98 -22 -89 3 95 45 -63 -78 35 103 -22 -110 -23 94 27 -105 -78 65 72 -41 -99 -7 74
2216G4m4r5OR7M0r0q5Q3J11m6j36L2J33Oj08n5Q3P8n2q6lR7L3p8o7N6R7l6r8j2
$$ 74 30 -65 -59 38 78 -12 -97 -14 97 51 -85 -53 80 86 -22 -77 6 84 32 -54 -57 40 73 -5 -72 -16 81 45 -53 -65
2246f5J17K4r6o9Q2P6n0r2MJ01L2p8o7N3P9nj05qJ06K4r3n0Q2P8n0p4J4Q5J5p5
$$ -65 52 76 -20 -89 -7 69 19 -73 -69 32 64 -14 -81 -28 51 46 -59 -67 39 63 -30 -80 2 80 30 -44 -30 55 70 -5
2276en0O5O2k3r0lR2K0p4n8O6N9m2p0QP5Po8k6L2O0j4p2lN6M2o0n4M8P4k4o8N
$$ -5 -55 10 72 49 -41 -44 48 68 -6 -64 2 61 19 -51 -43 32 39 -29 -55 -23 37 23 -49 -52 4 46 -14 -68 -20 54 30 -38 -33
2309c3P3J2n5l0M4M8k2n5pO3K0m2o5L6O6k5n4rO4Rn7l0L5M9k5l4qL1J7j7m5K4
$$ -33 40 52 -3 -33 11 59 37 -18 -25 38 58 16 -49 -13 53 28 -26 -35 29 38 -19 -49 -14 35 10 -24 -32 -1 16 -1 -46 -22
2341b2N6ro7JP6J3m2l6L0L7k9jj7K2K4j9l9RL9Pn1qM3L3n4k1L3J3nk7rJ8K8j0
$$ -22 34 25 -42 -41 35 48 6 -30 0 37 8 7 -10 12 36 17 -22 -13 26 33 -18 -26 17 50 -4 -25 8 21 16 -11 -20 -2 26 16
2375A6m6OL6K3o1j6M2L7l8m6M2J8Lk7j6K2K3qk2j2M6J9l6l9N0M1l1n9L5L7j4l4
$$ 16 -30 -24 12 35 -26 -42 0 37 -1 -47 -5 13 16 -11 -27 -5 18 10 -12 -24 22 41 5 -34 16 57 26 -33 2 39 25 -9
2407iqK6J9rl7rL4K5l9l9L8M2l1m9J7M6ql6LK8J3j4k2j1M0K1m0j0L2L5k7n3M3
$$ -9 -17 9 28 19 -18 -27 7 32 -7 -46 -8 34 3 -46 -29 17 9 -27 -24 4 17 3 -19 -30 10 31 -9 -19 13 48 21 -32 11
2440A1L7j5l7JL2Jk7j4QJ2J1k0k5J9L9l2m4L0M2k1n4K5M4k1k5J1PoJ8nj6J6L0
$$ 11 48 33 -4 -3 29 30 3 -11 -3 9 20 0 -25 -6 33 1 -43 -13 29 8 -46 -21 23 2 -23 -12 -5 -11 7 2 -14 2 32
2473C2j8k8K6K8k1m0K7L0k9j7K0J2k0PPrj7J5J7l1%K6nk8J1K4j7k1J8lj1pK6M
$$ 32 14 -14 12 40 19 -21 6 36 7 -10 10 22 2 9 16 7 -10 5 22 -9 -9 17 12 -16 -5 19 2 -19 -1 -4 -15 -22 4 8
2507Hl5J1L3k2j6K6J0l1J6Pj0KJ7Mk2kL7j5l1J2L7j3k4J2J9j8j0K3k5pJ9lj9j0
$$ 8 -27 -16 17 -5 -21 5 15 -16 0 7 -3 -1 16 20 -2 -4 33 18 -13 -1 36 23 -1 11 30 12 2 25 0 -7 12 9 -10 -20
2541b0M4k3l7J5N7k5m6J6L0j0k0J5J0mNn%nL5pm7J7N4k0m9K4L9j4m9J9K1mj1l
$$ -20 24 1 -36 -21 36 11 -35 -19 11 1 -19 -4 6 2 7 2 2 -3 32 25 -22 -5 49 29 -20 4 43 29 -20 -1 20 16 5 2
2575BnNJ7j4k8ML2nm4K1M4k8m1K2K8k1rJ9Pk2K0Lk0nL5ml4K0L3j1m2K3K9j3k2
$$ 2 -3 2 19 5 -23 -19 13 8 -36 -15 29 1 -40 -18 10 -11 -20 -1 6 -16 4 7 -13 -18 17 13 -21 -1 32 21 -21 2 31 18 -4
2610dJ5Lj6kK5j4j8K2J1l8kL9j2l1J0J5nj8K1jj6MJ0Kl2K5K6k3k7K8J6k3j0K8
$$ -4 11 14 -2 -4 21 7 -11 11 22 -16 -18 21 9 -22 -12 3 -2 -20 1 0 -16 -12 -2 0 -32 -7 19 -4 -31 -3 13 -10 -20 8
2644HKj7RLj0mM9j6l6K6L4l1l0J8M0m2j1MK1j5Nj7j0J4K5j8n0L0L6k5m1J8N3r
$$ 8 10 -7 2 5 -5 -9 40 24 -12 14 48 17 -13 5 45 3 -8 -4 17 2 7 -10 -20 -6 19 1 -49 -19 17 -8 -49 -31 22 13
2678A3m2J1K9Jrj3KK2J3j2l7L4L7k3o3L9M9k6m6J3M1j1k6k8K6K5j0j9k1K1M0l1
$$ 13 -29 -18 11 12 3 -10 -8 14 27 15 -22 12 49 26 -37 2 51 25 -21 -8 33 22 -4 -32 -6 19 9 -10 -31 -10 30 -1
2710ao1L5N6k7n2J9N3Mn0mM0n%j5j5K6M2l2m9J8P7k8o4J2O3om8jL4lk3mJ2j4L9
$$ -1 -62 -27 29 2 -50 -31 22 26 -24 -28 12 7 7 -8 -23 3 45 13 -36 -18 59 31 -33 -21 42 36 -12 -13 21 18 -5 -9 3 -11 28
2745B8j7m9J8M7lo1J1M2%m3KL4nnj2LLK4%m8K4K6J0o0MM4J4l6oL6pnlo%J5kj6
$$ 28 11 -38 -20 27 24 -37 -26 16 16 -27 -25 9 4 -1 -13 -10 -7 17 17 -31 -7 19 29 -31 -27 17 31 -5 -11 25 18 13 10 4 4 19 17 1
2783Aj7M2Qm4k2M3K0m9rK4J3j7j4Nj1J8K0l1j3L5L0m7k5M4M4l0m3L2J2qqo%K7
$$ 1 -16 26 34 -10 -32 11 31 -18 -27 -3 10 -7 -21 -16 -27 -9 11 -20 -33 2 32 -15 -40 4 48 18 -25 7 19 11 3 -3 -3 24
2817B4Kk9k8N5K8n4l7M4L9l2n1K8L4j6k3oJ7J8ol4j9N1L7n2m9M8O5n1n4K8N5j2
$$ 24 26 -3 -31 24 52 -2 -39 5 44 12 -39 -11 23 7 -16 -22 -5 13 7 -27 -46 5 42 -10 -59 -11 54 3 -51 -23 32 20
2849B0n3J4L1K1j4l0j5N1L0n6m1N1N5l9o4K5O7k1o1J2M7Pl1l6lN2J1n2k6M7N2
$$ 20 -33 -19 12 33 19 -11 -26 25 55 -1 -42 9 64 25 -39 -14 53 32 -29 -17 30 37 6 -30 -33 19 30 -22 -48 -1 51
2880E1m2o4K6P1k2o1RM2Qk5j1J0K7Rm0k6M8M3l5n6L8N6k5o2J2N7Kl7j0%K6Ml3
$$ 51 9 -55 -29 42 20 -41 -32 10 18 -7 -18 -8 19 28 -12 -38 10 53 18 -38 0 56 31 -31 -19 38 40 3 -7 -7 19 23 -10
2913a0l2L4M2l1o5L4O3k2o2RM6Pl1j4J8K0J5k6k6L8L8j5o3PP5j1n1j2M6J7l6j4
$$ -10 -42 -8 34 3 -62 -28 35 13 -49 -40 6 13 -18 -32 -14 6 21 -5 -31 7 45 30 -33 -26 49 38 -13 -25 21 38 2 -12
2945a2J1K8Jk1l8J3N4lo2lN3Qn6l0O1J4k1k5kL8J1k1m0J6M3J2n7j2P6J0n9l4N8
$$ -12 -1 27 28 7 -31 -18 36 33 -29 -32 21 29 -27 -57 4 18 -3 -28 -30 8 19 -2 -42 -26 17 29 -28 -40 36 46 -13 -47 11
2978A1M2n2k6J2L9K0m2l3J5O1j0o1j4O9J7o8l6O4M8o1n1K8N0Jl7k6K9L9Mp1j2
$$ 11 53 1 -25 -13 26 46 4 -29 -14 47 37 -24 -38 31 48 -20 -56 8 56 -5 -56 -28 22 23 -14 -40 -11 28 32 -39 -51
3009e1Q1J6o4n2O5N4m0n9K9M6J0l4l0K5N0kp6lO1K9m9o8P1O3n1o8L2N0qn0j2K4
$$ -51 30 46 -18 -70 -5 49 9 -50 -21 25 35 1 -29 -4 46 44 -32 -35 26 55 6 -62 9 72 21 -47 -15 35 27 -23 -35 -11
3041a1L8j3n0j8P1K6q1k9M6P1m8o0K8O1j1l3j5K9L7j6m9LM8L5o7l2M6P2n9p2L7
$$ -11 27 14 -36 -54 17 43 -38 -67 -21 50 2 -58 -30 31 20 -13 -28 1 38 22 -27 -24 24 59 -8 -40 6 78 19 -53 -16
3072a6O7k1m8j4L5L1j5m3oL9J8m6n4O2M8l1n6K1N2nm3k2M2M1k8m1NM4K9n7l1M1
$$ -16 51 30 -18 -32 3 34 19 -24 -30 9 27 -19 -73 -11 37 6 -50 -29 23 18 -25 -47 -5 36 8 -33 -28 16 45 -12 -43 -2
3104bN5k7n7J5M7J3n6j1L0K4j4k9j7L9L0m1m4K2N8j6p1KP0J0n7j9M5K7k3l1qL4
$$ -2 53 26 -31 -16 31 44 -12 -23 7 31 17 -12 -29 10 40 -1 -45 -23 35 19 -52 -50 20 30 -27 -46 -1 26 3 -28 -36 -2
3136bK4k2n6L2O9j5p3KP4J8o1l1L8N1k2m5j7O1K4l8n5L3O2j3p4mP4J4p8k4M4N0
$$ -2 22 0 -56 -24 45 30 -43 -41 33 51 -10 -41 -3 48 26 -19 -36 25 49 11 -44 -11 51 38 -36 -40 34 48 -30 -54 -10 40
3168D0l0n4%M9K8m6n3M0O6k0p2qQ9K0o8l8N8M2j8n2KM6L0l6n8L7O0j0p0j8P0L3
$$ 40 10 -44 -44 5 33 -13 -66 -26 40 20 -52 -60 29 49 -19 -57 1 43 25 -27 -25 21 51 15 -43 -6 54 44 -26 -44 26 59
3200E9p6l3M8M8l7m1j0N8K4n9m1K5P2j2o8j6P7K8p1l2M3N9j9o8J2N2K5n3l3K5
$$ 59 -17 -50 -2 46 9 -32 -42 16 40 -19 -60 -35 37 25 -43 -59 18 46 -25 -57 -14 45 26 -42 -30 22 47 -6 -39 -14
3230a4M9J3p5rO3L4o4m3N7N3m5n5RM4K5n2l4K3N1j3n1j6N1M7o5n0M3P0k7o7J2
$$ -14 35 48 -27 -36 27 61 -3 -46 11 64 19 -36 -27 17 42 -10 -44 -21 30 17 -34 -50 1 48 -17 -67 -24 46 19 -48 -36
3261c6N3K4n3l1J9N5lm4k5N7M7o0n2M4N9j2o7QN1J6n6k6K6M3jn2k1M5M0m4o3L8
$$ -36 17 41 -12 -43 -24 31 28 -16 -41 16 63 3 -49 -5 54 42 -25 -17 34 50 -6 -32 -6 37 36 -16 -37 8 48 4 -59 -21
3293b1O2pq0J3N0J3m3m0J9N1J6o3j9M8N2l1p8L3P3Np9lN8K1n0l4K1N5Nn5l2N1
$$ -21 41 34 -46 -33 17 30 -13 -53 -34 17 33 -30 -49 -1 51 20 -58 -25 48 53 -26 -29 29 50 0 -34 -13 42 47 -8 -40 11
3325A1M9n0n9L1O2j0p1qN7L1o1l4K1O7j2o1j6N4M9m5o7L5P3np0k1P8K5m9m7M2
$$ 11 60 10 -49 -18 44 34 -37 -45 12 43 -18 -52 -31 36 24 -37 -53 1 50 5 -62 -27 46 41 -29 -50 28 53 4 -43 -1
3356aM9pm8l2N1N1m4o1K5Q0j5q4qP0L7p2m7M0N2j3n5k0N0M3m5n0J9O8Nq6qO6M5
$$ -1 48 41 -7 -39 12 63 19 -42 -17 63 48 -36 -44 26 63 -9 -56 -16 36 23 -32 -52 -2 41 -4 -54 -35 33 38 -48 -56 10 55
3389E5o2n4N4N1no8JM2M5m1n5K0O7Op5k9P2M4o2n8M0N9j1o6j8N0M1l4o7K5P1L
$$ 55 -7 -61 -7 44 39 -29 -28 14 59 18 -37 -17 50 56 -19 -48 24 68 6 -52 -12 47 36 -30 -48 2 43 9 -58 -33 38 41
3421D1p2k1N2M8n9n1L5O0lo0k0N9M0m3m6J0P0J5o8l9O9M8n3m9K3O3j5n1k4N5L8
$$ 41 -31 -52 0 48 -11 -62 -27 33 30 -30 -50 9 49 6 -40 -30 40 55 -13 -52 17 65 12 -37 -14 49 34 -17 -41 14 52
3452E2l8o5K5N9kn5l7O3N1n6o7L3P8j2o8j9N2N7m9n2J2P0Mo4l3O9M9k8p4K0P4
$$ 52 14 -51 -26 33 31 -24 -61 2 53 -3 -70 -37 41 29 -39 -58 -6 51 2 -50 -38 32 36 -28 -61 8 57 29 -45 -25 49
3483D9Mo5l4O4L9m0n5J4N9Mn1l7O0M7l9p7K0P9ro9j7N1L9l0n9J5N7J6o7j9N7M9
$$ 49 53 -12 -46 18 57 17 -38 -24 35 39 -12 -49 11 58 19 -58 -38 41 32 -37 -54 -3 36 6 -53 -38 19 35 -32 -51 6 55
3515E5l8o6RR3qo5j4M9M7m0n6K0O5Qo0l6M6O4n9o2J8Q4oo9k1N0L9m7m4OO2On9
$$ 55 17 -49 -40 53 45 -20 -34 15 62 22 -34 -14 51 59 -1 -37 9 73 14 -48 -30 54 48 -21 -42 8 47 0 -44 -38 24 30 -29
3548b9l0N4M8l4n2J8O8mo1k7O3M3m1n0J2N6J6o1l3M7N8l1o9MQ2%o1l4N4M4l5o7
$$ -29 -59 -5 43 9 -43 -25 43 39 -22 -49 14 57 16 -34 -22 34 50 -11 -44 3 61 30 -39 -35 47 47 -14 -48 6 50 15 -52
3580e2J8O3Oo6k3M9M1k4n6MO5J7p9j2M5M6l1o1QP9jn3l0N3M8k7p0J0P6J0o3m5
$$ -52 -34 29 35 -31 -54 -5 36 12 -44 -40 25 42 -37 -49 -4 42 11 -50 -42 37 36 -17 -47 6 54 27 -43 -33 43 53 -10 -55
3612e5N7M9k8o5NP7%o0l5N0N4l7o7QN8L1o9l6N0N4l1p4K5N3K6n9l7N1M6l4n5J2
$$ -55 2 51 23 -42 -37 40 40 -20 -55 -5 49 12 -55 -47 11 42 -27 -63 -13 41 10 -64 -39 14 40 -19 -56 -5 41 7 -48 -36
3644c6O7Rm1m9M8O2k9o5NO0Qm3l8M0N5l4m7qP0J4p3m2O8M8l6p2K0N7J5n0m2M7
$$ -36 31 40 -1 -50 -2 60 31 -34 -29 31 39 -4 -42 -2 53 19 -28 -36 34 48 -25 -67 1 49 13 -59 -39 18 33 -17 -59 -12
3676a2N7l4n3OO0J6m8m5M2N6k7o0J5P3J2o6k8M2M7k2m9qN4J8m9n6N6M8k0o8kP8
$$ -12 45 11 -42 -36 24 40 -8 -53 -11 45 18 -42 -27 46 58 -8 -36 6 53 31 -18 -26 28 46 -3 -59 -3 45 25 -43 -45 33
3708C3Ro5k3L2N5k5p0KO6L0o4m6O1N1k8o3PO9Rn3l8N3M7k1o1oP5J9o4k9K9N6j8
$$ 33 42 -23 -46 -14 41 16 -54 -52 14 44 -20 -66 -5 46 18 -45 -38 31 40 -13 -51 2 49 28 -33 -39 36 55 -9 -38 -9 47 29
3741B9o9lP3K2o4l5M0N0m1n0lO7K1n4m1M5N9k2p8J3O3J6n0m0M1N5j8o5PN8K3n4
$$ 29 -40 -43 30 52 -12 -47 -7 43 2 -48 -51 16 37 -17 -58 -13 46 24 -54 -41 22 38 -12 -52 -11 44 26 -39 -32 26 49 -5
3773el9M0O0j8p3QN5K8n6l9M0N2k2p7QO0K2o0l7L9M5k0n7nO5J8m4n1M3M9j7n8
$$ -5 -44 -4 56 38 -35 -27 28 56 0 -39 1 53 31 -46 -38 22 44 -16 -53 -14 31 11 -46 -51 14 32 -12 -63 -20 29 12 -46
3805d6PN2K7m0m3K9O1j5o3LO2J8m1n4L7P1k5n6j6O6L3o9l9L3N4l3m9j1N7L1n4
$$ -46 -39 13 40 0 -43 -14 47 32 -31 -28 34 52 11 -43 -6 65 40 -16 -32 34 67 -2 -41 -8 46 13 -36 -47 10 41 -13
3836a3m0L6M6j5o1mO3L0n0l7L4N1j4m9pN2K3n0l8L5O4j9n8kN9K3n4l4K6N7k1n6
$$ -13 -53 -17 29 14 -47 -51 12 42 -8 -45 -11 40 26 -23 -30 22 45 -5 -43 -8 56 37 -21 -23 36 59 5 -29 -3 54 33 -23
3868b3nN8J2l6n3L1M8on8j2N8L1n2m9L1N5Jo8j7O2M1n6n0L8O6j8n2oN8K7m6l9
$$ -23 -28 30 42 6 -47 -16 32 26 -32 -44 14 45 -7 -56 -25 30 31 -37 -54 8 49 -7 -57 -19 47 29 -23 -29 29 56 10 -29
3900b9K4N5ro5pN7L3m8m9L4N2j8o4k3P8K4n0m7N0M2j9o1lN2L2n2l6J6N9rm8oM5
$$ -29 -5 50 41 -24 -31 26 59 11 -38 -4 48 30 -34 -57 21 45 -5 -52 -2 40 21 -40 -43 9 41 -11 -47 -31 28 19 -29 -35 10
3933A0J7k1m5L3N2ln5j8N0L2l5o0M2O0rp7j0O2L4m9n0K5N6j1n0k3M2M1m3n2L7
$$ 10 27 6 -39 -6 46 43 -12 -30 20 52 17 -43 -1 59 50 -27 -37 25 59 10 -40 -15 41 30 -20 -43 -1 40 -3 -55 -18
3964a8M0J1o8j4O5K6l8n0L3M8jn7j5O2K8l1n6K8O0no4k2O3L3m5n1L0M0J5o8j7
$$ -18 22 33 -35 -49 16 42 4 -46 -13 35 34 -23 -38 24 52 21 -35 -7 53 48 -16 -38 25 58 13 -38 -8 32 47 -21 -38
3995c8N3L3l4o1K5N4pn7k5N3L5l1m3J7M7On7j5N3K8l1m4K2M8%m7j1L1M8l8n1L1
$$ -38 15 48 14 -47 -22 32 25 -32 -57 -4 31 0 -43 -26 21 27 -30 -45 8 36 5 -39 -17 31 31 -16 -27 4 52 14 -37 -6
4027fM3Om9j9L8L7k6n5J6M7Lo1k2M9M0l4n3K4M2J0n8k2N2L4m3l4RN9%n1k1L9N7
$$ -6 37 43 -6 -25 13 50 24 -31 -15 32 35 -26 -48 1 41 7 -46 -22 20 30 -28 -50 2 36 -7 -41 -32 27 27 -24 -45 -6 51
4060E1l7n0K5N4Oo0j5M3L6l2n1J5N1Lm8k5M8L7l7m8PO0on3l3O3L6l6n3J3N6Kn4
$$ 51 14 -36 -11 43 49 -11 -26 17 53 21 -30 -15 36 39 -9 -34 14 51 14 -34 -27 33 27 -26 -59 4 40 4 -49 -36 20 22 -32
4093c2j4L8M5l8m9K5N8Pn5k2M6K8j6m9KO4Jn4j8M4M4l9n2K1M8%m8l0M8L8l1n3
$$ -32 -46 -8 37 -1 -50 -25 33 40 -15 -37 9 37 21 -28 -26 38 39 -15 -33 11 55 16 -36 -15 33 33 -15 -45 3 41 10 -43
4125d3ON1K2n6k4M0M4l6m4QN8Ln1k3M5M2m0l8RN7Om7k9N5L7k9n0kM7J7l9l5M2
$$ -43 -37 14 36 -20 -44 -4 40 4 -40 -32 26 29 -22 -45 0 42 2 -36 -27 30 36 -11 -40 15 52 23 -27 -29 18 35 -4 -39 3
4158CM1k3n3J0M5Qn0k5N0K7k7l8oN5Pl6k8J9M4%o2OM7J5m2k6M2L5k3n1J4M6K0
$$ 3 44 21 -32 -22 23 31 -19 -44 6 33 6 -32 -38 17 24 -12 -40 -21 23 23 -39 -33 14 29 -13 -39 3 38 15 -36 -22 24 44
4191D4m6k3L7L2j5m5kM0J7l5m3K9M2k0n2LN2Pl5k9K9K6j0l3pN4Nm2k5L3L4lm9
$$ 44 -2 -25 12 44 29 -16 -18 22 39 4 -39 -10 32 12 -40 -37 15 22 -13 -42 -13 13 3 -30 -37 17 22 -20 -45 -12 22 19 -30
4224c0%O2Kl4l5L0M2on4nO1K1n2l2K9M6j4o1JN8J0m6l1K4N8l1n2pM3L0m6l7N1
$$ -30 -30 32 34 0 -35 -5 37 31 -23 -28 33 54 2 -30 -1 45 31 -30 -29 29 39 -7 -38 -14 44 13 -39 -46 -3 27 -19 -56 -5
4257eM0k8n6LO4Rm8l0M2M5k9l5j0O1K7n2k8K6M8k3m7kN4J2m6k6M6K1mn4j0M4J9
$$ -5 35 7 -49 -46 18 27 -21 -51 -9 36 7 -28 -38 23 50 -2 -30 -4 44 21 -26 -28 26 38 -8 -34 12 33 29 -25 -35 9 28
4290B8l5n3M2M5j6n9J5M4J0m4k6L1L4j4m5mN6K2l6l1K7M1j3m2jL8L9n4k5K0L9
$$ 28 -7 -60 -18 27 11 -48 -33 11 21 -23 -49 -18 16 2 -43 -47 9 31 -5 -36 -9 32 19 -23 -24 14 53 -1 -26 -6 33
4321C3qm4LL6J4m7k5L2L7j8l8j6M5K6n4j8K3L4k0k7qM4K2l7k9J8M2rm2oN2L3n3
$$ 33 25 -19 -16 20 34 -13 -38 -6 31 13 -25 -41 4 30 -24 -42 -19 15 -5 -32 -40 4 26 -11 -40 -22 20 11 -31 -37 15 48 -5
4354ek3L5L5j5n0lL9K2k4m2K3M2on4kL9K4m1k6J7N6l3m6KM7Rk8m0L1M5pm6qL2
$$ -5 -28 7 42 27 -23 -26 13 35 11 -31 -8 34 28 -26 -28 11 35 -6 -32 -15 41 8 -38 -36 11 20 -8 -48 -17 28 21 -25 -33 -1
4388aL5l0m9K9N5j2m9JM8J8m1k6J1M4Ln0qM1K9l7m0K6L5rn2NL2J3k1l6J1M9km4
$$ -1 34 4 -45 -16 39 27 -22 -21 27 45 4 -22 -11 33 36 -14 -22 19 48 11 -29 -3 32 23 -29 -24 8 21 0 -36 -25 24 22 -22
4422b2j4L4L6l3m5J9N6j1m3k6N2K9l1k9J7M4ml6j6N1K3l5m3K6M0km7j5N3J4l0
$$ -22 -36 -2 34 1 -44 -25 31 20 -23 -49 3 32 1 -28 -11 33 29 -7 -23 28 51 16 -27 -1 39 37 -10 -25 28 42 12
4453A2m3K4M0j3m1j5L6K8l6m0K2N0j3m1j3M6K9k4m6J9M3j1k6j0M0K2k8l4L3J8
$$ 12 -31 -7 33 20 -21 -36 0 28 -8 -48 -26 24 11 -30 -43 3 32 8 -38 -19 24 13 -13 -23 17 39 11 -23 10 28
4483B8Rm5%K9J5j9l4J2L5Qm5j7L1K5k6m3QN0Jn2lL5J6k4k2ML4mk4j6L7K4j9m0
$$ 28 37 -8 -8 21 36 17 -17 -5 30 38 -7 -24 7 32 6 -37 -29 21 22 -30 -33 2 18 -6 -28 -24 10 6 -18 -34 3 27 8 -32
4517c2J6M4J5m6k2L5K9k5l6K6K5nj8k6K5M1k9l0qM8%n2nL8J9j9l5ML5Rm1j9L1
$$ -32 -16 28 43 -3 -25 10 39 14 -22 4 29 24 6 -20 5 46 17 -13 -21 27 27 -25 -30 8 27 8 -27 -23 12 21 -20 -39 -8
4550hK6j4k9LM0Qm4j8L0L4j9m9K7M4Pm3j0K9L7k1m1NK9J6n6j0M0K6k8l5OM3j0
$$ -8 18 4 -25 -22 18 26 -18 -36 -6 28 9 -40 -13 31 38 -5 -15 14 51 30 -11 -6 23 39 -17 -27 13 39 11 -24 -18 25 15
4583A5l2j8L4L4l8k1MM3pl0k3M6K9m1l0J9L3Ql6k4L5L8k6k7KM4jl6k0M4K0j7n0
$$ 15 -17 -35 -1 33 -5 -26 -22 21 14 -16 -39 7 36 -5 -35 -16 17 25 -11 -35 0 38 12 -15 -13 31 30 -6 -26 18 38 21 -29
4616b9K2L2pl4rK9K6k1l7QL1Ll2k7M0K3k0m0K2L9ll4j4L8K4k6l3K2L1Jl1mK6J7
$$ -29 -7 25 18 -16 -25 4 30 9 -28 -20 11 14 -18 -45 -5 18 -2 -42 -20 19 16 -18 -32 6 30 4 -29 -7 24 25 -6 -10 16 33
4650C3j3l8J1L5Jl3k3M0J8j5l5J3K6Pl8j8J3M0k1l3JM6Mm0k2K7L4k6l6K6K9kk7
$$ 33 20 -18 -7 28 29 -4 -27 13 31 16 -19 -6 20 27 -11 -29 -16 24 3 -30 -29 17 21 -19 -41 -14 20 -6 -42 -16 13 11 -16
4683a6mK5K4j7k6KL7Pk8j9K2K6nm0JL9lj5l2J7K7jm9RM2kl2k4K8K7j7k8rL4J8
$$ -16 -20 5 29 12 -14 -12 25 32 4 -15 7 33 28 -12 -11 28 25 10 -22 -5 22 21 -28 -19 23 21 -11 -35 -7 20 3 -25 -34 0 18
4718A8l5j6J4L3Lm2KL8J3k8l1L8K7om5LK7K1k7l0L4K5j4m4NL0J8m4j5K8K4pm3
$$ 18 -17 -33 -19 14 17 -25 -23 15 28 0 -31 7 34 28 -17 -14 13 34 7 -23 11 36 22 -22 -17 13 31 -13 -28 0 24 17 -26
4751b6NK8Rl0j9K1L0j9k2qL7J2k6k5K9L8k8l2RL6J1m2j5L0K8j2l8jM7Jl6mJ1L4
$$ -26 -21 7 16 -14 -33 -12 18 -1 -23 -31 6 18 -8 -33 -4 34 6 -26 -17 19 30 -12 -27 3 31 19 -19 -20 27 28 -8 -12 -1 33
4785C3k5k3MK9Qm0j7J2L6kl7j2M5jl3j1K7J9ml6ML6Ol2oK6J7Ll4pL2J7m1qJ4K5
$$ 33 8 -15 -11 18 26 -14 -31 -19 17 15 -22 -34 11 10 -23 -34 -7 12 8 -28 -24 12 18 -14 -20 6 23 26 -8 -15 17 34 -7 -15 -1 24
4821B4Nm4nL3Lk4j9J8K0Nl7LJ7J7k9qjL1km6J7J5J9k1j9J3J9Lk8NK8J5k5k2K2
$$ 24 29 -15 -20 13 16 -8 -27 -9 11 16 -21 -18 -1 16 -13 -21 -22 9 7 -39 -22 -7 12 -9 -28 -15 4 7 -21 -16 12 27 2 -20 2
4856BK9j3k6lL7jk0j7J5K4ll3JK2J0j6l7J7L4j0l6lL2Mk2j2KL2lk2j8M0J3j5k9
$$ 2 31 18 -8 -11 26 25 5 -12 3 27 24 -9 -8 14 24 8 -29 -12 22 12 -24 -27 5 9 -13 -25 -23 9 6 -16 -34 6 19 4 -25
4891b5J1M0%m9LM6Kk4k2L0J0ok3nK9Nj5k2J4J6lk2%J8J6k2k6J0K6lk8j4K7K8l2
$$ -25 -14 26 26 -23 -20 26 28 4 -18 12 22 16 -7 -12 17 22 7 -15 -1 15 12 -10 -10 8 24 2 -24 -14 12 9 -19 -33 -6 22 -10
4926a0j7RL1ml7QL2nj0k7L3J6j4k0LL2Qj7k3J0K8jl0nK3Qk9j8K2J9mk9j1K1K1
$$ -10 -27 -18 13 9 -28 -20 12 7 -3 -30 3 19 5 -15 -12 20 28 11 -12 -2 26 25 -5 -10 13 21 -8 -26 -4 15 11 -18 -29 -8 13
4961A3k0onK1J1k8k2L3J8k4j4LL2Nl3%K7Oj1j2J6J5Kl7kL2Mqk2LK8pj7oJ4J1j5
$$ 13 -7 -13 -18 3 14 -14 -36 -3 15 -9 -23 -20 12 17 -16 -16 11 17 6 -6 10 25 27 -10 -12 20 24 16 -6 -3 25 18 1 -5 9 20 5
4998Ej7OJ6Jj8j2K2J2j8j6RJ7Pj8j5J6K6j4j7NK7kk1nK3Rlk8KL2rj3j5K1J2k0
$$ 5 -12 -6 10 11 -7 -19 3 15 -3 -19 -10 7 14 -4 -19 -3 23 9 -8 -3 24 22 1 -4 19 28 25 -3 -1 31 22 9 -6 15 27 7
5034Gj1MK1Pl3j6K2K8k7k8J7K4nk7oK9J0j7j4JK3kk4nJ8L4j8l4K0K5%l6qL8J9
$$ 7 -4 0 21 28 -5 -21 1 29 2 -26 -9 15 10 -17 -23 6 16 -1 -15 -14 9 7 -17 -22 -4 30 12 -22 -2 23 23 -13 -21 17 36
5069C6k8j4PJ2J1j7j8J6K5j9l0J7K3ok8lJ4J6k5j0J4J6%k5j1K1J9ql4K4J6pk0
$$ 36 8 -6 1 13 24 7 -11 5 30 11 -19 -2 21 15 -13 -16 -2 14 -11 -21 -7 9 9 -16 -27 -6 13 5 -29 -5 11 4 -16
5102a6oL8J0k0j4K1J2Jj8j8K8Nj6j7OK6rj5j4K0Nrj1J3J1rqj2J2Mkk6RK9Kk4J
$$ -16 -22 16 26 6 -8 13 25 26 8 -10 18 23 7 -10 -4 22 13 -2 -16 4 9 0 -11 2 13 4 -4 -16 -4 0 -2 -28 -19 10 12 -12 -11
5139a1J0Rqj6J3J8kj4LJ0J4ok4J1J8kk7MJ8Jj7j0RJ1j2MrkQpokJ8%j3j0J1K1j1
$$ -11 -1 8 0 -16 -3 15 13 -1 2 12 26 20 -4 7 25 23 -4 0 18 19 2 -8 1 12 0 4 -5 -7 1 -6 -12 -14 4 4 -9 -19 -8 13 2
5178Bj3lJ3K0l5OPJ9j1j6nL1Lj4kJK9j8j2%K4Nk0j2%K3lk1pK5Nj9k7K2J3Km0J2
$$ 2 -11 -14 -1 19 -16 -10 -3 16 5 -11 -16 15 18 4 2 3 32 14 2 2 26 31 11 -1 -1 22 19 -2 -9 16 21 2 -25 -3 10 12 -28 -16
5216a6K4Lk2oJ5J3mj1j3L0J4k5j6J3K6j3n%K5oj3j5J6Nnj1KjJ3j1j3QJ9j1l0O
$$ -16 8 11 -11 -17 -2 11 7 -4 -17 13 27 2 -14 -1 25 12 7 7 32 26 13 -2 14 19 14 3 5 4 17 6 -7 1 20 9 -21 -15
5252a5K4Kk4mRJ8mj6oK9qj4rK8J7j4k9J5K5nk2ORJ9qk9LL0j2j6nJ4Rj1j0MJ1L
$$ -15 9 11 -13 -17 -8 10 6 -10 -16 13 5 -9 -18 10 27 13 -16 -1 24 19 -3 3 12 31 23 -6 -3 27 15 -1 -6 8 17 6 -4 0 11 14
5290A4k7J2NLrj3lJ5J4j2j6QJ5Lk3NK4mk2JJ5J1rqOOOjr%K4j2j3nJ4Pj5pPlJq
$$ 14 -13 -1 4 7 -2 -15 -18 -3 11 -1 -17 -9 6 9 -14 -9 15 11 -11 -10 5 16 7 -1 5 11 17 16 7 7 31 19 6 1 15 22 7 0 7 4 5 -3
5332cnJ3Pqj5OMMj4%J3Kmj4J9JmnoJ6Qlj3KJ4Qj6oK0J3k7nJ5jnj0KJ9pj2j5K1
$$ -3 -8 5 12 4 -11 -5 -1 3 -11 -11 2 4 0 -14 5 6 2 -3 -9 7 15 12 -1 1 15 23 7 1 21 34 7 2 17 16 11 1 3 22 15 3 -12 9
5374IrJ9l0%J1J2j9j4LL8j3j8KJ7LnpOOlpnJ5Nlj8J5J4nk1kL5j7Lk1J3J6j4kj7
$$ 9 0 19 -11 -11 0 12 -7 -21 -18 20 7 -11 -9 8 11 6 -1 5 11 8 1 -4 11 16 13 -5 10 24 19 -2 -4 31 14 17 -4 9 25 11 9 -8
5414hQJ7j9pJ4Jmj3jJ0J0j7j0J4J3jrkK1Jk3qK2J3nj9J0J1Mj6NNLoj0KQRk3pK
$$ -8 0 17 -2 -9 5 6 2 -11 -12 -2 8 -9 -19 -5 8 7 -2 -4 17 18 -5 -13 9 22 17 -2 8 19 23 7 12 17 20 14 4 6 14 23 0 -7 -5
5455eJ9ll3J2QJ1j4j2J1O%k0J1JPljpJ9p%pJ8jJqrK8j2KoJ2j0MqoOL%j1K3rmk2
$$ -5 14 11 -22 -10 -2 9 -5 -17 -6 0 0 -20 -9 -8 -1 -4 -5 -12 7 0 0 -7 11 10 11 3 -6 22 10 12 6 18 8 12 4 -2 4 7 7 -4 19 10 6 -16
5499a6K0MnopoJ8nj1J9j5J3j4jJ3JjjKQJj2J4nJ3j5jqK2Oj6j0OJ5j2pL%Pok1K0
$$ -16 4 8 3 -3 -10 -16 2 -3 -14 5 -10 3 -11 -12 1 2 1 0 2 10 11 -1 13 8 21 6 5 -3 19 25 9 -1 5 20 8 1 4 4 11 5 -16 4
5541D%jk1OJ4Pk4lK0J4k1j5J4J3%k0MJ3J4qoPKJ2k0j0K3Jj0rJ0J6j0j3KJ6j0%
$$ 4 4 3 -18 -12 2 9 -15 -18 2 16 -5 -20 -6 7 7 -13 -9 4 18 10 4 11 13 25 5 -5 18 19 9 0 10 26 16 3 5 21 11 11
5579A1k3J2J8qj3rK0Pj9rJ2Orj6J3NNj1%J0P%j7J2J1Pk0pQJ7oj6RQMrmjQnj8J6
$$ 11 -12 0 18 10 -3 -12 8 15 -4 -13 -1 5 -4 -20 -7 -2 3 -8 -8 2 9 9 -8 4 15 22 2 -5 3 20 14 -2 7 15 19 10 6 5 13 8 -10 6
5621FLkpoJJ3j1npQQnkJjJRrJ7nopJ0J0rOnJ0kj8J1J%MKj1OKnnj1K2j0nj0J0L
$$ 6 9 7 0 -6 -5 8 -3 -8 -15 -7 1 -4 -6 -5 -6 -5 4 -5 12 7 1 -6 4 14 5 11 6 16 14 -4 7 8 8 12 14 3 9 11 6 1 -10 12 2 -3 -13 -3 0
5668@%j7ROqLp%J0LrMJNkrK8j1lnJ9j0J5k4OMJ3rm%PPk5qJ9OqllMPpj4J1Nnk4
$$ 0 0 -17 -8 -2 -10 -7 -14 -14 -4 -1 -10 -6 -5 0 -2 -11 17 6 3 -2 17 7 22 -2 4 8 21 12 8 8 15 22 -3 -11 8 14 6 3 0 4 11 4 -10 1 6 1 -23
5715b3LK3Qk6kK5lLj8J7jNnmKJ2j1j0MJ4Pk0mK2kpj8K2J1pj5LKMj2j9J2Okj1R
$$ -23 -20 3 11 -15 -17 8 5 8 -10 7 6 11 6 2 4 16 5 -5 -1 13 20 0 -4 18 16 9 -9 13 24 17 2 5 7 11 -1 -20 -8 -2 -4 -15 -6
5756fMPj2%KJ9k0kJ9pKnKQQMj7nJ5J3k3j1J6Rn%j0K4lj3j1JJ1pMj4mJ4qj4J4L
$$ -6 -2 5 -7 -7 -5 14 -6 -8 11 4 6 1 3 11 19 23 6 1 16 29 6 -5 11 20 15 15 5 29 26 13 2 3 14 7 11 -3 -7 7 -1 -15 -1 2
5798BnoLJ0ojlJKLNkjJ1MJj1QlmjkOPRj8%Qkk%mJrlMNk4K2j4MQnJrJ8mqrK1qj
$$ 2 -3 -9 -6 4 -2 -3 -6 -5 -3 0 5 3 2 13 17 18 7 15 12 8 7 5 11 18 27 9 9 17 15 13 13 9 10 1 -2 2 7 -17 5 -9 -5 3 -2 -1 -10 8 4 -4 -13 8 0 -1
5850aKJ6mj4J4j1J5Mj4kNJ0pJj2J0Lj3OJ4j1j4NO%nlj7J4NJj6J0J1Jj8qK3Kor
$$ -1 1 17 13 -1 13 2 17 21 7 5 10 20 13 14 2 12 15 2 8 22 11 -3 2 8 8 3 0 -17 -3 2 3 -13 -3 8 9 -9 -17 6 8 2 -7
5891gJ0OjnLJJ1nrJ0mOj6%J8lj1%RLj4OKjpRn%jmj4NJ5jj6%J0KoMlJ5poQj2K5
$$ -7 3 9 8 3 6 7 18 13 4 14 10 16 0 0 18 15 4 4 13 16 2 8 10 9 2 11 6 6 5 1 -13 -8 7 6 -10 -10 0 2 -4 0 -3 12 5 -1 7 -5 20
5938B0orNJ%J%J7pj3kljMJJ1j5Rj5oN%jKqK1j9%mOKRpoPlJ0J2j8LMkKMMrJ1lm
$$ 20 14 5 10 11 11 12 12 29 22 9 7 4 3 7 8 19 4 13 -2 -8 -3 -3 -4 -2 -10 11 -8 -8 -12 -6 -4 5 -2 -8 -1 -4 6 18 0 3 7 5 7 11 15 6 17 14 10
5987A0J0mlrJ0qllRRok0LJ8j1mqJ4pKm%QoLj2J6Nmj3%J1Nj2J8lmJ0KjoK%l%J0
$$ 10 20 16 13 4 14 6 3 0 9 18 12 -8 -5 13 2 -2 -10 4 -3 -1 -5 -5 3 -3 0 -12 4 9 5 -8 -8 3 8 -4 14 11 7 17 19 18 12 14 14 11 11 21
6033B1oj2kJ1Pj3j0RKnrJ7j3J1pj5J0J0lj0J3Oj0j2KJ6jjpJ3jQj9KJ0MklQjQk6
$$ 21 15 3 1 12 19 6 -4 5 7 2 -7 10 -3 8 1 -14 -4 6 3 -7 6 12 2 -10 -8 8 7 6 -1 12 11 19 0 2 12 16 14 11 19 18 26 0
6075@PJ2nj4RoJ0j8kKNj0lJ0K%ojlJ3Oj2%J5kj7PJ5okJMPJKj6PMKJkkprJ4Kj7
$$ 0 7 19 14 0 9 3 13 -5 -7 -5 0 -10 -13 -3 -1 -1 -7 -8 -11 2 8 -4 -4 11 9 -8 -1 14 8 6 7 11 18 19 21 5 12 16 18 19 17 15 8 -1 13 15 -2
6122bOjoq%OlrJ2Oj0mJ0Mj6J0Pj0J2%jlPNJ1o%rJJ2Oj2Prjm%MjpOPk0lQJ6j5p
$$ -2 4 3 -3 -11 -11 -5 -8 -17 -5 1 -9 -13 -3 1 -15 -5 2 -8 4 4 3 0 7 12 23 17 17 8 9 21 27 15 22 13 12 8 8 12 11 4 10 17 -3 -6 2 18 3 -4
6170d%nJ2Lj0LjJ0kj3J7Opj6QOLj4J0J8j3oNLKLj5J0mJ7j0qNO%nj5J9k0k1J6K
$$ -4 -4 -9 3 6 -4 -1 -2 8 6 -7 10 16 9 -7 1 7 10 -4 6 24 11 5 10 13 15 18 3 13 9 26 16 8 13 19 19 14 -1 18 -2 -23 -7 -5
6212elpJ5j6PJ4j0rJ1J2orKK4j3Lj1J1mJMLlMk2J4J2njj9J7Mj8j0J5MpljKlll
$$ -5 -8 -15 0 -16 -9 5 -5 -14 -3 9 3 -6 -4 20 7 10 -1 10 6 7 11 14 11 15 -7 7 19 14 13 -6 11 15 -3 -13 2 6 -1 -4 -5 -3 -6 -9 -12
6255a2J3qKmPJ8j6r%J6JqlRmNjPoJ1j1%QK%j2%PRj4mP%k2J3mJ1j3Jj3RNJmmQK
$$ -12 1 -7 -5 -9 -2 16 0 -9 -9 7 8 0 -3 6 2 7 6 13 7 18 7 7 15 17 17 5 5 12 21 7 3 10 10 -12 1 -3 8 -5 -4 -17 -8 -3 -2 -6 -10 -2 0
6302@j0%J6jj1oJ1NoNJ5j0oQM%j2NMJ0j7Pj2OLllKJpMNjj3JjLjJnKKlkMMJ6k6
$$ 0 -10 -10 6 5 -6 -12 -1 4 -2 3 18 8 2 10 14 14 2 7 11 21 4 11 -1 5 8 5 2 4 5 -2 2 7 6 -7 -6 -7 -4 -5 -4 -9 -7 -5 -8 -10 -6 -2 14 -12
6350a2QPJ0nj1J0J1rnQQnqpJ0KNk0NJ2prlQjq%NnKkKrK0lj7KJ9qpLKJ1j0j0K7
$$ -12 -4 3 13 8 -3 7 18 9 4 12 20 15 7 0 10 12 17 -3 2 14 7 -2 -5 3 2 -6 -6 -1 -6 -4 -6 -4 -13 7 4 -13 -11 8 0 -7 -4 -2 9 -1 -11 16
6396A6j2PoJ1LJlj1KOQLk3J3Kqj0QJ1j5rJ3%mnqNKrjJ1pMNrRjkLJ0Nk0K1Lnlk
$$ 16 4 11 5 16 19 20 17 6 8 14 22 25 2 15 17 9 -1 7 18 3 -6 7 7 3 -2 -10 -5 -3 -12 -13 -2 -9 -5 0 -9 0 -1 -3 0 10 15 -5 16 19 14 11 9
6443IrJ3LNj5KNnnnJ0Pj2j1PJ%%Mj7RknPPpNrJ3%rMJ5j8J1JOnJ0kmLrmLNlrJ1
$$ 9 0 13 16 21 6 8 13 8 3 -2 8 15 3 -8 -1 0 0 0 4 -13 -4 -6 -11 -4 3 -4 1 -8 5 5 -4 0 15 -3 8 9 15 10 20 18 14 17 8 4 7 12 9 0 11
6492A1%Olj0kJ9orKoNnmJKk1K8%rJn%KJ2j3NOJNpJ2joqRQrOpQLj0Oj0J0J1j7q
$$ 11 11 17 14 4 2 21 15 6 8 2 7 2 -2 -1 1 -20 8 8 -1 0 -5 -5 -3 9 -4 1 7 8 13 6 18 17 11 3 12 20 11 17 10 18 21 11 17 7 17 28 11 3
6540CMLpJQj2mrJ9lMj2ONkjmNJ0Qj5NLKj0PQPprkOQpj4J0jLj2RKKj3JLLrmPjj0
$$ 3 7 10 3 4 12 0 -4 -13 6 3 7 -5 1 6 4 3 -1 4 14 22 7 12 15 17 7 14 22 29 22 13 11 17 25 18 4 14 13 16 4 13 15 17 4 5 8 11 2 -2 5 4 -6
6591flJ9j0kNjKJQlJKOrRmMOj1J3rrQj0NlQllLJllojKLkpNj3J0mRMj0%pJ4nJ4
$$ -6 -9 10 0 -2 3 2 4 5 13 10 11 13 19 10 19 15 19 25 14 27 18 9 17 7 12 9 17 14 11 14 15 12 9 3 2 4 7 5 -2 3 -10 0 -4 5 9 -1 -1 -8 6 1 15
6642A5jj3%J7%qNNLnKQj3OlJ0j6LJ0j7qJ6j1pJ6Jj9OrJ1KoJkLlMJ0rnOkNKLj0
$$ 15 14 1 1 18 18 10 15 20 23 18 20 28 15 21 18 28 12 15 25 8 0 16 5 -2 14 15 -4 2 -7 4 6 0 1 -1 2 -1 3 13 4 -1 5 3 8 10 13 3
6688COMOqPnLkpLJ4j1oJ3r%KopJJmLJJoJ1k%j1MOj3QkKJQl%LMlj4J5JmPmJ2oK
$$ 3 9 13 19 11 18 13 16 14 7 10 24 13 7 20 11 11 13 7 0 1 2 -2 1 2 3 -3 8 6 6 -5 -1 5 -8 0 -2 0 1 9 6 6 9 13 10 -4 11 12 8 15 11 23 17 19
6740A9j4%J7j3rOPmkj8J3NqpJ3mj0l%ONKJqLJ3oj4J9mLrMMQooLLJKqRkKpjOlj4
$$ 19 5 5 22 9 0 6 13 9 7 -11 2 7 -1 -8 5 1 -9 -12 -12 -6 -1 1 2 -6 -3 10 4 -10 9 5 8 -1 3 7 15 9 3 6 9 10 12 4 13 11 13 6 5 11 8 -6
6790fJ6kj4ONqjnO%J2j7MJ7k0J0KjmJ8jmoQmOmPqmKJ0j9QOomkQj1NJp%mJ1j4J1
$$ -6 10 8 -6 0 5 -3 -4 -9 -3 -3 9 -8 -4 13 -7 3 5 4 0 18 17 13 7 15 11 17 13 20 12 8 10 20 1 9 15 9 5 3 11 0 5 6 -1 -1 -5 6 -8 3
6838CQj3j8K4MJ0j0j2N%KNpJ9rj0J1qK1Mk7MJ5rj5K0J1k0ONplJJj6MO%pJQrj0
$$ 3 11 -2 -20 4 8 18 8 -4 1 1 3 8 1 20 11 1 12 4 25 29 2 6 21 12 -3 17 28 8 14 19 12 9 10 11 -5 -1 5 5 -2 -1 7 -2 -12
6881a2PK0k4lPLPOmKJQj5KLRroMPjrRkKqKJ5j1j5jJ0OpMjqJ1j0pKJ3j0nJ1klm
$$ -12 -5 15 -9 -12 -5 -2 5 11 7 9 10 18 3 5 8 17 8 2 6 13 12 3 12 10 12 4 6 21 10 -5 -6 4 10 3 7 6 -2 9 -1 -8 -6 7 -3 -8 3 1 -2 -6
6929fmJ6mkOljOoLRMmjMJj1jJ5oOj1%pMjPnmQj0lMknOjJ0j0Rj%j8OJ0NmlJ3j6
$$ -6 -10 6 2 0 6 3 2 8 2 5 14 18 14 13 17 18 7 6 21 15 21 10 10 3 7 6 13 8 4 12 2 -1 3 1 -4 2 1 11 1 10 9 9 -9 -3 7 12 8 5 18 2
6979BJ4%oJ1Pj1ljMjkKKmplQnJnjOj0J3j3lJ4nj3OLlnJ1mPpNnPLkQpNkOnPonJ1
$$ 2 16 16 10 21 28 17 14 13 17 16 14 16 18 14 7 4 12 7 8 3 2 8 -2 11 -2 -5 9 4 -9 -3 0 -3 -8 3 -1 6 -1 4 -1 6 9 7 15 8 13 11 17 12 19 13 8 19
7031A9mJljNj0jMMjnnkKPmk2J1J0JpPj0%jK1j0jMKJ0rKnJO%pJJ0jolQJj2jKLO
$$ 19 15 16 13 12 17 7 6 10 14 13 8 3 1 3 10 6 -16 -5 5 6 -1 6 -4 -4 -5 16 6 5 9 11 21 12 14 9 10 16 16 9 10 20 19 13 10 18 19 7 6 8 11 17
7081A7nrlJ3rrJkJ3j4%J3pLmkQoJ0M%kPnqMRj3%J2Qmj3J4pNoJkmNrNNnJ1k2J2
$$ 17 12 3 0 13 4 -5 -4 -6 7 -7 -7 6 -1 2 -2 -4 4 -2 8 12 12 10 17 12 4 8 17 4 4 16 24 20 7 21 14 19 13 14 12 8 13 4 9 14 9 20 -2 10
7129A0j1JjNkj3J5kjjLOnKR%pNQj4mJ1NlPpPnKJ3j7jJ7k3QoNj3OKkpmK0j6%LJ
$$ 10 -1 0 -1 4 2 -11 4 2 1 0 3 9 4 6 15 15 8 13 21 7 3 14 19 16 23 16 23 18 20 33 16 15 32 9 17 11 16 3 9 11 9 2 -2 18 2 2 5 6
7177FnjNLoNj7J6Nj0mJ6jjlJ2oMnrJ5Koj2PnKk%Nj1k%J2%Mj8NJ0ppjQOlO%kor
$$ 6 1 0 5 8 2 7 -10 6 11 1 -3 13 12 11 8 20 14 18 13 4 19 21 15 3 10 5 7 5 5 10 -1 -3 -3 9 9 13 -5 0 10 3 -4 -5 3 9 6 12 12 10 4 -5
7227eMJ1MKp%J4LoqK1mk2pK6lj2LmmQpKLmMj2mQjolJJ0KpkJ4r%jNJ0o%LJ5noK
$$ -5 -1 10 14 16 9 9 23 26 20 12 33 29 7 0 26 23 11 14 10 6 14 7 9 12 8 12 0 -4 4 3 -3 -6 -5 5 7 0 -2 12 3 3 2 7 17 11 11 14 29 24 18 20
7277B0Kmjj3OJ3j4jPj0jPJ6k1Qj9J0qQ%oNjnrJ4nQj2J4kONj1J5j6J3j0%RJ4j3
$$ 20 22 18 17 4 10 23 9 8 15 5 4 11 27 6 14 -5 5 -3 5 5 -1 4 3 -2 -11 3 -2 6 -6 8 6 12 17 6 21 5 18 8 8 17 31 18
7319A8mLKKJj3J4j6oJ1KqjjO%j8J3pMMqMOnmJNNojk%%LOj3J7lPnrJ1qjRJOnmL
$$ 18 14 17 19 21 22 9 23 7 1 12 14 6 5 4 10 10 -8 5 -2 2 6 -2 2 8 3 -1 0 5 10 4 3 1 1 1 4 10 -3 14 11 18 13 4 15 7 6 15 16 22 17 13 16
7370A6lpKlllRnLlrRk%j0kRJNnQmlmP%PLMj2OPmQj1Lj1LJ0%mJ%Kj3OnJ1rJloJ2
$$ 16 13 6 8 5 2 -1 8 3 6 3 -6 3 1 1 -9 -11 -2 -1 4 -1 7 3 0 -4 3 3 10 13 17 5 11 18 14 22 11 14 3 6 16 16 12 13 13 15 2 8 3 14 5 6 3 -3 9
$$ [...]
8191E
##END NTUPLES=NMR FID
##END=
