##TITLE=1H_LY-DMAA.Per.2.21
 CDCL3
 8 sc, 
 11.04.2022
##JCAMPDX= 6.0         $$ Bruker NMR JCAMP-DX V2.0
##DATA TYPE= NMR FID
##DATA CLASS= NTUPLES
##ORIGIN= UXNMR, Bruker Analytische Messtechnik GmbH
##OWNER= root
$$ XWIN-NMR		Version 3.5
$$ Mon Apr 11 15:15:04 2022 Russian Standard Time (UT+4h)  she@DPX200
##.OBSERVE FREQUENCY= 200.13135
##.OBSERVE NUCLEUS= ^1H
##.DELAY= (6, 6)
##.ACQUISITION MODE= SIMULTANEOUS
##.ACQUISITION SCHEME= undefined
##.AVERAGES= 8
##.DIGITISER RES= 18
##SPECTROMETER/DATA SYSTEM= spect
##.PULSE SEQUENCE= zg30
##.SOLVENT NAME= CDCl3
##.SHIFT REFERENCE= (INTERNAL, CDCl3, 0, 15.7039)
##AUDIT TRAIL= $$ (NUMBER, WHEN, WHO, WHERE, WHAT)
$$ ##TITLE= Audit trail, XWIN-NMR		Version 3.5
$$ ##JCAMPDX= 5.01
$$ ##ORIGIN= Bruker BioSpin GmbH
$$ ##OWNER= she
$$ F:/spectra/data/she/nmr/H-F/1/audita.txt
$$ ##AUDIT TRAIL=  $$ (NUMBER, WHEN, WHO, WHERE, WHAT)
(   1,<2022-04-11 15:14:10.76 +0400>,<she>,<DPX200>,
      <created by zg, POWCHK disabled, PULCHK disabled
       configuration hash MD5:
       00 E9 B6 7A A2 85 ED C7 34 08 36 98 17 FE 4E 26
       data hash MD5: 16K
       CE 95 0F D3 EA 51 C9 19 3F 6B 9C 44 97 30 7F E0>)
$$ ##END=
$$ 
$$ hash MD5
$$ F6 E4 15 58 4E 60 E2 1D C2 82 6B A3 74 67 D0 63
##$RELAX= 
##$RELAX= 
##$RELAX= 
##$RELAX= 
##$RELAX= 
##$RELAX= 
$$ Bruker specific parameters
$$ --------------------------
##$DU= <F:/spectra>
##$EXPNO= 1
##$NAME= <H-F>
##$PROCNO= 1
##$TYPE= <nmr>
##$USER= <she>
##$AMP= (0..31)
100 100 100 100 100 100 100 100 100 100 100 100 100 100 100 100 100 100 
100 100 100 100 100 100 100 100 100 100 100 100 100 100 
##$AQSEQ= 0
##$AQ_mod= 1
##$AUNM= <au_zg>
##$AUTOPOS= <>
##$BF1= 200.13
##$BF2= 200.13
##$BF3= 200.13
##$BF4= 200.13
##$BF5= 200.13
##$BF6= 200.13
##$BF7= 200.13
##$BF8= 200.13
##$BYTORDA= 1
##$CFDGTYP= 0
##$CFRGTYP= 5
##$CHEMSTR= <none>
##$CNST= (0..31)
1 1 145 1 1 1 1 1 1 1 1 1 1 1 1 1 1 1 1 1 1 1 1 1 1 1 1 1 1 1 1 1 
##$CPDPRG= <>
##$CPDPRG1= <>
##$CPDPRG2= <>
##$CPDPRG3= <>
##$CPDPRG4= <mlev>
##$CPDPRG5= <mlev>
##$CPDPRG6= <mlev>
##$CPDPRG7= <mlev>
##$CPDPRG8= <mlev>
##$CPDPRGB= <>
##$CPDPRGT= <>
##$D= (0..31)
0 1.2 0 0 0 0 0 0 0 0.06 0 0.03 0 0 0 0 0.0002 0 0 0 0 0 0 0 0 0 0 0 0 
0 0 0 
##$DATE= 1649675650
##$DBL= (0..7)
120 120 120 120 120 120 120 120 
##$DBP= (0..7)
150 150 150 150 150 150 150 150 
##$DBP07= 0
##$DBPNAM0= <>
##$DBPNAM1= <>
##$DBPNAM2= <>
##$DBPNAM3= <>
##$DBPNAM4= <>
##$DBPNAM5= <>
##$DBPNAM6= <>
##$DBPNAM7= <>
##$DBPOAL= (0..7)
0.5 0.5 0.5 0.5 0.5 0.5 0.5 0.5 
##$DBPOFFS= (0..7)
0 0 0 0 0 0 0 0 
##$DE= 6
##$DECBNUC= <off>
##$DECIM= 32
##$DECNUC= <off>
##$DECSTAT= 4
##$DIGMOD= 1
##$DIGTYP= 9
##$DL= (0..7)
0 120 120 120 120 120 120 120 
##$DP= (0..7)
150 150 150 150 150 150 150 150 
##$DP07= 0
##$DPNAME0= <>
##$DPNAME1= <>
##$DPNAME2= <>
##$DPNAME3= <>
##$DPNAME4= <>
##$DPNAME5= <>
##$DPNAME6= <>
##$DPNAME7= <>
##$DPOAL= (0..7)
0.5 0.5 0.5 0.5 0.5 0.5 0.5 0.5 
##$DPOFFS= (0..7)
0 0 0 0 0 0 0 0 
##$DQDMODE= 0
##$DR= 18
##$DS= 0
##$DSLIST= <SSSSSSSSSSSSSSS>
$$ [...]
##$SUBNAM2= <"">
##$SUBNAM3= <"">
##$SUBNAM4= <"">
##$SUBNAM5= <"">
##$SUBNAM6= <"">
##$SUBNAM7= <"">
##$SUBNAM8= <"">
##$SUBNAM9= <"">
##$SW= 18.05172834244
##$SWIBOX= (0..15)
0 0 2 0 0 0 0 0 0 0 0 0 0 0 0 0 
##$SW_h= 3612.71676300578
##$TD= 16384
##$TD0= 1
##$TE= 0
##$TE2= 300
##$TE3= 300
##$TEG= 300
##$TL= (0..7)
0 120 120 120 120 120 120 120 
##$TP= (0..7)
150 150 150 150 150 150 150 150 
##$TP07= 0
##$TPNAME0= <>
##$TPNAME1= <>
##$TPNAME2= <>
##$TPNAME3= <>
##$TPNAME4= <>
##$TPNAME5= <>
##$TPNAME6= <>
##$TPNAME7= <>
##$TPOAL= (0..7)
0.5 0.5 0.5 0.5 0.5 0.5 0.5 0.5 
##$TPOFFS= (0..7)
0 0 0 0 0 0 0 0 
##$TUNHIN= 0
##$TUNHOUT= 0
##$TUNXOUT= 0
##$USERA1= <user>
##$USERA2= <user>
##$USERA3= <user>
##$USERA4= <user>
##$USERA5= <user>
##$V9= 5
##$VALIST= <valist>
##$VCLIST= <CCCCCCCCCCCCCCC>
##$VD= 0
##$VDLIST= <DDDDDDDDDDDDDDD>
##$VPLIST= <PPPPPPPPPPPPPPP>
##$VTLIST= <TTTTTTTTTTTTTTT>
##$WBST= 1024
##$WBSW= 4
##$XGAIN= (0..3)
0 0 0 0 
##$XL= 0
##$YL= 0
##$YMAX_a= 279078
##$YMIN_a= -286518
##$ZGOPTNS= <>
##$ZL1= 120
##$ZL2= 120
##$ZL3= 120
##$ZL4= 120
##$ABSF1= 10
##$ABSF2= 0
##$ABSG= 5
##$ABSL= 3
##$ALPHA= 0
##$AQORDER= 0
##$ASSFAC= 0
##$ASSFACI= 0
##$ASSFACX= 0
##$ASSWID= 0
##$AUNMP= <proc_1d>
##$AZFE= 0.1
##$AZFW= 0.1
##$BCFW= 1
##$BC_mod= 2
##$BYTORDP= 1
##$COROFFS= 0
##$CY= 11.3945322036743
##$DATMOD= 1
##$DC= 2
##$DFILT= <>
##$DTYPP= 0
##$F1P= 2.36226072786647
##$F2P= -0.459571619588291
##$FCOR= 0.5
##$FTSIZE= 0
##$FT_mod= 4
##$GAMMA= 1
##$GB= 0.15
##$INTBC= 1
##$INTSCL= 1
##$ISEN= 128
##$LB= 0.24
##$LEV0= 0
##$LPBIN= 0
##$MAXI= 10000
##$MC2= 0
##$MEAN= 0
##$ME_mod= 0
##$MI= 1.114404
##$NCOEF= 0
##$NC_proc= 0
##$NLEV= 6
##$NOISF1= 3.799351
##$NOISF2= 2.8
##$NSP= 1
##$NTH_PI= 0
##$NZP= 0
##$OFFSET= 15.70392
##$PC= 1
##$PHC0= -18302.74
##$PHC1= 13.40078
##$PH_mod= 1
##$PKNL= yes
##$PPARMOD= 0
##$PSCAL= 0
##$PSIGN= 0
##$REVERSE= no
##$SF= 200.130013532006
##$SI= 16384
##$SIGF1= 3
##$SIGF2= 2
##$SINO= 400
##$SIOLD= 16384
##$SREGLST= <1H.CDCl3>
##$SSB= 0
##$STSI= 0
##$STSR= 0
##$SW_p= 3612.71676300578
##$SYMM= 0
##$S_DEV= 0
##$TDeff= 0
##$TDoff= 0
##$TI= <>
##$TILT= no
##$TM1= 0
##$TM2= 0
##$TOPLEV= 0
##$USERP1= <user>
##$USERP2= <user>
##$USERP3= <user>
##$USERP4= <user>
##$USERP5= <user>
##$WDW= 1
##$XDIM= 8192
##$YMAX_p= 0
##$YMIN_p= 0
$$ End of Bruker specific parameters
$$ ---------------------------------
##NTUPLES= NMR FID
##VAR_NAME=  TIME,          FID/REAL,        FID/IMAG
##SYMBOL=    X,             R,               I
##VAR_TYPE=  INDEPENDENT,   DEPENDENT,       DEPENDENT
##VAR_FORM=  AFFN,          ASDF,            ASDF
##VAR_DIM=   8192,          8192,            8192
##UNITS=     SECONDS,       ARBITRARY UNITS, ARBITRARY UNITS
##FACTOR=    0.0002768,     1,               1
##FIRST=     0,             0,               0
##LAST=      2.2672688,     0,               0
##MIN=       0,             -286518,         0
##MAX=       2.2672688,     279078,          0
$$ Real data points
##PAGE= N=1
##DATA TABLE= (X++(R..R)), XYDATA
0@%%%%%%%%%%%%%%nJ3j6J6j6J6k4L2l2M0m8N3o1P2q5R3j04J20j36J52j73J96k20
$$ 0 0 0 0 0 0 0 0 0 0 0 0 0 0 0 -5 8 -8 8 -8 8 -16 16 -16 24 -24 29 -32 40 -45 48 -56 64 -72 80 -93 103 -117
37a17K47k74L04l40L77m17M62n08N64o25O87p55Q30r15J009j112J228j360J507
$$ -117 130 -144 160 -180 197 -220 242 -266 298 -327 360 -395 435 -480 529 -583 645 -715 792
56G92j674J870k098K366k692L099l618M306n264O686r013J3454k4747J03234J92377
$$ 792 -882 988 -1110 1256 -1436 1663 -1955 2351 -2913 3773 -5240 8214 -16533 86701 279078
71B79078l37942j95052K67345J98594j90561j64697Q4217J25753J6858o5797j21244
$$ 279078 -58864 -253916 13429 212023 21462 -143235 -59018 66735 83593 17796 -103448
82a03448O673K04335N8733k68786j12509K99496J56598l02276j78493K73271J82562
$$ -103448 -96775 107560 166293 -102493 -215002 84494 241092 -61184 -239677 33594 216156
93B16156k22369j64703J51485J31999p1263q4892j3262L0703R1102K6527j56512
$$ 216156 -6213 -170916 -19431 112568 41305 -43587 -56849 -26146 64956 91483 -65029
104f5029p8654K02104J20213k26890j45660K29144J53636k11297j43800J75298
$$ -65029 -143683 58421 178634 -48256 -193916 35228 188864 -22433 -166233 9065
114I065J18327j25692p9802O7885L3274q348J5800m6645o0726R2901R6120j27392
$$ 9065 127392 1700 -78102 -10217 23057 14709 30509 -16136 -76862 16039 112159 -15233
126a5233j17636J48714J23770j56362j14528J50746R1406j33648n7587J07646
$$ -15233 -132869 15845 139615 -16747 -131275 19471 110877 -22771 -80358 27288
136B7288J7445p6516K3307M3091n9308j0195Q5919k0757j00336M8132J01292p0518
$$ 27288 44733 -31783 -8476 34615 -24693 -34888 51031 30274 -70062 -21930 79362 8844
148H844q9100Q7148O5440r7413l3122J01891l406j00711L9293R4419o9533q2679
$$ 8844 -80256 6892 72332 -25081 -58203 43688 40282 -60429 -21136 73283 3750 -78929
160g8929R0349O5884r9351m4567R5419J9713p9128P338N1973l5443j7560O2830
$$ -78929 11420 77304 -22047 -66614 28805 48518 -30610 -23272 28701 -6742 -24302 38528
172C8528k0008q7720N5610J07500q4762j19890J03776J23098j10350j15938J03625
$$ 38528 18520 -69200 -13590 93910 9148 -110742 -6966 116132 5782 -110156 -6531
183f531R8743q4093p2021N4080L7559j6863K093k2681m3481O0049Q2728r0725
$$ -6531 92212 8119 -63902 -9822 27737 10874 12967 -9714 -53195 6854 89582 -1143
195a143j15823J11225J39259j19306j50730J13851J48457r5533j32341O6000J03012
$$ -1143 -116966 -5741 133518 14212 -136518 -22667 125790 30257 -102084 -36084 66928
206F6928k8794o2960j1839J5642N1201L4537q5206q2391J10114J23609j23204
$$ 66928 38134 -24826 -36665 -21023 30178 64715 -20491 -102882 7232 130841 7637
217G637j53562J23089J69273j09594j68476Q4499J50868n0606j17793J1844P2437
$$ 7637 -145925 -22836 146437 36843 -131633 -47134 103734 53128 -64665 -52821 19616
228A9616K7595j9620o3551l5444R2299Q7022j11248j29913J18334J59401j13327
$$ 19616 47211 27591 -35960 -71404 20895 107917 -3331 -133244 -14910 144491 31164
239C1164j72641R7091J68145p1787j46643M0389J10601o127o3949k7179J1676
$$ 31164 -141477 -44386 123759 51972 -94671 -54282 56319 50192 -13757 -40936 -29260
250b9260N6628M0949p9226q8388R3126J26121r7311j50255R1968J58660p8307
$$ -29260 27368 68317 -10909 -99297 -6171 119950 22639 -127616 -35648 123012 44705
261D4705j50845N8033J27884l3671r2567P683M8602J7168r06l8736m5680N5241
$$ 44705 -106140 -48107 79777 46106 -46461 -38778 9824 26992 26086 -12650 -58330 -3089
273c089Q6084o5743j16181O9877J33237o8014j35731O1095J24045n0131r9746
$$ -3089 82995 17252 -98929 -29052 104185 36171 -99560 -38465 85580 35449 -64297
284f4297L6705O6087k2078k6854P551j3178O008M9702j8100p8946K8195R8001
$$ -64297 -27592 38495 16417 -10437 -2886 -16064 -10056 39646 21546 -57400 -29205 68796
296F8796l6288j05545M2221J01176m6012q6464M7708O3330m7240l5035M4489N103
$$ 68796 32508 -73037 -30816 70360 24348 -62116 -14408 48922 1682 -33353 11136 16239
308A6239l9370K3129L1796m6511k1625O2934R161p0870N166P0319k0549o1752
$$ 16239 -23131 -2 31794 -14717 -36342 26592 35753 -35117 -29951 40368 19819 -41933
320d1933L6053M6988n0399k8235O2288P946p0218J1088P2832k6966o9220L7756
$$ -41933 -5880 41108 -9291 -37526 24762 32708 -37510 -26422 46410 19444 -49776 -12020
332a2020N8866m2754m2165M1696J9889l5242O060K4795l3492j2090N9869j004
$$ -12020 46846 4092 -38073 3623 23512 -11730 -5670 19125 -14367 -26457 33412 32408
344C2408q2121J2678R7864k1339j04684K5966J01764k6308q8436K2435O5712j5043
$$ 32408 -49713 -37035 60829 39490 -65194 -39228 62536 36228 -52208 -29773 35939 20896
356B0896l5487N528M08M567L6062j3833p0443K0708R8877k4211j18563K3709J26994
$$ 20896 -14591 -9063 -8655 -4088 31974 18141 -52302 -31594 67283 43072 -75491 -51782 75212
369G5212j9240j23146J1431J06906j400p9498r244M3440J9162k224k6655m0028
$$ 75212 55972 -67174 -55743 51163 49763 -29735 -38979 4461 23623 21399 -5256 -45284
381d5284L0864P9108l1021j10808K7123J31896j9640j39861R515J33806J731j14177
$$ -45284 -14420 64688 33667 -77141 -50018 81878 62238 -77623 -68108 65698 67429 -46748
393d6748j2867Q2857K2282m3185k9017r07L2222M4796l1683q4087K7585J14541
$$ -46748 -59615 23242 45524 2339 -26678 -27585 4637 49433 17750 -66337 -38752 75789
405G5789k0255j33365J0948J38590n70j29901r285J08306J7830p6188k3934L7099
$$ 75789 55534 -77831 -66883 71707 71137 -58764 -68049 40257 58087 -18101 -42035 -4936
417d936K6952N136k6758m6069K3444Q1616j7562j08382R902J23634j567j26329
$$ -4936 22016 27152 394 -45675 -22231 59385 41823 -66559 -56657 66977 65410 -60919
429f0919o418J16410J2844r5339j6991O5459J8322l0037j6932p003J3233M2001
$$ -60919 -67337 49073 61917 -33422 -50413 15046 33368 3331 -13601 -20604 -7371 34630
441C4630p851p1440J997R2694L374j03814p152J04273Q789r4463p993P6019M806
$$ 34630 26779 -44661 -42664 50030 53404 -50410 -57562 46711 55500 -38963 -46956 29063 33869
454C3869n1155J6K2673n695O206J1047l2836j5149N4624J6940o9813j5924P7229
$$ 33869 -17286 -17270 5403 -292 5914 16961 -15875 -31024 23600 40540 -29273 -45197 32032
467C2032J1972p6861n229O9289l460n5789J3145L8303k2424j8795L0152n70l4893
$$ 32032 44004 -32857 -38086 31203 27743 -28046 -14901 23402 978 -17817 12335 11765 -23128
480b3128J7988L5891l2075l2357M1829K4390m6859j2571M7227k110m3671J7971
$$ -23128 -5140 30751 -1324 -33681 8148 32538 -14321 -26892 20335 18225 -25446 -7475
492g475L6938l3265k8273M6022J8618n4621r018N7633P5n4290P666M4564j3920
$$ -7475 29463 -3802 -32075 13947 32565 -22056 -31074 26559 26634 -27656 -19990 24574 10654
505A0654k9024J8652R301k1835J2720K3863l4616k4616N3859K4486o8183k3485
$$ 10654 -18370 282 9583 -12252 468 24331 -10285 -34901 18958 43444 -24739 -48224
517d8224P5807K1501p5488j8709O6951J4881n0967r971K8748M114k797K517k4350
$$ -48224 27583 49084 -26404 -45113 21838 36719 -14248 -24219 4529 8643 5846 8363 -15987
530a5987r766M9730J7125p0501k4076Q4414K9905q9682l3828Q5722L5260p2628
$$ -15987 -25753 23977 41102 -29399 -53475 30939 60844 -28838 -62666 23056 58316 -14312
542a4312l3654N1819K8856k5309k0830m146J0349L3296J921n9276j4764P9194
$$ -14312 -47966 3853 32709 7400 -13430 -17576 -7227 26069 27990 -31286 -46050 33144
554C3144K6772r1091l6688R3598M3165q6600m5494P0849M3013m7910l6015K0299
$$ 33144 59916 -31175 -67863 25735 68900 -17700 -63194 7655 50668 2758 -33257 -12958
566a2958K5072R183j1265l7452m033O1831J9280p9665l2655Q9315M2918q9921
$$ -12958 12114 21297 10032 -27420 -31453 30378 49658 -30007 -62662 26653 69571 -20350
578b0350m8755Q1553M9524o5172m5131M2597L5962j6348k3012j0939P549L6338
$$ -20350 -69105 12448 61972 -3200 -48331 -5734 30228 13880 -9132 -20071 -12522 23816
590B3816Q664n7446k4073P2246L6697p9431m5247P8605M8784p0156m6834N5417
$$ 23816 32480 -24966 -49039 23207 59904 -19527 -64774 13831 62615 -7541 -54375 1042
602A042L9647l6029k8006J4252J3463P748K378k7746j7652M4126L0560n5486l9607
$$ 1042 40689 4660 -23346 -9094 4369 12117 14495 -13251 -30903 13223 43783 -11703 -51310
615e1310O1188M3666o1048m2534N5434L6279m5361k5838L1878J2540j6634J867
$$ -51310 9878 53544 -7504 -50038 5396 41675 -3686 -29524 2354 14894 -1740 127
627A27J006j5731J3617K7388k6068l5415L5535L8930m1410l7473M3674L1385m2313
$$ 127 1133 -14598 -981 26407 339 -35076 459 39389 -2021 -39494 4180 35565 -6748
640f748k1438L7926R029l1098M354K2613j6947j3287K7204L691l3818N405L5961
$$ -6748 -28186 9740 18769 -12329 -7975 14638 -2309 -15596 11608 15299 -18519 -13114 22847
653B2847j3638l3494K0562K6618k6065j6360K9959L877l2135R130L2610k1115
$$ 22847 9209 -24285 -3723 22895 -3170 -19530 10429 14306 -17829 -8699 23911 2796
665B796l1152L0604K7763l6196k2467L7376J5414l3746o855K5859k718j4595J2785
$$ 2796 -28356 2248 30011 -6185 -28652 8724 24138 -9608 -16463 9396 6678 -7917 4868
678D868J258k2601J2510L1345k5132l8192L5038M2144m0907m2880M1916L9925
$$ 4868 6126 -16475 -3965 27380 2248 -35944 -906 41238 331 -42549 -633 39292
690C9292l7989l3234K9362K3261j7179j0539K737l721J2186J8508k5886l2320
$$ 39292 1303 -31931 -2569 20692 3513 -7026 -4289 -8010 4176 22684 -3202 -35522
702c5522L6873M3731m3570n1518M5444N4652m2178n2641L4247M5392k2547l3476
$$ -35522 1351 45082 1512 -50006 -4562 50090 7912 -44729 -10482 34910 12363 -21113
714b1113Q343J7906O573j87k0674j8106L2412L5006m0627m8774M4348N8006m3443
$$ -21113 -12770 5136 11709 11522 -9152 -27258 5154 40160 -467 -49241 -4893 53113 9670
727I670o1479L7947N8856k8532n0202J6336L6423k532j8798j1253q42K3732K0528
$$ 9670 -51809 -13862 44994 16462 -33740 -17404 19019 16487 -2311 -13564 -14406 9326 29854
740B9854l3533l8269L9786N2152m1823o0879L9628O3290l3520n9317K4239M9251
$$ 29854 -3679 -41948 -2162 49990 8167 -52712 -13084 50206 16686 -42631 -18392 30859
752C0859j2928l4262P06J5950J0923L718k0889k2714K8277L9075l2477n1043L3382
$$ 30859 17931 -16331 -15625 325 11248 14966 -5923 -28637 -360 38715 6238 -44805 -11423
765a1423N7525l1050n7833K6118N2162j9141m1227J1108K6355k840r154n028q388
$$ -11423 46102 15052 -42781 -16663 35499 16358 -24869 -13761 12594 9754 600 -4428 -12816
778a2816J1696K4543j6927l7592K0277M6226k1869m9762K1722M7918k0192m1056
$$ -12816 -1120 23423 6496 -31096 -10819 35407 13538 -36224 -14502 33416 13224 -27832
790b7832J7414L0160j3787j6507R633J710n115J2589O47k4825L683L3866p707
$$ -27832 -10418 19742 5955 -10552 -919 791 -4324 8265 8912 -15913 -12230 21636 13929
803A3929l8635J1204L9034j4271l5025J6631K7480j8344j7344J9099N962j8917
$$ 13929 -24706 -13502 25532 11261 -23764 -7133 20347 2003 -15341 3758 9720 -9197
815i197N246J7545j5116j4886K2408J1028k6738n840K7621l68k5251P219K0189
$$ -9197 -3951 13594 -1522 -16408 6000 17028 -9710 -15550 12071 11703 -13548 -6329 13860
828A3860j4134j3177K0619N287k5937K613K9451r527l0489J4687K8800j7601k4190
$$ 13860 -274 -13451 7168 12455 -13482 -10869 18582 9055 -21434 -6747 22053 4452 -19738
841a9738J8004J6835j6035p383J2119l617o867J4898J136k5602M379L4396q931
$$ -19738 -1734 15101 -934 -8317 3802 185 -6682 8216 9352 -16250 -11871 22525 13594
854A3594m0311J1941M2546j3078m0595J2302L4501r696k4605N812J1932j251K482
$$ 13594 -26717 -14776 27770 14692 -25903 -13601 20900 11204 -13401 -7589 4343 3092 5574
867E574l421j6982P372L0386j0242m0989J1413M7785j0973m9940Q927M7070n694
$$ 5574 2153 -14829 -7457 22929 12687 -28302 -16889 30896 19923 -30017 -21090 25980 20286
880B0286l9423J635K7595K582j2868o457l404R482J9571j1244l3977J1581M5164
$$ 20286 -19137 -17502 10093 12675 -193 -6650 -10054 -572 18999 7755 -26222 -14641 30523
893C0523j0370n1900P899N3556m439m9719M55M0881L582k7901p053J1965R722
$$ 30523 20153 -31747 -23848 29708 25269 -24450 -23995 16886 20468 -7433 -14486 -2521 7201
906G201N115j1179k1709J1237L6060j0079m6646P690N2379m574n2785J124M7749
$$ 7201 12316 1137 -20572 -9335 26725 16646 -30000 -22310 30069 25495 -27290 -26166 21583
919B1583K239l7950n066K4525O973q862p788p244P496K2307o234l4643M290M3186
$$ 21583 23822 -14128 -19194 5331 12304 3442 -4346 -11590 -4094 18213 11979 -22664 -18374 24812
933B4812j976m7103k82M6181K194m0777l413L1426L854j9344l475N745K394P847
$$ 24812 22836 -24267 -24549 21632 23826 -16951 -20364 11062 14916 -4428 -7903 -2158 236 8083
947H083r45k0158o83L0016K065l6497k959L9092L122l7644k426L2574R46k4456
$$ 8083 7138 -13020 -13703 16313 18378 -18119 -21078 18014 21136 -16508 -18934 13640 14586 -9870
961i870J210J4364l654l418O059p132q030J6376R115k3426q993K7621P453k8802
$$ -9870 -8660 5704 2050 -1368 4691 -2441 -10471 5905 15020 -8406 -17399 10222 17675 -11127
975a1127m659K7052P27k2856L864J6757q505r719J2728K413j5843M329J7437r946
$$ -11127 -15786 11266 11993 -10863 -6999 9758 1253 -8466 4262 6675 -9168 -4839 12598 2652
989B652j7061J4083J4620j6371j0265J6980M324j5914K568J3742r806j0626J6370
$$ 2652 -14409 -326 14294 -2077 -12342 4638 8962 -6952 -4384 9358 -448 -11074 5296
1002E296P095k1643l563K4859K75k5511K433K3282m437j8477N852J1219o630k348
$$ 5296 12391 -9252 -12815 12044 12319 -13192 -10759 12523 8086 -10391 -4539 6680 50 -2298
1016b298O893p199o840J6497O533k4369o075K9971N583l2434n057L1574M438k7239
$$ -2298 4595 -2604 -9444 7053 13586 -10783 -16858 13113 18696 -13738 -18795 12779 17217 -10022
1030a0022l560J9838K366j0086r79q32q73J1959K955k2120n213L0030P401l4950
$$ -10022 -13582 6256 8622 -1464 -2443 -3275 -4148 7811 10766 -11354 -16567 13463 20864 -14086
1044a4086r307L6267J0588l3829j1060K7849J0526j8927q883P988O271L883k773
$$ -14086 -23393 12874 23462 -10367 -21427 6422 16948 -1979 -10862 -2874 3397 7280 4507
1057D507j5349j340K5435N564l2838r580L7023J2771l7267j4846L3717J5322k6707
$$ 4507 -10842 -12182 13253 18817 -14021 -23601 13422 26193 -11074 -25920 7797 23119 -3588
1070c588j4261J7043J1507n730p460o028K393J7073K998k6230q191L2557J2528
$$ -3588 -17849 -806 10701 4971 -2489 -8517 -6124 10949 13947 -12283 -20474 12083 24611
1083B4611l5385j5555L4634J6855l0356j6231K3137J3870j3844r890L553M787
$$ 24611 -10774 -26329 8305 25160 -5196 -21427 1710 15580 1736 -8154 -4601 186
1095A86O860P47j6151o295K3573J1080k8426j4649L0305J6543k9207j6586K5253
$$ 186 7046 7793 -8358 -14653 8920 20000 -8426 -23075 7230 23773 -5434 -22020 3233
1108C233J4763j9122j1258J1395O471k968r40n322m550J2593R582j8323j3357
$$ 3233 17996 -1126 -12384 -989 5482 2514 1574 -3748 -8298 4295 13877 -4446 -17803
1121a7803K2041J5516k3410j5739K2558J4023j9676j0536J5178N733r694k47L762
$$ -17803 4238 19754 -3656 -19395 3163 17186 -2490 -13026 2152 7885 -1809 -2056 1706
1134A706n290K021J0083p148j3675J1210J5476j4000j5315J5400J3165j5428r381
$$ 1706 -3584 -1563 8520 1372 -12303 -1093 14383 383 -14932 468 13633 -1795 -11176
1147a1176J4317M337j2119J168R416o588o246J1183L114j4502N3J6032k903j5556
$$ -11176 3141 7478 -4641 -3473 5943 -645 -6891 4292 7406 -7096 -7043 8989 6086 -9470
1161i470N330J3184p343r129Q799L921r856J869J0347p565j0383J2412R858j5863
$$ -9470 -4140 9044 1701 -7428 1371 5292 -4564 -2695 7652 87 -10296 2116 11974 -3889
1175c889q842J7506P179j6983n011J4502K252j0177R28M587m260J681P571p852
$$ -3889 -12731 4775 11954 -5029 -10040 4462 6714 -3463 -2535 2052 -2208 -527 7044 -808
1189h08j0508J3188J2871j7123j4254J9116J4448j8857j3365J6438J0986j2174
$$ -808 -11316 1872 14743 -2380 -16634 2482 16930 -1927 -15292 1146 12132 -42
1201d2p451O423L037N8J894o634o934J2448J1631j6989j5425J9637J7963k0110
$$ -42 -7493 -1070 1967 2025 3919 -2715 -9649 2799 14430 -2559 -17984 1653 19616 -494
1215d94j8876J8416J8008j4661j5346R388J1069l035n577l505o81R580P131j4639
$$ -494 -19370 -954 17054 2393 -12953 -3565 7504 4469 -1108 -4613 -5294 4286 11417 -3222
1229c222j3039J8070J7680j9519k0664J8861K1532j6269k0151J2008J6625o583
$$ -3222 -16261 1809 19489 -30 -20694 -1833 19699 3430 -16721 -4713 11912 5329
1241E329j1356O65M819N159K280j0330r134J4311J5060j6636j9401J7256K1744
$$ 5329 -6027 -5362 -543 4616 6896 -3434 -12568 1743 16803 167 -19234 -1978 19766
1254A9766j6120k1717J3352J9536r490j5250M797R404J43k698m928m119Q872J0486
$$ 19766 3646 -18071 -4719 14817 5327 -9923 -5126 4278 4421 1723 -3205 -7324 1548 12034
1268A2034j1790j5739J3398J9241j3626k0675J2561J9874j0348j7006P413J2338
$$ 12034 244 -15495 -2097 17144 3518 -17157 -4596 15278 4930 -12076 -4663 7675
1280G675l976o502N44J12K648O139n227j1570P150J5611q289j7783Q654J7884
$$ 7675 3699 -2803 -2259 -2147 501 6640 1413 -10157 -3007 12604 4315 -13468 -4814 13070
1294A3070q342j6011P475J2384o242p538M726J987l127L538J474q419K7J2215
$$ 13070 4728 -11283 -3808 8576 2334 -5204 -478 1509 -1618 1920 3394 -5025 -4998 7217
1308G217j506j4400K871J4872m024j3617N049J0902n871p033O499K557o808K060
$$ 7217 5711 -8689 -5818 9054 5030 -8587 -3538 7364 1493 -5540 959 3516 -3292 -1232
1322a232O699o093o358R277N514j1225m180J1727K376j0870j37Q631k334n551
$$ -1232 5467 -626 -6984 2293 7807 -3418 -7598 4129 6505 -4365 -4502 4129 1795 -3756
1336c756M911J935p369J752R421n030j0823P576J1306q991j0804R323R102q336
$$ -3756 1155 3090 -4279 -2527 6894 1864 -8959 -1383 9923 932 -9872 -549 8553 217
1350B17o386O403K859l755J319O56n601K351R618m959j2940O868J5064p832j5842
$$ 217 -6169 234 3093 -662 657 1313 -4288 -1937 7681 2722 -10218 -3350 11714 3882 -11960
1365a1960P777J4971o687j2622M802Q836k303m016m66j375L115O785n215j1728
$$ -11960 -4183 10788 4101 -8521 -3719 5117 2814 -1202 -1668 -3043 72 6857 1642 -10086
1379a0086O688J5654p244j8058O880J8696n632j7449L719J4390j448r738r87M049
$$ -10086 -3398 12256 5012 -13046 -6166 12530 6898 -10551 -6832 7558 6110 -3628 -4615 -566
1393e66L180K083m833q199N889J3471o178j7396N668J9511m521j9627K910J7670
$$ -566 2614 4697 -136 -8335 -2446 11025 4847 -12549 -6881 12630 8109 -11518 -8608 9062
1407I062r92j3874q90Q682K582k547l909l742M721R644m901j4560M566J7883l727
$$ 9062 8070 -5804 -6694 1988 4570 2023 -1886 -5628 -907 8737 3836 -10724 -6158 11725 7998
1422G998j9376K511J8815j094j6349l61J2234J594o971k520J063L024M799l097
$$ 7998 -11378 -8867 9948 8854 -7495 -7856 4378 5972 -999 -3519 -2456 568 5367 2270
1436B270j0019K708J4123k010j6616J144J7362k73j6184n35J3470J030r399j184
$$ 2270 -7749 -5041 9082 7072 -9544 -8400 8962 8689 -7495 -8030 5440 6470 -2929 -4113
1450d113M542J043N48n27n432p9R454P51j2383j291J3858J514j3793j482J2343
$$ -4113 429 1472 2020 1493 -3939 -4018 5436 6187 -6196 -7487 6371 7885 -5908 -7390 4953
1465D953R91r708j41O157q74k263K069j725l110N293L850p985m165R690M005j0243
$$ 4953 5944 -3764 -3905 2252 1378 -885 1184 -541 -3651 1642 5492 -2493 -6658 3032 7037 -3206
1481c206l275R740J962q222k86O027j706l348L723N60n493J949O789m020p476
$$ -3206 -6481 3259 5221 -3001 -3287 2740 1034 -2314 1409 1969 -3524 -1575 5214 1194 -6282
1496f282N451P273o103o201N984M384n300j892M187j045k756M100J258o806R0
$$ -6282 -831 6442 339 -5862 122 4506 -794 -2686 1501 456 -2300 1800 3058 -3748 -3658
1511c658Q936j140j0187J823J0411k207r358K137P282j865m302J424O42r52L262
$$ -3658 5278 4138 -6049 -4226 6185 3978 -5380 -3243 4039 2174 -2128 -704 -62 -1014 2248
1526B248M40o888j32R906L7j2026r5J2848M14j2368p05J0468J046p390j276L469
$$ 2248 2688 -4200 -4332 5574 5611 -6415 -6510 6338 6752 -5616 -6321 4147 5193 -2197 -3473 -4
1542dJ340R01j108n224O37R038J83j2028j086J3679K018j3921k918J2704L479
$$ -4 1336 2237 1129 -4095 -3458 5580 5763 -6265 -7351 6328 8346 -5575 -8493 4211 7690
1557G690j0101l671O394L457k060k792k499J655O775k10j0337j357J2851K865
$$ 7690 -2411 -6082 312 3769 1709 -1083 -3582 -1927 4848 4638 -5699 -7056 5795 8660
1571H660j3907m119J3540N002j1813n235Q812M978m974m125O21K788L696j053
$$ 8660 -5247 -9366 4174 9176 -2637 -7872 940 5918 944 -3181 -2560 228 3924 2871
1585B871p585q84J0643K691j2555m237J3084N334j2295n817J0172N641p110m783
$$ 2871 -4714 -5598 5045 7736 -4819 -9056 4028 9362 -2933 -8750 1422 7063 -47 -4830
1599d830L458L332N03j480m153o24P234K732r483m442J0616N672j0606o205R511
$$ -4830 -1372 1960 2463 983 -3170 -3794 3440 6172 -3311 -7753 2863 8535 -2071 -8276 1235
1614A235O027p537n063M887L534k012j498r82p52L637K820n708m614P107N823
$$ 1235 7262 -275 -5338 -451 3083 1071 -427 -1409 -2161 1476 4296 -1412 -6026 1081 6904
1629F904p712o309P528O004o588m970N178L304l373j168J376j085N76L213k249
$$ 6904 -808 -7117 411 6415 -173 -5143 35 3339 -34 -1202 174 -911 -335 2878 629
1644F29m940L521O065m300o482M620O069m501m903L978L077l217q64K316j530
$$ 629 -4311 -790 5275 975 -5507 -887 5182 681 -4222 -244 2833 -384 -1248 1068 -462
1659d62j395L764N29n483J38O591o59o896J048O373j267n060J450L140j658p16
$$ -462 -1857 1907 2436 -3047 -2909 3682 3023 -3873 -2825 3548 2281 -2779 -1329 1811 153 -563
1675e63J821j796j976M083K173n944k327P096K400p510k290O932J995n566j507
$$ -563 1258 -538 -2514 1569 3742 -2202 -4529 2567 4967 -2543 -4833 2099 4094 -1472 -2979
1690b979L571P26j076K33j591j310M138K342o139l327P490M151q014m548P586
$$ -2979 592 1318 242 475 -1116 -2426 1712 4054 -2085 -5412 2078 6229 -1785 -6333 1253
1705A253M593o314m132M331L223j831j897q61J50L538J600n688l413P188M940
$$ 1253 5846 -468 -4600 -269 2954 1123 -774 -1635 -1485 2053 3653 -2035 -5448 1740 6680
1720F680p907o027P696O518o627o375M860N540k633m068J10K128K419J50m575
$$ 6680 -1227 -7254 442 6960 333 -6042 -1182 4358 1725 -2343 -2233 -105 2314 2464 -2111
1735b111k427O178M567p111o244P255P349o670p610N334P079l460n826J291L869
$$ -2111 -4538 1640 6207 -904 -7148 107 7456 786 -6824 -1490 5589 2129 -3697 -2406 1463
1750A463J015j539l074j108M756L503n794n568O171P124n961p834N111P643l715
$$ 1463 2478 939 -2135 -3243 1513 5016 -778 -6346 -175 6949 988 -6846 -1735 5908 2193
1765B193o613K063M863k18k648j486J19K892K403l861m587M352O280m384p256
$$ 2193 -4420 -2357 2506 2288 -360 -1846 -1727 1165 3568 -293 -4880 -528 5752 1368 -5888
1780e888L961P368l198o700K189N295j011l421o1J085J074J222j743l434K247
$$ -5888 -1927 5441 2243 -4457 -2268 3027 2016 -1405 -1466 -381 693 1915 172 -3262 -1015
1795a015N094k370o195K314O593k089o175J688N112j171l511P09J487k90O19L5
$$ -1015 4079 1709 -4486 -2172 4421 2332 -3843 -2155 2957 1786 -1725 -1016 471 181 800 835
1811H35k672J74M246k80n285K97N618k54n393L36M441m27l004O29J291r30N44
$$ 835 -1837 -1663 2583 2303 -2982 -2685 2933 2679 -2714 -2378 2063 1636 -1368 -739 552 -378 166
1828A66J292k249j639L622J929m456k023M700K007m462j675L628J118k387l09
$$ 166 1458 -791 -2430 1192 3121 -1335 -3358 1342 3349 -1113 -2788 840 1958 -429 -738
1843g38Q74o34O61J620k084k612L193L376l884l858M033L988l737l676K976K940
$$ -738 136 -498 163 1783 -301 -2913 280 3656 -228 -4086 -53 3935 198 -3478 -502 2438
1859B438j799j817M53M43Q97J148k114k713L062M014l549m963L621N462l227n333
$$ 2438 639 -1178 -725 -282 615 1763 -351 -3064 -2 4012 463 -4500 -879 4583 1356 -3977
1875c977K415M611j336l379L1J761J109K08k140k233K943L931l244n333L175O200
$$ -3977 -1562 3049 1713 -1666 -1635 126 1235 1443 -697 -2930 13 3944 700 -4633 -1458 4742
1891D742k717o453J982N982r48m910j52L337J176j309k021q84K640K984k874m791
$$ 4742 2025 -4428 -2446 3536 2588 -2322 -2474 863 2039 730 -1291 -2175 465 3449 575 -4216
1907d216K744O088k348o669J551O662p27n877k39M481J087k568j769L77K175J866
$$ -4216 -1472 4616 2268 -4401 -2850 3812 3085 -2792 -3031 1450 2537 -31 -1800 -1423 752 2618
1923B618k292l861K110N398j681o265J043O533l26o064l87M947J010l354j398
$$ 2618 326 -3535 -1425 3973 2292 -3973 -2930 3603 3277 -2787 -3174 1773 2783 -571 -1969
1938a969J352J587P43j561k683J278M238q13n341L33N741K61n612p37M924J025
$$ -1969 -617 970 1713 152 -2531 -1253 2985 2172 -3169 -2836 2905 3166 -2446 -3183 1741 2766
1954B766l645j201K076J145l46q56j350L93K912Q1l999n80M599J037m703j335
$$ 2766 -879 -2080 -4 1141 795 -61 -1411 -1018 1894 1975 -2024 -2604 1995 3032 -1671 -3006
1970c006M285J386l416j203K132Q62q02k34o45m40J893J084k812j671L361K015
$$ -3006 1279 2665 -751 -1954 178 1040 238 4 -641 -1081 812 1896 -916 -2587 774 2789
1986B789l467k098L197J932k578j448J695P40o52J14k88j061J177J930j832k590
$$ 2789 -678 -2776 421 2353 -225 -1673 22 762 110 224 -64 -1125 52 1982 150 -2440
2002b440K179K972k231l054K003K751j552k111R14J173k52n6l67j171Q59K265
$$ -2440 -261 2711 480 -2574 -571 2180 628 -1483 -569 604 352 296 -71 -1242 -383 1882
2018A882j143l213J301L783j165l925Q76L651n03k898N5J773M22m27p47r96R22
$$ 1882 739 -2474 -1173 2610 1445 -2480 -1604 2047 1544 -1354 -1299 474 896 469 -278 -1274 -352
2035c52K360q91l543P45M259m29m558K9M306M46l606q68K504J136j083j242n36
$$ -352 2008 1117 -2426 -1681 2578 2149 -2409 -2380 1926 2372 -1234 -2102 402 1538 455 -787 -1323
2052a323J226K008r37l320N55M255km744n65M731J111m195j507L180J751j875
$$ -1323 -97 1911 974 -2346 -1791 2464 2462 -2282 -2847 1884 2995 -1200 -2707 473 2224 349
2068C49j760L12J556J257j113k678M68L801J96m462r16M630J516m280j994L564
$$ 349 -1411 -1099 457 1714 601 -2077 -1609 2192 2388 -2074 -2990 1640 3156 -1124 -3118 446
2084D46K164k330k125R44J747N86j181j954M49L110L40l851j139M195J775m092
$$ 446 2610 280 -1845 -901 846 1432 251 -1703 -1254 1856 2196 -1655 -2794 1401 3176 -916
2100i16k176L472K363k545k274J376J858j30j218j140M71K150M00k937j196L319
$$ -916 -3092 380 2743 198 -2076 -700 1158 1028 -190 -1330 -859 1291 1691 -1246 -2442 877
2116H77J914l419k263L019K501k384k356J529J970n52j252m13L83J253N24j918
$$ 877 2791 -628 -2891 128 2629 245 -2111 -582 1388 836 -416 -829 -446 807 1331 -587
2132e87j377K284K073k379k514K218K594j772k420J192J866n22j135j01J97O54
$$ -587 -1964 320 2393 14 -2500 -282 2312 540 -1880 -688 1178 656 -479 -580 -383 271
2148B71P54j089j548J327K192j319k600J216K653r31k381O03J801k54r91j26J31
$$ 271 1025 -64 -1612 -285 1907 588 -2012 -796 1857 926 -1455 -852 949 695 -296 -422 -291
2165b91L56Q19n03j678N33K323m30k749K79K737j2k492j83J894L31j041m27J40
$$ -291 65 884 381 -1297 -764 1559 1129 -1620 -1341 1396 1384 -1108 -1291 603 934 -107 -534 -394
2183c94L67Q59k40j722j0K397L32k773o31K792R31k527j054J909J091j092r67
$$ -394 -27 832 592 -1130 -1140 1257 1589 -1184 -1815 977 1908 -619 -1673 236 1327 235 -732
2200g32J00O40R04k75j727k53K418P46k769j224K824J592k569j766K001J754j176
$$ -732 -632 8 912 637 -1090 -1343 1075 1821 -948 -2172 652 2244 -325 -2091 -90 1664 488
2217D88j544K43J145P00n47j565j31K244Q16k629j483K735J956k469k280K003
$$ 488 -1056 -813 332 1032 485 -1080 -1211 1033 1849 -780 -2263 472 2428 -41 -2321 -318
2233c18K255j265k050L91J592M73r25j273O1J962P37k289j536K398K207k256k529
$$ -318 1937 672 -1378 -987 605 1078 153 -1120 -1059 903 1640 -649 -2185 213 2420 164 -2365
2250b365J819K631j200k387M42J913L20j228r65L08J539N93j892j394J951K096
$$ -2365 -546 2085 885 -1502 -1060 853 1173 -55 -1020 -712 827 1420 -472 -1866 85 2181
2266B181j864k549J527K695j060k521M72K075J57j439p01N97J134L17j384j164
$$ 2181 317 -2232 -705 1990 930 -1591 -1119 956 1113 -326 -1027 -430 704 1021 -363 -1527
2282a527J471J871j337k369J080K580p02k465K21K142J70j486n51O94P87J33q44
$$ -1527 -56 1815 478 -1891 -811 1769 1067 -1398 -1177 965 1135 -351 -902 -208 579 712 -132
2299a32j005Q59J646o97k109M09K354j51k251j74J949M01j397n32O94N87P2n14
$$ -132 -1137 -278 1368 671 -1438 -1029 1325 1174 -1077 -1251 698 1099 -298 -830 -136 451 523 9
2317Iq33L93J408j33j828j45K033M07j993n75J678O89j200o82N66N49J08l72p16
$$ 9 -824 -431 977 844 -984 -1129 904 1311 -682 -1257 421 1110 -90 -772 -206 343 451 79 -637
2336f37K3J278L16j634o61J764R38j653j111J402J141r56r97L83P47K05l57p22
$$ -637 -614 664 980 -654 -1315 449 1387 -266 -1377 25 1166 210 -787 -404 343 548 191 -531
2354e31j48J142O26j398j087J509J386j363j587J058J597o38j425J63J007L41
$$ -531 -679 463 1089 -309 -1396 113 1499 136 -1451 -393 1204 566 -859 -696 311 652
2370F52m57q06j31J134P09j265j267J291J704j146j917Q76J929m96j682J3J292
$$ 652 195 -611 -742 392 1101 -164 -1431 -140 1564 418 -1499 -623 1306 810 -872 -859 433
2387D33M36p06q55O9J048O56j192j287J148J734q86k081N69K124k11j917k33J546
$$ 433 869 163 -692 -623 425 1081 -111 -1398 -250 1484 598 -1483 -914 1210 999 -918 -1151 395
2405C95N81r36q69K41J032N33j075j150R53J673o57k056L43K187J2k038l47J610
$$ 395 976 40 -829 -588 444 977 -98 -1248 -295 1378 721 -1335 -992 1195 1207 -831 -1178 432
2423D32P16j141r16M63J021K17r67q70P38J468m98j855J66K020J76j953m80J661
$$ 432 1148 7 -909 -446 575 792 -175 -1045 -307 1161 663 -1192 -1026 994 1170 -783 -1263 398
2441C98P36j159r20O08R20O7q31o92O17J225k67j593r5J738M53j734p31J526Q68
$$ 398 1134 -25 -945 -337 583 650 -181 -873 -256 969 702 -891 -986 752 1205 -529 -1260 266 1134
2460A134j094r87O17Q70l0o96n22M19R72k9j286l36J444O48j423q69J230J023
$$ 1134 40 -947 -330 540 510 -186 -708 -289 683 654 -632 -968 476 1124 -299 -1168 62 1085
2478A085q92j070N41Q78m2o36l93K79P63J13j023m98J119Q38j140j028R37J153
$$ 1085 193 -877 -336 542 500 -136 -529 -250 513 626 -397 -895 224 1062 -78 -1106 -169 984
2496I84o55j109L24Q65O2n59l91J79O76K41p89o87Q38J013p41j242N74J313l01
$$ 984 329 -780 -456 409 471 -88 -479 -300 376 617 -172 -859 -21 992 251 -991 -417 896 595
2515E95j222J1R80K46n87m78J14O18L47o90p63O31J089m67j355K81J406Jj325
$$ 595 -627 -616 364 610 23 -455 -341 277 624 -66 -829 -198 891 424 -931 -650 756 757 -568
2534e68k59J066M92o80o16K27O37L25o17q05N12J153k65j384M2J443K26j342n02
$$ -568 -827 239 731 51 -565 -338 299 624 7 -798 -286 867 602 -782 -740 703 929 -413 -915
2553i15J083O66o71p68J62P74K87o46p40L92J148j09j386j72J437M72j320p42
$$ -915 168 834 163 -605 -443 331 618 -28 -768 -376 772 663 -723 -895 542 1014 -306 -1048
2571a048J088Q66p26q82K36Q71K13o53o70L76J026o0j224k89J326N94j280q20
$$ -1048 40 906 180 -702 -466 405 618 -35 -705 -329 697 637 -587 -876 450 1044 -236 -1056
2589a056J064R56p08r97K62R29J47p14n16L67Q75k6j087l47J177O59j096r13Q82
$$ -1056 8 964 256 -741 -479 450 597 -117 -633 -266 609 583 -504 -851 326 985 -111 -1024 -142
2608a42J084o16j054K25R65J64p32m81L39P78K0q95m30R46P30q49j017P16J102
$$ -142 942 326 -728 -503 462 626 -106 -587 -248 530 550 -345 -775 171 901 52 -965 -249 853
2627H53m25j099R9R65J69o69m15L45O29qp25l60P05P38o28r63M39J092k51j063
$$ 853 428 -671 -572 393 562 -107 -522 -177 452 444 -281 -641 64 802 174 -789 -350 742 491 -572
2647e72mR46K27o86m16L06N54L5n79m19N35P63m72r38K65J016K4j030k12Q85L82
$$ -572 -576 370 597 -89 -505 -199 355 390 -189 -608 -73 690 218 -720 -455 561 585 -445 -657 228 610
2668F10n79n06K49N48J09n02m59M08P23j84r60NJ005K29r78m16Q14N49n43o32
$$ 610 31 -475 -226 322 431 -71 -530 -122 601 417 -543 -538 467 696 -282 -698 116 665 122 -510
2688e10K26N96R0n00m08K82P09j00q37j79R17M12q59n75O84P18m42p37J71O45
$$ -510 -284 312 402 -98 -506 -224 485 385 -452 -631 286 698 -161 -736 -52 666 224 -513 -342 303
2708C03J44m71m16K10O93Qq04l00Q55N47p85p32N65Q28l26q22M2P21K44n10n00
$$ 303 447 -24 -440 -230 463 471 -333 -633 222 769 -16 -748 -183 645 319 -503 -461 260 504 -6 -506
2729e06K55O78O4p74l65P71O09o43q34M59R57k27r22k4P89K53n47m50K38N92J11
$$ -506 -251 427 491 -283 -648 123 732 89 -745 -286 671 444 -478 -502 287 540 -7 -457 -219 373 484
2750D84o99m08O68O38n01r28L61R75j22q98j37P99L54n67n17K67O03P8o30l97
$$ 484 -215 -623 45 683 182 -746 -385 590 468 -430 -567 232 586 19 -498 -231 372 450 -180 -577
2770e77N69O83m17q51J74R47K6r20k49Q06L99n65n27K32N88O2n17l99M51O40k76
$$ -577 -8 675 258 -593 -419 528 554 -366 -615 191 590 25 -502 -270 318 380 -137 -536 -85 555 279
2791B79q43P8Q99J48q61k92P01N32n28n87K32N93P0n16l23L58N59j83p22k9P48
$$ 279 -564 -486 413 561 -300 -592 109 641 113 -474 -242 351 421 -95 -418 -60 499 316 -406 -435 313
2812C13K77p93m04O10N66m33o29J92N90P8n02l17L06N38q1o51j46O89L84o48n41
$$ 313 590 -203 -607 3 569 136 -493 -301 289 367 -135 -452 -146 392 311 -340 -486 203 587 -61 -602
2833f02N16O16k93o69J09N99J42m48l45K38M95j1n78k25N78M26m94o22L96O41
$$ -602 -86 530 237 -432 -323 276 418 -30 -375 -137 358 347 -231 -456 122 548 54 -568 -172 469
2853D69j64p03jO18J74m08l60J90M83K5n03k58M85M52l76o46K41P30l4p21j29
$$ 469 305 -398 -399 219 393 -15 -375 -185 298 323 -180 -438 47 499 123 -523 -282 448 414 -307 -436
2874d36N74L04m14m14J55M98O3m69l20M00N39k61p14J42P18P4o98k43N93L55l52
$$ -436 138 442 28 -386 -231 267 330 -139 -459 -59 480 219 -495 -353 365 439 -259 -502 91 446 94
2895I4m94J68M77J19m59l37L44N42k06o45j2P32J54o65l21N53M57l83n32J47M69
$$ 94 -400 -232 245 364 -95 -432 -88 454 248 -397 -409 323 477 -188 -509 44 501 118 -414 -267 202
2916B02J08m17l25K89N13r5o16j10O91K74o03m46N24N36l42n52R0N61J29m51l23
$$ 202 310 -107 -432 -143 370 275 -341 -451 240 514 -89 -535 -11 525 183 -369 -279 282 411 -40 -363
2937c63K32N24j05n50j89O37L31n48n22M54N47k53n82QN57J84m33l54K81M66l1
$$ -363 -131 393 288 -262 -451 186 517 -31 -553 -99 448 195 -387 -379 178 362 -71 -425 -144 322 291
2958B91n50j73N73L54m82m97L38O10j78o33QN78J46l92l16K22M12J2n07k20M41
$$ 291 -259 -432 141 495 13 -484 -146 464 286 -347 -339 239 385 -7 -323 -101 311 323 -184 -404 37
2979C7M27l98n25K45O21o2o93o1N39K72m26l45K02M39J9m42k35L97M08k58n54
$$ 37 464 66 -459 -214 407 345 -348 -409 130 402 -24 -369 -167 272 291 -151 -386 11 419 161 -393
3000c93J10O28K1n98j66N17K93l79m06J92M37Ql70k60L30M14k18n10L5N73J27
$$ -393 -283 345 366 -232 -398 119 412 33 -373 -181 256 264 -106 -366 -36 378 160 -350 -315 258 385
3021C85n45k67M87L56l23m36J39M35O9l60k49K47M01j05m97j00N86J83m94l70
$$ 385 -160 -427 60 416 93 -343 -204 231 300 -60 -309 -62 339 234 -263 -363 223 406 -88 -458
3041d58M03M52k60n04R5M50J26l50k90K20L98l4n01j01M86K87m26m16L44M61j70
$$ -458 -55 397 137 -367 -272 178 304 -46 -336 -116 282 248 -253 -354 132 419 -7 -423 -79 382 212
3062B12m57k8M61J61l57l09J88M05lm50k08M25L63l63m69K44N21q1n33p6M73J91
$$ 212 -245 -273 188 349 -8 -317 -129 276 273 -177 -385 40 403 40 -429 -185 336 255 -278 -354 119 310
3084C10l11l18J61M06K8m28j99L75L80k75m99J74N74j3n69j67M94K75l49l70J39
$$ 310 -1 -319 -158 248 276 -152 -351 24 404 129 -370 -196 378 365 -204 -371 123 398 49 -321 -182
3105a82M15L6l68k76L47M05k45n03Q7N69M9n41j90M38L29l27l97J59M07O7l72
$$ -182 233 269 -99 -375 -28 377 132 -371 -284 285 334 -207 -397 41 370 43 -354 -195 212 279 -93
3126i3k53L06L91j63m85mN18J64n17k90M17L84k61m16O7M31Q8l41k86K39M08j15
$$ -93 -346 -40 351 188 -297 -301 217 381 -136 -426 -9 375 114 -302 -235 196 284 -57 -343 -104 304 189
3148A89m44p2M93K12m39l46L50M49k43m56O3M43Q2l34k78K27L98o6m41j23M28
$$ 189 -255 -327 166 378 -61 -407 -57 392 149 -307 -244 199 281 -53 -331 -104 294 228 -213 -336 92
3169I2K59l88l50K77M64k07m21j6M18J59l29k44J53L93k5l93j65M05K83l36l86
$$ 92 351 -37 -387 -110 354 147 -274 -290 128 287 -42 -286 -133 260 235 -158 -323 82 365 29 -357
3190c57K13M78p1n17k9L97K01l21k92J77L57j9l42k13L15L41k49m31J49M80j6
$$ -357 -144 334 263 -254 -283 114 315 -6 -298 -121 236 217 -125 -338 -23 318 69 -362 -213 267 251
3211B51m55j39M24K28k78l23J57L37L4l10k10K68L44j71m09M0M65R4m81j93L68
$$ 251 -204 -343 81 309 31 -292 -135 202 236 -74 -284 -16 328 157 -252 -212 253 347 -134 -327 41
3232D1K69k37l41R5L44O4k97k58K55L18j07m21JM52J45m06l04L64L63k34l55K8
$$ 41 310 73 -268 -173 171 235 -62 -320 -65 253 146 -275 -274 178 323 -83 -387 -23 340 106 -249 -221
3254b21L79J17l19k42J89L96q2m34j03M72K16l93l42L19L88j82m03j6M16R2k68
$$ -221 158 275 -44 -286 -97 299 217 -217 -320 152 368 -25 -367 -48 340 158 -245 -261 155 247 -21
3275b1k77J87L25om17j16M24K37l59l57K97L78r7m45l0M03J76l27k82J79L65K
$$ -21 -298 -111 214 208 -209 -325 99 336 -23 -380 -83 295 198 -247 -277 126 302 -25 -307 -128 237 239
3297B39m00j64L46L27k85m35J88M85p6m51q9M10K18k82l15J47L98j1l71j68L11
$$ 239 -161 -325 21 348 63 -372 -184 301 225 -226 -315 95 313 31 -284 -137 261 250 -121 -289 22
3318B2L40k48m44J39N08o4m34j12L78K36l18k89J41L52j6l32j79L12L07j96l94
$$ 22 362 114 -330 -191 317 253 -181 -293 85 321 3 -286 -145 207 191 -141 -320 -8 299 103 -291
3339b91O1M57J9l99j72L82K48k51l20J18L44L7k91k25K87L09j50m01J3M47P0m07
$$ -291 -230 227 246 -153 -325 57 305 54 -266 -148 196 233 -58 -283 4 313 163 -238 -225 222 292 -115
3361a15k08L07L32k20l41L9L50R2l11j95J69L24p6l86JL72J58l60k25K33L44j57
$$ -115 -323 -16 316 96 -245 -206 144 236 -75 -270 -101 223 147 -239 -238 134 292 -68 -293 -60 284 127
3383A27l63L1L68Q1k66k22J76L14n1l72q7L73K18l23k96K01L81j38l56m4L46J70
$$ 127 -236 -205 163 244 -22 -244 -68 246 195 -177 -264 109 327 4 -292 -91 290 152 -204 -248 98 268
3405B68k82k50J53L22j1l49j26L47K22k39l75J86M06n8m02o6L52J75k69k75J25
$$ 268 -14 -264 -111 211 200 -149 -275 72 294 55 -320 -134 272 214 -188 -254 98 273 4 -271 -146
3426a46L33M3l51j57K53L58k80l69J42M06rl84j00L09K37k29l07J08L42L4l08
$$ -146 187 230 -121 -278 -25 333 53 -316 -174 232 223 -161 -261 48 285 56 -251 -143 199 233 -75
3447g5k02K66L09j72l82M2M43K5l84j76K89L17k16l36N5L45O7l32j94K35L26j20
$$ -75 -277 -11 298 126 -256 -214 229 254 -130 -306 -17 300 84 -252 -197 148 215 -117 -311 -76 250 130
3469A30l98J9M49P2l57k07K94K88j79l30M8L43P2k99j93K16L05j10l48n6L96J55
$$ 130 -268 -249 200 272 -85 -292 2 290 111 -219 -171 172 244 -55 -248 -32 273 163 -185 -241 155 310
3491C10l81k58K66L60j87l63J6L65R5k77k17J84K85k7l81n1L62J95l20k96K50
$$ 310 -71 -329 -63 297 110 -253 -237 128 223 -54 -271 -87 198 171 -210 -261 101 296 -24 -320 -70
3512g0L68j28l78jL55J09k83k14J65K88l7l47q4L52K04k95k90J79L61o9l81l7
$$ -70 298 170 -208 -209 146 255 -28 -242 -77 211 174 -173 -257 95 299 4 -286 -107 254 185 -196 -233
3534b33L15J42k39k17J32K96l1l00j12L05K23k26l14J23L84j8l75r3K95K19k09
$$ -233 82 224 -15 -232 -100 196 165 -135 -247 58 281 55 -259 -136 248 230 -145 -238 57 276 67
3555F7l08J10L09L6k91j54K16K71j47l66O5L91M0l66j38K88K46j93k99Q9L08O1
$$ 67 -241 -131 178 214 -77 -231 -15 256 109 -257 -192 199 239 -127 -265 23 269 76 -223 -134 174 235
3577B35l22j96K50K90j44l24j5L97Q9l29k17K43K89j48l44O8K99R1k70k00K32
$$ 235 -87 -283 -33 257 113 -211 -226 171 260 -69 -286 -43 246 98 -246 -178 121 212 -58 -258 -26
3598b6K69j06l38k1L61J26l05k35K49L08j26l42%L18J28k76k27K00K67m2l37p0
$$ -26 243 137 -201 -222 139 265 -40 -275 -26 282 156 -186 -186 132 260 -16 -243 -43 224 182 -155 -225
3620b25L11J63k67k83K14L18o8l74k5L46J20k42k45J38L31m6l12r0L13K09k50
$$ -225 86 249 -18 -301 -87 231 163 -211 -236 110 230 -12 -257 -119 212 166 -146 -236 77 286 36
3641C6l17J61L83p2l53n3L14J88k65k76J47L09%l39j21K99K28k14l37J66L11J3
$$ 36 -281 -120 263 191 -162 -215 99 287 22 -254 -107 202 202 -137 -258 41 269 55 -282 -116 195 208
3663B08l81j14L58J90k23k69R1L18K7l16j51K87K57j97l54J42L47K0l50j43L17
$$ 208 -173 -287 71 261 38 -231 -140 178 205 -111 -262 25 282 85 -269 -127 220 240 -110 -253 64
3684F4K15k25k84J10L03J1k86j46K45K44j76k81J0L67P8l70j15K25K77j90k91
$$ 64 279 54 -230 -120 183 194 -92 -238 7 251 75 -206 -196 171 249 -121 -236 -11 266 76 -215
3705b15P0K92O9k82k19K76K60j31l40M5L01J20l37j83K52K78j75k93J7L19Q6k62
$$ -215 -145 147 216 -66 -285 -9 251 120 -220 -175 126 246 -91 -274 -22 256 81 -212 -195 124 210 -52
3727e2j74J93K42o8l05k1L03J46k95k14J99L01p5l67RK86J32k53k08J45K75n6
$$ -52 -226 -33 209 141 -164 -185 118 264 -31 -245 -46 255 180 -187 -178 108 240 -13 -221 -76 199 143
3749A43l16m5K65K10k73k47J67K87k0l44l8K75J44k05k29J36K82l6k62j34K74
$$ 143 -173 -218 47 257 -16 -263 -96 191 171 -173 -211 64 208 3 -226 -90 192 156 -106 -240 34
3770C4K45k31k83J37L34k8l39j13L04K04k31k57R5L24Lk98j52K68K22j83l01R3
$$ 34 279 48 -235 -98 236 208 -131 -244 60 264 33 -224 -129 195 198 -100 -252 16 238 55 -246 -153
3792a53L50j7k98j35K73K28k14k82J17K74O9l03j52K36K38j25l16N5L14O1l01
$$ -153 197 180 -118 -253 20 248 34 -248 -131 143 212 -91 -243 -7 231 106 -210 -155 159 220 -81
3813h1j81K53K81j77l34P8L18M9l00j52K34K31r2l32J8L08R5k92j95K58K67j55
$$ -81 -262 -9 272 95 -239 -161 157 206 -94 -246 -12 219 127 -205 -187 121 216 -76 -271 -13 254 99
3835I9l19L7L11R6k96j57J83K59q4l24j3L33J01k67k24J79L15j49k88L2K90J20
$$ 99 -220 -183 128 224 -72 -229 -46 213 129 -195 -208 125 226 -41 -265 -86 229 80 -208 -176 114 234
3857B34k72k08K08K41n4l02k2K66J65k51k39J66K93q6k95k4K80J37k32k38J56
$$ 234 -38 -246 -38 203 149 -153 -175 91 256 5 -234 -68 225 139 -156 -180 100 237 5 -233 -77
3878g7K66o0k97l2K63J20j67k50J33K97k2l48l6K69J73k34j96J39K63l9k58r8
$$ -77 189 129 -168 -200 63 183 16 -234 -101 196 174 -174 -210 59 232 -2 -198 -59 204 165 -93 -191
3900a91K50J70j75k37N9L17k4k78j23K67J90j84k59J10K56Rl04p0K22J67j16k75
$$ -191 59 229 54 -183 -124 193 169 -109 -232 35 225 41 -218 -108 148 157 -147 -217 5 172 56 -219
3922b19N3K99O0l21j18K46K17j54k90Q6K80N3k63j42K26K13j25k91K4L10P2k75
$$ -219 -166 133 193 -128 -246 0 217 63 -227 -141 139 192 -71 -213 13 226 101 -190 -166 144 216 -59
3944e9j78K17K64j47k75J1K81J04l16j26K27K00r6k86lK80J10k51j80J72K84j46
$$ -59 -237 -20 244 97 -178 -167 114 218 -98 -224 3 203 107 -179 -182 98 208 -43 -223 -51 233 87
3966H7k66NK78R4k41j73J33K71r1k50n0K93J23k39k27J69K93p5l23KL06J25k84
$$ 87 -179 -174 104 198 -43 -216 -83 188 97 -153 -203 90 213 -26 -253 -84 209 134 -189 -187 119 244 -40
3989d0j66J74K47n8k67p9K88J49k33k37J56K71n2l03p2L13J42k48k16J49K54l6
$$ -40 -206 -32 215 157 -110 -189 99 248 15 -222 -66 205 153 -150 -222 91 233 -15 -231 -82 172 136
4011A36k87o6K75J47j98k44J33L10n4k85o0K49J65k05k45J61K54J1k78j08K47
$$ 136 -151 -217 58 205 7 -237 -104 206 152 -133 -193 56 221 16 -229 -68 186 197 -81 -189 58
4032E8J88k02k57J02K78L5l04j09K20K30k11k49R5K82J3k85j24K56J69j39k59
$$ 58 246 44 -213 -111 167 202 -102 -211 9 239 28 -221 -126 156 169 -116 -240 16 185 46 -213
4053b13Q4K83J2k64j17K52J86j67k37Q3K55K1k35j24K03J83j27k39K3K75J00k79
$$ -213 -129 154 166 -98 -215 37 223 56 -181 -98 157 178 -57 -181 22 205 78 -161 -138 137 237 -42
4075d2j70J90K20j09k76K6K92M7k43j51J89K41j47k40%K54R8k03k08J69K61j01
$$ -42 -212 -22 198 89 -187 -161 131 178 -65 -216 -27 214 67 -173 -173 81 179 -24 -232 -63 198 97
4097I7k38l4K83J02k70j37J57K00m9k53j2K33J26k09k18J77K30o1k55m0K63J16
$$ 97 -141 -175 108 210 -60 -197 -40 160 111 -142 -154 79 205 -4 -222 -45 185 124 -131 -171 92 208
4119B08j91k03J25K24l2k38l3J88J60j65k49J43K26j6k65r0K57J54k20k06J19
$$ 208 17 -186 -61 163 131 -107 -140 48 208 43 -206 -63 163 147 -118 -208 49 203 -17 -223 -104
4140a04K66k2k64q3K29J63j47k47R4K66L1k87r4K31K03k02k08Q0K76j1k56j05
$$ -104 162 140 -124 -207 22 185 38 -209 -115 151 182 -105 -199 32 235 33 -175 -95 181 170 -86 -191
4162a91K12J90j62k36P3K48L5k66j22K27J85j63k39Q9K78pk50j15K03K25j69k64
$$ -191 21 211 49 -187 -114 134 169 -97 -219 8 193 30 -209 -120 158 151 -99 -214 -11 214 45 -219
4184b19Q9K40P1k65j18K19J91j07k78L7K95N1k51j29J98J76q7k63J0K75P3k38
$$ -219 -130 110 181 -84 -202 17 208 101 -177 -140 155 206 -45 -174 24 200 113 -150 -140 135 208 -30
4206c0j84J94K40j28k91N1K75N6k52j42J80K15j07k31j6K62Q6k24j39J49K34q9
$$ -30 -214 -20 220 92 -199 -148 127 183 -69 -211 -31 184 77 -154 -170 92 178 -46 -185 -36 198 109
4228A09k70K5K27Q9k27j45J57K16o5k64J2J95J26k01j66J18K52n6k55n6K53J21
$$ 109 -161 -136 91 180 -47 -192 -35 181 116 -148 -136 59 185 -16 -182 -64 188 132 -123 -179 74 195
4250A95j86k04J45K25r0j93m3K05J28j74j99J10K31l3k31p4K35J62j98k01Q8K29
$$ 195 9 -195 -50 175 85 -108 -151 54 182 8 -191 -81 150 117 -114 -188 47 209 11 -190 -102 127
4272A27j0k42m2J78J48j11k04O5K27K3k56q5K13J93j59k45J04K37j7k27p2J82
$$ 127 117 -125 -167 11 159 48 -156 -91 136 159 -97 -182 31 224 65 -180 -76 161 144 -83 -155 27
4294B7J42j47j99M0K67J2k32j30K29J67j38k37Q9K24L9k43j23K15J86j35j98K1
$$ 27 169 22 -177 -137 130 142 -90 -220 9 176 38 -199 -110 114 153 -90 -213 2 188 53 -145 -124
4316a24K63M4k19j25J74J85j14k11J4K50N3k45j16J77J90j16k05pK22P0k05j53
$$ -124 139 183 -36 -161 13 198 84 -127 -113 137 190 -55 -171 6 196 80 -125 -132 90 160 -45 -198
4338a98J77K03j29k35N4K26N1k12j47J89K06j04k16k0K44Q9j87j49J04K50q9k68
$$ -198 -21 182 53 -182 -128 98 149 -63 -210 -21 185 81 -135 -155 89 178 -9 -158 -54 196 107 -161
4360a61J7K23J27k37j39J38K16r0k16m4K38R9j50k05J43K19p6k24j5K23J01j89
$$ -161 -144 79 206 -31 -170 -32 184 94 -122 -166 72 171 21 -184 -41 178 102 -122 -137 86 187 -2
4382bj87J58J89p2k07pK00R6j60j74Q9K30l6k31p6K34J50j66k13J37K24n7k38
$$ -2 -189 -31 158 86 -121 -128 72 168 8 -166 -77 153 117 -114 -190 44 194 28 -185 -48 176 119 -119
4405a19rK00R1j35j59P9J91mk26m6J93J31j71j62J03J72J3k09p0J52J37j48j41
$$ -119 -128 72 163 28 -131 -52 139 135 -91 -137 56 187 16 -146 -43 129 142 -67 -137 15 152 4 -137
4428a37K0K03K9j86j21J50J98j29j76L9K10J6j72q4J57J40q6k11N3K03K3j62j35
$$ -137 -117 86 115 -71 -192 -42 156 27 -149 -110 100 116 -56 -140 17 157 71 -140 -87 116 139 -23 -158
4451a58J43J81r6j86RK32M2k23j07J68J52j12j79oJ97M4j27j57J47J72q4k06N
$$ -158 -15 166 70 -116 -107 125 167 -56 -163 5 157 45 -134 -140 57 101 -26 -183 -36 136 52 -154 -149
4474a49K31R0k45j11J65J65p6j99J8K06Q7j99j23J13J75l6k23n0K64R9j91j81
$$ -149 82 172 -73 -184 -19 146 70 -129 -111 95 182 -17 -140 -27 148 112 -111 -161 103 202 11 -170
4496a70J55J74n2j95l3K01P3j46j79J07K12n5j91l2J53J54j83j81J35J93k7k21
$$ -170 -15 159 107 -88 -121 80 153 7 -172 -65 147 92 -99 -131 22 176 -7 -188 -53 140 113 -108
4518a08j9J69J18j49j78J11J84J0k36o6K03J20j67j41R9J88j1k58kJ91J04j47
$$ -108 -127 42 160 11 -167 -56 128 138 -98 -164 39 159 -8 -149 -50 138 127 -131 -133 58 162 15
4540A5j43O9J89J2j89r4J46J66j29j73R4J92m5k04m3J70J18j27j82M0K23Rj89
$$ 15 -128 -59 130 142 -47 -141 5 171 42 -131 -37 155 110 -94 -137 33 151 24 -158 -118 105 114 -75
4563g5p8J46J69r6k24J03J85K5k28n0J68J13q7j88L5J99K7j97p9J57J23p4j78
$$ -75 -153 -7 162 66 -158 -55 130 155 -73 -123 45 158 71 -117 -82 117 144 -53 -132 25 148 74 -104
4586a04J5J93J1j73p4J22J20p0j41qJ48O2j18j02Q3J37j1k12kK13O9j80j49J65
$$ -104 -89 104 115 -58 -132 -10 110 40 -101 -109 39 101 -17 -119 -36 101 90 -122 -124 89 158 -22 -171 -6
4610fJ53q4j64RJ64O2j20j36Q9J44jk20j8J92Q3j58j35R4J99n5k09J5J47P4j07
$$ -6 147 63 -101 -92 72 134 14 -122 -33 111 110 -110 -128 64 147 -11 -146 -52 147 92 -117 -102 45 119 12
4635A2j23N1J84k5j80n3J67J21j34j85J25J68l0j82k3J60P7j14j39M7J84Rj93
$$ 12 -111 -60 124 99 -81 -134 33 154 20 -165 -40 128 98 -84 -107 53 130 16 -123 -76 108 117 -76
4658g6n9J60J22j12k09J28K01m9j87n9J72J38j33j62N6J64J8j72r5J79J34j31
$$ -76 -135 25 147 35 -174 -46 155 106 -81 -140 32 170 37 -125 -69 95 113 -59 -154 25 159 28
4680B8j62L9K05k1j59o4J66R4j24j44M3J58O5j90n0J40J21q7j97O9J92jj93m8
$$ 28 -134 -95 110 89 -70 -134 32 126 2 -142 -99 59 124 -66 -116 24 145 58 -139 -70 122 121 -72 -120
4704a20J60J00q4j49N2J57Lj54q2J48R5m4k07K4J97lj57o6J31J12j00j30LJ84
$$ -120 40 140 56 -93 -41 116 119 -35 -117 31 126 82 -125 -101 96 93 -64 -130 1 113 13 -117 -114 70
4728G0J5j20r3J14J32o9j58J0J71O5j37j29J24J27m9j60K4J26N2j20r2Q4J04J0
$$ 70 85 -35 -128 -14 118 49 -109 -99 72 137 0 -129 -5 122 73 -87 -63 63 115 -5 -97 -13 91 101
4752A01j53m5J63N2j42j18J13J57n0j73J1J27N3j02j02P2J20k2j34o1J66R9j39
$$ 101 -52 -97 66 118 -24 -142 -29 128 78 -95 -84 43 96 -6 -108 -36 84 62 -72 -133 33 132 -7
4775gj44R8J37k2j52oJ37R7j06j31O4J14K5j42p9J44J19j20j41N6J61j4j51l7
$$ -7 -151 -53 84 62 -90 -96 41 138 32 -99 -35 79 104 -38 -117 27 146 26 -115 -59 102 88 -63 -100
4799a00J26P1q0j04L7J07L9j42r9J41J02n6j87M8J72rj43n9J26J11j03r2L7J22
$$ -100 26 97 17 -87 -50 57 96 -46 -145 -4 98 42 -145 -97 75 66 -77 -136 -10 101 -2 -94 -57 65
4823F5L6j61n4J14J56j24j36M7J55L0j81p7J56J16q4j56N1J13M0j32j11J16J10
$$ 65 101 -60 -114 0 156 32 -104 -57 98 128 -53 -130 26 142 58 -98 -47 66 106 -26 -137 -21 89
4846H9m1j72oJ94M1j76q9J58J20j02j12j0J57N8j50p2P7J46l7j62rJ80M4j57q5
$$ 89 48 -124 -130 64 105 -71 -160 -2 118 16 -96 -106 51 109 -41 -113 -36 110 73 -89 -98 82 126 -31 -116
4871a16J33J06q2j13J9J29L0j22r1Q6J28n6j34rJ46L8j23p3O4J55r6j43M1J07
$$ -116 17 123 41 -72 -53 76 106 -16 -107 -21 107 51 -83 -92 54 92 -31 -104 -40 115 19 -124 -83 24
4895B4M7j12n8P5J07m0j44j6J70O7j38q6O9J22l5j36J4J22K4j01n8L4J47l0j07
$$ 24 71 -41 -99 -24 83 43 -101 -117 53 120 -18 -104 -35 87 52 -84 -70 52 76 -25 -83 -49 98 68 -39
4920c9o0J16P3r0j20O3J40l8j26jJ12O2q2q8M9Q8k6r1n2J03J11q2j47N2J29K1
$$ -39 -99 17 90 0 -120 -57 83 45 -81 -82 30 92 10 -78 -29 59 33 -58 -110 -7 104 22 -125 -73 56 77
4946G7j38m2R2R3q5r4N9R3M9j05q3Q2J27o5j40L0J67rj40m2Q0R2p5r4L0P9L7r7
$$ 77 -61 -103 -11 82 -3 -97 -38 55 104 -1 -84 -2 125 60 -80 -50 117 108 -32 -74 6 98 23 -71 -41 38 75 -22
4974b2r6O9J32m6j43%J48K1j05j04J39Q0n8j00L8R8L6q5q2N0J39k1j60j4J68M4
$$ -22 -118 -49 83 37 -106 -106 42 63 -42 -146 -7 73 15 -85 -47 51 87 2 -80 -30 109 88 -72 -86 82 126
5000A26j54r9J36R2o7j02J4J15J4j02q4O7J04j6j19k9J57M5j25j17J33J02o0j23
$$ 126 -28 -127 9 101 34 -68 -54 61 75 -27 -111 -44 60 44 -75 -104 53 98 -27 -144 -11 91 31 -92
5024i2QJ45mo3q1O2J07nj47k4J63M4j04j02P7J35p3j38J6J01O7r4q9R3R4l2j26
$$ -92 -84 61 57 -6 -87 -25 82 77 -70 -94 69 113 9 -93 -16 119 46 -92 -76 25 92 -2 -91 2 96 64 -62
5051f2m0J25Q5j12j04O7J45o6j09j7J40Lo8o9N0Q8l3o1l1N8J12j07j00P8R7j4
$$ -62 -102 23 108 -4 -108 -41 104 38 -71 -88 52 55 -13 -82 -32 56 23 -38 -69 -11 101 -6 -106 -28 69 55
5077E5j11j9R9L7o0n9L8N2Km5l6L9Q1n6q3LJ32j0j29k0J13M6q4n3L7P5no3n3O2
$$ 55 -56 -75 24 61 1 -58 -20 32 34 -11 -47 -8 73 17 -66 -63 69 59 -70 -90 23 69 -15 -68 -31 44 39 -24 -77 -15
5107a5M5Jj16JJ07L0j15k9J19K6k5o1J2O4J3n9m2L7P2Jj13k5J18N0j11p7Q3J09
$$ -15 30 31 -85 -84 23 53 -62 -91 28 54 29 -32 -20 44 57 -2 -44 -7 65 66 -47 -72 46 96 -15 -92 -9 100
5135A00o0j08j4J28%n3q1L4R0Kj05k1R3R9j40o0N3J18l3j18RJ09J9p0p0K5Q6J8
$$ 100 40 -68 -82 46 46 -7 -88 -54 36 38 -67 -88 5 104 -36 -96 -43 75 42 -76 -67 42 61 -9 -79 -54 32 50
5163E0j12l5J20Q3q1j31R0R2j1j46K5J06K6q2p6M1J05kq0p5Q8J02r8j09M7J28
$$ 50 -62 -97 23 106 25 -106 -16 76 65 -81 -56 50 76 -6 -82 -41 64 62 -18 -93 -5 97 -1 -110 -63 65
5189F5qj24RJ05J9p8p6O6M2Rq6l3R2P5p8r4M5J62o8j22pJ28K8r3m2O4O2l3p3q
$$ 65 57 -67 -58 47 66 -12 -88 -22 20 29 -57 -90 2 77 -1 -95 -50 112 44 -78 -85 43 71 -22 -64 0 62 29 -44 -52
5219e2O9M0m3j11N3J02lj18rR8M3r6n6O6N9k3o7rN8L5l1n7j3J15Nj19k5J28K3
$$ -52 17 57 14 -97 -44 58 55 -63 -72 26 69 -27 -83 -17 42 19 -48 -57 1 36 5 -52 -65 50 55 -64 -89 39 62
5248F2n5p6N1Q6l7n3k6N0L5Kq2J9O5K7r6m0P6L6o4k6j5R6m5j4Pj5N6po5l7R4J1
$$ 62 7 -69 -18 68 31 -22 -48 2 37 39 -43 -24 41 68 -28 -68 8 44 -20 -46 -61 35 -10 -24 -17 -32 24 17 -48 -85 9 20
5280B0l6n4N5P7m0p0K7M9K6k2n4PP8mp8m2P8O4m7r3M6Q3l6j04NR5ko5j5K1O7p
$$ 20 -16 -70 -15 62 22 -48 -21 28 54 32 -22 -15 63 59 -19 -61 17 81 34 -59 -13 70 34 -70 -65 30 28 -37 -52 -31 36 29
5312B9o8o4Q2P6n6p4NJ28Mj06l7J32J3p5n5N4O1qo9l8N6Q9m4j25L8J50j7j33m6
$$ 29 -39 -103 -21 55 -1 -75 -70 58 62 -44 -81 51 64 -11 -66 -12 49 41 -28 -66 -10 79 35 -90 -52 98 81 -52 -98
5341i8J23O0r0o4O1O0J5j12NM3P0m9j15J3J10J1j24k5J30M5q5q1P5N2lq3pQ4L7
$$ -98 25 85 -5 -69 -8 52 67 -45 -40 3 73 24 -91 -78 32 43 -81 -106 24 69 -16 -97 -22 30 27 -56 -63 21 58
5370E8k6j05K2J09kj03l8J32N3j05o8P2P0k0p2j1N0M0k2n4m5Q9L1r0n0J21K3q8
$$ 58 32 -73 -51 58 56 -47 -85 47 100 -5 -73 -1 69 49 -23 -34 16 56 34 -20 -65 24 55 -35 -85 36 59 -29
5398b9m7O1O6l5q4K8L8K5mq4K6N8K2q4l0R1M3p0m0M7P1m3l0K7k0L3rl2k6M9Ml1
$$ -29 -76 -15 51 16 -68 -40 -2 23 19 -65 -39 19 41 -43 -73 18 61 -9 -49 -2 69 26 -4 23 3 36 27 -5 -31 18 22 -9
5430im5J4R1k9o4jQ4l9j2l7L3K1lk4k3L0O1m3m7J0P3k1p5J3M1N2m0j9lN5j3j2
$$ -9 -54 -40 51 22 -42 -43 41 2 -10 -47 -14 7 4 -20 -43 -13 48 5 -42 -32 41 20 -55 -42 -1 51 11 -8 -11 44 31 19
5462A9p5L9P6k2p4JR7mj04nR0K2n9l5J5M9J3n2m3J2N8Mp3k4J04J8r0o7J00P7o6
$$ 19 -56 -17 59 37 -37 -36 61 57 -47 -52 38 60 1 -34 -19 30 43 -9 -52 -40 18 22 -51 -75 29 47 -43 -110 -10 67 1
5493Am9L3O7j3o0l1L6O9j5r9NJ12K1q7q2R2P6p4n2L8P1j1n4o2N0O0l3p6JR3M4
$$ 1 -48 -15 52 39 -21 -52 -16 53 38 -61 -56 56 77 -10 -92 0 76 2 -50 -12 59 48 -6 -68 -18 42 9 -67 -66 27 71
5524G1j26n9J14P7j10o6O1R3j6p7j8M6M6np9J0Q0K6r8l6O5R6p9q7M9P8k0o3mP0
$$ 71 -55 -114 0 77 -33 -99 -38 55 39 -38 -56 -10 36 31 -48 -38 42 68 -30 -66 -1 95 16 -71 -22 56 36 -27 -31 39
5554C9Jj9p4J9N2M1r1o6J21L5o5p8O0P1k5o1K9j3K2jl6J8M1K4l8p0P1K5pm7oQ3
$$ 39 40 21 -53 -34 18 59 -32 -98 23 58 -7 -85 -25 46 21 -40 -11 -24 -2 -3 -39 -21 20 44 6 -64 7 32 25 -22 -28 55
5586E5k2p2J4L8J4j1k6jnM5j4k2j1M3jn7j1P3j0o5L4MJ2j9Jk3J0M7Mn3k0N4L0
$$ 55 33 -39 -25 13 27 16 -10 -11 -16 29 15 -7 -18 25 24 -33 -44 29 19 -46 -12 -8 4 -15 -14 -37 -27 20 24 -29 -49 5 35
5619C5m6k1K0K0Nl4nM0%l2J0j9L8N7n5n8P5L2n5o5O3O9n6n8K1M5j3j5m0L4K0o
$$ 35 -11 -32 -12 8 13 -21 -26 14 14 -18 -8 -27 11 68 13 -45 30 62 7 -58 5 74 18 -40 -19 26 13 -2 -42 -8 12 6
5651Fm5l5N8Q3q2r8N0J28l0j07J0R9Mo1lJ2K0K1l7o7Q1Q6r4q4R4J06q2j06N6Q0
$$ 6 -39 -74 -16 67 -15 -113 -63 65 35 -72 -62 37 41 -20 -23 -11 9 30 -7 -74 7 93 -1 -85 9 115 33 -73 -17 63
5681F3nj01QL8L1on5mM8N2j04p1N8J18n8j15L0J22l5p2J1L8N2n5l4L2N1Mn1n4
$$ 63 58 -43 -35 3 34 28 -27 -31 17 69 -35 -106 -48 70 12 -103 -73 49 14 -58 -47 -9 43 -12 -46 -14 37 41 -10 -64
5711f4O6R2p2p9J9R4l3q4J6N1K8l2l9JN7oqp4O6M7l0o6qJ13m1n3OM2rj8j3j4K8
$$ -64 2 94 22 -57 -38 56 23 -61 -45 6 34 2 -37 -36 21 15 7 -67 -1 46 16 -50 -58 55 14 -39 -33 9 0 -18 -31 -45 -17
5744a7L6k5rkN0k3m5OP2Pp4j8O6K2p0L0L4n9M9k0j2j2JL3k7k3L5M4j04K2K3J8
$$ -17 19 -6 -15 -17 33 10 -35 -29 43 50 -24 -42 24 46 -24 6 40 -19 30 10 -2 -14 -13 20 -7 -30 5 49 -55 -33 -10 8
5776Hl7J6J2j6K2J9m1n4O7J6l1k2K6M4qo5K2N3j6k1KpJ1M6l6n6L8N5oq9L4P5j5
$$ 8 -29 -13 -1 -17 5 24 -17 -71 -4 12 -19 -41 -15 29 21 -44 -22 31 15 -6 -4 -11 0 46 10 -46 -8 47 41 -48 -14 61 46
5809D6r9pQ7Ln8J1K3NMk4n2K6P8k4r0K7R1l7o7k8J27j4l4l6L1L3Qk9m2JJ05k7
$$ 46 -53 -60 27 30 -28 -17 6 11 15 -9 -61 -35 43 19 -71 -44 47 10 -57 -85 42 28 -6 -42 -11 22 30 1 -41 -40 65 38
5841C8q8J5J11k3r8j3R5K0r6j8P1L9l5n0nO7j4Op1nJ07pj20LJ25%j01k5Q4L2m9
$$ 38 -50 -35 76 53 -45 -58 37 57 -39 -57 14 53 18 -32 -37 30 16 22 -49 -54 53 46 -74 -71 54 54 -47 -72 12 44 -5
5872el6L0M1Rk4n5K1O8k1n0k0Q1K5j04k5Q6L9n9k7K9M8k9k9rqM6J0o9lN6J8p7
$$ -5 -41 -11 30 39 15 -40 -19 49 28 -22 -42 39 64 -40 -65 21 60 1 -26 3 51 22 -7 -16 -24 22 32 -37 -40 16 34 -43
5904d3l3R9K5r0k9O2Kj4J3k8OJ1L1n1oM7O7q0j4Q7mn5j1N2j5n7K9K6k0J7j2Mk8
$$ -43 -76 23 48 -42 -71 -9 -7 -21 -8 -36 -30 -19 12 -39 -45 2 69 -11 -25 62 58 3 -8 44 29 -28 1 27 7 24 12 16 -12
5937a2%N2k0o9N1J1k9l3O2j3k5K2qnl4P8l0m3nN9L7r0J6O5l4j8KK9KKJ5k2l5Q0
$$ -12 -12 40 20 -49 2 13 -16 -49 13 0 -25 -3 -11 -16 -50 28 -2 -45 -50 9 46 -44 -28 37 3 -15 -13 16 18 20 35 13 -22 58
5971E8Ko8j1P9J0r6kM6K6l2o9N1L7m3lpqK9N9r7k9P2O6j15j9O9M1n9k3L4L4j9
$$ 58 60 -8 -19 60 70 -26 -28 18 44 12 -57 -6 31 -12 -15 -22 -30 -1 58 -39 -68 4 70 -45 -64 5 46 -13 -36 -2 32 13
6003A3m2KM3mM3o6k8P8M0j02o1R2P2p5o1R3rj3l6%K6J9k7l5J4P0j5r1k2J06L0
$$ 13 -29 -27 16 12 55 -11 -39 39 79 -23 -84 8 80 5 -56 37 28 15 -21 -21 5 24 -3 -38 -24 46 31 -60 -82 24 54
6034E4q0m1N0O7o2o6P6J5j7k0oPJ9J9k8m9O1O6p2m1P4M3j14J0L5M7l4k3JL1lJ0
$$ 54 -26 -67 -17 50 -12 -78 -2 13 -4 -24 -30 -23 -4 15 -13 -62 -1 65 -7 -48 26 69 -45 -35 0 47 13 -10 -9 22 19 29
6066B9o7JM7j1j4m7N3N5n4n2M7M0o5nL7Ql0M0k5Lk2N8j7m8M9M6l4m5L8L6n8k9
$$ 29 -38 -37 10 -1 -15 -62 -9 46 -8 -60 -13 27 -38 -43 -6 2 -28 12 -13 -10 -32 26 9 -39 10 56 22 -23 15 51 -7 -36
6098c6Q0l2j7J2J8j5k1K8Nm2L0%pl6j0O3m7OJ5Ml9J1L1j6m2M1O0l8m3M6OJ3o9
$$ -36 44 12 -5 7 25 10 -11 17 22 -20 10 10 3 -33 -43 20 -27 -21 -6 -2 -41 -30 1 -15 -57 -16 44 6 -37 9 15 28 -41
6131d1M7J2l7M4Op6P0L9o3m1L8N3m3q3M1Q1l4o2L8L4m0Jj0OK3L1o6n3P3M1m3p0
$$ -41 6 18 -19 25 31 -45 25 64 1 -40 -2 51 8 -75 -34 47 13 -49 -11 23 -17 -16 -26 -20 3 34 -32 -85 -12 29 -14 -84
6163h4O0O2n0o1N2N2j4o2L0kL6k4qpM4L3p7l4O1O2l8j10R2P9o8n2mL0K7j9j9k2
$$ -84 -24 38 -12 -73 -21 31 17 -45 -15 -17 19 -5 -13 -20 24 57 -20 -54 7 69 31 -79 13 92 24 -28 -32 -2 25 6 -13 -35
6195c5J9N8p5k1K4J01l6j26P0O4o3m2JR3k6n0J2J0LM2m9j8O5N5o9r0R3O2n2q3
$$ -35 -16 42 -33 -54 -30 71 35 -91 -21 43 -20 -62 -61 32 6 -44 -32 -22 -19 23 -26 -44 21 76 7 -83 10 72 20 -63
6225f3M2Q8k5o1RM0j2l7J1PjJm6k7K2Q4n3k8nR8o6l9L6N7m0k6K3j5qL3Ll7L5L7
$$ -63 -21 67 42 -19 -10 30 18 -19 -8 -1 -2 -1 -47 -74 -52 32 -21 -49 -54 44 -22 -61 -25 32 -8 -34 -11 -26 -34 -1 2 -35 0 37
6259C7j2m0J1N6m3m8M8L1l6l2L7mk8K6K9k6k4J5K8n9qN9k2m1M6J8n1kM2J3p5Q
$$ 37 25 -15 -4 52 9 -39 9 40 4 -28 9 5 -23 3 32 6 -18 -3 25 -34 -42 17 -5 -46 0 18 -33 -35 7 20 -55 -47
6291d7M4J1n7K3O8m3j2L1Rm8RL2l0J6J0J5p1L9M0j2n1lQ8l3l9%M2np1J8NJ5K0
$$ -47 -3 8 -49 -26 42 -1 -13 18 27 -21 -12 20 -10 6 16 31 -40 -1 39 27 -24 -27 61 28 -11 -11 31 26 -45 -27 -22 -7 13
6324A3j0k9lO8l4o9OJ00j8q7K3N2J5q8K4M3K7k5l9KM6M1l3n4M5O0n4n6K5P4j6
$$ 13 3 -26 -29 39 5 -64 -58 42 24 -63 -40 12 27 -61 -37 6 33 8 -31 -29 17 58 25 -29 16 76 22 -34 -9 65 49
6355D9o6rN5j2m5N%L5Oj8k5j9P6l1q3L2R5k8j07L7Q1Nq1J4K6K3k5K9k5k0O7k8
$$ 49 -17 -26 29 17 -28 -23 -23 12 18 0 -25 -44 32 1 -82 -50 45 17 -90 -53 28 33 -48 -34 -8 15 -10 19 -6 -26 41 13
6387A3n7M8O0l3q3J8N9L3j01RM3L1p1J3pK8jNk8j9Q9m4o6J9P7j3q1K5O6l3l2k1
$$ 13 -44 4 64 31 -52 -34 25 58 -43 -34 9 40 -31 -18 -25 3 2 7 -21 -40 49 5 -61 -42 35 22 -59 -34 32 -1 -33 -54
6419e4M7Om2M2Jm0K7qMj1N5%o6L6K0J0o0M9L2n9l6Q0j7j0j2%M5n3KJ5roQJ7o6
$$ -54 -7 -1 -43 -1 0 -40 -13 -21 -17 -28 27 27 -39 -3 17 27 -33 16 48 -11 -47 33 16 6 -6 -6 39 -14 -12 3 -6 -12 -4 13 -53
6454e3L2M4n9j8O0J6n0j1L6M5n9j1K5J4l6L1Kj1K7j2k2j3M2L2m8k9O4J7q0kN5
$$ -53 -21 23 -36 -54 6 22 -28 -39 -3 42 -17 -28 -3 11 -25 6 8 -3 24 12 -10 -23 19 51 3 -26 38 55 -25 -27 28
6485B8J8o5j0N2j4j6ql0K6K5Rm2k8Q2K0j15%Q5K7p4l8O7K4l1kkJ9QK6o1j4J09
$$ 28 46 -19 -29 23 9 -7 -15 -45 -19 6 15 -27 -55 27 47 -68 -68 17 44 -30 -68 -1 23 -8 -10 -12 7 15 41 -20 -34 75
6517G5k6q3k0R5K5r7J2L0K1l4j5J6J6j9jl0lO0k2n1jQ2Qq0k4P9K9n5m1M9K3m1
$$ 75 49 -34 -54 41 66 -31 -19 11 32 -2 -17 -1 15 -4 -5 -35 -38 22 0 -51 -52 30 38 -42 -66 13 42 -13 -54 -5 18 -23
6549b3%lL2JK3m9kN0J1p5pQ8%o8j0P3K5p6k1M1J4Lm7J4J4K1mn3k2N8J7p4j2P9
$$ -23 -23 -26 6 7 30 -19 -21 29 40 -35 -42 46 46 -22 -32 41 66 -10 -31 10 24 27 -20 -6 8 29 25 -28 -50 8 25 -49 -61 18
6583A8qj3j9J8K5n3OL7k0k8L7j6%J9L0m8lL0J8l1j3N2rl8M5lmn9K9K6k7oL2j0
$$ 18 10 -3 -22 -4 21 -32 -26 11 -9 -37 0 -16 -16 3 33 -15 -18 12 30 -1 -14 38 29 -9 36 33 29 -30 -1 25 -2 -8 24 14
6617A4l1M1ln1L0Qj1n2J0M8l4j6N1K3l6k6K5L6oo3N8j8j0L0j5rL8Mj4n2M7L6n0
$$ 14 -17 24 21 -30 0 8 -3 -55 -45 3 -31 -47 4 27 -9 -35 -10 26 20 -43 15 -3 -13 17 2 -7 31 35 21 -31 16 52 2
6650Bm9N8O0q1rJ9K5j3k8lJ3J4j0jn3N9J8m1k4L2M9p4k2L9P2o4j1J3L2l0L3o8
$$ 2 -47 11 71 -10 -19 0 25 12 -16 -19 -6 8 -2 -3 -56 3 21 -20 -44 -12 37 -37 -59 -20 52 -12 -23 -10 22 -8 25 -43
6682d3MO0J0m6l7Q9K0o0n0N1L6m5l3K2O7m5l1LL5K2Kn6k3L0P2q2k2M0O1o1mkJ3
$$ -43 -39 21 31 -15 -52 37 57 -3 -53 -2 34 -11 -44 -22 45 0 -31 -28 7 29 31 -25 -48 -18 54 -28 -50 -10 51 -10 -14 -16 -3
6715cJ1m7L7L8m1K1k3pM6qm5oP7j2n9k4M6Q9p2l6L9K2m3j7K8%Lk3j7rJ5O6p7k
$$ -3 8 -39 -2 36 -5 16 -7 -14 32 24 -21 -27 50 38 -21 -45 1 90 18 -18 21 43 0 -17 11 11 14 -9 -26 -35 -20 46 -31 -33
6749c3O4%m5k6M1J2k2l5K4J7K0k3J9j2K3j3qj5L2K0n2NJ8L9m5j4N0k2l3J1K5K
$$ -33 31 31 -14 -40 1 13 -9 -44 -20 -3 17 -6 13 1 24 11 3 -12 20 40 -12 -7 11 50 5 -9 41 19 -14 -3 22 24
6781B4j7KJ7j6m5K4J1l9K4K4n6L1QL2n5QK8j2l9J3N1nk4K4KNnmlj1N0l2m0L5M1
$$ 24 7 9 26 10 -35 -11 0 -39 -15 9 -47 -16 -8 24 -31 -23 5 -7 -46 -33 18 13 -11 13 15 20 15 11 8 -3 47 15 -25 10 51
6816E1l0o0L0N8np0J6K1J2m5RJ8j5K4j5J0k5M9k7m8K2N7k6q3N9M0mn3J2M3k4J
$$ 51 21 -39 -9 49 44 -26 -10 11 23 -22 -13 5 -10 14 -1 9 -16 33 6 -42 -20 37 11 -72 -13 27 23 -30 -18 25 1 2
6848BkklK7m2RJ6P7o1n2L6O5l7q0M9N0oo6L5j9M6m1k4oM7K0m5n3M4P2n5n7NP5
$$ 2 0 -2 -5 22 -20 -11 5 82 21 -31 5 70 33 -47 2 52 46 -20 15 -4 42 1 -23 -29 18 38 -7 -60 -16 56 1 -56 -51 24
6882B4no9J4L4%k9ML0nL4k9k4K2K8J7n4MO5l2n3J6P1n6k9K1L1j0m6K3MPj6j2q
$$ 24 19 -50 -36 -2 -2 -31 -27 3 -2 32 3 -21 1 29 46 -8 -4 61 29 -24 -8 63 7 -22 -1 30 20 -26 -3 1 8 -8 -20 -28
6916b8M2L2n8l2L6J9rm1K1P0m4m1K4K5k9J1Lj3KM2k9j6J8M7o0k3N1L5o0NLJ3r
$$ -28 14 46 -12 -44 -8 11 2 -39 -18 52 8 -33 -9 16 -13 -2 1 -12 -10 32 3 -13 5 52 -8 -31 20 55 -5 0 3 16 7
6949Gk4K6J1j3j9j7L5k0K4Qm4%M7l6lJ5J8k9l4P1k2j1lK4J8oj7Pj0KJ1k2KL4%
$$ 7 -17 9 20 7 -12 -29 6 -14 10 18 -26 -26 21 -15 -18 -3 15 -14 -48 23 1 -10 -13 11 29 23 6 13 3 5 16 -6 -4 30 30
6984C0n3QN3ll1m9R8rk7k2J8L2l0nk1JkK5m2NK7L4p2kL8K0o2jP6j9j7k5L7j3K3
$$ 30 -23 -15 38 35 4 -45 53 44 17 -5 13 45 15 10 -11 -10 -12 13 -29 -24 3 37 -35 -37 1 21 -41 -42 34 15 -2 -27 10 -3 20
7019B0rl3J8L9pm7K3M1kp5RO6Mm1l0K9N2l6l0j5J4Rk2Kj9Q5pp0k2P9Ko2j0O2l
$$ 20 11 -22 -4 35 28 -19 4 45 43 -32 -23 43 47 6 -24 5 57 21 -9 -24 -10 -1 -23 -21 -40 45 38 -32 -54 25 27 -35 -45 17 14
7054A4n3J0L4RoNj9K8J2j8l0J1L6Ro8ML9K0n4jL5l6jOPKL3m2nMJ2J4m2QL6%m1
$$ 14 -39 -29 5 14 8 13 -6 22 34 16 -14 -3 33 42 -26 -22 17 37 -17 -18 17 -19 -20 -14 -7 -5 28 -14 -19 -15 -3 11 -31 -23 13 13 -28
7091b8lN7k2m8K8Qj1QLJ4MJ9l3MLJ3Ok8oQ5n0m3J6L2j9m4K0L8j2j0J2kk8K9k2
$$ -28 -31 26 4 -44 -16 -8 -19 -11 -8 6 10 29 -4 0 3 16 22 -6 -12 73 23 -20 -4 28 9 -35 -15 23 11 1 13 11 -17 12 -10
7126a0j9J8j3qPK8K5j4p0M2J7j1l5L5K6k7k0M1l1PL7k6lK1J5%k1J1OJ6p8N3J3
$$ -10 -29 -11 -24 -32 -25 3 28 14 -56 -14 3 -8 -43 -8 18 -9 -29 12 -19 -12 25 -1 -4 17 32 32 11 22 28 44 -34 19 32
7159C2o2k0M6K4l7N%J2jmkqLK7k6l6N2Pj7m3L7K5k2j2J1QNk3J5J5J3kk8j1J1M3
$$ 32 -30 -50 -4 20 -17 -12 -12 0 -1 -5 -7 -15 -12 15 -11 -47 5 12 -5 -48 -11 14 -8 -20 -9 -1 4 -19 -4 11 24 22 -6 -17 -6 37
7195C7l5k8O3K6n0m8L2K5l2kK2Oj7qk6J5M5J0p1nRN4m9j1M4Qk5k3K1K7Ll8J4J9
$$ 37 2 -26 37 63 13 -35 -3 22 -10 -12 10 16 -1 -9 -35 -20 25 35 -36 -41 -32 22 -27 -38 6 14 -11 -34 -13 14 17 -21 -7 12
7229A2pLk3JK0K9j8l2L4L1m5k3M0Jj8k5L0J6j6%jl5L3J1l2J2rLK5o4M8Nm2K0O
$$ 12 5 8 -15 -14 6 35 17 -15 19 50 5 -18 22 23 5 -20 10 26 10 10 9 -26 7 18 -14 -2 -11 -8 17 -47 1 6 -36 -16 -10
7264a0Pl1NK9qqRK2knJ2k3NRJ9k7rN2%m5k1L3Qm6K3L1j9k6K2Kk2J5K3k1m1O4l7
$$ -10 -3 -34 -29 0 -8 -16 -7 15 13 8 20 -3 2 11 30 3 -6 46 46 1 -20 13 21 -25 -2 29 10 -16 6 8 -14 1 24 3 -38 26 -11
7301a1m9L1K0j1j8K0J6mOmqK1j7K8jl0L3Jk6J9j0Nl0K0L6l3k9N2L0k5n1PN2n0
$$ -11 -60 -29 -9 -20 -38 -18 -2 -6 0 -4 -12 9 -8 20 19 -11 22 23 -3 16 6 11 -19 1 37 4 -25 27 57 32 -19 -12 40 -10
7335a0qj7J5J3K9m7k3M1L2l1m3O1J5l7j6J6L2Km8MJ5jJ3oRJ8Pl9k3K9M3m4k3K7
$$ -10 -18 -35 -20 -7 22 -25 -48 -7 25 -6 -49 12 27 -10 -26 -10 22 24 -24 -20 -5 -6 7 1 10 28 35 -4 -27 2 45 1 -22 5
7369EL4k8j9ML4j3j3j8K7k3K7k2k3K9K2k9lQJ6m2l9P3jj1k6K0J3J%j9RML1k3k8
$$ 5 39 11 -8 -4 30 17 4 -14 13 -10 17 -5 -28 1 23 -6 -9 -1 15 -27 -66 7 6 -5 -31 -11 2 3 3 -16 -7 -3 28 5 -23
7404b3N1L3n1l9L6K1ql3J5J2j0%mMmk1qJ7mK5j6lK1jl9NJ6K0k3n%L6k4J5k6K7
$$ -23 28 61 10 -29 7 28 20 -13 2 14 4 4 0 4 0 -21 -29 -12 -16 9 -7 -10 11 10 -29 -24 -8 12 -11 -16 -16 20 -4 11 -15 12
7440A2J1j1k6J1L2jk3k1L1j1mKJ7J4m3j8J3L8m0JK2l8K0jnLPJ0m1NJ7nk4K2K1
$$ 12 23 12 -14 -3 29 28 5 -16 15 4 0 2 19 33 -10 -28 -15 23 -17 -16 6 -32 -12 -13 -18 -15 -8 2 -39 -34 -17 -22 -46 -24 -3
7475ckrKK8Pk0j5J1J5k2jK0rqK4j4KJ6J4o6K9K6j4k1k2N6l3J8k7rL6j0j6j9RJ0
$$ -3 -5 -14 -12 16 23 3 -12 -1 14 -8 -9 11 2 -6 18 4 6 22 36 -30 -1 25 11 -10 -32 24 -9 9 -18 -27 9 -1 -17 -36 -27 -17
7511a7Nj9kL3L1n8JL2K1l8k0M0%rPj9PJ0jk1j3P3j9j7ML2k8m1J7N7m3k5K0PJ2
$$ -17 -12 -31 -33 0 31 -27 -26 6 27 -11 -31 9 9 0 7 -12 -5 5 4 -17 -30 43 24 7 11 43 15 -26 -9 48 5 -20 0 7 19
7546A9qk7Oj5J3J2m4K3L6j2j8l0P7m2j0N%J7k3K5%JJ5j9j3QL9qp3L5L9j8j2mN7
$$ 19 11 -16 -10 -25 -12 0 -44 -21 15 3 -15 -45 32 -10 -20 -15 -15 2 -21 4 4 5 20 1 -12 -4 35 27 -46 -11 28 10 -2 -6 51
7581E1k6k8mJ3Lqk4Mj3L8k4rJ2lJ1l1J6M1pm1K7oPk0L2j1K0k4mMK5nk6K8rPj1
$$ 51 25 -3 -7 6 9 1 -23 -19 -32 6 -18 -27 -15 -18 -7 -38 -22 19 12 -29 -2 -8 -1 -21 11 0 20 -4 -8 -4 21 16 -10 18 9 16 5
7618El0K0M3n2nJ2n%J2NQj8k9L3pJ9rrk7MM4j3j4kK2k2j8M4Nj1k2J8J0k6J5JJ6
$$ 5 -25 -5 38 -14 -19 -7 -12 -12 0 5 13 -5 -34 -1 -8 11 2 -7 -34 -30 14 1 -13 -15 7 -15 -33 11 16 5 -17 1 11 -15 0 1 17
7655A7pOOj9K4Jrk2J0K1n4K7K4j6j3j6L0J5k6j3rrJ4J1oJ6%L4l5o8O9j2K8j1o
$$ 17 10 16 22 3 27 28 19 -3 7 28 -26 1 25 9 -4 -20 10 25 -1 -14 -23 -32 -18 -7 -13 3 3 37 2 -66 3 -9 19 8 2
7690BjLj0oK9k6K2Lj2Okjl9M2L1m2krO1o4KK2K7m2j2oJ3L2m1J0j8M4Np1J7L2J9
$$ 2 1 4 -6 -12 17 -9 13 16 4 10 8 7 -32 10 41 -1 -3 -12 49 -15 -13 9 36 -6 -18 -24 -11 21 -20 -10 -28 16 21 -50 -33 -1 18
7727A8k9OL4j2l1LJ7k3M1l9K9j7L2k3jJ2k8N4n8L6%pj2j1KJ4Pk2OL2m6K0j9k6
$$ 18 -11 -5 29 17 -14 -11 6 -17 24 -15 14 -3 29 6 5 17 -11 43 -15 21 21 14 2 -9 -7 7 14 -8 -2 30 -16 4 -15 -41
7761d1M0nqjRj1oJ1j%j4L1jj3J5J0j8J7%Jm6L6j0K7J0j6J0ml3K3J4Kl3j4K2Kp
$$ -41 -1 -6 -14 -15 -6 -17 -23 -12 -13 -13 -27 4 3 -10 5 15 -3 14 14 15 -31 5 -5 22 32 16 26 22 -11 12 26 28 -5 -19 3 5 -2
7798boL1k8J6k7ORok7LL2nk8J5KROm2L9K5j3oJ8k9K6qj0J4J2Rj7j7J9K8m3nPP
$$ -2 -8 23 -5 11 -16 -10 -1 -7 -34 -31 1 -4 -32 -17 -15 -6 0 -42 -3 22 9 3 21 -8 18 10 0 14 26 35 18 1 20 48 5 0 7 14
7836A4j4k5ML8j2j6L3k9RK5j5j9j0J5j1j9J9rk1J6J9JL0l3J6K8Nl4J3j9QK0j3
$$ 14 0 -25 -21 17 5 -11 22 -7 2 27 12 -7 -17 -2 -13 -32 -13 -22 -43 -27 -8 -7 23 -10 6 34 39 5 18 -1 7 27 14
7869A4j7PQJ6l5J5%k2J4NM3n6rK1kJ9k7j6oM6l2j3JK7K5k1l4L3kj8NrN6m6jPK6
$$ 14 -3 4 12 28 -7 8 8 -14 0 5 48 -8 -17 4 2 21 -6 -22 -28 18 -14 -27 -26 1 26 5 -29 4 2 -16 -11 -20 36 -10 -11 -4 22
7906B2koLMk0J1mROnJ0l7J6J4lk8PlJ7k1k3L0K7l5j0QK1J6k0k6J2o%j7M4j6j3
$$ 22 20 14 17 21 1 12 8 17 23 18 28 -9 7 21 18 -10 -3 -6 11 -10 -33 -3 24 -11 -21 -13 8 24 4 -22 -10 -16 -16 -33 11 -5 -18
7943a8OJ2Nm4M0j8L1J8l9J9MMKk3J4J8j7j0LK9m5j1L6j6Oj5qMK5l9J8j7L3opj5
$$ -18 -12 0 5 -39 1 -17 14 32 -7 12 16 20 22 -1 13 31 14 4 7 36 -9 -20 16 0 6 -9 -17 -13 12 -27 -9 -26 7 1 -6 -21
7979b1J5J2k1J8j4J2K1k8jNmK3j5L4jj8%J7j9L0j4l8j1K2K5l9PK0qj2j0prjL4
$$ -21 -6 6 -15 3 -11 1 22 -6 -7 -2 -6 17 2 36 35 17 17 34 15 45 31 -7 -18 4 29 -10 -3 17 9 -3 -13 -20 -29 -30 4
8014Dnk3K7j4nL6j4J0m2J7J7j1J7l1ROJ7k2J1K9k1Mk5J9RRk4oK2%m6L2Nkj8K4
$$ 4 -1 -24 3 -11 -16 20 6 16 -26 -9 8 -3 14 -17 -8 -2 15 -7 4 33 12 16 -9 10 19 28 4 -2 20 20 -26 6 11 9 -9 15
8050A5kJ2k0Nj2%K3k8k3J0K2l5J9K2pJ0Nk5K9m6N7k0LLk5JNK0K0l1pL7%k2j6Q
$$ 15 13 25 5 10 -2 -2 21 -7 -30 -20 2 -33 -14 8 1 11 16 -9 20 -26 31 11 14 17 -8 -7 -2 18 38 7 0 37 37 15 -1 7
8086GJ0j3QloJ0l0K3j7RK0j3k3L3k1lPOk4K2j9J0J0J7l6MMPMNRj9J6Ok6K4kJ1
$$ 7 17 4 12 9 3 13 -17 6 -11 -2 18 5 -18 15 -6 -9 -2 4 -20 2 -17 -7 3 20 -16 -12 -8 -1 3 8 17 -2 14 20 -6 18 16 27
8124B7j9L3j3n1J9K9l1K2n0M6qLk9Ok4M3k0Rj8K6j0oMoJ2j2RJ2qmpNJ0J2MqK9
$$ 27 8 41 28 -23 -4 25 -6 16 -34 12 4 7 -22 -16 -40 3 -17 -8 -26 0 -10 -16 -12 -18 -6 -18 -9 3 -5 -9 -16 -11 -1 11 15 7 36
8161C6l0Nj0PJ0j3Qj3RKj3LL6qm5PJ3j1J1Ol3L9qk4J8Nj3k2K8k8
$$ 36 6 11 1 8 18 5 13 0 9 11 -2 1 37 29 -16 -9 4 -7 4 10 -23 16 8 -16 2 7 -6 -28 0 -28
8191b8
$$ Imaginary data points
##PAGE= N=2
##DATA TABLE= (X++(I..I)), XYDATA
0@%%%%%%%%%%%Qj6J6j6J6k4L2m0M8n6O6p5Q9j05J26j49J69j94K26k59K96l37L82
$$ 0 0 0 0 0 0 0 0 0 0 0 0 8 -8 8 -8 8 -16 16 -24 24 -32 34 -41 48 -57 69 -80 89 -105 121 -138 158 -179 203
34B03m32M88n49O15o88P70q57R51j058J174j300J437j588J752j929K125k342K580
$$ 203 -229 259 -290 325 -363 407 -450 501 -557 617 -683 754 -834 918 -1011 1114 -1228 1352
52A352k842L135l462L828m243M716n261N900o661P583q725J0181j2121J4850j8983
$$ 1352 -1490 1645 -1817 2011 -2232 2484 -2777 3123 -3538 4045 -4680 5501 -6620 8230 -10753
67a0753K6058m1349J30641j49191k41924L34314J80021k16455j96317J48843J38270
$$ -10753 15305 -26044 104597 -44594 -286518 47796 227817 11362 -184955 -36112 102158
78A02158k6204j03666o4446L1347J69884K2174k36173r0444K91224J33754l02154
$$ 102158 75954 -27712 -92158 -60811 109073 131247 -104926 -195370 95854 229608 -72546
89g2546j72393K93288J81195k48664j77467J90220J48999j11049j10798K9818
$$ -72546 -244939 48349 229544 -19120 -196587 -6367 142632 31583 -79215 -49397
99d9397N7673N4178k571j25183n4199J82410J00705k16903j35484K30979J51631
$$ -49397 8276 62454 59883 -65300 -119499 62911 163616 -53287 -188771 42208 193839
110A93839k22488j51127J95441J32677j51815j00585R7470N7150l7887q655j9998
$$ 193839 -28649 -179776 15665 148342 -3473 -104058 -6588 50562 12675 4020 -15978
121a5978l9203P1162P9956j11666j08711J39789J22731j54189j20991J55183J04572
$$ -15978 -55181 15981 95937 -15729 -124440 15349 138080 -16109 -137100 18083 122655
132A22655j43499p5520J21539L7994r2531L168N9876m2233k6542P3970n689r4760
$$ 122655 -20844 -96364 25175 63169 -29362 -26194 33682 -8551 -35093 38877 33188 -61572
144f1572L4908J02443o0035r6815P9550P8530r3031n0099J00367J5096j01989
$$ -61572 -26664 75779 15744 -81071 -1521 77009 -16022 -66121 34246 49342 -52647
155e2647K1742R8290n5310q9160Q1342P4981r6420n5749R9049L2538q8711o354
$$ -52647 -30905 67385 12075 -77085 4257 79238 -17182 -72931 26118 58656 -30055 -36409
167c6409O6718k1378l5469M9315j157p5783L8312R8362p1306j14785R5677J22675
$$ -36409 30309 8931 -26538 22777 21620 -54163 -15851 82511 11205 -103580 -7903 114772
179A14772j08757j20824J08627J08570r5353q6462P0239N5613l6089j8106k913
$$ 114772 6015 -114809 -6182 102388 7035 -79427 -9188 46425 10336 -7770 -10683
190a0683k2768M1994O3642p6392j00244J02475J28942j16930j46585J18329J51327
$$ -10683 -33451 8543 72185 -4207 -104451 -1976 126966 10036 -136549 -18220 133107
201A33107j06260j42163Q1967J19181m8140q4174Q607L9847L1937R373o9221n9000
$$ 133107 26847 -115316 -33349 85832 37692 -46482 -37875 1972 33909 43282 -25939 -84939
213h4939R8947J04158j18255j40217J24817J63432j17961j70992R8391J61788
$$ -84939 14008 118166 -89 -140306 -15489 147943 29982 -141010 -42619 119169
223A19169o8439j36018L1621R6390Q073m6629m6200p952P8969O2044j03167j09869
$$ 119169 50730 -85288 -53667 42723 50796 4167 -42033 -49985 28984 91028 -12139 -122008
235a22008J16313J46527j17359j68229J06458J72597q5445j59451N6633J30193
$$ -122008 -5695 140832 23473 -144756 -38298 134299 48854 -110597 -53964 76229
245G6229k3438q8363j0767L8194M2593J4949o8934o5602Q7409J08783r6428j40012
$$ 76229 52791 -35572 -46339 -8145 34448 49397 -19537 -85139 2270 111053 14625 -125387
257a25387R5825J56515q6059j56743O8878J41110m6228j11517K0715P1378N001
$$ -125387 -29562 126953 40894 -115849 -46971 94139 47911 -63606 -42891 28487 33488
268C3488k4960k8475k2907M7698O6878o1295j02670O8565J26410o9643j36343
$$ 33488 8528 -19947 -42854 4844 71722 10427 -92243 -23678 102732 33089 -103254
279a03254O5105J31615n6014j13329M3688Q3875k9454m6822J4767O725n63L2129
$$ -103254 -38149 93466 37452 -75877 -32189 51686 22232 -24590 -9823 -3098 -3661 28468
291B8468j2219o5420K3398Q9846l2458j03254L9531J04748m4352r5049M7065P5743
$$ 28468 16249 -49171 -25773 64073 31615 -71639 -32108 72640 28288 -66761 -19696 56047
303E6047m7764m9639M6121K0023m2258R389L5904l5571k7043N5684J5648o7976
$$ 56047 8283 -41356 4765 24788 -17470 -8081 27823 -7748 -34791 20893 36541 -31435
315c1435k170P1656j2772o6902K8395N5048m3450l7902N6792J8146o6836J875
$$ -31435 -33605 38051 25279 -41623 -13228 41820 -1630 -39532 17260 35406 -31430 -29555
327b9555P2278j9605p1792L3065O4881m1065n1295M2948L1579l9109p281L0384
$$ -29555 42723 23118 -48674 -15609 49272 8207 -43088 -140 31439 -7670 -14951 15433
339A5433j9770j8610M6981N439p1683P114R0948j7427j02441K4215J04506k6718
$$ 15433 -4337 -22947 24034 29473 -42210 -35096 55852 38425 -64016 -39801 64705 37987
351C7987r6310K4925P8163j9088n1362J0559J8338m74J7914r415n3736J7608Q5591
$$ 37987 -58323 -33398 44765 25677 -25685 -15126 3212 2738 20652 11237 -42499 -24891 60700
364F0700k2948j10016K4463J24249k1921j26704J5660J16496o636r4475l933O2353
$$ 60700 37752 -72264 -47801 76448 54527 -72177 -56517 59979 53343 -41132 -45065 17288
376A7288J4349k3241k3241j9070K9272O0248l1452r6102K9607J22907k3745j37591
$$ 17288 31637 8396 -14845 -33915 -4643 55605 24153 -71949 -42342 80565 56820 -80771
388h0771J4860J38587l936j25587p406R9819J7849o3846k6059K1391L1075K3141
$$ -80771 -65911 72676 68740 -56847 -64253 35566 53415 -10431 -36490 -15099 15976 39117
400C9117l2471o5307L0040J00593k4261j25595J5767J37732n824j35983m463J20611
$$ 39117 6646 -58661 -28621 71972 47711 -77884 -62117 75615 69791 -66192 -70655 49956
412D9956J3828r3371k1209N7331K5849j6079k7219k6023K5524O4762k0791r6233
$$ 49956 63784 -29587 -50796 6535 32384 16305 -10914 -36937 -11413 53349 32558 -63675
424f3675J3902J17514n748j26604k572J22914R845j07178j5250Q1262J8011m8224
$$ -63675 -49773 67741 61993 -64611 -67183 55731 65576 -41602 -56852 24410 42421 -5803
436e803j7992J1497J5300K4972j0676n7616M904Q3239Q37r9579n490J05412Q319
$$ -5803 -23795 -12298 3002 27974 17298 -40318 -35414 47825 48662 -50917 -56407 49005 57324
449E7324j00597q610Q6213O640o4205k516L7194k837q070Q414j9960j3340M4503
$$ 57324 -43273 -51883 34330 40970 -23235 -25751 11443 8606 536 8950 -11010 -24350 20153
462B0153J6327o3146j6875P4541J4263p8044q898P3888J079o3217Q256M7397j7911
$$ 20153 36480 -26666 -43541 31000 45263 -32781 -41679 32209 33288 -29929 -21673 25724 7813
475G813k8621K6566Q994l2950R623L5973k5536l4665L7571K8965m4972j8866M7619
$$ 7813 -20808 5758 14752 -18198 -8575 27398 1862 -32803 4768 33733 -11239 -30105 17514
488A7514N508m5920J0018M0614k5821l2790M0052K3519n0996j3779N6860M379
$$ 17514 23022 -22898 -12880 27734 1913 -30877 9175 32694 -18302 -32081 24779 29158
500B9158n6792L932N0173j0979l7430J6438J9585k0371J561K2960k3791k4367
$$ 29158 -27634 -23702 26471 15492 -21938 -5500 14085 -6286 -4725 18235 -5556 -29923
512b9923M4760K4689o1787k4082P3022K2586p6638k0226P2262J6899n9848j2498
$$ -29923 14837 39526 -22261 -46343 26679 49265 -27373 -47599 24663 41562 -18286 -30784
524c0784M0435P182j6124r03j0817o100L7434J3417o0876k0703P8436K7132q8170
$$ -30784 9651 16833 709 -194 -11011 -17111 20323 33740 -27136 -47839 30597 57729 -30441
537c0441l2161Q8873L4865q0215l4858O3082L1646l9042k5227J0815J5887J8927
$$ -30441 -62602 26271 61136 -19079 -53937 9145 40791 1749 -23478 -12663 3224 22151
549B2151m330m6858q323P0133K0985q6271l2066R3537M0417r1331m4875P9727
$$ 22151 17821 -29037 -37360 32773 53758 -32513 -64579 28958 69375 -21956 -66831 12896
561A2896M4803o0166m0070L4534L0932n642j8414k3629L632N0296J1752p1598
$$ 12896 57699 -2467 -42537 -8003 22929 17287 -1127 -24756 -21124 29172 40924 -30674
573c0674k6294Q5585L8286r0741m6411Q6841M9791p4268m7902N4522M1123k9767
$$ -30674 -56968 28617 66903 -23838 -70249 16592 66383 -7885 -55787 -1265 39858 10091
585A0091k9898K667J5509K3999N76m7623j6570O5711L0799p6861m1603P9995M7683
$$ 10091 -19807 -17140 -1631 22368 22944 -24679 -41249 24462 55261 -21600 -63203 16792 64475
598F4475p5315m8476O3474M3844m6176l4305K5309K1020l101n593j8089j0190
$$ 64475 -10840 -59316 4158 48002 1826 -32479 -7170 13850 10749 5156 -12933 -23123
610b3123L6493K4537n0484l5606N9084M2319o1851m3724N8892L9963n0896l1542
$$ -23123 13370 37907 -12577 -48183 10901 53220 -8631 -52355 6537 46500 -4396 -35938
622c5938L9008J9432k4435n373Q739q971O482K1912k0226l1927L1225L7761l8947
$$ -35938 3070 22502 -1933 -7306 1433 -7538 -1056 20856 630 -31297 -72 37689 -1258
635a258l8814M2974L5010m3399k6843M0494J5472l4739k333K7023j0843j7970
$$ -1258 -40072 2902 37912 -5487 -32330 8164 23636 -11103 -13436 13587 2744 -15226
647a5226K2494Q448l1002R64L5487r711l5301J7311L0527k3552k1865K8255J0254
$$ -15226 7268 15716 -15286 -14322 21165 11454 -23847 -6536 23991 439 -21426 6829 17083
660A7083l1297K635L2612j5429l2086K6252K9668l3923k5353L7397J9129l6126
$$ 17083 -14214 -11579 21033 5604 -26482 -230 29438 -4485 -29838 7559 26688 -9438
672i438j1279L0325K179k0563P739Q133j7766N675K7179j9078l5005L0509M0525
$$ -9438 -20717 9608 11787 -8776 -1037 7096 -10670 -4995 22184 3106 -31899 -1390 39135
685C9135l8508m2964M2022M1816m0570l7042L4218K8609k3676j7192J0131L521
$$ 39135 627 -42337 -315 41501 931 -36111 -1893 26716 3040 -14152 -4021 -500
697e00M749J1165j9343k5592L1843L8391m0759m8137M5138N3725m4448n4264L8766
$$ -500 4249 15414 -3929 -29521 2322 40713 -46 -48183 -3045 50680 6232 -48032 -9266
710i266M9656k8753l9959J5620K6087q51r242j3804r036K6922K6814l7013m2433
$$ -9266 40390 11637 -28322 -12702 13385 12534 3292 -10512 -19548 7374 34188 -2825 -45258
723d5258M3075N4023m4511o0505M1195O0925l3679n5229K2738M3855r543k7984
$$ -45258 -2183 51840 7329 -53176 -11981 48944 15265 -39964 -17226 26629 17086 -10898
735a0898m442R150J7753J0829k9027k9764L7188M5837m1384n7205M1276O2877
$$ -10898 -15340 -6190 11563 22392 -6635 -36399 789 46626 5242 -51963 -10687 52190
747E2190l6982o2119K9219N4952j8738m2318O782K5436N218o169j6187j3450K4951
$$ 52190 15208 -46911 -17692 37260 18522 -23796 -17014 8422 13640 7471 -8716 -22166 2785
760B785L1326l0843m5677L3344N5011l2584n8422K8861N5728k2809m7274J5237
$$ 2785 34111 3268 -42409 -9065 45946 13362 -45060 -16199 39529 16720 -30554 -15317
772a5317L4198o930j7873j218L37Q542J6737j4476l1543J8786M2518k1264m8705
$$ -15317 18881 11951 -5922 -7140 -6803 1739 18476 4000 -27543 -8757 33761 12497 -36208
785c6208K1993M9492k1152m5080J8939L6014j5728k3573J1756R104p347N581K856
$$ -36208 -14215 35277 14125 -30955 -12016 23998 8270 -15303 -3547 5557 -1790 3791 6647
798F647j9029J533K9825n683l6807R484L9414j2756l7523J5523L1669j7526k2681
$$ 6647 -12382 -10849 18976 13293 -23514 -14030 25384 12628 -24895 -9372 22297 4771 -17910
811a7910J8852J1726j9155k54J8368j0415j6418J9104J3154k5017q611K7603K851
$$ -17910 942 12668 -6487 -6741 11627 1212 -15206 3898 17052 -7965 -16576 11027 13878
824A3878k6862L705K3011j0668j6881J7466R302k3484j253K7995o266l0279J2400
$$ 13878 -12984 -9279 13732 3064 -13817 3649 12951 -10533 -11786 16209 9943 -20336 -7936
837g936L0024j6434k6856J8099K0883j7303j2339J4309J967r589R246M022k0405
$$ -7936 22088 5654 -21202 -3103 17780 477 -11862 2447 4414 -5175 4071 8093 -12312
850a2312J681L0310o848l7790J0637M1927j2781m2103J2909L8046j1202k9969
$$ -12312 -10631 19679 12831 -24959 -14322 27605 14824 -27279 -14370 23676 12474 -17495
862a7495P908J8533l584m822j110r792N512K3961q945l6081J1003M4988j1408
$$ -17495 -9587 8946 5362 540 -570 -10362 -4850 19111 10166 -25915 -14912 30076 18668
875A8668m9491J0150M9107p400m3835L705L3970M70k0496m649M793Q110J1557
$$ 18668 -30823 -20673 28434 21034 -22801 -19096 14874 15344 -5152 -9801 -5008 3102 14659
888A4659j0524k7082J1614M0014j1192m9117R299N3381o289n2284K518M5910J592
$$ 14659 4135 -22947 -11333 28681 17489 -31628 -22329 31052 24763 -27521 -25003 20907 22499
901B2499l4832n396K0202Q564l475j0596j3594J1419K9258j0838m1901Q987N0192
$$ 22499 -12333 -17729 2473 11037 7562 -3034 -16628 -5209 24049 13211 -28690 -19703 30489
914C0489o203n3269K828N0893N97m3418l728L1588O124j6897p468P46P753J5027
$$ 30489 24286 -28983 -26155 24738 25335 -18083 -21811 9777 15901 -996 -8464 -7718 35 15062
928A5062o959k8895N325L9453l113m5700P89M7287J296m3997k862L6510L670k5593
$$ 15062 8103 -20792 -15467 23986 20873 -24827 -24038 23249 24545 -19452 -22314 14196 17866 -7727
942g727l735J2638K984J101j699j4250J18K5490J359l3752k593L8317L109l8872
$$ -7727 -11462 1176 4160 5261 3562 -10688 -10570 14920 16279 -17473 -20066 18251 21360 -17512
956a7512k887L5526J797k8828Q6J9568k391q954M930j918p153J2024Q733k0225
$$ -17512 -20399 15127 16924 -11904 -11818 7750 5359 -3595 1335 -583 -7736 4288 13021 -7204
970g204r215K5886Q380k8568o207K8262K861k5277J492J9987o192j3365J0716
$$ -7204 -16419 9467 17847 -10721 -16928 11334 14195 -11082 -9590 10397 4205 -9160 1556
983A556O034j4465J071J6841p345j7487J2188J6140j5452j2681J6906P489j6676
$$ 1556 7590 -6875 -5804 11037 3692 -13795 -1607 14533 -919 -13600 3306 10795 -5881
996e881r39J4998o186j2220J3195Q900j9257n292K3556J882k5531J128K4793l510
$$ -5881 -6820 8178 1992 -10228 2967 11867 -7390 -12682 10874 12756 -12775 -11647 13146 9636
1010I636k1243N231J5082o323o942O824k438o899J1927O712k0645o367K7496N886
$$ 9636 -11607 -6376 8706 2383 -4559 2265 -173 -7072 4855 11567 -9078 -15445 12051 17937
1024A7937l1635n356L2460M774k9804m019K3921K998j5185j695M722J02O480J898
$$ 17937 -13698 -19054 13406 18180 -11624 -15643 8278 11276 -3909 -5604 -882 -780 5700 7598
1038G598j7270m070K6409O335l2967q384L6067J0048l5546j0989L1275J0912k3713
$$ 7598 -9672 -13742 12667 19002 -13965 -22349 13718 23766 -11780 -22769 8506 19418 -4295
1051d295r880J3679P683k111m602r718P53K0662L506k9540p654L5385J1325l7583
$$ -4295 -14175 -496 7187 5076 474 -9244 -8491 12171 15677 -13863 -21517 13868 25193 -12390
1065a2390j3984L5966J5309l0630j4976K2179J3022j1494r625k12N047J1733K62
$$ -12390 -26374 9592 24901 -5729 -20705 1474 14496 3002 -6623 -6835 -1788 9945 10207
1078A0207k1989n663K9757J0542l4459j4220L5412J6423l2870j6787K7069J5264
$$ 10207 -11782 -17445 12312 22854 -11605 -25825 9587 26010 -6860 -23647 3422 18686
1090A8686j8721j2033Q790P470J698k037j1665l570K0187Q820k6342j3046K9734
$$ 18686 -35 -12068 -3278 4192 5890 3853 -7812 -11382 8805 17625 -8717 -21763 7971
1103G971J5820l0104j6835K7533J5918k2419j3205J5335R002p178l858j219j774
$$ 7971 23791 -6313 -23148 4385 20303 -2116 -15321 14 9016 1838 -2020 -3239 -5013
1116e013R039P174j5690j1674K0471J4696k3026j5890K3314J5110k1342j2454
$$ -5013 4026 11200 -4490 -16164 4307 19003 -4023 -19913 3401 18511 -2831 -15285
1128a5285J7610Q251j2495l026O741k565q24P848m703j2060R290J4819j2822j5629
$$ -15285 2325 10576 -1919 -4945 1796 -769 -1593 6255 1552 -10508 -1218 13601 779 -14850
1142a4850J4908J4461j5658j1453J5019O982j3333j630J0841l952p860R020M672
$$ -14850 58 14519 -1139 -12592 2427 9409 -3924 -5554 5287 1335 -6525 2495 7167
1155G167j3042j473J5508j505j6008M131J4621o381j1315Q121O638r381j032J0142
$$ 7167 -5875 -7348 8160 6655 -9353 -5222 9399 3018 -8297 -176 6462 -2919 -3951 6191
1169F191m774j0429J0142J0187j4373r442J6943Q070j7551o150J6018L631j2510
$$ 6191 1417 -9012 1130 11317 -3056 -12498 4445 12515 -5036 -11186 4832 8463 -4047
1182d047p02P492k583j502N946m821r090J0701J1785j5400j3635J8354J4528j9285
$$ -4047 -4749 2743 160 -1342 4604 -217 -9307 1394 13179 -2221 -15856 2498 17026 -2259
1196b259j4034J7915J2367j4558r327R437N311l214o05l405m449R650R390j4970
$$ -2259 -16293 1622 13989 -569 -9896 -459 4852 1638 1033 -2372 -6821 2829 12219 -2751
1210b751j3691J8592J6888k0166j8691J9576J8660j6790j6859J2154J3397o294
$$ -2751 -16442 2150 19038 -1128 -19819 -243 18417 1627 -15232 -3078 10319 4025
1222D025q423k05K495O654L927j2274j0162J6558J5572j9031j9441J9451K1370
$$ 4025 -4398 -4603 -2108 4546 8473 -3801 -13963 2595 18167 -864 -20305 -854 20516
1235B0516j7800k1128J4310J8628r392j4236L674Q186K270j281p854n784J2472
$$ 20516 2716 -18412 -4102 14526 5134 -9102 -5428 2758 5028 3747 -4107 -9891 2581
1248B581J2236j5672j7483J7189K0864j6904k2039J4975K0935j1585j7579P176
$$ 2581 14817 -855 -18338 -1149 19715 2811 -19228 -4253 16682 5097 -12482 -5306
1260e306J2495k261o202k569o85O946P475j0503j3294J2733J7745j3696k0260
$$ -5306 7189 4928 -1274 -3843 -4528 2418 9893 -610 -13904 -1171 16574 2878 -17382
1273a7382J3243K0555j1577j8693Q952J4846n715r557K250L325J103L110m015
$$ -17382 -4139 16416 4839 -13854 -4902 9944 4229 -5328 -3078 247 1350 4460 445
1286D45r036O307J3823p785j6945Q555J8116q584j7173P957J4411o897j0076N483
$$ 445 -8591 -2284 11539 3754 -13191 -4636 13480 4896 -12277 -4320 10091 3194 -6882 -1399
1300a399M831l951Q02K314o131p20J0492q10j3526K185J4852l444j4476M578J2425
$$ -1399 3432 -519 283 2597 -3534 -4254 6238 5428 -8098 -5913 8939 5495 -8981 -4403 8022
1315H022n503r046O225M801o664k27O843m182o572P863N963j0431m894J1701L313
$$ 8022 2519 -6527 -302 4499 -2165 -2392 4451 269 -6303 1560 7523 -2908 -7802 3899 7212
1330G212j1466j305R879j056p210L647L762o192p6Q455l496j0226O417J1210q445
$$ 7212 -4254 -5559 4320 3264 -3946 -299 3463 -2729 -2805 5650 2154 -8072 -1655 9555 1110
1345A110j1192R291J0112q946p898P473M698n071q09K224l491R01P688l738j1377
$$ 1110 -10082 -791 9321 375 -7523 -50 4648 -423 -1232 992 -2499 -1598 6090 2352 -9025
1360i025N998J4180p457j5643P902J5619p361j3982N805J0875l560o567Q97J391
$$ -9025 -3027 11153 3696 -11947 -4045 11574 4213 -9769 -3964 6911 3351 -3216 -2319 -928
1374i28J795M094m229r340O051J3827p100j7030P175J8647o346j8309M742J6138
$$ -928 867 4961 732 -8608 -2557 11270 4170 -12860 -5685 12962 6616 -11693 -6951 9187
1388I187k587j2219K06P035K088r59m102n230N455J0976o131j5631N958J8718
$$ 9187 6600 -5619 -5413 1622 3710 2751 -1351 -6581 -1126 9850 3719 -11912 -5954 12764
1402A2764n165j9854L760J8862j926j6028N0J1433J780n707l287o00M369O825
$$ 12764 7599 -12255 -8495 10367 8441 -7587 -7537 3896 5676 -31 -3318 -3918 451 7276
1416G276m890j2249M830J6407m170j8857L142J9334j797j7799L58J4451J009r696
$$ 7276 2386 -9863 -5033 11374 7204 -11653 -8511 10823 9026 -8773 -8415 6036 7045 -2651
1430b651k125M016K882J898l139p543K919J2284k400j5621J608J7190o98j6970
$$ -2651 -4776 -760 2122 4020 881 -6662 -3743 8541 6141 -9480 -7872 9318 8620 -8350
1444h350k01J5058Q09j1549j143P067J146k000q03l065K52P568M43j1087j031
$$ -8350 -8551 6507 7316 -4233 -5376 1691 2837 837 34 -3031 -2779 4789 5232 -5855 -6886
1459f886J3290J468j4026j575J3207J294j1124o18P990l70m215J428K43k600L584
$$ -6886 6404 7872 -6154 -7729 5478 6772 -4352 -4970 3020 2650 -1565 -137 106 -2494 1090
1474A090L484o704m071Q973M157j0128l688J0146K705r090j170P165o68m694K718
$$ 1090 4574 -2130 -6201 2772 6929 -3199 -6887 3259 5964 -3126 -4296 2869 2201 -2493 225
1489B25J986m697P61O228l095p180M811P442n895o826O110N385n704l225M797
$$ 225 2211 -2486 -1725 4503 1408 -5772 -961 6481 586 -6240 -130 5255 -449 -3674 1123
1504A123M63l499K566K000n503n41P928o06r680J524J0435k063r970K173Q500
$$ 1123 1586 -1913 653 2653 -2850 -3391 4537 3931 -5749 -4225 6210 4147 -5823 -3650 4850
1519D850k073n887J678K510j173J312O86n149k76Q521M4j1119q1J2607K22j2777
$$ 4850 2777 -3110 -1432 1078 -95 1217 1903 -3246 -3522 4999 5043 -6076 -6157 6450 6672 -6105
1535f105n39J1553Q81r081j162N544J352j339j266l070R09P238k43j0678n93J3021
$$ -6105 -6644 4909 5790 -3291 -4453 1091 2443 1104 -162 -3232 -2323 4915 4672 -6006 -6599 6422
1551F422J586j4007k528J3516L235j1526l649Q339L637m272l192k46K266M708
$$ 6422 8008 -5999 -8527 4989 8224 -3302 -6951 1388 5025 753 -2439 -2685 -419 4289
1565D289r43q693n88J1730K132j3582l535J3933M611j2873n152J0438N168o919
$$ 4289 3346 -5347 -5935 5795 7927 -5655 -9190 4743 9354 -3519 -8671 1767 6935 16
1579A6m580K797L511J579j932n744J22R212J828j1752l530J2987M832j2820n695
$$ 16 -4564 -1767 1744 3323 1391 -4353 -4231 4981 6809 -4943 -8473 4514 9346 -3474 -9169
1594i169J1363N826q762n280N292M149j464k477k365M10N806J694q478l651J0208
$$ -9169 2194 8020 -742 -6022 -730 3419 1955 -522 -2887 -2477 3329 5023 -3455 -7106 3102
1609C102N135j0740o030J0193O229q617n609O231M369l433k566N24L66K351J808
$$ 3102 8237 -2503 -8533 1660 7889 -728 -6337 -106 4263 830 -1736 -1212 -846 1505 3313
1624C313m734l803O484N326p552o169P690O292p145n590N950M191m293k310K397
$$ 3313 -1421 -5224 1260 6586 -966 -7135 555 6847 -298 -5888 62 4253 -40 -2350 47
1639D7Q9l86K175j449m163K967N581l939o385M544O379m649n543M311M041l629
$$ 47 136 -250 1925 476 -3687 -720 4861 922 -5463 -919 5460 811 -4732 -421 3620 -9
1655ik025K772l29j859K672R52m719j67O131m41o834Q52O724j158n833J399M154
$$ -9 -2034 738 409 -1450 1222 2174 -2545 -2712 3419 2978 -3856 -3004 3720 2562 -3271 -1872 2282
1672B282j549j980J777n37j915K990K143n114k260O621K409p411k361P285K212
$$ 2282 733 -1247 530 -7 -1922 1068 3211 -1903 -4163 2458 4867 -2544 -4905 2380 4592
1687D592o367j815M682J139k364l46k16p51K892J797n187k862O890L779p899m398
$$ 4592 -1775 -3590 1092 2231 -133 -479 -695 -1446 1446 3243 -1944 -4806 2084 5863 -2036 -6434
1703f434P957M643p068m442N430L733l097k610M78J058K265P04m675k475O498
$$ -6434 1523 6166 -902 -5344 86 3819 722 -1888 -1410 -352 1913 2617 -2058 -4533 1965
1718A965M194p631n544P858O379p282o529N845N989l782m867J372L142J206j044
$$ 1965 6159 -1472 -7016 842 7221 -61 -6590 -745 5244 1462 -3405 -2033 1109 2315 1271
1733A271l550j279N445L536o729n493P288O909p072p522O034P470m450o538K408
$$ 1271 -2279 -3558 1887 5423 -1306 -6799 489 7398 326 -7196 -1162 6308 1858 -4680 -2272
1748b272M932j35k762k070K29L972K293n332m648O116O419o180p555N627P781
$$ -2272 2660 2525 -237 -2307 -2078 1894 4187 -1145 -5793 323 6742 562 -6993 -1366 6415
1763F415m470p206K921N808j142l818o29J438K195J204l439l567M166N556m453
$$ 6415 1945 -5261 -2340 3468 2326 -1492 -2121 -683 1512 2716 -723 -4290 -124 5432 979
1778I79o852M233P413l622p110K682O068j594m423M87K258N92O3j429k395K040
$$ 979 -5873 -1640 5773 2151 -4959 -2277 3791 2197 -2226 -1739 519 1111 1174 -255 -2650 -610
1794f10M327k361n757K415O484k219o467J864N724j399m359R33K551n11m20J81
$$ -610 3717 1356 -4401 -1986 4498 2279 -4188 -2324 3400 2001 -2358 -1425 1126 615 195 376
1810C76j690J01L477k12m846K80N568k98n606K94M964l66l798N15K198q18l43
$$ 376 -1314 -1213 2264 2052 -2794 -2514 3054 2756 -2850 -2556 2408 2042 -1756 -1241 957 139 -204
1827b04J112j455j463K993J760m071j979M662K037m627j868M084J433l044p41
$$ -204 908 -547 -2010 983 2743 -1328 -3307 1355 3392 -1235 -3103 981 2414 -630 -1371
1842a371J653j22j21J144j380k155K685L042l614l666M034L949l965l899L439
$$ -1371 282 160 39 1183 -197 -2352 333 3375 -239 -3905 129 4078 113 -3786 -347
1857c47L338k461k396J164J139K28L60j545j957K663L397l350m568L691N234l456
$$ -347 2991 530 -1866 -702 437 665 1025 -520 -2477 186 3583 233 -4335 -644 4590 1134
1873A134n432K846N026j858m089P23K621N06p84j676j215K582L112l162m712L280
$$ 1134 -4298 -1452 3574 1716 -2373 -1650 971 1477 693 -983 -2198 384 3496 334 -4378 -1098
1889a098N851l004o430K389O290j470n567M63M176O45k315j639K21K377J952k771
$$ -1098 4753 1749 -4681 -2292 3998 2528 -3039 -2576 1600 2245 -70 -1709 -1488 889 2841 70
1905G0l932K867N498k585o468J982O764j185o348K97N215O45l597j406J453K011
$$ 70 -3862 -995 4503 1918 -4550 -2568 4196 3011 -3337 -3040 2175 2820 -777 -2183 -730 1281
1921A281P63k251k917K220M669j905n901J361O513o86o391k6N574P02m156j248
$$ 1281 2044 -207 -3124 -904 3765 1860 -4041 -2680 3833 3147 -3244 -3270 2304 3006 -1150 -2398
1937b398K368J537k81j610j733J434L534j095m861O00N589j6n816m60N314R12
$$ -2398 -30 1507 1226 -384 -2117 -683 2851 1756 -3105 -2505 3084 3068 -2748 -3208 2106 3018
1953C018m376j123K916J172j216j025n46O68K186j61l519l62M389Q58m738j182
$$ 3018 -1358 -2481 435 1607 391 -634 -1180 -512 1674 1513 -2006 -2368 2021 2879 -1859 -3041
1969c041M543J378l871j307K798J010j448n34J9o5J316P19k393j375L104J866
$$ -3041 1502 2880 -991 -2298 500 1510 62 -472 -453 -518 798 1517 -876 -2251 853 2719
1985B719l480k105L384K042k908j716K136J122j144l58J92o14Q20J481j550k278
$$ 2719 -761 -2866 518 2560 -348 -2064 72 1194 50 -308 -116 -730 90 1571 21 -2257
2001b257K058K821k237l027K104K959j766k485J212J713n95o73l0n65O37J722
$$ -2257 -199 2622 385 -2642 -538 2421 655 -1830 -618 1095 500 -173 -203 -768 -131 1591
2017A591j051k779J239L562j307l869J049L812o67l313K27K409K08j131n78l05
$$ 1591 540 -2239 -1000 2562 1255 -2614 -1565 2247 1580 -1733 -1506 903 1111 -20 -598 -903
2033i03Q67J714r43k969Q39L962o08m489K51M468K60m048o78L094J028j814j234
$$ -903 -36 1678 735 -2234 -1395 2567 1959 -2530 -2279 2189 2449 -1599 -2277 817 1845 31 -1203
2050a203K76J289J257j106k735P77L863k95m567k47M796Q33m526j288L749J625
$$ -1203 -927 362 1619 513 -2222 -1445 2418 2123 -2444 -2691 2105 2938 -1588 -2876 873 2498
2066B498k527j802J105J689M87j380j965P87L290j40m216n52M618J264m568j793
$$ 2498 -29 -1831 -726 963 1450 70 -1895 -1108 2182 2042 -2174 -2726 1892 3156 -1412 -3205
2082c205L988K111k996k185J662J983k03j524j271Q70K540l3l507p81M119J458
$$ -3205 783 2894 -102 -2287 -625 1358 1155 -369 -1640 -770 1770 1737 -1770 -2551 1568 3026
2098C026m189j996L812K331l053k362K028K072p62j584n01Q46J677n2k577q31
$$ 3026 -1163 -3159 653 2984 -69 -2431 -403 1669 907 -677 -1178 -332 1345 1293 -1284 -2115
2114b115L201J544l423k134L255K490k770k491J983K192j065j590O2Q34Q86M2
$$ -2115 1086 2630 -793 -2927 328 2818 48 -2443 -460 1732 667 -923 -861 -27 859 901
2130I01j626r36K155J727k373k289K300K604k032k540J502K180q60j564J99P02
$$ 901 -725 -1661 494 2221 -152 -2441 -141 2463 431 -2109 -607 1573 713 -851 -652 50
2146E0L93K42q72j164J195J944j377k454J343K615j064k541P84K134m46j426Q0
$$ 50 443 685 -187 -1351 -156 1788 411 -2043 -700 1915 851 -1690 -906 1228 782 -644 -564
2163e64N69K40L73m38j261N29K030n01k538L45K771j57k661q8K202K87j490m07
$$ -564 5 245 618 180 -1081 -552 1478 977 -1561 -1216 1555 1398 -1263 -1351 851 1138 -352 -759
2181g59N80M24L72l11j323J10K076J87k616m68K811P75k687j000K264J099j507
$$ -759 -179 245 617 306 -1017 -907 1169 1356 -1260 -1728 1083 1858 -829 -1829 435 1534 27
2198B7j023N56Q74M03m75j335j5K110M80k647r66K831J411k764j672K296J807
$$ 27 -996 -440 434 837 362 -973 -988 1122 1602 -1045 -2011 820 2231 -533 -2205 91 1898
2215A898j608j672P29J297K63q55j146K18J954M55k474j146K761J697k625k140
$$ 1898 290 -1382 -653 644 907 52 -1094 -876 1078 1533 -941 -2087 674 2371 -254 -2394
2231b394K283K309j645k243Q76J841M0j268r05N18J598L64k150j169K387J851
$$ -2394 -111 2198 553 -1690 -814 1027 1067 -201 -1106 -588 1010 1374 -776 -1945 442 2293
2247B293k370k358K038K625j487k583Q44K205r1j562o81Q00J270J32j739j013
$$ 2293 -77 -2435 -397 2228 741 -1842 -998 1207 1116 -446 -1127 -327 943 1075 -664 -1677
2263a677J996J783j985k308J716K622j299k621P45K347j73j806m20J033R02j26
$$ -1677 319 2102 117 -2191 -475 2147 848 -1773 -1028 1319 1146 -660 -1080 -47 855 729
2279G29j289p59J466J496j357k182J220K520r03k557M70K324j0j837l64J154O56
$$ 729 -560 -1319 147 1643 286 -1896 -676 1844 941 -1616 -1146 1178 1168 -669 -1033 121 777
2296G77k83q66n33Q83J299p90j912O06K220k82k350MK134K72j697m79J077N46
$$ 777 494 -372 -905 -22 1277 487 -1425 -819 1401 1119 -1231 -1227 907 1179 -518 -997 80 626
2314F26k77o01m62M66J142k35j694M4J975K32k037m74J889O24j467p00R01O14
$$ 626 349 -252 -714 -248 894 659 -1035 -991 984 1216 -821 -1295 594 1218 -249 -949 -48 566
2332E66k31m59m10K12J002R3j450n05J763P52j724j046J552J158j183j102O58
$$ 566 335 -124 -534 -322 680 773 -677 -1182 581 1333 -391 -1437 115 1273 90 -1012 -354
2349c54Q96o7n76m64J06R73M10j311q62J495J246j461j520J226J650r17j509M34
$$ -354 542 475 -101 -565 -459 514 924 -387 -1249 246 1492 31 -1489 -263 1387 470 -1039 -605
2367f05J192R2p43n66J41R77M25j239r88J324J468j228j803J012J926o53j819
$$ -605 587 679 -64 -630 -489 488 913 -326 -1314 10 1478 250 -1553 -541 1385 732 -1087
2384a087K00J518K35r97o63M14R46K95j120r74J171J554j058j921P42K117m11
$$ -1087 -887 631 866 -131 -794 -380 566 861 -259 -1233 -62 1492 434 -1487 -745 1372 961
2401I61k035k0J758M38j270p85O28R63R5j021q57J008J466q08j909N09K152j61
$$ 961 -1074 -1094 664 1102 -168 -953 -325 638 733 -288 -1145 -137 1329 521 -1388 -879 1273 1112
2419A112k124k03J904N08j398q20Q23R37r0j003n86Q94J173o40j690L54J946K2
$$ 1112 -1012 -1215 689 1197 -201 -1021 -198 739 649 -354 -940 -46 1127 487 -1203 -849 1097 1119
2437A119k061k95J837O16j470q39R20R35k86q64l96P39R53m33j421Q6J731K49
$$ 1119 -942 -1237 600 1216 -254 -1093 -173 762 476 -388 -784 -45 908 475 -946 -860 871 1120
2455A120j753o04J648Q32j305r44Q50R05l00q00k40N50P23k18j161j38J378N08
$$ 1120 -633 -1237 411 1243 -62 -1006 -156 749 449 -351 -591 -41 682 464 -697 -835 543 1051
2473A051j462p59J320R73j084j039P09R58k54p58k06M94N91p4q80l27J062O67
$$ 1051 -411 -1170 150 1123 39 -1000 -291 667 413 -345 -551 -57 534 460 -420 -747 315 982
2491I82j081r72J015J137q03j146M72J044j93p41k04L59N46J8p21n05Q71Q50q12
$$ 982 -99 -1071 -56 1081 278 -868 -396 648 455 -286 -490 -131 415 433 -288 -793 78 928 116
2510A16j149O79J305m48j262J33J131J10q11l51L71N77J07o52n82O66R65n70j250
$$ 116 -1033 -354 951 503 -759 -626 505 615 -196 -547 -176 401 508 -144 -726 -60 905 335 -915
2529i15L65J416j63j376j23J202L56q80n37M07O43P1o16n75N38J020m06j281J53
$$ -915 -550 866 703 -673 -796 406 762 -118 -655 -248 395 466 -150 -725 -187 833 427 -854 -701
2548g01J456P7j397l79J254N79r00p13M74P34Q3p11n54N29R65k91j276lJ400L40
$$ -701 755 832 -565 -944 310 889 -11 -724 -250 484 567 -144 -698 -169 796 505 -771 -774 626 966
2568I66j431n82J181Q46r04r07M66R02Lp87m56N57Q65k30j151q3J274M50j281
$$ 966 -465 -1047 134 980 76 -831 -365 537 540 -247 -703 -146 719 489 -662 -745 529 979 -302
2587c02p62J199R04q51j048N26R64q9q24l36N74O66k16j001j45J141N13j148p96
$$ -302 -1064 135 1039 188 -860 -334 630 541 -283 -619 -45 621 405 -596 -741 400 913 -235 -1031
$$ [...]
8191A
##END NTUPLES=NMR FID
##END=
