##TITLE=1H_LY-DMAA.Per.2.19
 CDCl3
 8 sc, 
 14.03.2022
##JCAMPDX= 6.0         $$ Bruker NMR JCAMP-DX V2.0
##DATA TYPE= NMR FID
##DATA CLASS= NTUPLES
##ORIGIN= UXNMR, Bruker Analytische Messtechnik GmbH
##OWNER= root
$$ XWIN-NMR		Version 3.5
$$ Mon Mar 14 12:28:36 2022 Russian Standard Time (UT+4h)  she@DPX200
##.OBSERVE FREQUENCY= 200.131346
##.OBSERVE NUCLEUS= ^1H
##.DELAY= (6, 6)
##.ACQUISITION MODE= SIMULTANEOUS
##.ACQUISITION SCHEME= undefined
##.AVERAGES= 8
##.DIGITISER RES= 18
##SPECTROMETER/DATA SYSTEM= spect
##.PULSE SEQUENCE= zg30
##.SOLVENT NAME= CDCl3
##.SHIFT REFERENCE= (INTERNAL, CDCl3, 0, 15.7039)
##AUDIT TRAIL= $$ (NUMBER, WHEN, WHO, WHERE, WHAT)
$$ ##TITLE= Audit trail, XWIN-NMR		Version 3.5
$$ ##JCAMPDX= 5.01
$$ ##ORIGIN= Bruker BioSpin GmbH
$$ ##OWNER= she
$$ F:/spectra/data/she/nmr/H-F/1/audita.txt
$$ ##AUDIT TRAIL=  $$ (NUMBER, WHEN, WHO, WHERE, WHAT)
(   1,<2022-03-14 12:27:18.89 +0400>,<she>,<DPX200>,
      <created by zg, POWCHK disabled, PULCHK disabled
       configuration hash MD5:
       00 E9 B6 7A A2 85 ED C7 34 08 36 98 17 FE 4E 26
       data hash MD5: 16K
       C3 1A 55 32 DF B2 58 9B AA 55 7B 5D 0F 30 54 C1>)
$$ ##END=
$$ 
$$ hash MD5
$$ A3 A7 FA 19 DF 3D 98 DB 1D 3F 79 36 7A A8 5C E8
##$RELAX= 
##$RELAX= 
##$RELAX= 
##$RELAX= 
##$RELAX= 
##$RELAX= 
$$ Bruker specific parameters
$$ --------------------------
##$DU= <F:/spectra>
##$EXPNO= 1
##$NAME= <H-F>
##$PROCNO= 1
##$TYPE= <nmr>
##$USER= <she>
##$AMP= (0..31)
100 100 100 100 100 100 100 100 100 100 100 100 100 100 100 100 100 100 
100 100 100 100 100 100 100 100 100 100 100 100 100 100 
##$AQSEQ= 0
##$AQ_mod= 1
##$AUNM= <au_zg>
##$AUTOPOS= <>
##$BF1= 200.13
##$BF2= 200.13
##$BF3= 200.13
##$BF4= 200.13
##$BF5= 200.13
##$BF6= 200.13
##$BF7= 200.13
##$BF8= 200.13
##$BYTORDA= 1
##$CFDGTYP= 0
##$CFRGTYP= 5
##$CHEMSTR= <none>
##$CNST= (0..31)
1 1 145 1 1 1 1 1 1 1 1 1 1 1 1 1 1 1 1 1 1 1 1 1 1 1 1 1 1 1 1 1 
##$CPDPRG= <>
##$CPDPRG1= <>
##$CPDPRG2= <>
##$CPDPRG3= <>
##$CPDPRG4= <mlev>
##$CPDPRG5= <mlev>
##$CPDPRG6= <mlev>
##$CPDPRG7= <mlev>
##$CPDPRG8= <mlev>
##$CPDPRGB= <>
##$CPDPRGT= <>
##$D= (0..31)
0 1.2 0 0 0 0 0 0 0 0.06 0 0.03 0 0 0 0 0.0002 0 0 0 0 0 0 0 0 0 0 0 0 
0 0 0 
##$DATE= 1647246438
##$DBL= (0..7)
120 120 120 120 120 120 120 120 
##$DBP= (0..7)
150 150 150 150 150 150 150 150 
##$DBP07= 0
##$DBPNAM0= <>
##$DBPNAM1= <>
##$DBPNAM2= <>
##$DBPNAM3= <>
##$DBPNAM4= <>
##$DBPNAM5= <>
##$DBPNAM6= <>
##$DBPNAM7= <>
##$DBPOAL= (0..7)
0.5 0.5 0.5 0.5 0.5 0.5 0.5 0.5 
##$DBPOFFS= (0..7)
0 0 0 0 0 0 0 0 
##$DE= 6
##$DECBNUC= <off>
##$DECIM= 32
##$DECNUC= <off>
##$DECSTAT= 4
##$DIGMOD= 1
##$DIGTYP= 9
##$DL= (0..7)
0 120 120 120 120 120 120 120 
##$DP= (0..7)
150 150 150 150 150 150 150 150 
##$DP07= 0
##$DPNAME0= <>
##$DPNAME1= <>
##$DPNAME2= <>
##$DPNAME3= <>
##$DPNAME4= <>
##$DPNAME5= <>
##$DPNAME6= <>
##$DPNAME7= <>
##$DPOAL= (0..7)
0.5 0.5 0.5 0.5 0.5 0.5 0.5 0.5 
##$DPOFFS= (0..7)
0 0 0 0 0 0 0 0 
##$DQDMODE= 0
##$DR= 18
##$DS= 0
$$ [...]
##$SUBNAM2= <"">
##$SUBNAM3= <"">
##$SUBNAM4= <"">
##$SUBNAM5= <"">
##$SUBNAM6= <"">
##$SUBNAM7= <"">
##$SUBNAM8= <"">
##$SUBNAM9= <"">
##$SW= 18.0517287032376
##$SWIBOX= (0..15)
0 0 2 0 0 0 0 0 0 0 0 0 0 0 0 0 
##$SW_h= 3612.71676300578
##$TD= 16384
##$TD0= 1
##$TE= 0
##$TE2= 300
##$TE3= 300
##$TEG= 300
##$TL= (0..7)
0 120 120 120 120 120 120 120 
##$TP= (0..7)
150 150 150 150 150 150 150 150 
##$TP07= 0
##$TPNAME0= <>
##$TPNAME1= <>
##$TPNAME2= <>
##$TPNAME3= <>
##$TPNAME4= <>
##$TPNAME5= <>
##$TPNAME6= <>
##$TPNAME7= <>
##$TPOAL= (0..7)
0.5 0.5 0.5 0.5 0.5 0.5 0.5 0.5 
##$TPOFFS= (0..7)
0 0 0 0 0 0 0 0 
##$TUNHIN= 0
##$TUNHOUT= 0
##$TUNXOUT= 0
##$USERA1= <user>
##$USERA2= <user>
##$USERA3= <user>
##$USERA4= <user>
##$USERA5= <user>
##$V9= 5
##$VALIST= <valist>
##$VCLIST= <CCCCCCCCCCCCCCC>
##$VD= 0
##$VDLIST= <DDDDDDDDDDDDDDD>
##$VPLIST= <PPPPPPPPPPPPPPP>
##$VTLIST= <TTTTTTTTTTTTTTT>
##$WBST= 1024
##$WBSW= 4
##$XGAIN= (0..3)
0 0 0 0 
##$XL= 0
##$YL= 0
##$YMAX_a= 452605
##$YMIN_a= -391206
##$ZGOPTNS= <>
##$ZL1= 120
##$ZL2= 120
##$ZL3= 120
##$ZL4= 120
##$ABSF1= 10
##$ABSF2= 0
##$ABSG= 5
##$ABSL= 3
##$ALPHA= 0
##$AQORDER= 0
##$ASSFAC= 0
##$ASSFACI= 0
##$ASSFACX= 0
##$ASSWID= 0
##$AUNMP= <proc_1d>
##$AZFE= 0.1
##$AZFW= 0.1
##$BCFW= 1
##$BC_mod= 2
##$BYTORDP= 1
##$COROFFS= 0
##$CY= 11.3945322036743
##$DATMOD= 1
##$DC= 2
##$DFILT= <>
##$DTYPP= 0
##$F1P= 2.36226072786647
##$F2P= -0.459571619588291
##$FCOR= 0.5
##$FTSIZE= 0
##$FT_mod= 4
##$GAMMA= 1
##$GB= 0.15
##$INTBC= 1
##$INTSCL= 1
##$ISEN= 128
##$LB= 0.24
##$LEV0= 0
##$LPBIN= 0
##$MAXI= 10000
##$MC2= 0
##$MEAN= 0
##$ME_mod= 0
##$MI= 1.114404
##$NCOEF= 0
##$NC_proc= 0
##$NLEV= 6
##$NOISF1= 3.799351
##$NOISF2= 2.8
##$NSP= 1
##$NTH_PI= 0
##$NZP= 0
##$OFFSET= 15.70392
##$PC= 1
##$PHC0= -17116.51
##$PHC1= 24.00078
##$PH_mod= 1
##$PKNL= yes
##$PPARMOD= 0
##$PSCAL= 0
##$PSIGN= 0
##$REVERSE= no
##$SF= 200.130013532006
##$SI= 16384
##$SIGF1= 3
##$SIGF2= 2
##$SINO= 400
##$SIOLD= 16384
##$SREGLST= <1H.CDCl3>
##$SSB= 0
##$STSI= 0
##$STSR= 0
##$SW_p= 3612.71676300578
##$SYMM= 0
##$S_DEV= 0
##$TDeff= 0
##$TDoff= 0
##$TI= <>
##$TILT= no
##$TM1= 0
##$TM2= 0
##$TOPLEV= 0
##$USERP1= <user>
##$USERP2= <user>
##$USERP3= <user>
##$USERP4= <user>
##$USERP5= <user>
##$WDW= 1
##$XDIM= 8192
##$YMAX_p= 0
##$YMIN_p= 0
$$ End of Bruker specific parameters
$$ ---------------------------------
##NTUPLES= NMR FID
##VAR_NAME=  TIME,          FID/REAL,        FID/IMAG
##SYMBOL=    X,             R,               I
##VAR_TYPE=  INDEPENDENT,   DEPENDENT,       DEPENDENT
##VAR_FORM=  AFFN,          ASDF,            ASDF
##VAR_DIM=   8192,          8192,            8192
##UNITS=     SECONDS,       ARBITRARY UNITS, ARBITRARY UNITS
##FACTOR=    0.0002768,     1,               1
##FIRST=     0,             0,               0
##LAST=      2.2672688,     0,               0
##MIN=       0,             -391206,         0
##MAX=       2.2672688,     452605,          0
$$ Real data points
##PAGE= N=1
##DATA TABLE= (X++(R..R)), XYDATA
$$ [...]
1481G252l62j8271N54K4710Q3k8259j730K8897L861k6808n010K1923M807j4645
1495b998l324O240L77J867M212r097r991J4868J5376j8181j9827J8671K2732j7060
1509C865k3268J3938K0924r745j5853N298Q885j586n41n63q367J380J6687j033
1523A0021k2905o41K6666L081k7986m900K5997N854k1322n782J4837M086p562
1536e56p24J92m028O545R211j1643j4017J4392J8234j5238k0744J4604K0719j2313
1550D634j8280R292J3993o478q050M501P77l159O475K554j2593l137J7304M239
1564A2072k0431m912K1101N044j9573m516J6443K944j2524MP986l790l239P718
1578D327q14j1215L698J4405n851j6266P349J6297p954j4694P907J1963q177p861
$$ y = [7252, 6890, -11381, -10827, 13883, 13966, -14293, -16023, 12874, 16735, -10073, -15083, 6840, 11647, -2998, -6322, -82, 295, 2162, 6374, -2723, -12714, 2154, 17530, -651, -20478, -1807, 20925, 3865, -19403, -5465, 15459, 5714, -10139, -4841, 4044, 2458, 1917, 1354, -7013, -5633, 11054, 10021, -12884, -13525, 13141, 16222, -11764, -16664, 9333, 15187, -6135, -11917, 2920, 7006, -556, -1280, -1088, -5116, 1429, 10640, -1003, -15020, -628, 17606, 2368, -18376, -3772, 16947, 4634, -13646, -4354, 9639, 3161, -4889, -388, 389, -2770, 3705, 6259, -6334, -9471, 7833, 12072, -8359, -13271, 7830, 12874, -6699, -11215, 5228, 8172, -4352, -4348, 3638, -152, -3391, 4327, 3513, -7702, -4004, 10401, 4550, -11716, -4367, 11930, 3976, -10718, -2811, 9152, 975, -6886]
1592f886Q562K861q929J904R404o154j0016R501J0364j1920r699J2807Q218j2362
1606b345n983J1305K810r890J407Q121n770o309R652N260j2997m576J5468L656
1620I809j6183k770J5088J728j2748j91R469k276n477N458R76q564K738J1714
1634H771n394j4735P284J6655q051j6846P592J5515o391j2673N148Q215m086k423
1648a419L377l744l225R280M182j4089n771J7584P024j8883q044J7873Q626j5344
1662b573p960J1542N560o644k029J621k319K618P364n586j2511P534J6693p941
1676E369j9192O926J9894m979j8659L118J5079j483r675J62L386LL068J148r318
1691e153l124J4404N392j7605p738J8546R792j7670j0540J5071R655j0925p272
$$ y = [-6886, 1676, 4537, -4392, -2488, 6916, 762, -9254, 247, 10611, -1309, -11008, 1799, 10017, -2345, -8328, 2977, 5787, -4103, -2696, 5425, -345, -6654, 2998, 8258, -4739, -9315, 6153, 9809, -6374, -9144, 5944, 7672, -5076, -5267, 4202, 1926, -3551, 1907, 2883, -5681, -2943, 8771, 3377, -11358, -4074, 12581, 4530, -12316, -4724, 10791, 4400, -8273, -3125, 5090, 1004, -1419, 1958, -1786, -5011, 4269, 8451, -5638, -11409, 6175, 13199, -5684, -13728, 4145, 12771, -2573, -10533, 1009, 6569, -75, -2104, -483, -2802, -184, 7180, 1594, -10917, -3383, 13310, 5369, -13823, -6897, 12997, 8018, -10641, -7523, 7556, 6073, -3602, -3440, -54, -51, 3017, 4165, -5153, -8277, 6127, 11519, -6086, -13824, 4722, 14514, -3156, -13696, 1375, 11030, 105, -7167]
1704g167O119L769j653J077k081o537M918J1521o370j5411O250J8063n301j8833
1718a1636L949J7257k434j3882J218R147p38l807J454k011k781P175M576j1011
1732c524o607J3320Q608j4365r552J3926R183j1809p942R193N466o360j854L687
1746A370k577j163O642m98j0221J241J3041j624j4574J801J4326j835j2648J888
1760d831J0025k550o523L852K610n380J233O812m092q367O282R535p788r564Q278
1775d68Q621p851o959P171M367o687r32O016k663n469N787N211q322n261J0256
1790B817M927j0996m174J0499L096r018j509P120q28m796L765K314o547k44R140
1805E566j032j1410J822J2715k346j2624K322J1113k020q750K132N323k711j257
$$ y = [-7167, -1048, 2721, 1068, 2145, 64, -6473, -1555, 9966, 3596, -11815, -5565, 12498, 7197, -11636, -7687, 9570, 7136, -6746, -5528, 3619, 2881, -926, 528, -1483, -4264, 2911, 7487, -3524, -10131, 3189, 11797, -2568, -12120, 1806, 10989, -820, -8762, 431, 5897, -463, -2317, 1370, -1207, -2370, 4272, 3774, -6447, -5206, 7835, 6211, -8363, -6562, 7764, 5929, -6719, -4831, 5194, 2644, -3879, -27, 2583, -2797, -1564, 5248, 1156, -7211, -929, 8606, 818, -8746, -468, 8153, 302, -6657, 514, 4881, -1806, -2738, 3278, 615, -4854, 933, 6144, -2178, -7439, 2817, 7744, -3252, -7426, 3073, 6169, -2849, -4358, 2762, 1934, -2862, 903, 3217, -3330, -3574, 5566, 4534, -6876, -5054, 7661, 5315, -7309, -4987, 6126, 4106, -4644, -2512, 2811, 100, -1157]
1819a157L667k957m806O384O366q839q182J0568R258j0806r388R582Q907p648
1833I49p245N485M145k940k84P02l888P89P864j291j1555J149J4135n95j5073
1848g653n43J4446J586j2427k031R065J718m691p04J28j112M032L744p382o594
1863h418R813R047j0694j0793J0138J1507q484j0964O365Q640l791n237J311J109
1877d51L42L443j125p931J142J1646p32j3731m70J4411J969j3942k555J1632K711
1892F359q140k214M299R49n64J479l144m156O041O670p694q858Q135J0448p871
1907A739j0823O779R694n081p564L328M605k092p89J314l261q60O750J008r292
1922d545j706J0981K430j1604k540J0685K465q819j808O455M16l827J629J062
$$ y = [-1157, 2510, -447, -5253, 1131, 7497, -1342, -9524, 1044, 10302, -504, -9892, -310, 8597, 949, -6296, -811, 3334, 394, 110, 812, -3076, -2287, 5577, 4286, -7269, -6120, 8015, 7420, -7653, -8196, 6250, 7836, -4591, -6622, 2443, 4161, -530, -1234, -1106, -2218, 1814, 5558, -1824, -8418, 1395, 10442, -252, -11045, -907, 10600, 2116, -8848, -2483, 6157, 2366, -2871, -1560, -451, -109, 3334, 2209, -5722, -4580, 7066, 6334, -7397, -7867, 6544, 8513, -5429, -7984, 3648, 6359, -1781, -3995, 304, 1253, 689, 2168, -976, -5132, 909, 7579, -115, -8973, -838, 9610, 1739, -9084, -2305, 7389, 2308, -5256, -1928, 2677, 585, -204, 1110, -2151, -3011, 3739, 4747, -4545, -6251, 4730, 7160, -4444, -6984, 3701, 6166, -2653, -4461, 1994, 2410, -1417, 212, 1274]
1936A274l903J237N904k784p674L602Q937m098r176M161Q285l787o664L485M522
1951C321l544j660L707j234l958L744M402n585n019O987N183p503m751P060L964
1966E114o180k556M964N37l823K020K461m489j399O517R60q250p00R128N12q975
1982d159k58P849M7o115O95L800j923j032L355j508m830L437O435m727p842N407
1998a369Q417n280q192M452P144l431n367K553K558j669O35J090l753r85O427
2013C230J618q719k317R993L029r985l550Q874L788p083l155M636J740j793K82
2028E88r13k689K984N237m333p749N029R282m766r999L772R768k622q295J431
2043c275N792m60k490q9r49j8M263R03p182j956R179L150r976m258R602N012q384
$$ y = [1274, -2629, -1392, 4512, 1728, -5946, -2344, 6593, 2495, -6681, -2520, 5765, 1978, -4686, -1201, 3321, -223, -1883, 1824, 590, -3368, 376, 4778, -807, -5826, 1161, 6344, -1159, -5910, 1150, 5114, -1066, -3622, 1342, 1879, -1944, 76, 2537, -1952, -3351, 3166, 4126, -4124, -4824, 4304, 4816, -4159, -4417, 3432, 3479, -2636, -1941, 1859, -64, -1096, 2259, 751, -4079, -642, 5793, 1066, -6776, -1369, 7048, 1768, -6424, -1972, 5172, 1741, -3626, -1073, 1485, -184, 451, 1541, -2212, -3197, 3230, 4848, -3871, -6188, 3805, 6834, -3151, -6701, 2173, 5961, -1122, -4277, 359, 2099, 306, 588, -325, -3014, -30, 5207, 874, -6875, -1846, 7436, 2670, -7329, -3557, 6211, 3589, -4706, -3275, 2517, 2057, -433, -522, -1471, -1489, 2774, 3677, -3505, -5461, 3718, 6868, -3108, -7366, 2236, 7248, -1136]
2060a136m935O303L953l721k383J101K19J000K578k703n335L737P513l831r077
2075f717L307R696k444r177J584P540o67n075J03K291l11P94J070l768j975O050
2091B301K983p333m195P839M891p591m846O453M124m744k969L066J042j468J284
2106H37J29l587Q80N532j139p088J170P959j017p877Q78O824o50n286O66L346
2122A577j244j171K217j120l083K796M047l965m905M588N314m729n112M349M219
2137C778l501k977K939J055k318J062K005l148j768M795J827n973k008O607J924
2152D299o396j630N391J179m081l79K695j119r51K567n32m059J494N487k085o441
2168d561K351O715k220o230J620N362j233l716J183J550j290Q09J582k913k197
$$ y = [-1136, -6071, 232, 4185, 464, -1919, -818, -599, 401, 2979, 276, -5059, -1322, 6191, 2360, -6717, -3410, 6286, 3842, -5335, -3751, 3789, 3122, -1953, -1850, 441, 130, 924, 1994, -1774, -3749, 2301, 5284, -2049, -6244, 1595, 6486, -1105, -5951, 502, 4626, -118, -3087, -21, 1021, -447, 837, 966, -2621, -1741, 3791, 2652, -4436, -3266, 4693, 3676, -4201, -3323, 3501, 2851, -2435, -1769, 1577, 333, -838, 1379, 259, -2824, -28, 4019, 54, -4851, -263, 5051, 322, -4790, -441, 3778, 277, -2700, 239, 1294, -1024, 38, 2043, -1105, -2873, 1922, 3749, -2224, -4232, 2375, 4299, -2097, -3727, 1664, 2843, -1238, -1617, 1078, -41, -992, 1575, 1043, -3016, -1522, 3965, 1880, -4561, -2210, 4505, 2285, -3945, -2325, 3037, 1804, -1912, -729, 821, -469, 340, 1922, -991, -3188]
2183c188M537L075n775l880O319M278n926m323M883L955l665k789K091J017n61
2198D8J122o81l260J337N280j467o933J385P738q03p686J33O804N23n381o21L175
2215G13L79o14J27j763j187L719K564n295l796O028M770n895n409N128N400l920
2231I49m712K550L230j023j183j95j058Q28L446j102n481R86O915m73p448m20
2247d191P337R93o357j302M648J193k496o96K83k70J646J723l397l064M401M250
2263D701m716n054M422N455l783n033K849L974j782k385Q93M31k75J697j2l676
2279b294l8N095L65n922r02O192J254n819j321M734J145l248o67J751l63k07J653
2296A408j147k858K037L934k384m811K556N087k388m687J931L825j482k534J252
$$ y = [-3188, 1349, 4424, -1351, -5231, 1088, 5366, -560, -4883, 0, 3955, 290, -2499, -408, 609, 48, 1170, 489, -2771, -1434, 3846, 2379, -4554, -3169, 4569, 3766, -3920, -3787, 3017, 3540, -1841, -2462, 713, 1092, 478, 605, -1158, -2345, 1374, 3938, -1357, -5153, 875, 5645, -250, -5659, -531, 4869, 949, -3763, -1213, 2017, 994, -189, -384, -1442, -614, 2832, 1730, -3751, -2765, 4150, 3677, -3771, -4191, 3146, 4139, -2218, -3520, 1128, 2321, -175, -871, -588, -858, 788, 2511, -886, -3950, 451, 4701, -15, -5069, -647, 4808, 1025, -4008, -1159, 2815, 1033, -1352, -459, -28, -303, 1394, 1382, -2294, -2332, 2763, 3128, -2794, -3696, 2496, 3750, -2069, -3390, 1344, 2489, -759, -1426, 325, -38, -245, 1408, 261, -2597, -560, 3374, 990, -3821, -1265, 3822, 1434, -3253, -1322, 2503, 1021, -1513, -261]
2311b61R12j268Q42J429k547j602L613K070m334k495M648K498m406k228L616J736
2327B223k613q32J715n26o75J939r3l219N25M269o14m980N29N199m04m710J27
2344b140L765q5k521L49R51r29P40J538k049k371K958L243l426l925L511M164
2360C773l151l850K385L175j519k011Q39M09k86J410j22k955J01M258K48n292
2376b588o36N551J051n176j474M341J433k990j049J405K96K64O95j642j874K618
2392B25L192l132m221L201M775k730m878J978M414j159l336M26J763J02J9l65
2408B74j798J38L410L62m674r54N252J557n213k097M617K370l616k054K204J414
2424A192o58m37o06q41J561K362k233l625K521M387k223m853J687M786j210m046
$$ y = [-261, 651, -617, 225, 1654, -893, -2495, 1118, 3188, -1146, -3641, 1007, 3505, -901, -3129, 487, 2223, -390, -1222, 493, -33, -708, 1231, 1138, -2081, -1556, 2713, 2099, -2881, -2352, 2847, 2443, -2267, -2140, 1625, 1540, -981, -632, 319, -610, 130, 1668, -381, -2752, 206, 3449, 23, -3902, -391, 3773, 622, -3228, -843, 2332, 813, -1198, -359, 50, -236, 1174, 1052, -1903, -1802, 2456, 2704, -2588, -3224, 2327, 3378, -1798, -3272, 1069, 2502, -488, -1537, -132, 164, 428, 1123, -519, -2393, 225, 3417, 285, -3936, -735, 4040, 1310, -3568, -1590, 2824, 1665, -1671, -1245, 518, 620, 639, 274, -1524, -1386, 2024, 2386, -2288, -3242, 2010, 3567, -1646, -3743, 874, 3244, -372, -2426, -222, 1192, 534, 97, -509, -1350, 211, 2573, 340, -3285, -764, 3623, 1400, -3453, -1766, 3020, 1810, -2236]
2440b236O14K752n5j270r3m16j59K034N82l256j159M080J718m288k238M101K534
2457C245l551k284K502J763j338r05M26l80L53J750r18k854J090L692j008m213
2473b630O98M242m13l815K49K816l0j700J88L81o02R09J224k014j699K642K245
2490B691k842k805L040K697k623k363J910J868j306r66P59k97l59J506J21k590
2506a559o6L268L88l739o47L792P08l242q03K450O67j414j47M18o58O48J398j350
2524A12k166J706K953j794l472J656L497j378l076Q67K327m70j271J66N7k41J372
2541H45K90k356o99L179J126l543j585L600J828l102j848K298J600j352r23L48
2557b94J6N06J064j245k050J378L138j403l751J103L894o21l622Q4K960L09k035
$$ y = [-2236, -1622, 1130, 1075, -195, -288, -704, -863, 1171, 1753, -1503, -2662, 1418, 3136, -1152, -3390, 711, 3245, -306, -2590, -88, 1675, 337, -568, -142, -522, -169, 1581, 663, -2191, -1101, 2591, 1583, -2630, -1932, 2310, 1897, -1918, -1669, 1147, 1117, -583, -395, -14, -616, 293, 1517, -497, -2196, 446, 2691, -151, -2956, 84, 2781, 158, -2205, -295, 1573, 267, -699, 60, -237, -596, 910, 1031, -1559, -1625, 1643, 2031, -1708, -2355, 1437, 2145, -1097, -1900, 550, 1217, -197, -344, 74, -584, 64, 1462, 112, -2054, -348, 2605, 811, -2661, -1005, 2492, 1114, -1962, -1095, 1232, 762, -509, -343, -286, -527, 845, 1135, -1221, -1920, 1259, 2385, -1158, -2743, 857, 2685, -417, -2265, 33, 1633, 281, -642, -294, -278, 228, 1292, 47, -2003, -625, 2513, 1110, -2641, -1538, 2356, 1735, -1887, -1803, 1157, 1466, -569]
2574e69l59O35M36O38p0j759o31K739J357l284j883L267K370k966k591K362K474
2591B166j618j757O33Q44K36J41p88j317R47K548r84l418P43L802l00l739j69
2608b030L291O02k523o17J324N64j55j93r19m96J916J216k523j893K732K337k459
2625A74k725K047K652j505k075P41J280j20l71k57o30L03J788l06k662J67L143
2642A644K13l216o36L060P96k453q40J667O82q23j76j31n11R65J157j507j790
2659a899J684K300j629k609J361K609j033k084N55J416k26n82Q3m16j04J379L31
2676A136k077o17K512R75k655j278K535J306k002j164J285Q56o60l14O6n31M98
2693a29J300q75j944Q30K474n88k855N09K631j72k211l3J536K06o80j16j48k76
$$ y = [-569, -928, -293, 143, 781, 711, -1048, -1679, 1060, 2417, -867, -2750, 517, 2887, -79, -2670, -308, 2166, 548, -1209, -576, 268, 504, 645, -143, -1460, -513, 2035, 1051, -2367, -1624, 2178, 1878, -1861, -2030, 1261, 1863, -660, -1277, 47, 611, 456, 263, -656, -1152, 764, 1980, -543, -2436, 296, 2633, 174, -2551, -504, 2148, 643, -1432, -691, 589, 469, 98, -159, -789, -486, 1302, 996, -1666, -1499, 1644, 1857, -1359, -1995, 1065, 1861, -592, -1432, 235, 917, 94, -82, -213, -724, 241, 1398, -109, -1899, -215, 2085, 456, -2153, -792, 1817, 784, -1300, -745, 671, 445, -137, -54, -470, -574, 805, 1136, -941, -1558, 954, 1929, -726, -2004, 531, 1837, -165, -1329, -44, 812, 152, -162, -96, -627, -129, 1171, 296, -1648, -818, 1656, 1068, -1787, -1278, 1353, 1181, -1030, -1063, 473, 679, -1, -117, -265, -541]
2711e41J119N58j639j103K064J569k142j956J996J951j580j702Q34J396m16o62
2727b54j7l19M64J227o37j940N28K526k56k812j67K818M96k394o98J728P76r72
2745I7n68P4J95P48L69j462j012J771J726j861k185J667K341j311k209P21J884
2762I85k31j141j90L07M53O13m87j478K75K248Q7k642m18K622Q16k362j115J848
2780A90J168j232q60L23M26M33J32j008p88J323J546j490k054J274K393r36k418
2797a578N82K122j96j466j63P20L98R5l14r30K6J600L68k107p19K217J030k030
2815c45j356J722J290j121j109M86O62J30n3n36o63P30J434r13j854P56K198n35
2833I23k087P5J997Q1j405k89P99L31j77j08o60j55J216N03j589q91J652J331
$$ y = [-541, 578, 1136, -503, -1606, 458, 2027, -115, -2071, -75, 1876, 296, -1406, -572, 824, 408, -254, -271, -590, -126, 1101, 464, -1476, -948, 1578, 1322, -1490, -1657, 1161, 1657, -737, -1435, 293, 1069, 97, -471, -397, -202, 546, 915, -547, -1559, 212, 1938, 77, -2108, -441, 1900, 589, -1620, -899, 985, 754, -387, -577, -270, 183, 796, 309, -1169, -894, 1354, 1441, -1201, -1619, 1003, 1819, -543, -1658, 190, 1358, 126, -734, -411, 15, 448, 580, -428, -1216, 107, 1653, 163, -1891, -617, 1776, 840, -1578, -996, 1126, 930, -536, -699, 21, 419, 514, 200, -730, -704, 896, 1264, -843, -1562, 655, 1685, -345, -1701, 21, 1311, 190, -919, -433, 229, 359, 306, -230, -893, -163, 1271, 358, -1496, -740, 1458, 923, -1164, -1089, 908, 989, -416, -705, 94, 425, 248, 140, -520, -675, 541, 1044, -545, -1436, 216, 1547]
2851A547j611j484J355J419q42j231M07P76K8j84k17n75L65J200l86j563R9J885
2869I88J74j993l87J838M93j332n74P23N50k34j89m37k82R66P14j275j091J231
2887a17J579j092j830R31J651m46j435O1R78K72m16k58m27L24J068k27j416j99
2905i99J781N30j873q16J678R21j252j000P25Q46k38m06l00r0P53O43r78j106
2923a181R20J581p42j871N25J827j16j598j82J094L61n27l55j68K32Q87j30j282
2941g25k04J513O88j716j016J541J206j141j274P47J084k57o45k56J58O49M39
2958G91q24r28O47J509n49j774K99J698J42j649l57J292M84q04m20L9M22M53r9
2977C72r26l14J280O93j362j056J288J193q98j337O15J223k02q14k05L36M01K29
$$ y = [1547, -64, -1548, -193, 1226, 384, -847, -440, 336, 364, 180, -37, -612, -247, 953, 567, -996, -897, 988, 1162, -831, -1218, 620, 1113, -219, -793, -70, 480, 246, 57, -380, -662, 304, 1018, -257, -1348, -117, 1462, 370, -1460, -529, 1122, 676, -759, -698, 280, 552, 136, -122, -549, -225, 843, 616, -800, -999, 782, 1312, -561, -1377, 301, 1222, -30, -1030, -305, 541, 303, -103, -403, -493, 260, 903, -75, -1181, -261, 1320, 578, -1293, -768, 1059, 943, -655, -837, 257, 618, 91, -264, -432, -200, 687, 557, -725, -929, 584, 1272, -444, -1460, 81, 1287, 146, -1128, -381, 703, 446, -199, -455, -297, 352, 791, -33, -961, -314, 1195, 646, -1128, -829, 869, 1011, -638, -995, 297, 781, -23, -443, -404, 18, 471, 372, -554, -868, 412, 1105, -257, -1313, -25, 1168, 270, -1067, -452, 771, 569, -245, -450, -114, 287, 516]
2995E16m77p94L97J277k66j579L2J580L10j476n79J222N51o92m98J87L80K53o0
3014B84o42l99R62P65j017j057R04J298o27j416L84J251r7q21k62M54L57K8k80
3033F9o71J38J121m2j301k91J381O62j304q44J044Q50o12p05J38M60K61q7m74
3052b07l92P06P87p23j045M40J403l15j491J64J241Q7q32l80M21M50n5l08n10
3071e59J62R23Q3j049n23J214Q29j107j022Q87R80m51q96J04O75J11k04l78k98
3090e19O04O88n22j089K93J382j05j385k20J193M50q64o50N67N88j00m00l70Q4
3109c75Q50J65r28n50R43Q99r42r74O32J133l19j089L4P64K05l37l49k12M92N67
3129F09m10r50J94J190J06j324k87J076O19q86p31O12O64j43m41k78J33O80J04
$$ y = [516, 39, -755, -358, 919, 653, -926, -894, 686, 996, -480, -1059, 163, 714, 22, -476, -289, 91, 344, 284, -358, -757, 205, 970, -47, -1104, -200, 1098, 471, -945, -561, 690, 593, -228, -490, -36, 321, 349, 69, -602, -464, 657, 615, -686, -977, 404, 1066, -238, -1082, -38, 812, 200, -505, -367, 93, 354, 267, -207, -599, 107, 894, 171, -874, -434, 969, 654, -837, -673, 568, 655, -177, -557, -136, 314, 259, -49, -559, -397, 526, 609, -440, -963, 251, 1080, -27, -1049, -162, 818, 367, -529, -425, 250, 361, 157, -221, -519, 85, 773, 251, -838, -545, 837, 732, -653, -873, 320, 770, -94, -744, -177, 411, 311, -89, -459, -375, 475, 640, -288, -838, 105, 1004, 62, -912, -280, 853, 534, -555, -521, 243, 448, 111, -238, -450, 42, 609, 199, -751, -557, 633, 739, -585, -872, 204, 823, -63, -794, -182, 482, 339, -102, -380, -247, 433, 537]
3148E37p31n44P64Q55o92j002L94J148j68j033j38P70K79l28m52m2M49M09k90
3167A85p61N2J008J63j062l76R12O73o74p83M96O66j11m91l06K97M82jm70n46
3187f47O10P47m81r94K05J130M8r88k76P24L31l48m49K1M93K53j65o28o2Q83K88
3208F95r09n29P88P47n84q23L32P52q0n17k78K94L93Q0m18n16M57O85k91q41J2
3229e51R90J79r97k47P38L65l19m80M7L59L15j95n89p4Q15K64o67o73N92Q71m86
3250B57q66K62P45N7o16k87L51L06R2m00m11L04P10j51q25q7R15L18q91m26O76
3271C3M82k95n67MN20J71k22m58o4O51K72o03o01N19Q14l90q23J50O98J75o10
3292a44l83M01M02k5l65l51L69N50j44p09r4Q01L51p66m92N14O22l13o38O0N04
$$ y = [537, -194, -738, 26, 881, 189, -813, -419, 729, 561, -472, -610, 160, 439, 111, -341, -383, 66, 475, 185, -576, -524, 484, 647, -415, -791, 121, 794, 120, -663, -167, 499, 388, -103, -409, -112, 370, 369, -101, -647, -37, 710, 229, -765, -560, 570, 618, -370, -646, 78, 409, 61, -388, -367, 126, 379, 214, -414, -476, 407, 695, -214, -743, 45, 792, 208, -615, -283, 469, 389, -128, -406, -112, 281, 361, -57, -573, -116, 569, 278, -563, -551, 439, 618, -379, -626, 112, 477, 158, -322, -275, 84, 399, 204, -385, -459, 356, 620, -47, -720, -128, 743, 257, -609, -347, 398, 455, -161, -448, -97, 209, 301, -99, -510, -206, 504, 353, -472, -559, 356, 674, -217, -643, 33, 515, 220, -347, -343, 177, 348, 126, -332, -396, 255, 527, -76, -677, -158, 656, 266, -557, -407, 291, 466, -144, -527, -126, 276, 251, -114, -465, -96, 454, 310, -399, -493, 308, 659, -107, -599, -85, 537, 224, -414, -354, 150]
3313A50K05k32m42m5N33K77m43n89L18P94k24p49l6P30K12n52l70L67M17m3m20
3334a42j99K57N23q0o30k60P17L90o47m93L99O33j54o90J5M27L03k15m03o5M43
3355A29L20l92n86K55P79j08p16j82P16L12n22n16L98M63r1l83k17K80M12n4n46
3376b49k16O03M50o15n00K89O85j28o59n6M65K72k16l97J6L66K22k47n85K95O20
3397D15M7p61k15O28M26m91m87K76M90j4m52k56K73L44L4n10k18N32M19m32n12
3418d64J43P22m8o27j27M42L09k11m51P7L80K47l31m43J76N85L1o09k76N56M16
3439D97l76n50J80N50Km56j95K84L13m9l92k60M70L87k89n52J84N81L5n47k47
3460d30M36L66k00m50K8L96K18k32m86J51M83M6m75l11M05M75l26n59J80N61N3
$$ y = [150, 355, 123, -319, -364, 169, 446, 3, -586, -268, 526, 302, -447, -483, 247, 459, -93, -463, -96, 321, 278, -142, -341, -84, 439, 359, -271, -531, 186, 576, -71, -564, -165, 468, 314, -376, -361, 66, 369, 154, -249, -314, 129, 449, 57, -529, -274, 505, 397, -319, -501, 215, 527, 5, -511, -113, 350, 259, -124, -341, -61, 351, 297, -249, -465, 138, 588, -27, -527, -238, 447, 319, -340, -396, 69, 341, 125, -272, -256, 110, 332, 85, -500, -205, 415, 462, -299, -514, 114, 540, 49, -438, -162, 328, 314, -138, -394, -121, 223, 257, -253, -471, 61, 480, 48, -464, -321, 401, 353, -274, -401, 41, 350, 139, -312, -235, 145, 392, 61, -382, -206, 379, 410, -199, -475, 81, 497, 121, -429, -249, 301, 303, -153, -348, -64, 249, 200, -192, -452, 18, 405, 116, -436, -252, 329, 364, -183, -430, 6, 372, 172, -278, -250, 146, 364, 132, -354, -203, 280, 326, -149, -460, -55, 420, 94, -465, -285, 276, 329]
3481C29m64j32K45K70o6l03k19L74L07j91m81J6O53N3n58k22L91L46j85m67M1
3502b63L51J71k86k97P9M62L6l66k82L17M71k47m63L8N13P9m06k21K05L66ql72
3524a23j93L25L76j98n18N1N17J66m82l29L32M36j93m27J9K68K56k56l65J07L98
3545A67J20l84l40L59M95j96n37L4M54J78l63k45J66L30P0m56j99L01L60j25m93
3566c04k5M56K22m11l27K73M65j66m12m4K64L26k43l40R5L62J53m15k38J80M48
3587C19r1m50n3L93K26l67k46J62L46k1l38j64L09K42j53l38o4M36J74l63l06
3608c47K17M60j11m25j22L22L21k10l57P9L42J32k94l29K23M10r5m55n0M08J97
3629C16l52k36P7L77O2l92j10K35K58p6l38j02L56K18k94l20J80L60ml91o9K48
$$ y = [329, -135, -267, -22, 248, 182, -121, -340, 34, 341, 150, -331, -315, 338, 391, -167, -389, 2, 348, 163, -304, -263, 88, 259, -27, -324, -245, 217, 253, -113, -395, -78, 393, 146, -317, -279, 234, 313, -93, -314, -109, 257, 249, -123, -316, 9, 385, 187, -331, -280, 237, 403, -79, -408, -76, 360, 167, -260, -241, 27, 283, 27, -338, -231, 167, 287, -97, -437, -78, 417, 221, -316, -282, 172, 350, -13, -258, -92, 238, 308, -148, -347, -46, 314, 189, -304, -329, 127, 349, -62, -389, -116, 349, 183, -229, -273, -9, 317, 74, -266, -171, 191, 344, -71, -309, -129, 319, 228, -222, -275, 118, 344, -23, -269, -107, 239, 218, -120, -284, 25, 267, 114, -224, -288, 148, 322, -41, -347, -130, 330, 219, -206, -328, -6, 315, 105, -252, -173, 169, 301, 7, -322, -99, 311, 216, -239, -289, 119, 316, -36, -272, -195, 182, 244, -148, -258, -23, 235, 159, -179, -281, 75, 293, -1, -321, -141, 219, 215, -176, -245, 3]
3651CL14j99l82J57K30R0k49k28J68K56jk98j64L54K34k83l05J47K88O2k94k03
3673c03K72K41p8l15l7L33J10k05k95J59L70n1l08j01K19K66j63l23K5K74J13
3694B03k24k90J44L96o0l33j35K78K77k22k61K6L60M7k59k00J60L52p7l28j10
3715b56L25J69j85k89K6L85M1k84k21K15K88j77k44j3K73K41l31k03J09L51K2
3736B42l78j06K95J92j08l12k1L75L3k27k47K36K38l5l24j39K97K14j32l04P1
3757a40K85L8k63j83K33K52r5k45n7K23K06k61k31J43L17l4l36o3K33K19q9l50
3779a98N8K71Kj37k56R2L81r3k74p0K20K34j99k64P3K92R6l07j97J93L02n9l32
3802a72qK20J91j36l34J85K47k6k52j52K17K39j62k86RK92R0j32j97R1K34j5l07
$$ y = [3, 317, 118, -264, -107, 123, 213, -36, -264, -96, 160, 159, -139, -303, 51, 285, 2, -303, -156, 132, 194, -100, -303, -31, 210, 132, -183, -220, 113, 223, 18, -277, -118, 252, 201, -107, -208, 11, 277, 114, -209, -184, 90, 203, -21, -311, -167, 229, 169, -164, -299, -21, 256, 34, -227, -201, 159, 206, -53, -253, -93, 259, 182, -146, -256, 69, 238, 53, -236, -210, 175, 216, -68, -289, -74, 214, 37, -207, -220, 53, 294, -37, -240, -131, 220, 242, -136, -242, 53, 245, 137, -175, -196, 179, 212, -15, -262, -26, 212, 177, -147, -286, 11, 225, 93, -211, -140, 145, 183, -80, -263, -30, 222, 127, -118, -175, 48, 254, -7, -238, -95, 222, 188, -148, -211, 22, 241, 152, -198, -140, 131, 133, -4, -260, -168, 213, 120, -154, -224, -4, 230, 31, -233, -160, 132, 228, -79, -276, -83, 219, 160, -172, -180, 40, 231, 95, -239, -54, 193, 167, -85, -237, -20, 219, 57, -229, -220, 72, 162, 30, -167, -76, 158, 143, -164]
3825a64j26L16J41j04k96J36K39N0k02k02J51L11j06k63o7K06J72j28k36O2K02
3846I2J03k57j61J73K68j19k41j1K39O0j56j65Q3K04N5k04j34J67J63n0k76P7
3868i0K26N2k16j49J71J71m8j73j43J54K19q5k45l3L35P0k79j19J18J50Mj72j01
3891a83K26J12j30k48R2K66J9k30j02K05J39m4k60J0K00R0k20q0L9J69Q8k44j33
3914b19K31J56j32k00j1K53Q6j87k07J78K43j03k16K9J23J62j36k28J2K44O5j91
3936d8j97K08J77l1k84M0J92J30k16k09J60J89L6k27j06J28K68j56j89m5K75J15
3958B10j99k25J30K52k0k45l1J71J33j61j84K4K05N6j37j56J49J86q7k49M8J80
3980E0J36j91j80J25J99j8j37j40J15K16j80j30o4L02O9k20j37J44K22p4k41J8
$$ y = [-164, -290, 26, 167, 63, -233, -97, 142, 192, -10, -212, -61, 250, 144, -119, -186, 20, 192, 64, -172, -110, 92, 195, -62, -223, -50, 218, 99, -142, -153, 86, 146, -10, -175, -92, 112, 167, -37, -171, -4, 159, 109, -167, -90, 136, 188, -28, -177, -6, 165, 117, -56, -199, -45, 174, 89, -156, -189, 146, 216, -63, -182, -64, 86, 90, -82, -183, 43, 155, 25, -223, -131, 135, 154, -76, -178, 27, 166, 122, -138, -128, 72, 162, -58, -138, -99, 70, 158, -86, -219, 12, 168, 36, -164, -175, 78, 164, -23, -230, -52, 191, 88, -128, -99, 24, 186, 50, -178, -166, 78, 143, -48, -245, -37, 140, 109, -175, -135, 57, 187, -29, -238, -78, 111, 147, -80, -186, -58, 210, 54, -135, -180, 95, 210, 11, -214, -84, 168, 148, -97, -128, 43, 176, 15, -169, -145, 60, 116, -21, -177, -28, 158, 71, -178, -130, 50, 186, -5, -185, -60, 139, 121, -16, -156, -41, 175, -5, -135, -199, 103, 172, -48, -185, -41, 181, 107, -134, -116]
4002a16J20J21j07k12R6J47K9p6j82N2K60l0k24o9J92J47j53j23R7J81m7j21j06
4025a24J00J50l7j54n5J98N9j51j20O2K57r4k31qJ38J45p9j34q6K20N3j24j58
4048a73P9J95L9j79j50K09J42j62r3J3J64J5j34j00J10J36oj70q7J66P5o0j41
4071a12M9J20Q3j83j38K18Q1q8j13K9J13R6j21j36L8J47K4j42q3J57J46j24j99
4094a38M0K02J4j49q6J10R7j8j35j17K03L9k8j34RK14Pk04q1J35K06j26j28k8
4118i6J25P8p6j14l8J45P4j09j47J99J04q5k07K0J62L3q7j06Q2J23k6j07m9J05
4142CJ03j15n6p1K12O0j60r6J19J49o3k51J13P0J42j26j67R6J19Rj16p5P8J03
4166H0p2j73P6J07J03j94n9J17O3L3j45k9J00Q2k2j19m2J57Q4j55j39J40J33j25
$$ y = [-116, 4, 125, 18, -194, -98, 49, 78, 2, -180, -128, 132, 102, -122, -191, 1, 148, -5, -128, -31, 150, 103, -18, -124, -24, 126, 89, -65, -120, 78, 137, -14, -134, -72, 185, 91, -140, -148, -10, 135, 56, -78, -164, 56, 109, -15, -173, -94, 101, 140, -39, -189, 20, 162, 0, -93, -80, 84, 99, -35, -135, -25, 111, 105, -65, -152, 14, 89, 29, -112, -63, 57, 140, -43, -181, 37, 118, 30, -83, -54, 59, 155, 34, -102, -64, 83, 107, -35, -118, 39, 185, 61, -138, -98, 104, 118, -31, -117, -7, 90, 72, -63, -180, 23, 62, 34, -100, -91, 123, 130, -74, -155, -20, 186, 60, -68, -96, 29, 107, 31, -83, -121, 24, 98, -11, -158, 41, 145, 60, -147, -127, 35, 68, -19, -125, -43, 80, 54, -53, -102, 3, 106, -9, -65, -136, 76, 136, -24, -120, -1, 148, 85, -166, -53, 17, 159, 33, -134, -38, 81, 90, -26, -101, -23, 80, 8, -165, -89, 18, 121, -73, -132, -15, 48, 81, -64, -93, 7, 89, 67, -52, -94, 63, 147, -8, -147, -7, 126, 1]
4190Am0o3J28O4q4n4J6Q9O0j86n8J12J35m1j65n2K10L9j53r6J01J22k0q0o7N5
4216b7J30l9j25j3Q5J09j49p2M3J83n0j48k9J01P3p0o3JO6P1j19p5R3J12k6r0
4242b8k3J02N5j24o9L7J61m4o4l6K3R5Jj59o5J68P8j15q3O9J24l6j06J4N0O6o8
4269B3p8j0O4R9o3j44J17J60r1j54m4J52J22j78p4R2N3J4j01qL4N2J5j37oQ1J37
4296A27o4j50J7J56o8l7p1R8R5j08m5Q4RM8o9j29L4J71k8r8j25J81J20j86k1J3
4322d6J48q4j25P5J7N8Kj39L9N6J20j00j11L3J47M6j97k7J01J52j54q0J4Q6Q8
4347A19j61k1N3K0N7j16m8R7J47j88o1M4J30j4j36N4LR8k9o9n8N1J35q5j58P1
4373f5J44J9j17k1J07M9j12j07O2R1Mo5o9%J49J8j25q0J05J09l6j17OJ65q8r5
$$ y = [1, -39, -102, 26, 90, 6, -48, -32, 57, 117, -69, -127, -15, 120, 79, -86, -138, 72, 111, -42, -138, -37, 85, 65, -15, -82, -27, 103, 64, -61, -74, 11, 120, -29, -101, -58, 125, 75, -73, -102, -1, 72, 2, -61, -60, 6, 77, -42, -117, -24, 88, 62, -28, -51, 51, 106, -18, -87, -50, 111, 67, 3, -33, -10, 85, 86, -73, -138, 30, 108, -7, -90, -21, 103, 67, -39, -25, 25, 91, 23, -55, -65, -1, 98, 35, -109, 8, 168, 77, -77, -121, 31, 153, -25, -99, -7, 46, 60, -41, -49, -15, 37, 52, -85, -91, -10, 127, 63, -87, -70, 86, 18, -19, -90, 8, 103, -5, -50, 34, 43, 91, 22, -107, -73, 98, 70, -28, -153, 28, 148, -38, -59, -46, 102, 18, -107, -32, -15, 43, 45, -94, -55, 1, 121, 21, -90, -57, 90, 136, -61, -88, 13, 165, 11, -69, -55, 31, 119, -42, -63, -10, 10, 67, -49, -97, 0, 147, -41, -102, -58, 72, 58, -78, -24, -21, 77, 48, -21, -79, -28, 107, 22, -136, -65, 79, 98, -19, -40, 67, 116, 4, -103, -41, 50, 54, -11, -80, -80, 69, 87, -38, -118, -13, 96, 60, -57, -51, 114, 26, -69]
4399f9K7N5%%p0QM8R8q5q5k9J35M9j71j2N4J58j46k5OJ19M2j06o8L7P2M7j04m0
4428e5M5O0j3r5oJ13j6n9rQJ7M5Pr6N8L7J7j26J2Q7N3j11p3O8N6J8p7j5Q3M3q4
4459hrm9P5P9j13m9R3O5or2q2J16K3k7p6K0J08k7p5k9P6L7Oj24J8OJ18j07r2J11
4489a4R0l5p7l6J42j4j0p9J6P2O1j05j21N7Q5J0j23KQ6J5q1k9K9J50j07l3k3P7
4517EM3l3l9L7K6l1k4j8K1P6rp4k1Q1j7m7o5J01JK7o9p3M4M6Om2k6J11m6K8o4
4548d5k4O7kJ0n7O4L0p6K0oP4K8j01l4O1N2l5k2p5R3K5r1j4O4K0j5lr0L1O9Qj01
4580g5J5KO0%o7N1N3jj04K5N1jOlm1K0M3mp9j6J60r3j5m7M9K3j5n3K2M7J7n0m2
4613f2N4N2j2o9j2K2P5p6o0R2j0Q1j29M9L4K6n5k9p5J06O3r1k8J5R0K6o7p4O2
$$ y = [-69, -42, 13, 13, 13, -57, -49, -1, 97, 12, -73, -102, 33, 82, -89, -101, -47, 111, -35, -60, -54, 65, 107, 1, -67, -30, 42, 89, -15, -55, -10, 50, 37, -58, -64, 49, 33, -26, -35, -27, -10, 35, 42, -54, 4, 41, 58, -68, -56, 31, 84, -27, -100, -32, 24, 42, -35, -50, 33, 76, -8, -17, -66, 9, 88, -25, -74, 19, 84, 78, -14, -96, 20, 43, 16, -60, -40, 68, 41, -34, -63, 13, 50, 56, -68, -50, -44, 74, -33, -125, -14, 76, 41, -36, -72, 70, 56, 46, -33, -17, 55, 116, 11, -110, -53, 32, 42, -81, -79, 7, 22, -59, -88, -59, 91, -16, -49, -72, 5, 48, 15, -24, 13, 39, 8, -16, -34, -13, 63, 54, -20, -41, 40, 23, -24, -89, 12, 13, 40, -29, -102, -58, -12, -6, -48, -74, 37, -9, 19, -45, -69, -2, -4, 6, -51, 13, 43, -33, -13, -19, 55, 83, -18, -52, 9, 61, 26, 4, -71, 22, 47, -44, -58, 6, 26, 11, 8, -82, -51, 18, 26, -75, -60, -58, 2, 2, -65, -14, 39, 38, -66, -41, 10, 9, 15, 12, -29, -9, 34, 30, -49, -65, 95, 2, -13, -60, -11, 12, -3, -56, -34, 13, 30, -20, -62, -8, 44, 32, -37, -49, -27, 48, -28, -88, 4, -6, 75, -54, -5, 29, 55, 0, -29, -104, 2, 65, -26, -54, -39, 51, 77, 10, -64, -2]
4642bN6m9m1J2N9ql2OMN1K7j22M6L3qm5k9k8P1J1m6k5J3P1k3m4l8J26JNq3K1J08
4675I8p5n6J0PJ00p6p4N1PJ0p0M0MN7K4q7PMN5Mj12P3L9k6j9l5N2O1q8l0L9j2
4707a8O8l1r4ON8N8o8m5J14L3m0q1L0K4K9r2M0lL6l4l4J2K9O9m8m7n0J36K3m4
4737C6r1K0M6LJKj9P8o6ko1N8O2r2%L2N0l3j8r8Q5N0n3l5%K8P2m9l4l6P3J8m6
4770a9rM1j0k9n7P3O1m4k5NjJ3N9o2l2L5M9n5m1L9P0Oj24J3M3J4No4J2O0n8M1
4802Ik3m2P2k9j8J2O1L6q8p5O0Q1m2l5KO4n0mn5lOQ2ro3L1L4K8j26O6N9%j7l8
4835a4M5N2p2J1k0j5O2n1j6l5K9N5n7K4j4O9n6J5n9K5QkLJ4K8oL9m7k6M4K3r6
4867d0J6P6qp4%kO4l3nN0q9P5j2q7nK2L8QjJ9N0p7KPK6L5r5kj8J02o6nk7K8J27
$$ y = [-2, 54, 5, -36, -24, 35, 27, -5, 1, 5, 56, 83, -39, 7, 40, 32, -13, -42, -70, 1, 12, -34, -59, -46, 25, 2, -42, -80, 46, 47, 52, -31, -10, 98, 23, -33, -23, -16, 84, 8, -66, -15, -8, 2, -68, -28, -24, 33, 57, -30, -23, -19, 36, 40, -72, 1, 40, 14, -5, -40, 12, 73, -15, -45, -6, -18, 50, 19, -75, -69, -11, 47, -21, -66, 48, 81, 41, -40, -10, 14, 43, -49, -9, -12, 24, -10, -44, -32, -3, 66, 18, -29, -79, 57, 80, 36, -55, -35, 11, 14, 15, 17, -2, 76, 10, 8, -53, 5, 67, -25, -25, 7, 57, 24, 6, -92, -7, 43, -10, -45, -45, -17, 55, 6, -28, -64, 9, 27, -19, -28, 13, 3, -26, -83, -10, 51, 7, -18, -13, -14, -1, 58, -4, -36, -1, 48, -7, -48, -9, 61, 67, -57, -44, -1, 13, 18, -46, -34, 26, -32, 9, -14, -56, 16, -13, -31, -19, 42, 78, -10, -85, -25, 56, 14, -21, -19, 45, -5, -9, -64, -67, -61, 21, 12, -51, -20, 14, 42, -84, -18, 41, 41, 24, -14, 31, 83, 11, 22, 2, -13, 49, -2, -18, -53, -24, 31, -26, -2, -16, 53, -3, 12, -47, -22, -14, -16, -13, 1, 29, 23, 62, 15, -11, 33, 56, -40, -24, 52, 44, -30, -30, -32, 32, -1, -6, 44, -45, 30, 18, -69, -74, -52, -14, -6, -7, 12, 62, -15, -13, -6, 20, 55, -40, -42, -60, 42, -24, -29, -56, -28, 99]
4902I9p0q9L5%N1o7K2L6k5lj4m3L3N7L6q2QJ6P9m9j01K9O2m5l1M3L5J0k8J5j5
4933DlK1P4r6o4N3M8j5p1R0K8p9qQJ9k6M6l7l8L3lj7k9L5J9J5nk4L4LJ2n6Q1j
4967E1p3LKl3O4J3no5N8nNl2oK4K9q2N0J2J5m9J4K1J1k4L6p7J2M0Ol9L0N6l4j8
5001A0o5J14m1k6j1pK0N9rn3jj8J0N6p0OQ5j2n0Ok0M3l9L4Kl4L0j6l3N4nl3Rk5
5035c0J6k5Jl8J00j8m0NQJ3mK0J2n8O0kj1m5M5J2kk8KlOk9N6o5N4k5PK6Om2Qj0
5071a8k5J8J15n5q9N8l0N2k9j7M7om9j0J0Q3L4p5l5J2rM9n5l3R0k2j12M9L6J03
5101H7j11K6J3J3o0J2Ql0O1j2j1K0K4Oj03L0J5O0Mn6m8O0NM1p2L5N3n6m6J8JL8
5133B5Po5M0jl8O0J6p8jP0Oj07O0k1L1K2m4L0N8k8p1K3J7K9l1j9n9M2K8Nj2j8
$$ y = [99, 29, -60, -25, -25, 26, -41, -19, 17, -8, -11, -25, -68, -35, 22, 58, -24, -16, 0, 79, 30, -71, -42, 20, -25, -56, -13, 22, 32, 4, 19, 4, 1, 22, 96, 0, -64, -11, 37, 22, -49, 41, 69, -10, -18, -10, 9, -17, 29, -8, -46, -13, -16, -33, -62, -27, -8, 7, 2, -22, 12, 15, 27, -29, 52, 51, -22, -19, -17, -50, 14, 27, 22, -43, 15, 10, 15, -17, -23, 1, 30, -52, -2, 10, 25, -24, -10, 11, 22, -2, 34, -43, -31, 9, 15, -24, 6, 62, 28, 10, -55, 59, 18, -8, -19, -26, -6, 53, 44, -9, -10, -28, -18, 38, -32, -26, 59, 47, -3, 3, -17, 26, -13, 21, 23, -11, 19, 3, -30, 24, 19, -14, -5, -30, -14, -39, -38, -76, 24, 6, -34, -29, -21, -8, -12, 8, 20, -38, 22, 20, 9, -36, 9, 21, 19, -9, -7, -10, -4, -33, 23, -42, 12, -13, -6, 20, 26, -16, -8, -18, -43, -25, 90, 35, -54, 4, -26, 26, -3, -20, 27, 21, -28, -38, -28, 55, 89, 14, -21, -9, -18, 31, -24, -57, 33, 11, -101, -52, -16, 87, -24, 2, 15, 28, -32, -20, -12, -42, 19, 7, -4, 16, 40, 46, -57, -27, -12, 48, 52, -4, -52, 8, 13, 54, -18, 17, 70, 14, -32, -14, -13, 25, 32, -33, 7, 6, -32, 28, 44, -34, -35, 35, 41, -66, -6, -27, 4, 26, -18, 12, 70, 42, -29, -6, 11, 40, 9, -10, -69, -27, 1, 6, -6, -24]
5165b4R1J7oq6k9J35j51k3J04l6mMj0j9N1Ok4J2m8Q3j7n4K0rM9n3M2j3L1m2l8
5196d1N9Lmo0M6j2J5N7j00j3O5j0K7n9rQ1m9mQok3L8nm4N9J1j9n6L5L7%k0Pj1
5230Crj5J8p5M2Pl9L4NN4l7o6Q3L9m6nl0N5j5K7n3N0j3lOj9J2m8O0o0L6j6%N2
5264C4j4k3j6N8q4L6K0K7p4P0o8L8J0nJo2O7L5n7m1L6M4o6K8J0k4K0NLL7p9j1
5296d5R5m6k4mN4qo3M3lmK2m5M1k7L7l9J3l2J7O3q3Q9n8j4K3o0O7K6k6J5k6%J6
5329A4j2Qj4l3P7k3qjK5J0m4K7m9k0jM8K7m2R6n1k2K4k2n9mP7m1Jj9k9N0L0n4
5362c4L1l5O2k3l7k3O8J5Rl4n5J12Ko0l9M8J9k8n1K4J7Q8q5K9k8k0K5N8p7K2Q
5393Hkm0L2MO4j32O2Kj7j5j5M1k7K8l1N8m7M2%J7l3j0QM4j26R7Kj1OK0m7K3K6
$$ y = [-24, 67, 84, 78, -8, -37, 98, -53, -76, 28, -8, -12, -8, -18, -37, 14, 20, -4, 8, -40, 43, 26, -28, -8, -17, 32, -21, 21, 8, 39, -3, -41, 18, 21, 17, -43, 3, -9, 6, 63, -37, -50, 15, 5, 32, -27, -36, 45, -4, -8, 0, -6, -29, 9, 4, -40, 19, 30, 11, -45, -10, 27, 27, 7, 14, 3, -6, -21, -3, -78, -36, -29, -68, -34, -29, 25, -12, -78, 5, 44, -2, -7, -37, 18, 3, 30, -23, 27, 14, 11, 17, -2, 10, -38, 22, -38, -2, -18, -18, 34, 20, -3, -19, 39, -45, -9, 11, 38, -36, 34, -34, 4, 14, 9, 10, -52, 15, 50, -7, -48, -12, 32, -34, -6, 4, -20, 0, 5, 8, 45, -34, -45, 50, 4, -20, -24, 30, 22, -41, 2, -1, -5, 17, -28, 13, -14, 23, -16, -3, -35, -18, 45, -38, 51, -7, -21, 2, -58, 9, 35, 9, 24, -2, -2, 14, 2, 10, -4, -37, 40, 17, 9, 8, 33, 43, -1, 26, -23, -43, -44, 4, 31, -11, 85, 34, 12, 36, 14, -45, -49, 28, -13, -12, -31, -60, -10, 20, -34, -3, -38, 24, 1, -36, -59, 9, 24, 33, -1, -56, 56, 58, -2, -41, 7, 26, -2, -53, -29, -12, 76, -9, 20, -8, -28, -3, 55, -22, 0, 8, 6, -34, -2, 2, 66, -66, -4, -2, -19, -34, -49, -8, -35, -7, -38, 20, -27, 15, 15, 32, -1, -11, -3, 41, -85, 12, 14, 3, 9, 29, -18, 5, 31]
5426C1j3ql4M1L1m8k7N2J5n0L9j8m0M8q8M1L9m0J3N0n3J4j3L5j08J07O3o0m3K4
5456@j5oK6m8N0mK0j4m7N5L2n3J5k0j7K4OM2m6J1J2n0jP7l2m4O4Jo1N0q8O2l5
5489c4J8J2l0M2kK6k9k6Q3l3j7k4J4n9O8j2l9P1l1m6K0L7jj8l6J09q2K2l4L3J0
5520A2k0K3J7K7j00N1k6P3l1m6M6m9M4k9MRL0j6J8n3n4N8m3O2k1K1j3l0J9L6j0
5551Il3N7Jl9J7L2k5m4M3n9J7l1P1rm3O1l8K8k7N3j05Q0j9j4j8N7m5J8L1q9L1
5582c2lRpL2M9l9k8K7L6n0K4m0O6r3O2k1L3l9k1M7K0j3mm8M0m2K6P2l7Jn4M2k5
5615a0J5p%l3k5O8k8k2K6J%L0j9qK3ml5N0O0n4m7N0k7NLm1N5j1n7J6M6L1p6k9
5649e4K1j4J0j1M4J5K2n6K1k4K0j1N1Mn0k4L6k8J2L7k7j4K6j3k4LM6Nk6J7Ll3
$$ y = [31, 18, 10, -24, 17, 48, 0, -27, 25, 40, -10, 29, 11, -29, 19, -69, -28, 11, -29, -16, 34, -19, -5, -18, 17, -91, 16, 79, 19, -24, 0, -15, -21, 5, -43, 7, 3, 23, 9, -38, 17, 49, -4, 11, -9, -26, -2, 4, 46, 0, 11, 23, -27, -28, 49, 17, -27, 37, 38, -23, 27, -61, 1, -34, -16, -4, -34, 8, 6, 32, 3, -23, 60, 27, 10, -14, 0, -59, 9, -3, -42, 29, -2, -48, -28, 9, 8, -10, -46, 63, -19, 3, -31, 2, 12, -8, 15, 32, 59, -41, 10, -16, 57, 26, -20, 26, -23, 21, -8, -4, 5, 35, 19, 37, -16, -70, -12, -55, 7, -14, 7, -6, -36, -17, 19, 9, -24, 33, 34, -5, 12, 44, 19, -25, 18, -41, -24, -55, 16, 7, -36, 25, -13, 15, -12, 41, -64, 16, -3, -17, -35, 22, -23, -5, 26, -63, -32, -35, -26, -33, -1, 48, 9, -19, 8, 44, -6, 18, -22, 44, -49, 13, -8, 25, -14, -35, 12, 32, 19, 15, -33, 7, -35, -9, 63, 26, 27, -27, 15, -10, 5, -2, -2, -35, -60, 8, -20, -42, -16, -15, -15, 15, -4, -12, 11, 7, -28, 22, 82, 28, -19, 31, 4, 9, 12, -29, 26, 15, -42, -26, 20, 51, -25, -54, -33, -47, -37, -48, -4, 11, 33, -23, -2, -26, -6, -17, 34, 38, -12, -36, 0, -28, -16, 21, -6, -20, 6, -7, -31, -28, 18, 23, -3, 14, 17, -16]
5681a6j4qOL7KKK9l0j5K7l5o8N6Rm7L0J9rj6J5K3K4j12Q9k1qL4L9k7m1j0M6m6
5714c6PN9O3j08RJPNk5L6j2%l4L2Lrk6P2m5j8n5R0o8L7Nj3j2j6M1k8K4nM0J9o3
5749b3M5Jm2n1Q9l5j0oN0j4l3mL2kkj1%m6Q6p4N0N8m1Ol4J8mj7J9J0l0n7M0L2
5783@K1m7M2j5%kn0L9m1N3p0K4K8J2k4M9L9q4K8k6RJ6L3n0l0k5P7L5o5jN7p3M
5816c7O2l5nkRJ8J7o3L3J2o5P8k0lk9N9o0L8n9O5l7n3M0PL9k5L4k9ljlm0L0J7
5850a1J2j6ml2N3Mk1K0K9r5K0K6j4j2jM4l5M5l4N0k7l7K9J5k5J7K9mj9om0K8O
5883fk8N2rn8L9K7K1k8n4MJ03m1l1L9m4m4K5j3rMJ24o3m5O3mo7nJ9qJ3K3o1R2
5916C0m1k6N9K0m3lL5j34R6j0O9m5m6N5k3j8M0l4n8J23lj12M0P2n1l3O3rk1k7
$$ y = [-16, -30, -38, -32, 5, 7, 9, 38, 8, -7, 20, -15, -83, -27, -18, -65, -35, -16, -25, -41, -26, -3, 21, -91, -2, -23, -31, 3, 42, 15, -26, -36, 10, -36, -29, 30, 93, -15, -6, -5, 2, 7, -18, 18, 6, 6, -28, 4, 7, -2, -28, 44, -1, -19, -74, 16, -52, -15, -10, -23, -35, -51, -10, -38, -14, -19, 21, 40, -23, 22, 23, -19, -70, 19, -16, -26, -32, 18, 4, -29, -33, -1, -3, -5, -16, -16, -62, 24, -50, 0, 58, 17, 23, -11, 7, 3, -14, 5, 15, -15, -72, -32, 0, 21, -26, 16, 1, 1, -1, -51, -12, -53, 0, -70, -46, -18, -6, -30, 19, 58, -26, 2, -24, -15, 1, 34, -16, -46, -71, 6, 41, -24, -25, 32, -41, -37, 25, -10, -15, -17, -8, 10, 27, -36, -3, 9, -56, 22, 2, -1, -30, 29, -31, 7, -52, 13, -24, -77, -37, -30, 9, -16, 18, -11, -14, -15, -18, -58, -28, -11, 1, -15, -19, -51, 2, 6, -15, 5, 34, -61, -41, -15, -29, -41, -42, 2, -33, 12, -22, 28, 1, -36, -7, 8, -17, 0, 29, 25, 6, 0, -40, -12, -6, -34, 18, 9, -49, -10, 17, 38, 10, -44, -40, 63, 22, -9, 30, -14, -58, -33, -46, -55, -51, 73, 10, -35, 28, 24, -43, -48, -29, -37, -24, -1, -62, 30, -11, -37, 22, 42, -1, -4, 31, -103, -7, -17, 52, 7, -39, 16, -7, -25, 15, -19, -77, 46, 43, -69, -29, 43, -8, -41, 22, 13, -8, -35]
5946c5oN3J5k4lJ6q6N4K6j8j4OJ1j8NL2Kl8K4pm2N5OPm3rLN2j0m3N6Oq6P6jk5
5982cm9Q1l7j4j7M3K0r3P5mkl5%L8nKj5LL1rk4L0M4m5qJ9k1rJj0N2kk2jm1k0L2
6019a5j2KOM4o4N9Kp0L5J7l2K1lK0l0K3K9o5L8k8M4l1k0j5K1j7L4J0Rj1j4L6o
6052A7p4M4j2LL5l3K0K4l6l9N6o6K5M2Ml1LL2l9J6m0N3lk3J7K4m5J3Rm4K7l4N4
6085ak2J1J3m7M2j7KM6j6n0qL8M7m4LM4l6Pl0Nkk1j8O5m8j1K6l5O4Ol9L6n7J1
6119c6N7K1r6L6M4J9J6o6k7L1L3r7M5K6m5J6K9L5p5R7n4k3j4L9p6R8n6L6J0n0
6149b7L8k5l9L0K9m5K4j7QL2lLp4J20k8q5L6qL5j4o9J08q4N8jk4%L4j0Jl7JP3
6182D0l8m0L4J4k4j6M0J3p5O8j8Ql8O2j5l3lLM6n9J0K0qo6Q6p1K0L3MK8l9j4J1
$$ y = [-35, -41, 12, 27, 3, 0, 16, -70, -16, 10, -8, -22, -16, -5, -23, -18, 14, 16, -22, 2, -5, -47, 8, 14, 21, -22, -31, -28, 24, 14, -29, 27, 33, -53, 23, 22, -3, -52, 29, -8, -22, -39, 4, 24, -69, 6, 2, 0, -35, -35, 3, -2, 0, -15, -12, 19, 10, -14, 16, 60, 15, 7, 26, 5, -4, -3, -13, 39, 37, 15, 14, -27, -47, -15, -27, -25, -19, 25, -39, 20, 22, -48, -13, 4, -28, -7, -10, 10, -20, 3, 32, -33, 5, -23, 21, -10, -30, -45, -24, -41, -7, 3, 12, 1, -13, 23, 17, -57, -13, -25, -22, 13, -20, 0, 24, -12, -51, 5, -61, -36, 6, 10, -21, -18, 14, -25, -9, -49, 4, 1, -22, -5, 19, -26, -13, -4, -48, -21, -55, -1, -23, -12, 1, -46, -4, -21, -19, 27, 11, -39, -47, -9, 38, -6, -3, 41, 5, 12, -18, -13, -15, -36, -54, 11, -37, -48, -22, -57, 7, 13, -26, 10, -47, -36, 21, 42, -54, -18, 26, 45, 61, -5, -32, -1, 32, -65, -20, 6, -39, -23, 6, 41, -34, 63, 9, -14, -28, 11, -65, 33, -23, 13, 23, -27, 11, -14, -53, -23, 6, -39, -15, -32, -24, 8, 5, 8, -66, 54, 26, -59, -23, -31, 4, -10, -79, 29, -55, 3, 2, -22, -22, 12, 2, 3, -34, -33, 40, 2, -38, -4, 10, -14, -30, 10, 23, -52, 16, -2, 6, -32, 30, 15, -18, -21, -18, 28, -31, -21, -1, -9, -75, 11, -60, -40, -7, -3, 25, -14, -28, -17]
6215a7L5l4mk7N5j0L6o2K4j9l3O5K4j4J5m1KL9n6k9N1N%K5n8%RJ7J6o5M7K7r8
6248g5P6%Jj3m4JJ5LP9j6n1J7j1K9j7jkmON6j06%R6m3k1J3J5%Jm3MM9o1M0K1l2
6284a8J8o%l3l2K4L6M3mj9j1K6n3L1JJm5K9l0K7M1k6o8Q5j8k0Jk1O1q3L6K0o2
6317f9KK5O1J0m6J6Qj7k2R2o7m3J9O4Kk7lo1P1n4M3o2O3nk6M2j6L9l2L9n8N6m5
6350aM0l5nK7l3Rj2jJ3J4J6J2o2L0l7L9m4J6J6L4k7m9M0mLn0Q7j0m1QljOl9N8
6385A4J4n2K7J5nl4Po7M9K4j6j5R3j13L1N1k1n0N9m8L3k4k8L8m2L5K1J1J2j9K0
6416B0K0n1l9M1L4l3j5j0J2j4L7Jj8j7mK9j1k4M9%Nj9LrJ0L4J1l4n3L2l8N3K9
6449C1lk6mK0k3j5kO7m8jLpK3K1rm8j2L3K2kJ8n8jJ7o4Q2l2K4n9K8n3J03j6n2
$$ y = [-17, 18, -16, -20, -47, 8, -2, 34, -28, -4, -23, -56, 9, 33, 19, 34, -7, -5, 34, -22, -51, 0, 5, 5, 30, -28, -28, -19, -2, 14, -51, -4, 23, -75, 1, 1, 2, -11, -55, -54, -39, -36, 43, 27, -24, -7, -18, 11, -6, -7, -9, -13, -7, 49, -57, -57, 39, -4, -25, -12, 3, 3, 4, -39, -35, 14, -47, -7, 14, -18, 0, -6, -6, -39, -71, -47, -11, 32, 28, 9, -2, 24, -29, 2, 3, 4, -41, -12, -42, -15, 26, 0, -68, 17, -1, -21, -20, -41, 20, -63, -27, -7, -69, -67, -42, 19, 29, -17, -1, 7, -10, -32, 60, -7, -50, -31, 33, 35, 8, 5, -56, 15, -39, 4, -58, 5, 0, -26, 16, 0, 39, 7, 46, -12, 44, -1, 39, 4, -1, 26, -7, 2, -10, -11, 2, 16, 32, 44, -18, 12, -25, 14, -30, -14, 2, 36, 9, -40, 0, -4, -1, -51, 36, 26, -15, -7, -10, -11, -5, -44, 14, 28, -24, 3, 18, 13, -21, -14, -81, -32, -8, -24, -39, 54, -59, -28, 23, 2, -48, 11, -37, -4, -28, -56, -18, -60, -25, -4, 7, 19, 0, 20, 40, -11, -50, -9, 25, -8, -23, -33, -21, -35, 2, 3, -15, -32, -36, -7, -18, -42, 7, 7, 12, -7, -4, -13, -3, 31, 42, 8, -45, -13, -51, 2, 31, 28, 2, -2, 18, -5, -20, -22, 45, -3, -4, -1, -8, 15, 36, 27, -21, -33, 0, 22, 20, 38, -20, -21, -4, -68, 14, -18, 6, -53, -25, -78, 25, 9, -43]
6483d3L7l8M3J6pj8k7j5N9j8J0L6rn8J3L3K9m4J6K2n9M8l1L1ll4j6K5n4M1J7k3
6515b1MK8l4k1L4k4L7%j1N3n9j2j3J1M1k9J3m0K1N4p4J3K5J9l6LK0nkpK5L9m1
6548A1k4K4k2m3J1N8k4N3j2j9m2L8k1m8L9k3M0k4j9O5k4l2Qj5K6%J3M9o9J0K4
6579HoMK4j3J5n6j2J7QJ0o4J17n3k1K5j1l0O1n0L4QRk6j0J5oK6l0j0J7K3ol2r
6613b4L8m0%J5o1M9J5J4%m8J6rjO6m2k0L2L3k9QNk5oK9Ml1M5Lq6J3K9J2K8k4L1
6648C9mn3LK4%n2K8L1J2o0M2J9l6jJ4m3jM5j5lQN0k7r0P6p2Q5l2j5P2n7m1R4m4
6682dNPMl7L1J9l3K2jj8ML6m8j0K7k0NrM9p0L8K6p9R4n4M1n8M8j9n7Q3l0K4ml6
6717b4M4l8n0N0jj1P5p0N7%n2M3q5K5K7j3L9K4m0Lk0Qj3JnLnm1K4K8L8oo5P9l3
$$ y = [-43, -6, -44, -1, 15, 8, -10, -37, -52, 7, -11, -1, 35, 26, -32, -19, 14, 43, -1, 15, 37, -22, 26, -5, 26, 23, -11, -27, -2, -56, -15, 2, -21, -17, 11, -23, -44, -10, -34, 3, 3, -8, 45, -14, -26, -39, -28, 13, -16, -3, -43, -22, 32, -42, -29, -4, 15, -21, -18, 2, -3, -5, -12, 13, 52, 11, -13, 11, -11, -54, -43, 15, -9, 44, 32, 13, -29, 9, -12, -60, -21, -44, -4, -28, -47, 18, -6, -38, -30, -45, -19, -19, -6, 43, -26, -16, 8, 2, 6, 30, 17, 32, -24, -36, -19, -11, -1, -65, 52, -1, -22, 3, -8, -38, 23, -27, 7, 15, 24, -2, -12, 3, -3, 23, -7, -17, 0, 23, 17, -15, -24, 14, -26, -26, -11, -72, -23, -8, 6, 6, -42, -26, -35, -36, 30, -12, -32, 0, 33, 4, 12, 17, -8, -14, 15, 19, -12, 33, 36, -50, -37, -8, 4, 32, 8, 39, 35, -18, -15, 9, 9, -43, -15, 16, 28, -32, 10, 29, -7, -8, 6, -37, -38, 7, -8, -11, -3, 47, 20, -70, 6, -66, 19, -13, -28, 44, -13, -54, 40, -4, 1, 8, 12, -25, 6, 25, -8, 14, 13, -5, -1, 35, -13, -23, 4, -16, -11, -20, 29, -41, -3, 23, -56, 38, -16, 25, -33, 15, -4, -61, 22, -8, 16, 12, -24, 20, -18, -68, -18, -19, -30, 45, -25, 32, 32, -20, 23, -62, -37, -10, -23, 16, 40, 0, 3, -17, -9, -22, -21, -26, -23, -28, -69, -45, -17, 21, 15, -50, 29, -4]
6752dp1R7l0o2P7j9pJ0j4nJ8M3l9L3%m8J6N5n3K1Ml5Qj8lJ7K8j6m7L8Nj6k9NN5
6787A4L4l7k3l8M7O2q1Q8r4Q0k2n0K1LJ9j0k7oM7m4M0l5N7q7K2J5j6k1O3k2l1
6818c2k3P9j8M1m4j2L1l2N8n0L9m5m4M9k5OM3pl2O7n0k0RJ5m0L8j1l1N7rm3k8
6850f4J6N3j6L3Rl4j5j5J5L4llK9q9M7kK4lj0L5o6j7O7j5k4QK0pj8%J1m4N0j1
6884eJ8k7m4L2J8l4k9J06n1k0N7l2O3j26J4L5j9K9m8J05l8KL4j4j3j6pMpN8r8
6915e3J9M9Kj7J2l0O5n1%k5K3mJ6K5k2L7n6j6kN1j1J0l5olk2J0K8rK5ok7Lj4L5
6950Al3K6K9k5L1m2l8k4Q0kqNj0PnL3J9k4m2N5n5pK8K1n6K1N7p8K7j8m3J04k4
6983A0j2KJ4j9L1k9RLK3o8L7Pl6k3N8o9P6qL4l2qk4J3L7m9K3qk3J0K7N4m2p4P7
$$ y = [-4, -75, 22, -8, -70, 7, -12, -19, -9, -23, -28, -10, 33, -6, 27, 27, -21, -5, 50, -3, 18, 22, -13, -5, -23, -26, -9, 19, 3, -44, -6, -1, -17, -46, -41, 14, 48, 11, -12, -50, -3, 59, -22, 66, -28, 52, 30, -20, 1, 4, 23, 13, -14, -20, 27, -17, 23, -12, 45, -42, -20, -5, -21, -42, 21, -1, -32, -55, 24, 6, 47, 3, -9, 22, -10, 48, -2, 37, -8, -52, -3, -28, -22, 21, 14, -18, 49, -1, -21, -12, 3, -37, 1, -10, -41, 16, 7, -36, -64, -48, 5, -11, 22, 31, -3, -18, -33, -18, 16, 13, 10, 39, -50, -3, -5, 19, 16, 6, 41, -25, -42, 25, 10, -14, -6, 14, 7, -11, -11, 0, -44, 6, -5, 13, -14, -58, -26, -8, -42, -71, 35, -16, -36, 21, -11, 52, -74, -60, -25, -44, -15, -63, 42, 4, 6, 40, 26, 13, -3, -10, -6, -13, 45, -53, -34, 15, 17, 0, 12, -18, 47, -4, -4, -29, -6, -10, 6, 31, 9, 46, -10, -26, -28, 23, 12, 22, -13, -19, -22, -44, -34, -6, -15, 10, 4, -23, -20, -34, 1, -32, -6, 23, -2, 29, -13, -51, -75, 5, 3, -5, 0, -10, -3, -8, 25, 44, 20, -22, 33, -22, -29, -1, 20, -36, -15, 42, -36, -9, -27, -70, 34, 10, -2, 0, 14, -5, 26, -3, 6, 9, 32, -36, 1, 8, -28, -51, 7, -62, 14, 6, 40, 8, 0, -24, -11, 26, -23, 0, -8, -31, -21, 6, 60, 18, -56, 21]
7017B1om4k6J1N8k5K2k8N3k1l8O2n1K0J3l7P0k0j6j0Qp1L8L5n2K3K9Rq9M9J1O3
7049F1m4%m1J0M2J6o1k6M2M4k9j0L1J8p6N9l5K8r5P0k5J8nl7L0K5lo0Jl8O2j6
7081d4K5j9L5k6J2M6m3j0J1r0J17%l1k8M6J6k1M8j18J14n9kK7j9LM0n8j9L9n4
7111f2J02j7n8k1R1j0lqP1j32J2L0K2Pl5K2k9K1l1L3L7o7K4k5lL7Qnn2%M3J1r
7144Dk0mrK8K4l8j1kM8l9k2QN0l2L0MOl0j2K1j9L5m2oJ4qK7n3O0K6j9Mm0J9l0
7179b8j3L9J6l0o5P1l1P0J4l1mPl2j9N3n7P0k5k4L9k7J8j3N1m0k4MKk2J7RJ9m3
7212b9L1m6Q1pm7j6L4L2Lj4Ol6j6O1o9M1l6L3J6m7J8pRj4L4Jn8k7M9j2L5l6K5
7245hm8K4M3k0Mj9ML1k1lj5j6L3O1Jm3nj1j7k0P0m2L7ol8J5J1k7L7j4J2J0k7M0
$$ y = [21, 15, -29, -55, -44, 14, -11, 11, -17, 36, 15, -23, 39, -12, 8, 21, -16, 54, 34, 18, 8, 16, -55, -17, 18, -34, -11, 18, 27, -62, -13, -2, 61, 17, 17, -24, -14, 28, 44, -17, -43, -1, 43, 14, 4, 35, 53, -23, 36, 1, 29, -66, 4, -21, -3, -8, -45, -15, 10, 7, -53, -52, -90, -28, -44, -19, -38, -3, -29, -17, 29, -14, -24, -13, -103, 14, 14, -17, -45, 1, 17, -4, 44, -74, 40, -19, -21, 6, -13, -10, 30, -28, -47, -8, -62, 40, 23, -35, -56, 35, 25, 22, 14, 85, -47, -35, -5, 17, 24, -11, 11, -18, 3, -28, 5, 42, -25, -1, -26, -29, 8, 16, 11, -41, -41, 2, 13, 4, -16, -20, -29, -1, 23, -15, -26, -28, 20, -19, -41, -33, 17, -15, 15, 19, 25, -5, -17, 4, -15, 20, -22, -28, -14, -22, 5, -48, 12, 38, 19, 23, -17, 2, -28, -41, -2, 14, -16, -81, -10, -41, 29, 43, 12, 8, 15, -17, -36, 17, -40, 30, 5, -19, 20, -7, 11, -2, 49, 9, -15, -11, -9, -31, -14, -5, 14, -29, 2, -44, 37, 30, -17, -33, 1, 33, 36, 22, 28, -8, -24, 37, -32, 9, -27, 6, 22, -25, -7, -14, -5, -19, 15, 16, -42, -69, -20, -32, 3, -33, -8, -56, -32, 11, -9, -5, -24, -20, 11, -10, -13, -28, -44, -11, 50, 51, 8, 3, -8, -25, -45, 25, -17, 20, 14, -24, -9, 2, -25, 12, -2, 10, 20, -7, 33]
7279C3r3M6J0J3j7lpm1O6j2J8o8QqM2O8p5Kk0pO0qn8M9j4QL5n4M8ool1J9Ml1%
7315c0N7K1n6L9k5JRj4m4M8k9jN1n9K0N2k5J8o8N0Ln1L9rk4MM4j0n9L4m0N7pj5
7349a9J8j1j5K3J7k5j9L2n8M8K7n3L6J9n7J9kj7M9n4K8K9POj5m1M8n4K7k1N4o4
7381c8j1O2p5P4j1jk0pN0k7m5K6K3K7k8k8J2%N4o9O7q5%lJ8PrmOP9l8k8O8r6R1
7416D1o3Q4m7k0o0P4m5JR3o9qL1k1L7j7ON2q5M8l8j9L9K3Kok9kM4n1k2L8m3L2
7449@l1P5q9J5N0l8k1L2k4L1m2Q1o4J1j6O5Lp5N3k5Mk8L0mP7q9M7m8JKK8Kk0l4
7483d1J7K8p7O2qO4k4l5KMj2L7l6K8n8M9l7L1Qn4K3pJ01q5K5pk5L5J6j1k1J9n3
7516d2K2qP4o9M3Qn6J3JL8l2MJ8m6M0l8M8k2J4rj8PL3k1QJ1l7M9rk9k1K1l6N3
$$ y = [33, -60, -14, -4, 9, -8, -11, -18, -59, 7, -5, 13, -55, -47, -55, -13, 55, -20, -18, -38, -45, 15, 7, -51, -2, -16, -8, 27, -27, 21, 15, 9, -22, -3, 1, -30, -30, 27, 48, -8, 31, 6, 7, 16, 2, -42, 6, -23, -24, 27, -32, -12, 40, 15, 33, -35, 15, 18, -33, 6, -3, -27, -23, 21, 11, -48, -14, -54, 3, -4, -19, -1, -12, -27, -4, 13, -12, -31, 1, -57, -9, 18, -35, 1, 20, -37, -18, -20, -37, 12, -42, -14, 15, 22, 28, 13, -28, 20, -34, -7, -28, 26, -38, -49, 13, -62, 12, 1, 0, -20, -27, 23, -4, -49, -23, 0, 27, -1, -29, -17, -17, 37, -32, 35, -50, -50, -53, -35, -28, -37, -41, -35, 44, 6, -22, 46, -50, 41, -22, 62, 15, -5, -65, 9, -36, -35, 58, -11, -19, 12, -9, 28, 11, 17, 69, -16, 32, -6, -25, 14, 37, 39, 33, 4, 2, 46, -5, -27, 11, -32, 0, -31, 44, -45, -30, 20, -18, -39, -7, -31, 0, -42, 39, -25, -14, -30, 35, 38, -37, 16, -9, -5, -33, -3, -7, 70, -19, 28, -20, -19, -17, 11, 13, -7, -41, -24, 4, -73, -11, -19, 45, 21, -14, -12, -8, -20, 17, -19, 9, -49, 0, -37, -6, 2, -52, -29, -36, 65, -20, 5, -2, -27, 8, 24, 13, -8, 11, -42, -20, -28, 46, -23, 20, 28, -28, -15, -14, 24, -8, -4, 14, -32, 8, -30, 18, -4, 10, 1, -17, -10, 23, 2, 10, 21, -16, 33, 24, -5, -26, -5, -41, 12]
7550A2j2Jn7L3Oj1l4J7M4k6L5K1q9O1M9p0jKK2NL0o5J2J2K4l4J6oj0lJ5j8L5L
7584A9l9jJj7N4k3L2j9MM7l6k9Pp5O9J7q1N3M3pJ4k2o5N6L9l1l2J4OkMKK8J6q6
7619d0L4L3nq2M9pk1N0k8O5p9M2j5j2OL1jk1qKJ1QJ0o4K5M4j05N8N0n8PK0K8n0
7653b3M7l1j8L5L4qoj09M9M0m0J2L4l7K5j3l3J7M3p8N9J4k4N1m4LL6k6n3J6L0
7684BJ0Lm1mK0qj5L6m0K9k0j1K1J5J7l5L8l6J2j5K3k9K6j4Kl5N3l7K2K3J9m9J8
7717@j6KJ6j6J5%m2Q8o9L2pMn1P1q6N8MJ8J0n4J0l9M6rN1o5N6l6j3PL6r4KRJ2
7752e0O7o0ML3k9O1l8K9l6L1rm9L9j8j9N6k3N0n0j5j7M1j1qk6O6r3Q1j6k5L7m1
7784c8J8K9jk1jm1P3n1K8M1k9L6k4l8n2O7l2M4J1k7K1j7n3N1k7PJ3K3nqQMj3l7
$$ y = [12, 0, 1, -56, -23, -17, -28, -62, -45, -1, -27, 8, 29, -60, 1, 50, -20, -21, -19, 3, 8, 38, -27, -15, -3, 21, -13, 3, -3, -13, -16, -1, -19, 16, 19, -20, -21, -20, -37, 17, -6, 26, 7, 11, 58, 22, -7, 0, -75, -6, 11, -70, -17, 26, 19, 33, 11, -54, 2, 41, 10, -22, -8, -2, -4, 0, 2, 30, 46, -40, -6, 27, 22, -60, -11, -18, -39, 11, -17, 48, -31, 11, -4, -16, -10, 21, 20, -1, -9, -7, 4, 12, 22, -42, -17, 27, -78, -20, 30, -28, -21, -1, 27, -23, 24, -7, -25, 10, 44, 36, 30, -79, -30, 10, -30, -18, 16, -21, 4, -9, -42, -25, 18, -60, -1, 13, -11, 40, -4, -1, 35, 9, -44, -28, 2, 12, 15, -26, -30, -10, -18, -33, 3, -37, -8, -28, -39, -18, -3, 14, -21, 17, -19, -7, -22, 1, -28, -2, -16, -14, -49, 4, -33, -11, 12, 31, -18, 0, -16, -14, 2, -14, 1, 1, -41, 47, -22, 10, 3, 7, -44, 27, -59, -1, 3, 21, 31, -23, -13, -52, -6, -15, 36, -29, 27, -9, -22, -15, 21, -73, -71, -62, -50, 17, -43, -39, -6, -35, 26, -12, 17, -19, 12, 3, -46, -7, -25, -44, 12, -11, 39, -11, -26, -43, -2, -13, -21, -47, 19, -74, 7, -9, -34, 3, -38, -20, 9, 8, -13, -14, -55, 18, -33, -5, 36, 7, 43, 19, -19, -71, -4, -36, 8, 19, -8, 13, -4, -57, -6, -33, -26, -13, 10, 5, -3, 5, 9, -4, -41]
7818d1M1J8k6k0RN5m5N4l3l9RJ7Lj8Ol2jj9N0Kj0J3J9p1J3L8k3qK8nJO0j1n2N
7853a3K3k7L9n5K3J1j5M5m3oJ2l0N9l0K2l1k3N5n8J0J3QOl2L6N3o8M2k9kJo0N0
7886a4PJ9l6L1K9k8j5p9M3K7J0j2L7p5M2j0J4mn9R2n3M0%m4L6M7l7k2lk4K5j8
7918c4NOL7k9l7M2M3q5L1nM6m4mK9oNmm0K2O1l8j8L4p7QO0j4l8L5M7m8KK0j4O
7953Dk0L2m3JJ3qL3p6J01k3Jo2QK5JMN2K6q7KM7l4PL1n1M1k5J4k8L4l8Kl1L3L9
7988B5l9Mj3L0j0%J1qqMPm1J9j1k6K7OK7l6j3k3O3o7L8L3n4L4L7o1P0RJk6J2p8
8023e7K1M3k6oM9j7k8j3j3N5LK5m1J0l3l1N8OJRl8J0j7l6M1L6n2J1j2L2j9L2n8
8056e5K3l2K0LoR8j8n2N1p5nP2n4L7j6kMM7p8K5j1Kl9J9k2%Q1o4O%j2N3jrJ2m6
$$ y = [-41, 0, 18, -8, -28, -19, 36, -9, 45, 12, -27, -18, -1, 2, -16, -10, -42, -43, -62, -12, -10, -20, -7, 12, -59, -46, -8, -31, -39, -11, -16, -15, 45, 34, -18, -13, 10, -17, 22, -33, -10, 1, -14, 31, -12, -18, -6, -36, 23, -7, 15, -16, -39, 16, -42, -32, -19, -11, -5, -37, -1, 52, -16, 26, -3, -5, -4, -64, -14, -7, 12, -24, 7, 36, 8, -7, -86, -43, -16, -6, -18, 19, -56, -14, -24, -10, -14, -73, 19, -34, 6, 6, -38, -2, 45, 8, -14, -17, -41, -16, -34, -29, -23, 14, -15, -52, -10, 33, -52, -21, -26, 20, -24, -28, 1, -5, 0, -4, -44, -22, 39, 1, -17, 17, -60, -52, 8, -6, -44, -9, 38, -10, -8, 12, -2, 4, -16, 16, -27, -26, -13, -21, 12, -64, 37, 14, 15, -47, -39, -14, -13, -9, 43, 69, -18, -16, 31, -3, 4, 35, -16, 25, 0, 14, -14, 20, -18, -16, -47, -14, 25, -14, -10, -23, 7, -3, -3, 8, 0, -8, -4, 3, -38, -19, -30, -56, -29, -23, 4, -32, -45, -68, -5, -72, -34, -1, -55, -21, 16, -45, 25, 34, 35, 9, 21, -57, -36, 7, -19, -25, 24, 7, -21, -34, -47, 8, 11, 36, -5, 5, -28, -59, -1, 5, 6, 15, -23, -13, -30, -66, -25, 11, -41, -30, -42, -10, -29, 3, -55, -32, -64, -44, -41, -47, 51, 33, -19, 32, -43, -48, 24, -30, 7, -9, -11, -7, 40, -38, -13, -24, -22, -61, -42, -64, -64, 17, -47, -41, -41, -53, 0, -1, -10, 2, -44]
8092d4nnR5n7K9n6M8l7M1o8K8OO4m6K0K7n8k1M1l5K1ok4O6m9L5rk4PK6j2J8m7
8125c1N2p3M9Ok9j2Q3p5M0J9ol5K1%m3L1j1m0M9j6OrK9J3n5l7R4l0l6L0llJ9J
8159bm1O8K9n4M2k4n5%M4k6l2M7j1m0O4roj1J6o4R1p4N9K6ol8jL0k9m2J3M5
$$ y = [-44, -49, -54, 41, -16, 13, -43, 5, -32, 9, -59, -31, -25, 39, -7, 13, 40, -18, -39, 2, -33, -12, -18, -42, 24, -25, 10, 1, -23, -16, 10, -2, 16, -31, 21, -52, -3, 3, -26, -38, 45, -30, 10, 29, 23, -12, 9, 9, -34, -3, -14, -54, -5, -21, -15, -24, 5, 18, -37, -74, 20, -10, -46, -16, -19, -22, -3, -2, -43, 25, 54, 0, 42, 18, -37, -37, 7, -19, -51, -4, -15, -55, 9, 0, -6, -17, -1, -65, 26, -48, 11, 37, 31, -7, -8, 22, -7, -49, -36, 9]
8191I
$$ Imaginary data points
##PAGE= N=2
##DATA TABLE= (X++(I..I)), XYDATA
0@%%%%%%%%%%%%%%%%%%%%%%%%%mQoOj0J2j3J7k2K4k5L1l8M2m9N6o2P1q0Q9r8J09
47E8j24J37j49J67j86K02k18K38k58K77l00L20l36L48l49L25k61J22J86r00K772
68B071r247O5153L80615l11610n18188K14660M54485p3515l51342l7219J84210
79G3J26394K909j69621j93145J69055L55890j19794m80042M8150N43214L5057
90C18140n39345j11774M73360J68600l63822j85856K20544J61530o4679j01115
100b4417q1279J3035J95919R4334k74129k01344L10940K87176l04448l40308K60647
111f3874L55678j97060l26762J27946K54575o0951j51185P332L4527K2620Q4582
122H7428k8395j92903J8356K74493J563l19817k7094L30222M7375l10272n2156
$$ y = [0, 0, 0, 0, 0, 0, 0, 0, 0, 0, 0, 0, 0, 0, 0, 0, 0, 0, 0, 0, 0, 0, 0, 0, 0, 0, -4, 4, -2, 4, -6, 6, -7, 10, -12, 12, -13, 18, -20, 22, -27, 29, -33, 38, -42, 47, -51, 58, -66, 71, -78, 89, -97, 105, -113, 125, -133, 144, -156, 164, -172, 176, -173, 152, -109, 13, 199, -701, 2071, -7176, 57977, 438592, 126982, -391206, -176546, 277939, 204424, -146918, -184137, 73, 126467, 129376, -40245, -233390, -64335, 291555, 171761, -308281, -260131, 283083, 318140, -221205, -332979, 140381, 308981, -54841, -240697, -20153, 141377, 76698, -24417, -105696, -92661, 103258, 197592, -76537, -277881, 33059, 320235, 15787, -324521, -63874, 291804, 94744, -232018, -104072, 150503, 89552, -61633, -54301, -19774, 2846, 87428, 59033, -133870, -115514, 158979, 160542, -159275, -186369, 143853, 191228, -119044, -171200]
133a71200K61910L9429j94187j3701J20955k4464n2351P1932r329j18156N9999
144b9163J53063r4262j73371J14669J78769j27685j64857J36607J32548j40158
154a3840q9505J41979M3543j45565K928J47288m6147j41232P8295J26324r8067
165F001j03986J09402P0093j15332k3737J15389k9461j12884Q1470J13487j28787
176a8345j16753J67554J18003j88608j14941J87999J07774j68550r0571J34523
186A8085N8448q8074j2443L5282m2168J2221J02530m7590j64901O9520K17826
197A58736p6405k51755O5518K62602m2127k48547J5675K06286P331j37623k3184
208f3493N3236K5647L6574q977j23283k3616J97099O5520k45421j10809K62360
$$ y = [-171200, 90710, 130139, -64048, -77749, 43206, 18742, -33609, 38323, 28994, -89162, -29163, 123900, 29638, -143733, -29064, 149705, 22020, -142837, -6230, 126318, -13840, -103345, 38634, 82177, -63388, -60460, 86828, 40681, -100551, -22256, 104068, 6001, -97985, 11417, 81510, -33822, -57559, 57830, 28369, -84515, -3045, 110442, -18345, -135098, 32456, 150459, -38149, -153090, 34909, 142683, -25867, -116438, 18085, 76533, -11541, -23984, 11298, -30870, -18649, 83881, 36291, -128610, -59090, 158736, 82331, -169424, -103906, 158696, 116569, -131978, -116303, 89983, 97314, -40309, -63493, -10257, 15390, 51964, 42987, -80296, -103912, 93187, 158707, -86714, -197523, 64837]
219F4837J53039k49349j81089K09210J84934j46071j62881O9841J15961M315m6014
230A6733o6941m0749J12003J30227j33204k09459J27208K69519r8785l01955N8316
241a37087K98900j2645k59326l0124J91175N9664j02658o7750K916N4269R5132
252I2466k2740j76854k3729K32744P8201k60116j28809K56045J64265k21400j79837
263a89764J63906J71425r5646j35860K5921P5838L7663j211q4713p8031J09357
274a115J53660j11831k14867R7202K51007o8703k57517L3076K35961n51j89121
285g2799k0964J21286K8894m2962k2967l4012K139J00898K9412j52998o3212J84281
297E6996R1873j91760j11554J79179J17921j52444j06342J16357P7802p5014l7786
$$ y = [64837, 217876, -31473, -212562, -3352, 181582, 35511, -127370, -57529, 58432, 62747, 16733, -50208, -90957, 21046, 151273, 18069, -191390, -64182, 205337, 106552, -195403, -137087, 161813, 149168, -110158, -140282, 50893, 110557, 7899, -59851, -56935, -2666, 92466, 69726, -107128, -130857, 101887, 180088, -80028, -208837, 47208, 211473, -9927, -189764, -25858, 145567, 49921, -85939, -60018, 15820, 53483, 52272, -32441, -110472, -1115, 152545, 40714, -174153, -76951, 174056, 105353, -152164, -119088, 116873, 116322, -72799, -93763, 27523, 56417, 13455, -9512, -43524, -41385, 59513, 88925, -64073, -127285, 56996, 148869, -42891, -154445, 24734, 142655, -9789, -116131, 226, 78028, 3014, -34772]
308c4772L6654q708o148N7981j5963j02974L0642J35848l7320j54177L7834J57929
320I6826l7806j47104M0176J21699m4712q7644N1339N1221o1845j4718P3525j9464
332B1493q1332M7479Q3143o6901p8694Q0592O6814r0476m5560R6395J8546r8906
344d7407R649J00317l6362j01126N9823R7806p6299q8872Q2520P4317q0503n3476
356e9613P2816K3981o0870J2438M6476n1114l4217Q8735K7415j22391k4700J47373
368F6329K5096j57530k8265J51943L2080j31898l0906R8275K1618n3660m530M591
380f857k0321M0955N3019p9087q9651J05453J22723j16268j47355J10102J59744
391A32457r0763j55550O3569J31469l2221q9175K349L4770J9231K7110k8194r0138
$$ y = [-34772, 1882, -6826, -12974, 45007, 29044, -73930, -43288, 92560, 55240, -98937, -61103, 96826, 59020, -88084, -47908, 73791, 29079, -58565, -7226, 43995, -17850, -32568, 40957, 21493, -59839, -12360, 70783, 3882, -74812, 5780, 72594, -17882, -63442, 32953, 51499, -47407, -37758, 62559, 26197, -74929, -15106, 82700, 6401, -82471, 49, 74366, -6137, -59613, 13203, 37184, -23686, -11248, 35228, -15886, -50103, 38632, 66047, -56344, -81044, 66329, 91425, -66105, -94370, 57573, 89653, -42245, -73151, 25124, 46742, -6918, -11448, -6857, -27178, 13777, 66796, -12291, -101942, 3511, 126234, 9966, -137389, -27287, 132457, 41694, -113856, -50287, 81182, 48961, -40214, -37865, -3095, 16136, 43246, 15052, -75086]
403g5086K5490J45312j2100j83911j0309K02252L6227j99237n8128J73726P0625
414A14861j28752p1342P1394N7335j0845k7517m6781j4509R4836O1557j25794
425b5557j07732J36617J47361j28993j72364J06406J76990p2217j59831L3191
435f6129J23635J733p0452k7043O166M0288N9749m0064j18176K5879J62788k391
447I5983j89458k3525J93496M6278j75173o2047J39514O5766r2391n4153L9098
458a6612K9366J3433M652n7042m3877Q7727Q3891j04695j16693J07598J36669
469A24417r6976j41934P7364J31483n4862j05194L3111O5588j4950j9375L227
480A899k7698l66P1188M284j06588j1249J28672J9262j35742k5992J30314K7690
$$ y = [-75086, -49596, 95716, 83616, -100295, -110604, 91648, 127875, -71362, -129490, 44236, 114861, -13891, -85233, -13839, 43496, 32651, 5134, -41647, -56156, 38680, 100237, -25557, -133289, 3328, 150689, 21696, -150668, -44262, 132728, 60511, -99320, -66129, 57506, 59239, -11213, -38256, -32090, 8198, 67947, 27883, -90293, -64414, 98374, 95983, -93475, -117000, 76496, 122774, -52399, -114446, 25068, 90834, -1557, -55710, -16612, 12754, 26187, 30839, -26203, -70080, 17647, 101538, -3157, -119850, -12252, 124417, 27441, -114493, -37129, 94354, 39492, -65702, -32591, 32997, 18047, -1328, 1899, -25799, -26165, 45023, 49307, -57281, -68530, 60142, 79404, -56338, -82330, 47984, 75674]
492G5674j14076k1187Q8965Q142n9096R635L0138l0913m522N3372j7813p1850
504e3531L4872Q2901m5785q6777N2683Q2431n8258o9581O2383M9745o5039k7067
516d1023O7188M477o9286J7211O9011l5517o3862M8233N4571n5545m0813N9810
528A4455K1684o1261K056O0206k6751n8614M9455N8166o9083n7711Q2730N4946
540G0278q7524m9909Q2687M1744p0711k8201N3127P854l1367J7234R181m4395
552c0002Q996P2614k1284r8294K7900J16669k7997j23805K1819J19705j3000j03352
564e0031N349P4602q75l6606O88n229p273M5698K1042q1802l9068J08324N7575
577I2394j20962p4325J19106Q5858j04732q7299P9912P6492m7397n4208J3292
$$ y = [75674, -38402, -59589, 29376, 37518, -21578, -11943, 18195, -12718, -17240, 36132, 18319, -53531, -18659, 64242, 18457, -68320, -15637, 66794, 8536, -61045, 1338, 51083, -13956, -41023, 26165, 30642, -38644, -21433, 47578, 12061, -51801, -3568, 51003, -4542, -45355, 14455, 36139, -25122, -23066, 37140, 10389, -48225, 1230, 59396, -9687, -67398, 15332, 70278, -17246, -67155, 15532, 57276, -13435, -41636, 11491, 19345, -12022, 5212, 14393, -30002, -21006, 51608, 30324, -67970, -40070, 76599, 48602, -75203, -53384, 66321, 53321, -50031, -44682, 29920, 29045, -7561, -6873, -12102, -19375, 26323, 47365, -34437, -73505, 34819, 92394, -28568, -102893, 16213, 102071, -2661, -89960, -10048, 66444, 19047, -35161, -21869]
588b1869K2490J6423J7204l8389n9913N1146R8453n2443j27945M2680J45104k6264
600F6677j46773P569J30922R717r9935k2316N8868K5586j2370j8231l4798K266
612c2818P6132J9495j05502m4471J21208O8221j22679q4639J10488R0346q6322
623I459q4563N5913O6605k4661l6940m115o92K7058M0107m0630p7199M3704J07698
636H1744l8887j27030K8466J31679j4853j21743J289R9842P542o7850r329K9523
648C93M885R491N568m3432k1242P0184L8812q7726n3548R4146O2628q9749o5201
661g4791P7916N9291o2138m4052M3600K1815k5249L259J0461k9325l44N3977o805
674B7615p2893J1292Q3708j3031q6265J4248Q1508j6900o9533K1778N1695k7433
$$ y = [-21869, 621, 17044, 34248, -4141, -64054, -12908, 85545, 33102, -94843, -52163, 92941, 66677, -80096, -72527, 58395, 68112, -31823, -54139, 4729, 30315, 17945, -286, -35084, -32818, 43314, 62809, -42693, -87164, 34044, 102265, -20414, -105053, 5435, 95781, 9459, -75104, -19191, 47414, 22753, -14187, -18302, -18994, 8064, 48171, 7541, -69658, -25954, 81744, 42857, -84173, -55707, 75972, 61119, -60624, -59335, 40507, 48049, -19801, -29130, 393, 5278, 14769, 20337, -23095, -44337, 25847, 64659, -23067, -76615, 17531, 80159, -9590, -74791, 3125, 62416, 278, -43774, -174, 21641, -3608, -349, 10112, -19213, -19557, 34420, 27615, -45278, -33986, 49722, 36691, -49574, -35326, 46182, 29282, -40251, -18473, 33222, 5789]
686E789l1682L4233J2117m1994O335M8317k2593n0747L4303M9230m2211m3897
698d2800M7662L3708n1484j9236N3187K891n3429J2677N3625k6616n2725L8085
710d455M9044m4744m1957M6140L2217m3920j8634L9562P59l3225J9314K6341l9122
723a2680k1398N7125J8725p2007j7051Q0373J5781q0429j5324P2975J3382n8937
735a9465p647L8768k067j4620J4722q947l0286K9370M8136m4965o4826N4377P6867
748F9417n5388q2848M9014Q1476l8262p0674K5053N0238j1456k3167L08p476N141
761h624L9047m809o8073k75Q9695R063j00825k0305J01694L0066r1737l4964P1820
774A1773L3949m4633k6348J5425J1387J2686R881l7060l3854N4387N6787o2347
$$ y = [5789, -25893, 8340, 20457, -21537, -15202, 33115, 10522, -40225, -5922, 43308, 1097, -42800, 4862, 38570, -12914, -32150, 21037, 23928, -29501, -16824, 36801, 10185, -42540, -4455, 44589, -155, -42112, 4028, 36245, -7675, -26309, 13253, 14012, -19213, 101, 26442, -12680, -34078, 23047, 41772, -30235, -47286, 33087, 48868, -31561, -46885, 26090, 39472, -19465, -27112, 11656, 9589, -5031, 9691, 744, -29542, -172, 47964, 2999, -61827, -7450, 69417, 14029, -68819, -19805, 61671, 23409, -47265, -22212, 28026, 16570, -6597, -6289, -13765, -8624, 30423, 25614, -42459, -42734, 46961, 56024, -44801, -65106, 36588, 66654, -25083, -60047, 11773, 45722, 1089, -25259, -9834, 1553, 14239, 24120, -12940, -46794, 7593, 64380, 2033]
786B033p6221O1087Q9054n2980r2028L9529Q3636k3081o5490P231L9429M324p515
799I008j0364k6365J1034N6816n519q0320m688R5280J6394r9533k6100R2321L2310
812F0274p5580l3164N2858K6673k7052j3214R63m941K1562K5033l7662m5453M6719
825b984O2652m9418p3247M6000P5619l7823p0030K8024N6933j9170l6714J2141
837h017J2627p603J1942O775l4369r274N3256J2855o5963j6080P0858J8157o8907
850b3743j7858O1498J3325m9762m804L4778o019j9561J8116O136l0841N388M1852
863B8505j4789m8521K1167N0814k4940m8613K7993M1776l0588l0844L2787J7747
875B2494l4554m670L6356p619l7723J8439L6694k6567l2881L1076K6752l3534
$$ y = [2033, -74188, -13101, 75953, 22973, -69055, -29526, 54110, 31029, -34461, -27230, 12199, 16523, 9008, -1356, -27721, -16687, 40129, 34610, -45710, -50398, 44882, 61276, -38257, -64357, 27964, 60274, -15306, -48470, 4388, 31061, 4009, -9205, -8242, -13183, 8379, 33412, -4250, -49703, -2984, 59668, 10250, -62997, -16997, 58622, 20799, -49231, -21207, 35726, 16556, -20158, -8017, 4610, -2993, 8949, 15724, -18645, -27919, 25337, 38192, -27771, -43851, 27007, 45164, -23743, -41601, 19897, 33222, -16540, -21344, 13434, 7415, -12146, 5970, 12106, -18735, -13347, 28505, 13716, -34805, -13638, 37176, 12236, -36377, -8384, 33392, 2804, -28040, 4747, 22494, -12060, -16730, 19626, 12007, -25716, -7277, 29417, 2850, -30031, 1045, 27797, -5737]
887e737j7885L4517O024l4100P424L2691k0417l1482L1969L0762m1225k8949M6682
900A0274K5841m7024k1098M2680J4702l5405m844K5238p813j3419K1418K564l5483
913b2369N663M8876j1444n9287J4214O4450j3949o3454J1061N6765q118m3939
925b1531O379K5683o119m536Q249j6167j3742L5132K1751n0207l0082N9174L7275
938E1259o0718m2395N5772M3424m5836l8373L1567K7470j5322j2091N5o877J1685
951c80K7946j9638m7995K2953O3682k0938p3305J5078P5970p708p0044P55N5899
964B2275M880l5838p055J2685M226J1564K807l3830j2629N0841K3764o0893l4844
977e2047O3630M2981n9781m5627M9302M2513l4674l3755J9156J9271m710n13p387
$$ y = [-5737, -23622, 10895, 16919, -17181, -9757, 22934, 2517, -28965, 3004, 33766, -7459, -36408, 10274, 36115, -10909, -32007, 10673, 25375, -10030, -14874, 10364, 2551, -10868, 10550, 13114, -22369, -16706, 32170, 20726, -38561, -24347, 40103, 26154, -37300, -26239, 30526, 22408, -21531, -15152, 10531, 4412, -124, 8125, -8042, -21784, 13348, 35099, -15108, -45190, 13984, 51259, -9459, -51854, 3918, 47342, 1506, -36867, -5300, 22170, 6848, -5243, -5188, -12065, -380, 27566, 7928, -40067, -17114, 46568, 25630, -47675, -32597, 43373, 35665, -34379, -33624, 22275, 27155, -8683, -15738, -3053, 1173, 12737, 15544, -18286, -30915, 19926, 43690, -17203, -52047, 11583, 54564, -5217, -50844, -1542, 40971, 6297, -27458, -8302, 10969, 6259, 5746, -1641]
990a641j9510J5724L8349j8842n3932J7600O4590j3811o8047Q560O3934k923n3529
1003b3478j034L8183J507j9281J201j033o304J9177J3752l3854k2464M4155K9896
1016D0423m9178l4232M8463L4966m3165l1620L5535K3741k6630j1411J7055k527
1028A420q670J6550K992k9918R61M0540l833m6629N373M7825o286m5023P793L8527
1042B1622j0816k8837J4629J7392j8622o455K3070l432k7266J2202K9658j8927
1054D218k9234K3115K6557k5399k1558K7107J3843k7930m149K7597n339k7319
1066a8491J4087K7003k1820k5638K7205K2436k9438j7747K8631J1590k6255l191
1078a1628K2482p204j7542J7962J2808k7726r563L6432P285m2535n189M4341L886
$$ y = [-1641, -21151, -5427, 32922, 14080, -39852, -22252, 42338, 28527, -39520, -30960, 32974, 30051, -23478, -24512, 13671, 15178, -4103, -2902, -3935, -10239, 8938, 22690, -11164, -33628, 10527, 40423, -8755, -42987, 5476, 40442, -2723, -34343, 1192, 24933, -1697, -13108, 3947, 1420, -7250, 9300, 12292, -17626, -16665, 23875, 20042, -26587, -21214, 26611, 20325, -24698, -16905, 21622, 10806, -18031, -3402, 13990, -4632, -11087, 11983, 8551, -18715, -6513, 23145, 4218, -25016, -1901, 24656, -743, -22301, 4806, 18649, -9281, -13430, 14167, 8828, -18491, -4404, 22599, 779, -24859, 2346, 24782, -4656, -22403, 6228, 17818, -8437, -11628, 10854, 3650, -13892, 4070, 16878, -10848, -20411, 16021, 23306, -19229, -24418, 19923, 23809]
1091B3809m1733k780L5611N33k6174L475J3960r010q58J5475j0895k3335K0441
1104a481L1403k7455l7598L0430M0803k9046m0962K4852L6915j8955k8053J2402
1116f745J5028n717J03J184j5914L42L1518M43m4343k855N2057O857n4274j1296
1130c3612N1172J3794m2712j3507K9566J0217j4162m016j029n563J4692J7188
1142B2028k5789k8255L2304L7672l3676m4225L1067M6573k5627m3034J8038L4369
1154B1445r696k1819K825O385J320J0673l086k6843K159L9698J384m8345o502
1167c0402N2090J0914n0098j3675M2550J4362l1388j1952J8396N835m667L206
1179E171q135j3189J8022K3315k3963l2433K6712L8534k6387l9980K3032L7141
$$ y = [23809, -17924, -20704, 14907, 15440, -10734, -7259, 6701, -2309, -3167, 12308, 1413, -21922, -1481, 29922, 2467, -35131, -4701, 36102, 7056, -33906, -9054, 27861, 8906, -19147, -6745, 8283, 2566, 2669, 3853, -12061, -11719, 19799, 20242, -24101, -26956, 25101, 31958, -22316, -33612, 17560, 31354, -11358, -24865, 4701, 14918, 756, -3260, -4289, -9852, 4840, 22028, -3761, -32016, 288, 37960, 4284, -39941, -8874, 37699, 12072, -30962, -12924, 21445, 11749, -10070, -7245, -860, 460, 11133, 8047, -18796, -16637, 23061, 24445, -23900, -30402, 21688, 32602, -17496, -31171, 11379, 25741, -5647, -17599, 797, 6632, 1965, 5171, -2964, -16153, 1869, 25184, 1221, -31212, -4500, 34034, 7647, -32333, -9301, 27840]
1191B7840j8166l0470J3410K0078r696p199O970o346n660J8394O269k8423p992
1204b0991L5765R036l8795r456L7798R012l3704o708K7638K077j9625M026J1044
1217G117j0478l505J7172k593k3446P705K7516j1437k8805J3415K7595j4654k4072
1230a8470J5810J7947j7037j0076J7964J963j8840N372K0031j1984k0278J7269
1242c29J8807k0082j5877K1050J1623k0803n601J9863j894j8031R679J5828j6640
1255b407j4395K2532J3020k6902j1047K8302Q559k6603n980K3025K048j7754L564
1268d038J0857r896l722J6435k186k2915O638K8864r671l2502J0930L3164j0196
1281A1762l0837Q412K5639o998j7259O052O540n846M652P025j5293r887K4373
$$ y = [27840, 9674, -20796, -7386, 12692, 2996, -4203, 2767, -3579, -9239, 9155, 15424, -12999, -20991, 14774, 23810, -14985, -24441, 13357, 22369, -11335, -18043, 9595, 11672, -7953, -3927, 7117, -3361, -6866, 10306, 7713, -15733, -8028, 19488, 8051, -20754, -7339, 20256, 5602, -18470, -2660, 15287, -1750, -11826, 6138, 8101, -10739, -5367, 14664, 2680, -17598, -329, 18478, -1604, -17481, 3569, 15192, -5611, -11212, 8651, 6757, -11274, -1595, 14233, -2407, -16802, 5730, 18750, -8152, -19199, 9103, 17662, -8941, -14921, 8104, 10152, -7602, -4038, 6819, -3077, -6799, 9636, 7450, -15465, -8827, 20037, 10366, -22136, -11206, 21958, 11762, -19075, -10663, 14976, 7978, -9281, -3229, 3311, -2535, 2117, 9142, -6151, -16038, 8335]
1294H335J3541l1055j6660L3718J8983l2420k0044K8351J8376k1688j3556J3234
1306h85O281m215K592l145j2848Q622K3227j2022l1832J2913L7276j1134l9422
1319b4592P871L7521m437l1376J391K1401P63r774o96k608j833J4773N957k4930
1333a0569j0761L1420J6016l3914k0462L3155K2469k8843k1300K1580J7383j3188
1345B986j0740N302J331J644R198p020j9186R749K7604j0068l3607Q636L6197
1358B2026o520l4583M071K9146j781k1270J188J1458k356n96M854r587q067J7651
1372E634J2153k3341j5943K6567J8131k6783j8302K4042J6537j9824j2679J4986
1384A178O359r963J272N163q884j692J5978m37k1826J589K5690k458k6512K931
$$ y = [8335, 21876, -9179, -25839, 7879, 26862, -5558, -25602, 2749, 21125, -563, -14119, -885, 5396, 1181, 3773, 628, -12220, -3598, 19629, 7607, -24225, -11312, 25964, 14830, -24592, -16721, 20800, 16363, -15013, -13622, 7779, 8542, -1232, -1928, -4536, -6369, 8404, 14361, -10569, -21330, 10090, 26106, -7808, -28270, 4885, 27354, -1489, -22789, -1209, 16174, 2986, -7754, -2452, -1121, 523, 9721, 2701, -16485, -6736, 20868, 10800, -22807, -14171, 22026, 15506, -19077, -15006, 14140, 12359, -8911, -7723, 3735, 1379, 783, 5637, -3950, -12017, 5634, 17787, -5554, -21497, 5070, 23201, -3582, -21884, 2158, 18695, -1129, -13808, 1178, 7537, -2426, -1154, 4009, -4875, -6567, 9411, 8974, -12852, -11263, 14427, 11969, -14543, -11612]
1398a1612K4825l432k1101M861J5860p231r179R754K699j2484K961J5177p767
1411C331j7123J1427J7430j3745j5932J4416J3245j4752r004J4743L321j4285
1423f928K776J3513q257j2977J2914J2638j6601j1335J8334R423j8096o686J6409
1436E127L073j3821J816J0524p364o895J2551M023j7530j995K1483N23k3778N50
1450a1713K3363r66k0908J357J6654k608j0567M688L459p289L773J0418r699j4224
1464a4262J4437J7711j7377j9797J7983K0207j6345j8931J3496J5317j0044r192
1476f797N891J661k351O340J72j4487N82K1785k79k6915q54K8916K806k8135m558
1491a6223K4734N174j8616m171J0527K085k104J773n643p105J2253J2730j6866
$$ y = [-11612, 13213, 9781, -11320, -6459, 9401, 2170, -7009, 2745, 5444, -7040, -4079, 11098, 3331, -13792, -2365, 15065, 1320, -14612, -196, 13049, -1703, -10707, 4036, 7357, -6928, -4152, 9361, 1104, -11873, 1041, 13679, -2922, -14257, 4077, 13500, -4596, -11282, 5127, 8200, -5621, -3805, 6719, -645, -7540, 5011, 9034, -8496, -10491, 10992, 11515, -12263, -11713, 11650, 10684, -10224, -8867, 7787, 5179, -5388, -700, 2759, -4530, -757, 9661, -38, -14262, 175, 17886, 509, -19288, -1305, 18902, 2557, -16374, -2878, 12439, 2395, -6797, -906, 755, -1596, 4744, 4916, -9571, -8989, 12796, 12517, -14398, -15252, 13664, 16470, -11665, -16223, 8511, 13685, -4931, -9102, 1425, 3510, 1406, 3179, -2464, -9569, 2684, 15414, -1452]
1504a452j7700J8717K1417j8060k3396J5568K2579j1967j8711P458J2516l220
1516C749m917L57l764J071J2722j424j9989L57K5103J810k7641m068K7373N554
1530A6293k4016n909J8137N201j1214k653L854j691L360O653r363j1705J3273
1543B20J6239j5006j9783J5103K1009j3619j9746J0846J6418p848j1149N423M546
1556B653l759K913K761r654k738J5120L731j9146m677K1075N069k0604m919J8136
1570E961L872j4663j598J0341j841n603N808R92r418K356J2928m871j5592O773
1584d555J6558p721j5731Q015J3477q000j0127Q455N447q783m49R216m244r663
1598h105P932J0221j0868j0172J2524R069j2714p221J1805M590j0632q07R040
$$ y = [-1452, -19152, -435, 20982, 2922, -20474, -4906, 17673, 5706, -13005, -5547, 6969, 3749, -1168, -811, -4575, -3504, 9218, 7794, -12195, -11838, 13265, 15075, -12566, -16634, 10739, 16293, -7723, -13632, 4505, 9706, -1508, -4161, -307, -1998, 1362, 8015, -1348, -13053, 220, 16459, 1453, -18330, -3227, 17782, 4163, -15583, -4737, 11681, 3833, -7316, -1893, 2653, -1106, 1807, 4568, -5086, -7824, 7296, 11027, -8119, -12796, 8279, 13348, -7256, -12175, 5961, 9833, -4830, -6428, 3913, 2072, -3531, 2277, 3269, -6149, -3793, 9135, 4264, -11328, -4555, 12003, 4282, -11449, -3434, 10043, 2043, -8084, 371, 5818, -2965, -3414, 5802, 1558, -8105, -173, 10048, -820, -10992, 1532, 10601, -2113, -9334, 2471, 7061, -3571, -4378, 4662]
1611D662l610p103P791N678j1428m839J4426M143j6048l227J5883K209j3976j094
1625f533J1257r24p564L821L147o985R53J0138m192j3402O469J5912p870j6941
1639a2714P988J6392p119j4292N759J0705m576n445L725o45l197O552L639j1780
1653e008m916J6042O446j8512p664J8640Q467j6773q529J3586O933r153l958M045
1667c54p4N59M847m221j0020O671J4860p929j8161P563J9750n955j9531M109J7101
1682I215k192j2516O70O651K2j20M34o281k069J1983M291j6358o536J8332Q804
1697A4330j8339j0327J6660J0148j3119q617Q520N644l718j533k99l784L648R176
1711H390n849j3569O456J6932n834j8682M646J8270l208j5730J736J1638q32o597
$$ y = [4662, 1052, -6051, 1740, 7418, -4010, -8849, 5577, 9720, -6328, -9555, 6328, 8537, -5439, -6533, 4724, 3800, -3764, 57, 3204, -3781, -2828, 7310, 3118, -10284, -3815, 12097, 4227, -12714, -4726, 11666, 4547, -9745, -3986, 6719, 2143, -3302, 423, -222, -3419, 3133, 6772, -5008, -9924, 6118, 12564, -5948, -13612, 5028, 13495, -3278, -11807, 1779, 8712, -441, -4399, -354, -428, 131, 4978, 757, -9263, -2592, 12268, 4339, -13822, -6259, 13491, 7536, -11995, -7886, 9215, 7023, -5493, -4823, 1828, 1850, 1730, 2164, -4117, -6186, 5797, 10088, -6270, -12806, 5526, 14330, -4009, -14336, 2324, 12472, -647, -9264, -744, 4900, 1182, -351, -650, -4434, -786, 8390, 2541, -11028, -4572, 12360, 6526, -12156, -7510, 10760, 7552, -8178, -6442, 5196, 4364, -2233]
1725b233R49R89k149M678L621r207n637J2352P680j3965r287J4308R632j3060
1739a329q692J0537O877p707l825N076l69k357M681K81q556R56J1772j450j4072
1754h177J689J4698j835j3644J834J1325k086q356L059M601m618n69O086k811
1768A196p507N284R049p181r621Q122R244q165p845P518N802o903k823O421r07
1783A684n687M283N269p113n290R390N139j0775m628J0870L692r803k426Q060
1797B665M92o034K256L600n219j186P922m48j0336J536J2190k184j2753K305J2032
1812F838k164r976J996P145k374l364L103q97m157M652N571p699p350R833Q832
1827I989j0883r396J0345R255q684q189O603N774m178k273J785j801L01N871j196
$$ y = [-2233, -1284, -295, -2444, 2234, 5855, -3352, -8989, 3363, 11043, -2922, -12209, 2099, 11731, -1329, -10021, 516, 7393, -314, -4139, 937, 568, -1789, 2892, 3173, -5383, -4427, 7345, 5895, -8177, -6488, 8210, 6375, -7269, -5435, 5890, 3804, -4552, -1493, 3108, -1510, -2079, 4007, 1196, -6311, -1027, 8022, 841, -8780, -658, 8586, 421, -7424, 94, 5896, -1007, -3830, 2591, 1684, -4003, 280, 5549, -1564, -6854, 2536, 7675, -3100, -7728, 3142, 6834, -2969, -5395, 2665, 3157, -2877, -621, 2979, -2240, -3426, 4496, 4048, -6288, -4752, 7438, 5254, -7499, -5194, 6838, 4674, -5302, -3306, 3839, 1465, -1899, 1204, 307, -3850, 802, 6373, -1326, -8676, 1157, 9989, -894, -10290, 55, 9310, 626, -7563, -960, 4814, 636, -1637, 148, -1653, -1352, 4519, 3323]
1842C323r769J266J3011r66j4732P4J4858J029j3483j963J0878J946o994j217
1856b739K282j59K092K363n883n162Q802P933j0467r975J0587J1243r312j1430
1870i825P479J0040n220o906K468L256l93J105q45n756J287R801r70j2876J27
1885g228J4286J215j4402k295J2931K723j0004k633O324J693k403K78j382k851
1899c748M748N477p000p893Q085R803q043j0813P338J0440n939q743M134O141
1913C987k670k744J601j207j049N097Q24q136j303J0244K099j1410k529J1237
1927D041K527r727k183P575J194n058N49K448k728R6M952k065o812L204Q389l970
1943B432r137M168Q847m028p554L586N635l437l136L554J77l823K638M155m804
$$ y = [3323, -6446, -5180, 7831, 6865, -7867, -7793, 7065, 8094, -5389, -7352, 3526, 5472, -1522, -2739, -457, -616, 1476, 3839, -2044, -7206, 1596, 9529, -938, -10913, -326, 10917, 1605, -9825, -2346, 7694, 2474, -4432, -1964, 1292, 899, 2004, 1159, -4597, -3310, 6491, 5521, -7355, -7228, 7058, 8273, -6129, -8424, 4507, 7230, -2774, -5407, 917, 2610, 207, 485, -897, -3748, 1000, 6477, -523, -8416, -331, 9472, 1429, -9384, -2046, 8394, 2455, -6288, -2154, 3987, 1317, -1427, 174, -1033, -2082, 3015, 3839, -4297, -5600, 4644, 6743, -4667, -7196, 4041, 6568, -3159, -5342, 2233, 3427, -1631, -1082, 1366, -1362, -1266, 3686, 1621, -5191, -1987, 6402, 2432, -6705, -2537, 6310, 2282, -5272, -1686, 3949, 512, -2624, 930, 1107, -2716, -78, 4077, -727]
1958g27m618O288N241p370n047P462M369o630l326N647J581m431P13L175l369
1973a042j867N602J032p369r20Q835N41r181m39Q592J51o952K02M995j213k479
1989a512K668l06m083K599N681m224p075N119Q243n534q381M989P693l895o396
2004d414K964M054k107j005J327k296q87N156J225p667j982R492K680j0169l278
2019f907R558L820q152l556N946K571l236p90L44j344K057L862l671o516M715
2034a299Q640n033r769M345R958l209r178K007P209j014m164P1P54J38K688M67
2050B611n889j402Q382K516r728l648R858M755r075n081P441M421m955l232K328
2065f98J393L5J107j893l988L233O547l913q381L637R477k878r595J934Q543j104
$$ y = [-727, -5345, 943, 6184, -1186, -6233, 1229, 5598, -1032, -4358, 1289, 2870, -1561, -848, 2327, -1042, -2909, 2693, 3725, -3644, -4564, 4271, 4812, -4369, -4808, 3784, 3935, -3017, -2815, 2180, 967, -1512, 1156, 850, -3233, -634, 5047, 823, -6252, -1133, 7110, 1576, -6805, -1816, 5877, 1982, -4414, -1450, 2604, 497, -508, 819, -1477, -2364, 2792, 4017, -3650, -5632, 3860, 6540, -3629, -6907, 2651, 6471, -1681, -5237, 709, 3280, 44, -746, -402, -1746, 311, 4173, 502, -6014, -1299, 7341, 2308, -7461, -3116, 6842, 3633, -5545, -3538, 3671, 2657, -1507, -1436, -682, -544, 2144, 2611, -3278, -4680, 3702, 6218, -3510, -7158, 2700, 7455, -1620, -6701, 740, 5161, 206, -3026, -698, 695, 730, 1837, -56, -4044, -811, 5736, 1823, -6558, -2921, 6556, 3678, -5917, -3983, 4560, 3456]
2081C456o420L77L834k24p55P08k445j483N086K540o815l611P660M617p811m949
2097f235P045M541n633l626L896K131k316J06P58k526M80M596j118o295J182P611
2113D597j103q042J000P433o91o164O28M384r04k293J687M0k676K039L595l455
2129G5m525M275N250m796n271M615M708m050l648L280K112k682k6K175k197j811
2145b516M146J660n450j831O371J936o542j809N995J440m847p71L392l16j846
2160i88J907J44l375J106M742j844o014K201O688k230o689J958N845j461m545
2175b555J189K736j207l68J351j870j851L855K620n235l519O117M170o216m335
2190e118N332M228m187l442K801J974j310Lj50k143J083M220j428o150J473P369
$$ y = [3456, -2964, -2587, 1247, 1023, 268, 976, -1469, -2952, 2134, 4674, -2141, -5752, 1908, 6525, -1286, -6235, 810, 5351, -282, -3908, -12, 2119, -197, -91, 667, -1859, -1379, 3217, 2099, -4196, -3014, 4597, 3494, -4548, -3548, 3885, 3194, -2970, -2342, 2042, 1138, -1155, 532, 572, -2104, -65, 3530, 75, -4450, -175, 5075, 279, -4992, -377, 4331, 281, -3367, -87, 2025, -657, -683, 1492, -705, -2516, 1630, 3290, -2160, -3991, 2380, 4316, -2226, -4035, 1960, 3400, -1447, -2218, 1174, 858, -988, 919, 1063, -2312, -1206, 3536, 1692, -4322, -2121, 4567, 2337, -4352, -2394, 3451, 1990, -2555, -1366, 1370, 163, -205, 1146, -724, -2575, 1280, 3900, -1335, -4854, 1263, 5433, -783, -5118, 214, 4442, 255, -3187, -386, 1588, 278, 281, 131, -2012, -929, 3291, 1863, -4287, -2814, 4555]
2206D555j118p827M74P418K31o211n47M343N78j913j31o83o03K888J770m555l239
2223d570N763M361o093n204N540N536m550n245L292M091j855k198L24O7O67K216
2239B142j027m558J118O330p33p250M6P510O85o887j197N556J292l586r60J310
2255b09K41P19R74k540k466L985L696m703m707M592N414m202n334L316M655k312
2271A119l263J285J512m81N47J63k677N1M393J14n575n67O095J173o166j372N302
2288A653J415m107r52K451K21r79J004n82k258J726L442k333m391K556M971k427
2304A410n017K134M327j598l239J283J832j199n1J269j696j462L080J753l927
2319a101k304M458K577m524k462L962K036l089j344K106K63j145J172K64k542
$$ y = [4555, 3437, -4390, -3916, 3502, 3733, -2478, -3025, 1318, 1896, -17, -148, -831, -1434, 1454, 3224, -1331, -4570, 1193, 5554, -539, -5743, -203, 5333, 783, -4462, -1170, 2921, 1066, -1132, -808, -741, -74, 2142, 1115, -3443, -2325, 4005, 3272, -3978, -3932, 3578, 4263, -2624, -3821, 1735, 3027, -559, -1519, -209, 32, 751, 1725, -815, -3281, 704, 4400, -303, -5010, -418, 4996, 794, -4540, -1224, 3431, 1119, -2144, -859, 653, 172, 719, 882, -1795, -1744, 2649, 2763, -2812, -3379, 2716, 3889, -2277, -3649, 1653, 3068, -1039, -1991, 460, 681, -298, 706, 124, -2134, -408, 3034, 701, -3690, -1134, 3837, 1410, -3607, -1473, 2854, 1256, -1983, -700, 1132, -67, -118, 1151, -545, -2007, 1073, 2826, -1101, -3405, 1053, 3630, -894, -3356, 606, 2642, -447, -1791, 315, 578, -567, 605, 869, -1673]
2334a673L16L755n43m668N92N151m71n005L02M329k21l132K22J746n99j79J258
2351A180j470j967K557K811l258l660L551M083l370m056K787L558j904k663J184
2366f37J215m81M94k4k189K26L712K1m868l90N504Q32n495j198M742J490l717
2383g63j323K261O42n39J90j049j262K219K484k851l780L211M627l092m843K390
2399a478M743j586m027R04K681k21q77l17r10L23K604J79m153o50N017J152n191
2416a807j913M860K434m257k219K937J726j448q61j3k20J119J679j953l075K445
2432e66M082k422m670K061M796j416m452Q23L507l84j929j14L76P8J157L34k664
2449a403q25L706J416m231k054M254K517l906k472L090J997j889j369R20L01K1
$$ y = [-1673, -1357, 2398, 1855, -2813, -2221, 2930, 2459, -2546, -2244, 2085, 1864, -1268, -1046, 700, 101, -78, 1180, -290, -2257, 300, 3111, -147, -3807, -256, 3827, 457, -3599, -812, 2746, 842, -1821, -637, 578, 97, 591, 567, -1622, -1396, 2316, 2337, -2531, -2921, 2583, 3415, -2080, -3278, 1464, 2954, -763, -2086, 175, 817, 278, 468, -581, -1843, 376, 2860, 9, -3771, -560, 4067, 975, -3868, -1478, 3265, 1679, -2348, -1444, 1237, 1016, 139, -178, -1088, -765, 1839, 2018, -2135, -2785, 2232, 3384, -1807, -3720, 1140, 3574, -683, -2902, 35, 1761, 313, -548, -561, -781, 338, 2017, 64, -3011, -566, 3516, 1094, -3576, -1515, 3281, 1865, -2587, -1764, 1743, 1359, -570, -684, -308, -230, 927, 1261, -1403, -2228, 1478, 2894, -1337, -3391, 863, 3380, -526, -2998, 92, 2089, 200, -1169, -249, 52, 73]
2465G3J019o81k300J043L339j089m048Q86M322o34m020K90L302p0k321O6J096
2482B73l89J82R35j492j418K360K001k810k511K934K843k841k601K295K138j584
2498C15j365R89L41n47R31K26k133k9K909K20l640m75L911O24l584p81K918P10
2516A540k006l62R62k19J06R69r67j881J648K643j839l226J811L510j592l308
2532b211J122K779o45j947L71P27k96O50K07j847m22K738R35l449j372L612J785
2549B737l466j782K681J837j862j417R76M96J23N49r70j533J347K507j271l559
2565b607J327L862r24l804M39L322J09k594l86J355L84j1j73j290k03K206J022
2582B034l067j650L436K098l149k530K626K653j940k230J132J379k27l26n30p93
$$ y = [73, 1092, 411, -1889, -846, 2493, 1404, -2644, -1758, 2564, 1930, -2090, -1800, 1502, 1432, -889, -823, 273, -116, 66, 1001, -491, -1909, 451, 2452, -358, -2869, 65, 2908, 67, -2534, -239, 1899, 315, -1050, -61, 280, -267, 664, 890, -1243, -1272, 1637, 1857, -1783, -2258, 1653, 2277, -1307, -2088, 830, 1540, -466, -828, 134, -85, 21, 990, 23, -1858, -210, 2433, 594, -2632, -821, 2689, 1097, -2211, -1089, 1690, 1045, -902, -531, 196, -100, 550, 757, -1090, -1512, 1226, 2161, -1288, -2660, 952, 2737, -729, -2511, 170, 2007, 145, -1272, -296, 200, 323, 872, -98, -1631, -284, 2223, 952, -2607, -1280, 2582, 1658, -2146, -1707, 1615, 1724, -870, -1256, 99, 483, 472, 299, -991, -1194, 1012, 2034, -1033, -2683, 753, 2851, -298, -2828, -202, 2451, 511, -1719, -587, 792, 565, 239, -291, -1084]
2598a084R24J900r62k957Q43L672n91l783J7L564M67l064n60J940O11p22m46l61
2616e92j79J508Q49k271j452K594K228k724k592K287K827j836k469J158J787m66
2632F57q96j05j36L04J248m20k213K88K845N1l182m68L255P35k864p78K051P52
2650A124j105n18L11j04N43Q85j292j511J690J998j656k453J436K642j179k395
2666a584P84J844l95j123K11M1j02R65J43j767l99K324P87k558j168K643J264
2683A910k213j298J635J067r24o85M10j03K03R54p23j623R10K191q06k653N46
2700a202K758l66k422j3J922K04j162j11K27o6O93L56j470q05J998J355k209j748
2718b061K160J934j814j873J199J622o34j062J58J29L23P23n77j566O11K226k72
$$ y = [-1084, -160, 1740, 778, -2179, -1336, 2336, 1745, -2038, -2021, 1543, 2010, -1054, -1614, 326, 937, 215, -231, -592, -771, 737, 1586, -685, -2137, 457, 2685, -39, -2631, -344, 2483, 647, -1822, -664, 1123, 657, -239, -344, -480, -176, 1072, 652, -1561, -1273, 1572, 1623, -1559, -2027, 1228, 1963, -901, -1679, 372, 1124, 19, -499, -188, -292, 251, 1136, -156, -1667, 23, 2021, 365, -2088, -652, 1990, 811, -1584, -800, 1044, 649, -474, -263, -222, -324, 641, 784, -983, -1382, 942, 1729, -829, -1997, 646, 1910, -303, -1601, 34, 1101, 177, -508, -98, -201, 2, 956, 233, -1390, -480, 1711, 905, -1748, -1202, 1556, 1190, -1232, -1245, 677, 881, -281, -392, -165, -231, 462, 818, -652, -1457, 541, 1896, -313, -2061, 99, 2033, 219, -1654, -455, 1167, 533, -529, -371, -242, 81, 804, 227, -1339, -728, 1498, 1226]
2735A226k868O5K891L55k694n68K119P59j447n94M58M28L70P7j131o47J603J421
2753A823j900j974J814K286j489k335R26K184n09j570pP79L08K19n44j073M07
2770f55J915j87k440j55K630O74k534j053K193J227j571j049P42O88J06j89p96
2787d54m34J200J223j445j935J474K188j162k357P24K250k42j923k2J126L62m02
2804A71l11n45K15J341J08j888m55K136R65k189j254J972J350j526j197Q13Q46
2821E52j56m25l00l01O49J000p88j617Q09K007n63k295L51K142L2j802j54J111
2839B52L76m79k70j95j9Q73M08j456p86J648J154j591j508J478J560j168j317
2856a040O55R72k04n38j73n0K61R08m36j434L56J746N6k029k44J946M86j654n73
$$ y = [1226, -1642, -1577, 1314, 1669, -1025, -1593, 526, 1285, -162, -756, -298, 130, 500, 577, -554, -1201, 402, 1823, -77, -2051, -237, 2049, 560, -1775, -849, 1335, 826, -744, -751, 28, 336, 555, 11, -1062, -655, 1260, 1073, -1367, -1522, 1108, 1782, -752, -1805, 388, 1615, 44, -1005, -263, 425, 531, 342, -454, -888, 312, 1535, 90, -1845, -371, 1817, 655, -1702, -978, 1272, 1030, -893, -915, 211, 573, 171, -140, -685, -470, 871, 979, -909, -1364, 772, 1737, -452, -1706, 266, 1616, 90, -1107, -294, 552, 396, -29, -329, -630, 19, 1019, 231, -1386, -577, 1430, 867, -1428, -1077, 1065, 1097, -705, -859, 252, 628, 149, -121, -316, -335, 538, 946, -510, -1296, 352, 1506, -85, -1593, -115, 1445, 277, -1040, -385, 587, 383, -155, -328, -378, -117, 791, 355, -1079, -723, 1023, 1079, -950, -1194, 752, 1238, -416, -989]
2875i89J039O18m68l90j21m8P30M76j150r13J246J330j156j713R69J775o87j487
2893i39K40J208M7o71k46k8L29P35k53j238j7J669L68j962n61J839Q54j519r22
2912a067R68Q88m67o41j04K20N39L32q94q50Q91J434p81j906P18J885l73j692
2930i00LJ397L02r01l67J90L99N22k72j096l5J474M93j729q41J689J049j355j235
2949a213R50J189n41r02K7L78M54J20p00o62P62J250o52j605M02J809j26j730
2967g90k17J487M73j080m45L96M39K95l53p17p4J005O30j389r43J415J141j127
2985A46j315Q15J254m26r86k9O06L44n5m98n08M43J087l33j438J92J544J05j473
3004e25n11J326O74r56o88M65M83N5k65m58j23P60O01j052q77J000J187p33j441
$$ y = [-989, 50, 668, 200, -190, -311, -359, 371, 847, -303, -1216, 30, 1360, 204, -1509, -540, 1235, 548, -939, -699, 509, 556, -115, -361, -389, -60, 675, 422, -816, -833, 836, 1204, -758, -1319, 520, 1374, -145, -1067, -99, 789, 322, -319, -423, -203, 336, 668, -226, -1076, -185, 1249, 468, -1438, -720, 1165, 792, -900, -897, 500, 802, -99, -466, -276, 123, 645, 373, -723, -758, 716, 1209, -520, -1361, 328, 1377, 22, -1213, -263, 926, 385, -517, -490, -112, 342, 462, -238, -900, -138, 1112, 460, -1145, -743, 1066, 940, -790, -1007, 480, 953, -127, -572, -176, 263, 558, 205, -512, -586, 419, 1049, -340, -1283, 132, 1273, 146, -1169, -354, 900, 474, -512, -541, 65, 409, 354, -144, -652, -209, 878, 545, -893, -701, 843, 948, -525, -1036, 290, 964, 8, -680, -215, 268, 323, 58, -400, -523, 237, 838, -214, -1091, -91, 1096, 363, -1078]
3023a078N20J408k76j034m3N98L32j79l16l16J54R01p6j243j22J273M76j296p42
3042a059J192Q21q62p83L82N95K2k88l43j73O08O75p79q84N97J255l62j512K66
3061f32J332k1j028k22O51M19k55l90l13K40P64m6j014k74J078P56j206r06R82
3080h5R49o05r82K81P86K6l87l31m4N36N58o13q43L86J203j26j437m9J345K30
3100G98j075m38O81N94l32m40k44K90O00rq15l18R30P78j047j001Q49J107n04
3119D04j094J88Q90J39n42l47J27M17L94m83p48K81J041j3j259j89J178M07q73
3138h2p53P45O86l56n37n6K37N21l3o56l43O80Q05p60j000O22J071k81j085L5
3158e40Q91K39o11l55J44M40K08l39n87J01R50J08j156k91J052M84q43p06O47
$$ y = [-1078, -558, 850, 574, -460, -503, 95, 427, 248, -68, -384, -230, 671, 595, -648, -770, 503, 979, -317, -1059, 133, 954, 92, -691, -309, 286, 308, 20, -323, -496, 112, 787, 8, -876, -279, 976, 614, -898, -632, 700, 679, -349, -571, 80, 499, 244, -146, -459, -219, 545, 499, -515, -789, 289, 1045, -161, -1067, -85, 864, 259, -723, -442, 344, 370, -17, -348, -392, 144, 702, 89, -754, -368, 835, 709, -728, -777, 568, 798, -277, -715, -34, 560, 228, -212, -456, -166, 434, 425, -390, -708, 222, 1000, -47, -1048, -199, 908, 404, -690, -502, 388, 527, -15, -362, -235, 182, 576, 93, -655, -374, 667, 654, -605, -794, 384, 791, -82, -835, -90, 596, 240, -297, -353, -116, 405, 372, -284, -627, 53, 858, 98, -902, -280, 791, 510, -575, -540, 351, 590, -21, -376, -232, 208, 416, 77, -510, -409, 541, 649, -507, -798, 254, 738, -105, -811, -164]
3177a64P50l18n72n8L70L39l5n51l11O20O68n59q42K64J088j01j107l4P76L18
3197E41n04l94J29M09K10l17n06KQ03K10r24l89P98O40o53p94N30P56k43n68q1
3218c45L85L47j20m31k68M42N81m25p83J63R80R2j030k56Q26L79m62n79K39M99
3238B34P4k74l85M5O33K47p81m75P00P53n66q39K93R07j10p11j79M52M07k33l88
3259a96k77M32N40k97p71J02Q58J85q68m45P80N76n53n58K63N10M8k92m05P3O27
3280C32J75o11m75N68O98m19q43K16Q71j06o07k52M91L56k12l85k23L99M46k25
3300A94o48p4Q61K58q18m93P25O22m43o43K31M96J31l94k75O7M84J25m87l96L74
3321a03O94l33q13J02Q19R1o91k47M50M34k61l72j65L53M39j85n57o5O73L17o51
$$ y = [-164, 586, 268, -304, -362, 8, 347, 312, -239, -550, 70, 738, 179, -663, -399, 689, 588, -519, -553, 223, 541, 37, -357, -228, 181, 391, 74, -432, -430, 373, 583, -341, -730, 68, 708, 55, -739, -209, 547, 304, -264, -345, 40, 387, 267, -164, -432, 10, 591, 166, -617, -454, 526, 618, -412, -668, 158, 537, 75, -504, -265, 234, 308, 34, -351, -306, 327, 574, -207, -682, 18, 771, 205, -634, -341, 566, 456, -255, -434, 18, 425, 192, -196, -473, -41, 499, 202, -569, -467, 391, 576, -292, -737, 43, 619, 66, -492, -229, 281, 329, 37, -368, -295, 332, 507, -104, -579, -11, 687, 268, -575, -359, 512, 406, -201, -453, 38, 394, 182, -203, -426, -27, 419, 194, -454, -528, 333, 591, -227, -720, 5, 627, 184, -459, -228, 268, 399, 5, -270, -203, 281, 406, -81, -477, -103, 591, 258, -555, -453, 366, 457, -234, -481, -31, 403, 142, -230, -395, -42, 397, 212, -345, -410, 263, 580, -71]
3342g1n33N81N75l13o88J12O33J26l84l62J15L91J95m22m49L53O56j96p62j3P86
3363C30J64o17m04M59M68k00m10j29L04M20j46n08j08N50L43m74o03M83N80k10
3383B92o78K3N37K08l81m08J55L94J62m01l54K43N83n0o66j21O71L25o02m23M23
3404f8M48j02m35j71M01L25j73n29k9N01L62n52m77L44O02j45o32o6N98J52l17
3425C7l82Q9M61P0l18k94J79N58j7o61j44N58L74m59m79L10N08o4m95j54L58K44
3447B79j43l50j14M40K57l93m40K52O06l2o78j30N88K51l28m24J45M34J27l98
3467e1k50J42N44q2m86k05M72L75l32n47K44M75Km96j87M16K30j55l00p6L43K48
3489C24k20n18J75N78qn72j74M68L64l47l86Q8M05J28l33k51J18M41K1m77k02
$$ y = [-71, -604, -23, 552, 239, -449, -337, 296, 422, 38, -324, -209, 182, 377, -45, -494, -141, 515, 319, -443, -456, 330, 494, -123, -527, -68, 400, 200, -210, -339, -35, 385, 239, -269, -377, 173, 516, 42, -561, -78, 502, 292, -386, -363, 174, 382, 1, -407, -252, 142, 304, -97, -451, -208, 375, 325, -341, -462, 209, 534, -68, -491, -68, 380, 278, -157, -328, 73, 398, 225, -304, -333, 168, 530, -22, -499, -155, 447, 302, -330, -396, 202, 354, 37, -345, -256, 205, 275, -43, -337, -158, 400, 383, -278, -422, 136, 510, 51, -428, -118, 390, 326, -169, -323, 35, 279, 136, -214, -328, 112, 369, -24, -464, -212, 394, 362, -316, -446, 142, 393, 65, -359, -214, 220, 347, -51, -301, -159, 385, 303, -183, -388, 84, 459, 127, -420, -176, 299, 301, -195, -382, 34, 264, 109, -191, -267, 76, 324, 104, -414, -239, 339, 331, -241, -415, 53, 417, 70, -316, -228, 177, 305, -28, -279, -161, 280, 301, -176, -378]
3510c78L88L98l06n30J72N23M0m86k30M05L14j40l85p0L60K81k90l88Q1N51K0
3531C30m85k21M05L85k78m55J37L88P6k80k81J26L65J8l95j73K94L78k05m76J04
3552b43M12J29m99j45L42L03n8l86q0L47K65k76l64M1M55Q9m63k33L26L54j11
3573B05m98O5L49J95l34k71J06M05j6l66j76L08L77j94m36N9L94J65l91k37K65
3594b6L03j17l39j03L06L04k30l59J7M79J14m42k71L23L81k00m15N3L27K15l41
3615b1k40J14L57k9k75k08K92L63j86l91K7L93J53l38l19K81L20q5m00o1K84K44
3637B75j80l21kM23O7l27k69K80K91p0m18M5L73J09k87k39R7L64Qk64j69K05K97
3660B88j21l67n8M09J40k38k98J28L27J2m49l8K55K83j94l53O6L45R2k50k64J99
$$ y = [-378, 10, 408, 102, -428, -256, 267, 307, -179, -409, -4, 310, 170, -215, -285, 75, 356, 66, -322, -241, 310, 330, -155, -376, 29, 414, 136, -319, -182, 206, 282, 2, -279, -153, 212, 230, -165, -338, -44, 334, 129, -347, -243, 169, 298, -201, -346, -4, 299, 241, -145, -225, 122, 387, 111, -253, -212, 243, 332, -131, -364, -38, 316, 205, -293, -228, 121, 316, -18, -289, -183, 222, 206, -160, -336, -28, 349, 155, -281, -222, 172, 337, -54, -291, -26, 277, 160, -179, -282, 24, 328, 98, -261, -244, 235, 349, -93, -364, -41, 340, 140, -275, -222, 105, 320, -21, -261, -147, 210, 181, -94, -302, -10, 353, 167, -224, -197, 196, 349, 11, -308, -27, 293, 208, -192, -253, 31, 275, 95, -226, -228, 195, 262, -65, -334, -54, 237, 167, -251, -206, 167, 276, -11, -250, -153, 211, 219, -45, -214, -9, 288, 167, -200, -258, 151, 291, 53, -245, -117, 210, 222, -227, -265, -10, 273, 79, -274, -208, 137, 229, -21, -285, -86]
3682h6K88L7m23n5L27K13j98l33J47K38Q1k43j98J68L25j42l49k6L28J84k79k42
3704b38J37L08Jl33j44K36K65r8l09m2L32J72k62k65J22L95o9l42p7K70J98j89
3726F8l01M2L64Q9l05k12J91K57q6l02l0L03J59j92l66J90L24M4l11j61J80L23
3748B68p4l43j21M12J39k56k61J17L09M3l21j79K52K65k27k56N2K54J86k86k44
3769b71K00K71m8l55n4L53J41k00k53OL29Q1k76r4J27L05j02l14m4L63J61l37
3791a1k26R5L13mk88j27J82L24j89k92N6K55R0k50j37J43K30kk50j08K73J59j66
3814G0k59M5K67Q2k05j23J15K10m0l10m7K87J36j91k03N3K66N5k81j18J35K69
3836B13j42j73n7K37J79k42j51P6J88M9k38j30K74J34j16k90M5K82L8k56j03R4
$$ y = [-86, 202, 239, -184, -239, 88, 301, 103, -230, -83, 155, 236, -7, -205, -37, 288, 146, -203, -229, 99, 283, 4, -238, -101, 207, 208, -125, -269, -33, 232, 134, -175, -217, 115, 287, 25, -240, -118, 277, 208, -134, -211, 59, 257, 68, -233, -191, 173, 262, -43, -255, -64, 193, 107, -195, -225, 78, 237, 45, -321, -131, 193, 237, -74, -235, -55, 268, 194, -149, -270, 142, 281, 25, -236, -119, 190, 233, -88, -267, -15, 250, 23, -233, -181, 73, 259, -27, -271, -71, 200, 152, -203, -257, 96, 237, 37, -216, -210, 119, 200, -76, -170, -43, 262, 160, -154, -198, 165, 326, -11, -237, -142, 171, 167, -121, -248, -66, 258, 69, -223, -167, 88, 178, -72, -209, -66, 164, 162, -88, -196, 77, 236, 70, -189, -144, 123, 205, 0, -123, -8, 202, 162, -148, -195, 92, 228, 37, -166, -113, 153, 208, -73, -191, -56, 213, 71, -102, -159, 78, 257, 15, -136, -60, 128, 177, -61, -191, 83, 217, 101, -189, -144, 138, 176, -80, -183, -89]
3858h9K75j1l36n3K88J45k31k17J03L22o0j96r2J47K14q2j99n3J60J76j67k84
3880b40J41K14M7k60r0J81J72q1k43JK08K6q1k24J07K20K9k40r6K00K43j00l44
3903b10P9K99K5k70n0Q2K27o2k63J2J75J97j99k10O8K12R5l06j18K47J04p5k09
3926a50J8J82J01j87j56R4K20K6k56p3J95J77j30j55n3K98O6k06j92J50J88k2
3948A35k37k8K16N0j05k03OK56R9k53q5J24J77m7k57OK25O0j36j41L1K31%j47
3972b3j26J29J89m8k50m0K34J41k69j36J75J31l6j76m1J70J41j51j90R9K14J03
3994B40k44k20J97J89n9k46qK62L9o4k28N5K36j5j65j37J62J41k6k28q8J97J90
4017A80j58k26J17J64k6q0j15K17L9q2j07n4K29Q1j58j83J06J76p7j32k2J64R1
$$ y = [-89, 186, 175, -161, -214, 74, 219, -12, -229, -126, 196, 136, -60, -152, -5, 209, 127, -72, -125, 35, 211, 44, -240, -99, 115, 162, -98, -188, -7, 165, 84, -159, -158, 50, 76, -5, -229, -122, 98, 127, -113, -209, -9, 234, 134, -210, -131, 168, 193, -77, -127, -45, 182, 120, -143, -131, 44, 241, 42, -168, -100, 112, 207, -99, -217, 30, 134, 59, -150, -132, 50, 151, -36, -192, -98, 122, 148, -108, -181, 14, 191, 61, -94, -147, 151, 217, 11, -181, -31, 157, 135, -102, -130, 86, 136, 31, -172, -166, 90, 189, -64, -149, -25, 152, 105, -152, -146, 79, 139, 3, -138, -107, 124, 124, -23, -149, -20, 169, 121, -129, -169, 65, 206, -63, -199, -24, 107, 71, -105, -146, 24, 165, 14, -176, -77, 137, 240, -4, -224, -27, 162, 103, -143, -151, 111, 150, 86, -142, -87, 149, 134, -31, -168, -6, 135, 109, -119, -207, -10, 180, 22, -204, -87, 77, 51, -29, -144, 73, 112, 30, -77, -131, 98, 179, 21, -162, -56, 120, 43, -89, -111, 53, 144]
4040A44j26j70Q9O0J05j56o8J15J47n5k18k1J80J00j74j52J22J60M3j86q9K16
4062F6O1o4j06o5J54J23j39j63Q5J72j1k06rJ81P6j58j54J16Q0J08k05m5P6J78
4086A51q6j74jJ57R7j22j86R6K07r4j02n8J01J03rj52l9J18J51j66j32O9J62M1
4110A32k55m3J89J23j24j39Q3Q2J02j65p6R3R6Lk00k4J44J56j09k20L7K07%j52
4134f0r5J31J31r8p3l1Q5J13q2j66M2K35qk21k4J10J61r8k18P0K06k5n0j03L5
4159c3J26K3k01m1K02J10j63k19N8K23l2j48n7J66O1o2p8m0J11P1l4j20j2J57
4183F8L3j37j11J19J36p7q5L1J19m6m4q4N3J34K5j44r2J24P0k7j69oJ90N6k05
4208f9l7R4N9J9j63J6Q9L1Op6n4J57L9j56p2J55O7n1j66N6P9N2q8m3L5R3k0j8
$$ y = [144, 18, -152, -63, -3, 102, -54, -122, -7, 140, 85, -133, -154, 26, 126, -48, -200, -78, 82, 125, -61, -150, 66, 127, 63, -43, -108, 46, 169, 30, -133, -48, 124, 113, -93, -102, 79, 155, -3, -157, -41, 39, 147, -58, -103, -27, 151, 65, -109, -110, 47, 144, 22, -164, -68, 139, 45, -57, -115, -14, 89, 80, -72, -111, 7, 158, -8, -140, -71, 91, 132, -123, -166, 23, 146, 22, -117, -34, 48, 150, -15, -91, 2, 98, 101, -99, -123, 21, 177, 68, -152, -115, 92, 92, -60, -155, -24, 107, 9, -64, -95, -10, 103, 21, -145, -103, 132, 124, -97, -121, -11, 150, 52, -166, -96, 110, 85, 35, -68, -33, 93, 116, -85, -126, 76, 186, 23, -196, -138, 85, 53, -95, -152, 14, 75, 13, -65, -105, 6, 77, 43, -77, -89, 68, 101, -36, -147, -28, 108, 31, -54, -23, 96, 50, 6, -78, -25, 109, 134, -10, -102, 22, 92, 65, -104, -110, 80, 136, -69, -106, -12, 47, 66, -97, -81, 8, 39, 45, -31, -85, 72, 111, -45, -117, 38, 105, 54, -112, -56, 23, 75, -13, -56, -21, 72, 52, 34]
4236C4j26O8J02j1j84K0K11m8r7p2J28P5r6p7L9O8M4m5n6n4J63Mj03q6Q4J00o9
4263A6j41N0J19K8j27l1Q4P6m5j5j22R6J26l6j46j8J91J10k15q6J27Q1k8j28l1
4288f5Q7N4mj24m9J29R5j63l6J1J39m1j31PJ05M9n3o2kR6Q0j38p8N0J75o9j65
4315a03J1J54L5o9j60J22J02l9j14qQ4R5q9o4l5J71j3n6j27L4J46kj36l8J36Q9
4341A26j19m6K4O3L3j30l4O0P8J8j50n1J45N0j01r2J05Q2n2r4O4L4L4M1j37k6
4367g5J27j5j9q9O5J00n8r9PJ32L6j20q0Q8O9%q7l0N1P6k2j00p3J43K3p1n1k1
4395i3J83m0r5l4Q2J03l8j31Q4l3J07o1j24R6J13n9j7n0L5J18j44o4L1J15m7p9
4421d2j2N0J1L6j04k4R5M0J1j49nJ54kp7n8Q9N9n5m0m1R4M8m3j04l6J64j7o2l1
$$ y = [34, -92, -24, 78, 67, -117, -97, 114, 66, -31, -103, 25, 100, 4, -73, -34, 34, 78, 33, -23, -77, 86, 90, -13, -99, -15, 85, 16, -125, -75, 44, 72, -55, -86, -2, 74, 29, 14, -108, -12, 114, 78, -68, -86, 105, 215, 0, -86, 41, 122, 94, -34, -65, 22, 76, 72, -52, -101, 28, 123, -40, -76, -65, 74, 33, -98, -91, 14, 63, 10, -52, -54, 42, 122, -16, -94, -44, 131, 62, -103, -92, 62, 97, 28, -132, -10, 92, 53, -61, -69, 15, 110, 21, -43, -78, 93, 80, 24, -103, -69, 77, 75, -61, -99, 37, 126, 7, -39, -15, 48, 81, -49, -83, -23, 55, 73, -77, -128, 17, 67, -34, -126, -21, 61, 9, -85, -21, 13, 47, 88, -49, -75, 52, 37, 18, -71, -6, 94, 36, -63, -56, 76, 112, -8, -88, 0, 69, 69, -18, -48, 3, 79, 57, -43, -116, 27, 50, -21, -72, -93, 90, 50, -45, -79, 3, 106, 68, -63, 21, -12, 95, 34, -90, 6, 119, 60, 43, -7, 28, 146, 2, -62, -31, 84, 37, -42, -54, -4, 7, 43, -61, -85, 10, 50, 61, -88, -93, 61, 59, -18, -76, 13, 72, 17, -23, -64, 30, 78, 35, -69, -105, 59, 42, -20, -51]
4450e1M9Q8l2j39L4R3O3j87M3lQ8L2p1p4L3O4J9j31K7J35J4j12n1J11M9n4o5k3
4478e1K9O6Or6l5R8J06j44n6N7J55j27j17L8J69L5j31o1L8M9L6o6o4M6Q0l5r8
4505g3L3M7O9q6p2P8N8k5j20M3N2j6J7l5j1L5O3j34J0M5Q2p5o0L1J03J3m8j3J8
4534B9orln9L4P2k4j08NJ30L8j12n7Q3O1j15n8O8Q1k5k7k8l8R3K5q3m5Q4R2o2
4564C6o4jK7O8o2k7L3OO0o5m3PJ22q8m9m9Q2N5o2p1O9O7k8o9K8K8K3jn1k5O7L4
4596E7l2j13k0J52Np1J3J9N3m3n0lK3K5j0o2R2Pj0m3r3J05L4l0m7jR2K1j04L6
4626BK0N0r9L1j7J4L1k4j36J05M7Rj12PQJ00n9j9j7P7K0n8M3r9O3O2j07qJ20l8
4656A6k9m1M3J69j13n4%O1K2q2j3j2P2K1p8p1N2N5jj02L0K0M3n9K0L5L3j6m5K4
$$ y = [-51, -2, 86, 54, -85, -51, 42, 105, -82, -39, -42, 46, 78, 7, -67, -34, 30, 49, -82, -55, 80, 94, -18, -69, 42, 91, 37, -28, -51, -22, 44, 50, -46, -81, 17, 123, -21, -77, -20, 135, 8, -109, -71, 98, 133, 2, -59, -21, 28, 64, -2, -66, -20, 60, 25, -73, -40, 7, 76, -10, -82, -4, 54, 29, -91, -48, 4, -12, 5, -30, -41, -6, 57, -77, -67, -22, 60, -15, -75, -44, 59, 72, 24, 11, 29, 23, 14, 11, -48, -14, 58, 34, -74, -69, 61, 99, -13, -70, 13, 74, -41, -99, -31, 50, 25, -2, -30, -68, 25, 50, -33, -78, 6, 98, 36, -28, -29, -2, 66, 4, -23, 10, 16, 76, 11, -32, -25, 97, 9, -40, -89, -7, 48, -14, -85, -16, 51, 23, -46, -18, 10, 33, 32, -19, -44, 23, 57, 25, -88, -108, 44, 49, -22, -9, 10, 63, 20, -30, -33, -10, 15, 5, -57, 35, 42, 32, -11, -104, 1, 35, 5, -42, -43, 49, 70, -34, 2, 22, 72, -27, 4, -13, 1, 32, 8, -128, -23, 24, 33, -79, -72, -64, 36, -23, -42, -59, 18, 38, -20, 23, -76, -13, 49, -58, -66, 54, 16, -13, -54, -11, 158, 45, -9, -9, 52, 74, -8, -21, -33, 39, 60, -18, -89, -37, 18, 17, -85, -55, -35, 8, -51, -31, 4, 37, 21, -24, 0]
4686@L5k6j9j9PP4K9n4q6M6P7op0l3N3L9n2k8j1N1O1j02RlQ0J4j24OJ04j7j9o8
$$ y = [0, 35, 9, -10, -29, -22, 52, 81, 27, -59, -13, 64, 58, -12, -45, 8, 47, -5, -33, -44, 7, 68, -34, -25, -28, 52, 66, -58, -52, 52, 35, 16, -52]
$$ [...]
8191C6
##END NTUPLES=NMR FID
##END=
