##TITLE=1H_LY-DMAA.Per.2.17
 CDCl3
 8 sc, 
 14.03.2022
##JCAMPDX= 6.0         $$ Bruker NMR JCAMP-DX V2.0
##DATA TYPE= NMR FID
##DATA CLASS= NTUPLES
##ORIGIN= UXNMR, Bruker Analytische Messtechnik GmbH
##OWNER= root
$$ XWIN-NMR		Version 3.5
$$ Mon Mar 14 10:54:01 2022 Russian Standard Time (UT+4h)  she@DPX200
##.OBSERVE FREQUENCY= 200.131346
##.OBSERVE NUCLEUS= ^1H
##.DELAY= (6, 6)
##.ACQUISITION MODE= SIMULTANEOUS
##.ACQUISITION SCHEME= undefined
##.AVERAGES= 8
##.DIGITISER RES= 18
##SPECTROMETER/DATA SYSTEM= spect
##.PULSE SEQUENCE= zg30
##.SOLVENT NAME= CDCl3
##.SHIFT REFERENCE= (INTERNAL, CDCl3, 0, 15.7039)
##AUDIT TRAIL= $$ (NUMBER, WHEN, WHO, WHERE, WHAT)
$$ ##TITLE= Audit trail, XWIN-NMR		Version 3.5
$$ ##JCAMPDX= 5.01
$$ ##ORIGIN= Bruker BioSpin GmbH
$$ ##OWNER= she
$$ F:/spectra/data/she/nmr/H-F/1/audita.txt
$$ ##AUDIT TRAIL=  $$ (NUMBER, WHEN, WHO, WHERE, WHAT)
(   1,<2022-03-14 10:53:04.81 +0400>,<she>,<DPX200>,
      <created by zg, POWCHK disabled, PULCHK disabled
       configuration hash MD5:
       00 E9 B6 7A A2 85 ED C7 34 08 36 98 17 FE 4E 26
       data hash MD5: 16K
       9B 25 2D 9C A8 10 FF CC F1 78 85 91 CD 16 C8 1A>)
$$ ##END=
$$ 
$$ hash MD5
$$ 9D 72 47 14 72 28 77 24 25 E1 3D B8 B4 0C 9B F9
##$RELAX= 
##$RELAX= 
##$RELAX= 
##$RELAX= 
##$RELAX= 
##$RELAX= 
$$ Bruker specific parameters
$$ --------------------------
##$DU= <F:/spectra>
##$EXPNO= 1
##$NAME= <H-F>
##$PROCNO= 1
##$TYPE= <nmr>
##$USER= <she>
##$AMP= (0..31)
100 100 100 100 100 100 100 100 100 100 100 100 100 100 100 100 100 100 
100 100 100 100 100 100 100 100 100 100 100 100 100 100 
##$AQSEQ= 0
##$AQ_mod= 1
##$AUNM= <au_zg>
##$AUTOPOS= <>
##$BF1= 200.13
##$BF2= 200.13
##$BF3= 200.13
##$BF4= 200.13
##$BF5= 200.13
##$BF6= 200.13
##$BF7= 200.13
##$BF8= 200.13
##$BYTORDA= 1
##$CFDGTYP= 0
##$CFRGTYP= 5
##$CHEMSTR= <none>
##$CNST= (0..31)
1 1 145 1 1 1 1 1 1 1 1 1 1 1 1 1 1 1 1 1 1 1 1 1 1 1 1 1 1 1 1 1 
##$CPDPRG= <>
##$CPDPRG1= <>
##$CPDPRG2= <>
##$CPDPRG3= <>
##$CPDPRG4= <mlev>
##$CPDPRG5= <mlev>
##$CPDPRG6= <mlev>
##$CPDPRG7= <mlev>
##$CPDPRG8= <mlev>
##$CPDPRGB= <>
##$CPDPRGT= <>
##$D= (0..31)
0 1.2 0 0 0 0 0 0 0 0.06 0 0.03 0 0 0 0 0.0002 0 0 0 0 0 0 0 0 0 0 0 0 
0 0 0 
##$DATE= 1647240784
##$DBL= (0..7)
120 120 120 120 120 120 120 120 
##$DBP= (0..7)
150 150 150 150 150 150 150 150 
##$DBP07= 0
##$DBPNAM0= <>
##$DBPNAM1= <>
##$DBPNAM2= <>
##$DBPNAM3= <>
##$DBPNAM4= <>
##$DBPNAM5= <>
##$DBPNAM6= <>
##$DBPNAM7= <>
##$DBPOAL= (0..7)
0.5 0.5 0.5 0.5 0.5 0.5 0.5 0.5 
##$DBPOFFS= (0..7)
0 0 0 0 0 0 0 0 
##$DE= 6
##$DECBNUC= <off>
##$DECIM= 32
##$DECNUC= <off>
##$DECSTAT= 4
##$DIGMOD= 1
##$DIGTYP= 9
##$DL= (0..7)
0 120 120 120 120 120 120 120 
##$DP= (0..7)
150 150 150 150 150 150 150 150 
##$DP07= 0
##$DPNAME0= <>
##$DPNAME1= <>
##$DPNAME2= <>
##$DPNAME3= <>
##$DPNAME4= <>
##$DPNAME5= <>
##$DPNAME6= <>
##$DPNAME7= <>
##$DPOAL= (0..7)
0.5 0.5 0.5 0.5 0.5 0.5 0.5 0.5 
##$DPOFFS= (0..7)
0 0 0 0 0 0 0 0 
##$DQDMODE= 0
##$DR= 18
##$DS= 0
$$ [...]
##$SUBNAM2= <"">
##$SUBNAM3= <"">
##$SUBNAM4= <"">
##$SUBNAM5= <"">
##$SUBNAM6= <"">
##$SUBNAM7= <"">
##$SUBNAM8= <"">
##$SUBNAM9= <"">
##$SW= 18.0517287032376
##$SWIBOX= (0..15)
0 0 2 0 0 0 0 0 0 0 0 0 0 0 0 0 
##$SW_h= 3612.71676300578
##$TD= 16384
##$TD0= 1
##$TE= 0
##$TE2= 300
##$TE3= 300
##$TEG= 300
##$TL= (0..7)
0 120 120 120 120 120 120 120 
##$TP= (0..7)
150 150 150 150 150 150 150 150 
##$TP07= 0
##$TPNAME0= <>
##$TPNAME1= <>
##$TPNAME2= <>
##$TPNAME3= <>
##$TPNAME4= <>
##$TPNAME5= <>
##$TPNAME6= <>
##$TPNAME7= <>
##$TPOAL= (0..7)
0.5 0.5 0.5 0.5 0.5 0.5 0.5 0.5 
##$TPOFFS= (0..7)
0 0 0 0 0 0 0 0 
##$TUNHIN= 0
##$TUNHOUT= 0
##$TUNXOUT= 0
##$USERA1= <user>
##$USERA2= <user>
##$USERA3= <user>
##$USERA4= <user>
##$USERA5= <user>
##$V9= 5
##$VALIST= <valist>
##$VCLIST= <CCCCCCCCCCCCCCC>
##$VD= 0
##$VDLIST= <DDDDDDDDDDDDDDD>
##$VPLIST= <PPPPPPPPPPPPPPP>
##$VTLIST= <TTTTTTTTTTTTTTT>
##$WBST= 1024
##$WBSW= 4
##$XGAIN= (0..3)
0 0 0 0 
##$XL= 0
##$YL= 0
##$YMAX_a= 362117
##$YMIN_a= -309418
##$ZGOPTNS= <>
##$ZL1= 120
##$ZL2= 120
##$ZL3= 120
##$ZL4= 120
##$ABSF1= 10
##$ABSF2= 0
##$ABSG= 5
##$ABSL= 3
##$ALPHA= 0
##$AQORDER= 0
##$ASSFAC= 0
##$ASSFACI= 0
##$ASSFACX= 0
##$ASSWID= 0
##$AUNMP= <proc_1d>
##$AZFE= 0.1
##$AZFW= 0.1
##$BCFW= 1
##$BC_mod= 2
##$BYTORDP= 1
##$COROFFS= 0
##$CY= 11.3945322036743
##$DATMOD= 1
##$DC= 2
##$DFILT= <>
##$DTYPP= 0
##$F1P= 2.36226072786647
##$F2P= -0.459571619588291
##$FCOR= 0.5
##$FTSIZE= 0
##$FT_mod= 4
##$GAMMA= 1
##$GB= 0.15
##$INTBC= 1
##$INTSCL= 1
##$ISEN= 128
##$LB= 0.24
##$LEV0= 0
##$LPBIN= 0
##$MAXI= 10000
##$MC2= 0
##$MEAN= 0
##$ME_mod= 0
##$MI= 1.114404
##$NCOEF= 0
##$NC_proc= 0
##$NLEV= 6
##$NOISF1= 3.799351
##$NOISF2= 2.8
##$NSP= 1
##$NTH_PI= 0
##$NZP= 0
##$OFFSET= 15.70392
##$PC= 1
##$PHC0= -17109.1
##$PHC1= 14.00078
##$PH_mod= 1
##$PKNL= yes
##$PPARMOD= 0
##$PSCAL= 0
##$PSIGN= 0
##$REVERSE= no
##$SF= 200.130013532006
##$SI= 16384
##$SIGF1= 3
##$SIGF2= 2
##$SINO= 400
##$SIOLD= 16384
##$SREGLST= <1H.CDCl3>
##$SSB= 0
##$STSI= 0
##$STSR= 0
##$SW_p= 3612.71676300578
##$SYMM= 0
##$S_DEV= 0
##$TDeff= 0
##$TDoff= 0
##$TI= <>
##$TILT= no
##$TM1= 0
##$TM2= 0
##$TOPLEV= 0
##$USERP1= <user>
##$USERP2= <user>
##$USERP3= <user>
##$USERP4= <user>
##$USERP5= <user>
##$WDW= 1
##$XDIM= 8192
##$YMAX_p= 0
##$YMIN_p= 0
$$ End of Bruker specific parameters
$$ ---------------------------------
##NTUPLES= NMR FID
##VAR_NAME=  TIME,          FID/REAL,        FID/IMAG
##SYMBOL=    X,             R,               I
##VAR_TYPE=  INDEPENDENT,   DEPENDENT,       DEPENDENT
##VAR_FORM=  AFFN,          ASDF,            ASDF
##VAR_DIM=   8192,          8192,            8192
##UNITS=     SECONDS,       ARBITRARY UNITS, ARBITRARY UNITS
##FACTOR=    0.0002768,     1,               1
##FIRST=     0,             0,               0
##LAST=      2.2672688,     0,               0
##MIN=       0,             -309418,         0
##MAX=       2.2672688,     362117,          0
$$ Real data points
##PAGE= N=1
##DATA TABLE= (X++(R..R)), XYDATA
0@%%%%%%%%%%Qj6J6j6K4l2L2m0N0n8P2q9J06j24J48j77K02k35K74l12L58m10M67
$$ 0 0 0 0 0 0 0 0 0 0 0 8 -8 8 -8 16 -16 16 -24 26 -32 40 -49 57 -67 81 -96 106 -129 145 -167 191 -219 248
33B48n28N96o72P55q47R48j056J176j311J456j610J781j971K176k399K645k916
$$ 248 -280 316 -356 399 -448 500 -556 620 -691 765 -845 936 -1035 1141 -1258 1387 -1529
50a529L214l539L898m300M750n256N828o482P237q123R183j0470J2073j4137J6906
$$ -1529 1685 -1854 2044 -2256 2494 -2762 3066 -3416 3821 -4302 4881 -5589 6484 -7653 9253
65I253k0840K6903l7546O1546k10118N7482M75437k33910l78772O1689L49551
$$ 9253 -11587 15316 -22230 39316 -170802 -113320 362117 128207 -250565 -188876 160675
76A60675P271j98301j02602O6043J11603J11316j05690k41827L2700L57232M5242
$$ 160675 167946 -30355 -132957 -66914 44689 156005 50315 -191512 -158812 198420 243662
87B43662m00585j45805M02263K15634l40517k63811K53000K57744j40444k13902
$$ 243662 -156923 -302728 99535 315169 -25348 -289159 -36159 221585 81141 -132761
97a32761L7691J23576N0040j2107j00173j12505J15698K23403r2306l08782M6044
$$ -132761 -95070 28506 78546 66439 -33734 -146239 -30541 192862 100556 -208226 -162182
108a62182L52344J3468l52815o6198L11062J02218k38365j09577J47002Q6772
$$ -162182 190162 203630 -149185 -215383 95679 197897 -40468 -150045 -3043 83729
118H3729n3800l5463k8099l4867Q6704J11675j18077j81664J22425K32241j06529
$$ 83729 29929 -5534 -33633 -68500 18204 129879 11802 -169862 -47437 184804 78275
129G8275k56018P8776K50096n0007k16844K8492J63082j9869r7664K6600L1201
$$ 78275 -177743 -98967 151129 101122 -115722 -87230 75852 55983 -41681 -15081 16120
140A6120m6023K7946P3725p3144j02125J02755J24451j16874j35675J19496J32789
$$ 16120 -29903 -1957 71768 -1376 -103501 -746 123705 6831 -128844 -9348 123441
151A23441j15179j16067J08283Q7716j03171n2602J00606J5694j01115J8015J01607
$$ 123441 8262 -107805 478 88194 -14977 -67579 33027 48721 -52394 -34379 67228
162F7228m5448r9488O5418R1627p8674p5729Q7492N2403r4503k2884J02419q642
$$ 67228 21780 -77708 -12290 79337 663 -75066 12426 64829 -29674 -52558 49861 41219
174D1219j11660L8239J22252o1406j31077P5103J34770p8503j29441P2651J11942
$$ 41219 -70441 -32202 90050 28644 -102433 -27330 107440 28937 -100504 -27853 84089
185H4089o1463q1757M9007M0103m0785Q616L9947n8936m8655J03709O5599j36520
$$ 84089 22626 -59131 -10124 29979 -10806 -2190 37757 -21179 -69834 33875 99474 -37046
197c7046q6929J52403J07746j49436j20925J29059J21467r5324j04553N5303P0016
$$ -37046 -123975 28428 136174 -13262 -134187 -5128 116339 21015 -83538 -28235 41781
208D1781j6757j9975j2599l9825K7561J00983k5584j54768P617J92043K0987k06902
$$ 41781 25024 5049 -7550 -47375 -19814 81169 55585 -99183 -91566 100477 121464 -85438
220h5438n3576J96705Q0347j62910r4087J11146Q8610n0125o1989r597J6346N8591
$$ -85438 -139014 57691 138038 -24872 -118959 -7813 80797 30672 -31317 -40914 -24568 34023
232C4023M2500q8984j04757R7374J60573q3896j99635N3855K15090j5113k03193
$$ 34023 76523 -12461 -117218 -19844 140729 56833 -142802 -88947 126143 111030 -92163
243i2163k2881J65618N0364j08068o0812L9132N0534K9771k0487q9000k4525J29158
$$ -92163 -115044 50574 100938 -7130 -67942 -28810 21724 51495 31008 -57992 -82517 46641
255D6641P6573j46263j25617J39236J62379j11885j78885P1276J71486k6513j39436
$$ 46641 123214 -23049 -148666 -9430 152949 41064 -137821 -66545 104941 78428 -61008
266f1008j2549Q7393L8388k2771m5604m4254L3594J03716n318j46929l2953J68089
$$ -61008 -73557 13836 52224 29453 -16151 -60405 -26811 76905 71587 -75342 -108295 59794
278E9794P2327j65867j04226J42359J20854j04089j18043N8780R4619j5466n3892
$$ 59794 132121 -33746 -137972 4387 125241 21152 -96891 -38111 56508 41042 -12850
289a2850j8465K303L7870N2177m0981j00854K9850J36872q562j54946j6041J53733
$$ -12850 -31315 -29012 8858 61035 20054 -80800 -50950 85922 77360 -77586 -93627 60106
301F0106L7707j34727n0473J02685N0757o3748l7625K4310J2743R302J9551l3355
$$ 60106 97813 -36914 -87387 15298 66055 2307 -35318 -11008 1735 11037 30588 -2767
313b767n4133M5453Q4728m6510j06796L9033J16777k7246j13467J5529R8099p517
$$ -2767 -56900 -11447 73281 26771 -80025 -40992 75785 48539 -64928 -49399 48700 41183
325D1183p3581O050M4446j1438j4553K2697j1322l7392L1336N2095m3982o3367
$$ 41183 -32398 -26348 18098 6660 -7893 14804 3482 -33910 -2574 49521 5539 -57828
337e7828M9737O8668n0650o6798M8763N7768m6724m3475M5701K5747m6644p811
$$ -57828 -8091 60577 9927 -56871 -8108 49660 2936 -40539 5162 30909 -15735 -23546
349b3546M8922q477n1101K1290N1665l0258m8749L6048M1796l9508l0372M2467
$$ -23546 25376 16899 -34202 -12912 38753 8495 -40254 -4206 37590 -1918 -32290 10177
361A0177J6033m5871j62N0512j4744n5836K6546O0975l4050o3975L6246O2730
$$ 10177 26210 -19661 -19823 30689 15945 -39891 -13345 47630 13580 -50395 -14149 48581
373D8581l4060n5979K8755M2710k2958k3866J8848Q47j8395K3134K2750m5099
$$ 48581 14521 -41458 -12703 30007 7049 -16817 2031 2878 -15517 7617 30367 -14732
385a4732l1221O1778M2304p0466n2853P0182O0134o1210o0840M6181N3171k7906
$$ -14732 -45953 15825 58129 -12337 -65190 4992 65126 3916 -56924 -10743 42428 14522
397A4522l6639J0414J2571K708J6152r184m5554P566P0979R23q8730j4442R5728
$$ 14522 -22117 -11703 868 3576 19728 10544 -35010 -27444 43535 44458 -44272 -58714 37014
410C7014K9062r1073m0946P5579M6234n1939m2696K4630K9299K272p216k3752
$$ 37014 66076 -24997 -65943 9636 55870 3931 -38765 -14135 15164 17436 10220 -13532
422a3532k0355L6775M9652l9386p5470L2466R3342j8006j00072j02R4158J7005
$$ -13532 -33887 2888 52540 13154 -62316 -29850 63492 45486 -54586 -54688 39470 56475
434E6475p6447k8763M9485L1840j8179k4908j3050Q670L8811J4151n5726l9455
$$ 56475 -19972 -48735 750 32590 14411 -10497 -23547 -14877 23934 38085 -17641 -57096
446e7096O1716O2603n6859p8892M3496Q5269k4983p9928O190O3618R345l8863
$$ -57096 4620 67223 10364 -68528 -25032 60237 35254 -44674 -38484 25134 34479 -4384
458d384j7664R350J7662K0182r394m5456n317O2694K3183p0277m0417O7446N3029
$$ -4384 -22048 -12698 4964 25146 15752 -29704 -35021 27673 50856 -19421 -59838 7608 60637
471F0637n6251n8434L9203N4924k0310m2620L229K3196R159L59j4711k4212J3445
$$ 60637 4386 -54048 -14845 40079 19769 -22851 -19622 3574 12733 13092 -1619 -25831 -12386
484a2386M4953n982n9287m811O5574J6294o3384k5284N3987K9341l9562k7404
$$ -12386 32567 26585 -32702 -37513 28061 44355 -19029 -44313 9674 39015 -547 -27951
496b7951K3065J8973p580n951m599r903J1912K5653j4301l8969J2382M7477p650
$$ -27951 -4886 14087 6507 556 -4043 -13946 -2034 23619 9318 -29651 -17269 30208 22558
509B2558n0326K422M7430J822l9701l245K8848J548j6603L381N246j0408M025
$$ 22558 -27768 -25346 22084 23906 -15795 -19040 9808 11356 -5247 -1866 3380 -7028 -3003
522c003J8359j0407k5492J3670L0437j4611l2316J3840L0597j2724k6043J2141
$$ -3003 15356 4949 -20543 -6873 23564 8953 -23363 -9523 21074 8350 -17693 -5552
534e552J9133j2916j1254J4889L605j7623K647K0568p149k2459R907K2799j1027
$$ -5552 13581 665 -10589 4300 7905 -9718 -7071 13497 6348 -16111 -6204 16595 5568
547E568k0834J1599J6782j2015j0944J3293M287j5563K151J8542p516k1781J0870
$$ 5568 -15266 -3667 13115 1100 -9844 3449 7736 -7827 -5676 12866 5350 -16431 -5561
560e561K4119j2115k5127J1478K3527r663j9495P593J2938o259m685O366m198
$$ -5561 18558 6443 -18684 -7206 16321 6658 -12837 -5244 7694 1435 -3250 3116 -1082
573a082q204J2502J1797j8764j6188K2389K0600k2561k3566J9824K4242j4872
$$ -1082 -9286 3216 15013 -3751 -19939 2450 23050 489 -23077 -3253 20989 6117
585F117k1630Q765J5939l188p527r17k581K200J2926r69k1874k963K7858Q244
$$ 6117 -15513 -6748 9191 6003 -1524 -2441 -5022 -2822 10104 9135 -12739 -15702 12156 20400
599B0400l0197j3700K8499J7782k3158j9355J5630J7545o950j2103r22M061O679
$$ 20400 -9797 -23497 5002 22784 -374 -19729 -4099 13446 6496 -5607 -6529 -2468 4211
612D211N869r415j5658Q890K3944n426k9372J30L0801N543k8386j0323K2311J2798
$$ 4211 10080 665 -14993 -6103 17841 12415 -16957 -16827 13974 19517 -8869 -19192 3119 15917
626A5917j4034j2227M643Q418L877j961j0430o125J4055J4454j4216k1298J1426
$$ 15917 1883 -10344 -5701 2717 6594 4633 -5797 -11922 2133 16587 2371 -18927 -7501
639g501K5840o555k6743R46K4163M213j8429p381J0504Q069j842o049o165J478
$$ -7501 18339 11784 -14959 -14013 10150 14363 -4066 -11447 -943 7126 5284 -765 -6930 -5452
653e452J2138M374j5509j0560J5675J5721j3354j8895R108J9258m104j6870l63
$$ -5452 6686 11060 -4449 -15009 666 16387 3033 -15862 -6754 12504 8400 -8470 -8833
666h833J2138L425n649m530r81L619P156p77j1514l210J3992P202j4003j0541
$$ -8833 3305 6730 1081 -3449 -4430 -811 6345 5568 -5946 -9156 4836 12038 -1965 -12506
680a2506J2080J2191q727j2148M785R991j197o451j402J734K438L079k041p252
$$ -12506 -426 11765 3038 -9110 -4325 5666 4469 -1982 -3384 -1650 788 3867 1826 -5426
694e426L11J0138K158j1340m597J0994O460r009p234O460O622l448m780R40K066
$$ -5426 -5115 5023 7181 -4159 -8756 2238 8698 -311 -7545 -1085 5537 2089 -2691 -1751 315
709C15P49J202j345m311R36O574K12p971j787Q106L043p292l886N671L823l799
$$ 315 1064 2266 921 -3390 -2454 4120 4332 -3639 -5426 2680 5723 -1569 -5455 216 4039 240
725B40k881J895J255m79Q44k53k867M55M555K61n693r76O059J779n629k276M723
$$ 240 -2641 -746 509 30 874 621 -2246 -1791 2764 3025 -2668 -3644 2415 4194 -1435 -3711 1012
742A012K267l533j668K163O16j221P36N13k234m19L354P43m343j095M582J470
$$ 1012 3279 -254 -1922 241 857 -364 372 885 -1349 -1768 1586 2329 -2014 -3109 1473 2943
758B943m364j596L806J432k984p21K252n5j711J238J436k205j446L083J587l627
$$ 2943 -1421 -3017 789 2221 -763 -1484 768 713 -998 240 1676 -529 -1975 1108 2695 -932
774i32j692L557J841l411j594K792R84k403p5K006j156j890K305J982l289k296
$$ -932 -2624 933 2774 -637 -2231 561 1545 -858 -933 1073 -83 -1973 332 2314 -975 -3271
790c271M010K733m099k990L934K872l205k311K354J419j618J28J096j873r48L615
$$ -3271 739 3472 -627 -3617 317 3189 -16 -2327 27 1446 -172 -44 1052 -821 -1769 1846
806A846J248n088j951N904K738o147l471N553L699m357l579K956K418j376o81
$$ 1846 3094 -1994 -3945 1959 4697 -1450 -4921 632 4331 -26 -3605 -649 1769 393 -288
821b88J32j491N35L945n60n956M6P595J016q297k169Q063L132o836l550N061L050
$$ -288 -156 -1647 -1112 2833 2273 -3683 -3637 3958 4974 -3323 -5492 2571 5703 -1133 -4683 378 3428
838C428k778j871M93k06J247K724k469n417K710P684k171r302J082R885K59r389
$$ 3428 650 -1221 -728 -934 313 3037 568 -4849 -2139 5545 3374 -5928 -4846 5039 5298 -4091
854d091j223P637J982n202j739K366P94M58J164k781l534M429N878n006p996M719
$$ -4091 -5314 2323 4305 -897 -2636 -270 524 982 2146 -635 -4169 260 6138 1132 -6864 -2145
870b145R249l788r583K451Q681j332o872N31M296m29j331R42j610k006M053L523
$$ -2145 7104 3316 -6267 -3816 4865 3533 -3339 -2808 1488 1059 -272 670 -940 -2946 1107 4630
886D630n648n113O571O484o685p080O160P058n263o063M196M432l318k223K754
$$ 4630 -1018 -6131 440 6924 239 -6841 -681 6377 1114 -4949 -753 3679 361 -1862 892
901H92l54k615K769K648m879l006O368L350p355l532P682L257p470k620O967J528
$$ 892 538 -2077 692 3340 -1539 -4545 1823 5173 -2182 -5714 1968 5225 -2245 -4865 2102 3630
917C630o162j18N471j381m583K937L834m185k959N221K050n895r82O206j85o421
$$ 3630 -2532 -2650 2821 1440 -3143 -206 3628 -557 -3516 1705 3755 -2140 -3122 3084 2899 -3522
933c522J440O399k856o375L952O210m944n805N323N247n463m239N137K892m610
$$ -3522 -2082 4317 1461 -4914 -962 5248 304 -5501 -178 5069 -394 -4633 504 3396 -1214
948a214j076M081j149l500L690L189n836l168P848L462r152l934R613M326r261
$$ -1214 -2290 1791 642 -2858 832 4021 -1815 -4983 2865 6327 -2825 -6759 2854 7180 -2081
963b081m337P903L743n998k390L635K01j437K595m99n682J499Q646j685j1115
$$ -2081 -6418 1485 5228 -770 -3160 475 676 -761 1834 1335 -4347 -2848 5798 4113 -7002
978g002J182J2589k0j2774j105J1580K160r093k402N761J740j952J9j760k642
$$ -7002 -5820 6769 6749 -6025 -7130 4450 6610 -2483 -4885 876 2616 664 683 -1077 -3719
993c719M734N709o535q981P121J1569o478j3216M836J3282k656j1909N65Q865
$$ -3719 1015 6724 189 -8792 -1671 9898 3420 -9796 -4960 8322 5666 -6243 -5678 3187
1007C187R40m726j363J2O85M616J246q407l820J0955O772j1768r437J1154J1006
$$ 3187 4127 -599 -1962 -1950 -1265 3351 4597 -3810 -7630 3325 10097 -1671 -11108 46 11052
1022A1052r060j1228O176R795l228o773N59K588J081K075j557o808Q65J0490Q94
$$ 11052 1992 -9236 -3060 6735 3507 -3266 -2707 -119 962 3037 1480 -5328 -4463 6027 6921
1037F921j3039l129J4021N157j3108o604J0990O960p799n884M281L684j044k20
$$ 6921 -6118 -9247 4774 9931 -3177 -9781 1209 8169 370 -5514 -1233 2451 1407 1187
1051A187j500l576K834P521l253j0606K418J2716j212j3315m13J2452J499j0343
$$ 1187 -313 -3889 -1055 6466 3213 -7393 -4975 7741 6529 -6786 -7199 5253 6752 -3591
1065c591j952P246J453l776l4M46k219K370M809m120p300N080R239n045j0243
$$ -3591 -5543 1703 3156 -620 -654 -208 -2427 -57 4752 632 -6668 -1588 7651 2606 -7637
1080g637M552J0128l716q919L044O755k622m207K795J383l513J326M327l462n412
$$ -7637 -3085 7043 3327 -5592 -2548 4207 1585 -2622 173 1556 -1957 -631 3696 234 -5178
1095e178M944O060n699o450O035O076n904n039N575L562n318j622N279l15n279
$$ -5178 -234 5826 127 -6323 -288 5788 -116 -5155 420 3982 -1336 -2958 2321 2006 -3273
1110c273K101N467l576n420M557N184n095m448N142L330n136j754M986j74n061
$$ -3273 -1172 4295 719 -4701 -144 5040 -55 -4503 639 3969 -1167 -2921 2065 1891 -3170
1125c170K137N241m073n419N277N720n993n794O066N446n559m404M648K868l647
$$ -3170 -1033 4208 135 -5284 -7 5713 -280 -6074 -8 5438 -121 -4525 123 2991 -656
1140f56n67K892k120k306M656K405o892k865Q531L627r278m409Q912M768p612
$$ -656 -1223 1669 -451 -2757 1899 4304 -2588 -5453 3078 6705 -2573 -6982 1930 6698 -914
1155i14m703N704L565l409j642J080r60O07M014j588o959J726R478r99j1017k25
$$ -914 -5617 87 3652 243 -1399 -319 -1279 -672 3342 1754 -5205 -3479 5999 5000 -6017 -6242
1171f242J1442J619j0354k734Q274L158n307k552J839R90J436J358m015m337N480
$$ -6242 5200 6819 -3535 -6269 2005 5163 -144 -2696 -857 133 1569 2927 -1088 -5425 55
1186E5P278n849r770N036J1137l486j1300J669R930J67p325j378L842J681L2q07
$$ 55 7333 1484 -8286 -3250 7887 4401 -6899 -5230 4700 4867 -2458 -3836 6 1687 1719 912
1202I12l639r03O656L201q400n716Q961P757q073r065O239R154l965p907J518
$$ 912 -2727 -3630 3026 6227 -2173 -7889 1072 8829 756 -8309 -2070 7084 3119 -4788 -3270
1217c270N449L93k241j462j531J499N083o18p887j007R646K881j0075m481R224
$$ -3270 2179 2572 331 -1131 -2662 -1163 3920 3302 -4585 -5592 4054 6935 -3140 -7621 1603
1232A603N608p319n705M947M704k301k741M8M0J481L009k198n825K025P876j111
$$ 1603 7211 -108 -5813 -866 3838 1537 -1204 -1156 -1116 365 3374 1176 -4649 -2624 5252 4141
1248D141r168j47R347J089q241j940O484J970m215j288J783j6L92J880j963l845
$$ 4141 -5027 -5174 4173 5262 -2979 -4919 1565 3535 -680 -1968 -185 -201 191 2071 108 -3737
1264c737K943N566l062o679K661P152j935o803J267N697r26l990Q50J983j224
$$ -3737 -794 4772 1710 -4969 -2308 4844 2909 -3894 -2627 3070 2144 -1846 -996 987 -237
1279b37k15K139j562l120K649M026l229m719L367M848l110m492K758L633k453
$$ -237 -452 1687 125 -2995 -346 3680 451 -4268 -901 3947 837 -3655 -897 2736 283
1294B83k152K308O65k458R30K875k161l353K915L835l362l862L282L572l048k875
$$ 283 -1869 439 1104 -1354 -424 2451 290 -3063 -148 3687 325 -3537 -255 3317 269 -2606
1310b606K609J665k214l05K132j355k199K679K541l689l021M235L439m193l591
$$ -2606 3 1668 -546 -851 1281 -74 -2273 406 2947 -742 -3763 472 3911 -282 -3873
1325c873L711L340k850k490K004J200j095L61N72k091m97L755P90n039j371N585
$$ -3873 -162 3178 328 -2162 -158 1042 -53 308 880 -1211 -1708 2047 2837 -2202 -3573 2012
1341B012K033n499k735M874K874l652k603K123J677o20j67o47j597J351L557j487
$$ 2012 4045 -1454 -4189 685 3559 -93 -2696 -573 1104 484 317 -330 -1927 -576 2981 1494
1357A494n113J129O145l11o390o82N970J562m831k031L109J869j129j139q08j52
$$ 1494 -3619 -2490 3655 3344 -3046 -3728 2242 3804 -1027 -3058 51 1920 791 -348 -1156 -1308
1373a308K280J851l316l515L418M945k951n888K037O066p79n487l44M149J226
$$ -1308 972 2823 -493 -4008 -590 4355 1404 -4484 -2447 3619 2840 -2647 -2991 1158 2384
1388B384k262j425J37J127J854Nl536j254M394K704m635l883M032M600k873m824
$$ 2384 122 -1303 -1166 -39 1815 1820 -1716 -2970 1424 4128 -507 -4390 -358 4242 1369 -3455
1404c455J604M156m59k790o93J172J076Q44j074k641M72L956O06m812j469M804
$$ -3455 -1851 2305 1846 -944 -1637 -465 611 1455 381 -2260 -1788 2168 2774 -2038 -3507 1297
1420A297K500m234l026L162L111j845k553N90J444N56j08j146j508J282K861r89
$$ 1297 3797 -437 -3463 -301 2810 965 -1588 -998 446 1002 894 -252 -1760 -478 2383 1394
1436A394l904K93M410M00m267j110L607J481k564j598J497J028j20l48o77p24
$$ 1394 -2510 -2217 2193 2593 -1674 -2784 823 2304 -260 -1858 -361 667 547 199 -478 -1202
1452a202J280J860j369k788J194L352p43l402J71L077K79k420m57J434L01m57
$$ -1202 78 1938 569 -2219 -1025 2327 1584 -1818 -1647 1430 1709 -711 -1168 266 567 110
1468A10M1m70o49J083J313j409j990J485K421j236k539Q87K324m78j769K32J008
$$ 110 151 -319 -968 115 1428 19 -1971 -486 1935 699 -1840 -953 1371 893 -876 -644 364
1485C64p7j42K14o24n40J219J026j532j521J575J790j369j970J006J716n87j334
$$ 364 287 145 359 -265 -805 414 1440 -92 -1613 -38 1752 383 -1587 -581 1135 548 -786
1502g86K64O57p3Q2J34q09l91J396Q26j692j246J777J551j480j645J084J500n46
$$ -786 -522 135 62 144 278 -531 -922 474 1300 -392 -1638 139 1690 210 -1435 -351 1149 603
1520F03j141J29N46J56J79k27r56N2J568J91j903p37K040J031j763j382J392J356
$$ 603 -538 -409 137 293 472 245 -711 -659 909 1100 -803 -1540 500 1531 -232 -1614 -222 1134
1538A134p60j164J44P08L07N2o74o80O96J376m14j814K6K142L63j951q80J599
$$ 1134 374 -790 -646 62 369 421 -253 -933 -237 1139 725 -1089 -1063 1079 1442 -509 -1389 210
1556B10J124j034j137L74Q73J36l35p52k66R04R20q69j455N69J901j83j976l15
$$ 210 1334 300 -837 -463 410 546 211 -541 -807 97 1017 148 -1307 -738 1163 980 -996 -1311
1574a311J817O79j317q75P67R23j07o11m94J85Q80M28j115j004R59J457o35j752
$$ -1311 506 1185 -132 -1007 -240 683 576 -35 -529 -344 536 964 -151 -1155 -196 1261 626 -1126
1592a126J92J768K33j563n25R92P50m79p03j19M56O13K2r44m79R84J136r11j438
$$ -1126 -934 834 1067 -496 -1021 -29 721 242 -461 -580 -124 489 511 -433 -912 72 1208 297 -1141
1611a141O35J549j85j492j66J114M92o73o03J59M38L63k72p69j39R76N96r93j107
$$ -1141 -506 1043 858 -634 -800 314 806 133 -470 -311 127 490 218 -551 -690 286 882 -111 -1218
1630a218Q73J329n93j312K16J198J79r34l80N74M64J6l02m80O6P77L24r53p12
$$ -1218 -345 984 391 -921 -705 493 672 -262 -642 -68 396 412 110 -370 -304 473 797 -156 -868
1649h68R83R04q27j138O18J076k49j004rO58J61k81k30j59J05N91J56r33l28J005
$$ -868 115 1019 192 -946 -328 748 499 -505 -514 144 305 24 -206 -365 -260 331 487 -446 -774 231
1669B31O46r87p97Q81Q66n71q30M20O32k71l05O8j6j0K70Q3o21k26Q18L43r33
$$ 231 877 -110 -907 -26 840 269 -561 -141 491 220 -85 -17 -33 -43 227 310 -311 -537 281 624 -309
1690c09m89Q99N27q65m23P02L78o20q7L98j9l82L66L65n86k73P38K93q46k22Q64
$$ -309 -798 101 628 -237 -660 42 420 -200 -287 111 92 -290 76 441 -145 -418 320 613 -233 -455 409
1711D09J22q20k1O51j17n96K26N77m53n65O85M19p35m15P63K52o57j97O67L0n46
$$ 409 531 -289 -310 341 224 -372 -146 431 -22 -587 98 517 -218 -633 130 382 -275 -472 195 225 -321
1732c21J92N73m91l82P06L45q59m15J063L81j107l86J072K87q97l08P26R2m62
$$ -321 -129 444 -47 -429 277 622 -237 -652 411 792 -315 -701 371 658 -239 -547 179 271 -191
1751a91J30J35m30M2Q21j37j138J09J445j21j509K2J484J85j327j74J020R2m71
$$ -191 -61 74 -356 -314 507 370 -768 -659 786 665 -844 -822 662 847 -480 -654 366 458 -13
1770a3j7J13l11L13N94o03r77P45J335q19j568O71J647n32j499K38J246j32q29
$$ -13 -30 83 -228 85 679 76 -901 -156 1179 360 -1208 -537 1110 578 -921 -683 563 431 -398
1789c98N8L34j41K84K77q05n03J183Q97j372j146J402J340j224j367R82J256p11
$$ -398 -340 -6 -147 137 414 -391 -894 289 1186 -186 -1332 70 1410 186 -1181 -199 1057 346
1807C46j011M66M16k22R4J05o32k02J214K96j557n19J787O45j788p46J608P96
$$ 346 -665 -199 217 -5 89 194 -438 -640 574 870 -687 -1206 581 1226 -562 -1308 300 1096
1825A096j283n95Q63L69n08M7K65n99NR91j8j397J0J669k2j736n3J598J06j468
$$ 1096 -187 -782 81 450 -58 -11 254 -345 -340 651 633 -764 -754 915 893 -843 -896 702 808 -660
1845f60jJ151k33p33L51M71o81q0R01r1j178K71J399l34j473N07J335n54j149
$$ -660 -661 490 257 -476 -125 346 -335 -415 486 395 -783 -512 887 553 -920 -413 922 368 -781
1864g81O80Q80p95o68J014L27j205N1J160j44j318L12J258n29j096O79Q39p99
$$ -781 -101 779 -16 -684 330 657 -548 -497 663 519 -799 -487 771 242 -854 -175 664 -135
1882a35n88R77K26j084QJ361k20j541M84J581n64j538N89J413n61j059N31O69
$$ -135 -723 254 480 -604 -596 765 545 -996 -512 1069 505 -1033 -444 969 408 -651 -120 549
1900E49n93k06O77l03r12P62J131j117j402J286J581j339j608J097J649j002j296
$$ 549 -44 -250 427 124 -788 -26 1105 -12 -1414 -128 1453 114 -1494 -397 1252 250 -1046
1917a046P19Q88m61k18L72m97l35J183M55j693p10K089R65k225j217K123J294
$$ -1046 -327 561 100 -118 254 -243 -578 605 1060 -633 -1343 746 1711 -514 -1731 392 1686
1934A686j766j320J267R64o65m54J13j97J76J002l68j687L05K326n4k637k30K670
$$ 1686 -80 -1400 -133 831 166 -288 -175 -372 -196 806 438 -1249 -944 1382 1328 -1309 -1539 1131
1952A131N94k490p06J875P49j188n22M33J56J70M67p73j153J069J881j176k444
$$ 1131 1725 -765 -1471 404 1153 -35 -557 -124 32 202 669 -104 -1257 -188 1693 517 -1927
1969a927J082K609o27k739K58K453%j743k36J001J13J9P5p69n78J512J084j835
$$ -1927 -845 1764 1137 -1602 -1344 1109 1109 -634 -870 131 244 263 338 -431 -1009 503 1587 -248
1987b48j706K028K072j778k268J422K160r97j755N20J115l00l28L7m81j32J309
$$ -248 -1954 74 2146 368 -1900 -478 1682 685 -1070 -550 565 265 -63 -26 -507 -639 670
2004F70L40j924o94K273J048k338j287K168J431j810j205J331Q77q46k91M69m14
$$ 670 1010 -914 -1608 665 1713 -625 -1912 256 1687 -123 -1328 3 880 34 -257 212 -202
2021b02j64J084P8j729o9K086K52k398l30K288L54j999k77J520P6j072K30O52
$$ -202 -366 718 796 -933 -1002 1084 1336 -1062 -1392 896 1250 -749 -1026 494 570 -502 -272 380
2039C80p44k47J248m7j574K09J874j66k052K81J891k76j633M11J260o06p86Q64
$$ 380 -364 -611 637 590 -984 -775 1099 933 -1119 -838 1053 777 -856 -445 815 209 -577 287
2057B87L68j274K6J513k53j819M45J910n19j882N09J634m62j320O88O58p78j25
$$ 287 655 -619 -593 920 667 -1152 -707 1203 684 -1198 -689 945 483 -837 -149 509 -269 -394
2075c94J037k87j368P05J658q90j977J025K072r57j994Q00J675o45j097N09L64
$$ -394 643 356 -1012 -307 1351 461 -1516 -491 1581 624 -1370 -570 1105 460 -637 -128 236
2092B36m95L55O45j051r99J610J323j872j708J984J934j784j946J325J822r20
$$ 236 -259 96 741 -310 -1309 301 1624 -248 -1956 28 1962 178 -1768 -443 1379 459
2108D59j252N03N14k23M21J04j333j29K034M55k536q44K739J194k687j459K171
$$ 459 -793 -290 224 1 422 526 -807 -936 1098 1553 -983 -1827 912 2106 -581 -2040 131
2125A31J572j627j319Q63P86j32j0m15q96P37J780o88k544M73L059Ol198m74K931
$$ 131 1703 76 -1243 -380 406 274 264 -151 -1047 -310 1470 782 -1762 -1289 1770 1776 -1422 -1896 1035
2144A035Q75k322r90J455Q24m96l41m49l79J166J114j476k057J625K656j428l027
$$ 1035 1910 -412 -1402 53 877 381 40 -409 -788 378 1492 16 -2041 -416 2240 812 -2215
2161b215R14L077m27k732j3K053L86j067l87PN2J041L60j709j010K200J670k309
$$ -2215 -1301 1776 1349 -1383 -1396 657 1043 -24 -411 -404 -352 689 1049 -660 -1670 530 2200 -109
2179a09k186J999K519j575k463J004K050m74j359J09L47N4O57l4j545k57K223
$$ -109 -2295 -296 2223 648 -1815 -811 1239 765 -594 -485 -138 -84 573 539 -1006 -1263 960
2196I60P26k579j162K606J537k310j597J758J433j147j010O96K82k05N23r3j343
$$ 960 1686 -893 -2055 551 2088 -222 -1819 -61 1372 225 -785 -89 193 -12 511 418 -925
2213i25J18K006o1k397k36K635M18k443o09K052N82j551l44Q90J6m32O87j38j135
$$ -925 -807 1199 1138 -1259 -1495 1140 1558 -885 -1494 558 1140 -411 -755 135 151 -281 406 268 -867
2232h67L07J799m62k116L61K304j54k199J1J922n0j362J39P54n22j16Q36l00j371
$$ -867 -560 1239 777 -1339 -978 1326 1172 -1027 -1016 906 856 -506 -367 387 -135 -251 585 285 -1086
2251a086N62J796p17k035O34K097n08j901M09J539l60r49M20K97o08L59R71q82
$$ -1086 -524 1272 555 -1480 -846 1251 743 -1158 -749 790 430 -519 -99 198 -410 -51 920 38
2269C8j332J197J795j324k030J213K049r60j887O19J403m07o90L16j15l53Q30
$$ 38 -1294 -97 1698 374 -1656 -443 1606 646 -1241 -622 781 374 -316 0 -115 -468 362
2286C62N80j439r00J853J354k043j773J951J890j495j827R64J540n34q00P8j7
$$ 362 942 -497 -1397 456 1810 -233 -2006 -55 1835 340 -1487 -523 1017 483 -317 -239 -256
2303b56J44R35j41j724j39K302N98k693j015K634J399k322j521J635J411q78r90
$$ -256 -112 823 682 -1042 -1181 1121 1719 -974 -1989 645 2044 -278 -1799 -164 1247 369 -621
2320f21J68K20N00N94q12j465Q17K282n70k795J72L020L49k850p42K231J063j525
$$ -621 -453 -233 267 861 49 -1416 -599 1683 1113 -1682 -1510 1510 1859 -991 -1733 498 1561 36
2338C6r74N54N57L59M6j030r05J459J671j496k428J308K808p60k943K89K591K53
$$ 36 -938 -384 173 532 578 -452 -1357 102 1773 277 -2151 -843 1965 1205 -1738 -1449 1142 1395
2356A395j958m27R49O09j4l76q42j78J566R10j998j623K085K136j896k397J304
$$ 1395 -563 -990 -41 568 554 178 -664 -842 724 1634 -364 -1987 98 2234 338 -2059 -755
2373g55K352o99j984K14J222K02m01l68n36K57J417J24j966p35K415J109k287
$$ -755 1597 898 -1086 -872 350 552 151 -217 -753 -496 921 1045 -921 -1656 759 1868 -419
2390d19j512K024J665j479j548Q52J215k91n01j64l51L35J140l09j720j06K246
$$ -419 -1931 93 1758 279 -1269 -417 798 507 6 -158 -509 -174 966 657 -1063 -1169 1077
2407A077L93k395o54K048R77j732r14J146P19n01l19lk79L11R90m56j557M89J925
$$ 1077 1470 -925 -1579 469 1446 -286 -1200 -54 665 164 -155 -158 -437 -126 864 408 -1149 -660 1265
2426A265j84k223j3K075K61j703m44J216L00n91k9k6l72M29R62q13j419Q13J872
$$ 1265 1081 -1142 -1155 920 1181 -522 -966 250 550 -41 -70 -96 -468 -39 923 110 -1309 -496 1376
2445A376o95j990M60J905j39j611j0J017J18m42R4k51l22P21Q05j075j309J239
$$ 1376 681 -1309 -849 1056 917 -694 -704 313 431 -11 83 -168 -490 231 1036 -39 -1348 -109
2463a09J640j145j855P99J817m71j437N9R44J08k90q4m46j06J145M04j520r06
$$ -109 1531 386 -1469 -670 1147 676 -761 -702 242 350 60 -24 -470 -576 569 973 -547 -1453
2481a453J757J392j755j592J389J650q37j488L68J117n2l72k95m23L21J192j50
$$ -1453 304 1696 -59 -1651 -262 1388 551 -937 -569 548 496 124 -171 -594 -273 919 769
2498G69j765l25K186O81k125j119J795J407j370j401P65J136j23n53m12j06O89
$$ 769 -996 -1321 865 1546 -579 -1698 97 1504 134 -1267 -502 634 511 -42 -454 -560 129
2515A29R17p43j662O05K102o8k391l48K263Q13j918j027J167J091m34q06l07K88
$$ 129 1046 303 -1359 -754 1348 1280 -1111 -1459 804 1617 -301 -1328 -161 930 496 -310 -617 -329
2533c29Q13M08j135j212J243J770r18k192N32K357j12k090m34J681O59q16q08
$$ -329 484 892 -243 -1455 -212 1558 640 -1552 -1020 1337 1225 -865 -1299 382 1041 225 -583
2550e83P9M91P23n4j255n73J563J219j615j729J251K024p69k006K00J759J74j072
$$ -583 -504 -13 710 656 -599 -1172 391 1610 -5 -1734 -483 1541 772 -1234 -1034 725 899 -173
2568a73n58M10N69L91l72j083n7J559O47j827j074J707J450j366j564Q59J468
$$ -173 -731 -321 248 639 267 -816 -873 686 1333 -494 -1568 139 1589 223 -1341 -482 986
2585I86l05j169j22N61M01J03m73q04L18J397j8j711m48J874P36j589j064J234
$$ 986 681 -488 -610 -49 352 455 -18 -822 -504 893 875 -836 -1284 590 1326 -263 -1327 -93
2603i3J072o84r53K75N03K08O8m81o25M79J253l62j596O4J673L59j670n57J271
$$ -93 979 295 -658 -383 120 328 396 -85 -710 -231 1022 660 -936 -872 801 1160 -510 -1067 204
2622B04P52q74o82L19L58K19j5n02n77P59R99o41j435M25J665j01j597k14J394
$$ 204 956 82 -600 -281 77 296 281 -221 -798 -39 960 319 -1116 -691 974 873 -724 -938 456
2641D56M10r49m38L86L20J51ln94m07Q61Q66r73j221P65J445n04j515J77J334
$$ 456 866 -83 -521 -135 185 336 333 -261 -668 193 1059 86 -1135 -370 1075 571 -944 -767 567
2660E67J11q49m22M05L79K14k10p22j51J053O21j167j010J131J241p70j513N29
$$ 567 678 -171 -593 -188 191 405 195 -527 -678 375 996 -171 -1181 -50 1191 421 -1092 -563
2678e63J312l6j045k54N03M10J15m00p30J99J097J75j357n95J446R48j232j218
$$ -563 749 713 -332 -586 -83 327 442 42 -688 -489 608 783 -574 -1169 277 1225 -7 -1225
2696a225R20J225l93j075l5O44M10j31m89n20N13J063k87j459q0J670M10j563
$$ -1225 -305 920 527 -548 -583 61 471 340 -149 -669 -156 907 620 -839 -919 751 1161 -402
2714d02p74J220J028p82j025J99P89K48l42n74k72P98P54o87j294M70J605l1j650
$$ -402 -1176 44 1072 290 -735 -536 253 501 159 -415 -687 111 865 178 -1116 -646 959 928 -722
2733g22l39J499O92j149q13N63P37R1n24n57J22Q80L60r63r81Q96J334o61j502
$$ -722 -1061 438 1130 -19 -832 -269 468 559 35 -522 -400 480 840 -123 -1104 -208 1126 465 -1037
2752a037J23J608J86j266n02Q49O46l08n81k06K72P69J29j124m66J098R60r87
$$ -1037 -914 694 880 -386 -888 -39 607 299 -282 -488 -216 553 682 -442 -908 190 1150 163
2770A63j240O83J365l04j306n5R52L38m20n07j28M44N58j99r60j74J219M65j034
$$ 163 -1077 -394 971 667 -639 -694 258 596 176 -331 -459 -15 543 344 -616 -790 429 894 -140
2789a40r45J054J038o45j114K57Q79R2n08l15O9M20M00l48q19J50J044J68j153
$$ -140 -1085 -31 1007 362 -752 -495 384 476 -32 -347 -278 142 542 194 -625 -475 569 737 -416
2808d16n06J078P77q83q14M84P31j31m90k17J59L99L13m54p51M39R33r3j172j53
$$ -416 -922 156 933 50 -764 -280 451 320 -170 -387 -228 171 484 30 -721 -282 651 558 -614 -767
2828g67J175M38r43n98O05N96k17m98q0J45M65J41n81n41N38R08m54j094J70J078
$$ -767 408 846 -97 -695 -90 506 289 -209 -289 -144 321 462 -119 -660 -122 786 332 -762 -592 486
2848D86J40r77l35P13M53k38n18j02L69K95J28o82k96O58P15o11r64L83J060j39
$$ 486 626 -351 -686 27 480 242 -276 -378 -9 286 414 -268 -564 94 809 198 -766 -383 677 538
2868E38r32j36O78L64m05l90m9K95M53j18p75j44P93N92q46q56P42R58m28j000
$$ 538 -394 -530 148 512 107 -283 -332 -37 416 298 -477 -621 172 764 -82 -938 -196 762 334 -666
2888f66J33Q47K15n09m17J56M15K58k48o87L8R34J92r80n01Q96P65o44r67L78
$$ -666 -533 314 529 20 -397 -241 174 432 184 -503 -465 469 661 -319 -820 76 841 197 -770 -392
2908c92Q38K4n82l09J75N26J67m77n31L02Q56o3j062k11J035N38q93o97N86P85
$$ -392 446 470 -112 -421 -246 280 447 -30 -561 -259 597 534 -528 -739 296 834 -59 -756 -170 615
2928F15k40o43j27L83L50J6n88l38N60O86m23r97J82J059J69r75m28P37N62l66
$$ 615 375 -268 -395 -12 338 354 -234 -572 -12 674 251 -746 -564 495 664 -311 -739 -2 560 194
2948A94o05R1M11K90j86m66j90O74N12o78o81L83R17j31r95j00Q41K96n86m69
$$ 194 -411 -320 91 381 195 -271 -461 213 725 47 -634 -251 666 535 -460 -560 281 577 -9 -478
2968d78K19M82J02l36m20J17O01K28o73n98O19Q08l58r58K39P91J17o20k58K69
$$ -478 -259 223 325 -11 -431 -314 287 515 -158 -756 -137 671 313 -645 -406 385 502 -118 -376 -107
2988a07L75N8k69l81J04N63J94q10l11O33N68n26o86K84P51p5o32j25L80K73l5
$$ -107 268 326 57 -324 -220 343 537 -273 -584 49 617 91 -595 -311 440 365 -267 -392 -12 261 226
3009B26l84j66K55M68r2o29j95P58L29o70m75M82O09k69n15m8M13J92j36k56k08
$$ 226 -158 -324 -69 399 307 -322 -517 241 570 -100 -575 -93 516 247 -268 -316 97 289 153 -103 -311
3030c11K66N18k36p37L8Q19J20o53m12O45M11l38m81J25L58J18j51l01q5M09L72
$$ -311 -45 473 237 -500 -462 357 477 -176 -588 57 468 130 -351 -226 132 250 99 -202 -287 122 494
3051D94l79n75K15P26m6p38k23O79L57n13l80J58M02J12k99l19K5N13J81m55n14
$$ 494 115 -460 -245 481 435 -303 -526 153 510 -3 -383 -225 177 289 -10 -329 -304 209 390 -65 -579
3072e79M64O24k24p17P5O43J53n01l38L29L69l4k85k86J68N13J0n96l18N51N18
$$ -579 -115 509 285 -432 -357 286 439 -62 -400 -71 298 264 -21 -307 -139 374 384 -212 -530 21 539
3093E39m23o30J96P07l0o30k00M41L01o0l87j92K44M78n2n97j75O93L10n37n17
$$ 539 116 -514 -318 389 359 -271 -471 -30 271 211 -176 -368 -124 354 302 -295 -470 223 533 -4 -521
3114e21M35O00k10n65p0M11K43j80l71o9L13M09k51n74N2O42J43o40l44N35M68
$$ -521 -86 514 304 -261 -331 80 323 143 -228 -297 16 425 174 -400 -348 294 437 -203 -547 -12 456
3135D56k86n37O3M58J25j90l79N0M04K15l85m32K68N60p2o48r2N50L58m79l75
$$ 456 170 -367 -304 154 279 89 -290 -240 164 379 -6 -438 -170 390 318 -330 -422 128 486 7 -368
3156c68K30L30K8k93j91R9L74J27m43l46L87N19k65n60N5N52J76m98j98J99M09
$$ -368 -138 192 220 -73 -264 -165 209 336 -107 -453 -66 453 188 -372 -317 235 411 -87 -285 -86 323
3177C23j12k82j98K43L04l7m37j95M39L32l23m97J51N62L4m80j89M23J86j00l40
$$ 323 211 -71 -269 -26 278 241 -196 -391 48 380 57 -440 -289 273 307 -173 -362 61 247 147 -193
3198a93m7K66K29o8m39KL86K66l87m49L43M93j73m44p8M04J78k26k44n3K66K28
$$ -193 -240 26 255 187 -252 -250 136 402 15 -434 -91 402 229 -215 -293 111 289 63 -181 -234 32 260
3220B60j29m25oN34O5m52k35M07L68k46m44Q9L61J26k43k70Q3K44K34l87k36J52
$$ 260 131 -294 -300 234 299 -153 -388 19 387 141 -303 -214 147 273 30 -240 -157 87 321 -66 -302 -150
3242a50M23L5n42j70M73L42m21l46J75L81J2k84k23J20L62O3l54k62K65M85k22
$$ -150 273 308 -234 -404 69 411 -10 -356 -181 200 212 -72 -295 -175 187 250 -104 -366 -101 384 162
3263A62m86k3N67J18l86l20L51K92p8k57j20J55K93o2m01j69M20L50l22m45J61
$$ 162 -324 -347 220 338 -48 -368 -17 275 197 -60 -180 -25 268 206 -195 -364 56 406 84 -361 -200
3284b00M79J6n22j18L07K66j18k95n2K23K89j16l47q7M42K04l73l19K29M28r3
$$ -200 279 295 -227 -345 -38 228 110 -185 -237 -14 275 159 -188 -275 167 371 -2 -321 -92 336 243
3305B43m51m2L16K46k71k88K6L27J15k71k67L8M60Q2l69k97M00L38k31l57J2M03
$$ 243 -208 -250 66 312 41 -247 -221 106 221 -50 -317 -279 181 263 -106 -403 -3 335 104 -253 -241 162
3327A62Q4k56k33J13L11M0k38k48J98L09m4l92r9L80K56l29l03K45K26qk70k11
$$ 162 246 -10 -243 -130 181 221 -17 -265 -67 242 198 -194 -293 87 343 14 -289 -44 182 174 -96 -307
3349c07K29K86j1l41j59L06L21k19l65J8L95J47l32k69K64K95r9k79q2K25K26
$$ -307 -78 208 197 -144 -303 3 324 105 -260 -242 153 300 -32 -301 -37 258 159 -120 -202 23 249
3370B49r9l88K8K80J72k32l52J87L86J1m20j48L02K86j58l00L7K41J46j83k39
$$ 249 150 -238 -210 70 242 10 -342 -155 231 242 -178 -326 -24 262 104 -196 -159 82 228 45 -194
3391a94nL43J58l42k58L02L18j29m31l7L27K01k00k69N6K29J75l19k33J95L17
$$ -194 -199 144 302 -40 -298 4 322 193 -238 -275 52 253 53 -216 -160 69 244 -75 -308 -113 204
3412B04ll37j31K93K44j76l27N9L18R0k54j93J46K72J6k85j73K05K54m2m14J8
$$ 204 201 -136 -267 26 270 94 -233 -174 144 234 -20 -213 -67 205 221 -64 -237 -32 222 180 -234 -216
3434b16L44R3k33k56J39L15k2k58j07J76J61m6k33r9K35K40j57k97N3L81K6l41
$$ -216 128 221 -12 -268 -129 186 164 -94 -201 -25 136 90 -143 -242 -7 233 76 -221 -168 213 239 -102
3456a02j56K09L14j25k91n0K43J46j37k28JL08J56k66k50Q7L11l3k96q8K92J40
$$ -102 -258 -49 265 140 -151 -201 42 188 51 -177 -176 132 288 22 -228 -141 170 137 -159 -247 45 185
3478A85j29k38L2K56J42k34k08P7L04k4j98j58K30J78r1k76n1L37J8j15k24O5
$$ 185 56 -182 -150 106 248 14 -194 -117 187 163 -35 -193 37 215 124 -152 -203 134 152 37 -187 -122
3500a22K36J07l33r8R2K96m4k51o9K23J79j88k32P8K44P7k40j29J21K36m0k40
$$ -122 114 221 -112 -210 -118 178 134 -117 -186 37 216 28 -204 -126 118 195 -45 -174 -53 183 143 -97
3522i7r4J98K15j46k67j7K61J21k28j83J87K58r0j85j07J78J57r9k32K6K45Q7
$$ -97 -191 7 222 76 -191 -208 53 174 -54 -237 -50 208 118 -67 -174 4 161 62 -170 -144 101 188
3544A88j86k02J20K92k0k56j30K31J95j28k13k0J92J11r2k43M3J75J19k53j34
$$ 188 2 -200 -80 212 192 -64 -194 37 232 104 -109 -129 63 174 82 -161 -118 57 176 -77 -211
3565b11J61K25q9k32m7K49J13j21k41L5K70J00k17j87J34K03M8k23j45K39J45
$$ -211 -50 175 86 -146 -193 56 169 48 -193 -158 112 212 -5 -192 -58 145 193 -30 -175 64 209
3586B09j33k71O5J98J50k68j31J25J47L3k53q7K29J07n5k22QK31O2j55j72M2K73
$$ 209 76 -195 -130 68 218 -50 -181 -56 91 124 -129 -216 13 120 65 -157 -149 82 144 -11 -183 -141 132
3609A32J8k03p7J35J79j07j48q1K03J33j31j86K8K33J6k32p8J33J78n9k39j5J29
$$ 132 150 -53 -130 5 184 77 -71 -152 51 184 53 -133 -105 128 144 -88 -166 -33 145 86 -153 -168 -39
3632c9K02j26k03N5K01O9j95j03Q5J91k5k07q2K08J15n5j97n5K04J01j24j70M2
$$ -39 163 37 -166 -111 90 159 -36 -139 -54 137 112 -95 -177 31 146 91 -106 -161 43 144 20 -150 -108
3655a08J78L3j47j88K52J72j07k20M0J27J29j59j32Q0J50M9p3j92J06J53j4k11
$$ -108 70 103 -44 -232 20 192 85 -135 -95 32 161 2 -130 -50 100 149 76 -116 -10 143 129 -82
3677h2n6K03P1j08j83Q2J92l1j05j36R9J65o8q9q4J16J14m0k19P4J74L6j31j08
$$ -82 -138 65 136 28 -155 -73 119 88 -17 -153 -54 111 43 -46 -130 -14 100 60 -159 -85 89 125 -6 -114
3701a14Q2J30j6j30o3J84N4r8j12J9J37L3j01j59R3J76m6r0p8J24N6n9j16k0J25
$$ -114 -32 98 82 -48 -111 73 127 29 -83 -64 73 106 5 -154 -61 115 69 -21 -99 25 81 22 -94 -114 11
3726A1J06j07j19K8J71J02j93j05J11J37k8j83k4J37L4j02q5O2J29qr6j18J18
$$ 11 117 10 -109 -81 90 192 -1 -106 5 142 114 -69 -93 44 78 -24 -109 -47 82 74 -22 -140 -22
3749b2J05oj91o2J85O5m3j20P3O9R1j87l8K8J71q3o6o2J23J09j31j17P3R7P8j34
$$ -22 83 77 -114 -176 9 74 31 -89 -16 53 144 -43 -81 -53 118 35 -31 -93 30 139 8 -109 -36 61 139 5
3775Eo1RJ04qq2j2nJ03k7j19LJ20J3m3j51P3J25j0j21mQ1J28n1j25o3J99L7o4
$$ 5 -56 -47 57 49 -33 -45 -50 53 26 -93 -90 30 43 0 -151 -78 47 37 -84 -88 -7 121 70 -55 -118 81 118 54
3803E4j31M7P6N8j33m0R7J1M9j83J0O8M7k9j45P6J02J1j00KL0J21m0q3j0N7M5
$$ 54 -77 -30 46 104 -29 -69 28 39 88 -95 -85 -17 30 1 -144 -68 34 45 -55 -53 -23 98 58 -25 -35 22 67
3830F7l9j02K6J32r8n1K4M0N5Nr0k4N5Q7r3j29O7J14P2k11L0j2J39j1r5K5K0J04
$$ 67 28 -74 -48 84 -14 -65 -41 -1 54 59 -31 -55 0 87 -6 -135 -68 46 118 -93 -63 -75 64 53 -42 -17 3 107
3858A07j21m4J5P9Q7n7j11N8N6K4j27j9Q9L7k7j17l5J59Qj03k7O1k0P1n1o0K8
$$ 107 -14 -58 -43 36 123 66 -45 13 69 93 -34 -53 36 73 46 -71 -106 53 61 -42 -69 -8 -28 43 -8 -68 -40
3885d0R4m3j4MN7J2o4n5Q1L0m1o2l7L8R6rn8m0O8L2p7l6lQ1l8k1l1P0M4no0n2
$$ -40 54 11 -3 1 58 70 6 -49 32 62 21 -41 -78 -40 56 47 -11 -51 17 49 -28 -64 -67 14 -24 -45 -76 -6 38 33 -27 -79
3917g9J67k5o2n7L1J03j4r2m1R8Q9j15pp0J17M2o5o2j1J04m0Nq2RP5k6p1J0L3
$$ -79 88 63 1 -56 -25 78 64 -28 -69 29 118 3 -4 -74 43 85 20 -42 -53 51 11 16 -66 -57 18 -8 -79 -69 -36
3946c6O7o1j8N5J6J2l0n0M9k8Q1r3J8P8J1q2O8o6K5%jo5J6O7j7m4nK3M5J1q5J8
$$ -36 31 -30 -48 7 23 35 5 -45 4 -24 57 -36 -18 60 71 -11 57 -9 16 16 15 -50 -34 33 16 -28 -33 -10 35 46 -39 -21
3978b1N1J6p8j4N0kL8l3j1M4%m8n2M9N9k1L7r1NOL9p4n5J21P3r1j7J7M4n9K7l9
$$ -21 30 46 -32 -46 4 2 40 7 -4 40 40 -8 -60 -11 48 27 64 -27 -22 -16 23 -51 -106 15 88 -3 -20 -3 41 -18 9 -30
4010c0K1O8n9nj6M4L6l6L4n8N8l6l9K0J3L9p1m9K8J3jJ3n4LJ04l8l2K7l6P2No2
$$ -30 -9 59 0 -5 -21 23 59 23 57 -1 57 21 -18 2 15 54 -17 -66 -38 -25 -26 -13 -67 -64 40 2 -30 -3 -39 33 38 -24
4042b4l1M4M6M3p5j3P2j9j6lJK6k3q1L5L2J10j15p5K5Q7ml2n5k1Q4k0k2m3J31
$$ -24 -55 -11 35 78 3 -10 62 43 27 24 25 51 28 -53 -18 14 124 9 -66 -41 46 42 10 -45 -66 18 -2 -24 -67 64
4072F4l1k2p9O0L1L0n1m5N8J9jo2qQ0Ln1n0K5O6k2l1ML1L8k2o7l2Q4Rn5m7K0Q1
$$ 64 33 11 -68 -8 23 53 2 -43 15 34 33 -29 -37 43 46 -5 -55 -30 36 14 -17 -13 18 56 34 -33 -65 19 28 -27 -74 -54 27
4105B7OQr0K9M3J4m7r6J33L7k6k9m9R4N9j12j5L6M0j7j37R2l7O2p2L5j2k4M8j
$$ 27 33 41 -49 -20 23 37 -10 -106 27 64 38 9 -40 54 113 1 -14 22 62 45 -92 0 -37 25 -47 -12 -24 -48 0 -1
4135ao5J2J56l6p0J6N5J1m7p7K5O6No9ok4J52r0n6K8K0Q6r9o0mO9N9q2n2O2L9
$$ -1 -66 -54 102 66 -4 12 67 78 31 -46 -21 45 50 -19 -25 -49 103 13 -43 -15 5 91 -8 -68 -72 -3 56 -26 -78 -16 23
4166B3J6j14K6Q2M1o2r4M8Q0N4p3n9k0R6k4k8j9N8j9J2l7q9J33J4o4n5N2M0%l8
$$ 23 39 -75 -49 33 74 12 -82 -34 46 100 27 -32 -52 44 20 -8 -27 31 12 24 -13 -102 31 45 -19 -74 -22 18 18 -20
4196b0o9Q3R0n0r1j5J42Lr7l6O0N3pq7l5J10k0op1k7M5P8l9j07L9R6Jq3j1K8J44
$$ -20 -89 -6 84 34 -57 -72 70 73 -24 -60 0 53 46 -41 -76 34 14 8 -63 -90 -45 33 -6 -113 -74 22 23 -60 -71 -43 101
4227A01n2n9q3Q0Q5oj32O6Q8m0m1o1N6P8n5n6j3Q1J9r9k4nJ02J4l3j18Q0O1%p2
$$ 101 49 -10 -93 -13 72 66 -66 0 88 48 7 -54 2 80 25 -31 -44 37 56 -43 -67 -72 30 44 11 -107 -27 34 34 -38
4257c8n0R0M9l8n4k8R6R3j19m2N1M2qq0pN7M3k7o2m1R4M9q3r9Q1K1J01j29r4J03
$$ -38 -88 2 51 13 -41 -69 27 120 1 -41 10 52 44 -36 -43 14 57 30 -32 -73 21 70 -13 -112 -31 -10 91 -38 -132 -29
4287b9Q1j4r4LN6J7J1q9j4J15M8n9p9J9Q7Lr3L7K5Q3j01q1J7J13k9n7l9O7N4j4
$$ -29 52 38 -56 -53 3 20 31 -58 -72 43 91 32 -47 -28 59 62 -31 6 31 114 13 -68 -51 62 33 -24 -63 4 58 44
4317D4j47L7J29j3k3n1l8J06k2q4L3j3J00j2m3j03J25N0r3l7L3N2Po8l1L6N9J2
$$ 44 -103 -66 63 50 27 -24 -62 44 22 -62 -29 -42 58 46 3 -100 25 75 -18 -55 -22 30 37 -31 -62 -26 33 45
4345D5q4m4P4Q1r3o5Q1J00k7o1r8K4J53m4o7p6R4J13o1q2L2K1J7l6n5J1J12k3
$$ 45 -39 -83 -9 72 -21 -86 -5 95 68 7 -91 -67 86 42 -25 -101 -7 106 45 -37 -5 16 33 -3 -58 -47 65 42
4373D2j16J3N2Q9n1r1J0R8L9k1j51J01M4K6j04l8RJ51n5p5k3R6N2n7p4k7J73p4
$$ 42 -74 -61 -9 80 29 -62 -52 46 85 64 -87 14 58 84 -20 -58 -49 102 47 -28 -51 45 97 40 -34 -61 112 38
4401C8o0RJ7L4Pj29k3J25R6j48J0QL8Q7j70n4J00J8J6k9j2O1J6kj06jP6M8l6o3
$$ 38 -22 -13 4 38 45 -84 -107 18 114 -34 -24 -16 22 109 -61 -115 -15 3 19 -10 -22 39 55 53 -53 -54 22 70 34 -29
4431b9k9J13Qj08m1R5R8o8r6J0Q1K0q5l3PR8Lo5r7J12L5L4q4p1J43N1j23l1K0
$$ -29 -58 55 63 -45 -86 9 107 39 -57 -47 34 54 -31 -64 -57 41 44 -21 -118 -6 29 63 -21 -92 51 102 -21 -52 -32
4460c2M7M6o1j01M7J19r4Ro8J12Ql7j10R3O3K2l7j37P2Q5K6p2j8m4J62l7j14j3
$$ -32 15 61 0 -101 -54 65 -29 -20 -88 24 32 -5 -115 -22 41 63 26 -111 -39 46 72 0 -18 -62 100 63 -51 -64
4488f4J01L3r3j6K1P5Oj02o7Q2M6L5j23k1Q6Q4j11j29J08J02L0j28l2N5N6Mj05
$$ -64 37 70 -23 -39 -18 57 63 -39 -106 -24 22 57 -66 -87 -1 83 -28 -157 -49 53 83 -45 -77 -22 34 38 -67
4515f7%J21L5n3j02K2P3M3o3q3R1O9k1q3k5N6M7p0n9M4N3J0o0q7O0J13j8o0lM7
$$ -67 -67 54 89 36 -66 -44 29 72 9 -74 17 86 65 -18 -43 13 60 -10 -69 -25 28 38 -22 -109 -49 64 46 -14 -17 30
4545C0O0j38%lP2L8Lj10K0Q3m1l4l7K7P7j9q4nJ04N1j11n4Q9N6l2p7J9LO6qq6
$$ 30 90 -48 -48 -51 21 59 62 -48 -28 55 14 -20 -57 -30 47 28 -56 -61 43 94 -17 -71 18 74 42 -35 -16 -13 53 45 -41
4576d1NQ8K1p1l2RJ26l6m9j07J12M7r6k9kP0N3q3k4j4J07L5j18o5J06R0q8o9N7
$$ -41 -36 52 73 2 -30 -21 105 69 20 -87 25 72 -24 -53 -55 15 68 -15 -39 -53 54 89 -29 -94 12 102 14 -55 2
4605BM6K5p5q1N6M3R2j20j0K5L6K1r0m2N4J39r6j05K4P6M2nj16j6Q3L2k1m8kJ20
$$ 2 48 73 -2 -83 -27 16 108 -12 -22 3 39 60 -30 -72 -18 121 25 -80 -56 20 62 57 -59 -75 8 40 19 -29 -31 89
4635H9r1k8l2J08M9j34j1N8P8Pj30K5j0J10Oj37j4L8J3k0nn5R2M9m0j13J00P3
$$ 89 -2 -30 -62 46 95 -39 -50 8 86 93 -37 -12 -22 88 94 -43 -57 -19 -6 -26 -31 -86 6 55 15 -98 2 75
4663G5k9j21k0J09L6n6n9L2O1O3n1j08R3L6k9j9j19R0Q1j5o0m0J20m2l7%o4Q1
$$ 75 46 -75 -95 14 50 -6 -65 -33 28 91 40 -68 25 61 32 13 -106 -16 65 50 -10 -50 70 28 -9 -9 -73 8
4691HK8q7J5K8P4m3r2nJ09J9k9r7M9N2J2o2j2rJ21m8j03oP5N9m8n9pJ25rq8k8
$$ 8 36 -51 -36 -8 66 23 -69 -74 35 54 25 -72 -23 29 41 -21 -33 -42 79 31 -72 -78 -3 56 8 -51 -58 67 58 -30 -58
4722e8O8J03j23o7j4J22N5o4r4K1Q3L6p0p8J05O1k6n7o6Q0Lk0p7K0J28Kp4r8O3
$$ -58 10 113 -10 -77 -91 31 86 22 -72 -51 32 68 -2 -80 25 86 60 3 -63 17 20 0 -77 -57 71 73 -1 -99 -36
4751c6PO9o3o2N7P2k2q1L4O5j2l7m8N1Q3Or2l5N6L4k1n1m1K4P2o7lP8K4k8q2l0
$$ -36 -29 40 -23 -85 -28 44 22 -59 -25 40 28 -9 -57 -6 77 83 -9 -44 12 46 25 -26 -67 -43 29 -38 -41 37 61 33 -49 -79
4783g9O1M8n0Pl5O9L3n4l8L4N0J0o7ml3J22l0j12K3L7Pql9L1P2J6m6p0M1J9K0
$$ -79 -18 30 -20 -13 -48 21 54 0 -38 -4 46 56 -11 -15 -48 74 44 -68 -45 -8 -1 -9 -48 -17 55 71 25 -45 -4 15 35
4814C5p2RQ8j2o3l5nQ8NK0j62Q7O9J6m0l8K0N3n2qL0l3N1m1o0O7KL8k1j32Q3K5
$$ 35 -37 -28 60 48 -15 -50 -55 33 38 58 -104 -17 52 68 28 -10 10 63 11 3 33 0 51 10 -50 17 19 57 36 -96 -13 12
4846A2Jl2o3J26k6l8l1P9M9Ml7j12R4k3O4q5k1QJ05m3j25M2J51n1r9J1J2N7o2
$$ 12 13 -19 -82 44 18 -20 -51 28 77 81 44 -68 26 3 67 -18 -39 -31 74 31 -94 -52 99 48 -51 -40 -28 29 -33
4875c3J4NK8M7o9n9M3R5Mn6j18M9J27%j25M1L4O7l6o9K1L0J2m7p1L7O9rr6nQ5
$$ -33 -19 -14 14 61 -8 -67 -24 71 75 19 -99 -50 77 77 -48 -7 27 94 58 -11 10 40 52 5 -66 -29 40 31 -65 -70 15
4906A5N2m6o2jN4L5n1Jk3R1p0n5JP4J1j6m2kQ1K0r7l7Q4O5m0n6Mn6J04j4p3kQ4
$$ 15 67 21 -41 -42 12 47 -4 -3 -26 65 -5 -60 -59 15 26 10 -32 -34 47 67 -30 -67 17 82 42 -14 -10 -66 38 24 -49 -51 33
4939C3K0q8qMR6No3k7O7J5j2j20N9J08p1Mn3%R4L7j37M7l6R8j1j15pO4O5p3l9
$$ 33 53 -35 -43 -39 57 62 -1 -28 39 54 42 -78 -19 89 18 22 -31 -31 63 100 -37 10 -26 72 61 -54 -61 3 68 -5 -44
4970d4K9O3l6j8p6P8M6M9r7RK7L3p5k5O5l5P5o2k8j8J11n7m9oJ9O4Jr8L6O7Jm1
$$ -44 -15 48 12 -6 -82 -4 42 91 -6 3 30 63 -12 -37 28 -7 68 6 -22 -40 71 14 -35 -41 -22 42 43 -55 -19 48 49 8
5002Hm6PK0M3p0j7N2P6n0o0j6O8K2o2qjL0K7N0j26O2R3m2j21P1oP7p3r1Q3P1n1
$$ 8 -38 -31 -11 32 -38 -55 -3 73 23 -37 -53 15 37 -25 -33 -34 -4 23 73 -53 9 102 60 -61 10 4 81 8 -83 0 71 20
5034B0K0n5k5N7J5o9k3J08L4j09k4l5J40qo0M7p4Q7no5j0OJ01m2q3j6M6O5p5o
$$ 20 40 -15 -40 17 32 -37 -60 48 82 -27 -51 -86 54 46 -14 33 -41 46 41 -24 -34 -28 73 31 -52 -68 -22 43 -32 -38
5064c8L1O3n8k6k6P7opjo4N4Q1k3j02RO3%k1j2QL9k2j39Q0N7M8q9j9L1N7K1m1
$$ -38 -7 56 -2 -28 -54 23 17 10 9 -55 -1 80 57 -45 -36 27 27 6 -6 2 41 19 -120 -40 17 65 -24 -43 -12 45 66 25
5096B5o9P4Kj5m0J8P5o2l2k0L9L7Kq4J2O1K2k5j5j2J6O4p1m4JO4K1o3MK7K0k0
$$ 25 -44 30 32 17 -23 -5 70 8 -24 -44 -5 32 34 -50 -38 23 45 20 5 -7 9 73 2 -42 -41 23 44 -19 -15 12 32 12
5128A2p0N0oJ1J3j08L0Q0j1l6o4J12P8p5n2N1l1J7J4n7K7K2K4J9r4K7L4nk2l5
$$ 12 -58 -8 -14 -3 10 -98 -68 12 1 -35 -99 13 91 16 -36 15 -16 1 15 -42 -15 7 31 50 -44 -17 17 12 -10 -45
5158d5M7lK3r7J09J9m7Ll2j5Q5j0j4k3n3J17qq6m4J11K3n6m1jN7Np6jL6J7No2
$$ -45 2 -1 22 -75 34 53 6 9 -23 -38 47 37 23 0 -53 64 56 -30 -74 37 60 4 -37 -38 19 24 -52 -53 -17 0 5 -57
5190e7J3M2N4l3m2k4O1O2q6k4J10j5j6n0k6K8M1Rr3%Q6n5N3j14R8j5J9o3mJ8K5
$$ -57 -44 -2 52 19 -23 -47 14 76 -10 -34 76 61 45 -5 -31 -3 38 47 -46 -46 40 -15 38 -76 22 7 26 -37 -41 -23 2
5221Bj1l5rL0M5o4M4n3O6km7j5P2k1qj5J3L9j5LJ9n2Q7l0p6m0N4O5k7Mn7O8j1
$$ 2 -9 -44 -53 -23 22 -42 2 -51 15 13 -34 -49 23 2 -6 -21 -8 31 16 19 38 -14 73 43 -33 -73 -19 46 19 23 -34 34 23
5254B3n5jL2L3l7lpK9JJk1pJ6M0m3%m9N5J9m2mJ8O6o4M7j03P1lJ0q2K5L0R7r2
$$ 23 -32 -33 -1 32 -5 -8 -15 14 15 16 -5 -12 4 44 1 1 -48 7 26 -16 -20 -2 64 0 47 -56 15 12 22 -60 -35 -5 92 0
5288@l6k4N8Q7r9JJ6N1l4k8j9R2m4n8%M3L8j7K7j36L6P6l8k0J3N6n7N0p4k1Q1
$$ 0 -36 -60 -2 85 -14 -13 3 54 20 -8 -27 65 21 -37 -37 6 44 27 54 -82 -46 30 -8 -28 -15 41 -16 34 -40 -61 20
5319B0J5m7n6R3L7n9m7K4Q7J2m8q0M8N5K1q8j5O1J7m4l0k6j8P4%Ml5N9m8l8M3
$$ 20 35 -12 -68 25 62 3 -44 -20 67 79 31 -49 -1 54 75 -13 -28 33 50 6 -24 -50 -68 6 6 10 -25 34 -14 -52 -9
5350im3O6j1qm1J01l3n5K8k3L7K5j8o4RJ33n1o8l0L7O4l1j6OJO8l6m9m6Q9l4j6
$$ -9 -52 14 3 -5 -46 55 22 -33 -5 -28 9 34 16 -48 -39 94 43 -25 -55 -18 46 15 -1 5 6 74 38 -11 -57 32 -2 -18
5382a8j1LJ8N8o6m8O3L8m7NRn0P5l5M9p3P7l6k1j7O6k4J8q7nR9Ln4m9P3k6M6j3
$$ -18 -29 -26 -8 50 -16 -64 -1 37 -10 -5 4 -46 29 -6 43 -30 47 11 -10 -27 39 15 33 -54 -59 40 43 -11 -60 13 -13 33 20
5415B0o3K0N5J8o2L6jL4m7o9M9M0%l7m6L9P4p0J5l9j1Q2J6q0M1k6O9p6o7Q0O1
$$ 20 -43 -23 32 50 -12 24 23 57 10 -59 -10 30 30 -7 -53 -14 60 -10 5 -34 -45 37 53 -27 14 -12 57 -19 -86 -6 55
5446E5l2j4j6pN6l8N5l1j9L3ko7J5P8m8l6j1O7k2mm7j3Q3n8L7r7rO3N2J1j09M9
$$ 55 23 9 -7 -14 42 4 59 28 9 42 40 -27 -12 66 18 -18 -29 38 16 12 -35 -48 35 -23 14 -83 -92 -29 23 34 -75 -26
5478b6O3j6m2k1M0M4nm5OO2j7j2k7knj4j5J3%O9m6l6l2L5L1l1j5k7R3m1k2MrP2
$$ -26 37 21 -21 -42 -2 42 37 -8 -2 60 43 31 4 2 -3 -17 -32 -19 -19 50 4 -32 -64 -29 2 -29 -44 -71 22 -19 -41 -37 -46 26
5512B6lm7pM2Ok5j2NM7j7j5KJ0j3Mm0L1L2j4L5n1PK0Kkk0J7M8m0o3L0L7K4r2K4
$$ 26 23 -24 -31 11 17 -8 -20 -15 32 15 0 2 12 -1 3 -37 -6 26 12 47 -4 3 23 25 23 3 20 68 28 -35 -5 32 56 -36 -12
5547a2KL0OMp3M4moJ3lO0Kp9o8J13j5K1l2k3l1N4M7o0l5N3J9Lo2K1L1m6K2Rk4
$$ -12 -10 20 26 30 -43 1 -3 -9 4 1 61 63 -16 -84 29 14 35 3 -20 -51 3 50 -10 -45 8 27 30 -32 -11 20 -26 -4 5 -19
5581a9O8Kn8m0J2R1o4j0mK2J2K7r2OM9nm8L3L8J0n2m4O4K7k6O1p3k8P8l6nk3K9
$$ -19 49 51 -7 -47 -35 56 -8 -18 -22 0 12 39 -53 -47 2 -3 -51 -18 20 30 -22 -66 -2 25 -1 60 -13 -41 37 1 -4 -27 2
5614BO1l0q0%O4k0kj6QoK6N9q2J8PPk1OmK0J3l7nK4k6n0Q2PlmJ8o8L9j8M2n4l2
$$ 2 63 33 -47 -47 17 -3 -5 -21 -13 -19 7 66 -16 2 9 16 -5 1 -3 17 30 -7 -12 12 -14 -64 18 25 22 18 36 -32 7 -11 31 -23 -55
5651e5N0k8N0n7K4J8j8l6L8L2J1K4m2k8L9K6p7pl9O9Kj5pJ0J6K2j9l8O8j4k9O
$$ -55 -5 -33 17 -40 -16 2 -16 -52 -14 18 29 53 11 -17 22 48 -29 -36 -75 -6 -4 -19 -26 -16 0 22 3 -35 33 19 -10 -4
5683dl0M9j1K2ro7R4n5l0PN2j4J2M1n3j3P1o7J2J3l2N0mo6O5l3O0j06L6jL0l8
$$ -4 -34 15 4 26 17 -50 44 -11 -41 -34 18 4 16 57 4 -9 62 -5 7 20 -12 38 34 -32 33 0 60 -46 -10 -11 19 -19
5715a9KJL2K6lq5P0l3j4j2lM4KJ7j03J28Ol7k0k0j9RjqN6j8l8N2m1kL5l7M2l1
$$ -19 -17 -16 16 42 39 -46 24 -9 -23 -35 -38 6 8 25 -78 50 56 19 -1 -21 -40 -31 -32 -40 16 -2 -40 12 -29 -31 4 -33 9 -22
5749b2M0j9j9m1O2M2k4o8m4R3P4k1n0j2n6N9N6l1l3M0l0J8p5M2O2o8J6Pj3J0K5
$$ -22 18 -1 -20 -61 1 43 19 -49 -93 0 74 53 3 -9 -65 -6 50 19 -14 26 -4 14 -61 -19 43 -25 -9 -2 -15 -5 20
5780B0J2q5L8M0j7o5L5N3k4Ok5J3L5n3O3lmK6m1p6N0o1J21p8o0P1n3N0K0l4K9
$$ 20 32 -53 -15 25 8 -57 -22 31 7 13 -12 1 36 -17 46 43 39 65 24 -52 -2 -63 58 -20 -80 -9 -62 -12 8 -26 3
5811Cj1L4k6j1K1p8J11m7j5L1KL6l7J4o8N2p4J8O8kj1l6k3rP1J4n7N9l5%mok4
$$ 3 -8 26 0 -11 10 -68 43 -4 -19 12 14 50 13 27 -41 11 -63 -45 23 21 10 -26 -49 -58 13 27 -30 29 -6 -6 -10 -16 -40
5844d0K6K0r3O9oJ1L3n6L1O9m1K3p3K7K1j1k7J3m0M7K1k9l0jN7j8k5L9k0MPl3
$$ -40 -14 6 -87 -18 -24 -13 20 -36 -5 64 23 46 -27 0 21 10 -17 -4 -44 3 24 -5 -35 -36 21 3 -22 17 -3 1 8 -25
5876b5m5M6J3j3Pj2P9n4k6K6Qm7P5l5J1k1Pj7N7n3M6Jq0LK2O5n8j4L0k4J7J4n2
$$ -25 -70 -24 -11 -24 -17 -29 50 -4 -30 -4 4 -43 32 -3 8 -13 -6 -23 34 -19 27 28 -52 -49 -27 38 -20 -34 -4 -28 -11 3 -49
5909d9L1K2Mj5K6N7j8m4l2O5l2J7prK0M0m9J1j5k5J7k7Pn8M6L9l6j0J2J3n9O2
$$ -49 -18 4 8 -7 19 76 58 14 -18 47 15 32 25 16 36 76 27 38 23 -2 15 -12 -5 -63 -17 22 -14 -24 -12 1 -58 4
5941Do7O1P1o3j4k4K7j0j6M4mNNJ6l4nL7n3k6L2qQ0q4L4rM4m2J4nmm8O1j7n1N
$$ 4 -63 -2 69 6 -8 -32 -5 -15 -31 13 9 14 19 35 1 -4 33 -20 -46 -14 -22 58 -26 8 -1 43 1 15 10 6 -42 19 2 -49 -44
5976d4L7n0P4n0R3n3J2nk4M1o8L9J4mk7K2j5j8K4Kl3P9k9nj0m5L8rk2L8k8L1J
$$ -44 -7 -57 17 -33 60 7 19 14 -10 31 -37 2 16 12 -15 7 -8 -26 -2 0 -33 46 17 12 2 -43 -5 -14 -36 2 -26 5 6
6009Flj7P0o6L6j2n1L0k7N1Rm7Rj4l6L6J4mP9o3Om1L3j4L1Rn5J1J2mL0J3r0R3
$$ 6 3 -14 56 -10 26 14 -37 -7 -34 17 26 -21 -12 -26 -62 -26 -12 -16 63 0 6 -35 -2 -16 15 24 -31 -20 -8 -12 18 31 -59 34
6043C4J3L7r7Qj8K9J5l6K3N2l6m4L5K4l5l0J4L9j8n%om4O3m8J9qM2%Kj9oK8m6
$$ 34 47 84 -13 -5 -23 6 21 -15 8 60 24 -20 15 39 4 -26 -12 27 9 4 4 -2 -46 17 -31 -12 -20 22 22 24 5 -1 27 -19
6077a9J8K1j2n7L9J2J5j5moL2m2L8K8n5RKK9r5K1K8L6n3k1L7J3J3n4K6J2nj6J8
$$ -19 -1 20 8 -49 -10 2 17 2 -2 -8 24 -18 20 48 -7 2 4 33 -62 -41 -13 23 -30 -51 -14 -1 12 -42 -16 -4 -9 -25 -7
6110gJ3jK4l6k1L6JOm1JM1n5K5j0j2J5j4P3p5N5j00P9jKN2q4O5j1j1nrKjj9M0
$$ -7 6 5 29 -7 -28 8 9 15 -26 -25 16 -39 -14 -24 -36 -21 -35 38 -37 18 -82 -3 -4 -2 50 -34 31 20 9 4 -5 -3 -4 -23 17
6145A7j4L3o2k7nP5Jm0j7M6j1op%K3j8J2j1L5J5m9l1O9j8k5J2n2J00m5o4OL2O3
$$ 17 3 36 -26 -53 -58 17 18 -22 -39 7 -4 -10 -17 -17 6 -12 0 -11 24 39 -10 -41 28 10 -15 -3 -55 45 0 -64 -58 -26 37
6178C7m6K2l6kRK7rj6j0L1j2Ll3j3J9l0jN8n4R8n9K4J0J1l3k7J4k6L5M3oq9O7
$$ 37 -9 13 -23 -25 -16 11 2 -14 -24 7 -5 -2 -35 -48 -29 -59 -60 -2 -56 42 -17 7 17 28 -5 -32 -18 -44 -9 34 28 -61 6
6211FK7qkJ1on4qjM9q0O4l8L4K1n8N1rNK2m1m0O3Qj8J9N7o1%K7q0J04j7n5N2n8
$$ 6 33 25 23 34 28 -26 -34 -35 14 -66 -2 -40 -6 15 -43 8 -1 4 26 -15 -55 8 16 -2 17 74 13 13 40 -40 64 47 -8 44 -14
6246a4K5N0j13OM0j0k1P6n4J9K0k8J3J9nJ9n8J3ko4N7M1J7j2l9plqL0l7J7j4O8
$$ -14 11 61 -52 -46 -6 -16 -37 39 -15 4 24 -4 9 28 23 42 -16 -3 -5 -69 -12 29 46 34 -5 -12 -15 -23 7 -30 -13 -27 41
6279D1l5n7N3Qpj7O1k3l8J7L3l1qJ6J9r2Q2O0n3mJ0j4rj0K3M4l8qJ8o9pK3K1l8
$$ 41 6 -51 2 10 3 -14 47 24 -14 3 36 5 -3 13 32 -60 22 82 29 25 35 21 12 2 25 69 31 23 41 -28 -35 -12 9 -29
6313b9M0M9q8J3oj8K2oJ9l9N4j3L8j6m5J3J1M4m9k0K3j0L6p6R7p6K0j7Qk4O2J2
$$ -29 11 60 -28 -15 -21 -39 -17 -23 -4 -43 11 -2 36 20 -25 -12 -1 43 -6 -26 -3 -13 23 -53 44 -32 -12 -29 -21 -45 17 29
6345B9o9O4l4QK7j5l7J3K8l3j8O1Om9jJ2rK9k8N0Omo6pK6J6Mj3j2j8N1mPm4k2
$$ 29 -40 24 -10 -2 25 10 -27 -14 14 -19 -37 24 30 -19 -20 -8 -17 12 -16 34 40 36 -30 -37 -11 5 9 -4 -16 -34 17 13 20 -24 -46
6380d6K2K0k5%L4k4K7k8m0Q3j9oJ0m2nK7lKM5j2j8n8R0l2l5L6rkl0k5L3P5m4r
$$ -46 -24 -4 -29 -29 5 -19 8 -20 -60 23 4 -2 8 -34 -39 -12 -15 -13 32 20 2 -56 34 2 -33 3 -6 -8 -38 -63 -30 45 1 -8
6414hm0NP0n0O9p2O5nn9K6k2N2q0L6P1m4l0MK4L2n5K6n5NN6K7p1M6mk0k9L7m0
$$ -8 -48 -43 27 -23 46 -26 39 34 -25 1 -21 31 -49 -13 58 14 -16 -12 12 44 -11 15 -40 -35 21 48 -23 23 19 -1 -30 7 -33
6447c3K0K8nJ4m8K1O4o4Rj5N3p9N7k6OL2l6k4L7l1M4Jm1O7m9l5KK3jO9n4qJM3
$$ -33 -13 15 10 24 -24 -3 61 -3 6 -9 44 -35 22 -4 2 34 -2 -26 11 -20 24 25 -16 51 2 -33 -31 -8 -9 60 6 -2 -1 42
6481D2j4Qo8L3m6O5j00J16l2j5K3l2L4qKp3L2N7m4K8K6K1l4K7l8k6L2K6K5j12
$$ 42 28 36 -32 1 -45 20 -80 36 4 -11 12 -20 14 6 8 -65 -33 24 -20 8 34 55 21 48 10 -16 16 42 67 -45
6511d5N0J2n7j2J04l9mNj8L7o6J7L6oq1Q4j5rQmj2k2N3lk3l8J8O0J3n6k6L8K5
$$ -45 5 17 -40 -52 52 13 9 14 -4 33 -33 -16 20 14 -67 17 2 -7 1 -3 -15 -37 16 13 -10 -48 -30 30 43 -13 -39 -1 24
6544B4rKk5Nj4L2o0R8o3L2K9l9p2M3K5qJ5kll4k1O0l4LO3m9o7N7OQ6j07j4L0J3
$$ 24 15 17 -8 -3 -17 15 -45 53 -10 22 51 12 -60 -17 8 0 15 13 10 -24 -45 15 -19 -16 47 -2 -69 -12 -6 80 -27 -41 -11 2
6578Bl6M4L0rm2l4N6o8K4jJ00k6l4M8r0J9M6j4m4m5J7N0mJ2K0l1qJ2j4L6Nk3m7
$$ 2 -34 10 40 31 -11 -45 11 -57 -33 -34 66 40 6 54 -36 -17 29 15 -29 -74 -57 -7 -11 1 21 -10 -18 -6 -20 16 21 -2 -49
6611d9L4L2J2j3l7QJ3J9n6KR3K0o2m6N7k0k6Qn4M4K1QnrO5m1k6l1N7J5J8m5%K1
$$ -49 -15 17 29 16 -21 -13 0 19 -37 -35 58 78 16 -30 27 7 -19 -11 -65 -21 0 8 3 -6 59 18 -8 -39 18 33 51 6 6 27
6645B7j7ql3P9j2n1kk2K0kJ4J0m5L6K5j5m0O3K5k6j9lk3P9k1k9k5J4j2K7k4OM0
$$ 27 10 2 -31 48 36 -15 -17 -39 -19 -21 -7 3 -42 -6 19 4 -36 27 52 26 7 4 -19 60 39 10 -15 -1 -13 14 -10 -4 36
6678C6n2Q%M6K1j03OK8J4j4J2N5m3kMk7j5J9Q2m2l6J0rJJ2k4N7n5pNM2l1l0N2
$$ 36 -16 -8 -8 38 59 -44 -38 -10 4 -10 2 57 14 12 16 -11 -26 -7 75 33 -3 7 -2 -1 11 -13 44 -11 -18 -13 29 -2 -32 20
6712B0l0j7k4L2K3j1K1%Ok6K5k5m7L0rN0o4O6l2J6K5q8O2N5o3O9l5n9M8K5J9j28
$$ 20 -10 -27 -51 -19 4 -7 14 14 20 -6 19 -6 -53 -23 -32 18 -46 20 -12 4 29 -59 3 58 -5 64 29 -30 18 43 62 -66
6744f6M9M6K4j8o3L3k6J1KOj5J2Ln3L6K4l2K4pk3P7n8QKP7n4m2L8n0M5m6k5L1
$$ -66 -17 29 53 35 -28 5 -21 -10 -8 -2 -17 -5 -2 -55 -19 5 -27 -3 -10 -33 44 -14 -6 -4 73 19 -23 15 -35 10 -36 -61 -30
6777c0k4O9m7L7L0rl0K0m4QK9o0K8M7r%j6j2RpL6n5K3n3R1qLJ5l1K0J5r8R3j8
$$ -30 -54 15 -32 5 35 26 -4 16 -28 -20 9 -51 -23 24 15 15 -1 -13 -4 -11 25 -30 -7 -60 31 23 26 41 10 30 45 -53 40 22
6811B2j2Km9j0J4Q6pl1k3JkJ6j0J0n1M3MJ1kk2j2L7prk0N8K8j08N3K1plMn3K2
$$ 22 10 12 -37 -47 -33 53 46 15 -8 -7 -9 7 -3 7 -44 -1 3 14 12 -10 -22 15 8 -1 -21 37 65 -43 10 31 24 21 25 -28 -6
6846fPK5q0mN9lMm3N2P1j24J1J4K7j7j0N0l1MM1l6J9m4k6N6n3k4O7K5l2k7kN9
$$ -6 1 26 -54 -58 1 -2 2 -41 11 82 -42 -31 -17 10 -7 -17 33 2 6 47 11 30 -14 -40 16 -37 -61 6 31 -1 -28 -30 29
6879B9l1k2j9L9K7K2o0j7N6m0J%J5P7r1K1N8l8p3L5lk0RK8n7KL3k6M1j5MMM3j9
$$ 29 -2 -24 -43 -4 23 45 -15 -32 24 -16 -15 -15 0 77 -14 7 65 27 -46 -11 -14 -34 -25 3 -54 -52 -19 -45 -4 -19 -15 -11 32 13
6913A3kkl7K3j4j0N2rj5l6L5k3M0opl2K7lL8k7K6j2o2kP9k8k1k8N2K6p9N3jj8
$$ 13 11 9 -28 -5 -19 -29 23 14 -1 -37 -2 -25 15 9 2 -30 -3 -6 32 5 31 19 -43 -45 34 6 -15 -43 9 35 -44 9 8 -10
6947a0L4J6q5N1k4P3j8n9nK6J1l3rO5J4m6m4N6l4M3j4n1K7mK2p3N2O5nr4J12n5
$$ -10 24 40 -45 6 -18 55 37 -22 -27 -1 10 -23 -32 33 47 1 -43 13 -21 22 8 -43 -16 -20 2 -71 -19 46 41 -53 59 4
6979Dj9K2o7Q5qn0K1P9o9l5K9k9j0Q2p2M6n8L1N9K5p8q2J03k9M3o7N5j2J8rl3
$$ 4 -15 7 -60 25 17 -33 -12 67 -2 -37 -8 -37 -47 35 -37 9 -49 -18 41 66 -12 -94 9 -20 23 -44 11 -1 17 8 -25
7010b5RL2j8Mk2QpK0rj8N2j3p2O3Nl6j9j8J07m1J1j0Nk4l0M1K2K4m6k1M2%m9L
$$ -25 -16 16 -2 2 -20 -12 -19 1 -8 -26 26 13 -59 4 9 -27 -46 -64 43 2 13 3 8 -16 -46 -5 17 41 -5 -26 16 16 -33 -30
7044c0J9M1r8J12om1K4m1J9K5L7l5q9N4J7r0L2O5k3K1pm7J7J5J2LL7nk4nk8k4
$$ -30 -11 30 -68 44 38 -3 21 -20 -1 24 61 26 -63 -9 8 -82 -50 15 -8 13 6 -41 -24 -9 3 6 43 38 14 9 -19 -43
7076d3O8mn5N1qk2K4M5m6K1o1J1J2k4O4K7o5k8P5m3L7o2K4J8pj2l5M5K7o0L0K7
$$ -43 25 21 -34 17 9 -13 11 56 10 31 -30 -19 -7 -31 33 60 -5 -33 42 -1 36 -26 -2 16 9 -3 -38 7 34 -26 4 31
7108C1l7rL2k6K1l6M7n7k7N1MK3k7K3on1O8j0k3J0K3J3k6j8j5O3o4L6k5J2L1l7
$$ 31 -6 -15 17 -9 12 -24 23 -34 -61 -10 -6 17 -10 13 7 -44 24 14 -9 1 24 37 11 -7 -22 41 -23 13 -12 0 31 -6
7140fJ2q5J14l0j0lJj3N1kk1qO5l1n2O2o1K4ll1M4j3K9k8l6l1R1m9J7j4P1m6Q
$$ -6 6 -79 35 5 -5 -8 -7 -20 31 29 8 0 65 34 -18 44 -17 7 4 -27 17 4 33 5 -31 -62 29 -20 -3 -17 54 8 16
7173A6OJ8p4O2n4%K8pJ1pnnLk9K1%R7o5o3lQ4m2KPo8O9J2L1l8j0l4K9ml9L1N5
$$ 16 22 40 -34 28 -26 -26 2 -5 6 -1 -6 -11 -8 -37 -16 -16 81 16 -47 -50 34 -8 -6 1 -67 2 14 45 7 -3 -37 -8 -12 -51 -20 35
7209C5k2p0Q0QLk9pj8l8R9o7J9m2Q6Rl4k7J9O6o6j8rO0J0l0KLL0n6j4LPm5O3R
$$ 35 13 -57 23 31 34 5 -2 -20 -58 41 -26 -7 -49 37 46 12 -15 4 70 4 -14 -23 37 47 17 19 22 52 -4 -18 -15 -8 -53 10 19
7244A9o9N9j5j9K6J1qm3J7M5j4j8K8l5j8N7j2pk7M7k6k5K8M3m6M2p0L3Km9OK6
$$ 19 -50 9 -6 -25 1 12 4 -39 -22 23 9 -9 19 -16 -34 23 11 4 -23 24 -2 -27 1 44 -2 40 -30 3 5 -44 -38 -12
7276a2K1j7%J2M6j03K2kO8p3M7J5L4o3L5J8k6o1P1%n5J3j2o%K7K2Pm8K1J4Pl4
$$ -12 9 -8 -8 4 50 -53 -31 -33 35 -38 9 24 58 -5 30 48 22 -39 32 32 -23 -10 -22 -28 -28 -1 21 28 -20 1 15 22 -12
7309a2L8k2Nl8M0k6M6l9L3j2M2p6nK9l9K4k7N9j0k5OJ3J2Nnl0K6k9K8Pj2J2l0
$$ -12 26 4 9 -29 11 -15 31 -8 25 13 55 -21 -26 3 -36 -12 -39 20 10 -15 -9 4 16 21 16 -14 12 -17 11 18 6 18 -12
7342a2j5J6k9P3m4L3j1m8K2J01q0rJ3Rl1Pk4R0j6j16R9n8Q6q6M9k8j3O6n0j7k
$$ -12 -27 -11 -40 33 -11 22 11 -37 -15 86 6 -3 10 19 -12 -5 -29 61 45 -71 28 -30 56 -30 19 -9 -22 44 -6 -23 -25
7373b5QRN1l0l6O1l8J8k1J8k6N7q7M9K8qo1KJ9%j9K8k4M3nn8L9J6qm4K3jkN4k3
$$ -25 -17 -8 43 13 -23 38 0 18 -3 15 -11 46 -41 8 36 28 -33 -31 -12 -12 -31 -3 -27 16 11 -47 -8 8 0 -44 -21 -22 -24 30 7
7408Gk9LL4j0l3K3LK3l3kJ3k2L3K3k8mj0j0j5N8m7N5j2K1j3k1%J1%J2nl4MK3o4
$$ 7 -22 -19 15 5 -28 -5 -2 21 -12 -14 -1 -23 10 33 5 1 -9 -19 -34 24 -23 32 20 41 28 7 7 18 18 30 25 -9 -5 18 -46
7443d6K7L4j2j7QJ5j3L3k5NL0l6j0L4j2n4N2k2LNj7pN5m7m5M6M5k2J4Kj9RJ7l6
$$ -46 -19 15 3 -14 -6 9 -4 29 4 9 39 3 -7 27 15 -39 13 -9 -6 -1 -18 -25 30 -17 -62 -16 29 7 21 23 4 13 30 -6
7477fl0R4k5n6KJ9k6O4m2K3j2o4R5j3j1Rj9J4o%L1m3K2l2J9l8N8lj6m0L7J1mj9
$$ -6 -36 58 33 -23 -21 -2 -28 36 -6 17 5 -59 36 23 12 21 2 16 10 10 41 -2 20 -12 7 -31 27 24 8 -32 5 16 12 -7
7511gm2O0m0L0Kj4K1j6j6lJ0M0m8J7M5n8J4J7k2l0N5l0%PKmLnrK4lk3Q1p8N3l0
$$ -7 -49 11 -29 1 3 -11 10 -6 -22 -25 -15 25 -23 -6 39 -19 -5 12 -10 -40 15 -15 -15 -8 -6 -10 -7 -12 -21 3 0 -23 58 -20 33 3
7547CK9m6qrK8j4k5N3k6j1L2jk7P2j8l6m4jJ12m2r4R5ll7nL4K3l4oK0lkJ7Oj6
$$ 3 32 -14 -22 -31 -3 -17 -42 11 -15 -26 6 5 -22 50 32 -4 -48 -49 63 21 -73 22 19 -18 -23 11 34 0 -6 14 11 9 26 32 16
7582A6l1L6j7%k3K6Jl0n0N7J2NM5p0Q1m1k5NL6m5L5k1k3oM1K2K0o7O2j8j7j0M
$$ 16 -15 21 4 4 -19 7 8 -22 -72 -15 -3 2 47 -23 58 17 -8 -3 33 -12 23 2 -21 -27 14 36 56 -11 51 33 16 6 10
7615A0k6rJ5J0J8k4J4k9L6k4k6J1K4k0J8qK3k9J7k4K1k7L3n7L9j8K9M7l5l2j6
$$ 10 -16 -25 -10 0 18 -6 8 -21 15 -9 -35 -24 0 -20 -2 -10 13 -16 1 -23 -2 -29 4 -53 -14 -32 -3 44 9 -23 -39
7646c9kM3PJ7nj6M1l5Rm6J4l1nJ14oq0rl6L6Kj8M1M4l8k6M3n6NJ10o0o8M9KLO
$$ -39 -41 2 9 26 21 5 46 11 20 -26 -12 -43 -48 66 60 -20 -29 -65 -29 -27 -45 -4 40 2 -24 19 -37 -32 78 18 -50 -1 1 4 10
7681A0O4j00K8K2kJ8k3%K1r8O3j3J6K0l6K5J1j9kJ1M3%k8l5PNl3j5L5K8j5%j0
$$ 10 74 -26 2 24 22 40 17 17 38 -60 3 -10 6 26 -10 15 26 7 5 16 59 59 31 -4 3 8 -25 -40 -5 23 8 8 -2
7714bl6LM9m6Pk9O6J3k0j0J3nJ0J4l9J8l3L9m4L8R%m6pM8j0k7L5j8k8P9j27N1
$$ -2 -38 -35 14 -32 -25 -54 12 25 5 -5 8 3 13 27 -12 6 -27 12 -32 6 15 15 -31 -38 10 0 -27 8 -10 -38 41 -86 -35
7747c5O9r3P9j7j4j7J5J6m2J6L0j4J2j6j6N6m6M6l0L1l9J5mn3PM1Nj2J2Qn4N6
$$ -35 34 -59 20 3 -11 -28 -13 3 -39 -23 7 -7 5 -11 -27 29 -17 29 -1 30 -9 6 2 -51 -44 -3 2 -10 2 10 -44 12
7779A2pj7L0n7J4llJ7rK9J3Rl1Rj8k7jL7k9M5J3nj0ol5L3L5k8m0K6J4j4M7k8k9
$$ 12 5 -12 18 -39 -25 -28 -31 -14 -23 6 19 28 -3 6 -12 -39 -40 -3 -32 13 26 21 11 5 -30 3 38 10 -30 -4 10 -4 43 15 -14
7814a4MRj3L5j2P4q7j1N3k4k5j1P5n3%Qj1L7J6k6oj8N2p7O0m0l4L6l8j8L9J6K6
$$ -14 -10 -1 -14 21 9 83 -4 -15 38 14 -11 -22 53 0 0 8 -3 34 50 24 18 0 52 -25 35 -5 -39 -3 -41 -59 -20 -4 22
7847B2qOj4J0n0L3l3K3K6j2M6Kn7L3pkpJ0j1M2l0m7L4n3M0J7qN1l2m2PN3l2o4
$$ 22 14 20 6 16 -34 -1 -34 -11 15 3 49 51 -6 27 20 18 11 21 10 52 22 -25 9 -44 -4 13 5 56 24 -18 -11 42 10 -54
7881e4O5m1K4n5O6Lk3j0L7j6Rm5K1L0pkj0K6K9m6lj9J9l6O4L4j09O1k5R4j10L2
$$ -54 11 -30 -6 -61 5 8 -15 -25 12 -4 5 -40 -19 11 4 2 -8 18 47 1 -2 -21 -2 -38 26 60 -49 12 -13 81 -29 3
7913Com2R5Nn1P4k5m1J2j8J9m6%N3m3j3K6K9m8j3M4JL2p1j6L1k2K5j0J05n1n9
$$ 3 -3 -45 50 55 4 78 53 12 24 6 25 -21 -21 32 -11 -24 2 31 -17 -30 14 15 47 -24 -40 -9 -31 -6 -16 89 38 -21
7945b1j1R8J6q9J3rj7J1nnK2M5o0J0L7n2O0o6j1RO2l2n7nP0k2mJ9m0J3PM5j6k9
$$ -21 -32 66 82 -7 6 -3 -20 -9 -14 -19 3 48 -12 -2 35 -17 43 -23 -34 -25 37 5 -52 -57 13 -9 -13 6 -34 -21 -14 31 15 -14
7979a4kJ6k6M0k4M2o4N0qJ3lNp9K8M6k3j2L0p6R6p8L0k4K5K1MK0p5P9l3m5j6N3
$$ -14 -16 0 -26 14 -10 32 -32 18 10 23 20 25 -54 -26 20 -3 -15 15 -61 35 -43 -13 -37 -12 9 13 33 -42 37 4 -41 -57 -4
8012dJ4K6l8rk1K4k0O0n2K3j8K6m5K3mk9M0j9K8k7j4oK3JJ5o2R2l0nJ3k2j1M0
$$ -4 10 36 -2 -11 -32 -8 -28 32 -20 3 -15 11 -34 -11 -15 -44 -4 -23 5 -22 -36 -42 -19 -18 -3 -65 27 -3 -8 5 -17 -28 12
8045A2rmrm1P1j3k2J5m9j1M9L6ql5K3n8O1K5J1k9j7K4l7RPk7QOPk8MM4p6M3J7
$$ 12 3 -1 -10 -51 20 7 -15 0 -49 -60 -11 25 17 -18 5 -53 8 33 44 15 -2 22 -15 -6 1 -26 -18 -12 -5 -33 -29 15 -61 -18 -1
8080aOl1P2j7p6J2L2qpNkK7j4N3l8n8L8K4j0k7J8j0N5l9oRk4Rj7J2n3M5J4K2J
$$ -1 5 -26 46 29 -47 -35 -3 -11 -18 -13 -15 12 -2 51 13 -45 -7 17 7 -20 -2 -12 43 4 -2 7 -17 -8 -25 -13 -66 -21 -7 15 16
8115A6n4L7J6j0J6j6Nk2n2N6L0p7L2N6m7m1J7J10p9j4K1k7k2P4ln5K5k0j1L4Q
$$ 16 -38 -1 15 5 21 5 10 -12 -64 -8 22 -55 -23 33 -14 -55 -38 72 -7 -21 0 -27 -49 25 22 -33 -8 -28 -39 -5 3
8146Ck9l7O8m2j1P0m7N9j5m9R2m0l4K3n9L6k6Q1Ll4Ll1O1k4No1M0K7p9P6l0m4
$$ 3 -26 -63 5 -37 -48 22 -25 34 19 -30 62 22 -12 11 -48 -12 -38 43 46 12 15 -16 45 21 26 -35 5 32 -47 29 -1 -45
8178d5M3oM9J8o6L0n7J07j05L3J1k6k4
$$ -45 -2 -8 41 59 -7 23 -34 73 -32 1 12 -14 -38
8191c8
$$ Imaginary data points
##PAGE= N=2
##DATA TABLE= (X++(I..I)), XYDATA
0@%%%%%%%%%%%%%%%%%%%%%%%%%kMmOrRj1J7k1K2k3K6l1L7m3M6n2O1o9P7q4R5j05
$$ 0 0 0 0 0 0 0 0 0 0 0 0 0 0 0 0 0 0 0 0 0 0 0 0 0 0 -2 2 -2 4 -5 4 -7 10 -11 11 -12 14 -17 20 -23 23 -29 32 -37 40 -44 51 -54
48e4J14j27J42j58J73j88K04k22K41k59K77k94L07l11L00k59J60O8o05K036p056
$$ -54 60 -67 75 -83 90 -98 106 -116 125 -134 143 -151 156 -155 145 -114 46 114 -491 1545 -5511
69e511N0699L07978k35649m26935J44624L72799k5177k78886o0081J34687J13133
$$ -5511 45188 353166 117517 -309418 -164794 208005 182828 -96058 -156139 -21452 91681
80I1681K3400j14198j80131P3814L05541M204l86028r5812M08384J84114l76893
$$ 91681 115081 883 -179248 -105434 200107 204311 -181717 -277529 130855 314969 -61924
91f1924k44714L00103K66599j97681k41304Q7396J73008R497p0274q0005n0452
$$ -61924 -306638 -6535 260064 62383 -178921 -91525 81483 90980 20706 -59299 -109751
102a09751J12670J70402j08085k70556P1532L36023j6795l58100m1350L36801
$$ -109751 2919 173321 65236 -205320 -133788 202235 185440 -172660 -214010 122791
112A22791Q7360k77832j09642J94164J01998r9608o4041J0646K181O0716P3334
$$ 122791 210151 -67681 -177323 16841 118839 19231 -44810 -34164 -31983 28733 102067
123A02067j05959j48415J23236K09946j16552k47816R3305K56677o4190k36756
$$ 102067 -3892 -152307 -29071 180875 64323 -183493 -90188 166489 102299 -134457
133a34457L7807J91904k2319j31221K1347O3948l5018k33N9399n2403q8152R0095
$$ -134457 -96650 95254 72935 -58286 -36939 27009 -8009 -8242 51157 -1246 -89398 697
145F97J14471j11467j31638J19426J36197j17731j26014J11828J03021j05370
$$ 697 115168 3701 -127937 -8511 127686 9955 -116059 -4231 98790 -6580
155f580p0786J01505L4019j00632J692J01456l2780j01250N6280R6285p2746q4738
$$ -6580 -77366 24139 58158 -42474 -40782 60674 27894 -73356 -17076 79209 6463 -78275
167g8275Q3365O4914r1057l8262R8293P152j06743K4127J16996n0801j27005O9673
$$ -78275 5090 70004 -21053 -59315 38978 46130 -60613 -36486 80510 29709 -97296 -27623
179b7623J33985p8120j33237P6565J22319o7395r8519N5009O2217m4200j6322
$$ -27623 106362 28242 -104995 -28430 93889 26494 -72025 -17016 45201 1001 -15321
190a5321L9270l4174m3269Q2309N6192j21967p6038J46663R7765j53338j15728
$$ -15321 23949 -10225 -53494 28815 85007 -36960 -112998 33665 131430 -21908 -137636
201a37636J41253J23205j13486j15186P5636Q9577l5329m6589O38r097K2330P0782
$$ -137636 3617 126822 13336 -101850 -26214 63363 28034 -18555 -17917 -27014 -4684 66098
213F6098k8593j29402J8363J75874N837k02654l7397K05051O7997j82519q9404
$$ 66098 37505 -91897 -73534 102340 108177 -94477 -131874 73177 141174 -41345 -130749
224a30749J38644R3955q1221p7975J9431M1102L5952J1933p6429p3831R6072J34221
$$ -130749 7895 101850 20629 -57346 -37915 3187 39139 51072 -25357 -99188 -3116 131105
236A31105r3074j82680P0562K10742l4908k12485m516J87538L8403j38819n7964
$$ 131105 38031 -144649 -74087 136655 101747 -110738 -115254 72284 110687 -28132 -86096
247h6096P4241N8367m001l7811o1245o42J11724N0210j40943j02108J45574J46009
$$ -86096 -11855 46512 42511 4700 -56545 -57187 54537 104747 -36196 -138304 7270 153279
259A53279j27739j73649R2590J78400m8873j58300N770J15605K7572n6045m4428
$$ 153279 25540 -148109 -55519 122881 74008 -84292 -78522 37083 64655 8610 -35818
270c5818j0959M1986P5635k1081j27729j3119J60550N3038j69845q9709J56460
$$ -35818 -46777 -4791 70844 49763 -77966 -91085 69465 122503 -47342 -137051 19409
281A9409J14832j24673j22093Q1695J08664l6464p6148l101K8977L0072K5005
$$ 19409 134241 9568 -112525 -30830 77834 41370 -34778 -37879 -8902 21170 46175
292D6175m1451p7796L6950J20881j9982j48273l682J56707K7727j46170m5539
$$ 46175 4724 -73072 -36122 84759 64777 -83496 -87178 69529 97256 -48914 -94453
303i4453J20237N2385q3614m5760M3636K6474o396K744k2670l6958M0815P0208
$$ -94453 25784 78169 -5445 -51205 -7569 18905 12509 15253 -7417 -44375 -3560 66648
315F6648m7300r7261M3634J13340l3513j16812K1152J07132j0980q6910N984N9339
$$ 66648 19348 -77913 -34279 79061 45548 -71264 -50112 57020 46040 -40870 -34886 24453
327B4453p872k9265J6545R56k9788K2230M5082l8441n8269M7595O6974n0675o8639
$$ 24453 16581 -12684 3861 4817 -24971 -2741 42341 3900 -54369 -6774 60200 9525 -59114
340e9114M9962O3148m7706n1086M5908L4803m6082j6732M7666p36n0150J5274
$$ -59114 -9152 53996 6290 -44796 1112 35915 -10167 -26899 20767 20031 -30119 -14845
352a4845N1666k6358n0756L3478M5850l8001l6560M1040K3479m3990q069M8100
$$ -14845 36821 10463 -40293 -6815 39035 1034 -35526 5514 28993 -14997 -23066 25034
364B5034p476n3148K1268N8724l0985o2847L5845O4077l5636o0156L1663N0074
$$ 25034 17558 -35590 -14322 44402 13417 -49430 -13585 50492 14856 -45300 -13637 36437
376C6437k5819l3977K0510J2623j8143J1173J9958l4703k6595N4269L6531o7156
$$ 36437 10618 -23359 -2849 9774 -8369 2804 22762 -11941 -38536 15733 52264 -14892
388a4892m7868P1386N7247o6692o1458N4445N8144l7125m5907J8878K5441l097
$$ -14892 -62760 8626 65873 -819 -62277 -7832 50312 13187 -32720 -13842 11599 8502
400H502J517o822l1055R404N9084m195q1032p345R3640K1813r4963l5668Q4611
$$ 8502 10019 3197 -27858 -18454 40630 36435 -44597 -51942 41698 63511 -31452 -67120 17491
413A7491M4529o4636m5752L8395L7168j0771j9207j3882o067L1330L5245l9347
$$ 17491 62020 -2616 -48368 -9973 27195 16424 -2783 -16665 -22732 8598 43843 4496
425D496o3242L7106Q5717k5869r8207R093R8846R033q6715k3789O3992L1432l4155
$$ 4496 -58746 -21640 64077 38208 -59999 -50906 47940 56973 -29742 -53531 10461 41893 7738
438G738k9593K132J7825K6725K135m8562k6910O0102N1502o0558p1832N1043Q3352
$$ 7738 -21855 -19723 -1898 24827 26962 -21600 -48510 11592 63094 2536 -69296 -18253 65099
451F5099l4496q4102J5403P3055K356n2099j4365K4355J8839N772j4459l3502
$$ 65099 30603 -53499 -38096 34959 37315 -14784 -29149 -4794 14045 19817 5358 -28144
463b8144K667N5256J4097o7761l2058P0029M7428o2783n6886M8222N7812k9831
$$ -28144 -25477 29779 43876 -23885 -55943 14086 61514 -1269 -58155 -9933 47879 18048
475A8048m9855J1295L3490L743j1797j2794j2558J4920L5199j0257n3071R01O3565
$$ 18048 -31807 -20512 12978 16721 4924 -7870 -20428 -5508 29691 19434 -33637 -32736 30829
488C0829J0736o5501k1209N9551K8089m7210k9048L1350K3980j5039j2992R48
$$ 30829 41565 -23936 -45145 14406 42495 -4715 -33763 -2413 21567 6528 -6464 -5516
500e516j778Q862J7924j3812l2807J3760M3750j0183m9815N018M9590r7m4102
$$ -5516 -7294 1568 19492 5680 -27127 -13367 30383 20200 -29615 -24597 24993 24896 -19206
513a9206k945L4545K796k2674O41J0750o708j81J4461p654k2017J2454K8323j4365
$$ -19206 -22151 12394 15190 -7484 -6843 3907 -2801 -2982 11479 3825 -18192 -5738 22585 8220
527H220l1720J4325L1826j3268k8659J2374K2731j2473j5245J3723P248j6209
$$ 8220 -23500 -9175 22651 9383 -19276 -6902 15829 3356 -11889 1834 9082 -7127
539g127l30J9053n188k1598Q673K2875j0603k2147J1374J9099j1787j3890J2685
$$ -7127 -7457 11596 6408 -15190 -6517 16358 5755 -16392 -5018 14081 2294 -11596 1089
552A089P575j4207r13J7000n027k0097R388K3148j1708k4906J1960K4650j0675
$$ 1089 8664 -5543 -6456 10544 5517 -14580 -5192 17956 6248 -18658 -6698 17952 7277
565G277k1880Q511J6486o872r022O121J73p108Q525R784j5964j3979K1014J8497
$$ 7277 -14603 -6092 10394 3522 -5500 621 794 -6314 2211 11995 -3969 -17948 3066 21563
579B1563k2899k2266K1554K4354j7519k3291J1860J9251n756j2001Q79K530J958
$$ 21563 -1336 -23602 -2048 22306 4787 -18504 -6644 12607 6851 -5150 -4271 -1741 217
592B17P839j972j7637p28K5248N454k9637j1074K9794J5965k6258j9014J9568
$$ 217 8056 6084 -11553 -12281 12967 18421 -11216 -22290 7504 23469 -2789 -21803 -2235
605b235J8830j1255j5201K766Q447M152P65q492j0668R616K0051p403k7040K929
$$ -2235 16595 5340 -9861 -7095 1352 5504 6269 -2223 -12891 -3275 16776 9373 -17667 -14738
619a4738L0648K801l0149q107K5771J1863j8381j2868R288J0579j51n521p539
$$ -14738 15910 18711 -11438 -19545 6226 18089 -292 -13160 -3872 6707 6556 1035 -6504
632f504k007J2567J0315j4540j8158J3130K4001r186k6750L787K5921J790k1607
$$ -6504 -8511 4056 14371 -169 -18327 -5197 18804 9618 -17132 -13345 12576 14366 -7241
645g241n950J4553Q122o056p343k298M039R471J316j4151p629J6012J3364j4832
$$ -7241 -13191 1362 9484 3428 -3915 -6213 -2174 7297 8613 -5538 -13167 2845 16209 1377
659A377j7692J1359J9444o662j8588J829J4697K085r078m302K393M320M182k242
$$ 1377 -16315 -4956 14488 7826 -10762 -8933 5764 7849 -1229 -5531 -3138 1182 5364 3122
673C122r709j031J3134N209j4246q903J3254J1647j0500j2456O786J1330k870
$$ 3122 -6587 -7618 5516 10725 -3521 -12424 830 12477 1977 -10479 -3693 7637 4767
686D767q422k01M130K062P30k506n328J290Q892P95j1065l413J1372N596j0188
$$ 4767 -3655 -3856 274 2336 3066 560 -4768 -3478 5414 6209 -4856 -8269 3103 8699 -1489
701a489o955P795P066m868n802K100L559L3l32j157k772J259N551l27p447r83
$$ -1489 -8444 -649 6417 1549 -4253 -2153 1406 1439 1107 -50 -2822 -1563 3988 3661 -3786 -4769
717d769Q252K409p886l487O474L885m746l500K793K115j187k92pj849L74L776
$$ -4769 3483 5892 -1994 -5481 993 4878 132 -3368 -575 1540 353 61 54 -1795 -1421 2355
733B355j38n208n05N961J391n917j961N262K378m062k103K837J309j655J4P86
$$ 2355 2217 -2991 -3496 2465 3856 -2061 -4022 1240 3618 -444 -2547 290 1599 -56 -42 744
749G44j460m50K864M91l979q54M499J198m585j583M080J589l466j260K657M27
$$ 744 -716 -1166 1698 2189 -1790 -2644 1855 3053 -1532 -3115 965 2554 -912 -2172 485 912
765I12j945O27J554j683j351K708J563l347j706L683J879l475j745L111J274k551
$$ 912 -1033 -406 1148 -535 -1886 822 2385 -962 -2668 1015 2894 -581 -2326 785 2059 -492
781d92n79K124n01j893J632J875k924k117L693K460m128k966M083K988l549k712
$$ -492 -1071 1053 552 -1341 291 2166 -758 -2875 818 3278 -850 -3816 267 3255 -294 -3006
797c006K839K003k041n98J329r68q73K769J052m342j551N621K342o111l186N918
$$ -3006 -167 1836 -205 -803 526 -442 -1315 1454 2506 -1836 -3387 2234 4576 -1535 -4721 1197
813A197L606m992l758L677L007k175j624O67l66K20K689o89m963L55O854N07q046
$$ 1197 4803 -189 -3947 -270 2737 562 -1062 -395 -761 -541 2148 1459 -3504 -3149 3705 4212 -3834
830c834j572Q264K751p532l323N994L419l741k589J532R40N39J397k050m100K700
$$ -3834 -5406 2858 5609 -1923 -5246 748 4167 426 -2163 -631 309 848 2245 195 -3905 -1205
846a205O599k583q645J690R702m90r780q31Q633J639o464k017L881J276q81J86
$$ -1205 5394 2811 -5834 -4144 5558 5068 -4712 -5543 3090 4729 -1735 -3752 129 1405 524 710
862G10j744k204L719M726m740o974M917Q809m327r543L220R297j950p931Q59N621
$$ 710 -1034 -3238 481 5207 467 -6507 -1590 7219 2892 -6651 -3431 5866 3916 -4015 -3156 2465
878B465l57k889M68p2j447K787K760m953m427O298N826o740o876O531P184n658
$$ 2465 2108 -781 -313 -385 -1832 955 3715 -1238 -5665 633 6459 -281 -7157 -626 6558 900
894I00o705M786N362l687l383L065R73k602J609K571l884k860N771L140o981l443
$$ 900 -5805 -1019 4343 656 -2727 338 1311 -1291 318 2889 -995 -3855 1916 5056 -1925 -5368
910e368P531L386p687l007P245K089o628r03N855o30n009K105M269l587l384M821
$$ -5368 2163 5549 -2138 -5145 2100 4189 -2439 -3342 2513 1883 -3126 -1021 3248 -339 -3723 1098
926A098K610n646j556O238L87o374Q58O461k138o376L371O241m422o025N117N459
$$ 1098 3708 -1938 -3494 2744 3131 -3243 -2385 4076 1938 -4438 -1067 5174 752 -5273 -156 5303
942E303n403m835N346L631m963k085M344l1l727K324L366m774l141O924L371q570
$$ 5303 -100 -4935 411 4042 -921 -3006 1338 1307 -2420 -96 3270 -1504 -4645 2279 5650 -2920
958b920l775R596M218r499m417Q709M107o909l210M729J468k487J062L39m063
$$ -2920 -6695 2901 7119 -2380 -6797 1912 6019 -890 -4100 629 2097 -390 672 1011 -3052
973c052J028P201j744j0012J552J1944o99j2824n70J2282J736j0410k341P435
$$ -3052 -2024 5177 3433 -6579 -5027 6917 6218 -6606 -7176 5106 6842 -3568 -5909 1526
987A526K197l732j031P1j197L333M203n753p370P004J0388o915j2609N699J3446
$$ 1526 3723 -9 -1040 -969 -2166 1167 5370 -383 -7753 -749 9639 2724 -9885 -4186 9260
1002I260l723j2817J500J0500K72o890j360K370J215K337J24o612k502R844N380
$$ 9260 5537 -7280 -5780 4720 4992 -1898 -3258 -888 327 2664 2788 -3824 -6326 3518 8898
1017H898j1559q228J1705J0439j0196j1359P758J0744m686q454J728M971M18m20
$$ 8898 -2661 -10889 816 11255 1059 -10300 -2542 8202 3516 -4938 -3210 1761 2179 1759
1031A759j473m460J311Q759q8j2004j982J3667M211j3831o036J2302O818r425
$$ 1759 286 -4174 -2863 5896 5808 -6196 -8178 5489 9700 -4131 -10167 2135 8953 -472
1045d72o596O070M915k617k000k76j691K356N622l163r147L057J1768j883j3174
$$ -472 -7068 -998 3917 1300 -700 -976 -2667 -311 5311 2148 -6999 -3942 7826 5943 -7231
1060g231M05J3081J051j1639j853Q827J812n526r09K078j024J018L447l377o065
$$ -7231 -6826 6255 7306 -4333 -6186 2641 4453 -1073 -1982 96 -928 90 3537 160 -5905
1075e905M692Q286n097r844M857J0296m052r642L370P968k713n577K719K743l060
$$ -5905 -1213 7073 1976 -7868 -3011 7285 3233 -6409 -3039 4929 2216 -3361 -642 2101 -959
1090i59M1L881k435m892M293N698n370o389N894O344n972n688N692M362n469k659
$$ -959 -918 2963 528 -4364 -71 5627 257 -6132 -238 6106 134 -5554 138 4500 -969 -3628
1106c628N318O65n283J267N380k865n436M095N341m826m751N028M073n181k593
$$ -3628 1690 2355 -2928 -1661 3719 854 -4582 -487 4854 28 -4723 305 4378 -803 -3396
1121c396N141Q28n038J139N123l143n324M620N653n722n866O046N660n823m999
$$ -3396 1745 2573 -2465 -1326 3797 654 -4670 -50 5603 -119 -5985 61 5721 -102 -5101
1136e101N123L675m127j782L213p49k473L368K343n794k628P902L242r001m058
$$ -5101 22 3697 -430 -2212 1001 252 -2221 1147 3490 -2304 -4932 2970 6212 -2789 -6847
1151f847R231M684q346m815O698M156m545k739K227L51j39K456j268n557J736
$$ -6847 2384 7068 -1278 -6093 605 4761 216 -2523 -296 55 -84 2372 1104 -4453 -2717
1166b717Q368j514j0379M14J1390R76j1068k236R493L037o815k973L545J991r3
$$ -2717 5651 4137 -6242 -5828 5562 6538 -4530 -6766 2727 5764 -1051 -4024 -479 1512 1419
1181A419J10k864k777M857N845n815q572N526J0583m376j1388K524J0730o60q768
$$ 1419 1529 -1335 -4112 745 6590 775 -7797 -2271 8312 3936 -7452 -4928 5802 5142 -3626
1196c626r06N684J601j911j336j989M6N308K021p681m447Q852O881q649q558P342
$$ -3626 -4532 1152 2753 842 -494 -2483 -2437 2871 4892 -2789 -7236 1616 8497 -152 -8710 -1368
1212a368R227n132q609K744O745m93l922j068L93J557L406j245o688K6Q839J835
$$ -1368 7859 2727 -5882 -3138 3607 3114 -808 -1876 -1483 74 3480 2235 -4453 -4427 4412 6247
1228F247j0005l716R752N164q410n800O178N378l572l836J145J456Q94J484j921
$$ 6247 -3758 -7474 2278 7442 -968 -6768 -590 4788 1216 -2620 -1475 -19 875 2359 438
1243D38m444K161O963j563q697N17R412O32q998j517P428K029n420j709K877O54
$$ 438 -4006 -1845 5118 3555 -5142 -4625 4787 5419 -3579 -5096 2332 4361 -1059 -2768 109 763
1259G63o12R42j284k897K549M707k952o247K905P075k319p123J703O373j119m835
$$ 763 151 1093 -191 -3088 -539 4168 1216 -5031 -2126 4949 2630 -4493 -2790 3583 2464 -2371
1275b371P77L097r80j026J641q77k526K137L599l058m412L347M855l354m693K904
$$ -2371 -1594 1503 523 -503 1138 261 -2265 -128 3471 413 -3999 -652 4203 849 -3844 -940
1291i40M041k639k806K228J529k373Q3K657j453l170K705L568l275l743L344L855
$$ -940 3101 462 -2344 -116 1413 -960 -877 1780 327 -2843 -138 3430 155 -3588 -244 3611
1307C611l180l347K835K299k348j025K140m92k185J988K396l286k815M009L246
$$ 3611 431 -2916 -81 2218 -130 -1155 985 493 -1692 296 2692 -594 -3409 600 3846
1322C846m306l568M008L503l311k974K377J971j494m33Q03j236m82L058N62m448
$$ 3846 -460 -4028 -20 3483 172 -2802 -425 1546 52 -381 422 -814 -1296 1762 2324 -2124
1338b124j007N374J781n732k438N273K858m237k897K964K126j347r54j32p10J057
$$ -2124 -3131 2243 4024 -1708 -4146 1127 3985 -252 -3149 -185 1941 594 -360 -492 -1202 -145
1354a45K521j497m349J358N692o71o412j91O371J152n536j791M093K019k097j661
$$ -145 2376 879 -3470 -2112 3580 2909 -3503 -3694 2677 3829 -1707 -3498 595 2614 517 -1144
1370a144K15N07J658R78k901k729L477M294l314n545K543O060j362n953J71M892
$$ -1144 -929 -422 1236 2214 -687 -3416 61 4355 1041 -4504 -1961 4099 2737 -3216 -3045 1847
1386A847Q26l262j377J195J329R34o00k738o16M086K018m563l392M374M433l535
$$ 1847 2673 -589 -1966 -771 558 1492 892 -1846 -2462 1624 3642 -921 -4313 61 4494 959
1402I59m801K301M630j055l617j59K011J000k09j154j774P48L432m7m518j029
$$ 959 -3842 -1541 3089 2034 -1583 -1742 269 1269 1060 -94 -1868 -1120 2312 2265 -2253 -3282
1418c282M846K100m590k877L801L118k504k893J253K013J06q40r21n73J274K201
$$ -3282 1564 3664 -926 -3803 -2 3116 612 -2281 -1028 985 1091 251 -670 -1243 31 2232
1434B232j230l398P00M148Q7m375q61M016J397l212j612J932J359p57p26l23k08
$$ 2232 1002 -2396 -1696 2452 2539 -1836 -2697 1319 2716 -496 -2108 -176 1183 426 -300 -623 -831
1451h31J040J319j382k328J379L077r78l418N12L296K2k746l53J973L75q96j94
$$ -831 209 1528 146 -2182 -803 2274 1296 -2122 -1610 1686 1708 -1038 -1391 582 957 61 -133
1468a33j0l74P79J059j413j651J508K187j427k497J059K409o32k044K72J418j15
$$ -133 -143 -517 262 1321 -92 -1743 -235 1952 525 -1972 -913 1496 864 -1180 -908 510 395
1485C95o03J85k23l40Q81R26j419j326J636J675j450j971J188J940q26j545L89
$$ 395 -208 -23 -246 -586 295 1221 -198 -1524 112 1787 337 -1634 -446 1494 668 -877 -488
1502d88R72j39k55Om92k90J226N57j621j033J725J436j648j651J336J611p29j418
$$ -488 484 345 90 96 -396 -686 540 1097 -524 -1557 168 1604 -44 -1695 -359 1252 523 -895
1520h95L64Q82J8r9k72n48K32J170J56j838m24K076P92j958j268J682J393j145
$$ -895 -531 351 369 270 -2 -550 -318 852 1008 -830 -1254 822 1614 -344 -1612 70 1463 318
1538C18j367N18Q93J04l86m88l59O28J112n70j631K78K018K05k067o67J926J017
$$ 318 -1049 -531 362 466 80 -408 -767 -139 973 403 -1228 -950 1068 1273 -794 -1461 465 1482
1556A482j398j134P66J021j29o02m62J9Q21N92r07j211O95J678l46k011p6J851
$$ 1482 84 -1050 -284 737 608 6 -456 -437 384 976 69 -1142 -447 1231 885 -1126 -1202 649
1574F49N85j619q83J173R34m62q41j95N03O95J04r32p59J101J255q09j662M92
$$ 649 1234 -385 -1268 -95 839 377 -464 -659 -156 539 643 -289 -1048 53 1308 499 -1163 -671
1592f71J738N5j734m44J349O82p46p98O4O00M78k75q43k92J030Q38j033j280P96
$$ -671 1067 1122 -612 -1056 293 975 229 -569 -505 95 573 298 -545 -837 193 1031 -2 -1282 -486
1611d86J569m61j495L1J367M04j037n23M79O01J4l30n50K5R13L51j018q90R56
$$ -486 1083 622 -873 -842 525 929 -108 -631 -152 449 463 133 -417 -392 521 872 -146 -1036 -80
1630h0J182p28j360L15J355l2j142k22O91M31k12l78k58J35O47K04r11m58J078
$$ -80 1102 374 -986 -671 684 652 -490 -712 -21 410 198 -180 -438 -303 344 548 -363 -821 257
1649B57P83r19j085O93J232m58j079J09Q88N3m64k05l2K16L16K6p52k92R23N07
$$ 257 1040 121 -964 -271 961 503 -576 -467 421 474 10 -195 -227 -11 305 331 -421 -713 210 717
1669G17r15p67Q62R02p31q40N49P60l35m64J73K20j22K06Q1m51j99P75K84r78
$$ 717 -198 -965 -103 799 68 -772 -223 537 202 -262 -89 131 9 215 296 -155 -354 421 705 -273
1689b73m31J001L79q52n03P88L84o35k17M27J6l46K28K89m01l02O70K24p48k60
$$ -273 -704 297 676 -176 -679 109 493 -142 -359 68 84 -262 -34 255 -146 -448 222 446 -302 -562
1709e62R45J68q21r0Q07k5p60K36N69l34n88N71M39o62m79P73L72p58l32P58R2
$$ -562 383 551 -270 -360 447 422 -338 -102 467 133 -455 116 555 -107 -586 187 559 -199 -531 227 319
1730C19o58N3N40k91m38N35M19q38k77J011M33j102m06J026M80j038l14Q13K00
$$ 319 -339 -286 254 -37 -475 60 479 -359 -636 375 808 -294 -700 326 806 -232 -546 267 467
1749D67o04L3K68k45j40O68j27r79K02J207j45j462K9J497M3j427o3J196P4p34
$$ 467 -137 -104 164 -81 -221 447 320 -659 -457 750 605 -857 -828 669 712 -715 -778 418 492 -242
1769b42o4L21j07P8N19m76p79O75J192p50j539P74J663o41j617M88J253j33j109
$$ -242 -306 15 -92 -14 505 29 -750 -75 1117 367 -1172 -398 1265 624 -993 -505 748 615 -494
1788d94R3N36k4m5J36n08m39R94P14j277j028J394J312j330j391J194J316q26
$$ -494 -401 135 111 66 202 -306 -745 249 963 -314 -1342 52 1364 34 -1357 -163 1153 327
1806C27j116N74P06k89j59J23m01j81R81J60j325m21J623O68j815p45J643Q28
$$ 327 -789 -215 491 202 43 166 -235 -416 565 725 -600 -1021 602 1270 -545 -1290 353 1181
1824A181j478p33J111N30p80o4L68l42j18P84K9j250P9J605k5j766K8J705O5j491
$$ 1181 -297 -1030 81 611 -169 -233 135 -207 -325 459 488 -762 -683 922 897 -869 -841 864 929 -562
1844e62j51J311n3j010K67O26n12l31P75L2j137K06J278k77j424M72J383n38j276
$$ -562 -713 598 545 -465 -198 428 -84 -415 360 392 -745 -539 739 462 -962 -490 893 355 -921
1863i21O55J005o52p92Q78N05j023j98J202o3j279K72J290m83j200N87J065p28
$$ -921 -266 739 87 -705 173 678 -345 -543 659 596 -683 -411 879 396 -804 -217 848 120
1881A20p96Q06M59j091p8J226j42j379L45J488m95j541N13J536n27j315O10Q91
$$ 120 -676 130 589 -502 -580 646 504 -875 -530 958 463 -1078 -565 971 444 -871 -261 630
1899F30n50m37O41j5q05N18J053r78j323J272J474j376j598J263J632j124j449
$$ 630 80 -357 284 269 -536 -18 1035 57 -1266 6 1480 104 -1494 -231 1401 277 -1172
1916a172Q20J090o28n18M15j75l22R07L70j461n74J932R30k242j094K160J345
$$ -1172 -352 738 110 -408 7 -168 -490 417 787 -674 -1248 684 1614 -628 -1722 438 1783
1933A783j916j332J495J128q94p98M21J22RN51k26j437L66K092l30k480p7K739
$$ 1783 -133 -1465 30 1158 264 -534 -113 9 18 569 343 -1094 -728 1364 1034 -1446 -1523 1216
1951A216M17k653o87K272P66j600o78Q71L97r7J28n39p70R77J555j225k131J101
$$ 1216 1633 -1020 -1707 565 1331 -269 -947 -76 321 224 352 -187 -957 20 1575 350 -1781 -680
1969f80K572q24k799M88K641j67k078j33J240K61n17k1m27l12J221Q30j725j349
$$ -680 1892 1068 -1731 -1243 1398 1231 -847 -980 260 521 4 -17 -444 -756 465 1295 -430 -1779
1987a779J925J889j858k265J692K197j182k001Q13J484m02p72J79n2j51Q12L95
$$ -1779 146 2035 177 -2088 -396 1801 619 -1382 -569 915 513 -259 -80 -132 -283 529 924
2004I24j660n72K107Q71k348j209K306J335k013j329J582J021j033o05O75m5k90
$$ 924 -736 -1308 799 1670 -678 -1887 419 1754 -259 -1588 -6 1015 -18 -623 52 7 -283
2021b83P86M8j405l5J933J87k260k59K312L54k147l91J789L01j418R5Q32m53m68
$$ -283 503 551 -854 -889 1044 1231 -1029 -1288 1024 1378 -769 -1160 629 930 -488 -393 439 -14 -482
2040d82R28R9j472J64J771k29j970K19K049l40j751L70J483m68j033P16N32r55
$$ -482 446 545 -927 -763 1008 779 -1191 -972 1077 737 -1014 -644 839 371 -662 54 586 -369
2058c69j31J383k59j639M55J753m42j880M66J767n18j447M28J114p11m99R34q2
$$ -369 -500 883 624 -1015 -560 1193 751 -1129 -663 1104 586 -861 -433 681 -30 -529 405 323
2076C23j231N56J544r10j778J028K018r81k024Q78J810o31j417N46Q00n67M2N28
$$ 323 -908 -352 1192 282 -1496 -468 1550 569 -1455 -577 1233 602 -815 -269 531 -36 6 534
2094E34o89q09J382J056j794j523J944J829j884j964J520J930j134j511O58Q87
$$ 534 -155 -964 418 1474 -320 -1843 101 1930 46 -1918 -398 1532 398 -1113 -455 432
2110D32l23L1P8q73MJ656K05k300n77K701J043k769j377K459J677k056j446J212
$$ 432 109 140 218 -655 -651 1005 1210 -1090 -1667 1034 2077 -692 -2069 390 2067 11 -1435 -223
2128b23J068m77m91j29m84O57J340p17k231N19K916k11l219k32L111O71k674r21
$$ -223 845 368 -123 -252 -736 -79 1261 544 -1687 -1168 1748 1537 -1682 -1914 1197 1868 -806 -1727
2146a727J967R57j039n75O5J6Q08P05j355j551J531K360j475k921J170L082o17
$$ -1727 240 1197 158 -417 -352 -336 472 1177 -178 -1729 -198 2162 687 -2234 -1064 2018 1401
2163A401k982J28K412J99j545l97N55K87M36J70j400o94J996J348k216j981K169
$$ 1401 -1581 -1453 959 1158 -387 -784 -229 58 494 664 -736 -1430 566 1914 -302 -2283 -114
2180a14K445j831k498J312K273p38j662J90Q34J25O4j14j086j40J946N11k479
$$ -114 2331 500 -1998 -686 1587 849 -813 -623 211 336 400 286 -800 -940 1006 1517 -962
2197i62r52K590J374k478j621K098J542j472j225Q68P09l27%N7r08K09J643j87
$$ -962 -1914 676 2050 -428 -2049 49 1591 119 -1106 -238 471 144 144 201 -707 -498 1145 958
2215I58k170n5K510L05k499n66K340N54j854n20J269J25n90K63J35r58K50J492
$$ 958 -1212 -1267 1243 1548 -951 -1517 823 1377 -477 -997 272 397 -193 70 205 -753 -503 989
2233I89l68j974M07K294k90k273R2K102m7j593P2J065k86m31O65j08j127N45J525
$$ 989 621 -1353 -946 1348 1058 -1215 -1123 979 932 -661 -589 476 190 -241 424 316 -811 -266 1259
2252A259p00j943P03K162o78k115N03J684k94j292L81O51n33N4P75o34j165J075
$$ 1259 559 -1384 -681 1481 803 -1312 -809 875 581 -711 -330 321 -212 -158 617 -17 -1182 -107
2270a07J555j210j908J256K097j052k064Q04J749n57j088L46L17k70M45M06j173
$$ -107 1448 238 -1670 -414 1683 631 -1433 -629 1120 563 -525 -179 138 -132 313 719 -454
2287d54p92J708J194k029j583K051J800j702j880J254J629p43j158K52M55M6N07
$$ -454 -1246 462 1656 -373 -1956 95 1895 193 -1687 -433 1196 453 -705 -453 2 48 555
2304E55j29j376K2K132L08k549p32K613J180k420j538J989J450j219j205M74O74
$$ 555 426 -950 -928 1204 1512 -1037 -1769 844 2024 -396 -1934 55 1505 286 -919 -445 229
2321B29J75J09o64j029P86J919o90k566L30L007J34l032n05K578R07j835j026
$$ 229 404 513 -151 -1180 -394 1525 835 -1731 -1401 1606 1740 -1292 -1797 781 1688 -147 -1173
2338a173R81Q52j27k89p63m35J327J184j511k069J449K670j081k930N57K789n6
$$ -1173 -192 660 533 244 -519 -954 373 1557 46 -2023 -574 2096 1015 -1915 -1358 1431 1375
2355A375k303l84J479O42n76m73m70J43J266N43j828j221K120J804j976k207J540
$$ 1375 -928 -1312 167 809 233 -240 -710 -567 699 1242 -586 -1807 313 2117 141 -2066 -526
2372e26K436j066k152M09J664J9q44l45o0L11R93q0j722m31K230R19k406j318
$$ -526 1910 844 -1308 -899 765 784 -60 -405 -465 -154 839 759 -963 -1394 836 1755 -651 -1969
2390a969K170J613j734j680J180J410m88q70M3R4K39P86l70j445J76J982K06k323
$$ -1969 201 1814 80 -1600 -420 990 502 -368 -325 -231 8 794 424 -1021 -845 1137 1343 -980
2408i80n41K258Q64k002r87J440Q58p40o33K32L2K30O16m74j355N92J773k79k119
$$ -980 -1521 737 1601 -401 -1388 52 910 170 -463 -231 -199 31 647 173 -1182 -590 1183 904 -1215
2427a215Q9K190J41j957l25J497L80r27j77K83j18K24O53p16j135Q40J607p66
$$ -1215 -1126 1064 1205 -752 -1077 420 800 -127 -304 -21 -139 85 738 22 -1113 -273 1334 568
2445E68j926N50J970l16j753kJ393M3p20nM1j98N62O16j000j036J222J511j228
$$ 568 -1358 -808 1162 846 -907 -909 484 527 -193 -198 -157 -355 207 823 -177 -1213 9 1520 292
2464B92j746R73J840o12j709L08J234j1o39j75l8l7P86K40j256o78J660J045j698
$$ 292 -1454 -481 1359 747 -962 -654 580 569 -70 -245 -283 -320 466 706 -550 -1228 432 1477 -221
2483b21j406J420J789j155j677O61J272r9p12k12kL60Q04k39j583M1J965M56k215
$$ -221 -1627 -207 1582 427 -1250 -589 683 584 -128 -340 -342 18 822 583 -1000 -959 1006 1462 -753
2502g53q74K027J270j625j441J017J353m05r44j55J87O01N54p64j319O92J969
$$ -753 -1627 400 1670 45 -1396 -379 974 569 -375 -530 -343 258 812 48 -1271 -579 1390
2519A390l64k294j27K388N64k069r32J520J179q72r59J00N16O02J9j048p72J168
$$ 1390 1026 -1268 -1395 993 1557 -512 -1444 76 1255 383 -576 -476 40 642 661 -387 -1159 9
2537IJ564j117k068P69K294l30k317j36J918O07j361o51M49O93L13l20r86l00
$$ 9 1573 456 -1612 -843 1451 1121 -1196 -1332 586 1193 -168 -819 -370 323 636 316 -670 -970
2555i70J412R93j567j498J466J897j054k076N54J824M5j464l87O95N77O9m53q27
$$ -970 442 1435 -132 -1630 -164 1733 679 -1397 -843 981 1026 -438 -825 -130 447 516 63 -764
2573g64J90J289K66j648q18J809J244j527j531J105J596n65j396J39Q70K85k26
$$ -764 -574 715 981 -667 -1485 324 1568 41 -1490 -385 1211 646 -750 -611 259 544 318
2590C18m62n29M22J168j82j568k42J813N54j704r25J352J174r78j104M61P60L1
$$ 318 -144 -673 -251 917 735 -833 -1075 738 1292 -412 -1337 15 1189 211 -893 -432 328 359
2608C59k67l97l47N30R90m36j395K06J735K4j636m94J577O63j165o77N96M99j4
$$ 359 92 -305 -652 -122 868 432 -963 -757 978 1002 -634 -1128 449 1112 -53 -730 -134 365 351
2627C51k63l53k27N31P88o70j159N01J519k96j660k9J499K92j077m27O04M02q4
$$ 351 88 -265 -492 39 827 157 -1002 -501 1018 722 -938 -967 532 824 -253 -680 -76 326 242
2646B42k26k82k10P21O75r45j045Q78J335o69j484L63J368J04j164l52P55L28
$$ 242 16 -266 -476 245 920 -25 -1070 -192 1143 474 -1010 -647 721 825 -339 -691 64 392
2664C92j31k71m67J5R17K90j126p13J155J189j030j383O86J407k62j235p2P79
$$ 392 261 -10 -477 -462 455 745 -381 -1094 61 1250 220 -1163 -477 930 668 -567 -639 140
2682A40L44j75m11l89L10Q99k2j339l63J478P32j300j188J120J212o39j158J74
$$ 140 484 309 -102 -491 -181 718 696 -643 -1006 472 1204 -96 -1284 -164 1048 409 -749 -575
2700e75Q34K34l28n84j44N49Q31m48j284J72J614K50j660n96J373R80j045j070
$$ -575 259 493 165 -419 -563 -14 817 369 -915 -743 871 1121 -539 -1135 238 1218 173 -897
2718h97N46R05K4n96m77L2P24N65p98j066O07J404k48j653j13J620M80j321p52
$$ -897 -351 554 578 -18 -495 -463 261 826 28 -1038 -431 973 725 -928 -1041 579 1059 -262 -1014
2737a014R06P70l18o08k88L96O86J43q53p56R33J199p49j492L36J620l6j456l26
$$ -1014 -108 662 344 -264 -552 -156 530 673 -180 -936 -3 1196 447 -1045 -709 911 875 -581 -907
2756i07J083N85o35n92k0N06N45k34q71l19J128Q23j109j125R00J238m27j364
$$ -907 176 761 126 -466 -486 20 565 331 -540 -859 269 1092 -17 -1142 -242 996 569 -795
2774g95J57J052K81o81m80J52N19L04k77p83k0J071L65j193p51J101R89q44j024
$$ -795 -638 414 695 14 -466 -314 205 509 232 -551 -571 500 865 -328 -1079 22 1011 167 -857
2793h57M43R59j17o65k32L20M10J38l31p46L49J002K6j226k56J170N94j033p91
$$ -857 -414 545 428 -237 -469 -149 261 399 68 -678 -329 673 699 -527 -783 387 981 -52 -843
2812h43O85P60k47o44j28L75L70N3n48m48L89R08k25j130L2J123L39j106m82P58
$$ -843 -158 602 355 -289 -417 -42 328 381 -167 -615 -226 682 457 -673 -641 482 821 -285 -767 -9
2832iO36m41n16L4L27L24L1n54l99N83P58m04j103K19J168O5j159k94Q61M63n16
$$ -9 627 186 -330 -296 31 355 386 -168 -567 16 774 370 -733 -514 654 719 -440 -734 127 590 74
2853G4n02P0M39K36r7n75k36P22O48p31q90N52J055k65j109P1Q82K64n70m48K41
$$ 74 -428 -358 81 317 220 -355 -591 131 779 48 -842 -290 765 500 -609 -538 344 608 38 -410 -169
2874a69L92J88k41n71o7Q19L29q53o97P40R02m82r73J77R06J01o98k91L00M22
$$ -169 223 411 170 -401 -468 351 680 -173 -870 -130 772 290 -683 -506 400 501 -197 -488 -188 234
2894B34J95m63m58J90Q31P0r77l74R63O78p46q91M87Q53j58p34j86M57M29j09
$$ 234 429 -34 -492 -302 529 599 -378 -752 211 889 143 -748 -261 592 434 -300 -486 -29 400 291
2914B91m71l44L81P32k35r04q2J039K89q72o20P40P22m01o54O9M40L12k41m78
$$ 291 -180 -524 -143 589 354 -550 -632 407 696 -176 -796 -56 666 265 -389 -320 120 432 191 -287
2934b87j57N19N83m89q55K36J045R5j134l32R62M68o07n60K31N04J78l97m02j
$$ -287 -444 75 658 169 -686 -450 595 690 -444 -776 186 654 47 -513 -282 222 400 3 -399 -400
2954d00O19L52o24o83N90Q42l10r34K7Q80K25o58m50M02M65l6l71l12J58N56J05
$$ -400 219 571 -53 -736 -146 696 386 -548 -521 359 584 -74 -524 -122 343 307 -64 -376 -218 338 443
2975D43p38l46O74O36n18q05K36Q96l5p51k15N45L08j47l18k33K62N09o2o43k18
$$ 443 -295 -641 33 669 151 -654 -418 478 443 -308 -523 22 330 183 -135 -368 -106 403 341 -302 -520
2996e20P19M40o49o28N05O61j88o88l5M78K09j38l51j38L10M01k07o28M6O71K64
$$ -520 199 639 -10 -638 -133 528 340 -348 -383 95 304 166 -185 -323 -13 388 181 -447 -401 270 534
3017E34p28m64O31N21l05n82P8N28Q3j98l48L0L41K71l30m51Q9O96O2p57k37N82
$$ 534 -194 -658 -27 494 189 -393 -315 213 296 98 -250 -220 121 392 62 -389 -300 396 458 -299 -536 46
3039D6M66m68n25K00N27mk63l27J24M66J68l94n27L40O98j72p53o0P13K46m72
$$ 46 512 44 -481 -281 246 242 -21 -348 -224 242 410 16 -511 -171 527 355 -398 -458 255 501 29
3060B9m00K98L86p1l32k63K19M07M2m37l52M10N89k91p08J20O59J32o10k79M34
$$ 29 -371 -73 313 242 -90 -353 -134 273 315 -122 -474 -64 525 234 -474 -354 305 437 -173 -452 -18
3081a8L41j34l68r6K15L40L8n57j95O07M09n23n66K19P68r3o91p7M21K77j97l32
$$ -18 323 189 -179 -275 -60 280 318 -239 -434 173 582 59 -507 -288 480 387 -304 -381 40 317 120 -212
3103b12n5K95L27j73n52oN74L34o68m80N57N34k64o19J13N21J16l13k94P4L53
$$ -212 -267 28 355 182 -370 -376 198 532 -136 -616 -59 475 211 -408 -295 226 342 29 -265 -191 162
3124A62K06k73n15K13N73M8p04k22O12L85m48m74K20M60l3l04j88J35L67J20m13
$$ 162 368 95 -420 -207 366 414 -290 -512 100 485 37 -437 -217 243 210 -94 -282 -147 220 340 -73
3145g3l10K67N59j20o82o0O79K30n48l14K92M16j18m09n3J87L36n3m09j59L48
$$ -73 -383 -116 443 323 -359 -419 260 490 -58 -372 -80 336 218 -191 -244 -57 279 226 -183 -342 6
3166FM03k56o72K26O03L2n53j80L80L42j80l46J5K02K72j04l96q3L54L74m39l98
$$ 6 409 153 -519 -293 310 342 -211 -391 -11 331 151 -195 -180 22 294 190 -206 -289 65 439 0 -398
3188c98K75M30K0n71m8L35L03k87l09Q1K25J54j01m14K9M44J94m41l74M21M74
$$ -398 -123 307 327 -244 -292 43 346 59 -250 -169 56 210 109 -305 -276 168 362 -79 -453 -32 442
3209D42k77n30J28M75Q0k95k33J11L01N9j87l76J51M14P0m99k35M72L07l38m13
$$ 442 165 -365 -237 238 318 23 -210 -99 202 261 74 -302 -151 263 333 -166 -401 71 378 40 -373
3230c73J50M20L7l26k04K02K68M3l10k11K68L98j34m65q9M79K78m30l73L31L17
$$ -373 -223 197 234 -92 -296 -94 174 217 -93 -304 -36 362 228 -237 -326 153 431 1 -372 -41 276
3251B76q9l16r8K10K12p4k44j78K81L79k60m49M5N99M7m86k60L78L38j74k90n4
$$ 276 187 -129 -227 -17 195 121 -123 -301 -20 359 99 -350 -305 294 341 -145 -405 -27 311 137 -153 -207
3273b07K48J93q6l25q4M00K60l63l78K14M46n4m81r9M13J97k34k86L8K77J67k45
$$ -207 41 234 148 -177 -261 139 399 36 -342 -128 318 264 -217 -316 97 294 60 -226 -188 89 256 11
3295A1k89J12L43J74n10j69L12L77j91m33kM25J09k80k33J49K70J10k77l09J60
$$ 11 -278 -166 177 351 -159 -328 -16 361 170 -263 -265 160 269 -11 -244 -95 175 285 8 -301 -141
3316a41M07q7l44j68L48L57l18l85J32L69J8l23j54K14K79rl21r7K28K82j07l86
$$ -141 266 179 -165 -333 15 372 54 -331 -199 170 188 -135 -289 -75 204 195 -126 -223 5 287 180 -206
3338b06k3L65K30l74k93K43L65r0l31q7K33J52j03k56q1L23K31k52l36J10M02
$$ -206 -229 136 366 -8 -301 -58 307 217 -114 -201 32 184 81 -175 -256 67 298 46 -290 -180 222
3359B22L4l91j76L42K69k14k56l3L01J04j11k84j4L18J79l06k54K07L32k1m04
$$ 222 256 -135 -311 31 300 86 -170 -203 98 202 91 -193 -207 111 290 -16 -270 -63 269 248 -156
$$ [...]
8191b6
##END NTUPLES=NMR FID
##END=
