##TITLE=1H_LY-DMAA.Per.2.15
 CDCl3
 8 sc, 
 10.03.2022
##JCAMPDX= 6.0         $$ Bruker NMR JCAMP-DX V2.0
##DATA TYPE= NMR FID
##DATA CLASS= NTUPLES
##ORIGIN= UXNMR, Bruker Analytische Messtechnik GmbH
##OWNER= root
$$ XWIN-NMR		Version 3.5
$$ Thu Mar 10 11:17:21 2022 Russian Standard Time (UT+4h)  she@DPX200
##.OBSERVE FREQUENCY= 200.131346
##.OBSERVE NUCLEUS= ^1H
##.DELAY= (6, 6)
##.ACQUISITION MODE= SIMULTANEOUS
##.ACQUISITION SCHEME= undefined
##.AVERAGES= 8
##.DIGITISER RES= 18
##SPECTROMETER/DATA SYSTEM= spect
##.PULSE SEQUENCE= zg30
##.SOLVENT NAME= CDCl3
##.SHIFT REFERENCE= (INTERNAL, CDCl3, 0, 15.7039)
##AUDIT TRAIL= $$ (NUMBER, WHEN, WHO, WHERE, WHAT)
$$ ##TITLE= Audit trail, XWIN-NMR		Version 3.5
$$ ##JCAMPDX= 5.01
$$ ##ORIGIN= Bruker BioSpin GmbH
$$ ##OWNER= she
$$ F:/spectra/data/she/nmr/H-F/1/audita.txt
$$ ##AUDIT TRAIL=  $$ (NUMBER, WHEN, WHO, WHERE, WHAT)
(   1,<2022-03-10 11:15:57.01 +0400>,<she>,<DPX200>,
      <created by zg, POWCHK disabled, PULCHK disabled
       configuration hash MD5:
       00 E9 B6 7A A2 85 ED C7 34 08 36 98 17 FE 4E 26
       data hash MD5: 16K
       50 49 48 8B 0E 20 81 F8 30 63 69 C7 70 14 29 B6>)
$$ ##END=
$$ 
$$ hash MD5
$$ 90 AE 81 14 82 53 93 90 C6 EF 5C 53 12 99 9C 62
##$RELAX= 
##$RELAX= 
##$RELAX= 
##$RELAX= 
##$RELAX= 
##$RELAX= 
$$ Bruker specific parameters
$$ --------------------------
##$DU= <F:/spectra>
##$EXPNO= 1
##$NAME= <H-F>
##$PROCNO= 1
##$TYPE= <nmr>
##$USER= <she>
##$AMP= (0..31)
100 100 100 100 100 100 100 100 100 100 100 100 100 100 100 100 100 100 
100 100 100 100 100 100 100 100 100 100 100 100 100 100 
##$AQSEQ= 0
##$AQ_mod= 1
##$AUNM= <au_zg>
##$AUTOPOS= <>
##$BF1= 200.13
##$BF2= 200.13
##$BF3= 200.13
##$BF4= 200.13
##$BF5= 200.13
##$BF6= 200.13
##$BF7= 200.13
##$BF8= 200.13
##$BYTORDA= 1
##$CFDGTYP= 0
##$CFRGTYP= 5
##$CHEMSTR= <none>
##$CNST= (0..31)
1 1 145 1 1 1 1 1 1 1 1 1 1 1 1 1 1 1 1 1 1 1 1 1 1 1 1 1 1 1 1 1 
##$CPDPRG= <>
##$CPDPRG1= <>
##$CPDPRG2= <>
##$CPDPRG3= <>
##$CPDPRG4= <mlev>
##$CPDPRG5= <mlev>
##$CPDPRG6= <mlev>
##$CPDPRG7= <mlev>
##$CPDPRG8= <mlev>
##$CPDPRGB= <>
##$CPDPRGT= <>
##$D= (0..31)
0 1.2 0 0 0 0 0 0 0 0.06 0 0.03 0 0 0 0 0.0002 0 0 0 0 0 0 0 0 0 0 0 0 
0 0 0 
##$DATE= 1646896556
##$DBL= (0..7)
120 120 120 120 120 120 120 120 
##$DBP= (0..7)
150 150 150 150 150 150 150 150 
##$DBP07= 0
##$DBPNAM0= <>
##$DBPNAM1= <>
##$DBPNAM2= <>
##$DBPNAM3= <>
##$DBPNAM4= <>
##$DBPNAM5= <>
##$DBPNAM6= <>
##$DBPNAM7= <>
##$DBPOAL= (0..7)
0.5 0.5 0.5 0.5 0.5 0.5 0.5 0.5 
##$DBPOFFS= (0..7)
0 0 0 0 0 0 0 0 
##$DE= 6
##$DECBNUC= <off>
##$DECIM= 32
##$DECNUC= <off>
##$DECSTAT= 4
##$DIGMOD= 1
##$DIGTYP= 9
##$DL= (0..7)
0 120 120 120 120 120 120 120 
##$DP= (0..7)
150 150 150 150 150 150 150 150 
##$DP07= 0
##$DPNAME0= <>
##$DPNAME1= <>
##$DPNAME2= <>
##$DPNAME3= <>
##$DPNAME4= <>
##$DPNAME5= <>
##$DPNAME6= <>
##$DPNAME7= <>
##$DPOAL= (0..7)
0.5 0.5 0.5 0.5 0.5 0.5 0.5 0.5 
##$DPOFFS= (0..7)
0 0 0 0 0 0 0 0 
##$DQDMODE= 0
##$DR= 18
##$DS= 0
$$ [...]
##$SUBNAM2= <"">
##$SUBNAM3= <"">
##$SUBNAM4= <"">
##$SUBNAM5= <"">
##$SUBNAM6= <"">
##$SUBNAM7= <"">
##$SUBNAM8= <"">
##$SUBNAM9= <"">
##$SW= 18.0517287032376
##$SWIBOX= (0..15)
0 0 2 0 0 0 0 0 0 0 0 0 0 0 0 0 
##$SW_h= 3612.71676300578
##$TD= 16384
##$TD0= 1
##$TE= 0
##$TE2= 300
##$TE3= 300
##$TEG= 300
##$TL= (0..7)
0 120 120 120 120 120 120 120 
##$TP= (0..7)
150 150 150 150 150 150 150 150 
##$TP07= 0
##$TPNAME0= <>
##$TPNAME1= <>
##$TPNAME2= <>
##$TPNAME3= <>
##$TPNAME4= <>
##$TPNAME5= <>
##$TPNAME6= <>
##$TPNAME7= <>
##$TPOAL= (0..7)
0.5 0.5 0.5 0.5 0.5 0.5 0.5 0.5 
##$TPOFFS= (0..7)
0 0 0 0 0 0 0 0 
##$TUNHIN= 0
##$TUNHOUT= 0
##$TUNXOUT= 0
##$USERA1= <user>
##$USERA2= <user>
##$USERA3= <user>
##$USERA4= <user>
##$USERA5= <user>
##$V9= 5
##$VALIST= <valist>
##$VCLIST= <CCCCCCCCCCCCCCC>
##$VD= 0
##$VDLIST= <DDDDDDDDDDDDDDD>
##$VPLIST= <PPPPPPPPPPPPPPP>
##$VTLIST= <TTTTTTTTTTTTTTT>
##$WBST= 1024
##$WBSW= 4
##$XGAIN= (0..3)
0 0 0 0 
##$XL= 0
##$YL= 0
##$YMAX_a= 815791
##$YMIN_a= -726416
##$ZGOPTNS= <>
##$ZL1= 120
##$ZL2= 120
##$ZL3= 120
##$ZL4= 120
##$ABSF1= 10
##$ABSF2= 0
##$ABSG= 5
##$ABSL= 3
##$ALPHA= 0
##$AQORDER= 0
##$ASSFAC= 0
##$ASSFACI= 0
##$ASSFACX= 0
##$ASSWID= 0
##$AUNMP= <proc_1d>
##$AZFE= 0.1
##$AZFW= 0.1
##$BCFW= 1
##$BC_mod= 2
##$BYTORDP= 1
##$COROFFS= 0
##$CY= 11.3945322036743
##$DATMOD= 1
##$DC= 2
##$DFILT= <>
##$DTYPP= 0
##$F1P= 2.36226072786647
##$F2P= -0.459571619588291
##$FCOR= 0.5
##$FTSIZE= 0
##$FT_mod= 4
##$GAMMA= 1
##$GB= 0.15
##$INTBC= 1
##$INTSCL= 1
##$ISEN= 128
##$LB= 0.24
##$LEV0= 0
##$LPBIN= 0
##$MAXI= 10000
##$MC2= 0
##$MEAN= 0
##$ME_mod= 0
##$MI= 1.114404
##$NCOEF= 0
##$NC_proc= 0
##$NLEV= 6
##$NOISF1= 3.799351
##$NOISF2= 2.8
##$NSP= 1
##$NTH_PI= 0
##$NZP= 0
##$OFFSET= 15.70392
##$PC= 1
##$PHC0= -16750.83
##$PHC1= 15.60078
##$PH_mod= 1
##$PKNL= yes
##$PPARMOD= 0
##$PSCAL= 0
##$PSIGN= 0
##$REVERSE= no
##$SF= 200.130013532006
##$SI= 16384
##$SIGF1= 3
##$SIGF2= 2
##$SINO= 400
##$SIOLD= 16384
##$SREGLST= <1H.CDCl3>
##$SSB= 0
##$STSI= 0
##$STSR= 0
##$SW_p= 3612.71676300578
##$SYMM= 0
##$S_DEV= 0
##$TDeff= 0
##$TDoff= 0
##$TI= <>
##$TILT= no
##$TM1= 0
##$TM2= 0
##$TOPLEV= 0
##$USERP1= <user>
##$USERP2= <user>
##$USERP3= <user>
##$USERP4= <user>
##$USERP5= <user>
##$WDW= 1
##$XDIM= 8192
##$YMAX_p= 0
##$YMIN_p= 0
$$ End of Bruker specific parameters
$$ ---------------------------------
##NTUPLES= NMR FID
##VAR_NAME=  TIME,          FID/REAL,        FID/IMAG
##SYMBOL=    X,             R,               I
##VAR_TYPE=  INDEPENDENT,   DEPENDENT,       DEPENDENT
##VAR_FORM=  AFFN,          ASDF,            ASDF
##VAR_DIM=   8192,          8192,            8192
##UNITS=     SECONDS,       ARBITRARY UNITS, ARBITRARY UNITS
##FACTOR=    0.0002768,     1,               1
##FIRST=     0,             0,               0
##LAST=      2.2672688,     0,               0
##MIN=       0,             -726416,         0
##MAX=       2.2672688,     815791,          0
$$ Real data points
##PAGE= N=1
##DATA TABLE= (X++(R..R)), XYDATA
$$ plain form
0 0 0 0 0 0 0 0 0 -8 8 -8 8 -16 16 -24 26 -32 40 -54 64 -73 89 -113 129 -153 179 -211 243 -280 324 -375
30 -375 426 -485 554 -627 708 -796 893 -999 1117 -1247 1389 -1540 1709 -1894 2097 -2312
46 -2312 2554 -2813 3101 -3416 3763 -4148 4571 -5044 5574 -6172 6852 -7633 8544 -9617
60 -9617 10904 -12486 14483 -17087 20647 -25831 34089 -49318 86578 -367135 -170671 815791
72 815791 83808 -629137 -166487 500478 166677 -261186 -232583 57803 258452 175014
82 175014 -318968 -345850 346992 497094 -379009 -567632 372102 595373 -350967 -552571
92 -552571 286238 474362 -201554 -354544 83503 226285 42652 -94093 -180218 -19951
102 -19951 301452 109926 -405056 -165625 470524 189661 -495965 -181892 473496 153033
$$ packed form
0@%%%%%%%qJ6j6J6k4L2m0N0n8P2r4J18j37J62k02K42k82L32l90M54n23O04o99
30c75Q01r11J039j181J335j504J689j892K116k364K636k929L249l603L991m409
46b312M866n367N914o517P179p911Q719r615J0618j1746J3024j4485J6177j8161
60i617K0521k3390K6969l1570L7734m6478N9920q3407J35896m53713J96464R86462
72H15791p31983p12945M62650O66965l33801m27863K8603K90386K00649q3438
82A75014m93982k6882O92842J50102q76103j88623R39734K23271r46340k01604
92e52571Q38809J88124o75916j52990M38047J42782j83633j36745q6125J60267
102a9951L21403j91526n14982K39431O36149k80863o85626L14073O55388l20463
$$ plain form
112 153033 -407671 -109556 304723 65931 -175023 -26969 35731 4390 99204 1254 -213358
123 -213358 12049 295062 -39874 -336166 75833 333149 -113753 -291383 142893 215869
133 215869 -159799 -121821 157202 20900 -135950 70492 96603 -141051 -44500 181500
143 181500 -12675 -186023 69033 157343 -114394 -97964 145540 19633 -156702 67928
153 67928 149123 -150621 -124712 216796 88151 -257393 -47501 264803 8650 -238946
163 -238946 19141 180129 -33027 -97429 28107 -1095 -6352 102884 -29200 -196050 72503
174 72503 270593 -114241 -317097 147719 333344 -162329 -316603 154585 272750 -119855
184 -119855 -206808 60565 128770 18774 -47779 -110075 -28267 201416 90944 -283365 -138000
$$ packed form
112A53033n60704K98115M14279k38792k40954J48054O2700l1341R4814r7950k14612
123b13358K25407K83013l34936k96292M11999K57316m46902j77630M34276P2976
133B15869l75668L7978K79023j36302j56850K06442K6111k37654R6551K26000
143A81500j94175j73348K55056Q8310k71737J6430K43504j25907j76335K24630
153F7928Q1195k99744K5909L41508j28645l45544K09892L12304k56153k47596
163b38946K58087J60988k13156o4402J25536k9202n257J09236j32084j66850K68553
174G2503J98090l84834k02856M64816J85625m95673j54274M71188J18165l92605
184a19855q6953K67373O8205j09996o6553o2296Q1808K29683j10472l74309J45365
$$ plain form
195 -138000 342716 165991 -373015 -178099 366977 176250 -324569 -165699 248463 151568
205 151568 -144776 -137246 25330 127260 99800 -120355 -215672 117941 312734 -115527 -379808
216 -379808 110679 411483 -98703 -405470 75915 363252 -41068 -291938 -7822 198681
226 198681 66330 -96207 -132088 -6025 196797 96404 -254164 -167681 296017 214535
236 214535 -315603 -234801 309434 231771 -274080 -208274 213239 172741 -129950 -130565 33544
247 33544 90000 67312 -55724 -162077 30781 240132 -17068 -294653 11622 318672
257 318672 -13192 -312274 15651 275267 -16661 -214313 11513 136459 1473 -51143
267 -51143 -22447 -30666 50871 101316 -81972 -151364 113323 178311 -138128 -178958 153423
$$ packed form
195a38000M80716j76725n39006J94916N45076j90727n00819J58870M14162r6895
205A51568k96344P530J62576J01930k7460k20155r5317L33613J94793m28261k64281
216c79808M90487L00804n10186l06767M81385K87337m04320k50870K84116K06503
226A98681j32351j62537l5881J26063K02822j00393l50568Q6483M63698q1482
236B14535n30138Q0802N44235p7663n05851O5806M21513m0498l02691o15J64109
247C3544N6456k2688j23036j06353J92858K09351k57200k77585L06275L07050
257C18672l31864k99082L27925K59616k91928j97652K25826J24946j34986n2616
267e1143K8696q219Q1537N0445j83288o9392K64687O4988l16439m0830L32381
$$ plain form
278 153423 156659 -155035 -115664 141378 63206 -113544 -8699 72802 -40965 -25210 76825
289 76825 -24978 -95426 69991 93353 -105160 -72442 125150 36222 -127632 9869 113380
300 113380 -57597 -83876 101085 45364 -132381 -2309 148578 -36610 -146030 66227
310 66227 126115 -80910 -91186 77649 45536 -56938 4024 19974 -53065 26518 94209
321 94209 -77729 -125252 124392 142113 -160272 -145302 178579 135928 -175010 -116458 148901
332 148901 91952 -100565 -64795 36021 40771 39357 -21148 -115799 8419 185319 -2013
343 -2013 -239462 13 271234 -235 -277703 -1860 256624 7920 -211940 -22159
353 -22159 147218 43697 -70899 -72744 -9480 106149 85513 -139516 -149326 168246 196531
$$ packed form
278A53423L236l11694L9371K57042p8172j76750J04845Q1501j13767J5755J02035
289G6825j01803p0448J65417K3362j98513L2718J97592q8928j63854J37501J03511
300A13380j70977k6279J84961n5721j77745J30072J50887j85188j09420K12257
310F6227N9888k07025j0276J68835l2113j02474O0962J5950p3039P9583O7691
321I4209j71938m7523K49644J7721l02385J4970L23881m2651l10938N8552K65359
332A48901n6949j92517L5770J00816M750j414o0505r4651J24218J76900j87332
343b013k37449K39475K71221k71469k77468K75843K58484k48704k19860J89781
353b2159J69377j03521j14596j845O3264J15629k0636k25029r810L17572K8285
$$ plain form
364 196531 -185773 -222575 189134 228593 -173442 -214904 139211 186270 -87051 -147100 21223
375 21223 102972 52044 -59396 -126460 19697 192452 11760 -244401 -35226 274773 49653
386 49653 -281125 -57602 261335 60989 -217601 -62549 154789 65675 -78815 -70886 -1070
397 -1070 80143 77646 -91190 -141641 103448 188193 -112884 -212574 116787 213854 -112430
408 -112430 -194272 97128 157111 -71295 -109628 34688 57091 8205 -7661 -54702 -33823
419 -33823 98781 62848 -135529 -77387 160571 77982 -169778 -65654 162998 45543 -139242
430 -139242 -20667 102629 -2825 -56382 21583 6737 -32111 40279 32678 -79482 -23782
441 -23782 105323 6075 -116141 16103 109585 -40634 -88535 62193 55474 -77898 -15857
$$ packed form
364A96531l82304l6802M11709L9459m02035m1462L54115M7059k73321o0049J68323
375B1223Q1749n0928j11440o7064J46157J72755j80692k56161K09175L09999k25120
386D9653l30778K23523L18937k00346k78590J55052K17338q9114j44490P929O9816
397a070Q1213k497j68836n0451K45089Q4745l01077r9690L29361R7067l26284
408a12430q1842K91400N9983k28406l8333J44316K2403m8886j5866m7041K0879
419c3823J32604l5933j98377N8142K37958q2589k47760J04124K28652j17455j84785
430a39242J18575J23296j05454n3557P7965j4846l8848P2390p601j12160N5700
441b3782J29105r9248j22216J32244R3482j50219m7901J50728o719j33372O2041
$$ plain form
452 -15857 84979 -24026 -81853 58817 69674 -82222 -49071 91770 24277 -84229 2318
463 2318 61574 -25812 -25827 43884 -17717 -54404 63173 56208 -104781 -51258 135566 40386
475 40386 -152435 -27999 151310 16082 -133023 -8558 98465 7033 -51790 -12453 -1497
486 -1497 24748 56299 -41119 -105438 59762 145003 -75593 -169748 86021 178736 -86785
497 -86785 -170959 76072 148365 -53407 -114680 19030 73296 23292 -30431 -70750 -10896
508 -10896 116692 45352 -156762 -71497 184906 87650 -197235 -94527 191395 93951 -166149
519 -166149 -87898 124370 80009 -68630 -71545 5633 65536 59167 -61519 -118406 59845
530 59845 166212 -58914 -198273 56284 210880 -50613 -204540 38878 179619 -21244
$$ packed form
452a5857J00836j09005n7827J40670J0857j51896L3151J40841o7493j08506Q6547
463B318N9256q7386j5O9711o1601l6687J17577o965j60989N3523J86824r5180
475D0386j92821J24436J79309j35228j49105J24465J07023r1432n8823L9337J0956
486a497K6245L1551r7418o4319J65200Q5241k20596r4155K55769R2715k65521
497h6785q4174K47031P2293k01772o1273J33710N4266n0004n3723m0319N9854
508a0896J27588p1340k02114Q5265K56403r7256k84885J02708K85922r7444k60100
519a66149P8251K12268m4361j48639k915P7178N9903o369j20686n6887J78251
530E9845J06367k25126j39359K54557J54596k61493j53927K43418J40741k00863
$$ plain form
540 -21244 -140736 -3365 91827 32783 -39279 -65034 -11471 96976 55550 -124355 -88389
551 -88389 144392 108725 -152791 -114991 148941 109519 -130938 -94012 100497 72691 -59938
562 -59938 -49378 12770 27607 35493 -11150 -80785 464 116926 2776 -141203 -776
573 -776 150010 -5483 -143389 12783 122356 -18486 -89487 20893 50035 -17517 -7960
584 -7960 9134 -30140 4549 61015 -20921 -80163 38235 86359 -53622 -79615 64303 61172
596 61172 -69004 -35151 65973 4743 -56346 24150 40159 -48430 -20642 63679 -369 -68117
608 -68117 19405 60959 -33770 -42876 42087 17105 -42135 13757 35324 -44519 -21727 72013
620 72013 4696 -91663 13395 101464 -28862 -100101 38352 87470 -40161 -66038 32193
$$ packed form
540b1244j19492J37371R5192n9044p2062k5755N3563J08447m1426j79905L5966
551h8389K32781l5667k61516L7800K63932l9422k40457L6926J94509k7806j32629
562e9938J0560O2148J4837P886m6643o9635Q1249J16462j14150j43979J40427
573g76J50786j55493j37906J56172J09573j40842p1001J10380K9142o7552R557
584g960J7094l9274L4689N6466q1936n9242J18398M8124j39981k5993J43918l131
596F1172j30176L3853J01124o1230o1089Q0496J6009q8589K7788Q4321o4048o7748
608f8117Q7522M1554r4729r106Q4963k4982n9240N5892K1567p9843K2792R3740
620G2013o7317r6359J05058Q8069j30326p1239J38453M9118j27631k5877R8231
$$ plain form
631 32193 37701 -15746 -7001 -8541 -23309 36845 49460 -65605 -69105 90589 81141 -107256
643 -107256 -84738 113435 81616 -106226 -72470 86560 60357 -54972 -46712 15148 34102
654 34102 28940 -23670 -72664 15940 110667 -11169 -139547 7867 154975 -5433 -156377
665 -156377 1355 142796 5013 -116355 -15038 79731 28804 -36995 -45480 -6806 64235
676 64235 48067 -81819 -81778 96672 106137 -104932 -118704 105175 120009 -95537 -111054 75432
688 75432 93844 -46472 -72063 10072 48060 29405 -25568 -68774 5938 103039 8583 -128796
700 -128796 -18142 142885 23294 -143455 -24663 131010 24699 -106087 -23998 72464
710 72464 25075 -33005 -27707 -7050 32906 44064 -39637 -73883 46902 93610 -53310 -102139
$$ packed form
631C2193N508n3447Q745j540j4768O0154J2615j15065l500J59694r448j88397
643a07256K2518J98173l1819j87842L3756J59030k6203j15329Q260O1860J8954
654C4102n162n2610m8994Q8604R4727j21836j28378J47414J47108j60408j50944
665a56377J57732J41441j37783j21368J01317R4769n0927o5799q485L8674P1041
676F4235j6168j29886M1J78450R465k11069j3772K23879J4834k15546j5517J86486
688G5432J8412j40316k5591Q2135L7988j8655n4973m3206P4712R7101r4456j37379
700a28796J10654J61027j19591j66749J18792J55673j06311j30786Q2089R6462
710G2464m7389n8080N298K0657L9956J1158q3701l4246J20785M6708j46920m8829
$$ plain form
722 -102139 56573 98731 -55963 -85528 49713 64169 -38212 -38731 21277 12287 -740 11256
734 11256 -21258 -29083 42688 39599 -60069 -41446 71906 36018 -75570 -23948 71460 8681
746 8681 -59165 7722 40773 -22191 -18735 32162 -4428 -36695 24821 34236 -40500 -26218 48532
759 48532 13005 -48647 2711 40501 -18972 -25667 33642 6428 -44338 14719 50376 -33763
771 -33763 -50513 48619 45772 -55966 -36381 55098 24460 -45276 -11718 27456 -230 -3891
783 -3891 9380 -23236 -15556 49709 17630 -73018 -16880 89164 13620 -96626 -9944 93824
795 93824 7205 -80821 -6670 59290 9763 -31006 -15980 -138 25739 31530 -36746 -58966
807 -58966 47878 80290 -56566 -93384 60612 97226 -58775 -92565 49476 80010 -33563
$$ packed form
722a02139J58712M2158j54694k9565J35241J4456j02381n19O0008q990j3027J1996
734A1256l2514p825P1771l089r9668J8623J13352l5888j11588N1622R5408o2779
746H681o7846O6887L3051o2964L456N0897l6590l2267O1516R415p4736J4282P4750
759D8532l5527o1652N1358L7790n9473o695N9309k7214n0766N9057L5657q4139
771c3763j6750R9132k847j01738J9585R1479l0638o9736L3558L9174k7686l661
783c891J3271l2616P680O5265l2079r0648N6138J06044p5544j10246Q6682J03768
795I3824q6619q8026P4151O5960m9527m0769J5026J5842K5877N791o8276k2220
807e8966J06844L2412j36856l6818J53996L6614j56001l3790J42041L0534j13573
$$ plain form
818 -33563 -62441 11075 41327 15052 -20055 -42990 225 69239 16160 -90882 -28125 105451
830 105451 35804 -110489 -39077 105682 39778 -90475 -38175 66816 36430 -36516 -35214
841 -35214 2860 35005 30598 -36412 -60801 38200 84074 -40075 -99093 40037 103688 -37632
853 -37632 -98635 31186 84583 -20735 -63972 6309 39482 11263 -13882 -29956 -9182 48460
865 48460 28311 -63869 -41072 74834 47406 -79061 -47119 76261 41629 -66124 -32664
876 -32664 49333 21755 -28150 -11676 4208 3209 19200 1763 -40193 -3486 55913 1547
888 1547 -64911 2905 66419 -8508 -60142 14345 47593 -18256 -29981 19883 10427 -17938
900 -17938 9063 12916 -25399 -5221 36673 -4242 -41630 13634 39224 -22102 -30687 27659
$$ packed form
818c3563k8878P3516L0252k6275l5107k2935M3215O9014n3079j07042O2757J33576
830A05451o9647j46293P1412J44759o5904j30253N2300J04991l0386p2946J302
841c5214L8074L2145m407o7010k4389R9001M5874j24149n9018J39130O3651j41320
853c7632o1003J29821N3397j05318m3237P0281L3173k8219k5145j6074K0774N7642
865D8460k0149r2180K2797J15906k7428j26467L1942J23380l4632j07753L3460
876c2664Q1997k7578m9905J6474J5884r99J5991j7437m1956L6707N9399n4366
888A547o6458O7816O3514p4927n1634P4487L3248o5849j1725M9864r456k8365
900a7938K7001L853l8315K0178M1894m0915l7388N5264K5590o1326q585N8346
$$ plain form
912 27659 16702 -30105 -42 28468 -17327 -23473 32440 15764 -43111 -6711 48121 -1857
924 -1857 -46138 9037 37991 -12842 -24117 13297 6855 -9670 12069 2997 -30117 5877 45167
937 45167 -15460 -55724 23638 60200 -29184 -58932 30060 51799 -26242 -40352 16921 25728
949 25728 -3221 -9970 -13708 -5110 31999 18382 -49121 -28103 63205 34563 -71417 -36993
961 -36993 72989 36537 -66744 -33689 53188 29846 -33375 -25854 9138 22516 16408 -20608
973 -20608 -41279 19476 62051 -19320 -77176 18623 84583 -17206 -84092 13757 75875 -7624
985 -7624 -61070 -936 41785 12142 -19840 -24605 -1733 37722 21431 -49450 -37073 58605
997 58605 47694 -63415 -52941 62771 52640 -56613 -48264 44371 40453 -27509 -31160 7028
$$ packed form
912B7659j0957m6807L0063K8510m5795o146N5913j6676n8875L6400N4832m9978
924a857m4281N5175K8954n0833j1275L7414o442j6525K1739r072l3114L5994L9290
937D5167o0627m0264P9362L6562q9384k9748Q8992K1739p8041j4110N7273Q807
949B5728k8949o749l738Q598L7109j3617o7503K1018R1308k8642j05980L4424
961c6993J09982l6452j03281L3055Q6877k3342o3221P521L4992J3378o108l7016
973b0608k0671O0755M2575q1371n7856R5799O5960j01789o6886R7849O2118q3499
985g624n3446O0134M2721k9643l1982m765K2872L9455j6291p0881J2377R5678
997E8605j0911j11109J0474J15712j0131j09253Q349R2635l918o7962l651L8188
$$ plain form
1009 7028 21476 14578 -12858 -35477 6188 53253 -1695 -65764 -440 72031 1255 -70848
1021 -70848 -902 62946 960 -48987 -1595 31006 3896 -11063 -7827 -8418 13094 25085
1033 25085 -19309 -37477 24950 44097 -29800 -45047 32024 40163 -31610 -31120 27791 19176 -20853
1046 -20853 -6263 11416 -5550 -407 15181 -10443 -20765 20513 22459 -27628 -19725 31650
1058 31650 13595 -31413 -4987 27193 -4763 -19657 13843 9418 -21411 1388 25799 -11820
1070 -11820 -26868 19840 24134 -24519 -18352 24779 10257 -20529 -924 12398 -8114 -1151
1082 -1151 16056 -11258 -21626 23569 24625 -33319 -24642 39508 22464 -40745 -18516 36626
1094 36626 13769 -27686 -9277 14288 5524 1324 -3465 -18128 2615 33546 -3285 -46307
$$ packed form
1009G028J4448o898k7436k2619M1665M7065n4948o4069O5324P2471p0776p2103
1021g0848O9946O3848o1986m9947M7392L2601k7110j4959L236n91K1512J1991
1033B5085m4394j8168O2427J9147p3897j5247P7071Q139p1773M90N8911q615m0029
1046b0853J4590J7679j6966N143J5588k5624j0322M1278J946n0087P903N1375
1058C1650j8055m5008K6426L2180l1956j4894L3500m425l0829K2799K4411l7619
1070a1820j5048M6708M294m8653O167M3131j4522l0786J9605J3322k0512O963
1082a151J7207k7314j0368M5195J056n7944Q677O4150j7044o3209K2229N5142
1094C6626k2857m1455J8409K3565q764m200m789j4663K0743L0931l6831m3022
$$ plain form
1106 -46307 4468 54661 -5654 -57613 5938 55081 -4516 -47107 1213 34951 4558 -19672
1118 -19672 -11969 3210 20784 12749 -29619 -26818 37353 37431 -42789 -43979 44500 45988 -42163
1131 -42163 -44067 35041 38515 -23744 -30920 9080 22131 7643 -13250 -24643 5615 40219
1143 40219 735 -52326 -5049 59990 7905 -61954 -9462 58267 10523 -49075 -11571 35481
1155 35481 13186 -19083 -15634 1377 18678 15364 -22404 -30064 25659 40577 -28083 -46748
1167 -46748 28764 47850 -27027 -44251 22819 36865 -15710 -26550 6643 15248 4162 -3810
1179 -3810 -15178 -5715 25677 13040 -34029 -17048 39303 17839 -40896 -15979 38158 11924
1191 11924 -31691 -7123 21818 2078 -10169 1679 -2404 -4009 13883 4309 -23136 -2614
$$ packed form
1106d6307N0775N0193o0315n1959O3551M9143n9597m2591M8320L3738l0393k4230
1118a9672P703J5179J7574q035m2368K801O4171P8q0220j190Q8479J488q8151
1131d2163j904P9108L474o2259p176M0000J3051j4488k0893j1393L0258L4604
1143D0219l9484n3061M7277O5039n2085o9859N2492O7729m7744n9598L7504M7052
1155C5481k2295l2269L449J7011J7301l314l7768p660N5723J4918o8660j8665
1167d6748P5512J9086p4877j7224O7070J4046n2575j0840L3193Q605j1086p972
1179c810j1368R463L1392j2637m7069J6981N6351k1464n8735K4917N4137k6234
1191A1924m3615K4568K8941j9740j2247J1848m083j605J7892r574k7445K0522
$$ plain form
1203 -2614 29314 -335 -31019 4291 28952 -8050 -22998 11172 14384 -12747 -4180 12722
1215 12722 -6017 -10930 15043 7556 -21483 -3503 24335 -1105 -23729 4990 18971 -8039
1227 -8039 -11561 9367 1861 -8968 8627 6986 -18351 -3685 26362 -17 -31123 3839 32467
1240 32467 -6358 -29777 7445 23767 -6322 -14827 3023 4378 2160 6416 -8641 -16476 15456
1253 15456 24397 -21699 -29908 25924 32064 -27681 -31318 25900 27899 -20649 -22695 12284 16371
1266 16371 -1322 -9593 -10797 3622 23171 1723 -33809 -5630 41982 8518 -46300 -10122
1278 -10122 46174 11261 -41609 -11994 32797 12852 -21003 -14080 6989 15520 7324 -17531
1290 -17531 -20920 19281 32014 -20630 -39759 20991 43516 -19635 -42840 16541 38603 -11180
$$ packed form
1203b614L1928k9649l0684L5310K4661l7002j4948L4170L212k7131Q567J6902
1215A2722j8739m913K5973p487k9039J7980K7838k5440k2624K8719J3981k7010
1227h039l522K0928p506j0829J7595j641k5337J4666L0047k6379l1106L4962K8628
1240C2467l8825k3419L7222J6322l0089q505J7850J355k218M256j5057p835L1932
1253A5456Q941m6096q209N5832O140n9745l637N7218J999m8548k046L4979M087
1266A6371j7693q271j204J4419J9549k1448l5532K8179M7612l3464n4818L6178
1278a0122N6296l4913n2870K9615M4791j9945l3855O923K1069Q531q196k4855
1290a7531l389M0201J2733n2644j9129O0750K2525o3151k3205N9381K2062m9783
$$ plain form
1302 -11180 -30860 4170 21398 4574 -10988 -13926 960 23122 7690 -31080 -14323 36719
1314 36719 18376 -39403 -20260 38358 19707 -33893 -17941 25896 15045 -15512 -12026 3589
1326 3589 9362 8565 -7285 -19546 6198 28395 -5574 -33890 5702 35896 -5690 -33899 5596
1339 5596 28654 -4742 -20602 2936 11007 -357 -1215 -3196 -7979 7005 15135 -10983 -19742
1352 -19742 14214 21066 -16479 -19545 17020 15239 -15740 -9112 12721 2233 -8078 4481 2528
1365 2528 -10000 3436 13723 -8718 -15008 12762 13933 -14902 -10756 14671 5894 -12260 -258
1378 -258 7641 -5531 -1944 10408 -4474 -14218 10411 16136 -15100 -16337 17635 14793 -17603
1391 -17603 -11714 14943 7899 -9584 -3629 2510 -287 5889 3669 -14237 -6082 21603 7398
$$ packed form
1302a1180j9680L5030J7228j6824j5562k938J4886K2162j5432l8770J6757N1042
1314C6719j8343n7779J9143N8618j8651n3600J5952M3837j0851l0557L486J5615
1326C589N773p97j5850j2261K5744K2197l3969k8316L9592L0194m1586k8209L9495
1339E596K3058l3396j5860K3538Q071j1364q58j981m783J4984Q130k6118q759
1352a9742L3956O852l7545l066L6565j781l0979O628K1833j0488j0311J2559j953
1365B528j2528J3436J0287k2441o290K7770J171k8835M146K5427q777j8154J2002
1378b58P899j3172L587J2352j4882r744K4629N725l1236j237L3972k842l2396
1391a7603N889K6657p044j7483N955O139k797O176k220j7906Q155K7685j4205
$$ plain form
1404 7398 -26978 -7827 29505 7530 -29043 -7044 25098 6478 -18440 -6529 9327 7047
1416 7047 787 -8428 -11051 10126 20300 -11850 -27513 13294 32122 -13561 -33527 12571 32021
1429 32021 -9666 -27522 5164 21119 1027 -13230 -8187 4963 15579 2858 -22644 -9750
1441 -9750 28096 14843 -31576 -18277 32111 19686 -29786 -19526 24356 18049 -16422 -15790 6744
1454 6744 13284 3818 -10653 -14150 8488 23238 -6660 -29990 5291 33906 -3916 -34552 2578
1467 2578 31964 -862 -26428 -1564 18577 4395 -9697 -8036 413 11746 7963 -15478 -14898
1480 -14898 18394 19542 -20190 -21667 20375 21411 -18665 -18888 15117 14830 -9741 -9745 3409 4589
1494 4589 3452 14 -10137 -3633 15728 5888 -19733 -6743 21516 6117 -21012 -4647 18080
$$ packed form
1404G398l4376J9151L7332k1975l6573K1999L2142j8620k4918J1911J5856k280
1416G047o260r215k623K1177J0174l2150j5663M0807J8828m5683j9966M6098J9450
1429C2021m1687j7856L2686J5955k0092j4257N043J3150J0616j2721k5502J2894
1441i750L7846j3253m6419J3299N0388j2425m9472J0260M3882o307l4471O32K2534
1454F744O540r466j4471l497K2638J4750k9898k3330L5281K8615l7822l0636L7130
1467B578K9386l2826k5566K4864K0141j4182j4092J661Q449J1333l783k3441N80
1480a4898L3292J148l9732j477M2042J036m0076k23L4005k87k4571mJ3154J180
1494D589j137l438j0151O504J9361r840k5621J2990K8259j5399k7129J6365K2727
$$ plain form
1507 18080 2376 -13333 -214 7049 -1721 -396 3019 -6021 -3390 11446 2897 -15014 -1575
1520 -1575 16527 -92 -15477 2046 12419 -3493 -7351 4629 1372 -4908 4813 4361 -10688
1533 -10688 -3246 14910 1547 -17482 -46 17467 -1365 -15416 2013 11124 -1820 -5365
1545 -5365 767 -1202 1168 7858 -3319 -13632 5801 18083 -7626 -20527 8713 20978 -8539
1558 -8539 -19287 6818 15717 -3741 -10821 -589 5103 5667 553 -11163 -5967 16053 10281 -20022
1572 -20022 -13443 22129 15152 -22228 -15553 19923 14886 -15288 -13259 8856 11412 -963 -9207
1585 -9207 -7210 7326 15268 -5579 -22002 4160 26833 -2756 -29151 1365 28691 318
1597 318 -25721 -2519 20254 5042 -13210 -8006 5214 11086 2690 -14088 -9938 16526 15888
$$ packed form
1507A8080j5704j5709J3119P263q770J325L415r040K631J4836q549j7911J3439
1520a575J8102j6619j5385J7523J0373j5912l858J1980l257o280R721m52j5049
1533a0688P442J8156j3363j9029J7436J7513j8832j4051J7429R111j2944l545
1545e365O132j969K370O690j1177j0313J9433J2282k5709j2901K9240J2265k9517
1558h539j0748K6105Q899j9458p080J0232N692N64n114j1716N196K2020n772l0303
1572b0022O579L5572o977l7380O675L5476n037l0174K029K2115K556j2375q244
1585i207J997J4536P942k0847j6423K6162K2673k9589k6395L0516K7326k8373
1597C18k6039K3202K2773j5212j8252N204J3220N872q396j6778M150K6464o38
$$ plain form
1610 15888 -18013 -19731 18212 21648 -16792 -21325 13885 19344 -9403 -15898 3807 11594 2522
1623 2522 -7011 -8974 2571 14785 1034 -19600 -3994 22555 5646 -23594 -6593 22236
1635 22236 6622 -18837 -6262 13633 5783 -7135 -5197 282 4978 6515 -5035 -12174 5329
1648 5329 16309 -5524 -18279 5672 18263 -5460 -16076 4785 12218 -3517 -7356 1599 1883
1661 1883 623 3165 -3143 -7452 5400 10330 -7317 -11591 8394 11135 -8530 -9152 7682 6011
1675 6011 -5668 -2038 3082 -1833 216 5530 -3400 -8245 6322 9961 -8359 -10223 9166 9253
1689 9253 -8783 -7252 6704 4437 -3595 -1363 -611 -1800 4967 4468 -9233 -6515 12670 7779
1703 7779 -14727 -8195 15268 7969 -13602 -7127 10459 6096 -5636 -4951 -35 3960 5994 -3116
$$ packed form
1610A5888l3901j718L7943L436l8440m533L5210N459k8747o495J9705P787r072
1623B522r533j963J1545J2214j3751k0634J5606K6549j6909k9240J7001K8829
1635B2236j5614k5459J2575J9895p850j2918J938N479M696J537j1550p139J7503
1648E329J0980k1833j2755K3951J2591k3723j0616K0861P433j5735l839Q955K84
1661A883j260K542o308m309J2852M930j7647m274J9985K741j9665o22J6834j671
1675F011j1679L630N120m915K049N314q930m845J4567L639j8320j864J9389Q7
1689I253j8036J531J3956k267q032K232P52j189O767m99j3701K718J9185m891
1703G779k2506O532K3463p299k1571O475J7586m363j1732O85M916L995K034r110
$$ plain form
1717 -3116 -11739 2481 16334 -1947 -19546 1255 20745 -538 -19956 -767 17153 2363
1729 2363 -12893 -4438 7340 6789 -1345 -9309 -4580 11694 9941 -13514 -14121 14550 16979 -14356
1743 -14356 -18048 12838 17703 -9874 -15867 5582 13131 -445 -9704 -5332 5886 10933 -2426
1756 -2426 -15987 -814 19644 3329 -21687 -5290 21697 6647 -19699 -7488 15869 8008
1768 8008 -10496 -8228 4286 8405 2255 -8438 -8262 8401 13390 -8160 -16948 7628 18785
1781 18785 -6770 -18739 5178 16852 -3229 -13628 566 9324 2196 -4681 -5338 -45 8312
1794 8312 4063 -10793 -7262 12479 9282 -13044 -9935 12572 9564 -10599 -8061 7695 6004
1807 6004 -3946 -3512 -303 1223 4492 762 -8133 -2259 10790 2931 -12274 -3052 12054 2499
$$ packed form
1717c116q623J4220J3853j8281j7599K0801J9490k1283j9418J9189J7920j4790
1729B363j5256Q455J1778n51q134p964M729J6274j753k3455o07K8671K429l1335
1743a4356l692L0886M865k7577n993K1449P549j3576r259M372J1218N047j3359
1756b426j3561J5173K0458j6315k5016J6397K6987j5050k6346J2211K3357p861
1768H008j8504K268J2514M119o150j0693J76J6663M989k1550q788K4576J1157
1781A8785k5555j1969K3917J1674k0081j0399J4194Q758p128o877o57N293Q357
1794H312m249j4856L531J9741l197k2326L109K2507l008k0163K538J5756j691
1807F004r950M34L209J526L269l730q895N874J3049p859j5205R222J5106r555
$$ plain form
1821 2499 -10534 -1794 7655 825 -3975 135 -212 -744 4321 1173 -7631 -1146 10140 1163 -11108
1836 -11108 -747 10710 462 -8819 -306 5805 295 -2056 -629 -2172 1059 6075 -1763 -9499
1850 -9499 2258 11838 -2705 -12962 2650 12566 -2136 -10801 958 7888 930 -4127 -2973
1863 -2973 139 5386 3980 -7598 -7495 9419 10255 -10348 -11893 10339 12443 -9067 -11871 6600
1877 6600 10306 -3227 -8197 -983 5536 5410 -2861 -9703 227 13289 2012 -15911 -3902 17099
1891 17099 5353 -16652 -6381 14628 7157 -11194 -7531 6737 7911 -1483 -8063 -3750 8007
1904 8007 8776 -7884 -12844 7257 15706 -6414 -17155 4951 16850 -3164 -15216 665 12158
1917 12158 2164 -8334 -5069 3993 8050 385 -10498 -4153 12467 7380 -13407 -9361 13289
$$ packed form
1821B499j3033Q740R449o830m800M110l47n32N065l148q804O485J1286q977j2271
1836a1108J0361J1457j0248r281Q513O111n510k351J427j543L231N016p838p736
1850i499J1757R580j4543j0257J5612R916j4702q665J1759O930o958n057J154
1863b973L112N247j406j1578J03J6914Q36k0603j545K2232K104k1510k804J8471
1877F600L706j3533m970P214O519j26q271o842R930J3062j1277j7923J2009K1001
1891A7099j1746k2005J0271K1009p471j8351L663J4268J174r394o580M313J1757
1904H007P69j6660m960K0101Q449k2120j0741K2106J1899k0014j2052J5881J1493
1917A2158r994j0498L265R062M057p665j0883O345J6620n087k0787M046K2650
$$ plain form
1930 13289 10501 -11826 -10428 9376 9673 -5991 -8103 1907 6205 2295 -4349 -6440 2458 9916
1944 9916 -884 -12498 -427 13660 1270 -13676 -1987 12218 2401 -9533 -2695 6126 3047
1957 3047 -2174 -3252 -1698 3572 5373 -3820 -8122 4002 9825 -3883 -10263 3560 9482 -2886
1971 -2886 -7748 1773 5004 -497 -2028 -1150 -1294 2603 4073 -4057 -6205 5044 7468 -5490 -7644
1986 -7644 5206 6944 -4219 -5344 2629 3301 -477 -800 -2008 -1615 4317 3679 -6276 -5371 7629
2001 7629 6259 -8168 -6637 7600 6284 -6153 -5603 3672 4361 -677 -3073 -2735 1627 6149 -263
2016 -263 -8985 -908 11141 2038 -12101 -2814 11966 3598 -10380 -4114 7833 4743 -4329 -5235
2030 -5235 269 5505 3744 -5886 -7554 5877 10559 -5673 -12633 4831 13351 -3716 -12986 1957
$$ packed form
1930A3289k788k2327J398J9804K97j5664k112J0010M298l910o644k091Q898P458
1944I916j0800j1614J2071J4087j2390j4946J1689J4205r817j1934O838Q821l079
1957C047n221j078J554N270J801r193m302J2124N823j3708o380J3823N922j2368
1971b886m862R521L231n501j531Q78j44L897J470q130k148J1249K424j2958k154
1986g644J2850J738j1163j125P973O72l778l23j208L93N932o38r955R05J3000
2001G629j370j4427J531J4237j316j2437N50R275O89n038k396L38M362M522o412
2016b63q722Q077J2049r103j4139R287J4780q368j3978O266J1947l090r072r06
2030e235N504N236j761r630j668J3431M682j6232o960J7464Q520j7067r270J4943
$$ plain form
2044 1957 11397 227 -8923 -2710 5773 5383 -2355 -7816 -874 10039 4007 -11501 -6412 12059
2058 12059 8282 -11621 -9196 10088 9417 -7631 -9075 4260 8119 -507 -6837 -3476 5236 7191
2072 7191 -3727 -10380 2088 12588 -624 -13597 -737 13457 2027 -11866 -3104 9389
2084 9389 4182 -5935 -4997 2208 5823 1661 -6291 -5115 6605 7841 -6613 -9662 6080 10365
2098 10365 -5158 -10078 3704 8682 -1975 -6744 -185 4273 2435 -1683 -4486 -774 6389 2802
2112 2802 -7611 -4275 8175 5197 -7903 -5303 6947 5048 -5091 -4093 2753 3012 -83 -1854
2126 -1854 -2641 470 4981 586 -6810 -1471 7694 1944 -7878 -2287 6933 2352 -5202 -2135 2872
2141 2872 1931 -52 -1593 -2729 1263 5258 -934 -7157 661 8332 -290 -8428 -181 7619 814
$$ packed form
2044A957R440j1170r150O213Q483l90p738n461O942J0913o032j5508N089J8471
2058A2059l777j9903K425J9284o71j7048j444J3335L859q626o330L361Q712J955
2072G191j0918o653J2468J0500j3212j2973J2860J4194j1430j3893Q762J2493
2084I389n207j0117R38P205L615m162p952J176J1720J236j4454l049J5742M285
2098A0365j5523m920J3782M978j0657m769O559M458j838m118k803L712P163l587
2112B802j0413L336J2450k978j3100K600J2250j899j0139R98O846K59l095j771
2126a854p87L111M511m395p396N339R165n750r822N591R220m581p554L067N007
2141B872r41j983j541j136L992L995o192o223P818P671q622q138Q247P800o805
$$ plain form
2156 814 -5992 -1572 3537 2335 -852 -3248 -2061 3941 4670 -4586 -6838 4744 8308 -4574 -9001
2171 -9001 3781 8786 -2483 -7751 791 6117 1473 -3946 -3631 1667 5813 709 -7634 -2893 8882
2186 8882 4738 -9346 -6055 8923 6846 -7642 -7112 5509 6895 -2698 -6306 -555 5394 3748
2200 3748 -4300 -6837 3001 9328 -1789 -10978 624 11731 711 -11267 -1923 9924 3132
2213 3132 -7557 -4267 4667 5337 -1455 -6305 -1811 6836 4794 -7185 -7207 6901 8846 -6260 -9675
2228 -9675 4905 9541 -3191 -8705 1079 7173 1289 -5130 -3615 2888 5859 -511 -7524 -1482
2242 -1482 8807 3296 -9096 -4536 8628 5170 -7341 -5409 5401 5173 -2993 -4677 146 3903
2256 3903 2529 -3048 -5003 2056 6867 -1301 -8076 446 8462 308 -7837 -891 6586 1593 -4493
$$ packed form
2156H14o806M420N109j202l187k396J187O002P29r256k252J1582L564j2882m427
2171i001J2782N005j1269n268Q542N326m644n419L15N298M146n104q343M741J1775
2186H882m144j4084L291J4978k077j4488N30J2621J386r593l608N751N949j646
2200C748q048k537R838O327j1117r189J1602J1107j1020j1978R344J1847o792
2213C132j0689L290Q934O70o792m850M494Q647k042j1979k2J4108J945j5106l415
2228i675J4580M636j2732n514R784O094n884o419J515O503K971o370p013O042
2242a482J0289n511j2392M560J3164l458j2511J932J0810k28q166j684M823L757
2256C903j374n577j955P059M811q168o775Q522Q016q154q145O946P477m993o086
$$ plain form
2271 -4493 -2067 2220 2665 365 -2946 -2697 3287 4704 -3319 -6032 3047 6662 -2576 -6572 1664
2286 1664 5649 -693 -4270 -565 2364 1801 -366 -3001 -1686 3958 3416 -4522 -4743 4697 5534 -4244
2302 -4244 -5634 3332 5295 -1983 -4304 176 3077 1819 -1532 -3692 -41 5272 1477 -6566 -2753
2317 -2753 7071 3616 -7028 -4250 6032 4536 -4474 -4567 2318 4294 160 -3897 -2750 3211 5096
2332 5096 -2435 -7085 1573 8460 -623 -8958 -409 8626 1544 -7477 -2575 5605 3636 -3239 -4669
2347 -4669 575 5343 2058 -5833 -4487 5906 6437 -5546 -7712 4718 8400 -3477 -8279 1815
2361 1815 7539 138 -6109 -2082 4404 4151 -2386 -5998 431 7406 1464 -8300 -3007 8412 4203
2376 4203 -7901 -5000 6590 5465 -4755 -5544 2292 5208 261 -4752 -2800 3931 5135 -3119
$$ packed form
2271d493K426M287M45k300l311K49N984J417q023k713R079L615r238l996Q236
2286A664L985o342l577L705K929n63k167k635J315N644n42p938k21R440Q37r778
2302d244j390Q966J963p278k321M480K901j258l351k160L651N313l795q043L813
2317b753R824l455j0644K778J0282j496r010r3O885J976m134m057J147N961J885
2332E096p531m650Q658O887r083q335Q549R035p082r021M902Q180j969o875j430
2347d669N244M768l285p891J346J0393N31j1983k166J2430L682j1877m802J0094
2361A815N724p401o247M027O486k53o537l612O429O975n942r764N293J1419m209
2376D203j2104K901J1590j125j0220p89P836K916m947n013J952O731J204q254
$$ plain form
2390 -3119 -6968 2106 8153 -1072 -8409 48 8079 1110 -6784 -2069 5079 3015 -2829 -3802 507
2405 507 4337 1731 -4676 -3751 4556 5215 -4346 -6139 3536 6301 -2627 -5968 1327 5050 131 -3681
2421 -3681 -1600 2066 3006 -472 -4139 -1024 5022 2349 -5372 -3211 5251 3781 -4518 -3898 3387
2436 3387 3671 -1809 -3217 -92 2433 1935 -1528 -3635 578 4904 202 -5763 -1087 5929 1746
2451 1746 -5478 -2305 4450 2655 -2808 -2837 895 2964 1139 -2728 -3012 2458 4703 -1922 -5853 1285
2467 1285 6433 -515 -6447 -372 5646 1230 -4464 -2273 2757 3223 -863 -3989 -1158 4550 2934
2482 2934 -4834 -4446 4753 5542 -4195 -6031 3237 6141 -1842 -5662 152 4777 1607 -3527 -3407 2075
2498 2075 4989 -543 -6215 -907 6901 2244 -7091 -3402 6481 4194 -5318 -4729 3638 4890 -1578
$$ packed form
2390c119l849R074O047r225p337Q457Q031o969p894M715P148k064n844r73M309
2405E07L830k606o407R25Q307O59r561j793R675K765q928l341P295L723m919l812
2421c681K081L666R40l478l667L115O046k673p721K161Q462j470q299O20P285
2436C387K84n480j408L125K525m98l463k107M213M326m702n965M676P016m183
2451A746p224L173O755j795n463k9L732K069j825l867k84N470K245o625l931P138
2467A285N148o948n932O075O018m416n694K191N030M66m086l126K831N708j616
2482B934p768L88R199P89r737j836R268K904p983l820N814M625l170n134J20N482
2498B075K914n532n672N308P808m657r335L689R883k287r512N89Q367J252o468
$$ plain form
2513 -1578 -4832 -605 4460 2872 -3855 -4700 3157 6317 -2065 -7191 1117 7586 73 -7120 -1140
2528 -1140 6167 2321 -4755 -3296 2802 4132 -842 -4788 -1301 5129 3000 -5206 -4478 4799 5456
2543 5456 -4092 -5926 2944 5862 -1528 -5249 -49 4298 1693 -3002 -3270 1707 4562 -263 -5417
2558 -5417 -1055 5881 2177 -5748 -2959 5050 3420 -3903 -3716 2349 3626 -635 -3393 -1209 2854
2573 2854 2829 -2177 -4197 1440 5136 -564 -5481 -147 5429 881 -4633 -1583 3618 2244 -2066
2588 -2066 -2629 485 2935 1256 -3069 -2725 2897 3838 -2641 -4629 1934 4911 -1200 -4685 229 3952
2604 3952 857 -2976 -1905 1598 2923 -169 -3675 -1210 4143 2477 -4207 -3357 3937 4062 -3223
2619 -3223 -4310 2107 4181 -709 -3838 -826 3061 2282 -2073 -3697 990 4775 7 -5418 -1046
$$ packed form
2513a578l254M227N065j588o727q45P857L160q382n126Q308O469p513p193N980
2528a140P307l846p076J459O098J330m974l946L487O430k129q206P28R277O57
2543E456r548j834Q870K918p390l721N200M347k605m695k68M977K855m825n154
2558e417M362O936l704p925K789Q009j630p323J87O065J277m261k758K184M063
2573B854k5n006k020N637L696n700m917N334N576m548n514L050N201j374m310
2588b066n63L114K450j679m325L44N622R41o479j988O563K977o111l485M914L723
2604C952l095l833J071L503J325l092l506K465N353j666o684Q50P294J25p285
2619c223j087O417K074m890l129L012L887p79m355j624M687L785m768n425M372
$$ plain form
2634 -1046 5585 1957 -5365 -2729 4418 3371 -3129 -3686 1602 3896 210 -3805 -1907 3548 3601 -2962
2650 -2962 -4832 2237 5809 -1326 -6049 326 5846 751 -5144 -1882 3888 2878 -2483 -3895 742
2665 742 4498 845 -4878 -2442 4829 3765 -4445 -4661 3762 5123 -2555 -5191 1218 4893 322
2680 322 -4188 -1810 3201 3270 -2069 -4397 882 5237 359 -5616 -1457 5510 2374 -4996 -3114 3889
2696 3889 3560 -2576 -3822 943 3779 719 -3483 -2297 3037 3659 -2371 -4615 1566 5225 -656
2711 -656 -5274 -267 4776 1196 -3942 -2029 2692 2734 -1269 -3332 -274 3606 1659 -3590 -2878 3286
2727 3286 3670 -2832 -4195 1960 4215 -918 -3947 -187 3288 1320 -2365 -2299 1307 3276 -174 -3799
2743 -3799 -852 4058 1807 -3931 -2567 3436 2969 -2602 -3262 1525 3176 -282 -2978 -1199 2387
$$ packed form
2634a046O631l628p322K636P147j047o500n57N288K294l686m015J898N455N3o563
2650b962j870P069L572p135m723O375N520n095n895L262N770j010n361j412M637
2665G42L756l653n723K436P271j064q210k16Q423J361p678k636O409L675m571
2680C22m510K378N011O9n339k328N279M355m878n975M159O967l136p370J882P003
2696C889l29o136j246M765K836l060m202J186N334O22o030k244O181L659n881
2711f56m618N007N043l580n138J913M721M2m003k063L058L880j947n249P12O164
2727C286L84o502j363O155K255n133l029L760L475j968l685O6L606J969l450l625
2743c799K947M910k251n738J364O003m67n571o60M787J651l458k696J779L586
$$ plain form
2758 2387 2345 -1841 -3488 1002 4159 -128 -4517 -696 4395 1495 -3849 -2194 2962 2744 -1663 -3054
2774 -3054 379 3250 1131 -3089 -2503 2775 3535 -2342 -4336 1579 4627 -729 -4574 -313 4141
2789 4141 1303 -3277 -2272 2290 3090 -923 -3692 -299 4096 1529 -4067 -2628 3802 3482 -3107
2804 -3107 -4009 2262 4244 -1130 -4099 -159 3698 1494 -2953 -2727 2099 3788 -1098 -4503 -19
2819 -19 4868 981 -4784 -1922 4198 2684 -3381 -3259 2135 3581 -741 -3636 -675 3518 2106 -3051
2835 -3051 -3189 2573 4159 -1714 -4630 814 4718 118 -4452 -1093 3628 2019 -2759 -2787 1517 3274
2851 3274 -320 -3690 -1038 3691 2097 -3492 -2919 3019 3529 -2208 -3797 1355 3773 -145 -3427
2866 -3427 -930 2787 2028 -1984 -2931 1036 3585 -42 -3988 -917 3891 1727 -3571 -2414 2835
$$ packed form
2758B387m2m186j647M490L157m287m389L821N091k900n344J655N156k18m407j391
2774c054L433K871k119m220N86N278P60n877j994N915L048n356l845M261M454
2789D141k838m580J005M562Q00m013k769L393M395k567n596J439O430l20o589
2804c107r02O271J982n374k969L940L857k204m447K26M826J689m886l405M484
2819a9M887l887n765K862O120j514o065J22N394J446m322k895K961M193j412n157
2835c051j38N762J586n873k916N444L904m600m570L359M721j609m778k8M304J757
2851C274l594l370K652M729j594n589N73N938N10n737j589N152K418l918l282
2866c427K497L717p59m012r47L967K549l627l946L071M808k164n298J157N249
$$ plain form
2881 2835 2846 -1895 -3020 651 2978 563 -2726 -1687 2327 2702 -1661 -3410 1007 3849 -158 -3831
2897 -3831 -564 3667 1349 -2992 -1965 2004 2471 -998 -2848 -199 2949 1228 -2880 -2325 2500
2912 2500 3041 -2032 -3512 1173 3667 -398 -3501 -558 3005 1453 -2285 -2311 1345 3001 -359 -3413
2928 -3413 -638 3525 1671 -3318 -2433 2893 3070 -2140 -3395 1181 3370 -29 -3190 -1096 2710
2943 2710 2159 -2116 -3037 1276 3745 -433 -4058 -487 4008 1282 -3620 -2001 2952 2615 -1973 -2997
2959 -2997 934 3267 304 -3151 -1463 2957 2486 -2420 -3319 1779 3776 -984 -3967 57 3818
2974 3818 826 -3389 -1699 2580 2519 -1609 -3101 523 3443 608 -3473 -1586 3328 2400 -2794 -3055
2990 -3055 2155 3455 -1211 -3518 182 3273 847 -2812 -1885 2144 2685 -1333 -3293 471 3575
$$ packed form
2881B835J1m741j125L671K327k415l289J039M014L75m363j749M417K842m007l673
2897c831L267M231k318m341J027L969M67l469j850K649L148j721m108N55M825
2912B500N41n073j480M685K494m065l103K943L563j552l738k6L656J656l360l054
2928c413K775M163j854m989Q85N326J77n210j255M576K189l399l161K094L806
2943B710n51m275r21M313K469m178l625L571M495k726m902J619M953l37m588j024
2959b997L931K333k963l455J688M420m71m906q99N098J997m760k983M024L761
2974C818k992m215J690M279o1m128j492L624K920k835m081J887M914r28n194k61
2990c055N210J300m666k307L700L091k426l659R27M029N41m018j960L764L104
$$ plain form
3005 3575 323 -3673 -1255 3298 1847 -2802 -2458 1912 2779 -1000 -2884 -89 2831 1145 -2505
3020 -2505 -2060 2098 2840 -1445 -3282 746 3525 126 -3364 -867 2919 1559 -2251 -2266 1319 2659
3036 2659 -351 -2923 -608 2906 1506 -2591 -2337 2148 2883 -1540 -3130 703 3172 165 -2886
3051 -2886 -1043 2386 1834 -1648 -2482 914 2967 -16 -3145 -761 3102 1571 -2762 -2135 2146 2564
3067 2564 -1411 -2820 456 2707 458 -2631 -1425 2157 2226 -1579 -2860 877 3224 -99 -3358
3082 -3358 -633 3134 1391 -2600 -2036 1927 2524 -1013 -2817 61 2913 940 -2733 -1829 2329 2545
3098 2545 -1812 -3080 1056 3266 -262 -3218 -559 2912 1387 -2363 -2073 1636 2651 -790 -2950
3113 -2950 -75 3133 1004 -2878 -1697 2562 2360 -2017 -2731 1226 2935 -336 -2966 -595 2606
$$ packed form
3005C575l252l996K418M553j451m649L44M370Q67l779j884K795K920j686l650
3020b505M45M158P42m285j837M028K779l399l490K497L786j360l810j5L585J340
3036B659l010k572K315L514j400m097K54M485P35m423j590L833K469l007l051
3051b886J843L429n52l482q34L396K053k983l129K384L863j531m333O27M281M18
3067B564l975j409L276K251k249l089J206L582O9l805j281L737K347l323l259
3082c358K725L767j743l991N64L963N97l537j804K878K852j973l673R04M158K16
3098B545m357j268M136K210l528k956K659L471j525l750K90L709J015l441k160
3113b950K875L208k129l882J181M259k02m377p14L957J709l271k630K371L201
$$ plain form
3128 2606 1442 -2125 -2207 1510 2746 -836 -3117 -59 3227 794 -3028 -1575 2573 2093 -1810 -2498
3144 -2498 1019 2750 -21 -2757 -899 2592 1687 -2131 -2398 1579 2860 -885 -3030 118 3022
3159 3022 638 -2725 -1376 2138 1952 -1472 -2433 719 2635 94 -2761 -972 2581 1734 -2164 -2218
3175 -2218 1646 2629 -931 -2734 127 2638 699 -2353 -1432 1884 2101 -1276 -2527 500 2786 281
3191 281 -2808 -1028 2556 1676 -2148 -2146 1453 2473 -660 -2644 -82 2528 1015 -2176 -1753 1792
3207 1792 2405 -1155 -2695 534 2830 210 -2765 -863 2425 1539 -1927 -2093 1228 2365 -441 -2534
3223 -2534 -412 2522 1120 -2271 -1800 1844 2306 -1269 -2595 601 2702 160 -2487 -885 2309
3238 2309 1613 -1686 -2119 1043 2530 -320 -2727 -430 2630 1178 -2397 -1846 1882 2248 -1304 -2537
$$ packed form
3128B606j164l567q2L717J236l582k281L058L286k433l822J453M148m80l903o88
3144b498L517J731k771k736J858L491r05l818k67L977J281l745k145L148K904
3159C022k384l363J349L514j86l424r61L152J916k541k855J789L553q47l898n4
3175b218L864R83l560j803K861K511j939l052R21L316K17l377j251L027K286k505
3191B81l089J780L584q80l824KL599J020l133j984K562K610j513l191M23L545
3207A792O13l560j540L229K296k620k975J902L288q86l466j66L321J137k806k093
3223b534K122K934j402l391M71L644M62l575j326L196K101k542k647J602L194
3238B309o96l299m33L162J487k850k407K297L060j452l575N51L728L66l552j233
$$ plain form
3254 -2537 451 2585 259 -2478 -1127 2079 1800 -1624 -2280 1034 2595 -325 -2720 -306 2648
3269 2648 1041 -2291 -1609 1793 2085 -1103 -2316 355 2487 390 -2349 -1091 2085 1716 -1672 -2198
3285 -2198 1052 2490 -470 -2586 -326 2406 917 -2132 -1612 1586 2074 -879 -2375 210 2511
3300 2511 581 -2381 -1123 2115 1771 -1594 -2143 1012 2402 -330 -2421 -441 2204 1144 -1898
3315 -1898 -1714 1357 2126 -806 -2367 117 2426 564 -2353 -1071 1964 1642 -1442 -2012 824 2228
3331 2228 -177 -2234 -535 2172 1219 -1825 -1747 1333 2142 -852 -2350 128 2398 523 -2237 -1149
3347 -1149 1776 1677 -1337 -2019 628 2313 55 -2346 -740 2236 1296 -1895 -1816 1346 2180 -715 -2280
3364 -2280 56 2336 583 -2070 -1176 1802 1776 -1228 -2153 625 2345 -8 -2412 -703 2143 1173
$$ packed form
3254b537K988K134k326k737J351L206k79l424o56L314J561k920k395K414K954
3269B648j607l332O82L402K92l188j213K671K132k097k739J258L176l69l388n26
3285b198L250J438k960k116K260K732j489l049N20L198M88k953j496K585K301
3300B511j930k962J258L238l44l365n49L155J390k732k091J980K645j060l042
3315a898J84L071P69k932j561K484K309j862k917J282L035l22l084n70K836J404
3331B228k405k057J699K707r53l044P8L080Q09k994j498K478K270j875k760J088
3347a149K925r9l014o82K647J685k258k401J606K976r40l191P9L162Q34k895j565
3364b280K336K280j753k653Q94K978k6l004r25K778J720k353k404J709K846r70
$$ plain form
3380 1173 -1830 -1736 1272 2038 -764 -2248 37 2211 651 -2008 -1269 1712 1837 -1178 -2128 664
3396 664 2346 28 -2271 -606 2121 1278 -1702 -1705 1200 2053 -573 -2312 -172 2242 769 -2063
3412 -2063 -1390 1680 1771 -1219 -2150 531 2261 25 -2200 -672 1967 1257 -1502 -1701 1084 2081 -496
3429 -496 -2135 -103 2133 698 -1919 -1192 1582 1634 -1126 -1944 455 2064 163 -2063 -737 1825
3445 1825 1260 -1482 -1785 979 1993 -430 -2138 -222 2094 751 -1792 -1338 1394 1738 -903 -1960
3461 -1960 335 2103 325 -2019 -891 1783 1403 -1356 -1791 845 1999 -295 -2071 -371 1908
3476 1908 895 -1711 -1368 1276 1728 -731 -1890 196 2072 379 -1883 -922 1671 1410 -1286 -1696
3492 -1696 768 1953 -156 -1981 -410 1907 954 -1649 -1482 1184 1847 -723 -2008 144 1991 433
$$ packed form
3380A173l003R4L008P66k802j484K285K174j560k659P39K981J25l015r50K792
3396F64J682k318k299J665K727q43k980lK905Q53k626j739K140K414j473k832
3412b063O73L070R1k990r31K681J730k236k225J528K639p10k759j99K785R97k577
3429d96j639K032K236j435k617P27K774N2k760q18K399J609j901k226J326K562
3445A825n65k742l03K764J014k423j708J916K316j343k543M54K732L44k641j057
3461a960K295J768j778k344J128K674l80k759m35K636J154k294j776J700K279
3476A908j013k606L43K644M52k459j159K086J876j693k262R61K593k61k696m10
3492a696K464J185k109j825J571K317r53k603J67K666O63k570j285K152J847j558
$$ plain form
3508 433 -1995 -971 1602 1454 -1198 -1806 701 2005 -91 -2054 -525 1908 1055 -1622 -1488 1255
3524 1255 1875 -683 -1936 151 2031 462 -1866 -993 1556 1425 -1160 -1778 603 1956 -117 -2063
3540 -2063 -439 1823 962 -1603 -1411 1103 1746 -658 -1875 136 1970 454 -1811 -1011 1545 1436
3556 1436 -1074 -1723 658 1933 -121 -1880 -444 1761 928 -1510 -1377 1053 1733 -579 -1852 37
3572 37 1847 539 -1724 -996 1457 1397 -1021 -1684 560 1853 18 -1775 -442 1651 994 -1346 -1357
3589 -1357 959 1645 -486 -1798 -101 1765 531 -1616 -1036 1286 1324 -965 -1611 413 1709 112
3605 112 -1669 -643 1559 1065 -1174 -1476 861 1776 -353 -1752 -143 1807 704 -1588 -1083 1162
3621 1162 1465 -753 -1687 247 1714 274 -1661 -797 1475 1190 -1184 -1599 785 1666 -295 -1757
$$ packed form
3508D33k428J024K573j48k652o08K507J304k096j963J529K433q53k677J34K743
3524A255O20k558j253K087J880j569k328Q73K549j31k585o18K381J353k073j946
3540b063J624K262q61k565J92K514O43k404j217K011J834j516k265Q00K556j09
3556A436k510o49K381J275k054j759J436K205q33k438J33K430O80k312j273J889
3572C7J810j308k263P28K453o0k418o63K244J293j835j793J333K093o57k340j1
3589a357K316O86k131j312J697J866j234k147N80K322L8k289o46K024J296j597
3605A12j781J026K202m94k239l02K337R15k129j399J609J950j103k292N05K245
3621A162L03k218r34J934J467j440j935Q64K272k85k374m15K384Q81j961j462
$$ plain form
3637 -1757 -224 1637 722 -1395 -1123 1061 1481 -664 -1662 222 1804 376 -1690 -765 1486 1198
3653 1198 -1157 -1443 695 1689 -223 -1723 -345 1634 791 -1454 -1268 1060 1555 -712 -1805 171
3669 171 1790 328 -1716 -796 1455 1189 -1106 -1491 663 1666 -108 -1717 -346 1664 833 -1480
3685 -1480 -1287 1130 1492 -720 -1702 233 1731 247 -1619 -754 1365 1125 -1049 -1440 587 1623
3701 1623 -113 -1675 -321 1521 806 -1354 -1194 1105 1400 -656 -1500 184 1579 295 -1499 -755
3717 -755 1225 1143 -920 -1451 523 1606 -152 -1660 -373 1488 764 -1286 -1117 949 1411 -521 -1493
3734 -1493 93 1535 412 -1368 -812 1210 1184 -908 -1414 534 1526 -91 -1470 -360 1444 672
3750 672 -1169 -1122 758 1315 -406 -1451 -75 1439 469 -1356 -893 1130 1150 -839 -1373 427 1493
$$ packed form
3637a757J533J861r15k117K72K184M20k145r98J884J582j428k066R25K251k88
3653A198k355k86K138R94j912j500J378J979q43k245J86K328M95k267j093J976
3669A71J619j462k044R20K251k66k295l85K154J003j774j609J371K010q31k313
3685a480J93K417L62k212r82J935J498j484j866Q65K119k40k174l91K027J036
3701A623j736j562J354J842p15k160J60K299K95k056q44J684J395j284j794P44
3717g55J980q2k063n31J974J083j758j508J287J861p24k050J69K066M62j932r72
3734a493J586J442j123j780N56K022k6k092n06J948R92j617j379J110J804p72
3750F72j841M7J880N57j721j045J376J514r70j825M63K023K0j989n34J800J066
$$ plain form
3767 1493 -6 -1396 -475 1334 882 -1038 -1133 709 1430 -287 -1536 -161 1515 555 -1391 -909 1177
3784 1177 1193 -798 -1384 306 1402 131 -1472 -552 1242 929 -1027 -1244 684 1469 -288 -1581 -13
3801 -13 1440 529 -1261 -820 1022 1147 -659 -1398 238 1443 169 -1427 -595 1311 923 -1093 -1332
3818 -1332 710 1418 -314 -1484 -83 1422 491 -1292 -901 997 1233 -599 -1392 244 1525 172
3834 172 -1529 -605 1324 935 -1112 -1230 678 1336 -280 -1451 -187 1383 526 -1268 -972 910 1229
3851 1229 -605 -1426 280 1469 118 -1448 -498 1181 868 -962 -1086 619 1270 -169 -1307 -191
3867 -191 1280 626 -1143 -959 882 1206 -606 -1286 238 1347 125 -1321 -563 1027 838 -843 -1118
3884 -1118 463 1276 -113 -1333 -291 1244 650 -1111 -929 865 1142 -517 -1218 195 1249 277
$$ packed form
3767A493j499j390R21J809m52j920r5J842P21j717j249J375J676r60j946M82K086
3784A177J6j991n86J690J096j271j603R20J794l13j956k17J928P85j757j293J568
3801a3J453r11j790M41J842J25j806p39J636J205j274j596Q32J906l88k016k39
3818a332K042P08j732j170J401J505r31j783L91J898K36j832p93J636J281j353
3834A72j701R24J929l89k047j18J908O58j616j171J264J570q57j794K96J882L19
3851A229j834q21J706J189j351j566R50J679l13j830j24J705O51j439j138J116
3867a91J471o54j769J84J841L24j812o80J524J109j222j446P58J590j89j681k75
3884a118J581Q13j389j220J042J535n94j761J82J794K77j659p01J413J054r72
$$ plain form
3900 277 -1159 -543 982 875 -746 -1124 425 1315 -14 -1282 -261 1219 633 -1010 -830 699 1099
3917 1099 -363 -1184 -11 1156 342 -1088 -708 891 1024 -612 -1243 341 1352 -28 -1305 -379
3933 -379 1158 724 -977 -936 655 1101 -346 -1241 -82 1200 444 -1181 -823 898 1048 -675 -1229
3950 -1229 373 1242 38 -1222 -410 1108 716 -850 -1005 543 1206 -250 -1295 -103 1289 485
3966 485 -1165 -797 967 990 -684 -1164 309 1221 42 -1191 -408 1031 793 -883 -1052 569 1267
3983 1267 -277 -1324 -93 1393 355 -1086 -703 911 1032 -561 -1097 291 1231 103 -1154 -509
3999 -509 1086 786 -889 -1006 630 1134 -283 -1237 -85 1103 391 -1014 -684 757 937 -559 -1083
4016 -1083 190 1172 170 -1084 -403 1048 783 -839 -941 591 1051 -255 -1078 -82 1053 434 -948
$$ packed form
3900B77j436O16J525j07j621l78J549Q90j329j268J021J480n86j643J80J529M00
3917A099j462q21J173J167q14j430L80J599J33j636o31J584J011j380j277R26
3933c79J537m34j701M1J591M46j447q95J159J282p56j625L58J721J50j723n54
3950a229J602Q69j204j260Q12J518l92j566j55J548O63j456j045J192J392q04
3966D85j650L68J764K3j674m80J473R12j179j233P83J439k38j676j69J621O98
3983A267j544j047J231J486j038j441L83J614J21j593n36J388R40j128j257O45
3999e09J595l00j675j17J636N04j417r54J152J188p12j405L30J441J80j496n24
4016a083J273R82j002j254O81J451k65j622j02J532M60j306q23R96J135o19j382
$$ plain form
4033 -948 -758 668 984 -460 -1095 199 1166 165 -1094 -433 1000 732 -741 -872 457 1019 -118
4050 -118 -1072 -220 972 568 -894 -772 703 1003 -404 -1029 149 1060 172 -969 -399 823 702 -641
4068 -641 -883 344 961 -24 -988 -261 1023 557 -847 -767 686 926 -393 -1050 93 1041 198 -919
4086 -919 -515 797 756 -571 -984 272 1066 7 -1114 -312 1029 566 -901 -801 627 910 -306
4103 -306 -990 50 1026 286 -907 -589 716 858 -546 -995 315 1107 33 -1112 -249 1032 525
4120 525 -775 -741 549 886 -259 -974 -80 1024 352 -965 -616 769 761 -605 -961 352 1055 -64
4138 -64 -1034 -244 957 491 -720 -746 537 1000 -225 -1051 -60 1064 321 -993 -601 799 775 -585
4156 -585 -949 329 982 0 -946 -284 871 601 -709 -749 461 918 -234 -1056 -57 971 307 -903
$$ packed form
4033i48J90J426L16j444o35J294R67j001j259O61J433k68j473j31J329N62j137
4050a18r54Q52J192m04j462J22J475L00j407o25J178R11q88j141N70J222j21j343
4068f41k42J227O17r85r64P27J284m66j404Q0J453K40j319o57J143R48q43j117
4086i19M04J312m1j327m13J256P94j059j121Q02J341m63j467J00J428K83j216
4103c06o84J040R76p40j193L18J305J42j404m49J310P92j074j145Q63J281n07
4120E25j300L4J290L37j145p15Q94J104o72j317L49J385qj366l56J313P03j119
4138f4r70P90J201m66j211k6J283M63j225q26R91J124p43j314L92J400k4j360
4156e85l64J278O53r82r46O62J155k70j310m0J210M57j152q22R99J028o64j210
$$ plain form
4174 -903 -507 683 715 -503 -795 141 929 59 -874 -315 764 614 -647 -755 469 881 -243 -963
4192 -963 -6 870 280 -789 -444 590 700 -311 -857 110 920 162 -883 -406 787 603 -607 -698
4210 -698 443 848 -192 -778 -60 812 335 -684 -622 518 732 -305 -868 49 866 106 -887 -376 791
4229 791 561 -556 -747 359 840 -47 -786 -246 747 451 -668 -608 516 825 -291 -901 32 922 208
4248 208 -869 -377 736 544 -495 -803 266 879 -10 -906 -315 839 479 -707 -712 544 896 -341
4266 -341 -897 103 896 187 -740 -389 663 658 -482 -811 209 867 -52 -959 -241 884 447 -771 -621
4285 -621 541 736 -287 -832 86 809 189 -791 -463 639 607 -428 -827 263 927 -69 -883 -168 818
4304 818 378 -696 -517 477 731 -291 -760 -12 783 182 -803 -489 678 706 -464 -778 326 871 -104
$$ packed form
4174i03L96J190L2j218k92R36P88q70r33N59J079j50j261j08J224M12j124p20
4192i63R57Q76n90j069L45J034J10j011n46R67Q10p58j045M77J193j84j210r1
4210f98J141M05j040n86P18Q72m77j019O2J140K14j037n63R17Q17p60r93N11J167
4229G91k30j117j91J106M81q87p39N40R93k96j119O0J124L09j116o10R33Q90p14
4248B08j077M92J113j92j039l08J069O13q89q96N91J154l60j186nJ256L52j237
4266c41n56J000P93p09r27L51J052nj140l29J020O58r19r07P18J125m37j218J50
4285f21J162J95j023n45R18P23o20r80L28J102l2j035l99J090O64r96q14P15R86
4304H18m40j074J79R94K54j022m69P48P95o01r85L14J167K8j170l14J104N45r75
$$ plain form
4323 -104 -835 -169 700 321 -574 -588 429 683 -214 -734 37 739 293 -707 -464 629 571 -450 -685
4342 -685 298 698 -16 -685 -167 663 365 -531 -598 351 725 -166 -769 -28 793 243 -696 -325 592 512 -379
4363 -379 -637 223 705 38 -678 -352 610 462 -485 -566 291 723 -179 -765 -43 654 263 -579 -392 430
4383 430 535 -262 -653 24 671 118 -636 -352 588 507 -506 -638 368 729 -130 -743 -90 694 320 -546
4403 -546 -455 423 656 -243 -763 19 735 123 -746 -318 651 437 -529 -580 308 688 -74 -706 -108 652 356
4424 356 -588 -544 464 618 -251 -727 99 787 87 -698 -288 604 387 -489 -521 259 596 -54 -692 -154
4444 -154 681 332 -596 -508 499 611 -312 -737 172 730 63 -711 -248 553 420 -419 -539 205 610 -64
4464 -64 -723 -153 703 271 -625 -463 495 514 -326 -621 107 612 90 -617 -282 490 446 -350 -585 257 666
$$ packed form
4323a04p31O66Q69l79q95j4J017K54q97n20P71P02m46j000K43J093n8j021k35
4342f85R83M00p14o69N18Q30k98q96o7R49L74q91o03P41Q21n50r39L71R17q0q91
4363c79k58Q60M82o67p16L26R62j48r47q1Q57M32r02n86P22O97l91q42J87Q22
4383D30J05p97l91O77O47n53p54K84R40q1j013j32J006L61q59o13O53P84l74q66
4403e46R1Q78K33q99n20P82P16o12q69M28R69k14r66n1Q88L80p62o32N98P60k96
4424C56r44M4J008J54q69m76Q26O88p00p85M10Q92k17q76l2P80L37o50o38N38
4444a54Q35l49r28Q8J007J12r23m25R09N58o67p74M63Q01j33q39j20P44M05o74
4464f4o59N70Q56m32q96J62R58J9q40k95P28N05n22p07L35P72m4p96k35Q42M09
$$ plain form
4485 666 -55 -624 -73 607 275 -533 -335 457 517 -204 -521 37 593 130 -539 -357 439 408 -365 -611 206
4506 206 647 -82 -623 -150 546 280 -423 -402 295 492 -144 -583 -42 638 177 -568 -315 489 502 -353 -519
4527 -519 200 582 -17 -516 -115 434 297 -357 -426 271 519 -129 -578 -73 593 209 -538 -287 428 425 -235
4548 -235 -468 188 541 71 -499 -217 452 366 -394 -510 265 593 -149 -586 14 626 205 -520 -344 413
4568 413 441 -264 -515 85 522 69 -552 -259 553 406 -450 -529 332 619 -135 -594 -9 550 149 -490 -362
4589 -362 361 467 -180 -561 113 620 97 -629 -257 520 354 -455 -446 353 517 -208 -571 -22 576 254 -476
4610 -476 -355 407 518 -201 -542 139 622 19 -580 -132 574 277 -447 -349 335 395 -143 -482 -59 503 224
4631 224 -474 -352 379 431 -293 -534 122 498 -23 -484 -156 430 235 -305 -338 239 445 -65 -485 -90 522
$$ packed form
4485F66p21n69N51O80l32q08J98P92O0p21l17N58N56m63o69J82P96l1p73k46Q17
4506B06M41p29n41M73O96k66p03K1O97J97o36m39N41O80m61p45K53Q04J3q55j66
4527e19P19L82n99m99M01N49j37o54o9O97K48o48m49N05O66l84p47K51P15lo60
4548b35k33O56L53m70n70K82O69q6p60j16P75L28p42m37O00O12m21p25J76P57
4568D13K8p05k51O00M37m53o21K93Q12j47q56p9Q61K87p54m59N85N59m01o39J28
4589c62P23J06o47l81O74N07n23p26L72P77j66q09RP99J64p25l63N49N98l22p30
4610d76J21P62J11p19l41O81M83o03n99M48P06k97p24R8O84O0n38l39M23N62k79
4631B24o98J22P31N2p24k41O56L76n21m61L28N86j95n40l3N77K06n10m20L95O12
$$ plain form
4652 522 178 -468 -280 365 394 -290 -419 144 365 40 -420 -197 319 347 -291 -370 143 457 17 -489 -94
4673 -94 532 190 -425 -297 341 385 -179 -397 -5 456 66 -384 -243 330 383 -299 -440 156 491 -70 -444
4694 -444 -76 476 174 -310 -294 289 439 -89 -434 -1 483 184 -373 -284 416 384 -300 -452 192 477 -16
4715 -16 -433 -50 410 193 -362 -366 214 456 -144 -563 -19 553 167 -520 -277 424 320 -294 -410 191 475
4736 475 -42 -411 -108 417 265 -348 -333 237 525 -183 -521 79 475 72 -488 -193 405 283 -342 -354 125
4757 125 426 -51 -415 -190 438 187 -413 -287 318 371 -221 -463 118 439 1 -395 -197 337 303 -263 -410
4778 -410 176 423 -1 -477 -84 450 162 -370 -342 298 308 -234 -415 95 426 78 -283 -143 308 344 -198
4799 -198 -346 188 382 -37 -473 -45 378 156 -374 -222 201 304 -137 -338 -15 340 151 -433 -259 267
$$ packed form
4652E22l44o46J88O45K9o84j29N63K21l25m60K23N16K8o38p9N13L14m40n06L95
4673i4O26l42o15J28O38M4n64k18L92M61l90m50J41N73N3o82j41N96L35n61l74
4694d44L68N52l02m84J6N83J50n28l45M33M84k99n57Q9P00l2o84j52O44K85m93
4715a6m17L83M60k17n55mN80K42o00m19N44N72l86o87K43P01j04o14j16O01K84
4736D75n17l69L03N25j52o13J5N70K88p08l38O00L96m03n60K95N98j22o25j2M79
4757A25L01m77l64K25O28k51o00J26O05N3n92k42N81L21m38l96J98N34l4n66j47
4778d10N86K47m24m76L93N34k88n32K8O40J0n42j81N10L31l48l61J40M51L6n42
4799a98j48N34J94m19m36M28M23k22n30J52M23J03m41k01L23L55j89n84J74N26
$$ plain form
4819 267 307 -246 -404 136 445 -61 -375 -24 394 176 -279 -268 137 367 -27 -344 -54 411 183 -365 -223
4840 -223 251 301 -224 -347 99 370 0 -322 -129 261 186 -218 -365 113 428 -14 -416 -27 427 192 -384
4861 -384 -225 301 358 -158 -329 16 375 147 -373 -217 312 316 -221 -422 222 441 -87 -431 -27 402 127
4882 127 -369 -208 249 328 -188 -360 13 456 110 -327 -181 356 353 -318 -323 284 439 -150 -368 -33 400 103
4904 103 -276 -230 299 300 -114 -340 39 428 72 -419 -166 383 200 -318 -238 275 367 -94 -320 44 344 157
4926 157 -282 -235 239 309 -194 -414 75 425 -25 -450 -89 384 135 -324 -224 179 318 -100 -290 -11 307
4947 307 130 -282 -196 306 322 -217 -293 123 338 -25 -314 -42 292 173 -147 -198 169 291 -7 -274 -56
4968 -56 304 142 -265 -199 232 211 -180 -240 94 265 7 -199 -119 229 189 -129 -254 87 293 47 -333 -62
$$ packed form
4819B67M0n53j58N40L09n06l14L51M18k18m55J1M05K30l94l17K90M65k28n48J42
4840b23M74N0n25j23M46K71l70l22J93L90p5m04j47M78L15m42m02L89M54k35n76
4861c84J59N26N7n16j71L45L59k28n20J56N29Mn37k01O44K19n28l44M04M29k75
4882A27m96J61M57P9n16j72L73M43l46m37J46N37lo71nO07J55n89k18L35M33k97
4904A03l79M6N29Jm14k26L79L89l56m91K53N49j83n18Q0N13R2m61k26L64L00j87
4926A57m39M7M74P0n03k20M89L50m50m25L61M73k49m59J00M03J39m18j90K79L18
4947C07j77m12Q6N02J6n39p6M16K15l63k89K72L34j19l20n1L67J22k98k67K18
4968e6L60j62m07O6M31k1l91o0L34J71k58k06Q0L48m0l18j25L41K06k46l80K71
$$ plain form
4990 -62 365 86 -299 -129 247 169 -98 -206 -24 270 93 -301 -132 224 304 -224 -324 102 294 -52 -330
5011 -330 -35 299 113 -206 -152 113 261 -24 -310 -45 348 203 -297 -240 302 309 -187 -339 97 354 -22
5032 -22 -346 -60 260 213 -223 -280 149 366 -63 -425 -53 458 139 -413 -236 362 257 -199 -217 115 341
5053 341 -26 -291 -44 317 178 -215 -317 187 346 -183 -439 40 389 -24 -353 -173 318 154 -206 -234
5073 -234 118 291 -28 -301 -113 324 195 -312 -248 280 340 -178 -346 145 332 -71 -290 -111 269 213 -211
5094 -211 -280 105 257 -40 -395 -70 317 70 -298 -148 240 173 -177 -205 76 245 13 -184 -107 164 243 -126
5116 -126 -311 118 259 -41 -300 -25 259 45 -259 -166 158 186 -41 -143 -67 211 138 -187 -157 138 239 -144
5138 -144 -272 124 243 -4 -240 -77 199 123 -94 -161 31 200 -18 -237 -124 249 209 -175 -248 240 186 -134
$$ packed form
4990f2M27k79l85J70L76p8k67j08J82K94j77l94J69L56Q0n28j00M26J92l46k78
5011c30K95L34j86l19N4K65J48k85k86K65L93j45n00N7N42Pm96j52M36K57l76
5032b2l24K86L20m7m36n7M29K17m29l62L72N11l19n52J77N98j05m56j8L32K26
5053C41l67k65K47L61j39l93j02N04J59n29k56M79L49m13l29J80M91j64l60k8
5073b34L52J73l19k73J88M37j29n07O4N28O0n18j68M91J87m03k19J79L80n6m24
5094b11o9L85J52k97l55L25L87k47l68J50L88o7l50k8K81J69k32j97P7K71P9l69
5116a26j85M29J41l00k59K75K84k14l04R3L24K8k27j02P6K78p3l25L0K95J01l83
5138a44j28L96J19k47k36J63K76p6k17o7J92J69k18k19J13L73m0l84p3M88n4l20
$$ plain form
5160 -134 -230 28 245 38 -144 -104 156 215 -154 -242 62 356 61 -293 -57 321 160 -241 -159 233 259 -179
5182 -179 -240 43 239 79 -248 -209 194 273 -123 -301 135 385 -45 -385 -48 323 54 -327 -157 224 227 -73
5204 -73 -275 73 348 81 -347 -212 350 244 -259 -223 221 309 -118 -288 42 256 30 -258 -186 164 259 -114
5226 -114 -278 36 333 -7 -392 -77 338 123 -270 -189 281 150 -113 -220 25 179 104 -184 -190 225 170 -90
5248 -90 -352 80 337 -105 -299 -26 260 26 -165 -108 103 136 -51 -195 -65 246 90 -188 -175 211 205 -197
5270 -197 -219 121 189 -69 -176 -9 85 84 -73 -134 11 166 9 -235 -94 219 143 -201 -188 172 139 -95 -107
5293 -107 21 122 79 -75 -91 93 213 -52 -255 18 299 28 -285 -100 251 71 -196 -77 105 98 -64
5314 -64 -165 -81 158 172 -136 -222 120 280 -137 -247 48 256 -62 -255 -51 231 153 -101 -140 24 265 11
$$ packed form
5160a34r6K58K17k07j82M0K60N9l69q8L04K94k95l54K36L78j61m01Q2L92K6m38
5182a79o1K83J96j60l27L9M03P9l96j78M36K50m30l40L37L71k69l81J70L81Ll00
5204g3k02L48K75k67m28J35N62j06n03L6M44Q8m27j70L30K14k26k88P2L50R5l73
5226a14j64L14K97l40l85L15M15k15l93Q1M70j31k63j07K45J54p5k88oM15n5k60
5248i0k62M32K57m42j94K73K86k34j91N7K11L3j87j44J30L11j56k78J3L86om02
5270a97k2L40O8k58j07J67R4jj57o1J45J55j57k44J41L13p6l44J3L60l3k34j2
5293a07J28J01m3j54j6J84J20k65k03K73K81k71l13J85L51j80k67J19J82pj62
5314f4j01Q4K39J4l08q6L42J60m17j10K95K08l18j93K04K82p8k54l9J64K41k54
$$ plain form
5336 11 -227 -103 282 171 -252 -212 262 267 -172 -286 109 287 -40 -277 -85 220 185 -157 -283 87 326 -39
5358 -39 -400 42 370 102 -355 -145 318 215 -225 -192 112 227 -75 -269 -94 167 198 -212 -302 194 279 -178
5380 -178 -322 126 314 -62 -285 -38 251 109 -170 -150 180 201 -45 -231 -62 333 121 -286 -151 287 173
5401 173 -185 -179 116 255 -102 -188 -98 144 68 -139 -211 71 162 -20 -190 5 304 45 -273 -96 213 33
5423 33 -138 -71 73 67 -8 -71 -77 84 144 -96 -163 46 180 -64 -217 -2 158 -7 -123 -59 36 12 16 -163 -82
5448 -82 76 176 -95 -234 120 228 -88 -154 73 207 68 -145 -15 83 132 15 -126 -71 157 96 -246 -153
5470 -153 187 158 -237 -285 126 224 -94 -202 -11 139 87 -91 -124 52 268 -4 -262 16 289 107 -326 -54
5492 -54 322 153 -242 -161 146 244 -108 -188 -3 211 119 -230 -265 207 265 -196 -288 149 399 -123 -323 -10 335
$$ packed form
5336A1k38J24L85j11m23M0M74Nm39j14L95J78l27k37J92L05l5l42j26L70K39l65
5358c9l61M42L28k68m57K10M63j03m40L3L04J15l02j94J75K61L1m10r0M96Q5m57
5380a78j44M48J88l76k23K47K89j42k79K0L30K1k46j86J69L95k12m07J35M38j14
5401A73l58OK95J39l57q6R0K42p6k07p2K82R1j82j70J95K99k59l18J77L09j80
5423C3j71O7J44op5o3oJ61O0k40o7K09J34k44j53K15J60j65j16O4R5k4Mj79Q1
5448h2J58J00k71j39L54J08l16o6K27J34j39k13J30R8M9j17j41N5K28o1l42R3
5470a53L40k9l95m8M11R8l18j08J91J50n2j78l3J76K16k72k58K78K73j82m33K72
5492e4L76j69l95Q1L07R8l52q0J85K14r2l49l5M72N8m61r2M37K50n22k00L13L45
$$ plain form
5515 335 94 -232 -118 123 240 -92 -220 -9 287 150 -340 -160 325 181 -295 -244 212 240 -173 -233 32
5536 32 200 41 -123 -81 141 233 -70 -236 72 325 -14 -337 -12 352 65 -254 -58 239 74 -125 -130 14
5558 14 170 73 -161 -108 164 186 -219 -245 84 201 -100 -232 73 162 -21 -104 -37 60 61 50 -60 -5 129 118 -80
5583 -80 -104 193 147 -143 -76 170 120 -43 -25 -19 16 31 54 -120 -78 89 100 -158 -107 159 101 -230 -136 140 52 -34
5609 -34 -74 -14 16 114 -47 -152 -37 198 -7 -223 -49 213 39 -177 -101 163 61 -137 -98 -4 102 81 -121
5632 -121 -113 140 210 -180 -242 71 289 -48 -291 15 264 25 -239 -38 129 147 -73 -196 -33 217 78 -280
5654 -280 -160 264 207 -286 -195 251 237 -216 -261 69 241 -58 -211 -48 154 209 -65 -206 121 356 -52 -333
5676 -333 54 344 -15 -327 -22 266 125 -236 -105 83 186 -96 -229 -48 187 149 -256 -227 167 235 -223
$$ packed form
5515C35k41l26J14K41J17l32j28K11K96j37m90J80M85j44m76N1M56K8m13o0K65
5536C2J68j59j64M2K22R2l03j66L08K53l39l23L25L64k87l19J96K97j65j99nJ44
5558A4J56r7k34N3K72K2m05k6L29J17l01j32L05Q9j83q3O7R7Jj1j10N5J34j1j98
5583h0k4K97m6k90O7K46n0j63J8OL5J5K3j74M2J67J1k58N1K66n8l31R4K76q8q6
5609c4m0O0L0R8j61j05J15K35k05k16J74K62j74k16P6K64j02j98L9R4J06k1k02
5632a21QK53P0l90o2L13K18l37k43L06K49k39k64K01J67J8k20j23J63K50j39l58
5654b80J20M24n7m93R1M46j4m53m5L30J72k99j53J63K02N5k74j41L27K35m08k81
5676c33L87K90l59l12L05K88j41l61J31J88J03k82j33J81K35l8m05K9L94O8m58
$$ plain form
5697 -223 -265 121 255 -80 -254 107 213 14 -111 -41 68 174 -24 -190 14 200 96 -242 -116 255 78
5718 78 -195 -57 176 54 -126 -82 -10 6 28 -74 -144 46 170 -6 -197 57 181 33 -155 11 141 -42
5740 -42 -90 27 47 -62 68 14 -85 -61 150 -9 -148 -6 158 -64 -108 36 100 0 45 13 -104 2 125
5763 125 -103 -186 53 239 -25 -202 116 208 -59 -193 47 99 4 -112 -72 -27 78 76 -179 -119 173 166 -239 -211
5787 -211 164 208 -162 -199 129 195 -25 -209 -49 195 92 -118 -166 48 255 -2 -321 -19 337 80 -342
5808 -342 -116 321 94 -236 -137 107 137 -53 -145 -84 161 103 -206 -220 186 284 -152 -297 154 337 -139 -318
5830 -318 44 298 18 -202 -76 162 140 -75 -233 -28 269 106 -294 -126 344 110 -321 -170 228 170 -198
5851 -198 -132 108 120 10 -118 -51 77 173 -130 -248 85 250 -99 -265 51 256 -14 -226 50 202 -77
$$ packed form
5697b23m2L86J34l35j74L61J06j99j25P0J09J06j98j66K04J86j04l38J26L71j77
5718G8k73J38K33j22j80M4P2J6K2j02p0J90J24j76j91K54J24j48j88J66J30j83
5740d2m8J17K0j09J30n4r9K4K11j59j39J42J64k22m4J44O4j00M5l2j17J06J23
5763A25k28q3K39J86k64j77L18R2k67j34K40N2r5j16M0M5J05kk55O0K92pm05K8
5787b11L75M4l70l7L28O6k20j84J60K44j03k10m8K14K07k57l19L02L56k57m22
5808c42K26M37k27l30R9K44L0j90r2O1K45n8l09j4M06R8m36j45M51J83m76j79
5830c18L62K54k80k20J26K38k2k15j58K05K97j63m00J68M70k34m31J51L98n8l68
5851a98O6K40J2j10j28O7J28R6l03j18L33J65l49j66L16K05k70k12K76J52k79
$$ plain form
5872 -77 -54 3 24 55 53 -85 -139 85 96 -127 -166 121 146 -139 -55 108 90 -90 -33 9 10 37 50 18 -102 49 95
5899 95 -73 -87 92 34 -65 -69 34 -24 -53 59 30 -92 24 122 -99 -111 137 171 -109 -138 88 118 -35 -101 34
5924 34 80 54 5 -53 -17 155 61 -195 -70 296 59 -199 -76 242 85 -206 -76 129 84 -50 -113 -28 95
5947 95 79 -101 -202 76 266 -92 -274 111 343 -126 -296 49 250 38 -209 -3 117 139 -56 -163 -18
5968 -18 230 59 -270 -146 291 178 -329 -225 272 191 -200 -202 91 191 -57 -168 -68 151 150 -159 -269 83
5990 83 293 -66 -356 62 289 48 -280 74 203 20 -191 -46 89 88 -38 -142 -43 156 149 -170 -96 208
6012 208 177 -247 -159 207 254 -146 -142 114 81 -35 -76 -51 -11 93 2 -156 -22 176 -2 -203 -88 214 -9
6035 -9 -227 0 98 -70 -95 -25 58 -61 68 57 -64 -10 135 0 -100 7 118 -26 -13 2 36 -151 -50 87
$$ packed form
5872g7K3N7K1L1kj38n4K24J1k23l9K87K5k85Q4J63j8j80N7M2JK7J3l2j20J51M6
5899I5j68j4J79n8r9mJ03n8k9J12k9j22J16R8k21j2K48L4k80k9K26L0j53o6J35
5924C4M6k6m9n8L6J72r4k56J25L66k37k58J23L18j57k91J30K05m5j34o3Q5J23
5947I5j6j80j01K78J90l58j82L85K32m69j70L45K01k12k47K06J20K2j95j07J45
5968a8K48j71l29J24M37j13n07J04M97q1l91kK93J00k48j11J00K19jl09j10L52
5990H3K10l59k90M18K27k41l28L54J29j83k11J45J35jj26j04R9J99pl19P4L04
6012B08l1m24Q8L66M7m00MK56l3j16m1K5M0J04r1j58J34J98j78k01J15L02k23
6035ik18K27R8j68k5P0Q3j19J29j1j21N4J45j35j00J07J11j44J3J5L4j87J01J37
$$ plain form
6059 87 -87 -117 111 48 -158 -127 124 55 -170 -70 100 -39 -80 5 -21 25 42 16 -179 -18 190 10 -214 34
6083 34 265 -32 -256 48 181 4 -117 5 61 74 -34 -139 -70 199 108 -140 -199 209 216 -262 -220 186 232
6106 232 -209 -195 136 224 -17 -189 -63 141 116 -38 -233 60 273 -19 -322 -34 308 43 -354 -62 239
6127 239 53 -233 -97 88 139 -70 -135 -35 174 206 -234 -237 206 276 -218 -283 187 263 -155 -231 118 219 -61
6150 -61 -189 -46 87 65 -104 -159 -2 201 49 -352 -89 304 60 -261 -76 230 106 -204 -30 139 43
6171 43 -63 -85 -92 19 81 -67 -123 34 187 -95 -156 100 171 -89 -112 115 104 -112 -153 91 8 14 15 -44 -85 57
6197 57 93 -138 -80 144 50 -110 -51 123 -47 -76 100 69 -58 -74 141 6 -91 24 116 -59 -53 57 36 -12 -35
6222 -35 16 -56 -31 165 -27 -151 48 152 -112 -220 120 169 -93 -144 106 117 -23 -85 -89 28 54 -34 -118 -32 138
$$ packed form
6059H7j74l0K28o3k06L1K51o9k25J00J70j39m1Q5k6M6J7k6j95J61K08j80k24K48
6083C4K31k97k24L04J33j77j21J22N6J3j08j05O9K69r1k48n9M08Pm78M2M06M6
6106B32m41J4L31Q8k41j72J26K04k5j54j95K93K13k92l03K88L42k65l97K92L01
6127B39j86k86J36J85N1k09o5J00K09L2m40lM43P0m94o5M70P6m18p6L49J01k80
6150f1j28J43J33k2j69n5J57K03j52m01K63L93k44l21J85L06j24l10J74J69r6
6171D3j06k2pJ11O2j48n6J57J53k82o1K56P1k60k3K27j1k16m1K44q3OJn9m1J42
6197E7L6k31N8K24r4j60N9J74j70k9J76l1j27j6K15j35r7J15R2j75OJ10k1m8k3
6222c5N1p2K5J96j92j24J99J04k64j08L40M9k62n1K50J1j40o2mJ17K6q8q4Q6J70
$$ plain form
6247 138 58 -200 -75 221 80 -276 -189 225 95 -216 -119 76 115 -27 -134 -54 127 115 -96 -208 93 245
6269 245 -77 -295 85 301 -145 -234 62 248 -17 -211 -86 102 63 -41 -172 -46 179 63 -280 -124 240
6290 240 123 -302 -115 254 178 -216 -211 143 87 -60 -100 8 141 130 -95 -214 89 240 -159 -278 73 304
6312 304 -74 -231 49 200 -77 -158 -30 40 53 16 -101 -58 137 96 -168 -69 206 174 -195 -140 237 102 -190
6335 -190 -68 133 -1 -54 -10 9 20 53 1 -55 -47 97 -47 -159 -27 158 -117 -98 19 109 -73 -65 117 22 -117
6360 -117 17 70 -23 -69 116 -15 -72 -37 60 -72 -42 35 -28 -91 41 127 -153 -109 153 171 -129 -111 127 92 -59
6385 -59 -66 98 20 -33 -37 -13 16 116 13 -235 37 191 -57 -287 55 258 -34 -257 -7 206 -17 -145 -30
6408 -30 104 49 -53 -195 -64 108 131 -211 -189 227 165 -253 -157 257 187 -165 -172 121 140 10 -130 -31 101 128
$$ packed form
6247A38q0k58J25K96j41l56Q7M14j30l11R7J95L9j42j07Q0J81j2k11j12L01J52
6269B45l22k18L80K16m46q9K96J86k65j94J25J88l9j04j31J26K25j16l43J56L64
6290B40j17m25J87L69p6l94NL54n6j47m0J08J33j1k25j19L03J51l99j19L51K31
6312C04l78j57K80J51k77q1J28P0J3l7j17M3J95m1k64R9K75l2l69N5L77j35k92
6335a90J22K01j34n3M4J9J1L3n2n6QJ44j44j12J32J85k75J9J17R0j82QJ82r5j39
6360a17J34N3r3m6J85j31n7L5R7j32L0P7o3o3J32Q6k80M4K62J8l00J8K38l5j51
6385e9pJ64p8n3mK4K9J00j03k48K72J54k48k30L42K03k92k23K50K13k23j28J15
6408c0J34n5j02j42J31J72K3l42K2M16o2m18R6M14p0l52pK93J9j30j40R9J32K7
$$ plain form
6432 128 -59 -198 64 245 -60 -341 51 350 9 -316 -23 303 0 -240 -66 187 46 -104 -115 -47 154
6453 154 93 -213 -108 216 165 -170 -188 173 186 -227 -157 188 157 -106 -103 -28 28 61 11 -103 8 160 18 -252
6477 -252 -3 201 -12 -199 -21 196 -33 -158 32 145 -46 -105 51 -20 -45 8 -28 -86 83 130 -110 -133 138
6500 138 95 -158 -94 137 6 -137 -19 95 -66 -76 57 48 -43 4 37 -93 -3 119 -11 -111 56 74 -77
6523 -77 -77 123 47 -119 -69 160 20 -176 -39 139 -20 -147 -14 36 20 15 -49 -75 10 122 -35 -167 118 211
6547 211 -148 -238 142 167 -111 -143 58 109 -32 -52 15 -6 60 19 -134 -70 116 53 -240 -120 261 90 -288 -71
6571 -71 220 31 -175 -64 101 45 -29 -121 -121 82 133 -109 -191 197 222 -128 -264 145 275 -135 -214 50 222
6594 222 -66 -133 2 104 67 -69 -113 -21 256 43 -274 -78 279 151 -301 -113 266 45 -222 -62 202
$$ packed form
6432A28j87j39K62J81l05k81L92K99l41l25K93L26l03k40J74K53j41j50j1O8K01
6453A54o1l06J05L24n1l35j8L61J3m13P0L45l1k63LP5N6L3n0j14J11J52j42k70
6477b52K49K04k13j87J78K17k29j25J90J13j91n9J56p1k5N3l6n8J69M7k40k3K71
6500A38m3k53O4K31j31j43J18J14j61j0J33rr1M7L3j30R0J22j30j00J67J8j51
6523g7%K00p6j66N0K29j40j96J37J78j59j27J33N0j6no4k6Q5J12j57j32K85R3
6547B11l59r0L80K5k78l2K01N1j41k0O7k1O6m1j53O4J86o3k93J20L81j71l78K17
6571g1K91j89k06J11J65n6p4r2%K03N1k42q2L88K5l50j36M09J30m10p9K64J72
6594B22k88o7J35J02l7j36m4R2K77k13l17J96L57j28m52J88L79k21k67J60K64
$$ plain form
6615 202 102 -41 -95 9 92 64 -151 -166 150 156 -91 -167 120 223 -143 -221 130 149 -78 -128 66 104 29 -22
6639 -22 -90 -15 84 40 -111 -4 155 46 -155 -95 235 -29 -215 14 113 -18 -167 39 46 -99 -38 75 -58
6662 -58 13 44 -15 -35 51 48 -105 -79 136 104 -167 -45 198 2 -166 6 148 -29 -105 -11 96 0 -3 14 -39 39
6688 39 68 -83 -121 75 120 -120 -116 181 128 -184 -128 163 129 -104 -62 64 29 63 -105 -24 101 147 -51 -197 44
6713 44 218 -16 -215 71 231 -93 -186 32 193 -72 -115 -35 51 144 -63 -90 -30 150 114 -213 -162 189 131 -205
6737 -205 -165 215 136 -149 -116 105 142 -18 -93 -34 83 99 -36 -182 68 233 -99 -284 49 259 -82 -263
6759 -263 50 232 -55 -200 -10 112 36 -50 -75 31 97 46 -183 -82 202 121 -231 -132 228 115 -223 -119
6781 -119 163 76 -120 -55 34 65 -3 -95 -73 37 88 -33 -153 61 169 -56 -179 85 196 -63 -121 112 127
$$ packed form
6615B02j00j43n4J04Q3k8k15j5L16Ok47p6K87J03l66p8L51J9k27n0J94L8p5n1
6639b2o8P5R9m4j51J07J59j09k01O0L30k64j86K29R9j31j49K06Pj45O1J13j33
6662e8P1L1n9k0Q6lj53K6K15l2k71J22K43j96j68J72J42j77p6R4J07r6lJ7n3P8
6688C9K9j51l8J96M5k40MK97n3l12N6K91l4k33M2J26l5L4j68Q1J25M6j98j46K41
6713D4J74k34j99K86J60l24r3K18J61k65m3Q0Q6R3k07k7O0J80l6l27N1L51n8l36
6737b05M0L80p9k85L3K21L7j60p5N9J17J6j35j46K50J65l32j85L33K10l41j81
6759b63L13J82k87j45J90J22p6q6k5J06O6n1k29J01K84q1l52R9L60j13l38J04
6781a19K82q7j96O5Q9L1o8r2K2J10N1j21j20K14J08k25j23K64J11k59n8K33J5
$$ plain form
6804 127 -68 -74 51 1 -9 30 40 -45 39 17 -152 -81 94 45 -167 -92 148 5 -148 20 157 -36 -146 59
6828 59 42 -12 -3 10 -30 37 81 -28 -89 93 77 -182 -75 168 59 -184 -45 231 29 -131 -36 90 27 -40 -15
6853 -15 15 42 78 -29 -84 79 161 -73 -120 143 149 -136 -212 124 152 -135 -200 36 71 -30 -113 -18 35 87 -17 -229
6879 -229 -31 179 17 -218 -26 247 -13 -280 -25 233 77 -187 -44 158 45 -20 -101 -29 112 109 -162 -128
6901 -128 145 160 -209 -192 159 160 -161 -221 81 137 -98 -122 16 77 -5 -34 -101 82 131 -17 -204 -6 310 32
6925 32 -224 -13 218 -32 -190 -7 112 14 -142 -11 72 49 -12 -52 -89 94 70 -157 -132 175 69 -195 -160
6948 -160 126 116 -141 -53 68 41 -20 -5 23 58 -18 -4 -72 7 88 -14 -149 9 195 -92 -161 155 145 -87 -99
6973 -99 38 79 -40 -19 58 8 -24 22 -33 -49 108 31 -68 -8 118 -17 -159 -9 189 -24 -167 65 173 -59
$$ packed form
6804A27j95oJ25n0j0L9J0q5Q4k2j69P1J75m9k12P5K40j43j53J68J37j93j10K05
6828E9j7n4RJ3m0O7M4j09o1J82j6k59J07K43j09k43J39K76k02j60R5J26o3o7K5
6853a5L0K7L6j07n5J63Q2k34m7K63Ok85p6L36K8k87o5K36L5j01q3R5N3N2j04k12
6879b29J98K10j62k35J92K73k60k67K55K58j56k64J43K02j13o5q1P2J41lk71L4
6901a28K73J5l69J7L51Jl21o0L02N6k35k4J38O1q2k9o7J83M9j48j87J98L16k78
6925C2k56K11K31k50j58J83J19r8j56J31Q3k3o1m0l7J83k4k27K5L07j06k64L5
6948a60K86j0k57Q8J21k7o1J5K8L5p6J4o8P9Q1j02j35J58J86k87o9L16j0k32j2
6973i9J37M1j19K1P7n0l2M6n5j6J57p7r9O0J26j35j42J50J98k13j43K32J08k32
$$ plain form
6997 -59 -105 15 20 -19 7 -10 -38 105 41 -143 -70 143 65 -171 -95 167 154 -190 -113 153 11 -112 -101 70 68 -48
7023 -48 -60 -64 37 109 -86 -172 47 201 -79 -198 110 223 -102 -189 41 171 -31 -53 -53 67 84 -23 -125 -21
7047 -21 217 67 -180 -128 217 83 -208 -102 239 92 -176 -100 172 101 -143 -75 15 23 25 -95 -116 92 135 -76
7071 -76 -164 127 205 -73 -176 73 202 -72 -106 44 87 -9 -45 -42 2 40 -22 -116 -68 156 28 -176 -26 176 51
7096 51 -182 -82 193 27 -161 -35 98 15 19 -15 -42 -14 107 -103 -101 71 188 -134 -141 108 107 -123 -95 120 42
7121 42 -160 2 27 35 69 36 10 -20 47 -11 -99 -24 169 -55 -129 90 144 -91 -183 42 139 -74 -105 103 75 -54
7147 -54 12 19 4 -10 -2 -93 26 127 3 -140 -9 174 -29 -188 -21 195 6 -175 2 149 11 -36 -39 14
7171 14 17 36 -114 -67 122 92 -169 -119 206 165 -125 -196 155 109 -110 -167 140 111 -29 -85 -69 67 86 -97 -107
$$ packed form
6997e9m6J20Nl9K6j7k8J43o4j84P3K13p8k36P6K62j3l44P7K66j42j23J1J71kj16
7023d8j2mJ01P2j95q6K19J54k80j19L08J13l25q7K30J30k02k2%J20J7j07j02J04
7047b1K38j50k47N2L45j34k91J06L41j47k68P6K72p1k44O8R0QKj20k1K08M3k11
7071g6q8K91P8k78j03K49J29k74l4J50M3r6l6LM4L8o2r4M8K24j28k04J50K02j25
7096E1k33J00K75j66j88J26J33q3Ml4k7K8J21k10KJ72J17l22pK49jk30K8K15p8
7121D2k02J62K5QL4l3k6l0O7n8q8P5J93k24p4K19N4k35r2K25R7k13l1K08k8j29
7147e4O6Pj5j4Qr1J19J01j24j43J31J83k03j59J67K16j89j81J77J47j38m7lN3
7171A4LJ9j50M7J89l0k61N0L25m1k90p1L51m6k19n7L07k9j40n6J6J36J9j83j0
$$ plain form
7196 -107 20 167 -60 -192 31 210 -60 -208 17 157 -13 -153 8 76 25 -59 -93 -67 69 37 -121 -99
7218 -99 107 110 -143 -76 164 98 -159 -98 93 75 -116 -110 54 38 -26 -62 -56 39 111 -43 -175 54 163 -22 -202
7243 -202 78 207 -81 -166 69 153 -71 -122 14 15 10 49 -60 17 90 54 -115 -46 124 79 -176 -72 131 50 -162
7268 -162 -60 106 -4 -97 -43 40 -3 -10 0 -46 3 -14 -1 -74 84 96 -128 -97 113 114 -97 -86 149 50 -78 -21
7294 -21 79 -1 -19 -57 3 -3 83 -55 -153 21 127 -94 -99 97 135 -80 -171 16 129 -82 -67 41 47 28 -15 -1
7320 -1 -22 109 40 -133 14 183 62 -166 -76 237 48 -185 -40 114 46 -94 -71 74 17 -52 -78 -25 60 48
7344 48 -81 -127 104 147 -97 -122 64 155 -91 -107 69 75 -93 -107 -15 66 26 -29 -99 12 176 -11 -136 0 147
7369 147 -9 -198 8 150 28 -171 -55 104 13 -102 -51 -13 69 -25 -61 -66 124 80 -119 -84 93 171 -84 -113
$$ packed form
7196a07J27J47k27j32K23J79k70j48K25J40j70j40J61O8n1q4l4K6J36l2j58K2
7218i9K06Lk53O7K40o6k57O1J91j8j91OJ64j6o4l6OR5P2j54j32K29J09j85j80
7243b02K80J29k88q5K35Q4k24n1J36JnL9j09P7P3l6j69O9J70m5k55J04K03q1k12
7268a62J02J66j10r3N4Q3m3pJ0m6M9j7J3p3J58J2k24L1K10Jk11J1K35r9j28N7
7294b1J00q0j8l8O0oQ6j38r8J74J06k21nJ96L8k15r1J87J13k11J5J08Oj9m3J4
7320ak1J31o9j73J47J69j21k28R0L13j89k33J45J54o8j40K3J45n7o9k6N3Q5j2
7344D8j29m6K31M3k44k5J86R1k46j6J76Oj68j4R2Q1m0n5p0J11J64j87j25J36J47
7369A47j56j89K06J42j22j99J16J59r1j15N1L8Q2r4l6nJ90m4j99L5J77P8k55k9
$$ plain form
7393 -113 97 116 -97 -119 61 69 1 -30 20 65 15 5 -94 13 129 -46 -167 -2 124 10 -184 27 109 -20
7417 -20 -153 74 33 -34 22 -38 43 65 36 -37 -60 37 24 -105 -76 110 76 -121 -46 151 38 -72 -25 95 -48
7442 -48 -54 -43 -16 18 59 -53 -45 64 78 -73 -99 115 120 -96 -129 38 116 -62 -85 82 37 -63 -38 70 28 19 23 -63
7470 -63 3 55 -32 -138 -32 119 32 -177 29 135 25 -87 31 136 -15 4 0 71 47 -15 -89 -56 82 56 -152
7495 -152 -90 115 74 -120 -75 91 79 -151 -103 38 17 -71 -81 3 26 81 -86 -76 23 160 -94 -131 50 199 0
7520 0 -180 84 157 -73 -120 -9 57 28 -50 12 14 74 30 -100 -29 136 54 -112 -62 93 79 -172 -61 82 23 -145
7546 -145 -73 59 -36 -1 -31 9 48 49 -54 -96 134 125 -83 -100 138 82 -67 -134 58 58 -62 5 -14 34 42 15 4 56
7574 56 20 32 -83 -2 116 46 -125 -6 154 -36 -82 45 117 -82 -118 29 87 -23 -41 -15 22 59 46 -56 29
$$ packed form
7393a13K10J9k13k2J80Qo8l1N0M5n0j0r9J07J16j75j21J65J26j14j94K11Q2j29
7417b0j33K27m1o7N6o0Q1K2k9p3k3R7j3j29K9J86l4j97P5J97j13j10M7J20j43
7442d8oJ1K7L4M1j12QJ09J4j51k6K14Nk16l3J67P8j78k3J67m5j00K5J08m2rMq6
7470f3O6N2q7j06J06J51q7k09K06J06j10j12J18J05j51J9mP1k4o2p4L3J38k6k08
7495a52O2K05m1j94M5J66j2k30M8J41k1q8j0Q4K3N5j67J0R9J37k54l7J81J49j99
7520@j80K64P3k30m7J11O6k9p8O2KO0m4j30P1J65q2j66N0J55j4k51J11J43n9j68
7546a45P2J32r5L5l0M0L9Jj03m2K30rk08j7K38n6j49o7J92%j20O7j9M8Qk7j1N2
7574E6l6J2j15Q1J18p0j71J19J60j90m6J27P2j99l6J47N8j10j8K6L7L7j3j02Q5
$$ plain form
7599 29 86 84 -122 9 113 16 -127 -3 123 46 -93 -88 53 53 -50 -76 7 48 35 -50 -109 80 89 -30 -50 46 91
7626 91 -51 -78 78 55 -39 -75 28 78 1 -23 -69 27 38 4 -67 1 121 20 -82 -26 134 14 -151 -17 124
7651 124 84 -77 5 75 3 -64 -60 -18 105 -15 -66 -93 95 57 -63 -91 99 125 -62 -82 59 79 -46 -85 12 40
7677 40 19 -41 -67 26 51 -104 -95 95 150 21 -147 7 106 -47 -138 -31 102 -46 -40 6 81 69 -21 -95 -52 77
7703 77 59 -97 -51 91 84 -57 -49 167 38 -126 -43 54 38 -58 -27 -17 -25 -20 44 -37 8 81 -36 -101 31 73 -34 -59
7731 -59 22 158 -51 -90 69 82 -15 -45 -24 -2 16 -56 -59 -67 55 9 -111 -21 125 -1 -117 -29 136 -34 -97 9
7757 9 115 -19 -37 16 64 34 -61 -42 -27 55 53 -37 -30 114 88 -72 6 116 100 -48 -55 81 70 -40 -31 26 36 3 -63
7786 -63 -34 34 110 -65 -105 51 130 -105 -96 65 86 -46 -115 18 78 -25 -64 13 12 17 -29 -72 -14 109 -27 -107 -30
$$ packed form
7599B9N7kk06J31J04r7j43J24J26p7j39NJ41%j03k6Q3M1j3q5n9J89Rj19k0R6M5
7626I1j42k7J56k3r4l6J03N0p7k4m6R6J1l4p1O8J20j01j02N6J60j20j65J34J41
7651A24m0j61Q2P0p2o7MM2J23j20n1k7J88l8j20k8J90K6j87k0J41K0j25l9R7K8
7677D0k1o0k6R3K5j55RJ90N5j29j68J54R9j53r1J07J33j48OM6P5j2r0p4M3J29
7703G7j8j56M6J42pj41QK16j29j64Q3R7j6r6L1J0qNO4q1M5P3j17o5J32M2j07k5
7731e9Q1J36k09l9J59J3r7l0K1K2J8p2lqJ22m6j20R0J46j26j16Q8J65j70o3J06
7757IJ06j34j8N3M8l0r5J9J5Q2kr0PJ44k6j60P8J10j6j48pJ36j1j10RN7J0l3o6
7786f3K9O8P6j75m0J56P9k35RJ61K1j32o9J33O0j03l9P7jNm6m3N8J23j36q0P7
$$ plain form
7813 -30 85 35 -171 -54 104 19 -6 -24 82 31 -83 -29 42 44 49 -68 -84 73 78 -50 -42 45 85 -123 -119 10 69
7840 69 -47 -24 13 77 18 -43 -28 19 13 -28 -58 51 93 13 -128 11 99 25 -118 -53 56 62 -66 20 76 52 -15 -16
7868 -16 -23 54 21 -43 -72 112 39 -115 -70 84 106 -98 -38 91 37 -66 -18 21 40 -23 -75 -6 30 24 -9 -56 73 66
7896 66 -35 -69 43 123 -83 -104 62 101 -21 -83 0 53 -5 -20 -30 -24 101 39 -73 -5 51 -20 -91 -26 80 -27
7922 -27 -79 22 78 38 -87 -47 64 12 -67 -11 -5 42 -17 -50 -53 2 81 -23 -63 70 92 -81 -69 89 87 1 -33 30
7950 30 35 -5 -56 -14 26 111 -70 -19 30 106 -19 -105 21 73 -44 -98 62 100 -16 -48 3 5 7 -54 -54 -21 17 -3 -64
7979 -64 -17 94 90 -56 -21 98 54 -83 -10 67 89 -68 13 0 28 21 -12 -14 18 94 -59 -65 17 70 -38 -104 17 99
8007 99 -21 -95 20 120 -50 -72 15 12 74 -17 8 1 74 20 -84 -18 80 -12 -66 0 58 68 -12 -9 96 41 -27 -75 38
$$ packed form
7813c0J15n0k06J17J58q5k5j8J06n1j14N4P1KNj17j6J57Nj28QQ7M0k08MJ29N9
7840F9j16K3L7O4n9o1J5M7om1l0J09M2q0j41J39Q8p4j43O5J09Oj28Q6N6k4o7j
7868a6pP7l3o4k9J84p3j54M5J54K2k04O0J29n4j03M8L9J9o3n2O9L6ol3m7J29p
7896F6j01l4J12Q0k06k1J66L9j22o2Q3N3n8j5j0OJ25o2j12O8N6p1p1O5J06j07
7922b7n2J01N6m0j25M0J11n2p9N6OM7n9l3lN5P9j04m0J33K2j73J2J58kq6l4O3
7950C0Nm0n1M2M0Q5j81N1M9P6j25q6J26N2j17n4J60L8j16l2N1KKo1%L3L8k0o1
7979f4M7J11mj46L5J19m4j37P3P7K2j57Q1j3K8pl3kL2P6j53oQ2N3j08o6J21Q2
8007I9j20p4J15J00j70k2Q7lO2r1K5pP3n4j04O6R8r2n4O6N8J0q0LJ05n5o8m8J13
$$ plain form
8036 38 -22 -31 -23 -61 50 20 -93 -76 43 21 -43 -73 17 55 -17 -106 91 45 -43 -80 24 30 -52 -26 5 39 37 5 -68 69
8066 69 78 -5 -79 9 79 -47 -79 14 38 -18 -41 3 24 -3 -11 -6 42 65 -2 -59 -33 65 -1 -73 -19 44 77 -67 -31 48 7
8097 7 -36 -24 48 16 -9 8 7 21 25 8 -73 55 72 -34 -53 75 101 -31 -61 36 39 6 -73 -29 56 38 -25 -41 16 97
8127 97 -24 -105 -69 124 -53 -111 10 81 -16 -104 -11 9 10 -41 -35 93 58 -21 -32 -1 21 31 -89 -19 93 42 -60
8154 -60 -75 61 7 -79 -13 71 16 20 -56 1 -20 7 22 -38 17 42 -22 -96 39 83 -30 -52 -11 36 24 -59 36 145 30
8183 30 -1 -8 55 28 -22 -67 18 91
$$ packed form
8036C8o0rQl8J11l0j13J7J19k2o4l0R0L8p2q9J97m6q8l7J04Oq2K6L1L4kl2p3J37
8066F9Rq3p4Q8P0j26l2R3K4n6k3M4K1k7qNM8K3o7n7K6R8o6p2N4O3L3j44L6P9m1
8097Gm3J2P2l2k5J7jJ4Mj7q1J28J7j06j9J28K6j32l0R7Ll3p9M4Q5j8o3j6N7Q1
8127I7j21q1L6J93j77n8J21P1r7q8R3K0Jn1OJ28l5p9j1L1K2J0j20P0J12n1j02
8154f0j5J36n4q6O6Q4n5Mp6N7k1K7J5o0N5K5o4p4J35M4j13k2M1M7j2q3R5J09j15
8183C0l1pO3k7n0m5Q5P3
8191I1
$$ Imaginary data points
##PAGE= N=2
##DATA TABLE= (X++(I..I)), XYDATA
$$ plain form
0 0 0 0 0 0 0 0 0 0 0 0 0 0 0 0 0 0 0 0 0 0 0 0 2 -2 0 -3 4 -4 4 -7 12 -13 14 -15 20 -24 26 -32 36 -40 47 -52 59 -66 76
45 76 -86 94 -104 118 -129 141 -156 171 -186 203 -218 231 -246 257 -267 262 -243 198 -97 -115 554
66 554 -1563 4253 -14050 109977 773164 115217 -726416 -126901 571415 164699 -384902
77 -384902 -199792 159056 244603 60570 -289263 -265533 334626 428048 -365187 -539957 379001
88 379001 589104 -364909 -580087 323260 519154 -246702 -417015 145589 291597 -21601
98 -21601 -159104 -111687 34421 242930 68714 -357160 -142442 442160 181028 -489523
108 -489523 -189684 490128 169355 -446165 -132585 359983 87214 -242297 -45027 105912
118 105912 13910 33655 1206 -159219 3708 259411 -24032 -320534 57776 340452
$$ packed form
0@%%%%%%%%%%%%%%%%%%%%%%KmKlPqQj1J9k5K7k9L5m4N0n8O8p6Q7r9J11j25J42
45G6j62J80j98K22k47K70k97L27l57L89m21M49m77N03n24N29n05M41k95j8O69
66E54k117N816j8303J24027O63187o57947q41633N99515O98316m06716n49601
77c84902J85110L58848Q5547j84033l49833K3730O00159R3422p93235j74770R18958
88C79001K10103r54013k15178R03347J95894p65856j70313N62604J46008l13198
98b1601j37503M7417J46108K08509j74216m25874K14718N84602k61132o70551
108d89523K99839O79812l20773o15520L13580M92568k72769l29511J97270J50939
118A05912r2002J9745l2449j60425J62927K55703k83443k96502L78310K82676
$$ plain form
128 340452 -95003 -316712 129752 256876 -153609 -170678 160658 70864 -149323 26314
138 26314 117720 -109687 -72265 165020 15802 -188510 41455 175699 -93359 -130766 132242
149 132242 60836 -153266 24243 155664 -110177 -138314 186841 107826 -240570 -67686
159 -67686 265552 27464 -255982 6824 213086 -28450 -141646 32583 49062 -19568
169 -19568 51948 -10370 -151599 50126 235945 -94321 -297833 132631 329258 -157597
179 -157597 -328656 161856 298053 -140263 -241599 93451 169177 -22535 -87631 -63282
189 -63282 8848 156579 61553 -244445 -116699 316252 154146 -362258 -174200 374297
199 374297 178189 -350671 -172109 290026 158501 -199698 -144408 86309 131595 37396
$$ packed form
128C40452m35455k21709M46464J27124m10485j7069L31336q9794k20187J75637
138B6314R1406k27407L7422K37285j49218k04312K29965J34244k69058l7407K63008
149A32242p1406k14102J77509J31421k65841k8137L25155p9015l48396J72884
159f7686L33238k38088k83446K62806K06262k41536j13196J74229J6479o8630
169a9568P1516o2318j41229K01725J85819l30266k03512M30464J96627m86855
179a57597j71059M90512J36197m38316j01336L35050P5726j91712o5096K4349
189f3282P2130J47731r5026l05998J27746M32951j62106n16404J88058N48497
199C74297j96108n28860J78562M62135j31525l58199N5290K30717M5286r4199
$$ plain form
209 37396 -123235 -159369 119021 267609 -116576 -350114 114128 400620 -105558 -412919
219 -412919 89105 388786 -59956 -330719 18253 247270 35869 -148157 -98995 44037
229 44037 164641 52920 -227273 -135224 277096 193992 -309249 -228105 315824 235983 -295328
240 -295328 -222070 246848 191726 -173708 -151705 83172 110104 17337 -71490 -115880 42200
251 42200 203877 -22466 -270666 13490 310576 -11934 -319493 14283 296979 -16943
261 -16943 -247775 14746 176590 -6356 -94392 -11190 8969 35742 67889 -66333 -129099
272 -129099 98142 168205 -126554 -181543 147524 170791 -155793 -137721 150402 90622 -128932
283 -128932 -35534 94524 -17271 -49622 60835 -76 -88672 48304 96678 -89403 -85437
$$ packed form
209C7396j60631l6134K78390J48588l84185k33538M64242K86492n06178l07361
219d12919N02024K99681m48742k70763L48972K29017k11401j84026M9162J43032
229D4037J20604j11721k80193R2049M12320q3104n03241Q1144N43929p9841n31311
240b95328P3258M68918n5122l65434K2003K34877K6932r2767q8827m4390J58080
251D2200J61677k26343k48200K84156K97086l22510l07559L33776K82696l13922
261a6943k30832K62521J61844j82946q8036Q3202K0159K6773L2147j34222o2766
272a29099K27241P0063k94759n4989L29067K3267l26584J8072K88123n9780k19554
283a28932R3398J30058j11795l2351J10457o0911q8596J36976M8374j86081L966
$$ plain form
294 -85437 116882 55644 -128887 -14109 122356 -34108 -100289 80311 65420 -118481 -23772
305 -23772 142792 -17747 -149330 53281 138446 -75307 -110010 81801 69538 -69244 -20743
316 -20743 40147 -28984 2305 74710 -52293 -111524 101807 135224 -144439 -145671 171757
327 171757 141731 -179846 -127415 164675 104544 -127227 -78308 70069 52351 990 -29955
338 -29955 -77690 14237 152264 -4263 -214540 837 258593 -4 -277727 -248
348 -248 270501 4116 -237110 -14155 181402 31671 -110305 -57699 30402 88895 48293
359 48293 -123347 -119493 154726 175204 -178745 -212138 189605 228226 -183486 -223733 158926
370 158926 202418 -114896 -167339 55770 125538 15142 -80599 -89498 38876 160867 -2906
$$ packed form
294h5437K02319o1238j84531J14778J36465j56464o6181J80600j4891j83901R4709
305b3772J66564j60539j31583K02611Q5165k13753l4703J91811j2263j38782M8501
316b0743O0890o9131L1289P2405j27003n9231K13331L3417k79663j232L17428
327A71757l0026l21577N2431K92090o0131k31771M8919J48377j7718n1361l0945
338b9955m7735R1927J38027j56527k10277K15377K57756k58597k77723K77479
348b48K70749k66385k41226K22955J95557j49731j41976N2606Q8101N8493m0602
359D8293j71640L854K74219K0478l53949l3393M01743L8621m11712m0247L82659
370A58926M3492l17314n2443K23109O9768j10396r5741q899J28374J21991j63773
$$ plain form
381 -2906 -220788 -24775 262390 43204 -281405 -54603 274176 59367 -242514 -62031
391 -62031 188052 63694 -118046 -67932 38850 75089 40367 -85381 -111340 97660 167683
402 167683 -108354 -202960 115940 216226 -115658 -206374 106296 177608 -85488 -134298 54162
413 54162 83347 -14016 -31849 -31613 -14529 77144 49819 -118637 -72131 149516 79165 -167318
425 -167318 -73249 168448 56436 -152975 -33249 122516 8681 -80104 13300 31853 -27829
436 -27829 17646 33860 -61074 -29297 94288 15873 -112735 4549 114769 -28626 -100973
447 -100973 51729 72926 -71218 -36339 82454 -4566 -84827 42308 76724 -72279 -60197
458 -60197 88945 37066 -89879 -10752 74905 -14399 -44831 35927 4910 -49917 40850 56519
$$ packed form
381b906k17882J96013K87165k19186l24609K26802L28779k14809l01881J80483
391f2031K50083j24358j81740N0114J06782L6239l4722j25748k5959K09000P0023
402A67683k76037r4606L18900J00286l31884r0716L12670P1312k63096m8810J88460
413E4162K9185r7363j7833K36J7084R1673k7325j68456M6506K21647p0351k46483
425a67318R4069K41697j12012k09411J19726J55765j13835q8785R3404J8553n9682
436b7829M5475J6214r4934L1777J23585p8415j28608J17284J10220j43395p2347
447a00973J52702K1197j44144L4879J18793q7020q0261J27135L4416j49003J2082
458f0197J49142n1879j26945P9127Q5657q9304l0432Q0758l1017n4827R0767J5669
$$ plain form
470 56519 -84794 -54442 121860 46289 -146060 -34327 154009 21546 -144480 -11849
480 -11849 117343 6707 -76622 -9082 25458 17695 29033 -32579 -81873 50471 126859 -68124
492 -68124 -159162 81918 176521 -87512 -176615 83224 161521 -66096 -132552 37611 94765
503 94765 1395 -51757 -46795 9146 94023 28997 -138014 -59829 172374 80504 -193516 -92351
515 -92351 196468 94836 -181200 -91473 147205 84142 -97832 -75556 37796 68362 27152
526 27152 -63019 -89643 60708 144295 -59234 -184312 58093 207120 -54033 -210068 45556
537 45556 194121 -31007 -161792 9635 117031 17335 -65835 -48974 13159 81165 34480
548 34480 -111549 -73538 135474 100254 -150101 -113479 152690 113770 -141470 -102583 117396
$$ packed form
470E6519j41313L0352J76302p5571j92349J11733J88336j32463j66026J32631
480a1849J29192j10636q3329O7540L4540p763J1338o1612m9294J32344P6388j94983
492f8124r1038K41080R4603k64033q9103K59839P8297k27617o6456J70163N7154
503I4765r3370n3152M962N5941Q4877o5026j67011P8185K32203r1870k74020J01165
515i2351K88819j01632k76036Q9727K38678o3063j81974K2276J13352L0566m1210
526B7152r0171k6624J50351Q3587k03529j25078K42405J49027k61153j56035K55624
537D5556J48565k25128j30785J71427J07396r9696q3170J6861O2133O8006m6685
548C4480j46029L8011K09012l5220k50355L6622K66169l8920k55240L8887K19979
$$ plain form
559 117396 84008 -81170 -60874 36990 38184 11577 -18603 -58876 4936 100121 1872 -130945
571 -130945 -2519 147434 -2178 -148814 8934 134359 -16176 -107284 20196 70302
581 70302 -19952 -28936 14032 -11722 -2772 47020 -12335 -71968 29857 85140 -46141 -84353
593 -84353 59810 71712 -67419 -48928 68435 20141 -62049 9991 48778 -37443 -30886 57167
605 57167 9870 -67578 10116 65781 -27500 -53266 38735 30773 -43081 -2005 39680 -29254
617 -29254 -29101 59178 13631 -82785 4680 98191 -21511 -102037 34652 95194 -40302 -77707
629 -77707 37386 52374 -25081 -22594 4198 -8634 22247 36832 -51655 -60332 78661 75994
641 75994 -100221 -84023 111835 83931 -111483 -77605 98030 66887 -71943 -53402 36009
$$ packed form
559A17396l3388j65178K0296R7864J194k6607l0180m0273O3812R5185r8249j32817
571a30945J28426J49953j49612j46636J57748J25425j50535r1108J27480N0106
581G0302r0254q984M2968k5754Q950M9792n9355n9633J01825N5283j31281l8212
593h4353J44163J1902j39131J8491J17363m8294q2190P2040L8787q6221O557Q8053
605E7167m7297p7448P7694N5665r3281k5766R2001p962p3854M1076M1685o8934
617b9254J53Q8279m5547r6416Q7465R3511j19702q0526J36689O0542j35496l7405
629g7707J15093J4988p7455K487K6792j2832L0881J4585q8487q677J38993k667
641G5994j76215J6198J95858k7904j95414L3878J75635l1143j38830J8541Q9411
$$ plain form
652 36009 40316 6786 -28377 -50997 19619 92766 -13136 -126544 9416 148992 -6754
663 -6754 -157666 3516 151212 1269 -131153 -9658 98888 21245 -59023 -36957 14864
674 14864 54767 28050 -73274 -66011 89900 95425 -101638 -113752 106434 120889 -101455
685 -101455 -116466 86844 103375 -61864 -83360 28956 60146 9450 -36562 -49495 15216
696 15216 86679 1777 -117391 -14126 137276 21080 -145006 -24370 138774 24743
706 24743 -119930 -24271 90216 24416 -53049 -25993 12872 30195 26411 -35995 -59898 43491
718 43491 85204 -50242 -99314 55431 101863 -56901 -93337 53550 75553 -44727 -51922
729 -51922 30167 25171 -11518 -117 -10378 -21163 32204 35292 -52014 -41588 66795 39610
$$ packed form
652C6009M307l3530l5163k2620P0616P3147j05902j13408J35960J39576j55746
663f754j50912J61182J47696j49943j32422J21495J08546p7643q0268K2066N1821
674A4864L9903k6717j01324P263J55911N525j97063j2114K20186J4455k22344
685a01455j5011K03310J6531j65239k1496J12316L1190n0696m6012j2933O4711
696A5216P1463q4902j19168J03265J51402j16196j66086J20636J63144j14031
706B4743j44673R5659J14487o5800p7465K7056L8865J7323l784o2406k3903J03389
718D3491M1713j35446m9072J54745M6432j58764l6436J46887K2003j20280p195
729e1922Q2089m996l6689J1401j0261j0785N3367L088q7306J0426J08383k7185
$$ plain form
741 39610 -74666 -30504 74637 16716 -66062 -195 50818 -15191 -29918 27923 7158 -35130
753 -35130 15114 36295 -33473 -30985 45411 20004 -49749 -5490 45431 -11079 -33958 26478
765 26478 16232 -39652 4104 48032 -24654 -51124 41995 48771 -53224 -41388 56830 30809
777 30809 -51234 -17938 37459 5639 -16150 5280 -9451 -12873 36765 16996 -62107 -17636
789 -17636 82054 15302 -94244 -11842 96397 8234 -88712 -6651 70935 7662 -45794 -12500
801 -12500 15601 20564 16149 -31057 -45776 42612 70693 -52531 -87850 59374 96529 -60478
813 -60478 -95825 55103 87112 -42369 -71775 22965 52029 1514 -30758 -29109 9706 56361
825 56361 8311 -80978 -22819 99111 32469 -109248 -37904 109399 39800 -99190 -39061
$$ packed form
741C9610j14276M4162J05141n7921q2778O5867N1013o6009j4727N7841k0765m2288
753c5130N0244K1181o9768K488P6396k5407o9753M4259N0921n6510k2879O0436
765B6478j0246n5884M3756M3928p2686k6470R3119O776j01995J1836R8218k6021
777C0809q2043L3296N5397l1820k1789K1430j4731l422M9638j9769p9103M4471
789a7636R9690o6752j09546Q2402J08239q8163r6946Q2061P7586o3273n3456L3294
801a2500K8101M963m415m7206j4719Q8388K8081j23224l5319J47224L7155j57007
813f0478l5347J50928L2009j29481k9406R4740K9064n0515l2272J649L8815M6655
825E6361m8050q9289N8159J21930o6642j41717P1344J47303o9599j38990O0129
$$ plain form
836 -39061 79707 37447 -52154 -35468 20001 35021 14216 -35484 -46259 37356 73495 -39276
848 -39276 -92801 40336 102564 -39359 -102457 34803 92515 -26618 -75098 13871 51870
859 51870 2050 -26738 -20635 1925 39412 19416 -56611 -35429 70148 45153 -77669 -47872
871 -47872 78686 45062 -71963 -37349 58525 27387 -39213 -16602 16356 7076 7602 -352
883 -352 -30319 -3223 48699 2756 -61466 248 66511 -5708 -64315 11482 54526 -16599
895 -16599 -39241 19495 20316 -19214 -399 15932 -17688 -9255 31876 752 -39964 9111 41416
908 41416 -18131 -35663 25294 24216 -29413 -8619 29709 -8803 -26471 25222 19799 -38492
920 -38492 -11425 46350 2177 -48072 5720 42819 -11446 -31600 13601 15844 -11857 2676
$$ packed form
836c9061J18768m2260q9601J6686N5469J5020k0805m9700j0775Q3615L6139j12771
848c9276n3525J33137O2228j41923o3098J37260N7712j19133m8480Q8969L7999
859E1870m9820k8788O103K2560L7487j9996p6027K1182J05577k4995j22822K9797
871d7872J26558l3624j17025L4614R5874l1138o6600K2611L2958r280N26p954
883c52k9967K7096N1922m5943o4222O1714O6263p2219n8607P5797M3044p1125
895a6599k2642N8736Q21l9530J8815J6331l3620Q433M1131l1124m0716M9075L2305
908D1416n9547j7532O0957j078n3629K0794L8328l8512j7668N1693n423n8291
920c8492K7067N7775m4173n0249N3792L7099n4265k0154M5201K243k7701J4533
$$ plain form
932 2676 6795 -21272 1420 38256 -10587 -50986 19902 58742 -26788 -60318 30204 55962
944 55962 -28912 -46643 22082 33250 -10706 -18046 -5041 2163 22801 12021 -40957 -23700
956 -23700 56671 31867 -68062 -36125 73224 37159 -70768 -35224 60963 31965 -43798 -27751
968 -27751 21718 24186 3588 -21396 -29131 19912 52283 -19394 -70572 18953 81744 -18286
980 -18286 -85412 15654 80707 -11147 -69230 3554 51787 6212 -31012 -18262 8974 31254
992 31254 12074 -43800 -29724 54561 43136 -61502 -50859 63943 53479 -60386 -50911 51157
1004 51157 44637 -36456 -35955 17508 26213 3670 -17093 -25382 9238 44777 -3689 -60348 299
1017 299 69685 990 -72343 -1151 67756 867 -56589 -1084 40488 2588 -21042 -5557
$$ packed form
932B676M119k8067K2692L6836m8843m0399P0888L8840q5530l3530R0522K5758
944E5962q4874j7731O8725J1168m3956p340J3005P204K0638j0780n2978J7257
956b3700Q0371k4804r9929L1937J09349l6065j07927L5544R6187k8998p5763J6047
968b7751M9469K468k0598k4984p735M9043L2371p1677n1178Q9525O2791j00030
980a8286o7126J01066O5053r1854n8083P2784M8233m5575l7224J2750K7236K2280
992C1254j9180n5874J4076Q4285j1425j04638J0643J14802j0464j13865R475J02068
1004E1157o520q1093N01N3463Q705k2543k0763q289L4620L5539m8466n6659O0647
1017B99O9386o8695p3333P1192O8907o6889n7456N5505M1572l7900k3630J5485
$$ plain form
1029 -5557 1303 10378 17285 -16073 -31862 22249 41553 -27642 -45290 31227 43162 -32317 -36166
1042 -36166 29991 25305 -24737 -12786 16293 64 -6149 10678 -5060 -18431 15755 22200
1054 22200 -24447 -21460 30250 17119 -31937 -9418 29848 260 -23689 9499 14818 -17947
1066 -17947 -4104 23949 -6835 -26875 16136 25807 -22750 -21702 25144 14393 -23273 -5720
1078 -5720 16828 -3734 -7056 12336 -4984 -19104 17658 23502 -28724 -24880 37070 23861 -40689
1091 -40689 -20543 39440 16291 -32669 -11438 21418 7264 -6631 -4333 -9816 2775 25968
1103 25968 -2993 -40482 3717 51038 -5222 -56900 5915 56944 -5528 -51726 3108 41452
1115 41452 1472 -27548 -7993 11621 16355 5008 -25143 -20049 33775 32712 -40366 -41176 44190
$$ packed form
1029e557O860R075O907l3358j5789N4111J9304o9195j7648P6517J1935p5479l849
1042c6166O6157m686n0042J1951K9079j6229o213J6827j5738j3371L4186O445
1054B2200m6647K987N1710j3131m9056K2519L9266k9588k3949L3188N319l2765
1066a7947J3843K8053l0784k0040M3011R671m8557J048M6846j0751l7666J7553
1078e720K2548k0562l322J9392j7320j4120L6762N844n2226L844O1950j3209o4550
1091d0689K0146N9983k3149m8960K1231L2856j4154j3895K298n483J2591K3193
1103B5968k8961l7489M4199M7321n6260n1678O2815N1029o2472m6198N4834L8344
1115D1452l9980k9020J9555J9614M734j1347l0151N094N3824j063p3078q10Q5366
$$ plain form
1128 44190 45555 -43860 -45520 39105 41605 -29966 -34998 16697 26493 -941 -17704 -16230 9227
1141 9227 32612 -2234 -46822 -3106 56779 6697 -61638 -8818 60880 10074 -54239 -10950
1153 -10950 42796 12396 -27510 -14263 10304 17158 7224 -20507 -23038 24023 35758 -27097
1165 -27097 -44410 28650 47886 -28255 -46724 25222 40833 -19620 -32032 11361 20950 -1377
1177 -1377 -9421 -9723 -1177 20692 9802 -30125 -15330 37237 17911 -40544 -17130 40086 14224
1190 14224 -35389 -9604 27107 4535 -16191 -69 3770 -3199 8273 4280 -18978 -3744
1202 -3744 26589 1181 -30710 2260 30519 -6223 -26373 9756 18904 -12103 -9246 13017
1214 13017 -954 -11925 10913 9482 -18497 -5569 23422 1259 -24496 3102 21779 -6727
$$ packed form
1128D4190J365q9415j660Q4625K500p1571n032N1695R796k7434j6763J474K5457
1141I227K3385l4846m4588M3716N9885n0082o8335N2820O9698n0806o4313M3289
1153a0950N3746l0400l9906J3247K4567O854r934k7731k531M7061J1735o2855
1165b7097j7313P3060J9236p6141j8469P1946J5611o0453j2412M3393R589k2327
1177a377q044l02Q546K1869j0890l9927J4795N2567j9326n8455K3414N7216k5862
1190A4224m9613K5785L6711k2572k0726J6122L839o969J1472l993k3258J5234
1202c744L0333k5408l1891L2970K8259l6742k0150L6129R148l1007K857K2263
1214A3017j3971j0971K2838j431k7979J2928K8991k2163k5755K7598J8677k8506
$$ plain form
1226 -6727 -15665 8807 6725 -9436 3278 8041 -13739 -5588 22644 1770 -29238 1995 32251
1239 32251 -5308 -31622 7234 27203 -7100 -19500 5078 9847 -584 1146 -5196 -11579 12155
1252 12155 20818 -18751 -27503 24153 31296 -27252 -32052 27136 29868 -23781 -25608 16749 19505
1265 19505 -7091 -13014 -4701 6482 17042 -800 -28697 -3806 38369 7298 -44585 -9394
$$ packed form
1226f727q938K4472k082j6161J2714M763k1780Q151K8232k0874l1008L1233L0256
1239C2251l7559k6314L8856J9969l4303j2400K4578M769j0431J730o342o383K3734
1252A2155Q663l9569q752N1656P143n8548m800N9188K732n3649j827M2357K756
1265A9505k6596n923Q313J1183J0560j7842k7897K4891M2175l1071n1883L5191
$$ [...]
8191a
##END NTUPLES=NMR FID
##END=
