##TITLE=1H_LY-DMAA.Per.2.13
 CDCl3
 8 sc, 
 18.02.2022
##JCAMPDX= 6.0         $$ Bruker NMR JCAMP-DX V2.0
##DATA TYPE= NMR FID
##DATA CLASS= NTUPLES
##ORIGIN= UXNMR, Bruker Analytische Messtechnik GmbH
##OWNER= root
$$ XWIN-NMR		Version 3.5
$$ Fri Feb 18 11:52:37 2022 Russian Standard Time (UT+4h)  she@DPX200
##.OBSERVE FREQUENCY= 200.131346
##.OBSERVE NUCLEUS= ^1H
##.DELAY= (6, 6)
##.ACQUISITION MODE= SIMULTANEOUS
##.ACQUISITION SCHEME= undefined
##.AVERAGES= 8
##.DIGITISER RES= 18
##SPECTROMETER/DATA SYSTEM= spect
##.PULSE SEQUENCE= zg30
##.SOLVENT NAME= CDCl3
##.SHIFT REFERENCE= (INTERNAL, CDCl3, 0, 15.7039)
##AUDIT TRAIL= $$ (NUMBER, WHEN, WHO, WHERE, WHAT)
$$ ##TITLE= Audit trail, XWIN-NMR		Version 3.5
$$ ##JCAMPDX= 5.01
$$ ##ORIGIN= Bruker BioSpin GmbH
$$ ##OWNER= she
$$ F:/spectra/data/she/nmr/H-F/1/audita.txt
$$ ##AUDIT TRAIL=  $$ (NUMBER, WHEN, WHO, WHERE, WHAT)
(   1,<2022-02-18 11:51:04.10 +0400>,<she>,<DPX200>,
      <created by zg, POWCHK disabled, PULCHK disabled
       configuration hash MD5:
       00 E9 B6 7A A2 85 ED C7 34 08 36 98 17 FE 4E 26
       data hash MD5: 16K
       AB 9A A4 6C 8B FB FB B5 66 BB EE 40 F7 C0 3D 24>)
$$ ##END=
$$ 
$$ hash MD5
$$ ED 42 91 2E CF 40 B4 CB A3 82 4B 41 86 AF D8 C3
##$RELAX= 
##$RELAX= 
##$RELAX= 
##$RELAX= 
##$RELAX= 
##$RELAX= 
$$ Bruker specific parameters
$$ --------------------------
##$DU= <F:/spectra>
##$EXPNO= 1
##$NAME= <H-F>
##$PROCNO= 1
##$TYPE= <nmr>
##$USER= <she>
##$AMP= (0..31)
100 100 100 100 100 100 100 100 100 100 100 100 100 100 100 100 100 100 
100 100 100 100 100 100 100 100 100 100 100 100 100 100 
##$AQSEQ= 0
##$AQ_mod= 1
##$AUNM= <au_zg>
##$AUTOPOS= <>
##$BF1= 200.13
##$BF2= 200.13
##$BF3= 200.13
##$BF4= 200.13
##$BF5= 200.13
##$BF6= 200.13
##$BF7= 200.13
##$BF8= 200.13
##$BYTORDA= 1
##$CFDGTYP= 0
##$CFRGTYP= 5
##$CHEMSTR= <none>
##$CNST= (0..31)
1 1 145 1 1 1 1 1 1 1 1 1 1 1 1 1 1 1 1 1 1 1 1 1 1 1 1 1 1 1 1 1 
##$CPDPRG= <>
##$CPDPRG1= <>
##$CPDPRG2= <>
##$CPDPRG3= <>
##$CPDPRG4= <mlev>
##$CPDPRG5= <mlev>
##$CPDPRG6= <mlev>
##$CPDPRG7= <mlev>
##$CPDPRG8= <mlev>
##$CPDPRGB= <>
##$CPDPRGT= <>
##$D= (0..31)
0 1.2 0 0 0 0 0 0 0 0.06 0 0.03 0 0 0 0 0.0002 0 0 0 0 0 0 0 0 0 0 0 0 
0 0 0 
##$DATE= 1645170663
##$DBL= (0..7)
120 120 120 120 120 120 120 120 
##$DBP= (0..7)
150 150 150 150 150 150 150 150 
##$DBP07= 0
##$DBPNAM0= <>
##$DBPNAM1= <>
##$DBPNAM2= <>
##$DBPNAM3= <>
##$DBPNAM4= <>
##$DBPNAM5= <>
##$DBPNAM6= <>
##$DBPNAM7= <>
##$DBPOAL= (0..7)
0.5 0.5 0.5 0.5 0.5 0.5 0.5 0.5 
##$DBPOFFS= (0..7)
0 0 0 0 0 0 0 0 
##$DE= 6
##$DECBNUC= <off>
##$DECIM= 32
##$DECNUC= <off>
##$DECSTAT= 4
##$DIGMOD= 1
##$DIGTYP= 9
##$DL= (0..7)
0 120 120 120 120 120 120 120 
##$DP= (0..7)
150 150 150 150 150 150 150 150 
##$DP07= 0
##$DPNAME0= <>
##$DPNAME1= <>
##$DPNAME2= <>
##$DPNAME3= <>
##$DPNAME4= <>
##$DPNAME5= <>
##$DPNAME6= <>
##$DPNAME7= <>
##$DPOAL= (0..7)
0.5 0.5 0.5 0.5 0.5 0.5 0.5 0.5 
##$DPOFFS= (0..7)
0 0 0 0 0 0 0 0 
##$DQDMODE= 0
##$DR= 18
##$DS= 0
$$ [...]
##$SUBNAM2= <"">
##$SUBNAM3= <"">
##$SUBNAM4= <"">
##$SUBNAM5= <"">
##$SUBNAM6= <"">
##$SUBNAM7= <"">
##$SUBNAM8= <"">
##$SUBNAM9= <"">
##$SW= 18.0517287032376
##$SWIBOX= (0..15)
0 0 2 0 0 0 0 0 0 0 0 0 0 0 0 0 
##$SW_h= 3612.71676300578
##$TD= 16384
##$TD0= 1
##$TE= 0
##$TE2= 300
##$TE3= 300
##$TEG= 300
##$TL= (0..7)
0 120 120 120 120 120 120 120 
##$TP= (0..7)
150 150 150 150 150 150 150 150 
##$TP07= 0
##$TPNAME0= <>
##$TPNAME1= <>
##$TPNAME2= <>
##$TPNAME3= <>
##$TPNAME4= <>
##$TPNAME5= <>
##$TPNAME6= <>
##$TPNAME7= <>
##$TPOAL= (0..7)
0.5 0.5 0.5 0.5 0.5 0.5 0.5 0.5 
##$TPOFFS= (0..7)
0 0 0 0 0 0 0 0 
##$TUNHIN= 0
##$TUNHOUT= 0
##$TUNXOUT= 0
##$USERA1= <user>
##$USERA2= <user>
##$USERA3= <user>
##$USERA4= <user>
##$USERA5= <user>
##$V9= 5
##$VALIST= <valist>
##$VCLIST= <CCCCCCCCCCCCCCC>
##$VD= 0
##$VDLIST= <DDDDDDDDDDDDDDD>
##$VPLIST= <PPPPPPPPPPPPPPP>
##$VTLIST= <TTTTTTTTTTTTTTT>
##$WBST= 1024
##$WBSW= 4
##$XGAIN= (0..3)
0 0 0 0 
##$XL= 0
##$YL= 0
##$YMAX_a= 340812
##$YMIN_a= -292116
##$ZGOPTNS= <>
##$ZL1= 120
##$ZL2= 120
##$ZL3= 120
##$ZL4= 120
##$ABSF1= 10
##$ABSF2= 0
##$ABSG= 5
##$ABSL= 3
##$ALPHA= 0
##$AQORDER= 0
##$ASSFAC= 0
##$ASSFACI= 0
##$ASSFACX= 0
##$ASSWID= 0
##$AUNMP= <proc_1d>
##$AZFE= 0.1
##$AZFW= 0.1
##$BCFW= 1
##$BC_mod= 2
##$BYTORDP= 1
##$COROFFS= 0
##$CY= 11.3945322036743
##$DATMOD= 1
##$DC= 2
##$DFILT= <>
##$DTYPP= 0
##$F1P= 2.36226072786647
##$F2P= -0.459571619588291
##$FCOR= 0.5
##$FTSIZE= 0
##$FT_mod= 4
##$GAMMA= 1
##$GB= 0.15
##$INTBC= 1
##$INTSCL= 1
##$ISEN= 128
##$LB= 0.24
##$LEV0= 0
##$LPBIN= 0
##$MAXI= 10000
##$MC2= 0
##$MEAN= 0
##$ME_mod= 0
##$MI= 1.114404
##$NCOEF= 0
##$NC_proc= 0
##$NLEV= 6
##$NOISF1= 3.799351
##$NOISF2= 2.8
##$NSP= 1
##$NTH_PI= 0
##$NZP= 0
##$OFFSET= 15.70392
##$PC= 1
##$PHC0= -16748.37
##$PHC1= 10.40078
##$PH_mod= 1
##$PKNL= yes
##$PPARMOD= 0
##$PSCAL= 0
##$PSIGN= 0
##$REVERSE= no
##$SF= 200.130013532006
##$SI= 16384
##$SIGF1= 3
##$SIGF2= 2
##$SINO= 400
##$SIOLD= 16384
##$SREGLST= <1H.CDCl3>
##$SSB= 0
##$STSI= 0
##$STSR= 0
##$SW_p= 3612.71676300578
##$SYMM= 0
##$S_DEV= 0
##$TDeff= 0
##$TDoff= 0
##$TI= <>
##$TILT= no
##$TM1= 0
##$TM2= 0
##$TOPLEV= 0
##$USERP1= <user>
##$USERP2= <user>
##$USERP3= <user>
##$USERP4= <user>
##$USERP5= <user>
##$WDW= 1
##$XDIM= 8192
##$YMAX_p= 0
##$YMIN_p= 0
$$ End of Bruker specific parameters
$$ ---------------------------------
##NTUPLES= NMR FID
##VAR_NAME=  TIME,          FID/REAL,        FID/IMAG
##SYMBOL=    X,             R,               I
##VAR_TYPE=  INDEPENDENT,   DEPENDENT,       DEPENDENT
##VAR_FORM=  AFFN,          ASDF,            ASDF
##VAR_DIM=   8192,          8192,            8192
##UNITS=     SECONDS,       ARBITRARY UNITS, ARBITRARY UNITS
##FACTOR=    0.0002768,     1,               1
##FIRST=     0,             0,               0
##LAST=      2.2672688,     0,               0
##MIN=       0,             -292116,         0
##MAX=       2.2672688,     340812,          0
$$ Real data points
##PAGE= N=1
##DATA TABLE= (X++(R..R)), XYDATA
0 0 0 0 0 0 0 0 0 0 0 0 8 -8 8 -8 9 -16 16 -24 24 -32 40 -48 56 -64 74 -89 102 -121 137 -155 178 -203 232
33 232 -260 296 -332 372 -418 469 -521 581 -645 716 -791 877 -970 1068 -1178 1299 -1432
50 -1432 1578 -1736 1914 -2114 2334 -2584 2871 -3197 3578 -4028 4565 -5227 6066 -7158 8650
65 8650 -10827 14302 -20736 36592 -158540 -95837 340812 110940 -238937 -172261 155212
76 155212 157075 -30508 -125380 -61544 43242 146502 47760 -179011 -151609 182912 231844
87 231844 -142137 -288585 85443 300502 -13036 -274559 -45876 208843 87916 -121668
97 -121668 -96476 21957 74370 66552 -25088 -139061 -42681 177454 113346 -186016 -174242
108 -174242 162652 213012 -118884 -220765 66352 199035 -15432 -147543 -20276 79219
118 79219 36622 -1999 -28825 -68234 2954 123777 35353 -156878 -76214 165621 109271
129 109271 -153534 -128722 124365 126993 -90003 -107545 54974 70618 -28903 -25171 13002
140 13002 -23243 -9378 66910 15964 -98966 -26556 118830 38748 -123426 -44618 118133
151 118133 44582 -103498 -34459 86180 17001 -68939 5518 54530 -29741 -44729 50279
162 50279 36326 -67222 -30699 75866 22257 -79280 -11912 76556 -3467 -71987 21907
173 21907 67592 -41086 -63909 59484 63209 -72035 -61831 79074 60793 -76341 -54193
184 -54193 67584 42160 -53256 -22352 37913 -4401 -25265 34902 17320 -67361 -18056 94221
196 94221 24407 -113550 -36740 119478 48626 -112898 -57370 93299 57888 -64007 -46586
207 -46586 31307 23998 574 10433 -23388 -49624 36141 90465 -34298 -123903 20930 145183
219 145183 1216 -149305 -25777 134348 44896 -103888 -54648 60575 48408 -14010 -27631
230 -27631 -30206 -7830 62755 50694 -79743 -94188 79247 130532 -62288 -151557 35269
241 35269 154467 -2921 -135497 -24246 99656 41747 -50573 -43203 -2367 28499 51450
252 51450 434 -89374 -39466 109256 79216 -110943 -113835 93784 133913 -64936 -136858
263 -136858 29192 119457 4198 -84172 -28302 36493 38430 16786 -31352 -65389 10838 104240
275 104240 21084 -125308 -55066 128269 85251 -112718 -103663 84079 105845 -49053 -91091
286 -91091 13823 59789 13013 -18496 -28973 -28035 29639 70209 -18476 -103190 -1941 121463
298 121463 25738 -123405 -46452 110778 59896 -85448 -60630 55186 49655 -23495 -26461
309 -26461 -2381 -3524 20171 36800 -27473 -67450 24679 90078 -15368 -102777 1875 102345
321 102345 9298 -92051 -17072 72091 16862 -48209 -9257 23530 -5254 -1982 24019 -13328
333 -13328 -42700 23155 59674 -25797 -70046 25367 74090 -22178 -69881 20342 59953 -20500
345 -20500 -45823 23349 29624 -29290 -14604 35836 865 -42953 8998 46959 -17084 -48316
357 -48316 22709 45164 -27886 -38751 33351 29963 -39010 -19733 46062 11032 -51743 -3109
369 -3109 56734 -1445 -57526 4972 54748 -7119 -46956 9752 34728 -14606 -20093 21648
381 21648 4022 -32583 9378 44343 -20131 -57048 25024 66811 -25104 -72089 20495 70570
393 70570 -13507 -60785 7363 44662 -3302 -22265 4861 -1552 -11308 25113 23836 -43443 -39105
406 -39105 54780 54915 -57549 -67636 51675 73412 -39977 -71287 23973 58540 -9243 -37958
418 -37958 -2336 10326 6713 19074 -3424 -46753 -7238 68602 23619 -80211 -40832 81513
430 81513 56378 -71342 -64356 53764 63726 -31013 -51862 8732 30274 9015 -1846 -19273
442 -19273 -29659 19393 58156 -11614 -80726 -3619 91950 20601 -92040 -36499 80077 45928
454 45928 -59375 -46244 34076 37018 -7988 -17678 -13102 -7301 27612 35863 -31882 -61452 27886
467 27886 81191 -16454 -90909 1543 89450 12693 -77495 -23270 56174 25767 -30801 -20678
479 -20678 3941 6587 18558 12629 -34845 -34841 42298 55447 -40870 -70377 32970 77618 -20408
492 -20408 -74557 8293 63213 1878 -43873 -5956 21062 3959 2375 4193 -22781 -17003 37199
505 37199 30738 -45314 -43690 45797 51711 -41502 -54467 33203 49668 -24672 -39095 17264 23770
518 23770 -12847 -5966 12422 -11162 -14740 26462 19938 -36832 -24701 43160 28915 -44392 -29693
531 -29693 42221 27254 -37763 -21230 32327 11671 -28000 -1155 24113 -10320 -22429 19749
543 19749 20656 -27682 -19447 32375 17116 -34467 -13071 34753 7581 -33400 185 32307 -7833
556 -7833 -30589 16141 29966 -22304 -28583 26978 26792 -28803 -23292 28191 17323 -26484 -9540
569 -9540 23347 -1091 -21416 12096 19787 -23796 -20601 33337 22194 -39984 -24621 42779 26351
582 26351 -40879 -25726 35642 22559 -26953 -14724 18134 4015 -9519 10146 4038 -24872
594 -24872 -1657 38755 2982 -49549 -7541 54923 12860 -54883 -18264 48170 20228 -37303
606 -37303 -18636 22945 11581 -8382 -125 -4196 -14676 13008 31057 -16379 -45380 15185
618 15185 56436 -9330 -60893 1983 59032 5854 -49800 -10842 35379 11530 -17781 -7155
630 -7155 -644 -2726 16192 15804 -27889 -31188 32845 44750 -32040 -54911 25686 58810 -16278
643 -16278 -55605 6219 45670 2209 -29543 -5949 10710 4979 8969 1757 -25619 -11999 37730
656 37730 24474 -43335 -36082 42326 44143 -36100 -47201 25936 43308 -15312 -33847 5526
668 5526 18749 306 -1447 -1998 -16262 -978 31739 7596 -42435 -15616 47946 23897 -46897
681 -46897 -29067 41508 30837 -31825 -27012 21327 18791 -11164 -6566 3565 -7798 386 21818
694 21818 -1239 -34242 -1544 42142 5427 -45862 -9885 44202 12321 -38683 -12305 30236
706 30236 9077 -20522 -2361 11728 -6064 -4086 15982 -513 -24603 3319 31908 -3665
718 -3665 -35696 3337 36373 -3009 -33953 3381 28681 -5576 -22372 8769 15052 -13629
730 -13629 -8738 18282 2926 -23001 1347 26109 -4712 -27400 7545 26887 -9917 -24015
742 -24015 13060 20261 -15894 -15090 19800 10549 -23005 -5953 25853 2454 -27357 414 26873
755 26873 -3115 -24730 5419 20280 -8848 -15072 12526 8852 -17541 -3396 22453 -1201
767 -1201 -27197 4289 30829 -5434 -32140 5677 31183 -4854 -26702 4896 20448 -5471
779 -5471 -11844 8019 2852 -12206 5733 17756 -12637 -23993 16718 29302 -18392 -33253 16864
792 16864 33808 -13918 -31280 9857 24742 -6540 -15279 4818 4132 -5227 7732 8553 -17903
805 -17903 -13409 25822 19876 -29613 -25208 29740 29107 -26002 -29634 20078 26254 -13169 -19258 6623
819 6623 8613 -2475 3224 648 -15699 -2521 25988 6283 -33501 -11771 36642 17058 -35472
832 -35472 -20563 30654 21514 -22745 -18243 14238 11972 -5636 -2132 -424 -8934 4037 20500
845 20500 -4277 -30163 1771 36649 2187 -39317 -6989 37153 10173 -31610 -11563 22708
857 22708 9297 -13017 -4211 3525 -3629 4192 12958 -8907 -21954 10844 29769 -9592 -34198
870 -34198 6950 35394 -3140 -32340 306 26262 1099 -17875 -104 8369 -3389 318
882 318 8365 -7864 -14774 12613 20399 -15297 -25248 15163 27428 -13704 -26931 11285 23707
895 23707 -8973 -17853 7850 10694 -7627 -2430 9241 -4851 -11451 11231 14484 -15443 -16967
908 -16967 17854 18267 -18477 -18122 17505 15792 -16265 -11970 14422 6524 -13510 -824 12766
921 12766 -5038 -12729 9968 12846 -13748 -12558 16320 11888 -17210 -9820 17552 7235 -16839
934 -16839 -3249 16392 -827 -15712 5261 15191 -9085 -14692 11949 13652 -13907 -12344 14490
947 14490 9686 -14720 -6486 13942 1936 -13462 2920 13010 -7880 -12949 12445 13377 -15622
960 -15622 -13425 17775 13441 -17816 -12222 16855 10035 -14351 -6085 11698 1091 -9061 4873
973 4873 7161 -11283 -6525 16697 6567 -21191 -7698 23257 8563 -23450 -9210 21004 8516
986 8516 -17164 -6330 12244 2398 -7015 3228 2845 -9474 264 16177 -1246 -21624 1049
999 1049 25544 613 -26783 -2572 25331 3989 -21617 -4449 15566 2781 -8997 343
1011 343 2025 -5605 3543 11461 -7596 -17678 9240 22724 -8911 -25780 7167 26351 -4340
1024 -4340 -23768 2193 18996 -579 -11851 1086 4295 -3061 3307 6825 -9505 -11608 13640
1037 13640 16193 -15656 -20126 15004 21942 -13089 -21792 9805 18712 -6778 -13673 4369 6896
1050 6896 -3354 616 4081 -7623 -5949 13660 9129 -17392 -12087 19294 14703 -18567 -15650
1063 -15650 16381 14877 -12988 -11993 9394 7082 -6509 -1264 4337 -5426 -3816 11317 4089 -16288
1077 -16288 -5488 19159 6833 -20202 -7736 19285 7713 -16776 -6090 13580 3498 -9826
1089 -9826 659 6771 -5054 -4206 9840 2733 -13760 -1901 16549 1572 -18113 -1538 17849
1102 17849 906 -16640 -112 13888 -1782 -11137 4028 7880 -6880 -5079 9739 2743 -12207
1115 -12207 -726 14067 -489 -14654 1968 14595 -2962 -13122 4674 11215 -6279 -8645
1127 -8645 8452 6105 -10477 -3775 12121 1581 -13537 -31 13670 -1684 -13300 3013
1139 3013 11686 -4770 -9565 6606 6880 -8693 -4203 10972 1943 -12919 143 14637 -1285
1152 -1285 -15070 2300 14885 -2705 -13318 3392 10713 -4258 -7357 5606 3597 -7598 -115
1165 -115 9723 -3060 -12230 5070 14108 -6283 -15437 6380 15387 -5898 -13983 5178 11207 -4507
1179 -4507 -7183 4656 2722 -5226 2237 6909 -6297 -8875 9673 11174 -11404 -12951 11775 13760
1193 13760 -10974 -13354 9008 11132 -7137 -7760 5181 2995 -4281 2035 3996 -7174 -4871 11316
1207 11316 6434 -14276 -8079 15545 9690 -14970 -10164 13313 9671 -10300 -7496 7316 4107
1220 4107 -4393 443 2330 -5410 -1362 10000 1301 -13989 -2483 16188 3601 -17071 -4959
1233 -4959 15782 5235 -13485 -4708 9994 2864 -6212 236 2857 -3980 -86 8318 -1386 -11839
1247 -11839 2123 14877 -1695 -16214 1037 16119 -296 -14595 -76 11533 -440 -8063
1259 -8063 1610 3995 -3917 -621 6372 -2395 -9279 4185 11514 -5244 -13109 5366 13717 -4883
1273 -4883 -12826 4441 10946 -3923 -7898 4169 4637 -4634 -1015 5871 -2163 -7275 4734 8631
1287 8631 -6538 -9769 7332 9918 -7728 -9537 7405 7919 -7209 -5846 6811 2971 -6787 -81
1301 -81 6988 -2630 -7172 5083 7586 -6706 -7393 7948 7159 -8324 -6005 8527 4489 -8319
1315 -8319 -2513 8071 203 -7817 2048 7542 -4273 -7461 5844 6950 -7122 -6417 7595 5238
1329 5238 -7861 -3828 7636 1905 -7369 334 7073 -2586 -6753 4897 6781 -6554 -6480 7864
1343 7864 6378 -8331 -5588 8321 4468 -7696 -2831 6776 525 -5944 1893 5068 -4748 -4752 7057
1358 7057 4404 -9141 -4541 10271 4493 -10464 -4223 9996 3635 -8529 -2234 6866 502 -4740
1372 -4740 2160 3171 -4763 -1763 7567 1171 -9819 -972 11329 1120 -12009 -1556 11274
1385 11274 1572 -9893 -1381 7398 192 -4836 1352 2084 -3778 124 6323 -1649 -8728 2507
1399 2507 10768 -2460 -11736 2144 11820 -1341 -10474 1010 8445 -991 -5409 1636 2320 -3011
1413 -3011 685 4807 -3232 -6947 4793 8699 -5746 -10168 5592 10525 -5039 -9979 4072 8448
1427 8448 -3196 -5856 2799 2892 -2736 488 3550 -3306 -4459 5832 5915 -7272 -7023 7870 7794 -7625
1443 -7625 -7819 6699 6767 -5582 -5114 4337 2585 -3668 101 3132 -3099 -3263 5509 3667 -7344
1458 -7344 -4246 8511 4844 -8679 -4715 8316 4399 -7200 -3111 6089 1495 -4723 720 3659
1472 3659 -2972 -2920 5114 2408 -6940 -2351 8002 2035 -8599 -1963 8305 1373 -7635 -683 6434
1487 6434 -575 -5101 2017 3860 -3590 -2597 5232 1772 -6414 -981 7368 539 -7534 127 7373
1502 7373 -657 -6633 1460 5549 -2544 -4460 3611 3145 -4890 -2225 5820 1127 -6667 -462 6855
1517 6855 -337 -6851 1001 6184 -1771 -5235 2717 4126 -3651 -2845 4912 1715 -5812 -595 6708
1532 6708 -94 -7060 773 7092 -1235 -6561 1640 5458 -2341 -4231 2939 2501 -3920 -1105 4796
1547 4796 -418 -5927 1392 6621 -2097 -7161 2530 7152 -2490 -6489 2529 5417 -2433 -3627 2880
1562 2880 1894 -3200 177 4121 -1915 -4965 3180 5765 -4124 -6506 4322 6532 -4363 -6299 3821
1577 3821 5224 -3385 -3697 2896 1606 -2733 647 2927 -2598 -3204 4525 3998 -5669 -4499 6364
1592 6364 5020 -6218 -4931 5640 4438 -4638 -3243 3612 1508 -2612 527 1983 -2805 -1895 4617
1607 4617 1882 -6287 -2415 7083 2716 -7362 -3043 6782 2982 -5705 -2209 4516 1207 -3078 505
1622 505 1966 -2191 -928 4179 544 -5669 -399 6859 571 -7381 -769 7139 802 -6459 -719
1637 -719 5102 22 -3648 821 1980 -2235 -648 3557 -428 -4853 1117 5947 -1314 -6506 1517
1652 1517 6585 -1293 -5993 1407 5023 -1454 -3527 1975 2085 -2622 -514 3417 -839 -4311 1715
1667 1715 4883 -2402 -5405 2544 5308 -2797 -4946 2668 4052 -2748 -2897 2903 1569 -3107 -180
1682 -180 3584 -1014 -3824 2072 4216 -2691 -4183 3258 4057 -3418 -3546 3487 2681 -3487 -1688 3459
1698 3459 439 -3630 724 3594 -1848 -3736 2651 3665 -3277 -3448 3633 3069 -3683 -2321 3747
1713 3747 1551 -3488 -326 3599 -720 -3406 1927 3449 -2776 -3376 3398 3227 -3788 -3044 3779 2458
1729 2458 -3739 -1782 3369 688 -3198 342 2805 -1660 -2670 2750 2564 -3594 -2435 4337 2439
1744 2439 -4447 -2154 4446 1858 -3908 -1096 3462 283 -2633 929 2039 -2153 -1529 3289 1122
1759 1122 -4312 -1136 4899 899 -5305 -977 5025 848 -4506 -502 3567 -82 -2503 953 1542
1774 1542 -1951 -586 3205 25 -4090 343 4971 -454 -5221 447 5233 -249 -4676 336 3754
1789 3754 -534 -2649 893 1289 -1668 -211 2458 -960 -3460 1563 4077 -1939 -4651 1943 4798
1804 4798 -1802 -4438 1607 3731 -1364 -2561 1484 1314 -1646 126 2174 -1355 -2611 2394 3256
1819 3256 -2975 -3733 3117 3818 -3095 -3760 2712 3135 -2419 -2348 2057 1101 -1879 146 1851 -1401 -1967
1836 -1967 2443 2267 -3160 -2430 3603 2664 -3619 -2542 3451 2256 -2960 -1548 2503 696 -2129 369
1852 369 1703 -1483 -1551 2450 1416 -3293 -1516 3635 1409 -3910 -1353 3656 1096 -3307 -522 2800
1868 2800 -133 -2164 1047 1791 -1785 -1250 2702 1065 -3197 -761 3663 647 -3695 -438 3447
1883 3447 32 -3165 270 2548 -993 -2026 1529 1410 -2264 -1061 2729 605 -3168 -346 3380
1898 3380 68 -3289 267 3066 -481 -2543 964 2102 -1360 -1396 2053 914 -2535 -353 2975
1913 2975 7 -3315 239 3344 -570 -3214 629 2699 -1037 -2221 1264 1467 -1771 -753 2164
1928 2164 107 -2647 413 3068 -712 -3324 984 3298 -1061 -3032 1193 2614 -1241 -1846 1364
1943 1364 1050 -1605 -268 1989 -614 -2346 1096 2631 -1646 -2932 1759 2945 -1832 -2802 1710
1958 1710 2349 -1568 -1652 1505 878 -1400 110 1593 -915 -1708 1758 2070 -2220 -2144 2643 2347 -2589
1975 -2589 -2286 2425 1931 -2113 -1437 1712 610 -1446 215 1206 -1246 -1200 2039 1225 -2667 -1380 2966
1992 2966 1479 -3068 -1399 2961 1351 -2449 -942 2051 471 -1430 362 1017 -1086 -698 1900
2007 1900 515 -2614 -490 2971 400 -3264 -584 3007 403 -2782 -283 2201 -43 -1570 501
2022 501 943 -1168 -369 1802 65 -2290 223 2857 -273 -2960 422 3025 -307 -2674 456 2188
2038 2188 -626 -1512 832 848 -1292 -307 1614 -343 -2141 672 2333 -935 -2616 1008 2521 -1096
2054 -1096 -2291 1024 1833 -1080 -1240 1226 669 -1411 26 1687 -489 -1871 951 2059 -1239 -2103
2070 -2103 1386 2025 -1470 -1871 1371 1330 -1512 -927 1440 180 -1574 296 1555 -843 -1753 1258
2086 1258 1830 -1460 -1737 1678 1598 -1643 -1260 1560 850 -1498 -295 1526 -253 -1441 809 1435 -1306
2103 -1306 -1527 1597 1392 -1795 -1362 1790 1163 -1769 -929 1586 421 -1439 72 1272 -641 -1130
2119 -1130 1240 1089 -1553 -1008 1927 1057 -1998 -954 2065 832 -1839 -507 1624 173 -1357 282
2135 282 1005 -881 -805 1342 672 -1873 -661 2080 506 -2263 -579 2198 381 -1953 -180 1607
2151 1607 -78 -1150 474 847 -897 -343 1432 173 -1753 66 2096 -73 -2244 140 2222
2166 2222 -177 -2086 183 1560 -377 -1192 554 669 -914 -154 1241 -276 -1639 537 1874 -679
2182 -679 -2048 789 2150 -663 -1939 666 1629 -646 -1071 766 555 -807 -14 1101 -432 -1305
2198 -1305 781 1472 -1117 -1736 1160 1707 -1176 -1673 1070 1339 -949 -915 890 415 -862 198 956
2215 956 -601 -969 1037 1143 -1336 -1169 1595 1276 -1535 -1130 1395 919 -1267 -659 1076 233 -945
2232 -945 272 834 -772 -843 1131 750 -1496 -848 1635 810 -1639 -685 1553 627 -1368 -290 1208
2249 1208 -3 -914 432 801 -800 -641 1176 515 -1480 -481 1579 363 -1655 -375 1495 107
2265 107 -1387 13 1010 -386 -870 682 511 -956 -419 1241 253 -1454 -105 1587 35 -1532
2281 -1532 108 1457 -125 -1175 377 1006 -553 -636 865 331 -1117 -206 1263 -62 -1480 76
2297 76 1440 -240 -1497 177 1275 -377 -1055 460 730 -659 -337 901 110 -1092 196 1323
2313 1323 -339 -1374 444 1449 -473 -1316 552 1131 -535 -806 607 441 -715 -164 848 -289
2329 -289 -1062 484 1103 -686 -1301 779 1187 -834 -1205 779 1035 -675 -697 719 392 -636 73 768
2347 768 -327 -792 677 944 -892 -1030 989 1022 -1063 -962 948 820 -879 -574 709 219 -671 100
2365 100 586 -517 -589 810 568 -1006 -614 1221 702 -1223 -621 1163 532 -1040 -336 887 72 -675
2383 -675 197 464 -581 -404 840 327 -1144 -381 1207 233 -1302 -277 1249 239 -1106 -127 903
2400 903 8 -615 317 461 -478 -250 821 191 -995 26 1221 -36 -1211 -1 1218 -29 -1081
2417 -1081 51 803 -261 -613 325 308 -623 -179 700 -105 -937 159 1047 -299 -1098 384 1120 -349
2435 -349 -943 407 788 -395 -493 469 256 -606 16 742 -242 -841 387 928 -487 -992 529 877 -556
2454 -556 -840 492 584 -547 -366 533 105 -621 174 648 -336 -680 501 751 -566 -691 598 755 -586
2473 -586 -537 625 470 -557 -229 560 -53 -509 333 557 -542 -639 614 584 -795 -632 727 478 -705
2492 -705 -433 676 233 -549 21 565 -167 -461 460 426 -554 -439 762 452 -758 -432 794 389 -803
2511 -803 -316 652 44 -508 33 309 -298 -352 425 229 -694 -267 776 244 -921 -254 896 229 -740
2530 -740 -87 698 36 -476 145 348 -317 -183 534 100 -725 -50 836 -21 -894 -13 839 -59 -828 68
2550 68 616 -112 -493 169 253 -377 -53 494 1 -585 174 807 -154 -814 231 855 -154 -660 233 649
2570 649 -158 -443 232 310 -389 -19 385 -232 -585 232 625 -376 -765 366 663 -404 -672 321 491
2589 491 -342 -302 329 181 -322 17 382 -252 -387 363 495 -516 -567 527 532 -456 -474 464 388 -431 -283
2610 -283 345 85 -316 109 310 -269 -348 411 388 -509 -356 596 441 -551 -309 527 256 -420 -116 395 -24
2631 -24 -288 209 293 -355 -238 407 190 -602 -242 607 197 -644 -219 542 141 -539 -32 426 -105 -257 311
2652 311 238 -392 -160 500 183 -530 -47 641 118 -586 -7 504 -8 -446 63 317 -143 -291 249 103
2672 103 -406 -56 446 -32 -536 -1 508 -93 -603 77 489 -74 -346 125 334 -189 -70 270 5 -335
2692 -335 34 441 -151 -464 160 487 -204 -510 170 367 -191 -318 191 182 -315 -92 273 -91 -317 127 364
2713 364 -196 -421 265 501 -256 -406 284 398 -175 -267 244 119 -172 -9 310 -117 -298 234 270 -327 -375
2734 -375 341 393 -348 -365 343 304 -281 -326 251 144 -267 85 221 -123 -218 263 224 -343 -213 434 297 -440
2756 -440 -243 440 231 -323 -146 257 81 -214 52 163 -212 -144 281 112 -394 -144 434 152 -445 -146
2776 -146 452 104 -280 -66 274 21 -154 132 183 -152 -57 281 46 -301 46 409 -20 -434 -58 437 -24
2797 -24 -382 -66 228 -38 -244 87 112 -172 -34 317 -18 -290 49 379 -46 -291 117 333 39 -214 77
2818 77 304 -128 -136 139 129 -215 -29 239 -113 -333 104 336 -171 -333 121 274 -147 -299 166 165 -119 -92
2840 -92 144 14 -195 79 241 -121 -245 231 269 -183 -237 178 292 -194 -161 200 91 -171 -78 97 -64 -219
2862 -219 98 147 -132 -238 169 227 -298 -168 283 217 -166 -165 186 127 -147 0 155 -58 -142 130 158 -187 -99
2885 -99 237 85 -225 -141 249 72 -208 -133 176 56 -211 -40 85 -58 -48 141 22 -225 2 280 51
2906 51 -252 -41 348 115 -260 -67 237 -6 -197 7 84 -162 -26 145 -20 -199 -3 240 -5 -330 -49
2927 -49 260 -20 -229 9 190 26 -122 80 77 -79 -13 168 7 -169 73 198 -76 -185 81 295 -43
2948 -43 -169 88 115 -68 -173 26 21 -152 -14 111 -136 -202 89 158 -123 -235 82 240 -110 -148 50 210
2970 210 -100 -102 83 116 -62 50 114 -25 -84 163 145 -130 -131 127 165 -161 -218 154 29 -57 -41 38 37 -106 47
2995 47 102 -121 -87 214 93 -164 -100 165 142 -209 -130 137 54 -83 -53 123 -18 -53 51 46 -199 -81 151 55
3019 55 -153 -30 181 6 -127 -61 157 64 -127 14 62 -25 -72 109 71 -112 46 158 24 -164 -30 175
3041 175 -10 -211 -80 115 -74 -132 -41 86 -103 -67 83 -27 -142 65 145 -72 -122 12 122 -30 -109 83
3063 83 154 -26 -99 82 112 -11 8 50 -31 -25 -3 141 -38 -133 89 124 -98 -173 49 66 -78 -106 -22 36 -54 -16
3089 -16 67 -5 -15 47 147 -97 -83 129 157 -121 -116 117 105 -40 -34 100 49 -51 -23 15 -95 -88 69 34 -146 -72
3115 -72 86 78 -136 -93 78 98 -101 -40 58 41 -15 -17 24 -22 -25 76 68 -58 -71 98 38 -119 -46 80 59 -81 -45
3142 -45 39 -40 -34 34 39 -103 5 101 -39 -118 19 142 31 -128 -14 128 69 -71 -28 63 -24 -13 28 -13 -62 5
3168 5 43 -53 -134 -41 94 18 -133 -21 127 -26 -95 32 49 -47 -37 38 26 -19 88 70 -45 -37 60 124 -4 -19 67
3195 67 111 9 -77 -8 63 -45 -15 -37 -68 -18 -2 60 -73 -76 58 44 -25 -83 46 66 -60 -43 -3 77 -16 -54 42 14
3223 14 -31 47 91 -25 -48 84 70 -39 -49 39 85 -77 -78 4 12 -61 -37 -7 -29 -27 79 -13 -86 55 61 24 -121 -17
3251 -17 78 49 -20 -10 48 4 5 -8 28 -42 -7 29 7 -82 -50 89 -9 -83 -13 94 -37 -28 9 39 -13 8 31 22 -32 -12
3281 -12 36 22 -21 26 70 -4 -107 16 115 -23 -106 -36 35 -52 -56 16 -41 5 22 34 -33 -56 -10 71 -18 -26 16 61 12 -14
3311 -14 33 37 -2 12 92 -37 29 -1 71 -31 -60 58 56 -1 -120 12 85 -41 -91 -25 9 -42 -64 22 34 -26 54 26
3339 26 -42 -29 33 -4 -13 -61 60 48 -34 -9 7 60 3 -9 2 1 -9 51 24 -62 -41 20 15 -107 -15 43 41 -37 -63 30 6
3370 6 13 -9 39 7 10 84 19 -34 14 67 1 -11 66 56 49 -18 -54 18 6 -44 -8 1 -3 21 21 -57 -63 15 53 -49 -59 4 83 9
3404 9 -58 13 32 45 2 15 5 28 28 46 -36 -16 45 40 -24 1 20 55 -2 -46 16 -66 -14 -38 3 6 -14 -3 34 -36 14 38
3436 38 40 -26 -19 49 -7 1 37 6 -3 8 -36 -21 17 1 12 41 -79 -46 30 30 -95 -63 6 -3 -47 -51 -18 -47 -51 -36 -24 4 22
3469 22 22 11 -25 -17 8 40 -13 -28 47 46 5 -8 4 13 31 35 47 27 15 -31 3 -65 10 94 6 -98 5 74 -41 -51 -20
3500 -20 55 -47 -86 -28 -5 -10 -20 -6 -16 -30 22 -5 -7 20 -12 -4 -70 -77 -17 -10 0 25 20 16 -57 15 41 -16 0 76 3 -18 -27 2
3534 2 60 16 -11 4 42 0 6 -32 4 -31 27 -28 -8 -13 7 -36 -89 -19 -26 4 -89 -69 -23 46 -59 -47 30 -28 -11 16 30 -23
3566 -23 5 26 38 -34 13 47 29 -37 -21 -9 3 -26 -51 5 19 -17 -21 14 -24 31 -11 -44 -33 3 49 22 -8 -21 29 12 -4
3597 -4 29 -27 -2 63 5 9 14 48 63 -32 -71 21 37 13 -37 -102 13 3 2 -20 -54 -38 -47 -17 -31 -76 -16 50 -49 4 9 48 -59
3630 -59 -2 -18 42 34 -9 5 23 -23 38 -14 17 22 -10 49 -16 -35 56 59 -55 -46 5 -13 -35 -15 50 -8 -22 -45 6 -12 0 34
3662 34 40 -47 -36 -6 11 -52 -5 53 13 9 -33 -32 -7 -108 52 -20 -8 42 -46 -32 4 -30 0 -56 0 -47 54 -48 3 76
3692 76 23 12 -13 38 -50 -16 -41 59 -22 -47 -64 -48 -66 -42 -45 46 -23 -39 -44 8 4 -62 14 11 -82 1 35 -71 -2 -14 -5 30
3724 30 -40 17 10 -27 -21 12 40 -3 9 38 23 -69 31 37 -60 -17 30 33 -63 -62 21 8 -29 -13 9 -9 24 0 1 -19 -1 17 -15
3757 -15 18 -29 36 76 -15 -30 21 -11 -2 11 -34 -5 -44 2 9 -4 -2 -24 28 -33 -31 0 20 -42 -49 17 -12 44 16 1 11 3 29
3790 29 31 -7 -24 28 28 -22 -29 6 -10 -56 4 50 19 -46 16 -11 -35 59 24 -36 18 -12 21 20 -35 6 78 22 -88 78 34
3821 34 36 -55 37 3 33 14 -20 23 -36 13 -14 10 -24 -64 21 3 7 32 -3 -12 -40 15 -22 6 23 4 38 21 4 26 42 12
3853 12 56 24 -6 -5 13 21 4 -34 -4 0 -41 21 -33 -53 11 18 -4 23 -21 -3 -12 -61 -21 -31 60 -3 -10 3 0 29 20 29 21 -21 34
3888 34 29 -22 -15 39 36 -18 28 1 -44 -5 -36 -28 10 -38 13 1 -56 -17 -9 55 16 4 13 26 4 -26 19 25 5 -9 5 -33 -66 33
3922 33 47 32 0 11 8 -3 -43 36 -18 -31 -7 -3 -18 0 41 46 -18 -26 -1 -20 -3 -27 30 -13 -13 60 3 -27 -38 15 12 -45 -37 12
3956 12 -9 8 -12 -34 14 8 -32 -26 -5 -49 20 32 -25 -5 37 65 18 5 19 2 -7 20 -13 39 -11 58 39 -29 23 -33 28 -20
3988 -20 -4 -36 -1 -15 -3 -14 2 -1 19 15 1 13 42 57 -12 -18 33 -43 54 -33 -13 31 6 44 33 1 -7 52 32 16 -10 1
4020 1 35 -46 76 36 -18 16 -27 28 -5 -28 -30 -20 12 7 0 -30 0 -33 26 26 24 10 -11 -57 -35 -8 9 0 -42 7 6 -3 -37 51
4054 51 -7 -17 -4 -19 -14 29 -8 9 -44 -44 -7 -5 14 0 -26 32 36 -1 47 33 -43 1 16 -3 -29 -19 -42 -31 -27 -26 -17 19 -64 -19
4088 -19 25 19 0 -28 21 8 37 8 33 -14 18 -38 12 -31 43 -11 0 9 7 -4 -48 30 -10 32 -25 -18 -9 -8 -25 30 -26 -21 -20 2
4122 2 7 -3 -29 9 -19 -35 1 25 33 30 -7 28 36 -69 36 44 -30 48 17 -3 12 -29 44 -48 -16 -34 -2 1 2 -2 -44 13 -13 -22
4156 -22 44 18 -64 -49 3 11 7 64 19 39 14 3 -20 -44 42 31 -58 14 -18 1 9 -12 37 -19 -3 -33 14 -28 -26 13 42 24
4188 24 4 -4 -77 -29 25 28 37 -10 19 -40 20 23 34 4 16 -11 75 7 45 11 17 -21 -7 -1 23 -5 -41 6 -7 24 -6 33 -10
4221 -10 -41 -41 -4 -6 -11 -18 36 41 19 40 -8 10 31 -16 -15 -18 7 5 0 -16 42 11 -8 -10 -19 -38 -23 -35 12 -9 -16 -18 -41 50 -11 -5 29
4258 29 5 -42 -24 26 -14 -4 -11 0 -7 27 46 40 -66 13 28 -54 -8 -75 14 -9 40 32 -14 16 -58 -42 -2 16 -5 -20 44 64
4290 64 -21 -2 -33 11 -41 -2 5 -1 -42 67 -10 -35 40 -7 17 25 15 22 -15 2 -36 7 -18 -38 18 -25 -44 -23 6 -30 36 -33
4322 -33 -27 20 -12 25 6 -33 13 -44 39 10 35 -41 -20 12 -2 -32 10 -33 20 -1 -29 -23 -17 9 -24 -9 24 53 -79 -66 84
4353 84 5 42 60 -16 -10 -33 8 -17 26 -9 -14 -34 -28 -24 5 9 -44 -35 45 -18 12 31 -8 -8 7 4 -31 36 38 24 -39 -8 18 -24 -76
4388 -76 45 36 22 -37 -12 58 1 -27 46 39 9 -2 -50 16 -31 -3 -16 -22 -6 -38 28 -16 -14 -30 -29 15 19 29 -1 -5 10 -41 -45 -38
4422 -38 59 0 36 34 -14 -8 -9 16 -12 6 -6 11 -44 -16 -33 -16 -15 1 9 3 30 22 -23 -19 -4 41 -12 -1 -25 -56 24 -14 26 -15
4456 -15 -1 28 4 -31 -17 -7 -28 -30 15 4 18 -85 5 1 -5 3 -1 19 21 -24 -4 7 -55 34 23 24 14 -28 -26 -10 -21 -53 29 -36
4490 -36 27 -8 -52 6 3 -2 24 27 10 10 11 34 3 64 -44 -41 8 3 -35 -3 14 24 10 -20 5 20 15 50 -22 -19 3 -10 -23 -29 -55
4525 -55 3 -18 -2 13 -23 -23 3 10 0 -7 18 -31 -24 -39 -24 34 -11 10 -31 31 4 0 17 -22 30 -7 5 8 -24 -14 14 7 3 -24
4559 -24 -5 -3 36 -16 -3 2 18 -16 10 -31 -20 -27 -27 -31 -7 27 -33 -26 33 23 -5 -3 11 48 11 3 -36 1 27 -33 44 -12 54 -10
4593 -10 15 32 3 34 -5 -5 -7 2 37 -14 -47 15 -50 -31 -5 14 13 19 20 8 -17 -42 -1 16 11 24 71 25 6 -19 -40 36 -31 -11
4627 -11 -4 -33 18 1 7 34 -39 -31 -11 15 43 8 5 -2 26 -29 8 9 27 17 -30 -7 12 40 -21 39 -6 -52 -48 0 -12 12 -8 -6
4661 -6 -11 40 32 2 43 38 -10 16 -38 40 32 20 -6 14 -35 -25 10 6 45 26 4 -5 -33 -7 -16 20 -18 -3 -14 -13 0 -8 4 1 -32 7
4697 7 40 -6 -1 -34 -53 6 52 -8 -1 7 -11 22 -10 -4 20 11 -58 -16 -16 -53 32 -11 -24 -3 -14 -2 36 -20 -6 -31 9 -71 14 -12
4731 -12 -3 65 -18 40 72 -7 -57 -6 -6 -40 15 31 22 -15 -1 -37 -19 25 62 3 -13 -9 -51 37 17 -45 14 6 -32 13 13 -3 34
4764 34 85 28 25 42 -66 23 -19 -13 -19 -10 16 -60 3 -2 56 -21 -1 -3 -3 -23 2 -11 14 -17 89 10 15 -30 -11 27 -31 -24 12 32
4798 32 -19 -23 15 33 -14 11 22 21 -53 -39 19 27 -27 28 33 4 26 12 -21 -5 65 -34 18 27 17 31 -11 -9 9 32 10 -27 13
4831 13 21 -4 -9 21 63 10 3 -34 -5 -47 -42 -38 -22 -75 43 0 -18 -2 -5 -8 11 -9 -24 14 8 -36 17 47 42 39 -22 2 20 -26 24
4866 24 52 9 26 18 -2 -3 -29 19 25 -16 7 -12 -20 -2 5 9 16 -38 -5 26 -29 14 39 -23 37 11 -57 -29 4 -16 -30 -3 -23 -15
4900 -15 -24 0 11 43 3 3 -17 -24 -18 4 -12 -3 -40 14 -24 0 -6 -1 7 13 -30 -20 44 1 34 -26 -3 -10 3 -25 22 28 -35 -30 4 21
4936 21 25 -25 -12 -10 -48 -22 -36 -48 22 -6 1 -9 -17 13 -17 24 19 -32 17 36 42 23 30 -30 13 11 11 15 -15 8 8 16 51 -16 -79 3
4972 3 -8 64 -38 44 -65 -22 19 11 -31 26 -30 10 -8 37 14 40 70 -37 5 -13 2 16 5 -17 -32 -42 -26 22 28 23 40
5003 40 19 4 -5 0 53 25 20 -31 7 11 -3 0 -9 -20 0 10 11 22 -13 38 -21 2 47 0 -47 -19 -48 -40 16 -43 36 21 1 16
5037 16 28 0 -9 15 20 -21 -47 57 -16 9 5 26 -3 3 -21 67 -1 -5 29 10 -10 14 -14 10 32 35 -8 42 -8 34 -27 23 -18
5070 -18 -6 -11 0 -11 3 -17 -28 -7 -40 -42 -46 -23 -57 30 13 19 36 31 -34 42 6 13 9 22 0 -4 28 14 10 -14 -36 -26 14 -8 -29
5105 -29 -40 14 26 37 0 17 -36 6 26 -36 -18 51 -11 -3 25 -42 2 -19 22 42 44 4 2 4 30 15 38 5 40 -18 -19 26 10
5138 10 -24 -13 29 18 10 5 -7 -41 25 -12 2 31 30 -5 31 -9 -28 -28 -27 -20 -14 -8 34 -35 -16 2 -28 1 -32 28 22 -8 29 18 -15
5173 -15 -62 10 -4 -48 -29 -1 -21 30 -23 30 -7 33 -11 34 -56 -17 -31 -18 -48 -21 -19 -10 -19 22 2 32 5 -9 6 47 -74
5204 -74 -6 -9 31 20 -7 22 7 -31 11 -14 25 41 8 54 28 7 -30 -43 -38 10 47 -9 33 5 -38 36 13 -14 7 45 -17
5235 -17 -6 86 31 -23 -29 18 -8 -25 -26 33 -18 -15 -38 15 11 -20 15 -7 -13 9 26 6 2 34 42 77 14 -54 10 -6 45 31 -24 66
5269 66 -15 -26 1 -12 -26 -8 14 -32 23 -2 18 5 17 12 -12 -8 -11 -6 -2 -8 -18 96 66 30 31 2 5 -25 7 54 10 -41 2 25
5303 25 15 16 -27 -1 -6 -31 6 -6 -38 42 17 -51 -39 27 2 -3 -57 14 30 6 5 23 -24 43 -20 19 64 44 16 8 -5 -12 69
5336 69 35 12 -40 -6 -8 2 29 -3 31 12 7 10 -4 -38 -15 38 -18 -4 7 -71 -3 -28 16 -4 5 5 -27 -5 -23 18 3 -34 9
5369 9 62 -47 10 7 2 -1 -10 -5 39 64 13 -21 -28 20 38 1 56 -2 -23 1 1 -4 -2 35 3 -2 -38 5 3 -32 2 -9 -36 36 4 -17
5405 -17 26 22 56 -12 40 -37 -3 -19 17 -12 25 -31 -20 0 5 -46 42 28 -11 16 -7 2 -3 36 -80 -1 -20 -16 -23 -27 -48 -53 -18 -6
5439 -6 -49 22 -17 -72 -23 47 8 35 -26 50 23 -10 19 2 42 -2 22 6 21 -19 18 1 35 6 33 -17 2 -6 38 -56 -66
5470 -66 -5 -14 3 -18 -34 -8 17 -1 29 13 16 -25 15 42 17 27 -5 -27 -25 42 -10 -20 -33 -4 12 11 -48 -40 -85 -6 -58 13 -54
5503 -54 10 -9 54 1 -23 18 64 23 7 30 -3 59 -17 79 11 -39 14 81 -42 -88 39 -43 1 40 -23 -11 13 -39 5
5532 5 -48 -14 19 -16 -28 -24 -24 -25 6 -16 37 -23 -31 -22 -14 3 -6 17 -18 -8 32 -21 -23 20 12 -4 5 -15 3 -27 -7 -43 24 10 -28 -26
5568 -26 -6 8 20 -9 8 -1 16 -8 -2 -7 14 71 13 2 -6 16 -13 59 12 -8 28 4 -11 24 11 11 8 4 -32 26 29 40 7 40
5602 40 -23 -71 30 -11 53 52 -8 72 0 8 9 13 -5 13 -42 -18 23 -16 21 -38 20 -1 -1 -31 -40 47 -15 0 23 25 26 58 -37 21
5636 21 -18 -10 -16 22 28 62 10 -8 8 38 -24 -19 52 12 54 2 -15 -52 -38 -24 28 11 -10 -15 1 -21 16 -45 -32 46 -60 18
5668 18 13 -45 -13 -31 17 -7 71 -1 -7 -8 9 -4 12 27 -51 -5 6 4 -2 43 -60 6 8 -12 44 6 -44 26 -22 -13 -23 -37 -5
5701 -5 9 22 12 8 -31 -2 50 -2 -7 -7 7 10 15 51 -59 48 11 -49 34 37 -18 -29 -40 9 -39 -19 18 -23 -29 -22 29 27 25 -27 14
5736 14 -41 32 -11 25 -7 31 -4 -9 30 -11 -33 5 34 41 41 -13 43 24 -43 -34 -16 -6 -38 50 21 18 -11 -35 -42 -8 14 -13 3
5769 3 2 19 5 39 -26 31 -35 -34 59 10 3 30 38 34 15 -19 -9 15 6 40 -20 -20 -6 -20 51 29 54 -6 -2 6 -10 -8 -7 14 9 -11 -31
5806 -31 3 13 19 19 3 20 -26 20 -44 -39 6 40 7 -4 12 18 15 -33 9 67 8 -1 23 -43 -14 -53 55 10 2 23 11 35 14
5839 14 19 1 -7 27 15 6 -23 -34 40 -1 -88 -15 15 -9 58 -32 -8 65 -51 -26 -57 20 -24 -37 16 -2 -13 43 -16 -19 26 -4
5871 -4 27 -6 31 -7 12 -13 18 2 -37 -39 9 -60 -35 21 34 15 11 -21 4 -13 1 -13 14 23 6 -17 -59 -2 -17 1 -44 -28
5903 -28 20 3 -33 -30 -16 4 47 2 18 16 -28 4 -37 -9 -16 2 42 11 25 -6 25 17 7 -13 -9 19 -16 10 29 0 -35 20 15
5936 15 24 -2 10 -8 -15 -31 30 -18 -13 15 18 -24 -21 6 11 -50 -28 5 -32 6 -104 29 -1 -38 18 47 -15 28 8 -23 33 -14
5968 -14 -11 -14 -5 -48 -20 37 8 -34 39 -17 -15 8 36 -29 47 -6 15 -48 63 -11 -30 13 -17 42 30 28 -23 39 -15 -4 20 23 76
6001 76 -31 85 0 23 -23 -17 48 3 -16 -38 -41 -26 9 -27 25 9 0 -43 -20 49 36 -29 1 32 -18 -29 1 -8 29 1 43
6032 43 -23 11 -12 -28 13 8 0 21 2 43 17 10 -23 -18 35 -11 -7 -32 -18 -29 31 18 15 43 -18 20 15 -26 12 -75 32 -23 62
6065 62 -17 6 -16 6 24 0 -21 44 -6 4 -12 4 29 45 -26 13 -15 24 78 -38 -12 -39 -10 42 46 2 33 -7 26 -43
6095 -43 -18 -19 6 -4 24 7 27 -8 23 -17 9 -20 0 25 -35 15 2 14 13 16 -12 -22 1 -8 63 -6 -11 5 -35 8 2 4 -11 38
6129 38 36 1 30 17 -30 43 14 0 -22 22 9 22 2 42 3 35 -1 -23 43 38 57 29 19 -6 -34 7 -3 10 25 47 5
6160 5 56 -18 -34 8 -16 -12 -9 6 16 6 7 10 25 4 -18 -27 36 -6 15 -5 39 -1 25 18 -6 -43 -20 34 7 -15 -9 -2 11 13 -51
6195 -51 -4 -38 38 3 -15 25 22 57 -13 59 9 -5 43 42 -37 -4 -1 5 -2 37 1 24 -1 -35 -12 0 15 1 33 -4 -4 38 -17
6228 -17 10 7 -10 -35 -16 16 -17 9 16 3 26 -11 11 19 -22 3 20 -13 48 -31 9 18 15 26 -22 8 43 -2 -25 -31 4 15 6 -12
6262 -12 -24 5 1 -3 -29 -9 -37 -7 4 -11 -13 28 29 -28 65 -15 -4 50 25 -46 18 7 -13 27 20 -14 -43 -20 -37 -13 -22 -4 -45
6295 -45 -1 18 -37 5 9 -13 3 15 19 -14 -19 18 -33 13 -15 50 -25 1 36 -39 20 -70 -7 32 -17 18 -15 12 36 -12 -47 58
6327 58 14 2 -25 7 10 -6 -98 3 44 -7 -3 -30 -13 -22 -73 -19 27 30 -10 -46 -20 -24 -7 11 5 -21 -12 -26 -18 10 1 19 -29 -1
6361 -1 -4 28 27 41 43 -41 -3 -34 5 58 26 15 -34 9 5 2 -1 32 7 13 -13 -23 11 21 -49 25 -21 36 16 -12 23 -37 -43 21 -22
6396 -22 -22 10 -18 27 -10 -29 15 5 -11 4 58 -16 25 -19 20 14 32 15 -19 1 70 9 -3 -7 -9 22 -51 -11 19 -37 13 -7
6428 -7 -25 24 -41 -28 -24 -8 -26 1 14 -46 25 -58 42 -9 -23 3 -12 12 -1 41 1 50 12 24 6 11 8 -1 2 48 13 -52 -3
6461 -3 5 -56 1 -56 -19 -3 43 18 4 -20 16 -17 12 -21 0 -58 -14 40 -16 -55 27 17 28 0 17 -20 23 27 -3 30 28 -27
6493 -27 -23 4 32 18 49 3 -26 8 38 29 67 29 18 -28 -16 10 -19 -48 -28 41 17 11 20 -22 -19 -13 -58 2 9 6 -2 6 23 3 40
6528 40 2 -35 -7 16 16 21 20 -35 -25 5 42 -2 7 -1 -27 -34 -12 12 -13 -10 -19 -10 25 -48 -6 20 36 37 -25 -38 1 -13 20 -14 2
6563 2 -25 -8 7 -2 -26 20 -8 31 74 1 8 1 13 -17 12 44 -2 -24 -57 12 13 -26 15 37 18 -5 -27 38 -11 -25 17 -25 4
6596 4 2 17 20 45 1 16 -1 -11 -64 -24 -17 55 0 53 28 -6 -4 41 11 1 3 6 16 48 19 69 -11 -34 38 14 5 67 -7 -17
6630 -17 -25 -46 -34 21 -31 -20 20 -61 0 -23 -32 -32 5 18 13 2 29 -6 -18 -7 -4 34 26 -20 -5 37 -4 -49 4 40 52 47 17 18
6664 18 -37 16 56 39 -23 -28 -7 -2 7 -31 19 -65 -4 4 21 -2 -14 27 -25 -26 -10 26 24 7 -16 -35 27 39 8 29 73 8 66
6697 66 -25 14 -35 23 -26 18 41 17 -17 -24 -1 40 -29 -86 5 -23 -11 -14 36 16 -3 17 38 14 2 -56 46 18 -26 36 6
6728 6 52 2 9 39 -21 11 12 4 -4 61 6 29 -20 23 -77 7 -106 33 -47 1 21 -9 12 -12 6 -8 4 -9 42 -18 26
6759 26 -41 -23 -17 2 25 8 37 47 -28 19 36 33 -47 -12 16 25 7 29 47 13 -17 -7 0 60 29 16 34 -43 -4 -4 -3 -36 21
6792 21 0 -4 -29 -58 -1 -25 -103 19 1 -9 15 2 13 -23 0 -1 -60 -11 18 18 -8 4 48 -25 -4 13 9 -27 -18 10 -16 15
6824 15 -11 6 -40 39 -17 28 8 -43 -27 -39 37 -17 38 -10 -27 8 -9 12 50 -20 3 -34 -26 7 -47 -50 29 22 -46 -3 -37 7
6856 7 30 5 73 -65 -6 39 -9 19 3 -16 -54 -12 -14 -27 -41 13 -15 8 -22 -15 -2 -13 -2 25 19 -11 -18 -20 4 3 -8 -40 18
6889 18 13 -14 -38 -20 -5 0 -39 -9 17 -23 -1 12 -23 -3 22 14 -30 17 -15 36 18 -17 25 -35 -11 -19 -52 10 -37 -30 3 -49 -9
6922 -9 40 -47 -37 -52 -3 -5 7 -58 -5 -3 -38 7 -11 -28 -25 -11 -11 -9 -26 21 -6 28 15 44 -10 40 -14 -5 19 -4 -28 -2 35 -12
6956 -12 18 -44 -25 0 28 -29 12 -10 -18 17 -50 36 24 -4 -66 13 35 0 -16 -48 -28 12 -29 22 15 4 -14 -5 3 41 65 69 -1
6989 -1 -4 17 -12 42 11 -21 21 -36 26 -14 -55 -44 -33 13 -37 9 -1 10 -45 12 1 13 29 33 -57 -8 -31 -11 -25 -12 59 -21
7021 -21 -4 -6 33 19 -27 32 -8 -36 -18 -2 -18 -12 28 15 -32 4 26 -56 22 17 -29 -53 -21 -8 0 -8 -23 34 -2 25 29 -23 -17 2
7055 2 -18 -35 -22 20 30 -16 -35 -77 8 -21 -35 19 7 -48 23 -1 -5 -77 58 -32 11 -30 -13 -28 -7 -18 30 -16 -21 -32 -33 1
7087 1 -26 -17 -7 -13 -43 3 -17 -2 -27 -2 -86 -60 -44 9 -24 67 -40 -25 -29 33 38 -35 20 -42 19 -4 -32 -25 22 -28 32 44 -27
7120 -27 -9 -61 -21 8 57 4 30 19 -29 -24 -23 -35 29 7 12 27 -48 -15 -25 -29 3 -31 -72 34 -20 -31 -9 -17 15 15 30 39 43 -14
7154 -14 29 58 59 22 11 49 -12 8 -1 -33 3 22 3 -23 10 -27 0 14 -26 1 -31 -1 -30 -6 -17 -40 30 46 10 19 63 49
7186 49 4 -5 -10 46 -8 51 -5 -18 -15 -7 -19 -39 24 -6 38 -13 -16 -35 -45 -11 3 9 -35 -51 22 -28 2 7 24 10 -71 25 27 55
7220 55 52 0 50 -33 12 -24 -6 2 18 -28 -32 -31 24 7 -75 1 -13 8 7 -2 6 23 -8 14 0 15 -14 -25 14 29 0 -3 -31 41
7254 41 -70 -82 -26 10 -11 40 36 -2 -32 1 -47 -14 -5 26 18 23 -5 45 -30 16 6 -31 -31 2 28 36 -26 3 -8 -34 14 -10 -25
7287 -25 1 -35 22 -6 -28 -2 10 31 0 -47 -1 -12 12 -22 13 1 48 -48 51 22 20 -34 -3 41 22 14 40 25 -16 -1 24
7318 24 33 1 -2 25 25 2 -7 -3 -42 -5 0 76 -39 29 -18 -28 4 -62 -28 40 -17 -18 4 16 -8 -17 57 -8 -14 38 48 -37 -10 -47
7352 -47 -51 4 74 -43 -38 -9 69 20 6 21 -41 -27 59 8 -10 -11 28 3 17 39 -2 15 16 -32 9 -47 -23 5 4 -25 21 66
7384 66 -21 -5 -12 29 24 27 25 12 -8 -1 -49 19 -1 -22 78 -7 17 -28 -7 -16 -22 -8 18 20 16 -1 -19 -16 25 7 6 -36 -45 21 -17 -46
7420 -46 -44 29 -5 -1 -87 -31 28 -19 30 19 -7 18 -23 58 22 25 -9 9 -52 4 34 4 15 -13 -5 3 8 -11 -19 -10 20 24 18 26 18 13 -28
7457 -28 -27 -5 -30 -42 -52 -61 48 16 -28 -43 -12 -18 18 17 29 -6 -13 39 15 36 -40 -11 -5 26 9 -3 1 -16 -38 -1 -31 -23 8 -2
7491 -2 24 35 -20 -2 2 26 -2 -17 -62 19 -7 -19 28 40 -24 46 -21 -1 -26 -10 -27 28 -24 2 -48 -62 26 49 -44 47 -25
7522 -25 -20 20 11 17 -18 29 29 -19 -18 19 -2 13 -6 6 20 -12 -18 -9 -34 -141 -31 1 47 24 6 -6 -18 -34 -21 -14 -29 -47 -68
7555 -68 -4 33 33 22 7 -21 17 -12 -16 10 29 -14 3 25 21 1 52 49 11 -8 -22 11 -69 17 -48 22 -5 -54 -51 14 -25 9 -16
7588 -16 24 -25 -24 2 -2 17 -63 -3 40 -26 15 40 10 6 -16 26 -25 -27 48 -21 -10 -29 16 -40 -12 30 -3 -16 0 -20 -8 -3 -33
7621 -33 7 9 13 -82 -3 23 -60 -7 -19 -36 -24 -27 6 -11 47 12 10 -10 14 3 2 -12 18 -12 21 -71 -17 35 -11 5 44 0 0
7654 0 0 -51 -55 -21 -34 34 29 -3 19 -29 13 -13 -20 -50 -60 -55 -17 17 5 -13 67 13 -67 -13 -5 37 27 -18 -25 32 6 -14 75 32
7688 32 50 15 18 9 15 45 -7 7 28 27 36 -23 0 0 21 -46 -20 -24 -32 -11 -20 38 -27 -13 8 23 -4 2 -39 2 48 -8 -1 16 16 14 36
7725 36 -5 70 40 -29 3 33 27 16 -16 12 6 -22 -14 9 -6 34 13 5 10 -22 -15 16 1 -17 -14 -45 -32 21 14 4 -40 -2 17 6
7759 6 -18 31 -19 -29 -24 -51 40 -4 -21 8 49 -3 -9 -7 2 -1 -8 -19 16 52 65 23 -9 -12 -22 34 12 -29 22 -9 -10 11 17 32 47
7794 47 -22 -19 7 -46 33 -3 3 34 -12 -22 17 -7 29 -42 -33 45 12 21 -24 -49 16 28 -17 -28 -18 44 -5 -13 -7 -25 23 12 -16
7827 -16 24 -25 -26 -17 6 -83 7 -25 -87 0 20 37 49 -8 13 -23 32 -35 12 18 56 9 18 17 -30 5 20 23 -17 21 -17 37 44 22
7861 22 37 38 10 -36 15 3 -16 29 0 -20 -63 -9 -21 -11 21 -9 -41 11 24 23 -2 -64 -27 27 14 -42 10 -15 6 -6 3 24
7893 24 67 8 -17 -15 38 -6 12 15 -20 -12 -11 -32 -17 32 5 -14 5 7 6 -37 52 8 24 -15 -17 15 12 8 -21 -16 -19 33 -24 -26 -1 18
7929 18 11 8 -26 5 3 12 20 7 36 20 -11 -33 -3 8 6 38 -5 36 14 -9 -17 -97 -6 -15 -33 20 -3 -50 -23 -3 15 -7 -2 -67 21
7964 21 35 -2 18 -32 14 -16 20 -2 -10 -20 -21 -11 -6 31 -25 -35 5 54 -51 32 18 -5 23 -24 45 -23 37 11 -20 -18 -1 -53
7996 -53 -20 -3 34 8 -4 22 -40 -9 -10 20 -9 53 -1 -2 22 -19 21 23 -30 1 -9 14 -2 19 -15 -1 9 4 2 0 -15 -12 15 16
8030 16 -34 47 -2 18 35 -1 -16 -25 20 -4 9 -25 -36 43 47 14 -8 -23 -4 -74 -18 27 8 -1 -6 -38 -8 19 22 -26 64 19 -25
8063 -25 42 -16 -2 27 -28 -14 -9 26 -13 -12 -31 -32 -48 0 26 -13 25 -26 -23 -27 16 60 17 -35 -35 -37 -36 -74 7 -5 20 -6 -34 -20
8097 -20 -58 24 7 18 -2 31 -5 -7 -52 -39 48 28 -20 17 35 -19 19 5 -22 -23 14 -33 -26 -3 4 -3 -4 69 -4 -39 -13 51 14
8130 14 -38 -41 -28 58 -21 50 -4 2 9 73 -8 -40 14 12 20 -38 38 -21 19 -26 -14 30 45 4 -4 -4 -11 38 5 -43 -1 30 0 -11
8164 -11 -1 -28 9 -42 -51 25 29 -18 40 30 28 47 9 72 -2 -20 -17 -54 8 -24 14 31 70 15 -6 18 -17
8191a7
$$ Imaginary data points
##PAGE= N=2
##DATA TABLE= (X++(I..I)), XYDATA
0 0 0 0 0 0 0 0 0 0 0 0 0 0 0 0 0 0 0 0 0 0 0 0 0 0 0 0 0 0 0 0 0 0 1 -1 2 -2 2 -2 3 -4 5 -6 6 -7 7 -9 12 -12 13 -15 16 -16 18
53 18 -19 19 -20 18 -14 11 -1 -11 35 -74 139 -254 478 -949 2151 -6393 47631 333023 99294 -292116
73 -292116 -147355 200434 169225 -93004 -147034 -18707 86577 107271 -42 -168121 -100852
84 -100852 185696 194477 -166463 -264608 116460 300678 -48217 -291626 -17470 246216 70695
95 70695 -167081 -95699 72512 89705 24290 -52775 -106491 -7795 161956 78172 -186024
106 -186024 -146226 177143 196302 -143539 -221639 92442 213439 -39950 -176439 -4887
116 -4887 114788 31162 -40615 -35096 -33826 18671 99143 15848 -142858 -55608 164683 94783
128 94783 -161327 -120725 140558 130224 -107861 -119913 71639 90542 -40919 -49078 18825
139 18825 17 -10490 45474 11275 -84805 -21153 110530 32634 -123047 -42567 122189
150 122189 46096 -110968 -40050 95452 26903 -76944 -5767 61845 -17078 -48646 40911
161 40911 40398 -59571 -33659 72245 26665 -78457 -17826 78016 4157 -75118 11736 69173
173 69173 -31852 -65757 50461 63104 -66877 -62734 76484 61780 -78333 -57795 73179
184 73179 49559 -60524 -32951 45927 10296 -30516 19760 20752 -51241 -16766 81532 20441
196 20441 -105262 -30280 118031 42431 -118434 -54302 104013 58514 -79863 -54041 47548
207 47548 36396 -15029 -8073 -13248 -29466 31740 70764 -36542 -108151 29195 136818 -10108
219 -10108 -149068 -13108 144542 36553 -120864 -51425 83285 53465 -37425 -39986 -9220
230 -9220 10936 47750 28185 -73809 -73189 81403 113478 -72876 -143650 49461 155383 -19060
242 -19060 -147357 -11340 119778 34888 -75991 -44272 24484 38362 28446 -15095 -71928
253 -71928 -19011 101797 59646 -112359 -97732 104319 125856 -80797 -138304 46850 130112
264 130112 -12116 -104078 -18080 61147 34967 -10328 -37166 -42178 22721 86798 4418 -117026
276 -117026 -38004 129332 71424 -122117 -95797 100164 107362 -66666 -100459 31031 77305
287 77305 1026 -39924 -22564 -4761 30754 49575 -25841 -88610 8742 114072 13483 -124845
299 -124845 -37126 118435 54149 -99399 -61810 70797 56803 -38934 -39178 9814 12380 12818
311 12818 20571 -24664 -52417 27429 80153 -20520 -97757 9023 104254 4127 -98543
322 -98543 -14277 82545 17574 -60736 -14206 35406 2354 -12504 13874 -6802 -33788 18951
334 18951 51737 -25077 -65651 26034 73107 -23691 -72576 21453 65974 -19717 -52934 21765
346 21765 38007 -25901 -21681 32710 7517 -39558 4287 45166 -13587 -48338 19864 46967
358 46967 -25554 -42609 30159 34163 -36359 -25031 42419 15104 -49042 -6791 54596 633
370 633 -57423 3725 57060 -5729 -51034 8532 41556 -11699 -27377 18002 12273 -26720 2972
383 2972 38179 -15503 -51012 23048 62214 -25930 -70499 22900 71830 -17494 -66861 10032
395 10032 53452 -4868 -34014 3281 10428 -7316 13824 17291 -34685 -30922 50425 47421 -57054
408 -57054 -61579 55771 71740 -46237 -73423 32173 66022 -16509 -49339 2644 24525 5285
420 5285 4047 -6346 -33804 -1416 58416 14753 -75817 -32382 82140 49170 -77715 -61340
432 -61340 63491 65563 -42377 -58828 19830 42383 1232 -16442 -14999 -13549 20700 44615
444 44615 -16518 -70590 4566 87659 11903 -93680 -29300 87071 41837 -70932 -47588
455 -47588 46834 42693 -20936 -28503 -3476 5620 21430 21637 -30729 -48951 31212 72607 -22631
468 -22631 -87183 9503 91918 6163 -84487 -18544 67813 25618 -43916 -24351 17111 14444
480 14444 7820 2204 -27968 -23988 39300 45287 -42741 -63959 37457 74972 -27136 -77430
492 -77430 14118 70011 -2475 -54075 -4437 32967 5993 -8908 -301 -12803 -9915 31029
504 31029 24006 -42084 -37603 46299 48398 -44248 -53963 37564 52658 -29193 -45353 20393 31580
517 31580 -14838 -15169 11928 -2947 -13350 19057 17137 -32187 -22252 40751 27210 -44112 -29507
530 -29507 43913 29273 -39888 -24300 35315 16909 -29869 -6459 25944 -4641 -23077 15273
542 15273 21300 -24270 -20338 30104 18151 -33947 -15460 34612 10303 -34371 -4066 32746
554 32746 -3987 -31436 12114 30376 -19348 -29191 25164 28064 -27899 -24987 28998 20850 -27339
567 -27339 -13615 24966 4476 -22217 6472 20342 -18198 -20157 28609 21048 -37325 -23625
579 -23625 41690 25454 -42542 -26547 38526 24473 -31563 -19126 22690 9887 -13440 2929
591 2929 6508 -17278 -2073 32301 2092 -44479 -4760 53062 10237 -55561 -15697 52238
603 52238 19583 -43363 -20148 30138 15535 -15732 -6501 1480 -7247 8937 22748 -15493 -38648
616 -38648 16352 51600 -12671 -59428 5836 61009 2372 -55016 -8593 43427 12067 -26630
628 -26630 -9828 8569 2926 8974 9028 -22681 -23526 30952 38109 -33341 -50637 29229 57486 -21424
642 -21424 -58399 10885 51259 -1800 -38280 -4726 20350 6134 -663 -2191 -17668 -6294
654 -6294 32657 18371 -41142 -30403 43791 40862 -39620 -46257 31441 46148 -20567 -39326 10046
667 10046 26719 -2234 -10476 -1915 -7731 795 24247 3662 -37962 -11624 45862 19908 -48183
680 -48183 -26920 44741 30573 -36839 -29405 26840 23674 -15844 -12799 7108 -354 -866 15102
693 15102 -1122 -28346 190 38728 3338 -44765 -7815 45507 11279 -42057 -12973 34463
705 34463 10909 -25592 -6174 15809 -1715 -7675 10926 1467 -20429 2300 28700 -3530
717 -3530 -34014 3790 36632 -2888 -35372 3180 31725 -4229 -25576 7049 18668 -11099
729 -11099 -11819 15862 5583 -20914 -825 24568 -3379 -27249 6011 27234 -8843 -25743
741 -25743 11389 22217 -14489 -17657 17962 12954 -21253 -7953 24779 4316 -26662 -777
753 -777 27533 -1593 -25867 4333 22687 -7070 -17768 10560 11949 -15045 -6169 19784 763
766 763 -25132 2728 29055 -5112 -31877 5570 31892 -5336 -29333 4798 23990 -4875
778 -4875 -16151 6704 7564 -9776 1756 15052 -9231 -20714 15233 26906 -17849 -31596 17912
791 17912 33901 -15600 -33063 11772 28279 -8202 -20529 5173 9666 -4811 1690 6426 -13131
804 -13131 -10883 22220 16651 -28177 -22630 30244 27587 -28180 -29710 23421 28638 -16414 -23024
817 -23024 9833 14347 -4101 -2763 1245 -9550 -1284 21101 4026 -30336 -9116 35410 14360
830 14360 -36658 -19271 33293 21294 -27028 -20454 18476 15529 -9727 -7295 2356 -3266 2763
843 2763 14948 -4409 -25453 3462 34063 203 -38460 -4605 38853 8801 -34807 -11241
855 -11241 27353 10747 -18053 -7289 8003 399 495 8055 -7023 -17701 10163 26094 -10587
868 -10587 -32365 8421 35321 -4900 -34214 1683 29872 765 -22085 -652 13306 -1255
880 -1255 -3821 5734 -4313 -11466 10586 17651 -14338 -23128 15335 26493 -14716 -27660 12358
893 12358 25522 -10274 -21116 8182 14272 -7598 -6559 8306 -1261 -10218 8272 13186 -13491
906 -13491 -15680 17138 18018 -18178 -18308 18195 17288 -16840 -13991 15353 9378 -13993 -3851 12895
920 12895 -2302 -12847 7483 12646 -12176 -13009 15049 12229 -16951 -11057 17428 8664 -17216
933 -17216 -5264 16698 1357 -15899 3248 15546 -7116 -14791 10749 14384 -12936 -13004 14402
946 14402 11177 -14714 -8215 14283 4213 -13827 300 13030 -5588 -13029 10081 12996 -14296
959 -14296 -13525 16800 13508 -17961 -12969 17480 11359 -15617 -8136 13175 3942 -10206 1993
972 1993 8178 -7979 -6663 14222 6530 -19132 -7082 22507 8046 -23727 -9093 22340 8937
985 8937 -19430 -7722 14632 4436 -9712 219 4777 -6367 -1135 12898 -917 -18998 1402
998 1402 23971 -244 -26338 -1457 26536 3481 -23674 -4278 18834 3902 -12307 -1479
1010 -1479 5402 -2875 883 8326 -5904 -14750 8554 20267 -9464 -24700 8097 26366 -5876
1023 -5876 -25509 3111 21629 -1141 -15534 679 8255 -1727 -319 4961 -6513 -9023 12003
1036 12003 14066 -14871 -18281 15671 21327 -14237 -22186 11501 20494 -8370 -16542 5305 10260
1049 10260 -3865 -3250 3382 -4314 -4906 10765 7402 -15813 -10560 18622 13616 -19075 -15291 17760
1063 17760 15589 -14625 -13565 11327 9807 -7732 -4190 5341 -2031 -3906 8458 3811 -14041
1076 -14041 -4819 17892 6102 -20119 -7503 19854 7759 -18304 -7178 15192 4914 -11742
1088 -11742 -1478 8267 -2793 -5332 7572 3454 -11798 -2067 15470 1734 -17422 -1496 18298
1101 18298 1365 -17366 -618 15334 -777 -12617 2768 9374 -5511 -6499 8297 3693 -11181
1114 -11181 -1727 13168 22 -14584 1244 14771 -2464 -13878 3895 12317 -5400 -9836
1126 -9836 7456 7474 -9335 -4816 11430 2669 -12857 -682 13679 -876 -13636 2344 12427
1139 12427 -3944 -10794 5556 8150 -7706 -5676 9733 2943 -12054 -836 13822 -740 -14997
1152 -14997 1895 15245 -2493 -14138 3199 12255 -3684 -9018 5030 5554 -6422 -1748 8656
1165 8656 -1524 -10998 4169 13185 -5880 -14945 6333 15471 -6345 -14956 5445 12688 -4873
1178 -4873 -9445 4391 4942 -4846 -202 5965 -4358 -7775 8236 10172 -10564 -12070 11830 13574
1192 13574 -11386 -13664 10140 12534 -8058 -9554 6112 5479 -4627 -573 3893 -4783 -4407 9326
1206 9326 5483 -13121 -7376 15030 8927 -15530 -10089 14268 10076 -11846 -8719 8871 6015
1219 6015 -5693 -1794 3357 -2813 -1612 7883 1281 -12055 -1748 15313 3026 -16890 -4397
1232 -4397 16567 5170 -14860 -5278 11739 3806 -8187 -1468 4410 -2117 -1442 6123 -857 -10150
1246 -10150 1885 13538 -1930 -15635 1487 16482 -551 -15429 92 13296 -37 -9846
1258 -9846 980 6080 -2626 -2264 5029 -1049 -7907 3351 10353 -4880 -12542 5232 13456 -5310
1272 -5310 -13505 4649 11956 -4126 -9475 4039 6344 -4275 -2753 5319 -572 -6464 3682 8109
1286 8109 -5635 -9195 7086 10005 -7599 -9853 7586 8752 -7367 -7033 6921 4334 -6853
1299 -6853 -1639 6699 -1380 -7143 3834 7295 -6045 -7607 7460 7336 -8235 -6577 8529 5408
1313 5408 -8416 -3466 8326 1522 -7834 1083 7763 -3166 -7491 5119 7219 -6524 -6739 7395
1327 7395 5807 -7863 -4677 7648 2785 -7595 -808 7069 -1551 -6947 3770 6746 -5818 -6625
1341 -6625 7347 6464 -8156 -5949 8463 5214 -7983 -3607 7343 1814 -6259 699 5449 -3356
1355 -3356 -4840 5919 4459 -8275 -4499 9695 4460 -10578 -4496 10272 3922 -9385 -3046
1368 -3046 7713 1410 -5761 807 3952 -3380 -2349 6259 1458 -8643 -898 10771 1105 -11750
1382 -11750 -1282 11829 1612 -10647 -1600 8668 813 -6174 455 3338 -2676 -1025 4915
1395 4915 -1069 -7676 2151 9783 -2626 -11351 2360 11928 -1754 -11250 1224 9606 -854 -6850
1409 -6850 1319 3989 -2209 -672 3924 -2027 -5786 4182 7842 -5444 -9562 5715 10413 -5485
1423 -5485 -10570 4471 9227 -3709 -7351 2848 4339 -2740 -1295 3039 -1940 -3942 4712 5196
1437 5196 -6563 -6435 7771 7576 -7712 -7805 7307 7521 -6105 -6064 4979 4035 -3922 -1315 3309
1452 3309 -1594 -3256 4238 3373 -6676 -4016 7989 4497 -8721 -4895 8505 4620 -7793 -3791
1466 -3791 6685 2374 -5290 -331 4262 -1778 -3167 4187 2726 -6033 -2308 7554 2162 -8388
1480 -8388 -1984 8528 1677 -8059 -1140 6981 8 -5839 1180 4467 -2903 -3260 4440 2132 -5881
1495 -5881 -1396 6911 774 -7481 -198 7558 -322 -6914 1095 6194 -1969 -4975 3148 3859 -4213
1510 -4213 -2682 5408 1643 -6298 -815 6775 -35 -6961 618 6546 -1451 -5854 2187 4704 -3244
1525 -3244 -3525 4282 2293 -5326 -1055 6313 315 -6866 517 7235 -940 -6783 1544 6179 -1974
1540 -1974 -4890 2597 3431 -3403 -1854 4302 256 -5382 852 6265 -1890 -7065 2231 7158 -2614
1555 -2614 -6913 2507 5994 -2555 -4561 2644 2848 -2978 -799 3707 -986 -4359 2693 5451 -3676
1570 -3676 -6058 4401 6658 -4331 -6472 4138 5784 -3626 -4555 3068 2634 -2898 -610 2673 -1692
1585 -1692 -3122 3597 3618 -5247 -4287 6111 4853 -6355 -4969 6061 4819 -5092 -3851 4238 2478
1600 2478 -3050 -454 2349 -1567 -1886 3763 1815 -5588 -2148 6737 2510 -7355 -3019 7139 2965
1615 2965 -6408 -2651 5137 1769 -3824 -406 2452 -1341 -1389 3230 763 -4930 -374 6408 476
1630 476 -7150 -540 7360 793 -6774 -804 5770 415 -4372 312 2729 -1593 -1339 2899 -25
1645 -25 -4328 782 5415 -1345 -6374 1458 6634 -1376 -6352 1386 5576 -1336 -4262 1754 2851
1660 2851 -2145 -1150 3038 -127 -3794 1356 4656 -2094 -5183 2501 5403 -2705 -5200 2630 4457
1675 4457 -2723 -3558 2702 2135 -3055 -933 3276 -471 -3700 1595 4030 -2376 -4189 3037 4228
1690 4228 -3299 -3777 3519 3233 -3428 -2167 3518 1154 -3499 157 3594 -1300 -3696 2289 3690
1705 3690 -3097 -3648 3401 3267 -3740 -2845 3635 1839 -3682 -979 3549 -225 -3444 1362 3481 -2302
1721 -2302 -3412 3207 3393 -3617 -3087 3929 2808 -3780 -2095 3563 1253 -3238 -262 2917 -1105
1736 -1105 -2756 2179 2532 -3262 -2498 3944 2378 -4476 -2346 4465 2020 -4211 -1551 3680 795
1751 795 -3003 292 2403 -1428 -1717 2805 1369 -3762 -1055 4654 1012 -5205 -1032 5167 925
1766 925 -4759 -708 4021 187 -3112 506 1958 -1506 -1062 2562 260 -3667 160 4560 -406
1781 -406 -5151 485 5366 -360 -4973 360 4374 -299 -3213 698 1918 -1259 -643 1990 -465
1796 -465 -2979 1242 3722 -1803 -4513 1943 4695 -2004 -4695 1627 4096 -1523 -3237 1388 1948
1811 1948 -1525 -536 1872 -635 -2294 1988 3006 -2614 -3393 3144 3823 -3050 -3842 2941 3484 -2526
1827 -2526 -2762 2135 1698 -1966 -552 1742 -842 -1944 1905 2061 -2923 -2439 3385 2583 -3707 -2611
1843 -2611 3540 2490 -3160 -1900 2822 1246 -2225 -117 1936 -883 -1541 2033 1568 -2893 -1440
1858 -1440 3460 1442 -3822 -1443 3768 1162 -3593 -894 3079 163 -2535 497 1897 -1389 -1510
1873 -1510 2290 1139 -2932 -827 3462 757 -3566 -492 3597 343 -3227 212 2876 -617 -2315
1888 -2315 1269 1690 -1869 -1282 2493 799 -3025 -505 3227 185 -3435 8 3199 -364 -2854
1903 -2854 702 2371 -1127 -1740 1762 1190 -2217 -579 2848 246 -3087 149 3378 -372 -3251
1918 -3251 660 3002 -870 -2487 1093 1786 -1554 -1197 1936 353 -2492 149 2858 -653 -3242
1933 -3242 893 3266 -1084 -3190 1184 2844 -1122 -2187 1369 1531 -1446 -551 1836 -117 -2098
1948 -2098 900 2469 -1449 -2802 1654 2944 -1811 -2940 1699 2535 -1666 -2092 1482 1142 -1516 -411
1964 -411 1469 -555 -1669 1403 1901 -2036 -2143 2506 2322 -2570 -2304 2579 2176 -2184 -1666 1939 1054
1981 1054 -1564 -172 1315 -788 -1231 1614 1202 -2395 -1378 2829 1370 -3108 -1550 2941 1425
1996 1425 -2738 -1176 2243 727 -1732 -37 1292 -609 -854 1596 634 -2221 -423 2841 471
2011 471 -3161 -448 3236 541 -2922 -416 2447 155 -1915 245 1276 -825 -755 1421 176 -2116
2027 -2116 71 2627 -304 -2974 338 3027 -367 -2856 438 2458 -485 -1829 797 1221 -1034
2042 -1034 -479 1468 -80 -1891 539 2250 -844 -2589 977 2572 -1045 -2427 993 2035 -1057
2057 -1057 -1571 1133 944 -1303 -292 1537 -313 -1729 831 1986 -1047 -2056 1403 2158 -1415 -1909
2073 -1909 1464 1583 -1432 -1105 1418 533 -1501 59 1534 -659 -1723 1061 1742 -1478 -1818 1548
2089 1548 1696 -1653 -1461 1602 1075 -1606 -574 1551 82 -1432 576 1517 -1012 -1433 1452 1514 -1671
2106 -1671 -1435 1791 1283 -1805 -1040 1685 568 -1537 -205 1313 -414 -1281 888 1080 -1419 -1122
2122 -1122 1769 1105 -1998 -996 2055 920 -1957 -652 1772 397 -1504 100 1231 -539 -844
2137 -844 1126 701 -1621 -606 1945 521 -2217 -567 2189 485 -2134 -393 1807 72 -1508
2152 -1508 285 971 -730 -614 1157 284 -1565 20 2048 -106 -2221 190 2334 -115 -2136 215
2168 215 1882 -263 -1444 452 874 -757 -433 1090 -156 -1452 351 1711 -639 -2015 707 2147
2184 2147 -722 -2044 646 1785 -593 -1364 711 948 -740 -260 941 -221 -1176 717 1472 -977
2200 -977 -1635 1131 1716 -1269 -1701 1090 1497 -1087 -1196 909 609 -910 -210 868 -415 -993 842
2217 842 1029 -1250 -1154 1474 1286 -1512 -1169 1495 1146 -1300 -749 1223 469 -972 45 908 -494
2234 -494 -801 960 730 -1325 -844 1534 750 -1725 -816 1548 639 -1519 -482 1232 130 -1116 235
2251 235 803 -633 -654 1032 592 -1307 -428 1597 378 -1600 -286 1585 220 -1472 -48 1207
2267 1207 -244 -1010 478 658 -869 -465 1082 299 -1499 -189 1516 114 -1578 -7 1477 -81
2283 -81 -1304 321 1089 -447 -762 720 534 -936 -234 1251 83 -1371 59 1519 -205 -1552
2299 -1552 157 1328 -317 -1209 407 825 -608 -589 713 137 -1032 47 1191 -235 -1333 414
2315 414 1470 -494 -1339 551 1319 -498 -937 646 692 -639 -307 824 -78 -878 299 1029 -654
2332 -654 -1221 684 1235 -785 -1300 779 1064 -800 -885 680 544 -636 -201 713 -168 -779 495 870
2350 870 -811 -898 973 1094 -997 -957 1050 919 -910 -737 803 444 -709 -121 556 -325 -592 622
2368 622 523 -969 -676 1107 596 -1247 -718 1116 639 -1101 -457 899 286 -730 37 624 -316 -360
2386 -360 794 369 -970 -285 1228 303 -1271 -284 1245 192 -1178 -221 963 68 -766 138 548
2403 548 -408 -360 640 142 -881 -95 1096 0 -1198 -55 1250 -6 -1142 105 986 -145 -767
2420 -767 304 480 -458 -202 647 4 -847 142 965 -321 -1084 277 1067 -418 -1094 362 884 -401
2438 -401 -570 487 400 -537 -90 730 -102 -782 340 892 -469 -911 454 935 -567 -841 548 682
2456 682 -485 -526 523 209 -588 7 532 -280 -723 385 729 -591 -731 630 762 -654 -662 679 543
2475 543 -533 -293 579 116 -510 234 558 -375 -534 558 633 -703 -614 755 517 -813 -523 691 332
2494 332 -645 -140 507 -135 -545 331 386 -556 -444 734 478 -824 -373 814 433 -746 -290 789 202
2513 202 -564 -14 454 -195 -402 383 259 -614 -240 758 188 -858 -264 843 193 -853 -124 716 26
2532 26 -527 65 416 -259 -270 502 178 -600 -15 748 21 -861 5 889 -17 -839 33 736 -53 -605 132
2553 132 301 -307 -189 370 26 -585 97 684 -197 -803 192 839 -203 -776 166 689 -188 -500 289 348
2573 348 -277 -134 368 -16 -473 209 531 -355 -705 344 687 -390 -677 278 545 -370 -438 294 284 -337
2593 -337 -27 364 -142 -452 289 482 -433 -496 509 594 -523 -467 490 480 -359 -279 384 157 -398 -57 284
2614 284 -188 -349 270 345 -469 -405 496 387 -643 -349 534 274 -538 -246 428 85 -322 132 366 -163
2634 -163 -220 417 281 -519 -185 635 225 -645 -207 588 187 -532 -135 431 -47 -422 153 270 -271 -139
2654 -139 424 130 -566 -133 577 100 -598 -19 585 31 -490 37 437 -63 -312 252 162 -306 -63 410
2674 410 26 -503 64 568 -35 -576 51 465 -44 -441 81 331 -174 -236 272 112 -331 23 385 -73
2694 -73 -474 179 537 -110 -457 174 522 -154 -385 140 302 -257 -205 279 -12 -346 169 345 -152 -435 277
2715 277 446 -316 -472 231 426 -249 -270 233 257 -167 -52 277 7 -190 229 311 -267 -286 382 362 -326 -376
2737 -376 343 331 -332 -302 249 156 -300 -77 199 -119 -228 168 208 -396 -229 359 251 -373 -183 385 247
2758 247 -317 -156 354 146 -216 57 161 -107 -135 245 153 -365 -182 380 137 -498 -224 383 113 -397 -90
2779 -90 295 49 -257 18 102 -128 -106 299 31 -337 -24 411 45 -424 -38 441 4 -424 27 313 -49
2800 -49 -201 69 109 -159 -81 237 27 -337 31 320 -89 -374 21 356 -110 -344 58 263 -62 -199 138
2821 138 124 -178 30 207 -74 -249 147 350 -101 -347 110 268 -149 -348 99 223 -194 -201 132 32 -163
2842 -163 35 207 -128 -248 172 242 -140 -209 275 281 -191 -198 212 237 -167 -43 125 24 -190 46 192 -131
2864 -131 -174 154 128 -279 -292 181 136 -247 -204 231 81 -226 -82 99 -35 -78 137 140 -211 -81 222 183 -213
2887 -213 -80 305 148 -248 -65 259 110 -210 24 126 -82 -84 101 71 -202 -61 229 12 -282 -70 274
2908 274 13 -234 -84 314 64 -151 -18 132 -32 -24 92 96 -161 -11 287 27 -240 28 290 -32 -270
2929 -270 12 151 -32 -182 29 77 -86 -86 127 -33 -183 41 207 -61 -257 71 268 -72 -224 22 222
2950 222 -30 -175 92 49 -41 -21 64 -80 -161 70 156 -117 -217 113 201 -103 -233 83 167 -87 -106 140 45
2973 45 -93 -14 117 -3 -80 145 125 -85 -127 151 172 -161 -154 106 63 -109 -102 47 4 -119 -11 21 -109 -88 104
2998 104 81 -170 -132 181 87 -214 -143 164 86 -112 -12 172 58 -106 88 27 -69 -50 177 67 -163 -57 197
3021 197 53 -208 -95 158 13 -136 -68 93 -8 -136 8 -15 -91 -63 143 -26 -191 -3 185 48 -145
3042 -145 -27 176 19 -57 30 139 5 -34 67 50 -87 26 117 -15 -134 46 195 -30 -126 108 175 -29
3064 -29 -109 36 141 -24 -45 81 -2 -39 50 126 -2 -103 85 163 -31 -144 21 131 -31 -131 -4 44 -37
3087 -37 -46 11 17 9 70 65 -130 -54 91 156 -66 -139 97 146 -69 -79 124 83 -99 8 34 -39 -46 65 38 -109 -86 87
3115 87 77 -128 -67 45 53 -117 -169 40 30 -40 -27 77 -62 -27 68 -4 -103 -6 131 78 -98 -20 190 86 -61
3140 -61 -29 106 38 -26 20 16 -24 -29 57 39 -140 -32 123 -61 -189 -52 77 15 -104 -43 83 16 5 37 31 -24 53
3167 53 79 -5 -99 3 165 21 -139 -12 139 -12 -94 2 70 -25 -30 72 -18 -32 -8 55 0 -70 80 136 -38 -68
3193 -68 56 53 -72 -56 44 60 12 -69 13 30 -10 12 39 -30 -68 96 42 -75 -12 31 110 -44 -28 24 84 -69 -98
3220 -98 7 4 -20 65 38 -48 -66 97 145 -9 -26 64 103 -25 -72 27 32 -59 -55 124 -65 -47 6 -38 -77 -77 123 81 -103
3249 -103 -22 85 46 -37 -2 68 -7 -17 -19 61 16 0 46 -13 -8 1 99 56 -77 18 52 35 -64 -20 40 -24 -94 -45 4 -84
3279 -84 6 -37 20 -39 40 51 -41 -59 -5 44 61 -44 31 86 6 7 20 15 12 12 37 56 -13 45 91 -86 -110 30 108 -45
3309 -45 -70 53 49 -18 -36 -4 2 20 24 -11 6 -36 13 63 -48 -23 23 84 -14 -57 32 72 20 -27 28 -40 -22 31 -25 -11 -44
3340 -44 55 53 -45 -77 31 29 -63 -13 55 74 44 -15 21 42 -18 95 34 -3 16 42 41 -20 -60 21 -31 -70 -43 37 -4 1 -99
3371 -99 6 1 -17 -1 -23 -61 -38 37 -3 -67 25 42 40 11 32 101 -4 -19 -6 19 10 -20 49 11 -49 45 20 -25 -7 -8 39
3402 39 -27 -35 3 32 30 -42 -75 22 -5 -4 7 -35 -54 50 48 -8 -21 33 126 28 -19 43 71 2 -3 -4 22 6 -22 65 -53 -7
3434 -7 18 52 -37 -21 37 27 -25 -52 -5 46 -36 -25 35 7 -15 36 -50 -25 -8 68 10 -12 2 20 66 -21 -28 51 25 -24 -31 17
3466 17 55 5 -19 -27 -1 20 82 -20 -44 -19 91 24 -29 23 58 24 31 -59 35 -19 -24 20 -24 3 58 41 17 -41 11 27 32
3497 32 -59 -13 -4 35 -37 -86 24 -13 7 30 30 -61 0 49 34 -19 19 38 -27 -46 4 35 -24 -15 5 -25 23 -24 -66 -17 -22 37
3529 37 -31 -39 -88 4 -18 -70 -84 -14 -45 -43 -9 -23 21 -18 49 -27 -22 17 15 80 -17 9 35 15 -67 -15 -22 29 5 8 40 19 7
3562 7 -22 5 -76 -75 -36 17 -25 0 9 26 -26 -35 37 39 10 -41 18 6 -11 32 18 9 -2 -27 -22 -45 19 19 36 -10 17 -1 -3 30 -49
3597 -49 -8 15 -30 36 -21 21 27 13 -57 -57 8 61 1 -43 -34 13 14 5 -10 -3 17 39 6 -53 -51 20 37 -6 -55 -25 -22 -24 -38 7 42
3632 42 -10 42 39 89 41 15 57 20 -26 -7 20 -66 -25 -8 2 24 -78 37 -16 -16 -65 -38 -37 -79 2 -86 -6 5 34 -11 -46
3663 -46 -48 20 59 -20 -25 -25 31 -6 13 32 63 -13 38 40 37 -29 58 4 -54 -7 0 22 -49 -41 13 9 -75 -12 17 15 -53 -3 -1 -56 -8
3698 -8 35 -33 9 2 -1 -11 -17 -13 -63 -10 -3 31 -27 -9 -8 -45 14 105 29 43 -1 -51 -33 -26 41 -3 -32 42 2 -26 -52 -46 -30 32 -6
3733 -6 27 -20 -87 -1 -9 -34 -58 41 -26 -34 -5 -6 -27 -16 -33 7 -39 -36 11 3 -8 -24 -13 -23 -49 3 -3 -39 -36 41 4 -25 -30 21 36
3768 36 10 -12 -12 -29 24 16 45 -37 -33 -47 -46 -15 -12 71 5 -64 -58 16 -7 20 29 32 12 -15 33 45 23 -16 21 61 6 -27 50 -36
3802 -36 6 52 63 -28 -34 1 -42 18 -35 15 -21 -6 -24 -20 37 -51 4 0 29 -20 -2 16 -23 -48 22 30 25 -22 -6 77 -10 21 24
3835 24 -6 -23 23 30 -56 13 -6 18 -21 -38 8 1 -78 -4 27 -7 13 6 -15 -9 8 11 41 -37 -45 -1 19 -26 -32 -2 42 28 44 31
3869 31 15 8 7 33 -80 -91 6 -53 -16 -13 -41 51 -18 33 4 -31 -12 24 36 -7 -38 23 -2 14 55 37 46 -49 -11 37 33 14
3901 14 -25 2 -57 -40 5 -42 -51 -2 -32 36 -10 -58 39 55 -5 -16 -7 48 -3 25 35 44 -13 5 15 -48 29 -21 33 3 -25 78
3933 78 -8 -29 -36 30 12 -38 -32 -36 -24 5 -41 -27 -59 -22 69 45 35 7 -4 19 2 -24 14 -12 -11 -32 10 22 28 -24 6 -16 -45
3966 -45 -3 16 17 54 -32 -17 48 38 3 -47 -15 37 16 22 33 25 -13 -60 -3 69 -12 2 -34 18 -33 -39 12 -36 -15 35 4 -20
3998 -20 -54 -4 -32 5 -21 -2 3 12 1 42 18 -39 11 40 36 -67 39 -20 -57 -48 7 44 -47 24 24 8 26 -31 -26 -29 -27 -16 13
4031 13 -51 -40 -18 22 6 19 -15 -7 48 32 51 48 -53 8 15 20 9 9 17 63 31 21 -2 -31 15 -24 -26 -19 25 -14 3 -16 -26 60
4065 60 -7 7 -38 -38 -20 -15 14 36 -23 13 48 -46 5 -3 32 -75 37 -62 18 -9 3 23 -15 -37 -5 42 57 -29 47 29 -19
4096 -19 -42 3 -11 -2 63 -37 -72 -6 -41 18 39 -21 -62 -19 -1 -32 -57 -20 78 -36 3 -7 -31 -42 -38 -3 -4 -36 -25 35 18
4127 18 -1 34 -10 -20 -15 -15 -59 38 -30 11 -7 -31 2 39 26 6 13 5 -14 29 -4 -14 -36 -7 -46 -45 24 -29 -10 -25 23 21 -20
4160 -20 12 -39 -37 -13 -68 5 19 -6 -45 5 36 24 6 48 11 -58 -51 -3 24 -65 -8 13 -60 -37 -26 -30 36 -5 -14 6 -6 -6 -57
4193 -57 -56 -41 43 -25 11 -42 56 30 -26 -9 41 38 7 17 15 -10 17 20 9 45 -54 -10 -29 21 -73 -1 44 -33 -35 -17 6 -21 -47
4226 -47 -11 -2 -21 21 27 8 -27 -45 5 -9 -41 -47 -20 22 -70 33 -10 8 -96 -15 11 5 -28 5 41 5 0 -11 -9 -3 55 -42 35
4259 35 14 0 31 -2 12 -30 -9 50 16 27 -18 -15 -3 -20 -9 -4 -67 -24 5 24 -20 -6 -5 46 -8 -13 -8 -18 -7 -4 -2 44 43 -16
4293 -16 22 20 19 21 20 35 54 26 0 -32 -19 -21 42 -34 -12 -26 -66 -57 -68 -29 -13 -61 -17 -14 -11 52 -41 42 -11 -21 -1 43 15 -4
4327 -4 51 -45 -16 4 29 -13 19 -10 4 -1 -25 -5 17 -41 -19 54 51 14 2 32 10 -28 0 -18 -4 41 32 9 77 -3 -19 41
4359 41 15 14 -30 -13 10 1 -5 19 -15 -19 25 0 28 30 -3 3 -11 -23 38 14 4 2 -14 15 -44 -48 55 20 -7 16 18 11 -32 22 9
4394 9 -54 -2 18 -11 -5 13 -10 -51 -19 42 8 8 -28 -9 -51 -26 -5 1 -24 3 31 20 6 41 -26 38 50 55 -26 27 -36 6 33
4427 33 -25 -19 -3 0 -1 0 -80 13 -29 -43 -25 -18 -90 -19 3 -34 -12 -19 -3 -26 -25 -9 -20 -55 11 -25 8 14 22 -3 26 36 49 -22 32
4462 32 10 -18 -61 -70 -14 -26 68 38 16 28 29 -12 -38 -40 -2 46 -8 -20 -9 -8 27 -14 -14 -8 24 2 1 -10 -14 -5 -16 -39 9 -9 -44
4497 -44 -44 48 3 1 -5 -34 20 -5 2 -37 -27 5 34 9 18 -6 23 -15 -53 -15 -13 47 -4 19 -33 -47 -8 3 20 -4 39 22 -38
4530 -38 0 -53 10 46 4 -25 -58 -22 -40 -3 31 -40 -28 56 24 -28 35 -6 -10 11 -16 56 20 -7 42 -11 -17 -8 35 6 -53 -20
4562 -20 20 4 -34 -28 34 -19 -17 2 3 -1 11 13 -34 19 29 -8 20 -17 13 17 -6 58 -20 2 19 1 -9 6 -4 -19 -25 3 -8 33
4596 33 49 -40 -11 15 -25 -31 22 -43 15 11 -54 5 28 75 2 -7 -4 -48 74 -16 -22 31 -1 1 -35 -9 23 -26 -5 -49 -33 52 6
4629 6 22 -34 -29 -2 -9 23 -15 -3 -4 3 -18 33 -53 22 -41 -37 -50 11 -19 17 -36 -11 -49 -14 27 -12 -15 -54 23 -43 15 12 -5 -16
4663 -16 3 -21 -11 -32 10 3 28 2 -36 -14 2 -13 -25 13 61 -4 -4 7 2 -25 -4 19 -23 -19 -7 -2 -18 25 -45 -9 37 3 -3
4696 -3 0 -28 -30 -22 -21 -12 12 38 -33 49 17 -5 -15 1 -9 -6 53 -62 18 17 -42 -22 50 24 -21 0 -16 -54 -5 -31 -26 -27 -48 -46 27
4731 27 -6 16 -54 -30 9 -35 -44 -21 -15 30 21 -27 -5 9 18 44 27 1 19 31 13 11 1 9 -23 -29 8 67 -6 -51 -22 -1 -22 8
4765 8 -17 -29 -45 -21 31 19 -19 -2 -6 0 -30 -17 -30 11 18 14 -38 -17 -24 -45 -25 24 20 -72 -27 -18 -25 -9 15 0 17 6 14 25 1
4800 1 8 -44 -49 37 -3 -2 36 -10 23 60 -34 35 -15 16 -6 0 15 -32 -42 -36 -41 -17 49 5 -44 9 33 18 52 -8 45 -6 -22 24
4834 24 0 8 20 9 8 -11 -51 -36 11 28 52 5 -39 -28 -37 -37 7 -14 -30 -30 -60 -26 -55 22 -68 -1 -23 8 19 -16 9 3 27
4867 27 15 46 11 -46 8 35 -7 6 23 18 9 -23 -6 -14 -8 -4 7 -7 10 -4 -29 18 -39 -36 -14 -7 -34 -12 -7 23 29 -32 4 -19 28
4902 28 37 11 -44 58 4 -2 14 1 34 -35 5 5 -51 -7 19 -53 -8 -13 -1 -29 -65 -5 7 -3 -17 -33 -10 9 -71 -22 12 9
4934 9 -57 -13 3 5 -4 52 -34 -70 -23 7 -14 17 -2 -6 21 -27 -5 -19 5 46 6 39 33 -10 17 25 30 -23 16 -13 21 10 -23 32
4968 32 34 -79 4 -53 -3 11 -11 -47 22 -9 -10 2 -12 -3 12 28 -58 26 28 24 55 44 30 32 24 23 29 -18 50 31 12 35 -10 -27
5002 -27 16 -44 43 -31 -29 10 -70 46 -25 -7 -83 -38 -11 -4 49 -4 -3 -3 35 7 15 -24 -9 -3 -13 -30 6 9 61 -31 10 -34 13
5035 13 -46 -25 25 15 16 -26 10 -43 -41 -37 -4 -36 7 40 -66 13 -16 20 -35 -24 28 -15 -49 -12 -6 -52 2 12 -4 23 60 -8
5067 -8 -7 -36 -8 -31 -19 -11 -2 -12 -74 13 42 -9 25 -17 26 41 -42 -21 66 48 32 55 20 -84 50 -28 -36 6 -54 -16 -6 -24
5099 -24 -60 -31 -61 -10 -1 -15 -4 40 -18 -19 -26 7 -29 24 -11 -3 -15 32 -27 56 -3 46 11 -24 44 49 13 25 -10 -23 -22 6 -4
5132 -4 -16 12 25 21 1 8 16 -53 14 -41 2 14 12 -36 -25 -27 -39 24 49 -7 -28 -3 -28 51 19 15 -21 2 3 10 -27 24 18 -3 -3 41
5168 41 1 -11 25 -14 4 51 -13 -37 9 12 19 2 -2 -12 -33 -35 -35 -39 -41 15 -9 -3 -23 -33 32 -53 -39 -37 -55 12 -21 -8 37 23 -12
5203 -12 -12 -21 -38 -17 -11 -48 38 54 -25 12 6 -6 27 -45 -10 37 -12 -44 11 -2 -9 -8 12 -19 -41 -26 -49 -9 -28 -31 27 22 45 -14
5237 -14 34 -14 -33 11 -7 23 57 -9 18 -15 19 57 30 -16 8 -23 25 -7 43 -17 19 -6 -65 -39 -30 -18 7 -28 17 5 -10
5268 -10 -23 -12 -7 52 -10 -40 25 -52 56 8 9 9 -38 -5 -8 51 -19 41 62 35 -18 -48 -36 -17 61 4 -63 -16 13 -27 -15 -46
5300 -46 4 -11 21 -11 11 -16 -22 -19 17 -37 -3 8 30 -14 -50 5 0 23 0 47 -23 -32 -4 30 4 64 -1 38 69 28 -12 41
5332 41 12 -42 3 2 -39 0 26 -38 -15 39 -28 -54 -4 -18 -8 -57 -6 0 -42 -48 17 -20 30 -11 -13 11 -7 -20 30 -22 -21 45 -15
5365 -15 27 10 46 27 -12 11 -1 -8 -39 -41 -30 6 14 -5 -15 -20 42 2 66 58 -31 -23 3 -10 -50 -6 -33 -36 -16 21 -12 -17 20 28 54
5400 54 -14 10 -30 -24 -8 16 1 20 -52 -7 -12 25 -5 -1 -4 -6 -42 -10 -36 -7 -11 -4 -3 -30 5 -22 28 -30 -19 -28 72 -5 -32 6
5434 6 7 5 6 -11 1 9 70 -4 -41 41 -11 -12 -23 1 17 7 -7 35 -2 8 5 42 32 -70 -30 75 -32 -37 35 -22 -15 -51 -45 -32
5468 -32 -39 -14 14 -25 -37 -18 55 14 -92 -9 -22 -10 -31 -36 34 7 -25 27 18 25 27 20 20 -32 -32 3 45 9 29 10 -41 -13 -1 20
5502 20 11 15 13 -1 7 -12 85 -4 -37 5 -25 9 25 -29 -33 17 -47 30 -9 -10 15 37 2 -24 -6 29 -2 45 21 1 -43 2 -31
5535 -31 -24 37 -17 50 6 -16 -14 26 -18 13 -30 45 -69 -32 -2 5 -19 7 26 -19 -26 -7 -45 -24 39 42 21 21 -8 14 -23 65 48
5568 48 24 -19 24 -21 24 -14 -16 0 -16 36 7 19 -18 11 -15 8 13 18 35 19 -5 -11 -24 -18 18 -61 -10 38 17 17 -37 53 -5
5601 -5 6 31 20 0 -14 39 60 13 8 35 10 16 11 65 -18 13 46 16 -21 -9 -15 24 -39 31 21 4 -26 -16 24 44 -53 -49 -56 7
5635 7 -2 -12 -93 -75 17 -55 -5 -15 3 -67 3 -32 21 -27 5 -27 41 12 -6 -9 19 4 13 53 3 -20 -33 36 -11 -16 -11 0 -2 -10
5669 -10 11 11 -35 6 -30 5 -14 -16 -39 26 4 -36 53 7 -21 27 19 11 19 51 22 -25 9 -10 -22 -3 43 -14 33 14 12 -29 -2
5702 -2 39 -20 49 -31 -42 -12 13 -48 -9 -13 -7 38 -29 38 -39 -41 -56 -8 18 -16 12 -48 12 8 23 -39 -32 63 56 28 -6 32 -40 -2
5736 -2 34 30 27 12 -38 29 9 32 -16 36 7 6 -8 16 -10 -17 -9 -32 -11 -39 24 -8 -76 11 15 -57 -14 33 62 41 -18 4 -21 29
5770 29 17 13 18 66 9 20 25 38 -26 59 7 5 -29 8 24 -1 24 19 -20 11 1 1 -8 -44 11 19 3 -45 6 -16 -8 -26 3 -45 -11
5805 -11 -9 31 27 -41 50 -12 -13 0 13 15 -9 31 2 19 2 -36 11 -26 80 46 -5 8 24 -16 4 20 7 3 -6 44 -29 20 -25
5838 -25 12 -2 11 26 -2 -56 0 -4 -10 42 13 -62 0 -24 -14 0 4 -24 -8 -23 6 -1 5 -14 -54 10 6 49 -30 47 8 36 42 11
5872 11 32 67 -24 3 -2 -53 -4 15 -53 9 21 -28 -7 16 8 16 -66 34 37 -26 -37 -5 -18 -21 -5 32 27 -22 -12 16 -8 6 36
5905 36 48 -23 37 10 3 62 5 16 -28 57 -20 -15 -3 18 1 -37 -39 -15 -7 46 -2 -14 -16 20 30 -3 -3 13 -3 1 -13 18 -11 17
5939 17 47 23 45 65 45 5 0 -4 -2 42 10 8 14 20 -34 7 35 20 8 23 3 27 21 -3 23 -31 -49 6 -29 -3 -35 4 19 66
5973 66 32 -4 18 -11 -3 -9 -28 -6 -12 -1 46 6 16 -1 -42 36 76 -26 -1 -22 -9 10 45 1 -34 -12 10 -24 -5 -34 -65
6004 -65 12 -33 42 -5 -50 13 -5 -23 8 -69 0 13 -37 -1 13 -62 45 9 -63 -4 52 29 24 -36 19 54 -15 38 27 15
6034 15 9 54 -7 48 -40 49 37 -20 29 46 -7 -57 13 42 -13 11 48 41 1 9 -43 6 18 6 -19 -11 -42 19 -10 52 32 3
6066 3 -17 14 12 -4 19 7 33 -16 26 37 20 -14 28 -14 18 37 7 0 6 51 5 -26 -7 -50 10 8 9 28 11 52 -1 31 10
6099 10 35 46 -7 5 34 58 19 20 17 -17 -13 -29 18 10 -4 -15 12 -5 29 12 -25 46 -11 1 12 14 27 -63 -29 -49 -17 -7 -15
6132 -15 4 -38 3 -2 26 -6 17 -60 14 4 25 21 27 -36 27 -24 23 36 24 47 16 42 60 -9 72 -38 43 8 -13 19 20 -15
6164 -15 83 60 -31 -16 20 1 13 54 31 -42 -4 -18 -21 -41 19 9 -1 -5 -37 -27 23 9 25 24 11 -5 5 21 -25 -21 -9 0 31
6197 31 -31 24 6 5 40 33 48 23 32 0 -36 36 -24 -5 -70 6 -36 8 -11 -4 -35 10 9 27 27 7 -10 10 20 4 26 17 18 23 18
6232 18 19 11 26 10 5 43 7 63 23 7 36 9 23 -14 1 34 -25 -25 -11 29 14 -26 -21 27 -32 -43 16 8 -7 24 -74 27 39
6265 39 -1 -8 -6 -25 -9 43 51 39 -20 23 2 38 20 2 -3 23 -2 -22 43 -20 2 35 -1 -7 -31 6 9 -55 10 -24 14 38 53
6298 53 -48 -5 -35 24 56 93 73 0 -44 -7 33 -24 16 22 16 14 88 -26 -34 -11 30 49 -10 -1 40 25 8 3 30 -36 -3 1 13
6331 13 17 13 11 22 14 -17 -6 -4 16 8 -64 -3 -39 31 45 -18 7 21 16 37 27 13 -9 15 -22 20 20 18 19 30 7 -15 32 36 34 25 16
6368 16 11 19 24 -18 24 -42 13 -17 -34 18 -74 58 -42 -9 4 13 16 -11 -30 35 -10 -36 39 -18 -25 -35 2 12 -1 73 58 -29
6400 -29 -38 44 -3 42 48 26 10 -28 -20 18 7 -40 67 4 41 -10 -28 49 -1 -34 -21 -11 -24 -18 20 3 15 27 27 -25 8 -9
6432 -9 -38 -5 -6 48 57 24 -9 21 -10 -6 44 12 15 -1 -1 7 32 6 17 -3 3 -49 -16 27 -11 23 3 41 -17 -5 -32 -2 -23 -23 59
6467 59 9 2 32 -10 16 10 -32 33 -17 -17 4 28 16 23 -34 11 -21 -27 -8 -6 -13 -15 29 -27 -38 46 -39 22 -26 12 -5 -11 -24 -8 -2
6502 -2 -28 -6 15 -17 -44 -13 -5 -2 -35 4 30 -15 -17 19 -9 -64 0 28 34 18 -2 3 -8 46 1 7 -4 57 34 21 9 -20 -10 -17
6536 -17 6 -45 11 15 2 8 23 23 -29 -57 -18 18 -76 47 -47 -24 -1 20 4 42 -5 50 45 30 38 32 0 -21 13 52 10 39 -22
6569 -22 32 -31 -16 35 -77 -27 -35 -16 -19 3 35 -15 5 -35 -11 1 -32 2 38 6 -31 -1 -16 -30 -40 13 -19 6 -16 -1 65
6600 65 30 -15 41 29 18 -13 -9 21 19 -21 3 -4 26 13 -34 -32 17 -1 -4 -10 -8 57 23 17 66 -28 -40 11 11 15 14 16 -46 -14 -32 0
6636 0 44 6 -47 -5 56 1 62 -5 8 16 8 -1 81 14 20 -21 -19 44 -2 28 65 22 -22 -15 -26 4 33 20 -51 -40 -68 2 -76 29
6670 29 9 -49 -10 -15 -33 36 5 -39 37 -9 7 34 19 -3 -6 12 65 45 -28 11 26 -7 -3 -13 -50 14 -14 -25 -34 16 10 -21 57
6703 57 -27 -14 -31 -1 -92 -16 -8 31 -22 42 -41 -3 26 7 3 -45 86 2 -5 -47 9 51 3 29 2 1 -22 5 17 13 -14 88
6735 88 -9 25 0 13 -14 50 2 1 -14 1 -55 14 -40 -25 -18 -7 -15 -21 43 54 -32 22 -30 -9 4 -48 -5 26 9 34 -1 -6 -4
6768 -4 14 -1 81 16 33 27 20 69 1 -20 55 6 -3 59 -12 -36 15 -17 24 29 31 14 -58 10 3 38 -24 24 7 -41 13 15 -13 -13 27
6803 27 22 9 5 -41 20 -32 51 75 21 70 -85 2 7 20 8 41 19 14 25 -7 -23 -13 12 -36 -2 13 -9 3 11 21 -52 -7
6835 -7 -17 -12 -1 -7 18 -22 1 -15 -30 -60 -32 -30 24 19 13 25 41 23 -6 14 4 -43 32 -20 5 36 -57 -14 42 -1 4 -50 19 -44
6869 -44 -42 -35 20 -17 -8 0 -29 -21 -37 17 10 -10 18 51 22 19 5 37 -30 25 15 26 14 31 38 -34 21 9 16 -38 -44 5 -5 40 -12
6904 -12 37 -37 -4 30 -44 14 -39 8 2 -13 -4 -32 15 -2 -18 -30 44 31 -22 -12 -8 19 -9 -21 28 -21 -17 32 -13 -23 -18 51 -21
6937 -21 25 24 3 14 65 -22 -27 -10 -12 -57 -42 -30 14 -2 -78 -40 5 -9 -30 -54 42 13 -11 37 4 -50 24 -33 -6 16 4 5
6969 5 -70 -9 56 32 46 1 -7 20 -5 -31 15 -1 -22 -11 15 -34 -39 37 -17 -43 -8 -34 50 67 35 -50 -7 -12 -17 -44 -44 -52 -10 1
7003 1 -15 -25 10 -55 14 12 51 28 10 -46 -8 -13 0 -2 -9 39 34 66 -14 30 -30 -7 3 39 8 62 -5 14 40 -12 -29 -28 47 -36
7037 -36 -21 -29 -23 -16 -16 -10 -15 15 -47 39 35 44 -34 -46 -40 14 -16 -40 24 -10 56 10 6 51 61 -17 2 3 1 59 -8 39 31 35 76 11 30
7074 30 -20 -56 28 48 13 -36 -21 -3 -2 -31 19 -27 -38 11 -45 18 -79 -21 -27 32 -9 17 -5 2 -2 -5 -30 22 9 -3 -11 -12 -11 34
7108 34 46 -57 -11 -14 22 9 38 0 24 -53 -41 -49 -9 5 -17 0 -27 -8 30 -46 -6 4 66 27 7 0 -5 36 34 13 46 53 -29
7141 -29 44 -40 -6 48 -41 -30 -42 -40 4 -32 27 -38 10 -39 -4 31 54 9 -29 41 4 4 -18 -30 -3 -29 34 17 4 34 21
7172 21 35 -42 -13 -2 18 11 37 17 39 -18 52 -49 57 36 1 -25 13 20 -24 6 -4 45 -52 -17 28 -5 -13 -23 -33 -27 -44
7203 -44 -23 1 25 -21 57 4 3 24 -12 1 16 -15 7 13 -54 -23 -41 -7 -10 -40 5 11 66 -6 -25 -2 -27 30 15 29 35 16 29
7236 29 -85 17 4 -57 -39 -24 -46 -4 5 22 -38 -6 -12 -36 -31 -9 34 -27 -27 8 4 -5 34 17 -35 -22 46 37 -21 4 16 -12 30
7269 30 18 -13 15 4 -2 1 16 -27 -57 39 15 26 -9 -24 -15 -3 -13 -35 -23 37 -29 -9 -44 -30 -15 -55 -1 -21 5 -42 31 26
7301 26 27 23 33 24 2 -5 3 47 10 11 30 -5 -36 43 -52 21 -54 12 -20 -16 -26 -51 7 -40 25 67 -31 41 -29 -15 -23 12 20 -59 22
7336 22 -18 5 -16 -72 -28 47 37 23 27 -18 -22 55 -1 -9 -7 118 31 4 -43 14 40 17 34 -29 30 24 -15 -29 3 32 -37 30
7368 30 10 5 -12 -29 -20 -16 -28 -25 36 -3 52 3 -54 -23 14 -50 40 46 27 47 -15 14 7 71 -1 9 -9 -14 40 -1 0 -10 -11 3 -4
7403 -4 28 56 21 8 23 25 -18 10 54 63 -26 -17 6 1 15 -7 -10 15 19 23 -9 -30 -1 12 14 30 43 5 -22 24 18 30 -8 24 -3
7438 -3 -31 26 -10 46 -20 -17 7 34 10 -8 7 -3 9 -38 -27 -13 -9 -4 -33 -70 39 0 -5 -2 -32 -10 -14 25 25 55 4 15 -3 -11
7472 -11 -19 22 37 20 -15 33 -26 9 -10 53 21 50 -49 -12 -20 8 -32 -4 -48 23 -20 -4 -26 3 5 -3 -37 -22 -3 -16 9 1 27
7505 27 -34 27 -78 24 6 14 30 38 -52 26 28 13 -19 35 -23 85 9 40 -3 44 -1 46 -42 12 -25 -28 -16 -1 -14 -12 13
7536 13 -16 48 24 36 29 19 -44 -38 -12 15 -22 -52 -27 11 16 -25 4 14 -29 -43 2 6 -14 22 -44 -9 -8 76 12 13 5 14 -31 14
7570 14 -36 2 -26 3 1 -19 -43 -19 -45 -24 -33 36 23 -44 26 -7 19 12 21 20 -4 17 32 10 10 -11 43 42 8 11 -20 -14 -13 29 -16
7605 -16 22 17 -10 10 -28 -36 -9 -22 -1 -4 -36 2 24 -80 -1 -27 -50 11 -13 4 24 -11 20 8 -13 86 13 22 5 39 -11 -14
7637 -14 2 2 28 -45 -59 91 -7 -16 -15 2 -16 4 6 -8 -50 -21 0 3 20 -27 -27 21 -15 21 -7 5 10 -19 10 -25 6 -6 -4 32
7671 32 1 15 -22 -8 1 -49 18 1 37 4 3 9 -20 -14 23 11 36 28 -12 30 -38 -7 -4 0 -9 -9 -6 -48 10 53 -2 -31 4 2 3 -22
7707 -22 9 -20 23 41 -11 -22 8 12 10 10 39 7 -19 -11 33 31 44 51 11 14 34 -32 -9 -28 -26 -30 -21 -24 17 26 -51 2 6 -8 -13 24 11
7744 11 -6 -26 15 -1 -21 -16 -33 39 -6 13 30 17 22 -12 28 23 16 14 -34 -17 -9 59 26 31 3 -7 2 19 34 1 12 13 45 13 -13
7779 -13 -8 -27 -29 -36 -8 -18 -67 -22 33 -25 -9 -4 28 65 -7 -10 47 -31 10 -26 -9 -2 38 -13 33 49 39 -18 39 2 43 -31 35
7812 35 16 14 1 -13 11 0 -1 -23 5 14 -37 -14 -20 -28 14 -46 -35 15 -18 -34 -3 9 -33 0 52 -15 53 4 5 14 -53 6 20 27
7846 27 -10 -7 2 48 16 8 12 -6 2 23 23 -6 -11 -24 -13 -10 31 37 -20 -20 -1 65 -2 36 -45 17 -12 -38 14 31 -24 -14 -14 31 -17 12
7882 12 34 22 -14 -7 -17 43 2 -37 21 36 -7 -9 40 -33 8 -21 7 -7 -21 -27 -5 -34 -16 -12 18 4 -12 48 -6 -4 15 4 25
7915 25 -32 -27 14 -5 -31 -24 27 -17 -34 6 -10 27 43 6 4 -12 -26 -1 41 22 -38 -38 -25 31 52 11 11 -36 -31 -21 -20 48 20 -32
7949 -32 -32 13 8 6 13 -12 -2 12 73 16 -45 11 36 14 19 78 83 -17 13 72 73 23 -13 43 28 30 19 19 -22 -28 4 -12 11 4 -24
7984 -24 34 14 10 20 20 -28 -13 -45 12 51 12 -33 -38 25 -34 -32 3 -24 -1 36 21 27 15 36 -8 -23 38 -22 37 40 1 -20 29
8017 29 17 -33 -25 26 -30 16 -18 26 30 30 -3 7 0 -9 -16 -44 -38 25 -5 -3 -55 7 -20 -19 5 28 -1 -19 4 9 -19 27 7 52 -10
8052 -10 3 21 -1 -1 45 -48 -22 42 3 -61 -31 -10 -15 -35 -10 22 -69 -39 -18 -7 -47 3 -22 34 59 -18 -4 -21 -21 -34 -15 4
8084 4 -28 -53 7 66 15 -13 51 10 -9 -11 62 58 54 11 24 -26 48 9 -13 53 9 -52 51 -11 -16 30 15 -24 -28 30 -9 8 21
8117 21 14 28 -5 -7 4 -7 -24 2 -28 56 -13 27 6 14 15 -15 -9 53 47 42 44 -31 40 -33 17 15 -24 5 -51 -52 59 -28 -11 -22 15
8152 15 -49 -27 51 -3 -18 2 42 -31 -14 9 -41 -13 10 -4 20 36 28 55 -6 15 -25 8 55 27 3 6 -2 -5 -28 -38 -6 -34
8184 -34 46 -3 21 -26 15 28 -11
8191a1
##END NTUPLES=NMR FID
##END=
