##TITLE=1H_LY-DMAA.Per.2.12
 CDCl3
 8 sc, 
 17.02.2022
##JCAMPDX= 6.0         $$ Bruker NMR JCAMP-DX V2.0
##DATA TYPE= NMR FID
##DATA CLASS= NTUPLES
##ORIGIN= UXNMR, Bruker Analytische Messtechnik GmbH
##OWNER= root
$$ XWIN-NMR		Version 3.5
$$ Thu Feb 17 12:05:02 2022 Russian Standard Time (UT+4h)  she@DPX200
##.OBSERVE FREQUENCY= 200.131346
##.OBSERVE NUCLEUS= ^1H
##.DELAY= (6, 6)
##.ACQUISITION MODE= SIMULTANEOUS
##.ACQUISITION SCHEME= undefined
##.AVERAGES= 8
##.DIGITISER RES= 18
##SPECTROMETER/DATA SYSTEM= spect
##.PULSE SEQUENCE= zg30
##.SOLVENT NAME= D2O
##.SHIFT REFERENCE= (INTERNAL, D2O, 0, 15.7039)
##AUDIT TRAIL= $$ (NUMBER, WHEN, WHO, WHERE, WHAT)
$$ ##TITLE= Audit trail, XWIN-NMR		Version 3.5
$$ ##JCAMPDX= 5.01
$$ ##ORIGIN= Bruker BioSpin GmbH
$$ ##OWNER= she
$$ F:/spectra/data/she/nmr/H-F/1/audita.txt
$$ ##AUDIT TRAIL=  $$ (NUMBER, WHEN, WHO, WHERE, WHAT)
(   1,<2022-02-17 12:03:39.07 +0400>,<she>,<DPX200>,
      <created by zg, POWCHK disabled, PULCHK disabled
       configuration hash MD5:
       00 E9 B6 7A A2 85 ED C7 34 08 36 98 17 FE 4E 26
       data hash MD5: 16K
       90 FC 65 E8 91 5B 2D AB 7C 96 8D 0E 32 5C C9 2A>)
$$ ##END=
$$ 
$$ hash MD5
$$ DA FE E3 EB 13 2A 7F 8F 57 69 44 5C 42 49 CB F2
##$RELAX= 
##$RELAX= 
##$RELAX= 
##$RELAX= 
##$RELAX= 
##$RELAX= 
$$ Bruker specific parameters
$$ --------------------------
##$DU= <F:/spectra>
##$EXPNO= 1
##$NAME= <H-F>
##$PROCNO= 1
##$TYPE= <nmr>
##$USER= <she>
##$AMP= (0..31)
100 100 100 100 100 100 100 100 100 100 100 100 100 100 100 100 100 100 
100 100 100 100 100 100 100 100 100 100 100 100 100 100 
##$AQSEQ= 0
##$AQ_mod= 1
##$AUNM= <au_zg>
##$AUTOPOS= <>
##$BF1= 200.13
##$BF2= 200.13
##$BF3= 200.13
##$BF4= 200.13
##$BF5= 200.13
##$BF6= 200.13
##$BF7= 200.13
##$BF8= 200.13
##$BYTORDA= 1
##$CFDGTYP= 0
##$CFRGTYP= 5
##$CHEMSTR= <none>
##$CNST= (0..31)
1 1 145 1 1 1 1 1 1 1 1 1 1 1 1 1 1 1 1 1 1 1 1 1 1 1 1 1 1 1 1 1 
##$CPDPRG= <>
##$CPDPRG1= <>
##$CPDPRG2= <>
##$CPDPRG3= <>
##$CPDPRG4= <mlev>
##$CPDPRG5= <mlev>
##$CPDPRG6= <mlev>
##$CPDPRG7= <mlev>
##$CPDPRG8= <mlev>
##$CPDPRGB= <>
##$CPDPRGT= <>
##$D= (0..31)
0 1.2 0 0 0 0 0 0 0 0.06 0 0.03 0 0 0 0 0.0002 0 0 0 0 0 0 0 0 0 0 0 0 
0 0 0 
##$DATE= 1645085018
##$DBL= (0..7)
120 120 120 120 120 120 120 120 
##$DBP= (0..7)
150 150 150 150 150 150 150 150 
##$DBP07= 0
##$DBPNAM0= <>
##$DBPNAM1= <>
##$DBPNAM2= <>
##$DBPNAM3= <>
##$DBPNAM4= <>
##$DBPNAM5= <>
##$DBPNAM6= <>
##$DBPNAM7= <>
##$DBPOAL= (0..7)
0.5 0.5 0.5 0.5 0.5 0.5 0.5 0.5 
##$DBPOFFS= (0..7)
0 0 0 0 0 0 0 0 
##$DE= 6
##$DECBNUC= <off>
##$DECIM= 32
##$DECNUC= <off>
##$DECSTAT= 4
##$DIGMOD= 1
##$DIGTYP= 9
##$DL= (0..7)
0 120 120 120 120 120 120 120 
##$DP= (0..7)
150 150 150 150 150 150 150 150 
##$DP07= 0
##$DPNAME0= <>
##$DPNAME1= <>
##$DPNAME2= <>
##$DPNAME3= <>
##$DPNAME4= <>
##$DPNAME5= <>
##$DPNAME6= <>
##$DPNAME7= <>
##$DPOAL= (0..7)
0.5 0.5 0.5 0.5 0.5 0.5 0.5 0.5 
##$DPOFFS= (0..7)
0 0 0 0 0 0 0 0 
##$DQDMODE= 0
##$DR= 18
##$DS= 0
##$DSLIST= <SSSSSSSSSSSSSSS>
$$ [...]
##$SUBNAM2= <"">
##$SUBNAM3= <"">
##$SUBNAM4= <"">
##$SUBNAM5= <"">
##$SUBNAM6= <"">
##$SUBNAM7= <"">
##$SUBNAM8= <"">
##$SUBNAM9= <"">
##$SW= 18.0517287032376
##$SWIBOX= (0..15)
0 0 2 0 0 0 0 0 0 0 0 0 0 0 0 0 
##$SW_h= 3612.71676300578
##$TD= 16384
##$TD0= 1
##$TE= 0
##$TE2= 300
##$TE3= 300
##$TEG= 300
##$TL= (0..7)
0 120 120 120 120 120 120 120 
##$TP= (0..7)
150 150 150 150 150 150 150 150 
##$TP07= 0
##$TPNAME0= <>
##$TPNAME1= <>
##$TPNAME2= <>
##$TPNAME3= <>
##$TPNAME4= <>
##$TPNAME5= <>
##$TPNAME6= <>
##$TPNAME7= <>
##$TPOAL= (0..7)
0.5 0.5 0.5 0.5 0.5 0.5 0.5 0.5 
##$TPOFFS= (0..7)
0 0 0 0 0 0 0 0 
##$TUNHIN= 0
##$TUNHOUT= 0
##$TUNXOUT= 0
##$USERA1= <user>
##$USERA2= <user>
##$USERA3= <user>
##$USERA4= <user>
##$USERA5= <user>
##$V9= 5
##$VALIST= <valist>
##$VCLIST= <CCCCCCCCCCCCCCC>
##$VD= 0
##$VDLIST= <DDDDDDDDDDDDDDD>
##$VPLIST= <PPPPPPPPPPPPPPP>
##$VTLIST= <TTTTTTTTTTTTTTT>
##$WBST= 1024
##$WBSW= 4
##$XGAIN= (0..3)
0 0 0 0 
##$XL= 0
##$YL= 0
##$YMAX_a= 631103
##$YMIN_a= -555729
##$ZGOPTNS= <>
##$ZL1= 120
##$ZL2= 120
##$ZL3= 120
##$ZL4= 120
##$ABSF1= 10
##$ABSF2= 0
##$ABSG= 5
##$ABSL= 3
##$ALPHA= 0
##$AQORDER= 0
##$ASSFAC= 0
##$ASSFACI= 0
##$ASSFACX= 0
##$ASSWID= 0
##$AUNMP= <proc_1d>
##$AZFE= 0.1
##$AZFW= 0.1
##$BCFW= 1
##$BC_mod= 2
##$BYTORDP= 1
##$COROFFS= 0
##$CY= 11.3945322036743
##$DATMOD= 1
##$DC= 2
##$DFILT= <>
##$DTYPP= 0
##$F1P= 2.36226072786647
##$F2P= -0.459571619588291
##$FCOR= 0.5
##$FTSIZE= 0
##$FT_mod= 4
##$GAMMA= 1
##$GB= 0.15
##$INTBC= 1
##$INTSCL= 1
##$ISEN= 128
##$LB= 0.24
##$LEV0= 0
##$LPBIN= 0
##$MAXI= 10000
##$MC2= 0
##$MEAN= 0
##$ME_mod= 0
##$MI= 1.114404
##$NCOEF= 0
##$NC_proc= 0
##$NLEV= 6
##$NOISF1= 3.799351
##$NOISF2= 2.8
##$NSP= 1
##$NTH_PI= 0
##$NZP= 0
##$OFFSET= 15.70392
##$PC= 1
##$PHC0= -16393.13
##$PHC1= 16.00078
##$PH_mod= 1
##$PKNL= yes
##$PPARMOD= 0
##$PSCAL= 0
##$PSIGN= 0
##$REVERSE= no
##$SF= 200.130013532006
##$SI= 16384
##$SIGF1= 3
##$SIGF2= 2
##$SINO= 400
##$SIOLD= 16384
##$SREGLST= <1H.CDCl3>
##$SSB= 0
##$STSI= 0
##$STSR= 0
##$SW_p= 3612.71676300578
##$SYMM= 0
##$S_DEV= 0
##$TDeff= 0
##$TDoff= 0
##$TI= <>
##$TILT= no
##$TM1= 0
##$TM2= 0
##$TOPLEV= 0
##$USERP1= <user>
##$USERP2= <user>
##$USERP3= <user>
##$USERP4= <user>
##$USERP5= <user>
##$WDW= 1
##$XDIM= 8192
##$YMAX_p= 0
##$YMIN_p= 0
$$ End of Bruker specific parameters
$$ ---------------------------------
##NTUPLES= NMR FID
##VAR_NAME=  TIME,          FID/REAL,        FID/IMAG
##SYMBOL=    X,             R,               I
##VAR_TYPE=  INDEPENDENT,   DEPENDENT,       DEPENDENT
##VAR_FORM=  AFFN,          ASDF,            ASDF
##VAR_DIM=   8192,          8192,            8192
##UNITS=     SECONDS,       ARBITRARY UNITS, ARBITRARY UNITS
##FACTOR=    0.0002768,     1,               1
##FIRST=     0,             0,               0
##LAST=      2.2672688,     0,               0
##MIN=       0,             -555729,         0
##MAX=       2.2672688,     631103,          0
$$ Real data points
##PAGE= N=1
##DATA TABLE= (X++(R..R)), XYDATA
$$ [...]
$$ plain form
1623 5473 5731 -7688 -7554 8945 8525 -9179 -8286 8446 6915 -7120 -4713 5157 1672 -3138 1556
1638 1556 948 -4769 834 7354 -2310 -9144 3198 9770 -3674 -9152 3754 7470 -3425 -4576
1652 -4576 3133 1185 -2644 2590 2384 -5914 -2094 8830 2022 -10626 -1938 11075 1982 -10312
1666 -10312 -1797 8077 1316 -5095 -691 1218 -448 2817 1626 -6528 -3104 9599 4506 -11541
1680 -11541 -5636 12303 6544 -11355 -6612 9328 6191 -6041 -4893 2163 3104 2138 -693 -6157
1694 -6157 -2021 9510 4719 -11926 -7189 12789 8911 -12427 -9885 10410 9713 -7428 -8613 3579
1708 3579 6424 782 -3412 -4797 -22 8352 3789 -10687 -7136 12059 9909 -11848 -11625 10386
1722 10386 12113 -7831 -11344 4452 9273 -763 -6209 -2944 2319 6073 1742 -8623 -5787 9989
$$ packed form
1623E473K58j3419J34J6499m20j7704Q93J6732j531j4035K407R870l485m810M694
1638A556o08n717N603O520r664o834J2342O572j3444n478J2906L716j0895j151
1652d576P709j948l829N234k06q298L820J0924o808j2648Q688J3013r093j2294
1666a0312Q515R874o761o411M404J909j666L265j191q154L424J2703n093j6047
1680a1541N905J7939n759j7899M743J5940l137j2232J148P056R41r66k831n464
1694f157M136J1531m791j6645M737J9978l878k1338K542K0295o97j7141j185J2192
1708C579K845n642m194j385M775Q374m563j4476L551J9195k150k1757K23K2011
1722A0386J727j9944l513J5796M821j0036n446L265N263L754m331j0365K836J5776
$$ plain form
1736 9989 9143 -10367 -11618 9525 12769 -7753 -12628 5278 11067 -2168 -8201 -761 4601 3610
1750 3610 -361 -5802 -3695 7336 7516 -7864 -10344 7564 12025 -6482 -12370 4700 11168 -2692
1764 -2692 -8928 579 5514 1280 -1756 -2889 -2234 3895 5781 -4312 -8615 4333 10446 -3727
1778 -3727 -10876 2918 10288 -1864 -8347 981 5644 -185 -2464 -461 -1007 642 4107 -763 -6684
1793 -6684 608 8229 -395 -8987 126 8450 -110 -7069 144 4885 -406 -2242 997 -657 -1554
1808 -1554 3233 2286 -5290 -2827 6703 3200 -7084 -3102 6592 2675 -5336 -1817 3419 440 -1252
1823 -1252 1098 -1090 -2892 3053 4450 -4550 -5762 5205 6546 -5365 -6619 4711 6024 -3370
1837 -3370 -4596 1806 2599 145 -32 -1851 -2550 3249 5114 -4122 -7215 4451 8741 -4177 -9392
$$ packed form
1736I989q46j9510j251K1143L244k0522m875J7906N789j3235o033P440N362r91
1750C610l971n441K107J1031J80j5380k480J7908M461j8507n888J7070O468j3860
1764b692o236R507M935m234l036j133O55O129J886j0093m303J2948O113j4173
1778c727p149J3794P370j2152o483R328M663n829k279K003n46J649L465m870n921
1793f684P292P621q624q592R113Q324q560o959P213M741n291j836L239j654q97
1808a554M787r47p576K463R530l503j0284L982R694l917q011L519N236k979j692
1823a252K350k188j802N945J397r000j212J0967J341j1911j254J1330J313r394
1837c370j226O402P93k454j77j819o99N799J865r236l093J1666M290j2918n215
$$ plain form
1852 -9392 3249 8808 -2018 -7496 355 5142 1167 -2247 -2688 -1192 3648 4428 -4219 -7427 4090
1867 4090 9652 -3387 -10747 2364 10908 -807 -9562 -599 7381 2060 -4266 -3167 700 3955
1881 3955 3078 -4078 -6494 3562 9212 -2751 -11013 1395 11468 -6 -10885 -1466 9028
1894 9028 2733 -6253 -3534 2912 3968 819 -3833 -4413 3266 7446 -2112 -9669 869 10862 664
1909 664 -10843 -1998 9654 3026 -7372 -3727 4387 3756 -1133 -3359 -2383 2422 5336 -1272 -7776
1924 -7776 -186 9136 1542 -9509 -2649 8901 3363 -7222 -3585 4934 3350 -2188 -2573 -563
1938 -563 1459 3298 -76 -5321 -1287 6688 2501 -7312 -3472 7011 3776 -6097 -3711 4460 3106
1953 3106 -2590 -2069 521 568 1439 901 -3050 -2380 4185 3671 -4650 -4289 4677 4609 -4105 -4034 3191 3108
$$ packed form
1852i392J2641N559j0826n478P851M787l975l414m41J496M840P80q647l208J1517
1867D090N562j3039p360J3111Q544j1715q755Q963P980n321o326J099L867L255
1881C955q77p156k416J0056N650j1963q262J2408J0073j1474j0879R419J0494
1894I028o295q986K719O446J056l149m652n80P679M180r558p557J0538R993j0198
1909F64j1507Q845J1652o628j0398L645Q114o31m889k226R76M805K914o608o504
1924g776P590R322p594j1051O860J1550n538j0585L637Q519j584n538l85K010
1938e63K022J839l374n245M034P975m187r813L840J0483l235r873K386Q171j354
1953C106n696N21K590M7Q71n38l951O70O565n14q321L61Q966o8q714P1P225q3
$$ plain form
1971 3108 -1965 -1601 635 -141 457 1977 -1462 -3693 2014 4830 -2333 -5454 2050 5346 -1769 -4656
1987 -4656 1145 3335 -498 -1506 -78 -644 561 2799 -635 -4428 624 5843 -195 -6395 -160
2002 -160 6330 702 -5526 -1025 3933 1330 -1986 -1418 -316 1154 2564 -635 -4740 -144 6118
2017 6118 905 -7026 -1886 6987 2530 -6195 -2988 4714 3121 -2604 -2798 300 2233 2281 -1066 -4408
2033 -4408 -119 6110 1523 -7091 -2824 7312 3802 -6679 -4425 5151 4529 -3264 -4194 878 3271
2048 3271 1485 -1961 -3730 257 5397 1398 -6588 -2945 6963 4345 -6537 -5092 5458 5410 -3739
2063 -3739 -5127 1767 4178 373 -2817 -2453 986 4190 936 -5383 -2744 5837 4278 -5771 -5383
2078 -5383 4952 5758 -3665 -5546 2022 4643 -216 -3208 -1435 1409 2933 637 -3867 -2486 4431
$$ packed form
1971C108n073L64K236p76N98J520l439k231N707K816p163l121P504L296p115k887
1987d656N801K190l833j008J428n66J205K238l434l793N052N219o038o200O235
2002a60O490n628o228M501M958k603l316N68J102J470J410l199m105M596O262
2017F118n213p931N140Q873m457q725L207P702j593n725j94L098J933M8l347l342
2033d408M289O229m587q614M267J0136l510j0481K254R576o22p793r30N072K393
2048C271j786l446j769L987N140l999p986L643R908k618j0882J445J0550m8r149
2063c739j388O894K411l805l190L64L439L204l254o319K639Q581j559j0049L88
2078e383J0335Q06r423j881P568K621m859k992J773K844J524k296m504J381O917
$$ plain form
2093 4431 4148 -4419 -5087 3878 5668 -2990 -5422 1897 4597 -637 -3245 -609 1477 1611 339 -2359
2109 -2359 -2179 2738 3613 -2802 -4763 2415 5163 -1839 -5068 1163 4368 -368 -3091 -207 1593
2124 1593 779 205 -1047 -1889 1105 3342 -927 -4320 598 4690 -238 -4571 -221 3771 460 -2611
2140 -2611 -625 1074 499 452 -283 -2011 -182 3255 718 -3985 -1154 4306 1559 -3937 -1707 3208
2156 3208 1706 -2014 -1296 623 807 847 9 -2126 -925 3222 1817 -3836 -2562 3885 3047 -3634
2172 -3634 -3244 2745 3065 -1641 -2537 260 1635 1085 -407 -2251 -939 3130 2257 -3466 -3374 3602 4184
2189 4184 -3122 -4481 2229 4326 -1135 -3693 -94 2491 1343 -989 -2358 -648 3028 2272 -3401
2204 -3401 -3710 3202 4769 -2786 -5210 1906 5197 -876 -4509 -218 3418 1382 -1789 -2224 140
$$ packed form
2093D431k83q567o68Q965J790q658k432P319K700n234k608K636K086J34j272k698
2109b359J80M917Q75o415j961P178K748p002l229O231L205m736k723K884J800
2124A593q14n74j252q42K994K237m269l393M918M092m928m333M350L992l311l071
2140b611J986J699n75m7p35j728J829L437k537m703K831N460k747n496K230M915
2156C208j502l720P18J919J84M0q38k135J201M147j405n653J274O447q38o681
2172c634L90N989L20m706q96K797J375n50j492j844J312M069q73n723R2O976N82
2189D184p306j359O710K097n461k558L599K585j148k332j369J710L676p56n673
2204c401l09O912J567p555k424P116L291o073l633M291L636k036l171m35K364
$$ plain form
2219 140 2877 1820 -3047 -3385 2879 4640 -2369 -5325 1519 5484 -615 -5093 -443 4044 1361
2234 1361 -2669 -2074 779 2444 1033 -2516 -2772 2205 4135 -1655 -4978 894 5408 -63 -4970
2249 -4970 -700 4178 1454 -2912 -1840 1272 2003 442 -1919 -2085 1504 3440 -955 -4343 248
2264 248 4708 415 -4608 -1045 3888 1453 -2882 -1611 1509 1636 22 -1274 -1381 802 2664 -159
2280 -159 -3425 -483 3866 1194 -3772 -1548 3279 1793 -2435 -1777 1324 1448 -151 -871 -1040 109
2296 109 1943 715 -2632 -1426 2882 1917 -2763 -2275 2390 2342 -1619 -2007 783 1413 109 -568 -964
2313 -964 -406 1628 1379 -1982 -2170 2094 2712 -1884 -2998 1391 2881 -852 -2435 166 1585 418
2329 418 -582 -1111 -542 1489 1708 -1586 -2640 1487 3256 -1084 -3508 634 3479 96 -2842 -638
$$ packed form
2219A40K737j057m867l38O264J761p009k956O844L965o099m478M650M487k683
2234A361m030N95K853J665j411l549k56M977J930n790l323N872M514n471m907
2249d970M270M878k724m366J072L112P31j561k361j66L589J936m395l388M591
2264B48M460m293n023L563M933k435m335J271L120J27j614j296j07K183J862k823
2280a59l266K942M349k672m966K224M827j486m228O58L101J24j599p20j69J149
2296A09J834j228l347J206M308r65m680M88M665m8l961l88K790O30j304o77l96
2313i64N58K034k49l361j88M264O18m596j114M389J490l733j583K601J419j167
2329D18j000n29N69K031K19l294j054M127J769m340k424M142K845l383k938K204
$$ plain form
2345 -638 1981 1127 -760 -1402 -505 1488 1795 -1293 -2888 936 3579 -462 -3970 -196 3856 783
2361 783 -3285 -1371 2301 1683 -1163 -1835 -252 1722 1652 -1323 -2772 788 3601 -96 -4040 -596
2377 -596 4020 1286 -3507 -1756 2659 2069 -1477 -2144 122 1879 1209 -1434 -2390 676 3261 96
2393 96 -3751 -895 3826 1682 -3459 -2130 2669 2405 -1594 -2331 441 1984 837 -1286 -1862 574
2409 574 2759 287 -3189 -1133 3307 1865 -3099 -2404 2469 2522 -1616 -2449 543 1991 386 -1329
2425 -1329 -1340 507 2076 402 -2548 -1241 2637 1957 -2442 -2374 2031 2536 -1371 -2373 578 1916
2441 1916 217 -1237 -1005 303 1566 546 -1843 -1434 1899 2067 -1709 -2438 1282 2534 -797 -2335
2457 -2335 105 1785 361 -1024 -842 161 1159 856 -1193 -1592 1134 2225 -802 -2567 486 2566
$$ packed form
2345f38K619q54j887o42Q97J993L07l088j595L824K643m041l508L774M052l073
2361G83m068J914L672o18k846o72J583J974p0k975j449L560K813l697l944L444
2377e96M616k734m793J751M415n90l546o67K266J757o70k643r56L066K585l165
2393I6l847K856M721k144n141J329M799k64l999p37K772J543j147k123n76K436
2409E74K185k472l476K056M440j442m964O95M873N3m138q33K992J448j605j715
2425a329j1J847J569j674k950J307L878o80m399O8M405N05l907j002K951J338
2441A916j699j454K32J308J263j020k389M09L333J68l776p29L720J252l331j538
2457b335K440J680j424j385J82J003R98l03k049l99K726J091l027j765L053K080
$$ plain form
2473 2566 -43 -2252 -371 1663 692 -883 -927 -51 919 887 -850 -1682 575 2232 -160 -2594 -268
2490 -268 2531 649 -2213 -922 1566 1186 -717 -1110 -135 943 1082 -514 -1785 181 2333 375
2506 375 -2568 -936 2451 1321 -2038 -1651 1395 1582 -643 -1502 -340 1121 1152 -599 -1826 -175
2522 -175 2257 778 -2434 -1400 2336 1893 -1909 -2083 1324 2114 -538 -1823 -239 1403 1076 -725
2538 -725 -1691 -76 2086 909 -2253 -1599 2069 2081 -1815 -2415 1148 2377 -451 -2122 -317 1537
2554 1537 1040 -821 -1604 -56 1872 918 -1982 -1640 1879 2269 -1416 -2535 906 2565 -254 -2267
2570 -2267 -428 1666 957 -992 -1389 74 1597 743 -1576 -1534 1337 2136 -1045 -2424 516 2501
2586 2501 -13 -2245 -433 1681 916 -943 -1206 197 1313 638 -1222 -1359 1010 1943 -674 -2269
$$ packed form
2473B566k609k209J881K034r71j575m4Q76R70l2j737q32K257J657k392k434K326
2490b68K799j882k862J291K488l80j903l93R75J078J39j596j271J966K152j958
2506C75k943J632L387j130l359L87L046J87k225q59J162J461L1j751j227J651
2522a75K432j479l212J034L736m43l802j74L407P90k652j285J584J642l27j801
2538g25r66J615K162j177l162O54L668J2l896o00L563J229k828j671J805J854
2554A537m97j861p83J548J928r54k900L42L519L90l685j119L441J659k819k013
2570b267J839K094p09j949l97J463J523q54k319M2K871P99l181j379K940J985
2586B501k514k232J812K114p65j859k63J403J116o75j860j37K369R33k617j595
$$ plain form
2602 -2269 213 2336 197 -2067 -629 1532 912 -975 -1114 119 1065 630 -867 -1348 550 1746
2618 1746 -142 -2054 -281 2009 680 -1745 -921 1385 1099 -668 -1036 27 926 657 -607 -1234
2634 -1234 204 1618 222 -1770 -701 1672 979 -1511 -1322 1050 1229 -531 -1150 -110 921 670
2650 670 -461 -1166 -38 1436 548 -1592 -1025 1492 1392 -1216 -1539 763 1551 -234 -1310 -337 855
2667 855 785 -377 -1211 -229 1417 805 -1444 -1362 1216 1653 -833 -1837 420 1736 49 -1451 -573
2684 -573 998 907 -332 -1148 -252 1346 935 -1189 -1470 1001 1804 -617 -1981 193 1897 264 -1581
2701 -1581 -714 1102 997 -510 -1253 -220 1277 836 -1089 -1434 804 1868 -425 -2084 -48 1959
2717 1959 533 -1618 -827 1172 1154 -470 -1183 -185 1175 821 -941 -1399 592 1768 -195 -1949 -251
$$ packed form
2602b269K482K123k139k264J438K161o20j887j39J233R46m35j497m81J898J196
2618A746j888j912J773K290j329k425Q24K306k86j767l68J063Q99k69j264o27
2634a234J438J414j396j992J069K373o93k490J89K372J79j760o19J040J031k51
2650F70j131p05J128J474q88k140N67K517j00k608l23K302P88j785j076R73J192
2667H55p0j162q34R82J646o12k249Q2K578M37k486j004K257J316j687j500Q78
2684e73J571r1j239q16Q96J598m11k124k81K471Q03k421j364K174J704j633j845
2701a581Q67J816j05j507p43J033J497m41j925l45K238J064k293j659K036K007
2717A959j426k151P91J999j8j624p13R98J360l54j762m58J991J176j963j754J698
$$ plain form
2734 -251 1864 661 -1591 -994 1104 1123 -569 -1180 -51 1054 699 -788 -1183 491 1525 -21 -1686
2751 -1686 -388 1676 834 -1393 -1054 1018 1213 -468 -1172 -59 1011 599 -691 -1089 201 1371
2767 1371 189 -1502 -599 1416 927 -1170 -1192 809 1263 -321 -1213 -166 918 692 -518 -938 84
2784 84 1203 386 -1222 -808 1138 1116 -843 -1250 512 1234 -166 -1159 -254 809 623 -425 -908 -62
2802 -62 1013 550 -1038 -877 827 1225 -596 -1388 273 1357 99 -1117 -404 780 745 -324 -894
2819 -894 -145 963 655 -825 -1041 642 1273 -286 -1444 -24 1340 364 -1104 -751 729 852 -260
2836 -260 -927 -251 884 817 -715 -1091 400 1383 -61 -1442 -182 1349 619 -1106 -772 676 967
2853 967 -203 -963 -295 800 731 -662 -1087 245 1282 37 -1417 -441 1268 793 -1060 -920 629
$$ packed form
2734b51K115j203k252N97K098J9j692o11J129J105l55j487l95J674J034j546j665
2751a686J298K064q42k227L39K072J95j681p04J113J070m12j290l98J290J170
2767A371j182j691R03K015m89k097k2K001M54j584q92J047J084k26j210m20J022
2784H4J119q17j608M14J946k2j959m07J762P22j400r93R05J063j86j048m83Q46
2802f2J075m63j588J61J704L98j821p92J661J084j258j216P13J184l5j069n70
2819h94P49J108l08j480k16J683O31j559j158J420J364r76j468L53J480J23j112
2836b60o67O76J135o7j532l76J491R83j444j381J260J531p30j725L34J448K91
2853I67j170p60O68J095o9j393m25J332J037j245j454R76J709m75j853J40J549
$$ plain form
2870 629 1066 -189 -994 -290 874 767 -541 -1078 203 1271 237 -1334 -597 1199 847 -945 -1101
2887 -1101 585 1144 -143 -1052 -344 792 709 -498 -988 52 1168 313 -1207 -667 1077 937 -771
2904 -771 -1059 464 1148 -53 -966 -350 772 669 -425 -923 42 1005 326 -1005 -736 901 953 -579
2922 -579 -1116 258 1129 -5 -955 -440 722 660 -347 -851 -66 930 456 -863 -768 670 1026 -383
2940 -383 -1137 79 1179 334 -880 -455 558 667 -278 -811 -127 729 529 -612 -851 454 965 -250
2958 -250 -1074 -109 1046 331 -802 -540 541 723 -133 -749 -218 697 563 -493 -818 315 979 -28
2976 -28 -1033 -277 892 515 -793 -692 449 817 -105 -775 -305 647 553 -452 -835 145 988 156 -1012
2995 -1012 -411 915 618 -646 -825 347 778 18 -762 -303 644 627 -321 -815 63 953 264 -929 -496
$$ packed form
2870F29M37j255q05P04J164j07j308n37J281J068j034j571P37J796l52j792j56
2887a101J686N59j287r09P08J136q3j207m90J040J116q55j520N40J744j40j708
2904g71k88J523O84j201r13O16J122j03j094m98R65R63o79j331K69J637N2j532
2922e79n37J374Q71j134r50N15J162o2j007n04P85R96m74j319R5J438L56j409
2940c83p54J216J100q45j214M25J013J09r45n33O84Q56k00j141k39J305N11j215
2958b50q24R65J155p15j133K62J081J82q56o16N31R15j34j056l25J133O64j007
2976b8j005P56J169l77j308J01J141L68r22o70M70R52r4j005l83R80Q43q32j168
2995a012O01J326k97j264j79J172M31p60p80M59R47j7r48m94Q78Q90o89j193M33
$$ plain form
3014 -496 762 700 -563 -885 281 870 70 -784 -406 558 650 -341 -812 -3 869 335 -822 -579 698
3033 698 806 -466 -863 169 888 145 -730 -418 546 669 -260 -763 -97 782 382 -742 -667 598 855
3052 855 -389 -919 64 918 204 -711 -395 528 644 -227 -726 -89 675 386 -668 -628 456 835 -320
3071 -320 -915 -47 839 294 -680 -524 462 633 -156 -684 -164 629 459 -529 -670 327 814 -96 -873 -102
3091 -102 817 395 -652 -521 367 647 -67 -649 -195 580 495 -440 -620 225 805 43 -811 -281 750 401
3111 401 -559 -608 273 592 -24 -626 -318 484 478 -311 -649 134 747 189 -761 -315 649 526 -455 -604 235
3132 235 701 112 -649 -299 463 509 -259 -638 42 752 261 -702 -459 484 584 -438 -689 138 716 143
3152 143 -542 -339 414 573 -219 -648 -1 711 294 -635 -511 419 599 -273 -706 59 708 140 -548 -346
$$ packed form
3014d96J258o2j263l22J166N89q00q54L78R64R2r91m71Q09Q72n34j157K43J277
3033F98J08j272l97J032P19p43q75L12R64J23r29n03O66Q79m00j124P5J265K57
3052H55j244n30R83Q54p14r15L16R23J16q71m99O37P64k89j054M0J084L79j155
3071c20n95Q68Q86n45r74J56R86J71p89n28N20P93j70r88j41R97M87r10p77P71
3091a02R19m22j047J31Q88K80p14n82M54P75q5r35j80Q45N80p62q54N30J031l49
3111D01r60m9Q81L19o16o02L08Q02op89l38P83O13n58r50M46R64j23r81j49Q39
3132B35M66n89p61L50P62M6p68l79O80P10m91r63K43R43J00j022k51Q27N78n73
3152A43o85K03P53J59p92m29O47P12m17r29J24R30J80q72m33P65O49n68o88K02
$$ plain form
3172 -346 404 551 -134 -626 -145 651 285 -559 -553 417 661 -214 -743 24 683 262 -471 -427 346 550 -41
3193 -41 -632 -168 604 365 -481 -577 326 677 -99 -730 -137 636 283 -527 -456 229 541 -1 -609 -207 566
3214 566 393 -453 -564 294 673 -28 -658 -160 583 397 -461 -417 233 513 21 -487 -179 477 408 -310 -542
3235 -542 171 615 30 -641 -242 550 350 -409 -499 151 532 -19 -538 -261 399 423 -263 -532 51 645 124
3256 124 -560 -314 495 427 -273 -565 100 516 84 -488 -256 351 471 -184 -520 -43 567 211 -545 -415
3276 -415 357 480 -277 -553 76 513 147 -398 -344 301 486 -120 -508 -97 545 295 -433 -428 375 531 -195
3297 -195 -606 -62 464 185 -439 -354 286 456 -54 -541 -133 544 295 -465 -441 260 601 -127 -589 -46 568
3318 568 300 -398 -455 257 484 -35 -475 -141 493 294 -393 -457 252 578 -109 -600 -77 468 238 -353 -393
$$ packed form
3172c46P50J47o85m92M81P96l66q44OR70K44q75n29P67O59m21p33M4P73K04n91
3193d1n91M64P72k39q46r6R03L51p76o31N93P73l53q10P1O85L12n42o08M02P73
3214E66j73q46j11Q58L79p01o30M98P43j86q58M4O50K80m92n08L08O56o9p18k32
3235e42P13M44n85o71L99P92k00p59r0O50L81n51n19K77O60K4o86k69N83N94n21
3256A24o84K46Q09o8p00k92O65M16m32n72K32O07J20o55l36M77O10l56p56J30
3276d15P72J23p57k76O29M37l66n45N4O45J85o06l88M11O42k50p28NQ03J56p26
3297a95m11N44N26k79o24Q5O40J70n10m87M08O77k49p60K4P01L41p28m62N43O14
3318E68k68o98n7P12K27n19m40L34O34j99o87o4P09L26o87m91N23N45k30n91m0
$$ plain form
3339 -393 203 471 33 -471 -180 422 356 -333 -437 161 573 -21 -491 -182 514 330 -360 -387 116 522 14
3360 14 -490 -219 321 373 -281 -486 99 520 59 -483 -167 415 325 -292 -397 136 442 48 -411 -223 310
3381 310 361 -236 -416 65 505 143 -451 -280 393 351 -224 -370 89 411 90 -361 -268 279 354 -169 -458
3402 -458 4 418 155 -363 -329 306 438 -187 -454 -8 425 162 -327 -247 235 411 -131 -438 -88 472 194
3423 194 -374 -369 213 355 -121 -425 -46 353 139 -304 -304 153 375 -19 -408 -150 419 315 -279 -389 213
3444 213 418 -16 -373 -111 390 158 -289 -337 120 334 31 -418 -229 363 325 -280 -375 153 440 -1 -426
3465 -426 -180 392 233 -252 -358 86 420 101 -350 -185 356 377 -225 -417 94 399 47 -476 -154 347
3485 347 275 -251 -365 125 327 51 -329 -218 289 384 -188 -418 33 444 131 -398 -245 349 376 -170 -335
$$ packed form
3339c93N96K68m38n04K91O02o6o89j04N98M12n94m70L09O96j84o90k7N03M06n08
3360A4n04K71N40N2o54k05N85M21m61n42L16N82r0o17j05N33L06l94m59J88N33
3381C10N1n97j80M81M40l62n94J71O73m2n75j46M59L22l21m51R3N47P5n23k89
3402d58M62M14k63n18L4O35J32o25k67M46M33k63m89Q0M82J76n42l07L50N60k78
3423A94n68NN82J42m76l04L79L99k14m43%M57K22l94l89K58N69j04n94j10O02
3444B13K05m34l57K62N01k32m47m8M57K14l03m49J89N92l8o05r5N28K87m41m25
3465d26K46N72j59m85j06M44L34l19m51J65N41K1o02j92N11L05l52n23L22N01
3485C47p2n26j14M90K02k76l80J11N07R5n72k30M51M11l13n29J53N94K7n46j65
$$ plain form
3506 -335 64 417 121 -387 -236 214 348 -116 -384 10 448 114 -436 -208 250 277 -149 -339 12 362
3526 362 163 -268 -243 173 313 -113 -376 6 430 138 -350 -270 261 336 -164 -347 16 346 119 -292 -255
3547 -255 179 336 -68 -335 -104 320 139 -307 -294 210 342 -90 -301 -19 320 164 -272 -245 120 342 28
3568 28 -315 -127 339 244 -309 -301 144 417 -43 -324 -78 330 194 -207 -260 65 301 30 -321 -190 272 242
3590 242 -175 -279 161 380 -1 -312 -147 342 220 -177 -228 50 342 57 -312 -199 267 280 -127 -276 20
3611 20 356 82 -342 -200 225 235 -176 -315 62 343 122 -254 -240 187 228 -81 -340 -4 379 42 -281
3632 -281 -179 258 295 -112 -254 25 327 122 -245 -191 182 342 -96 -334 -17 346 153 -355 -265 251 275
3653 275 -81 -300 36 285 125 -227 -222 203 307 -31 -334 -66 348 188 -252 -271 181 259 -109 -309 -33
$$ packed form
3506c35L99L53k96n08J51M50J34m64k68L94M38l34n50K28M58K7m26j90L51L50
3526C62j99m31K5M16J40m26k63L82M24k92m88Q0N31P5n00j83L63L30k27m11L7
3547b55M34J57m04k67K31M24j81m46J3N04J32m32k11K82L39j56m36K7L65K22l14
3568B8l43J88M66r5n53QM45K73m60k81K46M08j36m01n3L25K36k71l51J31M62l0
3590B42m17j04M40K19l81l11J65M89j22l97n1K78K92k85l69J13M66J3m07j49K96
3611B0L36k74m24J42M25J0m11j39L77K81k21l76J4M27M1l09k59L36L83l37l23
3632b81J02M37L7m07j42K79L02k05l67N4L73J60m38k38L17L63j93n08R0N16K4
3653B75l56k19L36K49j60l52NM25J04l38l03K68M14j60m40j9M52P8l68k00K76
$$ plain form
3674 -33 279 78 -261 -221 108 274 -77 -382 -50 262 165 -218 -284 170 291 -98 -311 -55 271 145 -234
3695 -234 -259 165 301 15 -281 -91 280 220 -292 -312 95 279 -28 -285 -75 206 107 -171 -217 71 215 -42
3717 -42 -293 -152 216 263 -178 -302 61 319 -39 -279 -54 212 203 -103 -252 84 241 37 -235 -167 182 165
3739 165 -110 -275 52 262 72 -272 -132 188 190 -123 -216 -4 245 133 -207 -132 209 254 -71 -281 5 246
3761 246 49 -255 -147 176 232 -54 -238 14 248 154 -200 -194 105 235 -58 -238 -2 272 128 -223 -201 129
3783 129 258 -72 -219 -64 217 95 -182 -169 127 235 16 -278 -37 247 87 -234 -190 124 257 -41 -243
3804 -243 -50 214 88 -174 -216 60 252 -37 -264 -120 220 168 -171 -218 154 246 -20 -256 -78 247 175 -173
3826 -173 -220 77 209 18 -246 -138 237 218 -185 -224 89 262 -14 -249 -71 238 122 -120 -199 87 258
$$ packed form
3674c3L12k01l39M0L29J66l51l05L32L12r7l83o6M54J21l89k13K56L26j26l79
3695b34k5M24J36k86k96J90L71o0n12k0M07J84l07k57K10K81r9k78m6K88J44k57
3717d2k51J41L68M7m41j24L63K58l58k40K25K66rl06j49L36J57k04k72O8L49j7
3739A65k75j65L27K10j90l44J40L20Kl13r3K12K49j12l40P5L41M5l25k10K86K41
3761B46j97l04J08L23N6k86j84K52K34r4l54OK99J30k93j80K36K74j44l51K2L30
3783A29J29l30j47J55K81j22k77J3K96J08k19k94K41K84j60l21M4L14J33k98k02
3804b43J93K64j26k62m2K76J92k89k27J44L40n2l39m7L72R2k66k36J78L25p2l48
3826a73m7K97J32j91k64J08L75j9m03l9L13J73k76k35J78L09j16k42p9K86J71
$$ plain form
3847 258 11 -250 -115 206 207 -151 -214 34 267 22 -233 -72 166 124 -128 -190 52 247 69 -216 -105 201
3869 201 239 -108 -281 18 241 -14 -236 -114 209 190 -123 -251 20 236 46 -161 -206 155 173 -120 -222
3890 -222 -56 256 52 -191 -122 119 175 -61 -168 -40 236 60 -129 -175 67 188 -3 -214 -36 168 82
3911 82 -159 -123 138 176 -42 -202 -24 122 150 -133 -103 89 206 34 -251 -50 189 177 -149 -208 148 189 -15
3934 -15 -183 -51 165 124 -139 -192 57 194 55 -194 -133 168 161 -121 -154 109 216 -32 -198 -31 160 116 -99
3957 -99 -172 50 194 14 -230 -121 127 178 -131 -191 64 245 34 -182 -60 213 93 -98 -132 -19 175 78
3979 78 -153 -155 151 212 -113 -270 33 242 -28 -233 -111 156 127 -95 -130 28 169 47 -209 -154 110 220
4001 220 -84 -227 -16 278 26 -214 -106 146 206 -127 -201 -6 146 65 -157 -110 127 153 -72 -269 40 183
$$ packed form
3847B58k47k61J35L21Jl58o3K48K33k45k55J61K38m2k52o2K42J95j78k85J11L06
3869B01L8l47j73K99K23k55k22J22L23j9l13j28K71K16j90k07m5L61J8k93j02
3890b22J66L12k04k43O9K41N6k36j07J28K76j76j89m6K42J21j91k11J78K04q6
3911H2k41L6K61L8k18j60J78J46K8k83L0J92J17j72k85K01K39j2l26n9L56M1k04
3934a5j68J32K16m1k63n3K49J37j39k49O1L01pk82l3K63J07k48j66J67J91m4k15
3957i9p3K22J44j80k44J09K48N1l09o0K55J81k11k16J22K73j20j91l4J13J94r7
3979G8k31kL06O1l25j57L03K09k70k05J22K67k9k22l5J58J41j22k56N5K64J10
4001B20l04j43K11K94k52k40J08K52O0l33p4J95J52q1k22M7K37K6k25j97L09J43
$$ plain form
4023 183 50 -209 -99 135 209 -73 -211 -52 142 14 -152 -138 110 144 -12 -174 -34 169 39 -144 -144 124
4045 124 161 -96 -185 4 186 68 -119 -186 68 141 -22 -203 -70 142 96 -159 -181 90 113 -48 -181 -15
4067 -15 187 42 -83 -109 44 145 15 -203 -81 152 146 -135 -113 80 135 -2 -165 -116 136 75 -73 -136 36
4090 36 124 53 -178 -76 168 115 -149 -234 58 161 17 -186 -110 188 104 -69 -136 7 159 53 -138 -164 126
4113 126 168 -59 -193 -19 171 26 -165 -175 121 121 -78 -172 -20 195 101 -170 -95 119 137 -83 -177 -20 208
4136 208 98 -208 -107 180 123 -139 -163 -55 177 102 -128 -135 78 193 -29 -214 -34 165 57 -199 -153 99
4158 99 159 -44 -182 17 111 85 -124 -133 58 138 -19 -183 -58 199 57 -175 -108 118 148 -48 -146 -49 145 83
4182 83 -131 -108 -10 170 21 -164 -26 153 137 -142 -181 102 193 0 -150 -73 176 98 -139 -131 105 151 -4 -131
$$ packed form
4023A83j33k59J10K34P4k82j38J59J94j28j66J4K48L4j56j62J40K03j30j83%K68
4045A24L7k57q9J89J82j18j87o7K54P3j63j81J33K12m6k55k2K71K3j61j33J66
4067a5K02j45j25k6J53J01j30k18J22K33ok81K2J93N5j37j63M9K52o1j48o3J72
4090C6Q8p1k31J02K44n3k64q5K92J03j44k03P6K98q4j73o7J43J52j06j91k6K90
4113A26M2k27j34J74J90j45j91j0K96%j99r4J52K15r4k71P5K14J8k20r4J57K28
4136B08j10l06J01K87n7k62k4J08K32p5k30pK13J15k22j85J80J99j08k56M6K52
4158I9O0k03j38J99R4k6k09rJ91Q0j57j64J25K57j42k32O7K26L0j96r8R7J94o2
4182H3k14K3R8J80j49j85J38J79j6k79l9K83R1j93j50P7K49p8k37QK36M6j55j27
$$ plain form
4206 -131 -126 122 116 -106 -132 93 167 -51 -163 -49 75 86 -112 -107 48 189 20 -126 -85 110 59 -65 -150 58
4230 58 98 7 -162 -63 134 123 -31 -84 1 168 51 -145 -69 97 123 -51 -193 -32 166 31 -202 -98 108
4253 108 73 -77 -145 4 104 39 -147 -94 55 135 -37 -202 14 185 64 -102 -120 94 131 -42 -156 -54
4275 -54 90 58 -154 -115 69 164 -57 -138 -4 124 76 -137 -61 85 174 -85 -118 -48 147 74 -101 -76 77 146
4299 146 0 -173 -48 113 57 -172 -91 82 98 -30 -187 -46 86 84 -88 -114 10 138 6 -130 -56 145
4321 145 118 -138 -137 34 183 2 -125 -84 102 104 -125 -104 30 127 -17 -178 -90 90 101 -116 -208 -31 187 39
4345 39 -175 -76 141 67 -105 -95 53 140 9 -156 -68 141 111 -54 -145 36 184 16 -139 -69 97 87 -74
4368 -74 -141 67 133 28 -86 -101 105 81 25 -154 14 140 15 -99 -39 74 87 -75 -77 54 182 56 -54
$$ packed form
4206a31NK48ok22k6K25P4k18j12J14J24J1j98NJ55J41j69j46M1J95n1j24q5K08
4230E8M0r1j69R9J97j1j54n3Q5J67j17j96P6J66K6j74j42J61J98j35k33J04K06
4253A08l5j50o8J49J00o5j86N3J49Q0j72j65K16J71j21j66j8K14L7j73j14J02
4275e4J44l2k12L9J84R5k21q1J34J28m8k13P6J46Q9k59l3P0J95p3j75K5J53O9
4299A46j46j73J25J61n6k29Q1J73J6j28j57J41J32kj72k6J24J28j32j36P4K01
4321A45k7k56JJ71J49j81j27M1J86Kk29K1J34R7j44j61Q8J80J1k17r2J77K18j48
4345C9k14R9K17p4j72J0J48Q7j31j65Q8K09l0j65r1J81J48j68j55P0J66j0j61
4368g4o7K08O6j05j14j5K06k4n6j79J68J26j25j14O0J13J3j62kJ31J28j26j10
$$ plain form
4391 -54 -152 68 84 -39 -141 -24 173 71 -143 -80 128 98 -56 -122 11 125 112 -107 -133 41 98 -16 -170
4414 -170 -29 93 58 -186 -107 64 129 0 -194 -13 99 83 -78 -67 59 134 -14 -131 -4 153 51 -92
4436 -92 -106 52 93 -22 -119 -69 120 60 -86 -134 61 149 1 -152 -87 59 145 -61 -112 46 140 -8 -158 -46
4460 -46 155 87 -54 -122 24 119 17 -103 -57 102 115 -46 -160 40 161 -14 -158 -27 76 122 -117 -146 25
4483 25 122 34 -131 -92 145 113 -69 -124 3 93 4 -148 -36 94 82 -121 -98 -19 113 26 -115 -113 61 92 -8
4508 -8 -145 7 133 31 -73 -59 100 92 -46 -89 26 141 111 -79 -75 11 74 -43 -171 1 112 81 -81 -97
4532 -97 74 128 5 -108 13 129 28 -51 -80 93 90 -13 -141 1 111 25 -40 -92 -3 90 -20 -86 37 84
4556 84 68 -47 -97 -17 104 -8 -110 -53 131 76 -128 -170 73 79 22 -79 -5 84 41 -74 -128 -4 133 -15 -123
$$ packed form
4391e4r8K20J6j23j02J17J97j02k14O3K08l0j54o6J33J14j3k19k6J74N7j14j54
4414a70J41J22l5k44P9J71O5j29j94J81J12j6j61J1J26P5j48j17J27J57j02j43
4436i2j4J58M1j15r7N0J89o0j46m8J95Q8j48j53O5J46Q6k06n1J58R4j48j50J12
4460d6K01o8j41o8J46R5j02j20M6J59J3j61j14K00J21j75j44J31J03M6k39k9J71
4483B5R7q8j65L9K37l2j82n5J27R0q9j52J12J30j2k03K3P9J32q7j41KJ74L1j00
4508hj37J52J26j02j04J4J59qj38m3J15J15l0j90MQ6O3j17j28J72J11l1j62j6
4532i7J71N4j23j13J21J16j01p9k9J73lj03j28J42J10q6o5n2Q9R3j10o6J23M7
4556H4j6j15n0Q0J21j12j02N7J84n5k04m2K43On7j01P4Q9m3j15n4J24J37j48j08
$$ plain form
4581 -123 -72 83 144 -48 -142 26 149 -2 -122 -30 83 69 -41 -159 -26 90 19 -99 -61 86 105 -19 -104
4604 -104 23 60 -22 -66 -106 68 81 -67 -91 -47 74 85 -115 -100 68 56 -41 -155 -3 78 62 -100 -68 66 106
4629 106 -56 -139 11 104 25 -162 -78 65 166 51 -140 -34 139 -13 -100 -85 71 111 -13 -115 -40 78 54
4652 54 -96 -102 -30 128 -32 -140 -29 47 100 -101 -55 76 96 -19 -101 -14 107 95 -84 -103 3 110 45 -148
4676 -148 -38 174 74 -118 -79 60 92 1 -124 -8 93 82 -68 -81 62 113 -23 -117 -93 61 83 -37 -170
4699 -170 32 101 -41 -101 -32 26 66 -65 -84 -5 128 9 -58 -54 96 100 -47 -129 -13 101 13 -90 -71 85 63
4724 63 -45 -36 -12 125 19 -59 -85 81 105 -37 -109 -24 77 22 -86 -89 152 94 -75 -149 -15 120 99 -88 -150
4749 -150 45 134 -44 -152 0 85 2 -64 -67 65 97 7 -127 -17 69 88 -60 -67 4 118 -45 -101 -30 77 77 -100
$$ packed form
4581a23N1J55O1j92r4J68J23j51j20R2J13j4j10j18J33J16p1j18L8J47J9j24q5
4604a04J27L7q2m4m0J74J3j48k4M4J21J1k00J5J68j2r7j14J52Q1j6j62L2J34M0
4629A06j62q3J50R3p9j87Q4J43J01j15j91J06J73j52q7J5J56M0j24j02P5J18k4
4652E4j50oP2J58j60j08J11P6N3k01M6J31K0j15q2Q7J21j2j79j9J06J07o5j93
4676a48J10K12j00j92L9J39L2r1j25J16J01j1j50j3J43N1j36r4K4J54K2j20j33
4699a70K02O9j42o0O9N8M0j31j9P9J33j19o7MJ50Mj47q2J16J14q8j03J9J56k2
4724F3j08RK4J37j06p8k6J66K4j42p2Q5J01n5j08lK41n8j69p4J34J35k1j87o2
4749a50J95Q9j78j08J52Q5q3o6lJ32L2r0j34J10Q6J9j48pP1J14j63n6P1J07%j77
$$ plain form
4775 -100 -56 66 74 28 -123 -45 103 22 -79 -195 45 125 25 -127 -52 96 100 -60 -119 -12 87 -6 -129 -18
4799 -18 69 155 -38 -70 1 117 22 -122 -25 107 112 -58 -85 35 77 16 -147 -51 101 80 -140 -123 37 61 34 -145
4825 -145 -36 119 71 -70 -95 16 115 35 -115 -14 75 55 -69 -98 5 105 17 -109 -40 46 84 -71 -128 21
4849 21 112 16 -97 -33 68 97 -60 -74 -58 64 25 -38 -75 46 100 -64 -111 6 116 40 -80 -85 -1 33 -72 -70
4875 -70 1 53 49 -63 -99 5 136 -15 -118 10 79 56 -91 -60 1 67 67 -49 56 97 46 -71 -87 59 122 6
4901 6 -144 -71 95 36 -33 -61 0 67 -17 -33 -31 -1 49 -141 -183 -13 81 39 -85 -25 12 50 -61 -83 28 48 -43 -58
4929 -58 -18 74 66 -29 -62 -12 106 68 -95 -79 41 99 -81 -79 69 95 -43 -93 -52 121 78 -19 -83 2 92 45 -84
4956 -84 -96 20 45 -19 -151 14 95 20 -86 -58 36 102 -38 -143 -23 104 61 -66 -104 36 107 -13 -80 14 48
$$ packed form
4775a00M4J22Qm6j51P8J48q1j01j16K40Q0j00j52P5J48Mj60n9J07R9r3j23J11
4799a8Q7Q6j93l2P1J16r5j44R7J32Nj70k7J20M2o1j63R6J52k1k20J7J60K4k7j79
4825a45J09J55m8j41k5J11R9q0j50J01Q9k0j24k9J03J00q8j26O9Q6L8j55n7J49
4849B1R1r6j13O4J01K9j57j4J6J22l9o3l7J21N4j64m7J17J10p6j20nQ4L4j05K
4875g0P1N2mj12l6J04J31j51j03J28O9k3j47L1O1O6%j16J05M1n1j17j6J46O3j16
4901Fj50P3J66n9o9k8O1O7q4j6KL0N0j90m2J70R4m2j24O0L7L8j11k2J11K0r1j5
4929e8M0R2qr5l3N0J18l8j63J6J20N8j80KJ48K6j38n0M1J73m3r7o4Q5R0m7j29
4956h4j2J16K5o4j32J65Q1p5j06K8R4O6j40j05J20J27m3j27l8J40P1j20o7R4L4
$$ plain form
4981 48 20 -108 -52 64 44 -20 -74 30 62 52 -58 -54 63 78 -27 -136 -97 102 17 -70 -52 71 82 6 -115 21
5007 21 110 73 24 -106 41 96 8 -98 -9 87 -17 -74 -51 27 63 -45 -48 -36 25 9 -27 -17 40 131 -15 -99 -9 58
5035 58 28 -98 -89 26 10 -6 -87 -29 46 66 -23 -33 33 118 19 -102 -88 83 103 -91 -51 49 -12 8 -93 -38 16
5062 16 80 -40 -70 -7 62 76 -45 -52 80 53 -38 -51 6 87 -7 -111 -77 44 31 -12 -55 -5 46 7 -78 -147 4 64
5090 64 -1 -85 1 29 -17 -55 -72 -20 55 -26 -37 -37 98 12 -49 -47 8 55 11 -99 9 83 47 -60 -47 53 71 70 -29
5119 -29 -19 49 39 -56 -54 6 91 33 -58 -32 115 59 -72 -67 63 77 -10 -80 -38 38 59 -48 -140 -8 123 11 -34 -36
5147 -36 75 72 -60 -86 40 51 9 -31 -14 117 65 2 -88 15 101 -13 -127 -41 57 68 -10 -72 -1 50 -6 -106 1
5174 1 38 51 -64 -33 -15 85 3 -99 -82 90 33 23 -87 13 72 24 -64 1 65 9 -15 -58 -11 33 -11 -126 -58
$$ packed form
4981D8k8j28N6J16k0o4n4J04L2j0j10MJ17J5j05j09L9J99q5q7J8J23J1p6j21J36
5007B1Q9l7m9j30J47N5q8j06Q9R6j04n7K3P8L6j08lJ2O1j6l6J0N7R1j46q4R0O7
5035E8l0j26RJ15j6j6q1N8P5K0q9j0O6Q5r9j21J4J71K0j94M0J00o1K0j01N5N4
5062A6O4j20l0O3O9J4j21pJ32k7r1j3N7Q1r4j04L4J21j3m3m3N0N1l9q5o9J51O0
5090F4o5q4Q6K8m6l8j7N2P5q1j1%J35q6o1KN5M7m4j10J08P4l6j07J3J00J8jr9
5119b9J0O8j0r5KO0Q5n8r1K6J47n6j31NJ30J4q7p0M2P6K1j07r2J32J31j12m5k
5147c6J11lj32k6J26J1m2m0J7J31n2o3r0J03Q6j14j14Q6R8J1p8o2P1N1n6j00J07
5174AL7J3j15L1J8J00q2j02J7J72n7j0j10J00N9m8q8O5O4n6k4m3M7M4m4j15O8
$$ plain form
5201 -58 33 78 -2 -89 -12 93 13 -68 -22 -9 -43 -7 -34 -20 57 54 -32 -35 0 85 -10 -51 -8 106 17 -108 -42 22 26 27 -16
5232 -16 -66 61 58 -20 -90 16 73 -7 -85 -71 88 -7 0 -46 -12 -24 -35 -37 21 39 9 -33 -39 49 69 10 -89 3 65 -4 -57
5263 -57 -31 -2 68 52 -70 -74 23 106 -41 -40 -53 87 95 -65 -102 62 56 -22 -66 53 41 32 -29 16 57 60 40 -28 -15 81
5293 81 27 -83 -83 75 65 -52 -34 -3 58 6 -70 -60 6 22 -4 -115 -53 46 91 -56 -59 41 50 -72 -81 -17 19 2 -49
5322 -49 -41 30 51 -27 -40 -8 105 34 -49 -74 19 53 -62 -72 -18 83 21 -12 -15 58 21 0 -16 -11 84 12 -39 -121 -11 105
5352 105 -5 -118 -40 111 -32 -94 -78 68 50 30 -71 0 39 -5 20 -55 16 108 -10 -37 -55 24 28 -66 -51 32 28
5379 28 33 -33 23 9 60 45 -72 -60 50 74 43 -107 45 40 -56 -98 3 53 -34 -8 7 -39 19 -11 -60 -15 41 -19 -88
5408 -88 -42 -22 102 -42 -36 -2 51 -7 -21 -40 -28 30 26 -17 1 55 -22 19 -72 26 70 -31 -68 24 13 -17 -59 -10 10 93
$$ packed form
5201e8R1M5q0q7P7J05q0q1M6J3l4L6k7J4P7lq6lL5Q5r5m1M3J14q9j25O6O4MJm3
5232a6n0J27lp8p0J06N7q0p8J4J59r5Pm6L4j2j1kN8J8l0m2oQ8K0n9r9R2O2o9n3
5263e7K6K9P0j6j22mR7Q3j47Jj3J40Qj60l7J64op8m4J19j2ro1M5M1Lk0o8J3R6
5293H1n4j10%J58j0j17J8L1O1n2p6J0O6J6k6j11O2R9M5j47lJ00Rj22rO4L6j7n1
5322d9QP1K1p8j3L2J13p1q3k5R3L4j15j0N4J01o2l3lP3l7k1j6NR5p2n1q2J10J16
5352A05j10j13P8J51j43o2J6J46j8k0j01P1L9m4K5p5P1R2j18k7j8P9Mr4J5Q3m
5379B8No6N6j4N1j5j17J2J10K4l1j50J52nr6m2J01N0q7K6J5m6N8l0m9M5N6o0o9
5408h8M6K0J24j44OL4N3n8j4j9J2N8mm3J8N4p7M1r1R8M4j01l7R2j1l0m2M9K0Q3
$$ plain form
5438 93 33 -74 17 31 85 -14 -105 9 77 8 -93 6 42 41 -37 -103 57 97 -18 -76 -83 54 113 -23 -72 59 109
5465 109 51 -129 -9 111 -3 1 -58 41 34 -2 -61 -49 -2 57 -42 5 -13 97 -3 -97 9 68 66 -76 -17 116 -3
5492 -3 -31 -50 -28 50 55 5 -54 17 48 15 -69 4 47 16 -10 -39 13 -9 8 -12 -20 86 38 5 -15 -13 55 -13 -56 -26 61 11
5524 11 -37 -77 31 -4 15 -33 -15 -32 0 -19 -59 -31 63 33 -30 -59 -7 1 -71 4 -7 52 -20 -39 -15 5 31 32 -92 -38
5554 -38 -14 -28 -42 -45 17 -8 -59 10 31 8 -45 -68 -15 -66 28 24 0 -32 -36 46 -36 -59 13 -24 -30 -52 -7 -14 48 4 -102 0
5586 0 13 10 -68 -47 -7 36 -12 -102 -49 59 18 -34 -67 44 47 -70 15 19 25 32 -27 -30 -21 28 6 -85 -48 68 36 -61 -49 77
5618 77 24 -7 -33 -29 54 6 -42 -33 -16 -10 33 -46 -36 116 90 -126 -11 72 63 -5 -17 50 18 34 14 -26 7 24 13 -71 19
5649 19 93 -25 -53 -39 76 14 -26 -72 0 47 -9 -62 -61 6 3 -20 -69 -20 43 31 -90 -83 69 37 -75 -55 29 88 -9
$$ packed form
5438I3o0j07R1J4N4r9r1J14O8o9j01R9L6jp8o6J60M0j15n8pJ37N9j36m9J31N0
5465A09n8j80J20J20j14Mn9R9pl6n9J2M7N9r9M7j8J10j00r4J06N9kj42N9J33j19
5492ck8j9K2P8Nn0n9P1L1l3q4P3M3l1k6k9N2k2J7k0qJ06m8l3k0KO8o8m3L0Q7n0
5524A1m8m0J08l5J9m8J8j7L2j9m0K8R4l0o3k9N2Qp2P5j1N9p2j9K4K0K6Jj24N4
5554c8K4j4j4lO2k5n1O9K1k3n3k3N3n1R4mk4l2mQ2q2k3P2l7ok2M5pO2m4j06J02
5586@J3lp8K1M0M3m8r0N3J08m1n2l3J11Lj17Q5MOPn9lRM9k2r1L7J16l2r7J2J26
5618G7n3l1k6MQ3m8m8RJ7OM3p9J0J52k6k16J15Q3ro8j2O7l2J6k0m0L3J7j1q4R0
5649A9P4j18k8J4J15o2m0m6P2M7n6n3JO7lk3m9M9O3j2j21PJ52l2j12K0Q4N9r7
$$ plain form
5678 -9 -31 2 15 49 -31 -52 -35 36 56 -8 -109 32 48 -54 -49 -11 22 13 -25 -2 39 49 -45 -28 0 -19 78 -23 -28 -31 86
5709 86 3 -64 15 19 -49 16 0 16 31 19 -10 23 8 14 -49 -45 -27 3 12 -57 9 51 -7 -30 -18 -32 -2 25 -9 -43 15 28
5741 28 20 -34 -60 36 58 -80 -6 -8 -38 -24 -39 41 8 32 24 4 -25 28 76 -65 -27 29 36 -3 -88 72 57 -9 -35 23 24
5772 24 -20 -38 -15 9 -7 76 -7 -21 43 55 -72 -34 12 21 2 -34 16 52 11 -45 -1 36 -15 20 -51 -31 23 69 -31 -48
5802 -48 6 50 25 -99 42 57 18 -9 -44 31 14 23 -43 -85 8 82 -69 -94 -22 79 -10 -37 28 22 -12 -45 -33 -9 66
5831 66 -2 -16 -60 50 21 10 -51 -18 7 26 -11 20 75 -57 -51 22 32 11 -30 16 -51 2 -20 -27 -19 -39 23 -35 -37 -17 49
5862 49 -18 -57 7 -32 -65 -8 -63 12 0 10 4 -26 4 14 -23 -46 -7 22 22 -81 -61 68 -5 14 5 -2 -7 -10 45 21 -36 -1
5894 -1 35 -12 -16 -1 -38 19 -13 -59 -12 26 4 -42 -39 -17 70 -11 -21 -3 49 8 -47 -11 28 33 23 -62 0 14 -9 -26 -25 -8 15
$$ packed form
5678ik2L3J3L4q0k1J7P1K0o4j01J41J6j02NL8L3rl8K3M1J0r4J7K8j9R7j01nlJ17
5709H6q3o7P9Mo8O5j6J6J5j2k9L3j5Oo3MJ8L0Ro9O6M2n8k3J2j4L0K7l4l4N8J3
5741B8qn4k6R6K2j38P4kl0J4j5Q0l3K4qk0k9N3M8j41L8N6Pl9q5J60j5o6k6N8J
5772B4m4j8K3K4j6Q3q3j4O4J2j27L8M6Rj9l6N0L6m1n6M4L7n1L5p1K0N4M6j00j7
5802d8N4M4k5j24J41J5l9k7l5P5j7Ro6m2R3P4j51k5P2J01q9k7O5ol4l3J2K4P5
5831F6o8j4m4J10k9j1o1L3K5J9l7L1N5j32OP3J0k1m1M6o7N3k2pQk0O2n8kK0O6
5862D9o7l9O4l9l3N7n5P5j2J0ol0L0J0l7k3L9K9%j03K0J29p3J9rpnlN5k4n7L5
5894aL6m7mJ5l7N7l2m6M7L8k2m6LK2Q7q1j0J8N2m1n5L6L9Nj0q5O2J4k3j7JJ7K3
$$ plain form
5927 15 -3 24 7 25 61 -50 -8 0 3 -46 -23 59 47 10 -16 -37 -2 59 16 -54 -11 43 -30 -66 -35 63 29 -92 -6 26
5957 26 44 -45 -44 -27 9 43 -32 -14 36 107 -15 -73 -20 69 72 -41 -8 52 84 -36 -52 34 16 -24 -33 -44 26 40 -4 -45
5987 -45 -8 3 8 -68 -19 28 44 -70 -89 7 9 -11 32 -5 8 55 2 -30 51 42 -5 -81 -34 15 -27 -65 -36 58 -28 -28 -50 4
6019 4 -46 38 -20 -36 -16 -23 79 -10 8 45 29 -80 -76 10 16 -58 -35 32 -40 6 -10 7 -3 6 -37 -22 -6 -3 -7 26 -31 -22 7
6052 7 -5 -27 1 35 -21 27 18 -9 -31 18 -35 5 -32 -3 -23 -37 16 -33 -47 -53 -1 -31 -44 71 27 -70 -22 36 -10 -34 -11
6083 -11 9 40 -54 -15 -25 25 49 -53 -16 9 8 3 -20 -47 43 53 -54 -7 -4 19 -87 18 1 32 -42 -18 -34 -15 16 -14
6113 -14 -15 -50 29 7 -42 -69 24 40 -18 -17 21 55 14 -53 -17 5 17 -22 -60 18 58 40 -65 -17 18 48 -66 -73 -48 20 -20
6144 -20 -129 1 24 -19 13 -51 -16 12 59 -45 -29 51 31 2 -55 15 65 -6 -50 10 34 11 -17 0 -20 -45 -32 -9 -65
$$ packed form
5927A5j8K7j7J8L6j11M2QLm9K3Q2j2l7k6k1L5O1m3p0M3N4p3l6L1R8l4j21Q6L2
5957B6J8q9JJ7L6L4p5J8N0P1j22n8N3Q9Lj13L3O0L2j20j6Q6j8m0rj1P0J4m4m1
5987d5L7J1Np6M9M7J6j14j9R6Kk0M3l7J3M7n3l2Q1rm7p6M7M9m2l8K9R4q6%k2N4
6019Dn0Q4n8j6K0pJ02q9J8L7j6j09MQ6Op4K3O7p2M6j6J7j0Rm3J5J6LmL3n7RK9
6052Gj2k2K8L4n6M8rk7k2M9n3M0l7K9k0j4N3m9j4oN2l0j3J15m4r7M8N8m6k4K3
6083a1K0L1r4L9j0N0K4j02L7K5jnk3k7R0J0j07M7LK3j06J05j7L1p4K4j6J9L1l0
6113a4jl5P9k2m9k7R3J6n8JL8L4m1o7L6K2J2l9l8P8M0j8j05M8L5L0j14pK5O8m0
6144b0j09J30K3m3L2o4L5K8M7j04J6Q0k0k9n7P0N0p1m4O0K4k3k8J7k0k5J3K3n6
$$ plain form
6173 -65 30 45 -22 -38 72 45 -16 -59 13 28 9 -40 23 -1 -5 -6 -46 7 18 9 -39 -14 70 0 4 -61 9 -29 -27 -21 -33 -7 -11
6206 -11 -13 3 13 36 21 -13 5 -14 30 62 -39 -18 39 -44 5 4 4 -15 -1 8 -26 -26 9 31 32 -11 -3 -41 -8 -24 18 35 -17
6239 -17 11 49 38 75 27 9 -16 -52 27 3 -7 25 -20 -19 -34 -21 27 -25 -45 23 21 -6 31 -37 -31 14 63 10 -44 26 82 28
6271 28 -63 22 42 14 8 37 -23 74 33 -37 10 -39 33 -49 -51 -2 46 -14 -93 1 35 40 -31 -48 25 27 -28 -47 28 13 -14 -40
6303 -40 -46 52 25 2 -11 11 17 18 -87 -43 21 18 1 -40 -16 -41 11 8 -43 19 94 0 -46 25 34 65 -56 -19 32 51 43 -12 -50
6336 -50 43 -20 -7 5 -12 29 -5 -29 -46 26 17 -6 -29 -27 -1 -33 14 47 4 -55 -38 28 -37 -32 -45 -9 -21 14 -12 -6 -4 2 -38
6369 -38 4 20 27 15 -39 -18 12 48 17 48 -17 -18 -61 30 -31 -57 78 21 -7 -3 0 -25 -61 -24 1 7 -56 -1 24 -27 -24 16 1
6402 1 -24 -25 18 -1 13 -16 -1 -65 0 11 -16 -55 -12 -13 -52 -73 14 -25 -19 -20 49 -40 -71 -15 13 -12 -43 -3 -7 -4 57 29 -28 -76
$$ packed form
6173f5R5J5o7j6J10k7o1m3P2J5j9m9O3k4mjm0N3J1rm8K5Q4p0Mo5P0l8KOj2K6m
6206a1kJ6J0K3j5l4J8j9M4L2j01K1N7q3M9j%j9J4Rl4%L5K2Jm3Ql8L3j6M2J7n2
6239a7K8L8j1L7m8j8k5l6P9k4j0L2m5Jj5J3M8n2k0O8kk7L7o8OM5M9n3n4P0N6n4
6271B8r1Q5K0k8oK9o0R7m1p0M7m9P2q2kM9M8o0p9R4L4Np1j7P3Kn5j9P5j5k7k6
6303d0oR8k7k3j3K2OJj05M4O4lj7m1K4k5N2ln1O2P5r4m6P1RL1j21L7N1J9qn5l8
6336e0R3o3J3J2j7M1l4k4j7P2rk3k3KK6l2M7L3m3n9J7O6o5Nj3L6j2L5k6OKOm0
6369c8M2J6Pj2n4K1L0L6l1L1o5jm3R1o1k6J35n7k8MLk5l6L7K5Oo3N5K5n1LM0j5
6402Ak5jM3j9J4k9J5o4O5J1k7l9M3jl9k1Q7l9OjO9q9l1N6K8k5l1M0mLO1k8n7m8
$$ plain form
6436 -76 23 79 -112 0 -8 44 -35 -26 -1 8 -52 -22 49 57 -29 26 -9 -28 35 -2 -65 -24 48 -6 -26 -46 31 70 27 -42 -14
6467 -14 102 4 -12 -28 9 60 -3 23 5 -22 12 -7 -66 67 -16 -49 -7 -15 20 -25 -37 -19 -11 22 -16 -42 4 36 12 1
6497 1 -39 8 47 -37 -68 48 36 25 -34 -21 27 13 28 -36 16 71 15 -19 -16 46 -29 3 19 21 31 12 -9 -13 32 -5 -43 -24
6529 -24 -11 -30 -17 14 -71 -43 8 -36 -66 18 41 -1 -80 15 -1 14 22 -5 -26 -4 46 -14 20 24 -6 54 1 26 -56 -36 -33 38
6561 38 -46 0 -73 49 -15 -6 -16 -16 84 -30 -32 6 4 -1 18 -54 -20 13 -10 -46 24 29 9 -25 53 21 -50 -23 71 -1 -14 -3
6593 -3 -9 20 9 30 -1 -17 18 -5 -40 -57 11 13 -37 -2 -25 36 52 -74 -1 17 -35 -89 31 29 -43 -13 19 -42 18 20 -2 -55
6625 -55 23 130 -10 -83 -21 78 -9 -11 28 12 -12 -33 -15 46 -11 -3 -68 -35 -6 -1 -40 -78 35 45 39 -35 14 42 -22 -25 -9
6656 -9 -6 -11 1 -13 10 29 13 5 -1 -4 32 -4 -26 14 20 27 13 17 12 8 -54 -30 29 34 26 -38 -51 21 41 -19 -61 8 7 -11 -62 -39 -9
$$ packed form
6436g6R9N6j91J12qN2p9RK5Ro0L0P1Qq6N5l5j9O3l7o3M1P2n4k0k0P7L9m3o9K8
6467a4J16r8j6j6L7N1o3K6j8k7L4j9n9J33q3l3M2qL5m5j2J8QL3l8k6M6L2k4j1
6497Am0M7L9q4l1J16j2j1n9J3M8j4J5o4N2N5n6l4LO2p5L2J6KJ0j9k1mM5l7l8J9
6529b4J3j9J3L1q5K8N1m4l0Q4K3m2p9R5j6J5Qk7k1K2N0o0L4Ml0O0n3K5q2K0LP1
6561C8q4M6p3J22o4Rj0%J00j14kL8knJ9p2L4L3k3l6P0Nk0l4P8l2p1K7R4p2j3J1
6593coK9j1K1l1j6L5k3l5j7O8Kn0L5k3O1J6j26P3J8n2n4J20kp2L0L2o1O0Kk2n3
6625e5P8J07j40p3O2R9q7kL9j6k4k1J8O1n7Qo5L3K9Nl9l8J13J0op4M9K8o4lJ6
6656iLnJ2j4K3J9j6qolL6l6k2M0OPj4Mnmo2K4N9Nqo4j3P2K0o0m2O9jj8n1K3L0
$$ plain form
6693 -9 -6 -62 -15 -9 -47 4 42 42 -10 32 -30 1 15 28 -18 14 13 36 -11 -30 -13 10 -21 39 29 7 -16 -2 -47 -24 -18 5 24
6726 24 -18 3 17 -33 -89 -2 2 -25 -41 12 4 22 9 56 17 -15 18 74 -20 13 13 36 -11 7 48 -36 -35 27 -9 -59 -13 53
6758 53 30 26 -34 31 -28 5 -27 9 -8 8 -7 20 41 52 14 -61 -8 2 -16 -16 -18 21 1 27 -5 -42 -16 18 -4 1 -15 29
6790 29 18 -16 11 -2 15 -12 -52 57 4 -15 6 -3 12 47 -42 38 13 -13 15 -30 -19 4 18 -3 -18 -5 18 4 -32 21
6820 21 50 2 -52 -25 6 18 -46 -12 -47 37 -18 -5 -47 2 5 -46 -46 -20 32 1 -48 14 -51 2 20 -11 5 32 -5 21 -64
6851 -64 20 47 47 -48 -13 -15 -26 -3 -9 54 -47 16 49 -16 -63 13 -20 -48 -19 18 -40 -13 34 -10 -23 20 11 -1 -46 -89 28
6882 28 -51 -55 7 36 4 -8 -13 51 -11 -9 -24 -19 -36 14 -5 -12 -27 -24 11 -2 30 12 -11 20 17 25 -4 -51 -36 -7 1 38 -33 -3 61
6917 61 -1 0 -5 36 21 -14 1 6 22 -19 -25 38 4 -11 -41 18 -26 -3 54 -3 7 -6 57 15 14 20 73 -30 -7 14 2 -1 6 61
$$ packed form
6693iLn6M7Ol8N1L8%n2M2o2L1J4J3m6L2jK3m7j9J7K3l1O0j0k2k3J4m5K3OK3J9
6726B4m2K1J4n0n6Q7Mk7j6N3qJ8j3M7l9l2L3N6r4L3%K3m7J8M1q4JO2l6n0M6O6
6758E3k3mo0O5n9L3l2L6j7J6j5K7K1J1l8p5N3J0j8%kL9k0K6l2l7K6L4k2Nj6M4
6790B9j1l4K7j3J7k7m0J09n3j9K1rJ5L5q9Q0k5k6K8m5J1K3J4k1j5J3K3j4l6N3
6820B1K9m8n4K7L1J2o4L4l5Q4n5J3m2M9Ln1%K6N2l1m9O2o5N3J8l1J6K7l7K6q5
6851f4Q4K7%r5L5kj1K3oO3j01O3L3o5m7P6l3k8K9L7n8K7M7m4j3M3rj2m5m3J17
6882B8p9mO2K9l2j2nO4o2Kj5Nj7N0j9pj5LL5j3L2j8k3L1lQk9m7J5K9QL7p1L0O4
6917F1o2JnM1j5l5J5NJ6m1oO3l4j5l0N9m4K3N7n7J0j3O3m2jON3j03K3K1j2lPN5
$$ plain form
6951 61 9 8 -8 27 -27 -26 -23 -16 5 -14 -41 -18 0 10 14 -11 -27 -1 65 56 -23 45 1 12 -21 1 -53 -60 8 -22 5 -1 14 23 14
6986 14 2 3 8 -25 -39 52 -5 -79 -63 -2 42 49 5 -41 -1 49 -3 -94 39 43 6 -15 35 -33 -12 4 -30 13 -10 -30 -30 -27 33
7019 33 -28 0 -5 30 46 -56 -27 -14 36 2 -2 51 -15 -21 8 13 12 30 -8 -42 32 -46 23 -8 -5 20 55 -27 5 -17 32 -3 -16
7052 -16 40 3 -47 -70 13 -6 -6 13 -25 -39 18 -31 16 15 -39 45 -3 21 16 7 -95 -68 32 -44 3 -8 -36 -20 -37 -18 1
7083 1 -26 -8 8 -16 -17 19 37 -39 11 8 -2 -72 11 49 -3 -51 -17 47 6 -7 1 32 6 -17 -10 52 -4 45 40 -20 -6 -66 15
7116 15 -5 -6 1 21 -50 6 -3 -12 26 12 19 10 15 -11 -3 -15 42 10 -25 4 -4 19 -40 44 23 -22 -30 -5 -42 0 1 -17 -37 -6 -16 -2
7152 -2 -7 -32 3 -27 1 52 -4 60 -42 44 -17 -9 -47 1 -8 -1 33 7 -35 -82 39 -15 14 -6 21 -36 15 -15 27 37 -8 -50
7184 -50 20 -6 26 3 5 -1 -6 11 33 -29 26 27 -47 -8 72 -5 -62 6 -24 -48 -16 -39 -6 -23 29 -13 1 -3 -4 -24 -4 -13 -10 43
$$ packed form
6951F1n2jj6L5n4JLPK1j9k7K3J8J0Mk5j6K6O6rp9O8m4J1l3K2n4pO8l0K7oJ5Rr
6986A4j2JNl3j4R1n7p4J6O1M4Pm4m6M0N0n2r1J33Ml7k1N0o8K1J6l4M3k3k0%LO0
7019C3o1K8nL5J6j02K9J3N0l4mN3o6oK9NjJ8l8l4P4p8O9l1LK5L5q2L2k2M9l5j3
7052a6N6l7n0k3Q3j9%J9l8j4N7m9M7jn4Q4m8K4nrj02K7J00p6M7j1k8J6j7J9J9
7083Ak7J8J6k4jL6J8p6N0lj0p0Q3L8n2m8L4O4m1j3QL1k6k3PO2n6M9no0J4o0Q1
7116A5k0jPK0p1N6rrL8j4PrNk6Qj2N7l2l5K9qK3n9Q4k1m5qK5l7M2Jj8k0L1j0J4
7152bnk5L5l0K8N1n6O4j02Q6o1Ql8M8rPL4k6m2m7J21n4K9k0K7n7N1l0M2J0m5m2
7184e0P0k6L2k3KonJ7K2o2N5Jp4L9Q0p7n7O8l0k4L2k3L3j7N2m2J4mjk0K0rLN3
$$ plain form
7218 43 -13 18 -2 41 -32 30 -6 -15 -40 -27 -42 -7 42 6 -6 -5 16 -27 -65 17 0 -14 -18 23 23 -8 -1 -28 -9 -8 -17 29 -14 59
7252 59 17 6 0 -48 -12 4 11 23 -15 21 -14 -5 16 0 -9 16 -1 -6 52 6 -32 -37 13 -9 -7 -2 -43 17 -23 12 4 -41 -13 66 62
7287 62 -13 19 -1 -26 19 -5 14 27 -23 29 -2 43 12 42 -21 -44 -25 27 -2 -1 -23 20 -11 -5 -9 -23 4 -1 -48 -12 -9 83 -54
7320 -54 -13 -6 -20 -3 26 28 -21 -15 -18 -4 -31 -21 -34 0 -51 39 -7 19 -6 25 -13 -26 -44 22 75 -4 8 24 21 -16 -15 -23 14 26
7354 26 33 -13 10 17 -92 58 -10 18 -51 -13 1 -1 7 16 -9 22 67 -3 -77 0 21 9 19 -18 -16 11 14 -3 -47 -42 7 -26 -42
7387 -42 33 -52 -40 23 30 -17 12 -71 9 9 -5 51 -34 27 10 -46 42 -32 24 21 -61 5 41 -11 -62 10 -4 -1 -14 16 19 35 65
7420 65 -7 0 -11 -2 -8 4 3 -7 22 -2 14 -26 -42 -41 2 16 -26 11 -6 -4 -44 -20 -30 10 -64 -6 -43 -20 -23 29 22 -30 -14 44
7454 44 -9 -10 9 14 -2 41 -15 13 -20 18 -36 -25 3 12 13 -34 38 24 -40 -47 -15 3 -1 -70 33 -20 -31 -16 -20 -11 12 36 11 -10
$$ packed form
7218D3n6L1k0M3p3O2l6rk5J3j5L5M9l6j2JK1m3l8Q2j7j4mM1%l1Pk7J9JrM6m3P3
7252E9m2j1om8L6J6PJ2l8L6l5RK1j6rK5j7nN8m6l8nN0k2KNm1O0m0L5qm5K8P9m
7287F2p5L2k0k5M5k4J9J3n0N2l1M5l1L0o3k3J9N2k9Jk2M3l1Omj4K7nm7L6LR2j37
7320e4M1Pj4J7K9Km9OlJ4k7J0j3L4n1R0m6K6k5L1l8j3j8O6N3p9J2J6ll7JqL7J2
7354B6Pm6K3Pj09J50o8K8o9L8J4kQRk5L1M5p0p4P7K1j2J0l7KK7Lj7m4NM9l3j6
7387d2P5q5J2O3Pm7K9q3Q0%j4N6q5O1j7n6Q8p4N6lq2O6L6n2n1P2j4Lj3L0LJ6L0
7420F5p2Pj1RoJ2jj0K9k4J6m0j6JM3J4m2L7j7Km0K4j0M0p4N8l7K3lN2pn2J6N8
7454D4n3jJ9Nj6M3n6K8l3L8n4J1K8RJm7P2j4o4pL2J8mo9J03n3j1J5mRK3K4k5k1
$$ plain form
7488 -10 -19 -27 -26 -18 -13 24 -27 -30 -59 -22 -7 -17 -54 -23 -23 3 73 18 -40 -11 -59 -22 -26 -32 36 6 -19 -27 13 5 -11 -87 14 -7 4
7523 4 39 -31 -17 18 10 -37 21 -6 -23 -13 47 -46 -35 11 5 -14 2 7 27 -34 -20 -18 -26 35 4 -26 5 8 -30 -19 -33 28 -20 6
7557 6 16 -42 -23 -52 -10 4 -19 -57 -18 -14 -10 -10 -32 -23 39 -43 13 26 71 12 -4 0 20 36 -9 -4 -21 -22 -9 12 -8 45 -7 -30
7591 -30 2 -24 26 43 19 -37 -60 6 -34 -66 10 25 9 -9 -61 -20 24 -3 -64 13 -37 20 -5 18 -6 46 -25 -9 -19 -13 41
7622 41 19 17 3 10 7 -5 -42 -16 -73 37 16 -30 53 7 25 32 7 -21 -47 -10 39 -18 -18 6 23 23 29 -13 4 -2 -80 -6 -20 -24
7656 -24 5 -3 -33 -23 34 17 45 -6 -33 6 -33 -10 -40 3 32 -51 -25 -43 2 -58 -50 35 65 -8 -14 39 19 34 -53 15 -16 -24
7688 -24 -39 38 -58 -49 26 -38 -27 -25 14 -3 -1 17 -4 -59 -59 -15 -31 -47 -12 -27 12 -28 -3 -9 12 -36 -5 -25 -15 -20 -7 -17 -19 -14
7722 -14 -1 -57 -81 22 -43 24 -46 -33 2 -12 0 -8 -4 23 -16 -50 -1 -11 3 -17 -23 -6 -7 -4 -39 7 8 12 2 -8 26 16 -7
$$ packed form
7488a0rqJQNL7n1lk9L7J5j0l7L1%K6P0n5n8K9m8L7moO8l0k5qM0qj6p6J01k1J1
7523DL5p0J4L5qm7N8k7j7J0O0r3J1M6oj9J6NK0o1J4KqO1l1l0L1Ll8J1j4O1m8K6
7557FJ0n8J9k9M2J4k3l8L9MM%k2RO2q2N6J3M5n9j6MK0J6m5Nj7jJ3K1k0N3n2k3
7591c0L2k6N0J7k4n6k3O6m0l2P6J5j6j8n2M1M4k7o1P7n0N7k5K3k4N2p1J6j0ON4
7622D1k2kj4Plj2l7K6n7J10k1m6Q3m6J8Pk5k8k6L7M9n7%K4J7%Om2J7op8P4j4m
7656b4K9ql0J0N7j7K8n1k7L9l9K3l0M3K9q3K6j8M5o0QQ5L0p3oN3k0J5q7O8l1q
7688b4j5P7r6RP5o4J1KL9j7KJ8k1n5%M4j6j6L5j5L9m0K5oK1m8L1k0J0nJ3j0kN
7722a4J3n6k4J03o5O7p0J3L5j4J2qMK7l9l4M9j0J4k0oJ7jLl5M6JMj0j0L4j0k3
$$ plain form
7755 -7 25 11 -3 1 20 15 63 21 28 -15 27 33 1 -25 -94 -21 2 -17 3 62 79 -24 -23 -15 30 24 -36 -4 -37 -25 -14 -16 -55 20
7789 20 6 -16 -21 -30 5 -50 -8 -17 -3 -19 -39 -17 -20 9 20 4 -16 -30 -49 -81 17 -2 -102 -38 -22 4 1 8 1 -2 3 -40 -25 -11
7823 -11 28 0 -18 -4 21 -24 19 -20 2 -8 -14 1 -17 24 -18 26 -28 -35 61 -31 -7 -31 -7 15 -53 -11 -26 -17 -60 7 -7 17
7855 17 2 -40 32 61 21 -22 -2 -8 -7 -7 -62 2 76 18 -56 33 4 -14 -6 -36 0 5 39 28 36 -60 35 1 -4 56 20 -15 26 19
7889 19 -42 -49 -15 41 20 -13 28 -3 -10 -13 -53 -53 -59 53 -38 -14 0 -12 -10 -30 -3 -10 -47 -13 -28 11 41 9 -45 15 -12 -39 36
7922 36 29 24 -28 -60 12 -13 -64 -38 -42 0 -14 40 -24 17 1 36 30 -8 -23 -39 5 -9 -7 3 -6 -29 -21 31 -15 44 35 -5 -9 26 -8
7957 -8 -33 10 -9 2 -21 3 22 36 60 20 -9 -5 39 -15 20 11 -22 11 11 -16 0 -16 -11 15 -8 -12 -9 -10 10 -6 -27 -25 30 21 18 -13
7993 -13 30 -3 56 -4 -13 -21 -10 -1 -2 -5 27 10 -47 41 -14 8 -24 -57 -6 12 -3 -22 -11 22 -13 -1 -26 14 -7 -20 -3 -12 -15 -40
$$ packed form
7755gL2j4j4MJ9nM8m2Pm3M2Ol2k6o9P3K3j9K0N9J7j03JQM5oo0L2l3J2J1kl9P5
7789B0j4k2nrL5n5M2rJ4j6k0K2lK9J1j6k0j4j9l2R8j9j00O4J6K6lPplNm3J5J4
7823a1L9k8j8J4K5m5M3l9K2j0oJ5j8M1m2M4n4pR6r2K4k4K4K2o8M2j5Rm3O7j4K4
7855A7j5m2P2K9m0m3K0oJ%n5O4P4n8p4Q9k9j8Ql0L6NL4j1Qr6R5l4nO0l6l5M1p
7889A9o1pL4N6k1l3M1l1plm0%oJ12r1K4J4j2Kk0K7pl7L4j5L9L0l2n4O0k7k7P5
7922C6pnn2l2P2k5n1K6mM2j4N4o4M1j6L5ol8j5j6M4j4KJ0rk3QN2m6N9rm0mL5l4
7957hk5M3j9J1k3K4J9J4K4m0k9MM4n4L5rl3L3%k7J6j6NK6k3mLjK0j6k1KN5rll1
7993a3M3l3N9o0rqJ1RjlL2j7n7Q8n5K2l2l3N1J8j5j9J1L3l5J2k5M0k1j3J7rlk5
$$ plain form
8027 -40 -7 -12 -11 -2 3 -7 43 -26 -47 -2 -29 5 20 15 18 -35 0 29 -19 -43 -2 54 -16 4 4 2 6 5 -9 32 11 -36 44 36 30 49
8063 49 0 -36 -19 64 -57 17 -32 -37 -10 -1 -9 15 -43 -67 -40 -23 94 21 -28 -4 45 9 -59 77 -16 -25 18 -8 -11 -14 60 16
8095 16 28 -55 17 -50 14 9 -20 -28 23 -25 52 1 -20 -14 1 20 14 8 26 9 17 -52 26 22 1 2 3 -9 -6 61 -39 8 10 -21 -22 -4
8131 -4 16 -38 0 -9 -25 34 0 -16 -9 -24 -25 28 -49 24 3 24 3 -28 -5 -14 -52 35 -27 -9 -4 -9 -1 36 1 -34 37 -18 -35 11
8165 11 3 -4 26 -24 -25 9 3 -13 8 2 -1 -26 4 -19 -19 13 -57 -58 -35 -16 -93 -17 -17 37 -37 11
$$ packed form
8027d0L3nJRNj0N0o9k1M5k7L4J5nLn3L5K9m8k4M1N6p0K0%kMjj4M1k1m7Q0qoJ9
8063D9m9l6J7Q3j21P4m9nK7RqK4n8k4K7J7J17p3m9K4M9l6o8J36r3rM3k6llP4m4
8095A6J2q3P2o7O4nk9qN1m8P7n1k1OJ5J9ooJ8j7Qo9P8mk1JJj2LO7j00M7Kl1jJ8
8131dK0n4L8rj6N9l4j6Pj5jN3p7P3k1K1k1l1K3rl8Q7o2J8NnQL7l5l5P1n5j7M6
8165A1qpL0n0jL4oj6K1olk5L0k3%L2p0jK3J9p7P6%N4p4M8
8191A1
$$ Imaginary data points
##PAGE= N=2
##DATA TABLE= (X++(I..I)), XYDATA
$$ plain form
0 0 0 0 0 0 0 0 0 0 0 0 0 0 0 0 0 0 0 0 0 0 -4 0 0 4 -5 4 -3 5 -5 4 -4 4 -4 3 -4 4 -4 4 -5 4 -3 5 -4 1 0 1 -1 0 2 0 2 0 1 2 -6 10 -18 28 -44
59 -44 70 -108 164 -252 400 -653 1121 -2098 4526 -12902 92937 604517 108355 -555729 -153710
74 -153710 423431 191115 -263626 -202261 75413 193482 111194 -162452 -286610 112789
84 112789 425065 -49525 -515845 -14983 549423 74439 -527165 -118363 456218 148603
94 148603 -343025 -158236 201641 150238 -44880 -121483 -108044 78656 241132 -28391 -343168
105 -343168 -21559 404992 62905 -427037 -94641 405269 110373 -346765 -110745 255997
115 255997 92731 -147234 -60822 33343 21529 74692 19373 -166060 -53666 236588 79975
126 79975 -277926 -91628 290741 89041 -274025 -69356 234547 36792 -179084 3034
$$ packed form
0@%%%%%%%%%%%%%%%%%%%%mM%MrRpQj0RqQqPpQqQrRpQrNjJkJKkKkJJqJ6k8M6p2
59d4J14j78K72m16O52j053J774l219O624j7428J05839N11580m96162o64084M02019
74a53710N77141k32316m54741O1365K77674J18069q2288k73646j24158L99399
84A12789L12276m74590m66320N00862N64406m74984o01604M08802N74581l07615
94A48603m91628J84789L59877n1403j95118p6603J3439J86700J62476k69523l14777
105c43168L21609M26551l42087m89942L32396M99910k94896m57138K36020L66742
115B55997j63266k39965Q6412R4165j1814N3163n5319j85433J12394K90254j56613
126G9975l57901J86298L82369k01700l63066K04669L03903j97755k15876J82118
$$ plain form
136 3034 114158 -44669 -47990 79605 -16465 -106128 70658 117355 -113133 -113259 139565 90796
148 90796 -152315 -53115 153118 5526 -143412 47057 127037 -95768 -103710 137351 78907
159 78907 -163269 -52297 171425 27414 -157449 -2968 122559 -21103 -70807 43996
169 43996 6689 -66957 60299 86426 -125388 -104351 178153 117134 -213648 -125114 225082
180 225082 125307 -210473 -115678 171983 96770 -112174 -67042 39538 30629 40639 12697
191 12697 -117134 -57645 183183 101993 -229561 -140253 251293 167564 -246394 -181468 214112
202 214112 177850 -159761 -158684 86308 122031 -3849 -72362 -80502 12344 156140 51812
213 51812 -215230 -112816 252347 165746 -262122 -202737 245682 221595 -202278 -217530 138914
$$ packed form
136C034J11124j58827l321J27595r6070q9663J76786M6697k30488j26K52824m8769
148I0796k43111R9200K06233j47592j48938J90469P9980k22805p942K41061n8444
159G8907k42176J10972K23722j44011j84863J54481J25527j43662m9704J14803
169D3996l7307p3646J27256K6127k11814K1037K82504o1019l30782Q8534L50196
180B25082r9775l35780R4795K87661p5213k08944M5132J06580q909J0010k7942
191A2697j29831N9489K40828q1190l31554Q9308L91546q3729m13958O4926L95580
202B14112l6262l37611J077K44992L5723j25880o8513q140R2846J43796j04328
213E1812k67042J02414L65163q6601m27868N9385M48419k4087m23873j5252L56444
$$ plain form
224 138914 191650 -60672 -144929 -22565 82084 101727 -10535 -169641 -63664 217936
234 217936 130726 -244005 -185811 243468 220511 -218967 -232586 172635 219724 -111068 -183779
245 -183779 41089 129517 30741 -61585 -95605 -10739 149243 82271 -184679 -143201 200855
256 200855 188890 -196009 -213596 172469 215284 -134152 -194964 84484 153688 -30790 -98087
267 -98087 -23363 32155 70492 34480 -108298 -96093 132877 145108 -143609 -176582 141279
278 141279 188270 -126250 -178116 102871 149854 -72574 -105307 40577 51868 -8472 5041
289 5041 -20294 -58192 44295 101512 -63109 -131502 75167 143941 -82396 -140284 83572
300 83572 119927 -81495 -87952 75440 47773 -66704 -5171 55725 -34404 -41816 67465 26496
$$ packed form
224A38914N2736k52322q4257J22364J04649J9643j12262j59106J05977K81600
234B17936q7210l74731N8194M29279k2957m39478j3619M05221M7089l30792p2711
245a83779K24868Q8428r8776r2326l4020Q4866J59982o6972k66950M1478L44056
256B00855j1965l84899j7587L86065M2815l49436o0812K79448O9204j84478o7297
267i8087P4724N5518L8337l6012j42778J2205K28970J2231k88717l2973L17861
278A41279M6991l14520n1866K80987M6983k22428l2733J45884J1291o0340J3513
289E041k5335l7898J02487N7217j64621o8393K06669O8774k26337n7888K23856
300H3572L6355k01422o457J63392k7667j14477O1533O0896r0129p412J09281m0969
$$ plain form
312 26496 -89005 -8100 98918 -11066 -95032 32233 80348 -53109 -56536 73105 27703
323 27703 -90536 1757 102472 -29123 -108459 49212 105070 -61694 -93072 63543 70517
334 70517 -56687 -39584 41731 1794 -21555 39969 -191 -80676 21399 117651 -37398
345 -37398 -144671 48005 160263 -49875 -160168 44417 144380 -31803 -113256 14213
355 14213 68912 5333 -16262 -25142 -41072 40814 95729 -51601 -143645 54297 178377 -49495
367 -49495 -196641 37090 195718 -18507 -174697 -2787 136064 25462 -81913 -44641
377 -44641 19058 59461 47912 -66261 -110525 65054 163160 -55517 -199809 38702 216092
388 216092 -17572 -211023 -6488 183536 28729 -138082 -47966 77774 60534 -10174
$$ packed form
312B6496j15501Q0905J07018j09984q3966J27265M8115j33457l427J29641m5402
323B7703j18239R2293J00715j31595p9336J57671N5858j66764l1378J56615O974
334G0517j27204J7103Q1315l9937k3349O1524m0160q0485J02075R6252j55049
345c7398j07273J92676J12258k10138j10293K04585R9963j76183q1453J27469
355A4213N4699o3579k1595q880j5930Q1886N4915j47330r2044J97942J24080k27872
367d9495j47146K33731J58628k14225j56190J71910J38851j10602j07375L7272
377d4641O3699M0403j1549j14173m4264J75579R8106k18677j44292K38511J77390
388B16092k33664j93451K04535J90024j54807j66811R0116J25740j7240p0708
$$ plain form
398 -10174 -65884 -58312 63184 120492 -52865 -169333 37130 201169 -16734 -211336 -4030
409 -4030 200859 24510 -169540 -40451 122200 51332 -63326 -55555 -717 52596 62751
420 62751 -43938 -117791 29467 158663 -12926 -183341 -5173 188320 21096 -174686
430 -174686 -33574 144117 40850 -100124 -41584 48472 37037 6415 -26868 -57430 14251
441 14251 100957 186 -131696 -13062 148177 22708 -149215 -27797 135432 27005
451 27005 -109880 -21561 74921 11013 -35907 1276 -4214 -14554 40395 25700 -70175 -33111
463 -33111 91162 35459 -101566 -31295 102396 22314 -93284 -7838 77451 -8695 -56150
474 -56150 26371 32777 -41703 -9309 52836 -12134 -58114 29507 55504 -42808 -45792 50569
$$ packed form
398a0174n5710P572J21496N7308j73357j16468K06463J64039k17903j94602K07306
409d030K04889j76349j94050J29089J62651p0868j14658P771N4838N3313J0155
420F2751j06689p3853J47258J29196j71589j70415J78168J93493j67224j95782
430a74686J41112J77691j03267j40974N8540R0056j1435l0622l3283l0562P1681
441A4251Q6706j00771j31882J18634J61239j25469j71923J21418J63229j08427
451B7005j36885Q8319R6482o3908m6920L7183n490j0340N4949j4695r5875L7064
463c3111J24273n5703j37025P0271J33691q0082j15598Q5446Q5289q6146m7455
474e6150Q2521O406p4480L2394O2145o4970m5980Q7621K5997r8312k984R6361
$$ plain form
486 50569 28492 -54476 -6586 53826 -18565 -50715 43151 45243 -64326 -38242 79456 30822
498 30822 -85534 -22189 82384 13726 -68446 -3901 46338 -5805 -16964 16270 -15646 -26841
510 -26841 48057 36663 -76839 -45891 97698 52229 -108877 -56269 107728 55689 -95083
521 -95083 -51165 70975 41565 -38423 -27385 906 9822 38104 10768 -73309 -31644 101990
533 101990 52109 -119376 -68600 124628 80196 -116093 -84597 95182 80845 -64004 -69035
544 -69035 25508 49141 15105 -23811 -54733 -5662 87790 35176 -112048 -62469 124070 83783
556 83783 -123122 -96737 109719 100271 -84832 -92815 52213 76036 -14190 -50380 -23871 19723
568 19723 59333 13656 -87661 -45774 106571 73216 -114464 -93338 110231 103292 -95736
$$ packed form
486E0569k2077q2968M7890O0412p2391l2150R3866K092j09569K6084J17698m8634
498C0822j16356O3345J04573o8658q2172O4545N0239n2143j1159L3234l1916j1195
510b6841P4898j1394j13502L0948J43589m5469j61106N2608J63997n2039j50772
521i5083M3918J22140k9410p9988J1038K8291Q916K8282k7336q4077M1665J33634
533A01990m9881j71485N0776J93228m4432j96289L1496J79779j4337j44849n031
544f9035R4543K3633l4036l8916l0922M9071R3452n2614j47224M9579J86539m0287
556H3783k06905K6385K06456r448j85103p983J45028K3823r0226l6190K6509M3594
568A9723L9610m5677j01317M1887J52345l3355j87680K1126K03569o939j99028
$$ plain form
579 -95736 -103068 71380 91466 -41279 -70831 7727 42502 24976 -9961 -53691 -23227 76014
591 76014 53941 -89156 -77919 93524 93854 -88009 -98732 74877 93238 -55322 -77541
602 -77541 32145 53886 -7962 -25150 -15153 -5659 34617 34321 -49873 -58721 58925 75031 -62702
615 -62702 -82861 60756 80818 -54333 -69710 44559 51561 -32162 -27958 19211 2915 -5677
627 -5677 21869 -6352 -42264 17389 57227 -26068 -64498 32879 63802 -37648 -55887 39911
639 39911 41317 -40819 -23158 39272 2804 -36544 16150 31498 -32207 -24995 43068 16555
651 16555 -47700 -6369 46121 -4906 -38221 17649 26245 -29758 -10939 41584 -4545 -50798
663 -50798 18999 57067 -29992 -58916 36344 55526 -37699 -47023 33332 32931 -24910 -15095 12562
$$ packed form
579i5736p332J74448K0086j32745k9552P8558L4775j7526l4937m3730L0464R9241
591G6014k2073j43097J1237J71443L30j81863j0723J73609J8361j48560k2219
602g7541J09686K1741o1848j7188R997R494M0276k96q4194q848J17646J6106j37733
615f2702k0159J43617K0062j35151j5377J14269P002q3723M204M7169j6296q592
627e677K7546k8221l5912N9653L9838q3295l8430R7377L0923j01450j8239R5798
639C9911J406q2136J7661O2430l6468l9348N2694J5348o3705P212O8063k6513
651A6555o4255M1331N2490n1027l3315N5870Q596n6003J8819N2523m6129m6253
663e0798O9797L8068q7059k8924R5260J9182r3225r324Q0355m01n7841R815K7657
$$ plain form
676 12562 -6169 797 28160 -14310 -49176 25688 66901 -33331 -79012 36733 84541 -34526
688 -34526 -81407 28106 70675 -17208 -51819 4346 27193 9658 1299 -22341 -30855 32061
700 32061 58241 -38060 -81057 38653 95794 -34750 -101813 25964 97138 -14338 -82822
711 -82822 792 59608 12724 -29923 -24243 -2798 33091 36225 -37351 -65679 37630 89128
723 89128 -33002 -103272 24993 107270 -14090 -100106 1880 82831 9958 -57241 -20728
734 -20728 25424 28333 8350 -32971 -41679 33168 70179 -30057 -91627 23492 103450 -14535
746 -14535 -104469 4693 95143 5450 -75905 -13708 49701 20174 -18705 -23270 -12980 23499
758 23499 42665 -20732 -66968 15715 83539 -9587 -91232 2713 88992 2874 -78408 -7546
$$ packed form
676A2562j8731O966K7363m2470l4866P4864M1213j00232m5681J15745M7808j19067
688c4526m6881J09513M2569q7883l4611N6165K2847j7535q359k3640q514O2916
700C2061K6180r6301m2997J19710N7141j30544o7063J27777P1174j11476o8484
711h2822Q3614N8816m6884m2647N680K1445L5889L134p3576k8328J03309N1498
723H9128j22130p0270J28265Q2277j21360q6016J01986Q0951p2873o7199L6513
734b0728M6152K909j9983m1321q708P4847L7011j00236o1570J15119P9958j17985
746a4535q9934J09162R0450q9693q1355O2197O3409k9527l8879m565J0290L6479
758B3499J9166o3397m6236Q2683O7824r3126q1645R3945Q6279q6118q1282P0862
$$ plain form
770 -7546 59915 9737 -36676 -10219 10640 8628 14969 -5548 -37680 2101 55741 1650 -66868
783 -66868 -3926 71175 5320 -67792 -4398 58259 2025 -43454 1940 25383 -6752 -6282
795 -6282 11220 -12363 -15266 27823 17036 -39799 -17047 46403 13813 -48251 -8273 45156
807 45156 453 -38055 8805 28363 -17960 -16964 26494 5912 -32264 4529 35196 -12633
819 -12633 -33749 18720 28367 -22034 -18862 23019 6308 -22354 7731 19886 -22379 -17203 35068
832 35068 13685 -45111 -10636 50321 7617 -50423 -5015 44843 2679 -33728 -215 18447
844 18447 -2096 -19 5207 -18825 -8272 36978 11930 -51606 -15310 61243 18441 -64600
856 -64600 -20808 60900 21400 -50706 -20655 34523 17388 -14587 -12310 -7549 5089 28996
$$ packed form
770g546O7461n0178m6413K6457K0859k012O341k0517l2132L9781N3640n4091o8518
783f6868O2942P5101o5855p3112O3394O2657n6234m5479M5394K3443l2135M70
795f282J7502k3583k903M3089j0787n6835K2752O3450l2590o2064L9978N3429
807D5156m4703l8508M6860J9558m6323R96M3458k0582l8176L6793L0667m7829
819a2633k1116N2469R647n0401L172M1881j6711k8662L0085J2155m2265N176N2271
832C5068k1383n8796L4475O0957m2704n8040M5408M9858m2164l6407L3513J8662
844A8447k0543K077N226k4032J0553M5250k5048o3536L6296P6553m2802q3041
856f4600M3792Q1708l9500p2106L0051N5178j7135l1975K277M761J2638K3907
$$ plain form
868 28996 3339 -47672 -12256 61593 20929 -68766 -27933 69107 32991 -61796 -34563 48381
880 48381 32921 -29605 -27436 7993 18979 14456 -8177 -35466 -4217 52417 16371 -64241
892 -64241 -27602 69074 35979 -67116 -41176 58020 41843 -43287 -38214 24349 30318 -2936
904 -2936 -18848 -18067 5501 37176 9087 -51692 -22394 60875 33791 -63396 -41100 59554
916 59554 44077 -49875 -42170 35526 35307 -18545 -24834 245 11273 16842 2948 -31635 -17025
929 -17025 42184 28620 -48296 -36959 49382 41089 -45594 -40278 38056 35192 -27155 -25956 14901
942 14901 14423 -1892 -1163 -9996 -11582 20305 22804 -27961 -31154 32468 35413 -34069 -35685 32368
956 32368 31299 -28582 -23694 22598 13030 -15724 -1384 8238 -10191 -1058 20346 -5278 -27355
$$ packed form
868B8996k5657n1011L5416P3849m0664q9695M0833R7040l6116r4787K7233Q2944
880D8381j5460o2526K169L5429J0986m523k2633k7289L1249N6634l6046q0612
892f4241L6639R6676l3095j03095K5940R9196j6177q5130N073O2563N969l3254
904b936j5912P81K3568L1675k8089o0779K9298Q3269k7084r7187K2296J00654
916E9554j5477r3952P705P7696k19n3852o289K5079J1028N569j3894l4583J4610
929a7025N9209j3564p6916J1337Q6341q293q6683N316P8334k864o2347J199M0857
942A4901m78j6315P29q833j586L1887K499n0765l193O3622K945o9482j616O8053
956C2368j069n9881M888M6292r568k8754J4340R622j8429R133K1404k5624k2077
$$ plain form
969 -27355 10972 31059 -15057 -30388 18331 26233 -20065 -18505 21033 8851 -20910 1676
981 1676 19865 -11885 -18166 19920 15263 -25628 -11880 27475 7143 -26059 -1869 21107 -4244
994 -4244 -13514 10701 4411 -16863 5456 22676 -14253 -26959 21509 29811 -25660 -29985 26776
1007 26776 27784 -24206 -22724 18660 15081 -10683 -5467 1105 -5580 8273 16699 -17068 -27352
1020 -27352 23530 35589 -27412 -40968 27729 42410 -24710 -39768 18761 32962 -10394 -22322
1032 -22322 1159 9266 8541 5521 -16843 -19942 23363 33078 -26895 -43060 27245 49048 -24588
1045 -24588 -50308 18850 46302 -11365 -37877 2292 25054 6513 -9772 -14674 -6881 20924
1057 20924 23062 -24714 -36969 25750 47500 -23713 -52961 19439 53311 -12757 -47763 5378
$$ packed form
969b7355L8327K0087m6116j5331M8719P902m6298J560L9538j2182k9761K2586
981A676J8189l1750o281L8086m657m0891J3748L9355k0332l3202K4190K2976k5351
994d244r270K4215o290k1274K2319J7220l6929j2706M8468Q302n5471m325N6761
1007B6776J008n1990J482M1384l579k5764N216O572o685J3853Q426l3767j0284
1020b7352N0882J2059o3001j3556O8697J4681o7120j5058N8529J4201m3356j1928
1032b2322K3481Q107p25l020k2364l099M3305R715n9973j6165P0305K1803p3636
1045b4588k5720O9158K7452n7667k6512M0169K2762j8541j6285m902P793K7805
1057B0924K138m7776j2255O2719K1750p1213k9248P2400L3872o6068l5006N3141
$$ plain form
1069 5378 37574 2515 -23233 -9543 6652 15207 10436 -19033 -26493 20369 39345 -19691 -48241
1082 -48241 16739 51548 -12557 -49662 7364 42628 -1941 -31240 -3062 17048 7352 -1276
1094 -1276 -10016 -13845 11562 27427 -11457 -37446 10407 43541 -8274 -44827 5878 41546
1106 41546 -3388 -34184 1075 23419 426 -10999 -1521 -2216 1671 14340 -1636 -24602 1140
1119 1140 31723 -810 -35086 859 34701 -1350 -30500 2620 23661 -4177 -14430 6406
1131 6406 4712 -8244 5026 9906 -13371 -10554 19532 9901 -23245 -8040 23980 4557 -22342
1144 -22342 -123 18265 -5335 -12979 10667 6864 -15692 -779 19566 -4510 -21499 8621
1156 8621 21482 -10983 -18768 11956 14140 -11260 -7107 9650 -928 -7051 9605 4251 -17860
$$ packed form
1069E378L2196l5059k5748J3690J6195Q555m771k9469p460M6862J8976n9036k8550
1082d8241O4980L4809o4105l7105N7026L5264m4569k9299K8178K0110r696q628
1094a276q740l829K5407J5865l8884k5989M7853L3134n1815l6553N0705L5668
1106D1546m4934l0796L5259K2344k2993j1425R478o95L887J2669j5976k2966K5742
1119A140L0583l2533l4276L5945L3842l6051k9150L3120K1041k7838j0253K0836
1131F406j694j2956J3270M880k3277K817L0086r631l3146J5205L2020j9423k6899
1144b2342K2219J8388k3600p644K3646l803k2556J4913K0345k4076j6989L0120
1156H621J2861l2465p785L0724K184k5400M153J6757j0578o123J6656n354k2111
$$ plain form
1169 -17860 -1734 24723 -383 -29466 1575 31047 -2193 -29612 1863 24651 -1253 -16978
1181 -16978 317 6890 465 4345 -803 -15373 721 25492 223 -32866 -1423 37252 3349
1194 3349 -37452 -4972 33886 6535 -26463 -7421 16124 7440 -3998 -6627 -8934 4513 20867
1207 20867 -1824 -31074 -1817 37852 5488 -40932 -9058 39672 11912 -34361 -13496 25549
1219 25549 13901 -13808 -12360 1011 9608 12102 -5279 -23662 327 32943 5091 -38579
1231 -38579 -10022 40059 13977 -37577 -16523 31030 16796 -21568 -15396 9868 11928 2212
1243 2212 -7110 -14080 1244 24024 4802 -31178 -10294 35080 14705 -35098 -17148 31812
1255 31812 17882 -25213 -16244 16581 12799 -6526 -7804 -3611 1913 12878 4150 -20526 -9921
$$ packed form
1169a7860J6126K6457k5106k9083L1041K9472l3240k7419L1475K2788k5904j5725
1181a6978J7295O573o425L880n148j4570J6094K4771k5269l3089L1443L8675l3903
1194C349m0801L2480L8858k7351l2998J9042K3545q684j1438k629k307J3447J6354
1207B0867k2691k9250K9257L9669l2364m6420L1874M8730k7760m6273K0865L9045
1219B5549j1648k7709J448J3371Q597K494j7381j8383K3989L2616k7852m3670
1231c8579K8557N0081k6082n1554K1054M7553j4234l8364O172K5264K060r716
1243B212r322o970J5324K2780j9222l5980K0884M5374k0375m9803J7950M8960
1255C1812j3930m3095Q969L2825l782j9325j278M193N524J0965q728k4676J0605
$$ plain form
1268 -9921 25529 14222 -27996 -17059 27277 17694 -24264 -16293 18924 12815 -12147 -7767 4915
1281 4915 1874 2429 4399 -8569 -9894 13754 14406 -16809 -16725 18267 17079 -17817 -15201 15998
1295 15998 11253 -13096 -5971 9284 -281 -5451 6196 1524 -11576 1789 15242 -4712 -17031
1308 -17031 6898 16660 -8366 -13982 9230 9706 -9522 -3902 9567 -2117 -9034 8218 8504
1321 8504 -13169 -7497 16620 6301 -17997 -4811 17049 2862 -14121 -698 9220 -2018
1333 -2018 -3392 4788 -3258 -7726 9307 10515 -14416 -12753 17861 14103 -19048 -14306 18109 13347
1347 13347 -14773 -10731 9828 7011 -3515 -2104 -3176 -3336 9608 8973 -14924 -14125 18481 17969
1361 17969 -20000 -20570 19050 20965 -16106 -19416 11130 15657 -5087 -10204 -1679 3492 8226 3956
$$ packed form
1268i921L5450j1307m2218J0937M4336r583m1958P971L5217o109k4962M380J2682
1281D915l041N55J970j2968j325K3648O52l1215Q4L4992j188l4896K616L1199
1295A5998m745k4349P125J5255r565n170J1647m672j3100J3365J3453j9954j2319
1308a7031K3929R762k5026n616K3212M76j9228N620J3469j1684o917J7252K86
1321H504k1673N672K4117j0319k4298J3186K1860j4187j6983J3423R918j1238
1333b018j374Q180q046m468J7033J208k4931J663L0614l758l3151M742L2415m762
1347A3347k8120M042K0559k817j0526J411j072j60J2944o35k3897P99L2606n12
1361A7969l7969n70L9620J915l7071l310L0546M527k0744n117Q525N171M734m270
$$ plain form
1375 3956 -13617 -11185 17651 17686 -19423 -22425 19124 25194 -16621 -25207 12320 22745 -6837
1388 -6837 -17763 628 10679 5295 -2634 -10524 -6074 14284 13965 -16449 -20667 16695 25141 -15036
1402 -15036 -26895 11918 25869 -7604 -21939 2974 15878 1979 -7907 -6233 -536 9698
1414 9698 9062 -11878 -16435 12720 22025 -12200 -25201 10357 25609 -7835 -23455 4551 18656
1427 18656 -1303 -12152 -1928 4416 4452 3554 -6273 -10848 7235 16967 -7252 -20815 6626 22584
1441 22584 -5213 -21608 3834 18552 -2242 -13472 1068 7204 -103 -450 -432 -6045 597 11413
1455 11413 -578 -15466 395 17363 -525 -17434 695 15412 -1382 -11899 2291 7185
1467 7185 -3359 -2046 4589 -2799 -5528 7245 6212 -10367 -6120 12282 5493 -12433 -3979 11225
$$ packed form
1375C956j7573K432K8836L5l7109l002M1549O070m1815q586L7527J0425k9582
1388f837j0926J8391J0051n384p929p890M450K0358l19l0414m218L7362Q446m0177
1402a5036j1859L8813J3951l3473j4335K4913J2904j3899r886J674N697J0234
1414I698o36k0940m557K9155R305l4225j3001L5558J5252l3444j5620K8006J4105
1427A8656j9959j0849J0224O344L6q98r827m575J8083R732k4219j3563K7441J5958
1441B2584k7797j6395K5442J4718k0794j1230J4540O136p307l47J8n613O642J0816
1455A1413j1991j4888J5861J6968j7888j6909J8129J4717j6794j0517J4190M894
1467G185j0544J313O635p388k729J2773j033j6579M247J8402o789j7926Q454J5204
$$ plain form
1481 11225 1769 -8771 949 5476 -4041 -1888 7012 -1694 -9846 4547 11644 -6666 -12548 7638
1495 7638 12091 -7487 -10171 6454 7107 -4503 -2853 2388 -1863 -33 6943 -1934 -11305 3385
1509 3385 15051 -4053 -17193 3954 17523 -3236 -16021 1876 12656 -410 -7820 -1333
1521 -1333 1893 2567 4456 -3469 -10617 3719 15798 -3279 -19452 2329 21250 -727 -20588
1534 -20588 -931 17894 2748 -13139 -4069 7041 5051 66 -5172 -7120 4628 13562 -3439
1547 -3439 -18636 1335 21677 724 -22507 -3118 20794 5001 -17064 -6416 11370 6889
1559 6889 -4666 -6563 -2505 5366 9362 -3280 -15082 957 19341 1862 -21269 -4169 21157
1572 21157 6242 -18642 -7327 14344 7755 -8693 -7123 2224 5498 4214 -3387 -10288 697
$$ packed form
1481A1225r456j0540R720M527r517K153Q900q706q152J4393P097j8310n882K0186
1495G638M453j9578k684J6625O53j1610J650N241m251J830O976q877r371J4690
1509C385J1666j9104j3140K1147J3569k0759j2785J7897J0780j3066p410O487
1521a333L226O74J889p925p148J4336J2079j9077j6173K1781J8921k1977j9861
1534b0588J9657J8825j5146j5887R070J1110j990m985n238j948J1748Q934j7001
1547c439j5197J9971K0342k0953k3231J9389K3912j5793k2065J0648J7786m481
1559F889j1555j897M058P871L996j2642j1802J6039J8384j7479k3131J7100K5326
1572B1157j4915k4884J1315K1671o589j6448J570R347L274j284p601o901J0985
$$ plain form
1585 697 14920 1969 -18067 -4547 19105 6481 -18158 -7536 15398 7689 -11090 -6790 5931
1598 5931 5069 -200 -2619 -4947 -135 9557 2972 -12668 -5436 14449 7139 -14603 -7944 13160
1612 13160 7602 -10623 -6457 6986 4139 -3234 -1430 -702 -1641 3999 4503 -6631 -6722 8460 8239
1627 8239 -9082 -8460 8990 7812 -7846 -5841 6239 3307 -4161 -63 2013 -3199 -56 6103
1641 6103 -1628 -8387 2793 9559 -3518 -9676 3713 8423 -3658 -6133 3290 2933 -2862 732
1655 732 2503 -4263 -2145 7547 2071 -9786 -1957 11062 2058 -10761 -1834 9403 1607 -6695
1669 -6695 -1066 3151 201 758 925 -4792 -2392 8079 3731 -10769 -5155 11973 6102 -12008
1683 -12008 -6603 10551 6488 -7839 -5645 4157 4061 40 -1866 -4153 -568 7997 3459 -10808
$$ packed form
1585F97J4223j2951k0036J3520K3652j2624k4639J0622K2934p709j8779M300J2721
1598E931q62n269k419k328M812R692o585j5640P232J9885p310k1742O659K1104
1612A3160n558j8225M166J3443k847p373J804P28r39N640N04j1134r1J5182k21
1627H239j7321O22J7450j178j5658K005J2080k932p468M098K076n212L143O159
1641F103p731o759J1180O766j3077o158J3389M710j2081k475R423l57n795L594
1655G32J771o766K118R692n476j1857P829J3019r004j2819Q927J1237p796q302
1669f695N629M217k950N57J67n717K400J0471m348j4500N614J7128n871j8110
1683a2008N405J7154m063j4327K194R802r6m021j906k287L585Q565m538j4267
$$ plain form
1697 -10808 -5971 12551 8133 -12757 -9490 11552 9907 -9048 -9428 5515 7591 -1447 -5064 -2850
1711 -2850 1704 6649 1942 -9686 -5477 11620 8661 -12076 -10927 11287 12109 -9226 -11917 6267
1725 6267 10519 -2613 -7810 -1113 4338 4616 -267 -7438 -3842 9369 7598 -10348 -10575 9989
1739 9989 12347 -8813 -12930 6494 11962 -3810 -9837 703 6534 2279 -2558 -4754 -1700 6719
1753 6719 5769 -7678 -9007 7822 11375 -7085 -12346 5716 11911 -3745 -10178 1630 7311 379
1767 379 -3674 -2187 -355 3440 4039 -4234 -7383 4348 9609 -4071 -10786 3317 10696 -2354
1781 -2354 -9383 1404 7118 -501 -4065 -101 791 658 2646 -717 -5456 687 7623 -530 -8729
1796 -8729 263 8849 -106 -7894 -9 6037 -260 -3609 615 760 -1257 2013 1922 -4382 -2545 6128
$$ packed form
1697a0808M837J8522m418k0890L267K1042j645j8955l80J4943K076r038l617K214
1711b850M554M945m707j1628M209J7097k959k0737J149K2214Q22k1335k691J8184
1725F267M252j3132n197O697N451K78m883p171L596J3211j771j7946k27K0564
1739I989K358k1160m117J9424N468j5772o027J0540N831m255m837k196L054Q419
1753F719r50j3447j329J6829L553j8460n261J8062O195j5656o433J1808N681o932
1767C79m053J487J832L795N99q273l149J1731N261j3680o715J4103P379j3050
1781b354p029J0787N714p619l564L964Q92j33J988l363m739O143O936q153q199
1796h729Q992Q586q955p788P885O046o297l349M224J45k017L270r1o304J837Q673
$$ plain form
1812 6128 3074 -6995 -3252 6960 3040 -5979 -2291 4450 1185 -2341 306 33 -2008 2127 3664
1827 3664 -3921 -5099 5032 6185 -5456 -6701 5096 6384 -4109 -5422 2576 3658 -880 -1407
1841 -1407 -961 -1200 2620 3884 -3691 -6205 4392 8077 -4343 -9118 3807 9282 -2664 -8311
1855 -8311 1179 6438 520 -3731 -1983 511 3153 2786 -3988 -6043 4179 8537 -3842 -10352 2923
1870 2923 10931 -1656 -10382 174 8606 1384 -5905 -2716 2533 3654 1186 -3997 -4809 3924 7967
1885 7967 -3219 -10189 2159 11401 -724 -11372 -744 10040 2142 -7837 -3244 4589 3821 -1054
1899 -1054 -4013 -2681 3545 5983 -2715 -8686 1569 10416 -15 -10969 -1287 10428 2571 -8529
1913 -8529 -3373 6018 3767 -2750 -3589 -670 2965 3892 -1881 -6669 509 8542 804 -9571 -2172
$$ packed form
1812F128l054j0069L743J0212l920r019L688O741l265l526K647k73k041M135J537
1827C664p585j178J0131J153j1641j245J1797J288j0493j313P998J082m538n27
1841a407M46k39L820J264p575k514J0597L685j2420m775J2925N475j1946n647
1855h311R490N259n918m251J748K494K642l67o774k055J0222M358j2379o510J3275
1870B923Q008j2587q726J0556Q432p222p289L189N249J121k468n183q12Q733M043
1885G967j1186o970J2348R242j2125j0648J0628J0784p898r979M593P833p68m875
1899a054k959J332O226K438q698n971J0255Q847j0431j0954R682J1715p857j1100
1913h529N156R391k251o517q39K919L635R27n773m788P178Q033p738j0375P399
$$ plain form
1928 -2172 9318 2990 -8138 -3618 6113 3479 -3562 -3014 827 2027 2019 -759 -4347 -622 6140
1943 6140 2021 -7053 -2979 7259 3668 -6622 -3749 5395 3445 -3587 -2582 1590 1294 444 184
1958 184 -2320 -1718 3592 3016 -4529 -4008 4773 4484 -4431 -4329 3662 3680 -2562 -2390 1358 753 -2 1091
1976 1091 -982 -2794 1837 4305 -2214 -5208 2225 5528 -1929 -5157 1422 4020 -805 -2437 225
1991 225 445 253 1628 -565 -3622 628 5260 -444 -6234 65 6560 443 -5993 -797 4829 1271
2007 1271 -2973 -1353 842 1322 1555 -964 -3668 349 5485 470 -6738 -1376 7052 2143 -6768
2022 -6768 -2816 5533 3090 -3729 -3084 1420 2606 1082 -1664 -3423 496 5353 874 -6652 -2141
2037 -2141 7304 3396 -7034 -4172 6053 4590 -4237 -4422 2091 3725 258 -2683 -2643 1051 4560
$$ packed form
1928b172J1490o328j1128M520R731k634p041N48L841J200qk778l588L725O762
1943F140m119r074M074J0238l591j0290K873R144j950p032J005M172k96q50k60
1958A84k504O02N310n76p545N21Q781k89q915J02P991J8o242J72L748o05p55J093
1976A091k073j812M631K468o519k994P433L303p457l228O579K598m825j632K662
1991B25K20j92J375k193l057M250M632n704n790O299O495o117o436N196N626l558
2007A271m244J620K195M80K33k519k704M017N136n015p208N362Q428m909q911
2022f768L952Q349k443o819O45M504J186j524k746j759L919M857m479p526M511
2037b141R445l908j0430K862J0225j463q827j85O513J634l467k941M0L694L509
$$ plain form
2052 4560 484 -6124 -2218 6818 3718 -6862 -4750 6075 5351 -4648 -5288 2806 4765 -635 -3552
2067 -3552 -1480 1987 3418 -21 -4776 -1885 5743 3619 -5889 -4917 5443 5658 -4332 -5788 2843
2082 2843 5179 -1237 -4060 -640 2330 2126 -378 -3437 -1613 4233 3317 -4419 -4714 4224 5500 -3477
2098 -3477 -5586 2478 5106 -1246 -3982 14 2496 1178 -581 -2001 -1302 2559 2908 -2786 -4251
2113 -4251 2625 4991 -2168 -5242 1527 4736 -828 -3805 67 2358 533 -670 -926 -1080 1102
2128 1102 2704 -1039 -3847 797 4582 -384 -4666 33 4309 402 -3251 -588 1881 574 -305
2143 -305 -409 -1291 29 2622 439 -3673 -951 4182 1341 -4246 -1676 3683 1782 -2638 -1526 1371
2159 1371 1158 130 -405 -1428 -387 2745 1400 -3532 -2136 3957 2801 -3800 -3229 3215 3235 -2264
$$ packed form
2052D560m076o608L906R036l100j0580K112J0825p24r999o40Q094J959n400k917
2067c552K072L467J431l439m755K891P628k124r508R72J0360K15r990j456Q631
2082B843K336o416k823L420K970k04k504l059J824N846r16p736k95Q938J276q977
2098c477k109Q064K628o352k736L996K482j318j759j420O99L861L49n694j465
2113d251O876K366p159l074O769L209n564k977L872K291j825j203k56j54K182
2128A102J602l743k808M644L785m966m282M699M276l907l653K663K469j307q79
2143c05j04q82J320K593k183m112K722N133k841n587K570N359j901m420J112K897
2159A371k13j028n35j023J041L132j345m932J396O093j156o601N71O444K0n499
$$ plain form
2175 -2264 -2870 915 2108 337 -1116 -1693 -286 2672 1681 -3364 -2849 3672 3867 -3403 -4408 2732
2191 2732 4527 -1735 -4014 581 3221 803 -1741 -1851 172 2759 1499 -3279 -3026 3309 4220 -3075
2207 -3075 -5094 2370 5283 -1418 -4956 285 4016 770 -2711 -1831 961 2607 881 -2992 -2593
2222 -2593 3065 4083 -2674 -5029 2048 5585 -1029 -5365 55 4634 940 -3358 -1735 1693 2291
2237 2291 109 -2595 -2045 2381 3463 -1998 -4637 1290 5260 -505 -5238 -343 4630 1161 -3546
2252 -3546 -1656 2107 2021 -395 -1925 -1272 1724 2771 -1292 -3950 611 4606 70 -4686 -744 4346
2268 4346 1248 -3419 -1605 2219 1698 -756 -1501 -711 1076 2027 -503 -3054 -200 3740 813 -3876
2284 -3876 -1325 3623 1791 -2871 -1758 1923 1698 -713 -1088 -450 521 1559 276 -2367 -1080 2780
$$ packed form
2175b264o06L785J193j771j453n77J407K958r91n045N15O521J95p270j005P140
2191B732J795o262k279M595K640k418k544j10K023K587j260m778K53O335R11p295
2207c075k019P464K913o701l538N241L731l246l481Q80K792J646j726l873L99
2222b593N658J018o757k355P077L537o614m336N420M579l694m298J623L428N98
2237B291k182k704N50M426J082n461k639N927L970n765m733M895M973l469m707
2252c546J890L763q6k416j530O53K996J047m063k658M561L995m536m756L942N090
2268D346l098m667J814L824n21k454p45P90J787R51k530k551K854L940k927m689
2284c876K551M948j832m662J113L681k25k411l75O38R71J038j283k643J287L860
$$ plain form
2300 2780 1721 -2870 -2210 2604 2353 -2030 -2192 1291 1732 -372 -1027 -544 151 1317 906 -1840 -1718
2317 -1718 2135 2501 -1924 -2849 1752 3028 -1114 -2619 509 2006 183 -1100 -760 50 1294 1028
2333 1028 -1553 -2180 1521 2963 -1321 -3487 861 3593 -305 -3224 -273 2513 905 -1421 -1310
2348 -1310 207 1508 1218 -1439 -2351 1223 3284 -678 -3786 84 3943 521 -3626 -1056 2864
2363 2864 1536 -1775 -1758 409 1814 925 -1518 -2221 1045 3204 -488 -3845 -263 4099 963 -3773
2379 -3773 -1539 3154 1976 -2099 -2086 850 2069 600 -1623 -1782 1088 2852 -292 -3521 -554 3866
2395 3866 1287 -3654 -1929 3140 2312 -2211 -2373 1068 2228 255 -1694 -1399 998 2320 -59 -2995
2411 -2995 -713 3343 1584 -3227 -2101 2856 2530 -2009 -2481 1166 2291 -55 -1676 -915 910 1762
$$ packed form
2300B780j059m591O60M814k51m383j62L483M41k104o55M83O95J166m11k746J22
2317a718L853L66m425r25M601J276m142j505L128J497j823j283L40Q10J244k66
2333A028k581o27L701J442m284k166M348K732l898k919K951K786j608k326J11
2348a310J517J301k90k657r12L574K061l962l108L870L859l422m147K570L920
2363B864j328l311J7K167J405q89k443p03L266K159l692l357L582M362l136m736
2379c773K234M693j178m075J3K936J219j469k223j59K870J764l144l229K967M420
2395C866k579m941J725N069q28m523j62L441J160j973j949K95K397J322k379k936
2411b995K282M056j759m811J126M957l26m539m72L647J125k346j621P61J825Q52
$$ plain form
2427 1762 -37 -2363 -914 2587 1562 -2654 -2166 2254 2482 -1691 -2541 991 2200 -60 -1552 -589
2443 -589 760 1306 171 -1711 -999 1893 1814 -1780 -2307 1488 2554 -1016 -2493 452 2055 143
2459 143 -1426 -669 548 993 330 -1215 -1228 1203 1954 -956 -2420 642 2533 -184 -2405 -176 2009
2476 2009 566 -1298 -764 432 968 497 -909 -1280 669 2075 -362 -2429 -86 2581 466 -2375
2492 -2375 -903 1894 1017 -1193 -1186 301 1070 607 -790 -1436 344 2093 158 -2451 -658 2540 1201
2509 1201 -2246 -1490 1807 1688 -1024 -1577 173 1317 637 -868 -1553 271 2093 409 -2388 -1119
2525 -1119 2370 1672 -2225 -2030 1650 2124 -962 -1971 180 1661 667 -1053 -1404 338 1892 495
2541 495 -2202 -1193 2284 1894 -1954 -2287 1490 2460 -778 -2342 105 1823 684 -1221 -1298 407
$$ packed form
2427A762j799k326J449L501j025m216M88M420K28m173q50L532J209k260j492R63
2443e89J349N46j135j882P12K892p9l594n27L795J066l570j477K945J603j912
2459A43j569P57J217M45o63j545j3K431P51k910j464L062J891k717k221K229K185
2476B009j443j864N34J196N36m71j406l71J949J406k437k067K343K667k115k841
2492b375J472K797q77k210PJ487P69m63j397o46J780J749j935k609J793L198j339
2509A201l447P56L297j19k712n53J750J144o80j505o85J824J822j684k797J269
2525a119L489o98l897J95L680M74l086j009K151J481r94j720l51J742J554j397
2541D95k697J009L477l90l848l33L777R70l238j564K447J718j139j905p7J705
$$ plain form
2557 407 1762 474 -1968 -1302 1839 1953 -1720 -2415 1237 2583 -498 -2398 -67 1968 721 -1344
2573 -1344 -1211 517 1539 367 -1640 -1136 1550 1866 -1251 -2279 795 2533 -360 -2392 -241 1982
2589 1982 722 -1396 -1061 601 1271 200 -1275 -1003 1160 1716 -852 -2117 418 2366 24 -2214
2605 -2214 -428 1910 814 -1255 -1053 489 1098 268 -965 -989 697 1496 -345 -1995 -47 2077
2621 2077 439 -2007 -849 1616 1022 -1015 -1082 324 1027 325 -791 -876 397 1427 56 -1621 -447
2638 -447 1817 891 -1620 -1177 1308 1212 -781 -1243 119 1041 349 -674 -924 197 1327 347 -1532
2655 -1532 -808 1510 1213 -1360 -1506 980 1621 -456 -1372 -23 1111 589 -615 -1042 51 1304 552
2672 552 -1408 -1111 1339 1513 -1077 -1827 655 1850 -199 -1714 -310 1202 717 -741 -1088 47
$$ packed form
2557D07J355j288k442O66L141J14l673o95L652J346l081j900K331K035j247k065
2573a344J33J728J022j172k007N04K686L16l117j028L074J738k893k032K151K223
2589A982j260k118L35J662O70j071j475K72K163N56k568j265K535J948k342k238
2605b214J786K338j096k069K02J542O09q30j233k4J686P99j841j650J948K124
2621B077j638k446J158K465n94k037o7J406P03p02j116q5J273J030j371j677J174
2638d47K264r26k511M43K485r6j993m62J362R22o92j023k50J121J130r80j879
2655a532P24K318k97k573j46K486O41k077r16J349J134n22j204m27J093J253p52
2672E52j960K97K450J74k590p50K482J195k049j515J404J512m85j458l47J135
$$ plain form
2688 47 1283 608 -1272 -1153 1122 1667 -828 -1896 450 1970 20 -1758 -434 1419 830 -820
2704 -820 -1122 107 1257 591 -1240 -1245 887 1635 -596 -2024 171 1990 241 -1874 -638 1406 1051
2721 1051 -801 -1165 155 1252 541 -1044 -1061 821 1654 -385 -1852 15 1945 497 -1742 -827
2737 -827 1384 1095 -869 -1250 222 1173 404 -978 -996 574 1429 -231 -1641 -238 1723 608 -1614
2754 -1614 -924 1271 1153 -731 -1182 268 1105 409 -832 -851 482 1256 -17 -1485 -405 1461 771
2771 771 -1286 -1067 1057 1242 -582 -1187 67 1044 465 -727 -778 303 1124 195 -1181 -595 1198 930
2789 930 -1002 -1173 715 1328 -270 -1198 -2 988 488 -659 -782 115 959 284 -1040 -788 925 1075
2807 1075 -754 -1255 432 1404 -112 -1205 -198 962 581 -515 -790 132 951 441 -901 -862 773
$$ packed form
2688D7J236o75j880J19K275N45k495j068K346J520j950j778J324J853n89j650
2704h20l02J229J150o66j831nK132P48k231j428K195J819j749k115J236K044l55
2721A051j852l64J320J097p11j585j7J882Q33k039j467J867J930j448k239R15
2737h27K211k89j964l81J472R51p69j382j8J570Q55j660j410J403J961j115k222
2754a614O90K195j18j884m51J450Q37o96j241j9J333P74j273j468J080J866o90
2771G71k057K19K124J85j824o05J254R77n79j192n1J081Q21r29j376N86J793k68
2789I30j932j71J888O13j598r28J196R90n00j147j23Q97Q44o75j324K52J713J50
2807A075j829n01J687R72j516j093J007J160l81j096k75R22Q19n10j342L9J635
$$ plain form
2824 773 1245 -477 -1328 115 1458 199 -1251 -586 930 819 -492 -952 -27 871 507 -855 -974
2841 -974 578 1215 -314 -1425 -63 1409 416 -1210 -676 946 927 -450 -954 26 933 526 -672
2858 -672 -938 454 1241 -80 -1364 -299 1394 611 -1211 -900 783 1089 -416 -1078 -126 902 531
2875 531 -647 -865 417 1197 83 -1325 -465 1330 767 -1051 -994 769 1106 -382 -1034 -101 937
2892 937 553 -617 -872 362 1125 120 -1187 -523 1136 739 -937 -1060 626 1129 -238 -1084 -108
2909 -108 894 451 -609 -734 260 986 195 -1009 -544 982 898 -681 -1090 494 1211 -118 -1069 -190
2927 -190 865 561 -505 -807 148 848 254 -907 -640 791 918 -461 -1070 228 1128 122 -956
2944 -956 -350 804 652 -391 -732 87 774 340 -656 -699 606 954 -316 -1069 96 1015 236 -915
$$ packed form
2824G73M72j722q51J443J343j259j450O65J516j11j311m60R25Q98l64j362j19
2841i74J552O37j529j111J362J472r93j626N34J622j9j377n04R80R07m07j198
2858f72k66J392P87j321j284J065J693p83j822L11J683L06j505o62R52J028l71
2875E31j178k18J282P80j114j408Q60J795n63j818N7J763L37j488o52R33J038
2892I37l84j170k55J234P63j005j307O64J659l97j676j23J686N03j367q46R76
2909a08J002m43j060j25R94P26p91j204M65J526q4j579m09J584P17j329r51Q79
2927a90J055l04j066l02R55P00n94j161K67J431J27j379o09J298R00j006j078
2944i56O06J154j52j043l41Q19O87m34r96m3J305L48j270p53J165R19p79j151
$$ plain form
2962 -915 -504 700 678 -318 -742 -25 715 384 -588 -690 467 932 -204 -1067 -137 1046 435 -907 -574
2981 -574 615 739 -186 -794 -51 731 468 -548 -779 251 934 8 -1064 -203 933 500 -809 -766
2999 -766 523 873 -193 -782 -100 655 480 -493 -706 196 948 127 -919 -363 893 662 -657 -793
3017 -793 482 934 -100 -839 -193 737 507 -469 -697 150 877 124 -842 -452 762 697 -578 -868 281
3036 281 889 -32 -792 -285 664 560 -393 -721 82 859 234 -791 -545 674 783 -475 -868 162 884
3055 884 7 -836 -314 614 524 -360 -662 28 756 213 -692 -492 562 760 -326 -847 143 891 163 -788
3075 -788 -417 588 576 -265 -676 7 640 317 -606 -573 464 726 -248 -836 -25 834 265 -700 -470 495
3095 495 614 -203 -701 -44 654 383 -496 -556 399 741 -118 -761 -181 790 378 -592 -524 427 633 -132 -668
$$ packed form
2962i15M11J204k2r96m24P17P40l31r72j02J157M65j136q63R30J183o11j342L33
2981e74J189J24r25o08P43P82k63j016k31J030O83r26j072Q61J136m33j309M3
2999g66J289L50j066n89O82P55j75r73k13R02P52q21j046N56J256k31j319j36
3017g93J275M52j034p39O46R30k30r76k28Q47P27p53r66L90J214o5j275k90J149
3036B81O08r21p60N07R49j04r53l28Q03P77o25j025K46J219J09j258l93J030P22
3055H84q77q43N22R28r0q84l02O90P28n43r05K00J054J98j086n21R90P48p28r51
3075g88L71J005j2q41m11O83O33l23r23L3J037K62r74n88Q11Q59n69r65K30R65
3095D95J19q17m98O57O98k71q79o0R55L42q59o43N80R71m12r70O8R51K06p65n36
$$ plain form
3116 -668 -102 565 397 -463 -616 223 709 -35 -785 -220 697 500 -580 -573 299 685 -19 -626 -266 534
3136 534 448 -337 -613 140 720 119 -707 -326 655 533 -466 -645 265 719 -18 -660 -230 539 403 -340
3156 -340 -613 54 691 167 -674 -409 602 580 -338 -606 212 713 113 -625 -319 534 490 -238 -626 58
3176 58 672 170 -620 -445 508 591 -254 -697 92 694 79 -644 -359 482 484 -274 -647 -1 653 241 -534
3197 -534 -497 442 680 -169 -698 22 677 233 -535 -394 362 471 -135 -520 -57 566 338 -535 -557 305 608
3218 608 -157 -654 -77 638 233 -470 -399 313 481 -134 -538 -106 521 291 -407 -490 239 605 -54 -582 -179
3239 -179 579 334 -434 -457 287 516 -33 -526 -206 490 325 -340 -548 145 547 50 -559 -216 602 387
3259 387 -365 -447 233 470 18 -489 -198 399 333 -285 -503 107 548 68 -576 -285 438 396 -381 -520 140
$$ packed form
3116f68N66O67j68q60j53Q39M86p44p50N65R17j97j080PQ72L86p04o07L60Q00
3136E34q6p85k76P53N80o01q26L81R81j22r99j79R10M54p37o42M30P69j36p43
3156c40k73O67O37n24q41K65J011k2r18k68Q18N01o00p38L06Q53m4p28l88O84
3176E8O14n02p90J75R53Q3q45m43P89O02o15p23K85Q41Kp58l73O46O54m12p75
3197e34L7R39K38q49n29P20O55m44p68J41P56J09o06l85M63O23k28q73k2Q62L03
3218F08p65m97N77P15m05p03P1P12J68o15m04M32O27k30o98q3P29L66o59n28M03
3239a79P58k45p68k3P44K29n49m93L20O96j65o65k08O93M02m97o09L43Q18k15
3259C87p52q2O80K37m52n07K91N97o6o18k18O10M41m80o44K91P23m2p77j39O60
$$ plain form
3280 140 501 87 -405 -257 410 415 -231 -471 31 587 184 -540 -338 400 458 -255 -562 107 507 129 -486
3301 -486 -338 284 447 -185 -564 -28 474 244 -422 -409 381 483 -251 -601 25 576 143 -399 -283 359
3321 359 430 -73 -501 -13 523 244 -470 -380 313 509 -119 -547 -18 478 179 -446 -378 286 412 -127 -452
3342 -452 -109 477 275 -369 -398 266 502 -78 -551 5 528 197 -384 -374 241 489 -47 -470 -135 468 276
3363 276 -333 -416 176 519 -25 -519 -149 447 226 -376 -359 146 398 -33 -424 -164 386 318 -340 -427 172
3384 172 447 0 -487 -122 437 339 -300 -352 149 411 -18 -419 -213 357 316 -193 -415 96 495 114 -398
3405 -398 -227 409 331 -312 -368 128 463 40 -371 -248 299 378 -150 -405 -30 431 139 -381 -245 338 358
3426 358 -219 -384 -1 404 108 -297 -241 245 320 -93 -382 -82 354 241 -393 -318 244 407 -97 -427 32
$$ packed form
3280A40L61m14m92J48O67No46k40N02N56m03p24K02P38N8p13l07O69M00l78o15
3301d86J48O22J63o32l79N36N02k30o66J3P90J02p34l50O26N51m33n42J16O42
3321C59P1n03m28M88N36k79p14R0O93J96o28m28N29M96k99o25O8O64J26n39l25
3342d52L43N86k02o44k9O64K36n80m73N56N23l31n81J0O15K48n36m23L35O03j92
3363B76o09q3N92L43n44m94L70N96k21o02J7N05K52m31l91K60N50o8o58q7N99
3384A72K75m47m87L65N59r8o39n2N01K62m29m01K06N70m1n09k22N11L99l81n12
3405c98J71O36p8o43n6M96L35m23m11J23N47P9n28k55L75M61k92n20J36N83K0
3426C58n77j65L83M05k96m05N6M86P5m13k89L00M36j13o34P5N62J63n04l30M59
$$ plain form
3447 32 426 215 -322 -244 236 344 -45 -377 -97 397 251 -341 -340 213 431 -78 -474 -120 388 132 -307
3468 -307 -314 201 415 36 -370 -148 405 282 -297 -384 167 444 -26 -414 -101 424 204 -289 -331 176 392
3489 392 33 -440 -189 347 304 -236 -389 127 479 62 -452 -187 352 257 -297 -322 152 388 35 -341 -167
3510 -167 331 310 -207 -352 47 455 99 -386 -192 325 292 -239 -358 92 326 104 -314 -171 245 371 -144
3531 -144 -378 45 397 65 -395 -206 336 339 -174 -307 98 308 55 -276 -154 210 253 -132 -395 35 376
3552 376 78 -372 -232 215 314 -123 -322 -24 316 58 -291 -169 199 272 -29 -335 -78 345 199 -239 -218
3573 -218 227 285 -73 -332 -22 292 106 -226 -206 144 232 -23 -338 -112 347 182 -246 -196 140 346 -51
3594 -51 -271 -28 275 142 -215 -257 112 296 42 -269 -163 251 270 -194 -329 96 355 65 -383 -94 274
$$ packed form
3447C2L94k11n37P8M80J08l89l32K80M94j46n92JN53K18n09l96L54N08k56m39
3468c07pN15K14l79m06K22N53j23n79q7N51K77m70l88L13N25k20m93m2N07K16
3489C92l59m73K51N36m3n40j53N16L52m17n14K65N39r5n54k5M74K36l53l76J74
3510a67M98k1n17j45L99M08l56m85J94N17l3n31j19M50K34k22m18J43M16J26n15
3531a44k34M23L52l32m60J89N42Ln13j33M05K10k53l31J22L64M3l85k63M30L41
3552C76k98m50J40M47R9m37j99K98L40k58l49J22L68P3l01l06K57M23j46m38K1
3573b18M45N8l58k59L10L14j86l32K0L50Q8k55l15K26M59j65m28N0L36K06l97
3594e1k20K43L03j33l57m2L69J84k54l11J06M14J9m64j35M25K59k90m48K89L68
$$ plain form
3615 274 185 -183 -250 116 329 58 -269 -164 229 268 -150 -313 29 369 36 -336 -179 260 205 -192 -291 80
3637 80 304 85 -254 -171 247 334 -168 -284 74 365 63 -315 -161 280 274 -164 -327 50 343 28 -322 -158
3659 -158 247 252 -99 -309 73 313 130 -329 -200 231 310 -142 -328 90 252 168 -276 -185 214 255 -94 -313
3681 -313 -21 329 152 -290 -179 224 275 -111 -327 41 271 71 -213 -196 190 278 -25 -265 -20 284 202
3702 202 -168 -217 153 270 -73 -273 4 291 149 -246 -221 100 292 -71 -297 -124 258 180 -258 -234 162
3723 162 271 -67 -293 -54 243 144 -197 -213 124 279 -35 -236 -126 204 227 -107 -285 74 303 -24 -259
3744 -259 -106 298 141 -193 -206 87 192 62 -186 -122 194 207 -104 -283 32 299 81 -205 -85 194 231
3765 231 -116 -166 66 224 69 -227 -155 155 254 -77 -272 42 278 35 -240 -156 242 232 -93 -302 22 273
$$ packed form
3615B74q9l68o7L66K13k71l27J05L93L9m18j63L42L40l33l72J57M39n5l97r9L71
3637H0K24k19l39Q3M18Q7n02j16L58K91l02l78J54M41om38j63L77K93l15l50J64
3659a58M05Nl51k10L82K40j83m59J29M31P9m52j86M18J62q4m44R1L99M1l49k19
3681c13K92L50j77m42J11M03N1l86k16L68K30k00k84J7L86Q8l03k40K45L04q2
3702B02l70m9L70J17l43k00K77K87j42l95K5L21J92l63k26J73L82p8m38K4L96
3723A62J09l38k26K39K97r9l41j6L37J55l14k01J10L30K3l34j78L59K29l27k35
3744b59J53M04j57l34j3K93J05j30k48O4L16J3l11j79L15K67k18k86J20K79L7
3765B31l47n0K32J58j55k96P2L10R9l31j95L14K36k43k75Q4L98j0l25k09L24K51
$$ plain form
3787 273 31 -228 -149 187 252 -21 -246 -75 254 87 -266 -200 189 266 -157 -230 43 241 87 -223 -134 160
3809 160 222 -15 -248 -17 227 125 -226 -212 110 257 -91 -271 -16 299 96 -198 -120 116 237 -34 -242
3830 -242 -72 253 203 -203 -178 233 289 -42 -273 -24 260 144 -237 -168 93 203 -33 -263 -142 194 186 -182
3852 -182 -238 127 287 11 -219 -59 262 118 -100 -136 117 255 10 -161 -31 162 151 -126 -218 77 276
3873 276 8 -265 -71 197 120 -158 -175 100 256 -20 -229 -96 195 148 -52 -228 -4 267 107 -204 -106
3894 -106 169 178 -126 -200 48 194 82 -140 -98 102 131 -107 -230 -22 220 100 -230 -118 109 213 -82 -180
3916 -180 4 158 88 -202 -164 107 245 -3 -191 -23 205 134 -199 -166 97 211 -64 -201 50 195 88
3937 88 -169 -137 90 168 -2 -209 -49 193 117 -145 -195 100 202 -48 -197 -68 174 93 -194 -155 87 173 18
$$ packed form
3787B73k42k59P9L36O5k73k25J71L29j67l53O6L89P7m23p3K73J98j54l10Q9K94
3809A60O2k37k33K31K44j02l51J4L22J47l48j80K55L15k03k94P8K36J21k71k08
3830b42J70L25n0m06K5M11N6l31k31K49K84j16l81O9K61J10k36k30J21L36ql68
3852a82n6L65J60k76k30J60L21j44k18l6K53J38k45j71J30J93j1k77r2K95J99
3873B76k68k73J94K68p7k78j7K75J56k76k09J33K91m7k00j76K24K71j60l11R8
3894a06K75Rl04p4K48J46j12k22M2K00K9k38j23K08K42j20l30J12K27J04k95r8
3916a80J84J54p0k90L8K71J38k48j88J68K28p1l33L3K63J14k75j37K51J45j07
3937H8k57L2K27P8j70k07J60K42p6k62n0K95J02k50j49J29K42q1k87L9K42Q6j55
$$ plain form
3960 18 -165 -82 156 142 -138 -196 102 249 -57 -199 -42 192 108 -103 -159 81 204 28 -199 -91 153 142
3982 142 -185 -191 112 229 52 -213 -67 193 147 -148 -198 58 164 48 -194 -86 185 210 -109 -217 23 255
4004 255 72 -180 -52 143 165 -75 -185 25 227 4 -188 -95 111 192 -127 -210 -1 204 36 -204 -41
4025 -41 140 165 -107 -173 63 200 45 -147 -86 127 207 -129 -192 0 233 -42 -181 -81 128 174 -138 -175 -13
4048 -13 191 2 -156 -98 110 183 -48 -178 32 179 106 -215 -118 129 120 -59 -167 -41 123 72 -136 -86 59
4071 59 145 15 -116 -62 134 130 -152 -132 100 225 -3 -141 -76 127 118 -131 -102 60 130 0 -210 -53 103 139
4095 139 -143 -132 47 263 -33 -193 -18 158 122 -125 -113 -14 183 -7 -211 -33 136 146 -99 -121 19 187
4117 187 35 -235 -109 115 128 -110 -195 56 110 26 -140 -143 138 111 -51 -184 39 225 -25 -208 -95 147
$$ packed form
3960A8j83Q3K38j4k80n8K98J47l06j42J57K34q4k11n6K40J23j76k27J08K44j1
3982A42l27oL03J17j77k65J46K60m6k95n0K56J06j16k42J08K71K5l19j08K40K32
4004B55j83k52J28J95K2k40j10K10K02k23j92R3K06Q1l19q3K09K05j68k40J63
4025d1J81K5k72o6K36J37j55j92O1K13Q0l36o3J92K33k75j39J00K09M6l12l7J62
4048a3K04j89j58N8K08P3k31j30K10J47p3l21R7K47rj79j08J26J64n1k08N0J45
4071E9Q6j30j31N4J96mk82K0K32J25k28j38O5K03rk49K9J62P0j30k10J57J56L6
4095A39k82J1J79K16k96j60J75J76l6k47J2R9J97j90k04J78J69J0k45k2J40J68
4117A87j52k70J26K24J3k38q5K51N4q4j66lK81k7j62j33K23J86k50j83J13K42
$$ plain form
4139 147 61 -95 -155 -27 150 19 -132 -98 149 143 -25 -232 6 203 32 -202 -123 128 146 -105 -162 12 139
4162 139 64 -216 -87 117 156 -47 -142 38 226 90 -154 -67 137 165 -55 -177 38 123 34 -139 -130 74 134
4185 134 18 -127 9 146 75 -178 -122 134 141 -94 -158 30 202 59 -99 -100 110 196 -35 -155 -11 168 81
4208 81 -168 -128 55 124 -58 -138 44 151 87 -131 -45 44 130 -53 -184 -80 95 68 -115 -127 104 194 21 -210
4232 -210 -87 123 53 -128 -131 128 188 -7 -112 -37 100 41 -111 -151 85 145 12 -148 -63 104 124 -144 -93 46
4256 46 134 47 -151 -77 62 126 -57 -192 -32 188 68 -110 -68 141 147 -83 -107 48 190 57 -148 -106 119
4279 119 147 -8 -140 30 145 64 -152 -115 104 119 -90 -195 28 160 37 -92 -112 131 94 15 -139 -39
4301 -39 170 79 -115 -109 74 154 -51 -174 55 127 24 -160 -101 76 155 14 -158 -9 106 100 -125 -86 52 134
$$ packed form
4139A47q6j56o0J28J77j31j51L4K47oj68k07K38J97j71k34P9K51J8k51n7J74J27
4162A39p5k80J29K04L9k03r5J80J88j36k44Q7K04K8k20j22K15Q5q9j73RK04O0
4185A34j16j45J36J37p1k53N6K56Pk35o4J88J72j43j58jK10Q6k31j20J44J79q7
4208H1k49M0J83O9j82q0J82J07o4k18Q6Q9Q6j83j31J04J75k7j83j2K31R0j73k31
4232b10J23K10p0j81lK59O0j95j05P5J37n9j52m0K36O0j33j60Q5J67K0k68N1J39
4256D6Q8q7j98P4J39O4j83j35J60K20j20j78M2K09Ok30k4J55J42j33k05M2K25
4279A19K8j55j32J70J15q1k16L7K19J5k09j05K23J32j23j29k0K43l7p9j54J00
4301c9K09r1j94OJ83Q0k05j23K29P2j03j84N9J77P9j41j72J49J15ok25L9J38Q2
$$ plain form
4325 134 -29 -134 -35 148 69 -123 -140 61 185 -15 -143 -45 164 100 -61 -127 70 196 50 -114 -17 150
4347 150 55 -125 -111 12 135 -68 -137 -49 135 93 -64 -114 59 181 -11 -101 -49 145 97 -51 -100 59 119 -6
4371 -6 -120 -85 116 116 -60 -153 76 130 -43 -176 -60 123 115 -58 -122 13 91 55 -108 -11 120 188 -20 -85 41
4396 41 109 13 -122 -60 79 121 -88 -91 18 108 50 -67 -53 110 90 -38 -168 23 146 47 -86 -114 87 111 -40
4421 -40 -138 -60 125 55 -88 -46 35 143 9 -176 12 130 39 -100 -46 82 147 -16 -142 -7 140 83 -73
4444 -73 -112 53 104 -25 -161 -51 153 149 -120 -95 37 113 14 -184 -15 103 85 -124 -77 58 155 -18 -155 -62
4468 -62 100 134 -67 -130 42 161 8 -155 -79 60 64 -108 -100 18 106 -16 -124 -43 111 74 -55 -98 60 180
4492 180 -21 -148 -43 103 102 -124 -88 61 132 42 -146 -57 126 67 -61 -120 17 118 -20 -120 -105 173 68
$$ packed form
4325A34j63j05R9J83p9j92j7K01J24k00j28R8K09o4j61o6J97J26j46j64R7J67
4347A50r5j80J4J23J23k03o9Q8J84m2j57n0J73J22j92r0N2J94m8j48m9J59O0j25
4371fj14L5K01%j76r3K29N4j73j33J16J83qj73o4J35P8l6j63R7J31O8k08o5J26
4396D1O8r6j35O2J39M2k09lJ09R0n8j17J4J63k0j28j30J91J23r9j33k8K01K4j51
4421d0r8P8J85p0j43M2Q1J08j34j85J88J18r1j39N4J28O5j63j26J35J47n7j56
4444g3l9J65N1j29j36J10K04mk69K5J32P6r9j98J69J18j8k09M7J35R7j73j37R3
4468f2J62L4k01o3J72J19j53j63P6J39Mj72QJ18Q8j22j08Q1J54l7j29m3J58J20
4492A80k01j27J05J46jk26L6J49P1r0j88Q9J83n9j28n9J37J01j38j00J5K78j05
$$ plain form
4515 68 -21 -136 60 117 55 -130 -40 111 93 -83 -114 -7 119 -1 -146 -105 120 104 -61 -119 23 120 38 -109
4539 -109 -66 67 97 30 -119 -13 97 36 -83 -33 91 101 -67 -86 -23 105 70 -104 -83 45 82 11 -101 -4
4563 -4 129 85 -89 -120 72 70 -61 -115 -4 85 69 -72 -82 21 103 -47 -127 -36 125 52 -81 -70 87 75 -7 -115
4589 -115 -12 111 54 -68 -103 29 93 -23 -111 -79 117 95 -48 -138 23 111 28 -107 -29 150 71 -50 -25 -8
$$ packed form
4515F8q9j15J96N7o2j85R0J51j8j76l1J07J26j20j45M1K25j6j65n8J42R7q2j47
4539a09M3J33L0o7j49J06J10o1j19N0J24J0j68j9O3J28l5j74K1J28L7p1j12R7
4563dJ33m4j74l1J92kj31n4J11Q9j6j41j0J03Q2j50q0R1J61p3j33J1J57j2q2j08
4589a15J03J23n7j22l5J32O4j16q8L2J96k2j43r0J61Q8q3j35P8J79p9j21K5J7
$$ [...]
8191A0
##END NTUPLES=NMR FID
##END=
