##TITLE=1H_LY-DMAA.Per.2.11
 CDCl3
 8 sc, 
 17.02.2022
##JCAMPDX= 6.0         $$ Bruker NMR JCAMP-DX V2.0
##DATA TYPE= NMR FID
##DATA CLASS= NTUPLES
##ORIGIN= UXNMR, Bruker Analytische Messtechnik GmbH
##OWNER= root
$$ XWIN-NMR		Version 3.5
$$ Thu Feb 17 09:43:10 2022 Russian Standard Time (UT+4h)  she@DPX200
##.OBSERVE FREQUENCY= 200.131346
##.OBSERVE NUCLEUS= ^1H
##.DELAY= (6, 6)
##.ACQUISITION MODE= SIMULTANEOUS
##.ACQUISITION SCHEME= undefined
##.AVERAGES= 8
##.DIGITISER RES= 18
##SPECTROMETER/DATA SYSTEM= spect
##.PULSE SEQUENCE= zg30
##.SOLVENT NAME= CDCl3
##.SHIFT REFERENCE= (INTERNAL, CDCl3, 0, 15.7039)
##AUDIT TRAIL= $$ (NUMBER, WHEN, WHO, WHERE, WHAT)
$$ ##TITLE= Audit trail, XWIN-NMR		Version 3.5
$$ ##JCAMPDX= 5.01
$$ ##ORIGIN= Bruker BioSpin GmbH
$$ ##OWNER= she
$$ F:/spectra/data/she/nmr/H-F/1/audita.txt
$$ ##AUDIT TRAIL=  $$ (NUMBER, WHEN, WHO, WHERE, WHAT)
(   1,<2022-02-17 09:41:39.20 +0400>,<she>,<DPX200>,
      <created by zg, POWCHK disabled, PULCHK disabled
       configuration hash MD5:
       00 E9 B6 7A A2 85 ED C7 34 08 36 98 17 FE 4E 26
       data hash MD5: 16K
       43 BA D7 21 E4 88 54 B0 39 21 BE 21 52 5B 8C A9>)
$$ ##END=
$$ 
$$ hash MD5
$$ A7 E1 29 4D 52 AF 22 32 10 3B 0D 4D 32 78 AD C3
##$RELAX= 
##$RELAX= 
##$RELAX= 
##$RELAX= 
##$RELAX= 
##$RELAX= 
$$ Bruker specific parameters
$$ --------------------------
##$DU= <F:/spectra>
##$EXPNO= 1
##$NAME= <H-F>
##$PROCNO= 1
##$TYPE= <nmr>
##$USER= <she>
##$AMP= (0..31)
100 100 100 100 100 100 100 100 100 100 100 100 100 100 100 100 100 100 
100 100 100 100 100 100 100 100 100 100 100 100 100 100 
##$AQSEQ= 0
##$AQ_mod= 1
##$AUNM= <au_zg>
##$AUTOPOS= <>
##$BF1= 200.13
##$BF2= 200.13
##$BF3= 200.13
##$BF4= 200.13
##$BF5= 200.13
##$BF6= 200.13
##$BF7= 200.13
##$BF8= 200.13
##$BYTORDA= 1
##$CFDGTYP= 0
##$CFRGTYP= 5
##$CHEMSTR= <none>
##$CNST= (0..31)
1 1 145 1 1 1 1 1 1 1 1 1 1 1 1 1 1 1 1 1 1 1 1 1 1 1 1 1 1 1 1 1 
##$CPDPRG= <>
##$CPDPRG1= <>
##$CPDPRG2= <>
##$CPDPRG3= <>
##$CPDPRG4= <mlev>
##$CPDPRG5= <mlev>
##$CPDPRG6= <mlev>
##$CPDPRG7= <mlev>
##$CPDPRG8= <mlev>
##$CPDPRGB= <>
##$CPDPRGT= <>
##$D= (0..31)
0 1.2 0 0 0 0 0 0 0 0.06 0 0.03 0 0 0 0 0.0002 0 0 0 0 0 0 0 0 0 0 0 0 
0 0 0 
##$DATE= 1645076498
##$DBL= (0..7)
120 120 120 120 120 120 120 120 
##$DBP= (0..7)
150 150 150 150 150 150 150 150 
##$DBP07= 0
##$DBPNAM0= <>
##$DBPNAM1= <>
##$DBPNAM2= <>
##$DBPNAM3= <>
##$DBPNAM4= <>
##$DBPNAM5= <>
##$DBPNAM6= <>
##$DBPNAM7= <>
##$DBPOAL= (0..7)
0.5 0.5 0.5 0.5 0.5 0.5 0.5 0.5 
##$DBPOFFS= (0..7)
0 0 0 0 0 0 0 0 
##$DE= 6
##$DECBNUC= <off>
##$DECIM= 32
##$DECNUC= <off>
##$DECSTAT= 4
##$DIGMOD= 1
##$DIGTYP= 9
##$DL= (0..7)
0 120 120 120 120 120 120 120 
##$DP= (0..7)
150 150 150 150 150 150 150 150 
##$DP07= 0
##$DPNAME0= <>
##$DPNAME1= <>
##$DPNAME2= <>
##$DPNAME3= <>
##$DPNAME4= <>
##$DPNAME5= <>
##$DPNAME6= <>
##$DPNAME7= <>
##$DPOAL= (0..7)
0.5 0.5 0.5 0.5 0.5 0.5 0.5 0.5 
##$DPOFFS= (0..7)
0 0 0 0 0 0 0 0 
##$DQDMODE= 0
##$DR= 18
##$DS= 0
$$ [...]
##$SUBNAM2= <"">
##$SUBNAM3= <"">
##$SUBNAM4= <"">
##$SUBNAM5= <"">
##$SUBNAM6= <"">
##$SUBNAM7= <"">
##$SUBNAM8= <"">
##$SUBNAM9= <"">
##$SW= 18.0517287032376
##$SWIBOX= (0..15)
0 0 2 0 0 0 0 0 0 0 0 0 0 0 0 0 
##$SW_h= 3612.71676300578
##$TD= 16384
##$TD0= 1
##$TE= 0
##$TE2= 300
##$TE3= 300
##$TEG= 300
##$TL= (0..7)
0 120 120 120 120 120 120 120 
##$TP= (0..7)
150 150 150 150 150 150 150 150 
##$TP07= 0
##$TPNAME0= <>
##$TPNAME1= <>
##$TPNAME2= <>
##$TPNAME3= <>
##$TPNAME4= <>
##$TPNAME5= <>
##$TPNAME6= <>
##$TPNAME7= <>
##$TPOAL= (0..7)
0.5 0.5 0.5 0.5 0.5 0.5 0.5 0.5 
##$TPOFFS= (0..7)
0 0 0 0 0 0 0 0 
##$TUNHIN= 0
##$TUNHOUT= 0
##$TUNXOUT= 0
##$USERA1= <user>
##$USERA2= <user>
##$USERA3= <user>
##$USERA4= <user>
##$USERA5= <user>
##$V9= 5
##$VALIST= <valist>
##$VCLIST= <CCCCCCCCCCCCCCC>
##$VD= 0
##$VDLIST= <DDDDDDDDDDDDDDD>
##$VPLIST= <PPPPPPPPPPPPPPP>
##$VTLIST= <TTTTTTTTTTTTTTT>
##$WBST= 1024
##$WBSW= 4
##$XGAIN= (0..3)
0 0 0 0 
##$XL= 0
##$YL= 0
##$YMAX_a= 364474
##$YMIN_a= -318465
##$ZGOPTNS= <>
##$ZL1= 120
##$ZL2= 120
##$ZL3= 120
##$ZL4= 120
##$ABSF1= 10
##$ABSF2= 0
##$ABSG= 5
##$ABSL= 3
##$ALPHA= 0
##$AQORDER= 0
##$ASSFAC= 0
##$ASSFACI= 0
##$ASSFACX= 0
##$ASSWID= 0
##$AUNMP= <proc_1d>
##$AZFE= 0.1
##$AZFW= 0.1
##$BCFW= 1
##$BC_mod= 2
##$BYTORDP= 1
##$COROFFS= 0
##$CY= 11.3945322036743
##$DATMOD= 1
##$DC= 2
##$DFILT= <>
##$DTYPP= 0
##$F1P= 2.36226072786647
##$F2P= -0.459571619588291
##$FCOR= 0.5
##$FTSIZE= 0
##$FT_mod= 4
##$GAMMA= 1
##$GB= 0.15
##$INTBC= 1
##$INTSCL= 1
##$ISEN= 128
##$LB= 0.24
##$LEV0= 0
##$LPBIN= 0
##$MAXI= 10000
##$MC2= 0
##$MEAN= 0
##$ME_mod= 0
##$MI= 1.114404
##$NCOEF= 0
##$NC_proc= 0
##$NLEV= 6
##$NOISF1= 3.799351
##$NOISF2= 2.8
##$NSP= 1
##$NTH_PI= 0
##$NZP= 0
##$OFFSET= 15.70392
##$PC= 1
##$PHC0= -16393.38
##$PHC1= 18.40078
##$PH_mod= 1
##$PKNL= yes
##$PPARMOD= 0
##$PSCAL= 0
##$PSIGN= 0
##$REVERSE= no
##$SF= 200.130013532006
##$SI= 16384
##$SIGF1= 3
##$SIGF2= 2
##$SINO= 400
##$SIOLD= 16384
##$SREGLST= <1H.CDCl3>
##$SSB= 0
##$STSI= 0
##$STSR= 0
##$SW_p= 3612.71676300578
##$SYMM= 0
##$S_DEV= 0
##$TDeff= 0
##$TDoff= 0
##$TI= <>
##$TILT= no
##$TM1= 0
##$TM2= 0
##$TOPLEV= 0
##$USERP1= <user>
##$USERP2= <user>
##$USERP3= <user>
##$USERP4= <user>
##$USERP5= <user>
##$WDW= 1
##$XDIM= 8192
##$YMAX_p= 0
##$YMIN_p= 0
$$ End of Bruker specific parameters
$$ ---------------------------------
##NTUPLES= NMR FID
##VAR_NAME=  TIME,          FID/REAL,        FID/IMAG
##SYMBOL=    X,             R,               I
##VAR_TYPE=  INDEPENDENT,   DEPENDENT,       DEPENDENT
##VAR_FORM=  AFFN,          ASDF,            ASDF
##VAR_DIM=   8192,          8192,            8192
##UNITS=     SECONDS,       ARBITRARY UNITS, ARBITRARY UNITS
##FACTOR=    0.0002768,     1,               1
##FIRST=     0,             0,               0
##LAST=      2.2672688,     0,               0
##MIN=       0,             -318465,         0
##MAX=       2.2672688,     364474,          0
$$ Real data points
##PAGE= N=1
##DATA TABLE= (X++(R..R)), XYDATA
$$ [...]
763A653m329M17M890k24m882J46M408K2l379j03K118R4n76%j069n1K454N2l608
782a967j42M248Q6m578O7M305k91l632N06K714r08j501J283J88j454J088J581
799A593k058j528K891J374l321r00L406L84l230K81K715r89k115J629J301k268
815h35m06K524l13k806R00K708j371k358J585J857j616j095J528K56j280O74J143
832A095j553p07K136N42k634l52K888K76k871l58K647M02k158m94J279O58n48
849B48p03m13O51J191n06j739J60K102L14k225p46K146J276j723j750J165K245
866A693m60k490j52K567O24k367j064J944J227j412j168O26R20J25n48j010J25
883h20J584N11k318r19K864J144l083j193L177J132l067p00K806K30k249K59J649
$$ plain form
763 1653 -2676 -2259 2631 2407 -2475 -2329 2079 2101 -1278 -1381 737 831 255 255 -814 -865 1589 1641 -1967
782 -1967 -2109 2139 2225 -2353 -2286 2019 1728 -1904 -1398 1316 408 -1093 190 378 -1076 12 1593
799 1593 -465 -1993 898 2272 -1049 -1949 1457 1841 -1389 -1108 1607 618 -1497 132 1433 -835
815 -835 -1241 1283 970 -1836 -936 1772 401 -1957 -372 1485 -131 -1226 302 558 -722 -48 1095
832 1095 -458 -1165 971 1513 -1121 -1473 1415 1691 -1180 -1538 1109 1511 -647 -1141 138 796 248
849 248 -455 -868 -217 974 468 -1271 -1111 991 1305 -920 -1666 480 1756 33 -1717 -552 1693
866 1693 1233 -1257 -1409 1158 1782 -585 -1649 295 1522 110 -1058 -432 488 613 65 -945 -820
883 -820 764 1275 -1043 -1962 902 2046 -1037 -2230 947 2079 -988 -1688 1118 1348 -901 -642 1007
900A007q30q01J261k8j607R10J629j887j510K605J240l375p40L835J18m033L53
917a853M046q47l650J296K882j395j932J543O93j380P33J113k058p22L268L53
933B090m191lM762m08m856N51M557p63l834Q64K651r44j276R03l62o78J765N72
951A400l076l42L987K89m580J25M594m10m058O71L238r07k126J225P45j386N29
968h2J395j707j336K667R15l180n03L414k02l272Q78K735j587k024K289J164k669
985a105l18K970m74k706R79K394j537j524J810M88j909O97J866k073j608L101
1001A051J427m019j158M470Q31m536n96M133K46l152k5J889l52k51P06j366j070
1018a772L046J398m299j668N238J974n677j976N443J836m653j677L504J152j925
$$ plain form
900 1007 177 -624 637 609 -998 -88 1541 -346 -1856 749 1989 -1386 -2126 1709 1827 -2206 -1853
917 -1853 2193 1346 -2304 -1008 1874 479 -1453 90 783 -597 136 1249 -809 -1531 1737 2090
933 2090 -2101 -2104 2658 2250 -2606 -2055 2502 1739 -2095 -1231 1420 476 -800 103 -259 -937 828 1400
951 1400 -1676 -2018 1969 2258 -2322 -2197 2397 1987 -2071 -1400 1838 931 -1195 30 775 -611 -82
968 -82 1313 -394 -1730 937 1852 -1328 -1831 1583 1381 -1891 -1013 1722 135 -1889 400 1564 -1105
985 -1105 -1423 1547 1073 -1633 -654 1740 203 -1321 489 977 -932 -235 1631 -442 -2050 1051
1001 1051 2478 -1541 -2699 1771 2602 -1934 -2530 1603 1849 -1303 -1328 561 209 -42 664 -702 -1772
1018 -1772 1274 2672 -1627 -3295 1943 3917 -1760 -3736 1707 3543 -1110 -2787 717 1869 -56
1033e6n59O9k18J717Q85l227j661M483K224n203k707N387L017n056k966M214K788
1050C131l006k183J562J470Pm33j570n62K867J551l783k511M253L127m389l467
1066c936L902L566l130l330K065K688q66j792l87P45J502M57k382j505K888K458
1082B943k971l076K798L387k169l388J411K972n02k363l56J434J081m22j581p07
1098a509J878J575j894k224J497K593r35k751L34K476M12j959r37J252J432l95
1114H45j581m74J532J231j205j720O99J903m4j932n33J509J185j057j678L68J788
1131H36L35j723r73J456J401r81j528K48J622L93j338q90Q15J438k38j666l90
1148a183J779R16j591j354J245J599p69j596J78J391L00r26q54L59J282lj380
$$ plain form
1033 -56 -615 -546 -764 953 1838 -1389 -3050 1433 3657 -1546 -4253 1134 4151 -905 -3871 343 3131
1050 3131 125 -2058 -496 974 981 548 -1022 -1584 1283 2834 -949 -3460 793 3920 -469 -3936
1066 -3936 -34 3532 402 -2928 -863 1825 959 -833 -1220 -475 1027 1484 -898 -2403 485 2943
1082 2943 -28 -3104 -306 3081 912 -2476 -1065 1907 1405 -958 -1314 120 1201 779 -802 -1509
1098 -1509 369 1944 50 -2174 -677 1916 981 -1770 -1436 1040 1452 -507 -1444 -192 1240 845
1114 845 -736 -1210 322 1553 348 -1372 -673 1230 1186 -746 -1279 230 1415 358 -1320 -952 836
1131 836 1171 -552 -1525 -69 1332 351 -1177 -929 693 1086 -252 -1142 -327 1111 873 -793 -1183
1148 -1183 596 1512 -79 -1433 -188 1411 642 -954 -776 615 915 -11 -865 -506 776 773 -607
1165f07o72J469J061j360j259J056J396o61j290K99J073R3p19l14K24O75K05q39
1183a70n66R35Q36r27j004Q95Q20p74p38O30M67n03k21K55K5j05K46o6m34L02
1203i7N32m79n29O42N65q39l41R24K32j000n7R89J1r50J04P72k89m72K48J88l61
1224b07K02K88n19l12P79L29j064l10J259K25j172j63J025K22q84q6O24L6k77
1243eJ03j14j39L83K52n98m58P42N46q47o21P90N60o11n97N27L63k38l29R8K22
1264B9k1Q4j21k05J61M03q8n45kO46J71o92k69O78L72o58m32M89M78l55m30J86
1286a21J55J1O6j53m19K39P17k73j074M07J285l95j399M00J375k74j225K00J003
1305E25j71m83R9K2j39O06J28j196j10J537J73j893k82K097L05k172k70J869K68
$$ plain form
1165 -607 -1279 190 1251 -109 -1368 -312 1084 423 -867 -568 505 598 -121 -435 -211 464 669 -170
1183 -170 -736 199 1035 108 -896 -1 819 45 -693 -63 404 -99 -320 -65 -40 -145 101 35 -399 -97
1203 -97 435 -44 -573 69 634 -205 -546 378 610 -390 -447 542 553 -397 -293 479 190 -282 -34 154 -207
1224 -207 -5 283 -236 -548 231 560 -504 -814 445 670 -502 -665 360 582 -302 -388 236 272 -5
1243 -5 98 -16 -155 228 480 -118 -576 166 712 -135 -756 34 594 -17 -614 -87 276 38 -291 -193 29
1264 29 8 92 -29 -234 -73 330 242 -303 -305 341 512 -180 -449 229 601 -57 -489 0 478 123 -307 -121
1286 -121 34 45 111 -42 -461 -222 495 222 -852 -445 840 445 -954 -554 821 547 -678 -478 525
1305 525 354 -129 -30 -8 -147 459 587 -609 -719 818 991 -902 -1184 913 1218 -954 -1224 645 913
1324I13j506j40R50L7k83J90m44l45J043N11j477p68J974R23k120r45K113R29
1342A555k008p46J606M92j179j72N71k24P2M78n99p84J031R63j330j022J563R82
1360A249j627q20J620N56j293l69J084J08p36J59L28l60J46L67m32m49P40L41
1378F12j043k72J155K39j348o8J244j0j062oQ55j7m87r7J99K30K94l39o37L82
1398a76J019m75j191M49J335m65j273K94J141j63q52N1L53J48O5l39p13O26J064
1417H98p38j295O96J552p26j551O69J350m88r83M15N00j90M1M1n46Q5J020k45
1436E05j415M00J585n45j535N36J344o24j028O55O12p03j11O85l13p53Q37O03
1454G35j080n19J264L94j272j46J237j91r51M92O57q65k18J052j21j293M61J347
$$ plain form
1324 913 -593 -733 217 254 -29 161 -283 -628 415 926 -551 -1319 655 1578 -542 -1487 626 1555
1342 1555 -453 -1199 407 899 -280 -452 119 -105 -33 445 -154 -938 93 1056 -274 -1296 267 1249
1360 1249 -378 -1198 422 978 -315 -684 400 508 -228 -69 259 -101 45 412 -20 -469 271 612
1378 612 -431 -703 452 691 -657 -725 519 509 -553 -559 296 279 -208 -305 -106 124 418 79 -558 -176
1398 -176 843 368 -823 -374 961 496 -777 -483 658 495 -357 -306 47 195 260 -79 -792 -166 898
1417 898 160 -1135 -439 1113 387 -1164 -495 855 367 -616 -201 299 109 150 191 -355 -270 750 505
1436 505 -910 -510 1075 530 -1005 -469 875 251 -777 -122 490 -213 -324 361 48 -705 132 735
1454 735 -345 -864 400 794 -478 -624 613 422 -529 -37 620 -245 -463 589 468 -825 -364 983
1472I83o98j247P35J101q19q15P92L66n65oM39n16j94R13j0j193J37J570l68j578
1492i73M60J530n00j236M01R61m31m63K55k5q1M50j60q07K17J258l88j469M22
1511e79J586m99j464M31J255l82q47J81N06P8j52j81l93M80P34n36j117O82J349
1530A132p09j493O02J498n49j327L30J024r9o66j15J56M02K54n78p13P05J178
1548A032p49j443P02J561m93j608L98J416j60j066j54O90L85k05n18l35N68Q47
1566H68o47j184M64J428l04j512J20J389J44j195l61Q30N16l59n51j23N83N10
1584F16l81q98K89J022Qj130k38J067N04r09o42N02Q27k33q19p1O00M36m78n90
1604e18J54P12J09o37l95M56O73k73q37M9R67K18r44n06R00O72o12p17K83O80
$$ plain form
1472 983 285 -962 -227 874 55 -760 32 398 -167 -173 266 -250 -444 469 459 -734 -597 973 605 -973
1492 -973 -513 1017 517 -719 -318 643 212 -251 4 -21 -102 348 188 -619 -402 856 468 -1001 -579
1511 -579 1007 508 -956 -525 730 348 -499 -318 188 266 114 -67 -460 20 754 218 -899 -217 1132
1530 1132 423 -1070 -468 1030 481 -846 -516 508 409 -257 -372 -216 186 440 -138 -851 -146 1032
1548 1032 283 -1160 -458 1103 610 -998 -600 816 656 -410 -564 126 511 306 -212 -547 21 868
1566 868 221 -963 -499 929 625 -887 -767 622 766 -429 -790 40 556 197 -354 -477 106 616
1584 616 235 -663 -374 648 656 -474 -712 355 859 -50 -692 -190 637 404 -415 -486 114 550 72 -518
1604 -518 -364 348 457 -180 -575 -119 554 281 -556 -507 460 678 -266 -772 128 800 188 -529 -246 434
1624D34j1n24k95K33N03J59p41n00Q31P98q74j068Q26J170o58j158M12J101k56
1643C82p82j4M56L25q1l65m76N50Q66m74j292M41J592m89j611M00J475k31j308
1662f36N2R98k6m44k36rK33N78k91r40J82J308o3j577k2J677J06j484j92J293
1682E07K15r61j66N02J02N0j20l82j23Q82J20j114k85J269K72j290k89J201K91
1701F81j010k91P75J74l87r9J25j03K09L12n16l23P14L57q07l13P74K72p36k62
1721d54P04R8n66O6L38j14k09K04j7k64J62L04k94k70L84J89l98l0M00J6m63L5
1743a79M94j69l67J68K67j07j72Q8O2j07J12k8k64N1M25j20m50m3N64L2m62j65
1765c70N14L5k52j74K54J71J9j70j90O9L10M9m16j35M13L50m35m43K90N13k04
$$ plain form
1624 434 423 -101 -396 -163 340 499 -242 -742 89 887 13 -1055 -229 941 283 -875 -463 638 382
1643 382 -400 -414 42 367 286 -79 -555 -5 861 387 -905 -464 1128 639 -972 -572 903 672 -636
1662 -636 -584 414 388 -56 -292 -301 -68 510 219 -721 -539 769 706 -871 -893 784 890 -594 -786 507
1682 507 722 -239 -405 97 199 249 129 -253 -376 506 626 -488 -773 496 768 -522 -811 390 681
1701 681 -329 -620 155 329 -58 -157 -32 -135 74 386 -130 -453 261 618 -189 -502 272 544 -192 -454
1721 -454 250 348 -218 -152 186 72 -137 67 50 -214 -52 252 -42 -312 72 261 -137 -167 233 249 -214 -179
1743 -179 315 146 -221 -53 214 107 -65 23 85 -22 90 62 -202 -151 274 154 -296 -339 225 257 -205 -370
1765 -370 144 179 -73 -247 7 178 197 27 -163 -94 216 265 -151 -286 127 477 42 -401 -111 402 198
1786A98n10j7N03J19l62k54J70L64ol20k84K84N49k02p05lR04J87r25k74Q19L91
1808F26n82n08M02L41rl32k25J88M30O6o64l96Q92N85r63p71R39Q69q15q94N96
1829b25P13l27m90J11K42J47J42l91m08M84P86n98j012O59J177o75j253N78J086
1848G46m60q86M01N70l18j14R7j99k4N52l7r35J56J143k65j153L05J188l26j112
1868f71M24Q65m39n91M88K19m07OM03l82k46N63K08p96j47R14rr56K00Q35k53
1889B28p97M56N77n40l87O15K57o75L7O00j78n01M53K20n01j91O87j55o19K34
1909a80P78n49o09O16M77o70l73N94K83n38j11L63l4k02K56kl49J10N17k31o40
1930d94M21O63n15n94N28M55l36m70K96K59j91Qo3r9J10L39k62m55L19M80l39
$$ plain form
1786 198 -312 -329 174 293 -69 -323 -153 211 205 -115 -399 -115 434 232 -473 -476 428 615 -310 -584 235 626
1808 626 44 -464 -62 279 270 -62 -287 -99 331 397 -267 -663 229 814 -149 -920 19 888 73 -821 -225
1829 -225 488 161 -329 -218 24 171 313 -78 -486 -2 784 186 -826 -167 1010 335 -918 -340 746
1848 746 286 -600 -199 371 53 -61 36 -163 -187 365 328 -607 -451 692 427 -726 -421 767 441 -671
1868 -671 -247 618 179 -412 76 295 -112 -106 297 -85 -331 232 440 -356 -503 411 402 -554 -354 481 228
1889 228 -569 -113 464 -76 -463 152 409 -266 -229 371 193 -308 145 365 -136 -327 360 205 -414 -180
1909 -180 598 49 -560 56 533 -137 -510 84 367 -171 -282 81 47 -155 101 99 -250 -140 377 146 -494
1930 -494 -73 590 75 -519 9 464 128 -342 -46 213 22 30 -33 -132 -22 317 55 -400 -81 399 60
1951F0n68L33N41k25n01J61L44j2j40q3oJ14K38j39l81J35N10j46n45Q5M80M3
1973B98m16o9J59J52j0j73j73N8L88n8m63p7O22J32n17k66M40L08j92l28J5L02
1995A32J89k24l98J50N31Q3p05j85N67L50m96n00L05N67m9n69k12M86L89k52n95
2016d36O0P23J00o31l30M73N98l50o44J16O86J60o02m34M90N62k77p02K3P38J99
2037E22o51m18M79N25k27o10k7N39K91m20n61L60O44j47p57k8P36K86o03l24L20
2058g1M76k12l68r1L15L50k26n12J05N52J18o32k80N91L44m79m10L05L89n4l41
2079a31j55K76K34l2m22m9L52K98m61k96L34M48k64m68K38L42pl21q2J33J58M3
2101A68l05o1J78K96k05l86K34L60q5m14jL47J03k51j76J64K57r8k11j04L03J04
$$ plain form
1951 60 -508 -175 366 141 -360 -199 145 133 -7 -90 -96 18 256 117 -264 -129 381 235 -310 -225 255 298
1973 298 -118 -187 -28 124 114 -59 -232 -174 214 156 -307 -384 238 370 -147 -413 27 335 143 -185 -170 132
1995 132 321 97 -301 -151 380 463 -242 -427 140 490 -6 -506 -201 366 317 -252 -464 22 411 159 -436
2016 -436 -376 347 447 -184 -514 -41 557 207 -437 -321 365 525 -77 -511 -21 541 264 -438 -415 323 522
2037 522 -129 -547 -68 457 230 -380 -407 132 423 3 -558 -198 446 299 -458 -486 250 536 -67 -391 -71
2058 -71 405 193 -175 -266 49 399 173 -339 -234 318 436 -196 -476 115 459 -20 -430 -125 264 210 -131
2079 -131 -286 -10 224 192 -230 -279 73 371 -90 -386 -52 396 132 -336 -98 244 237 -84 -166 -33 125 168
2101 168 -137 -198 -20 276 71 -315 -81 279 194 -220 -221 126 229 -22 -198 -34 223 125 -86 -190 113 217
2123B17j04k92R8K65o8k20m0J94J69k09k14Q9K25lk99l8K68Q9k09j75K36J84j45
2146A8k08K01J02Pp8j08J05J21o9r1j24K37L5k48n3K28P4j62j69K29M1j52o2R6
2170c0k0lM2ppJ3O5j29kJ33N9j77o9K38J1j58q3K03P5k08OJ11rmr4O5m5J6O8j51
2200i1n1K03O7k44k2K14M2k35K1J58M2j42NM3RJ6J1r5L1J42L0k12n5J65M3j42
2226d7k9M8J15j09k1m4O9M3lj27R9J34p3j22pJ64n3m0m0R9k1PL3n4p2J00M8j90
2254i3m0J76J16k07j74K56P0j59m8R7j05R9R7j34j12J58J53j43k60L03K30k69
2276A1j88K54J23j82m3K5N0o7P7j0j68M6K57r1l28K13K91k87k71K57K31k22j89
2299b11J69J16j16l2J21m9k6J45p2k47J70L36k87k30K12K47k46j70K05J81k12
$$ plain form
2123 217 113 -179 -81 184 116 -104 -144 50 219 10 -204 -115 110 107 -192 -230 38 127 -82 -257 -21 163 18
2146 18 -190 11 113 120 42 -66 39 160 91 0 -124 113 148 -100 -153 75 149 -13 -182 47 88 -64 -126 -30
2170 -30 -50 -53 -11 -18 -25 -12 53 -76 -78 55 114 -63 -132 106 117 -41 -124 79 154 -54 -48 63 54 50 -44 21 -24 -8 60 -91
2200 -91 -142 61 128 -116 -138 76 118 -117 -96 62 104 -38 -33 10 19 35 46 -49 -18 124 154 -58 -113 52 95 -47
2226 -47 -76 -28 87 -22 -43 -87 -18 25 22 -105 -6 128 55 -67 -74 90 37 -3 -43 56 35 42 75 21 -51 49 97 -93
2254 -93 -133 43 159 -48 -222 34 104 -55 -103 -6 -111 -12 85 -49 -161 -3 150 7 -253 50 280 11
2276 11 -177 77 200 18 -25 0 50 -17 60 50 -118 -72 185 94 -234 -21 270 -17 -288 -31 200 -22 -211
2299 -211 -42 74 -42 -74 47 -2 -28 117 45 -202 -32 304 17 -213 -1 246 0 -170 35 216 4
2320Dj64J85P3j22OK4j25J08J41j65j89K63J67k69j98K98L12m18j63K93J22j95
2342a2n9O0N2R2n3j44p1K19J57l38k26L94K93m20k95M28J70k88j75J80R3K6o5
2365A8j12m9J91J53k93k08L73K68l87l26M26L03l62k65K70K25k60n4Q7o4Q1J04
2387A19j46k85K59L57l49l25L26M15l29m07L02L00j63j98J21J17j14P2l9j67Q4
2408e0K82j28l47J74L99k60l70K39K84j89k84K05J83k15o5J17M1j14P0Q9j49m0
2430a28K62Jl41O6L47m3l42J37K00j5j81p1K18p0n6L0q2j8K31n6k36m8L10Q0l63
2455a68K0K04R7j94j24J40J11p4r2M1O0P5P0k60l9K86N4k87j36K34K21j91k19
2478a71P3K02l0j73j9O8J46m3j70RK01O3k32j41K31K31j73k37Q7K75j0k22j63
$$ plain form
2320 4 -160 25 98 -24 -18 6 -119 -11 130 -35 -224 39 206 -63 -261 37 349 -69 -232 61 183 -12
2342 -12 -71 -11 41 133 80 -64 -135 84 241 -97 -323 71 364 -56 -351 77 247 -41 -216 -36 57 83 18
2365 18 -94 -143 48 201 -92 -300 73 341 -46 -372 54 357 -5 -270 0 225 -35 -89 -2 -66 15 119
2387 119 -27 -312 -53 304 -45 -370 -44 371 42 -365 -63 237 74 -124 -3 114 0 72 33 -134 -50
2408 -50 232 104 -243 -69 330 70 -300 -61 223 34 -250 -45 138 -77 -142 -25 16 -98 -28 61 -88 -128
2430 -128 134 135 -206 -140 207 164 -178 -41 159 144 -37 -108 110 40 -16 14 -68 -86 145 89 -147 -195 115 195 -168
2455 -168 -148 56 153 -41 -165 -25 86 12 -80 -39 21 96 166 -94 -133 153 207 -80 -216 18 239 48 -171
2478 -171 -98 104 74 -99 -118 -50 96 53 -117 -108 93 156 -76 -217 14 245 72 -165 -78 197 187 -35 -198
2501a98K11J97j15k52L0K52R1k72k12K88J58j05k85OK97Q9k65j27K42J10r7k22
2523a79Q4K78rk24j23K14K18j46k37k5L13L4k63j19K18J62j08j97kK01L6j42j81
2546a97J75J70n0k76n7L33Q5k53k04K25K60j49k27P8K70Nj82j16Q0J67j9k26o1
2569a69K28K35k82k74K11K61m9l56K6K96O0k32j46J34J13J20k80r6K19K02j16
2590A05k89J2M08j0l94p3L06K03k76k33J82J24N7j32j34Q2K78p4l26o8L85J57
2612B90m19j51L16K17k17k40J33J60O7j65j10Q9K09n3k26n6K22J45k06k55J87
2633f3K92j50k99P9K31N4j54j49Q5J66N4k30r1J73J76j07k54R7K46j7k08q2K19
2656F8J54j87j72R1J64N3j84j26J35R4l1j25l2J11J22j88n2N0J82o6j25j3J30
$$ plain form
2501 -198 13 210 95 -157 -127 125 216 -56 -268 20 178 73 -212 -206 91 180 -85 -212 30 140 43 -179
2523 -179 -95 183 174 -50 -173 41 259 113 -124 -149 164 198 -65 -184 34 196 88 -109 -111 90 126 -16 -197
2546 -197 -22 148 98 -178 -235 98 183 -70 -274 -49 211 62 -165 -87 183 188 6 -110 -30 137 118 -108 -169
2569 -169 59 294 12 -262 -51 210 161 -195 -169 127 187 -45 -191 -57 56 176 -104 -200 19 221 105
2590 105 -184 -172 236 226 -168 -241 65 268 -8 -241 -59 65 122 -10 -144 -62 216 142 -184 -252 133 290
2612 290 -129 -280 36 253 36 -204 -71 89 156 -9 -119 -30 179 126 -100 -156 66 211 5 -250 -63
2633 -63 229 79 -220 -141 90 144 -10 -159 -74 92 146 -84 -175 -2 174 67 -187 -90 156 139 -69 -151 68
2656 68 222 35 -137 -46 118 171 -13 -139 -4 90 59 -66 -98 13 135 -53 -105 -55 127 61 -64 -77 53
2679E3K5m8j08N0Q3K1p4p2J09O0J7j55j1J12O8j30o0O0J21o4j60J8R1K1m1j4k6
2706e4O5K0Lj86J90P1kk11K4J31lo6nL6O8j0o2j4k2J16m0q7j2J14N5j69m5J63
2734F8O4j62rR4L2k3m8ll3R8j2r5o8J72M1r2j16J07P3n9n8L4J6N0q0j4n5M2R2
2763E6o3p8P9J16r3j19M3R3l0o5LO1JJ8l7j29J25J83q3j82K2K43m2k12N1J31m9
2790D3n2l8pR2N4p5j64J01J28l1j55m7K68Pj85n4J96k2j15J7L5M1K4n4n1J4J60
2817A30mk48N2J41Q8j83r1J10J32k33KJ10Pl8k4n9L3J33K1j56l3R9J73j89r4K15
2843I4L6q6j45Q9N9K2J7q4j9P9k7r8l3Q7J25j15q4O2O6k8r9N8N1qom3P0ok2K6
2873C8n7kO8Lp0MQ2m3m9J2L2NKl0l3M9KLp8L7K0K1n8N3n8oQ5qj3pN1l1Qn6M9n
$$ plain form
2679 53 78 30 -78 -28 55 76 2 -70 39 99 116 -39 -50 62 130 0 -60 0 121 57 -103 -85 6 27 -14 -28 -54
2706 -54 11 31 34 -152 38 109 107 -104 -80 51 48 -18 -23 13 81 71 9 -5 -27 89 49 -38 -50 64 119 -50 -95 68
2734 68 132 -30 -39 55 87 64 16 13 -20 78 66 -29 -97 75 116 24 -92 15 88 29 -29 5 21 71 -9 -23 -78 -36 56
2763 56 -7 -85 -6 110 17 -102 -59 34 4 -61 -58 3 4 22 -15 -144 -19 164 81 -101 -79 164 122 -90 -39 92 43
2790 43 -9 -47 -54 38 92 17 -147 -46 82 51 -104 -151 117 124 -61 -115 81 59 -56 -39 -4 37 61 7 -44 -30 130
2817 130 126 -122 -70 71 159 -24 -115 -5 127 -106 -104 6 13 -25 -49 -108 -75 58 79 -77 -110 -11 162 -27 -121 94
2843 94 130 44 -101 -12 47 69 86 2 -17 62 35 -63 -96 -9 116 1 -83 -21 45 17 -82 -24 27 19 13 -30 40 34 12 38
2873 38 -19 -21 47 50 -20 -16 66 23 -26 -14 18 23 25 -5 -38 11 13 16 -62 -25 -5 16 -42 11 -47 -53 32 24 11 4 55 24 32 -24 25 20
2909B0N5n5j7rK4K0m2m0m0J24q8l9Q4K2K7m0m7N5O6r0n3J1L4J15r5q3R4J9lj00
2939g1N6P7k0l2o1Q4J8o7qp5J09O7j03l4k2J20Jj39J6O3M2q0k1O8K4K1q6j4R7
2968C0M1o0n4KJ12k1n7r7J38J26q0j46O5N2J4o9n1J5J01l6j12N8J25j2j18j12
2994a46J22J55l7j20o9K06J3j25j27Q9J75o6j52m2J74L9j22q2P6J30o3p9l2R8
3018A5J7l4j45R9J06k9n9r3J24J25j63n7P0J81p2j67j6J97K6j18l3j3J14N9j70
3043c6k0P6O9p3j68J01J55k7j63l5J30J54j29j23M6R5Rj10l9J47N4r9p9k2J53
3068F6N4k01L8Q2J25j88m0K2J09M8j58n0R1J31p8j05L6J38m2j29n4J17L9Kj71
3093a18J13O6K3n8n3N4R2j17n9l6J38K8m9n4N9L8j1r5j1P2M2q7j6Q1Kj1n1j6N3
$$ plain form
2909 20 75 20 3 -6 18 38 -4 -44 -84 40 -48 -87 -3 19 46 6 -41 14 80 -10 -63 -52 -18 97 2 -81 13 32 29 -71
2939 -71 -15 62 42 10 -51 33 51 -16 -24 -99 10 77 -26 -60 -82 38 39 -100 -84 -21 21 -59 -80 -12 12 33 -53 -67 30
2968 30 71 11 -43 -41 71 50 -7 -104 34 160 80 -66 -1 51 65 -4 -55 -40 61 25 -87 -29 96 84 -34 -146
2994 -146 -24 131 94 -26 -95 111 124 -1 -128 -39 136 70 -82 -124 50 89 -33 -115 -39 91 28 -51 -83 15
3018 15 32 -2 -147 -48 58 29 -30 -123 1 126 -37 -94 -24 157 85 -82 -98 99 125 7 -26 -39 75 134 -36
3043 -36 -56 20 89 16 -152 -51 104 77 -86 -121 9 163 34 -89 -43 52 61 -49 -88 59 113 14 -65 -87 66
3068 66 120 -81 -43 39 164 -24 -64 -42 67 115 -43 -93 -2 129 51 -54 -18 120 78 -51 -105 12 51 53 -118
3093 -118 -5 61 84 26 -27 27 119 2 -57 -93 45 73 24 -30 29 67 56 -39 -50 22 64 -23 -39 42 44 33 -18 -34 19
3122A9M5p5j3J02o6L8n8J0M9Np1n6P1M7l4o0L6K6ko2kM0K8n8qM3K2j5l1m8J03
3153B5pL7m8MK5j8j3K4k5O0n4k2M9M7p7n0K2Q5op3j2M6ql0k3M3n4R7p0NRR2k9
3186E1q3M0L6N0r5K0k5L6l0k2M0j6N8l9l8%L9L8n6l6P8m3l1k3M9J7K6k0j9L9r
3217C2J2k8m3M2j3l9J1K4N1j6l5K1n6L9lk2R0l1o3MQ8k0mj8m1KO9m0j5l4P6m7
3249gJkQ2m7ql0j0Q1j01N8m3QP4p5p0P0K2Ok1lj8K7PKm8J6O0o1J5K3K4l1l6nJ08
3284F8j1j03N4J11j03lJJ1j0k2j7L7KROn9j2J8K8p4J5Q3M0j23K5J1R0j09M1j0
3314fl5MP7pp5N5K1j5n2P4k7Kp1J14J8l4l6lk8Nj2K1l6J8J5Ll2LK9n1O8k1N3m7
3348hnN1j7p1N2L6J1q7j7O7Oo1P9p5L4Nj4k9M4qJ6JK5Ok0qj7M3m6L5p5N5l8R6
$$ plain form
3122 19 64 -11 -24 78 12 50 -8 2 51 56 -15 -71 0 47 13 -47 -11 15 13 -49 -51 -11 17 -41 -49 -6 16 1 -30 -78 25
3153 25 18 55 7 11 36 18 5 29 4 64 10 -12 37 84 7 -43 -21 64 58 -15 -27 19 11 -19 -42 1 -53 44 -26 -21 -12 80 51
3186 51 -32 8 44 94 -1 19 -6 30 0 -22 18 2 60 21 -17 -17 22 60 4 -32 46 3 -28 -51 -2 15 41 21 2 41 32
3217 32 44 16 -27 15 2 -37 -26 -2 49 33 -2 19 -37 2 -1 -23 67 36 -27 -23 65 45 41 23 -18 -16 53 13 -2 -36 40 -7
3249 -7 -6 -8 74 27 19 -11 -21 60 -41 17 -26 -18 56 -19 -89 -19 3 9 -12 -15 -33 -6 1 3 -45 -29 31 -30 -15 8 32 1 -35 -40 68
3284 68 57 -46 8 119 16 13 14 25 15 -7 -24 13 15 24 30 -29 -41 -23 5 -69 -54 29 69 -54 -29 -18 72 -37 4 -6
3314 -6 -41 -37 40 33 -42 13 34 19 -33 41 14 16 -55 59 77 43 7 4 -24 -19 -31 -10 -46 -28 -13 -10 -42 -39 -10 -61 7 -14 39 -8
3348 -8 -13 38 21 -50 2 38 49 -38 -55 12 18 -43 36 -39 -5 0 -14 -43 1 -7 9 10 35 41 21 13 -4 39 -7 28 -47 8 -30 66
3382F6r1N2m0Nl5K5J4l9M3k4j1K4Ok4n4O3O7q5qL4L9j6l4n4N7K0M1k8k0M2Qm2
3414Ao8R0K1j8m5N6L7o0m0K4oK5l5m2N3m1P1Qn4k5J05l1o0K3N4Mo9PK5N9m4m7
3446b2kK5P7q7J2J9K2l0j8n3Q5K3l8k0N8N4j17k8n1J26m3kp8J04K8m3n2M5N0j
3476D3l2j49J02J16l5j21M9N3N4q5o1MJ25Kj23RP4Q1j41o3N1J58p6m5p2J12O8
3503I8j23K5QR6o3r6L0N4K7o1m9j3R2Qj08J3R4j5k1k2l6R2n0Lq6R7O6k3j34O0
3533c7J49l7q6q7J65K0l4o3KJ07k4o9q2Q0J14j02k2p0J62n4p6n2J29J9J8j27p0
3560a27J82L6j15n9M4J21k9j41M2P9M4o9r6J46K5l5j7j34J12K1m4nj2P3j2p8m0
3587h8R8O9q1m5K0P2k1o6m8J27N3q1p9M4O5k5n2l3Q6M8p4q5K0Q9Q2j13k3LN3k
$$ plain form
3382 66 -25 27 -13 -8 -43 -18 -4 -43 0 -24 -35 -11 -5 -29 -83 -20 47 -38 -46 -12 27 11 -23 -77 -20 0 41 13 -7 35 43 1
3414 1 -67 23 44 26 -19 37 74 14 -26 -2 -8 17 -18 -60 -7 -48 23 31 -23 -48 57 26 -34 -11 43 47 -22 -15 10 69 25 -22
3446 -22 -24 1 78 -9 3 22 44 14 -4 -57 28 51 13 -7 51 105 -12 -40 -91 35 -8 -10 -88 16 44 1 -51 -6 44 43
3476 43 11 -138 -36 80 45 -76 -27 26 80 -5 -66 -62 63 65 -58 -49 25 106 -35 -98 -47 111 35 -10 -82 30 98
3503 98 -25 0 8 104 41 -55 -25 29 56 -5 -54 -67 25 33 -75 -62 32 17 -4 -26 -62 30 -20 -17 -103 -6 60 37 -97 -37
3533 -37 112 75 -11 -98 67 87 53 -10 -8 99 75 6 -76 4 118 16 -6 -76 86 32 -44 -96 33 52 70 -57 -127
3560 -127 55 91 -24 -83 -39 82 53 -88 -46 33 77 8 -88 58 83 48 31 -103 9 30 -14 -19 -31 42 30 -48 -88
3587 -88 10 79 -2 -47 -27 45 24 -42 -90 37 90 9 -70 -26 39 14 -38 -71 15 63 -11 -96 -76 13 95 -18 -41 -38 15 13
3617A3j17M8R6N4j21m4J4J12n3J0k3L4Q2j19M2Rj0L9j18J8N7OL0j53P3Q5l1q2
3645d9jP2k0l4mk6Q4J4p5J4O1J3j4q4M7M9j4Jl2l6P6n0k2l5Q3l0O3m8L1JMj03
3677f4K5L1mj5l8M1l5R5ko4K0M5n5j9L4K9K1l9pp1M8P1mm9N3j2J2p2k4P1l5K2
3709Io8P3j6J8pKn3R7n6m2J8K1R1n5l7N1J1p1L2m3O1m7O1p6N4j3nml9O3l9mK8
3742A5m0J7J3j1%N9n5K6J2Oj1K8p4kk4N9J2m7K6J3K5p7n1M2L6K1k6m5L7j5K8j18
3774a21J14K5Ro3J0K8M7k1%l8N2K2o7NP1l0oRn2Q1j3r4MM3M2p2o2M8Q6k4Pq8P8
3807C0%m2l6m4J48l9K6p8J3N6m2k7l5J08krk6OL1M8j08QK5qj6pM1j9M5n0m0Q0
3839C7l4Pm1m3J31l9kpLn3J8M5j0qj3m8O8J2K3m6m7O7k7j0Pm0R0rp3P4JJ1l6j
$$ plain form
3617 13 -104 -56 40 94 -27 -71 -57 55 2 12 -11 23 105 -14 28 37 27 66 -52 -34 23 29 59 -94 -21 64 33 -49
3645 -49 -50 22 2 -32 -36 -62 22 36 -39 -25 36 49 35 -49 -2 47 33 34 2 -34 42 -8 -30 -65 18 -12 51 3 34 35 39 -64
3677 -64 -39 -8 -12 -27 -65 -24 -59 36 34 -30 -10 35 -20 -39 -5 24 45 6 -1 -72 -24 47 43 -6 47 35 47 -25 -49 22 -13 9
3709 9 -59 14 -2 16 9 11 -42 55 -1 -43 -25 -4 87 32 -5 46 57 -14 18 -25 36 -11 50 -26 28 15 10 6 -33 30 -9 -13 15
3742 15 -25 -8 5 -6 -6 53 -2 24 36 42 31 59 -15 -17 -41 18 30 -17 9 22 47 -30 -81 -39 -3 18 -8 -53 -16 -31 -3 -121
3774 -121 -7 18 27 -36 -26 2 49 28 28 -10 42 64 -3 2 73 43 37 46 -6 75 62 -32 -28 15 57 -15 -77 -29 57 33 40 -48 30
3807 30 30 -12 -48 -92 56 17 43 -35 -22 34 -8 -35 -70 38 36 27 1 7 38 86 -22 -14 11 3 -13 -20 21 2 47 -3 -43 37
3839 37 3 10 -31 -74 57 18 16 9 12 -41 -23 22 12 4 -9 -57 11 23 46 0 -47 20 -7 -17 -10 -50 40 31 -42 32 33 44 8 7
3873GJ6K7l1J6j4N8o6n5O5rL3m2j3R3o7Lmrj7K6m1M9K6p3j8N7m4OL7n5K5K7Ol
3907A6m8J8L9J5Nl5oL8m0nL1j6J8Lm2j8M4j4o9O2k7L8l0j6M9Qj0J1k5K1k8jM2
3940B8j3O1o6p2L4Q0N1q3n4M2K8Pl4o5O6Rql3lJ09k9n4k9J2O8q8K1L9rnRn9K6
3973a4M4l4o1N1K8O3j05JN7K3o1qM3M8k3p5l8N1L8j6k2l2J26p2k0J7nN1l4q1N4
4004fN0qm1QL1K9lo7L9K4m7l7l9N7N2n1j6j9Q9L0n8k4K5j1Kn4nP6RJ1k4n0P2o1
4038a7J8L9K1m2j0J1p0O0J6Lnrk5j7k1L1N5l3%m5k0Rj5M0qN4k2J8Jl0JN5m0oM1
4073C8l9l4L0K2Jj7K3jl3K3j9k4J2QQl8M4k3J5j3K1k4k4L2j7J5pO8p2k7J2J1j6
4106d5O4k4k7M5oJ0n1J6l5J3N5%oOn3Q6m3l7L0LO0n9lN1ol6l9O5m8O2k1l5o3J27
$$ plain form
3873 7 23 50 19 35 21 79 13 -42 23 14 47 5 -8 85 18 21 17 8 -9 17 -24 25 51 -22 -40 17 -27 -21 16 -39 -14 13 19 16
3907 16 -32 -14 25 40 45 10 4 42 2 -3 28 12 30 33 -9 -27 17 3 -66 -4 -31 7 -23 -39 10 18 8 19 -6 15 -13 -14 28
3940 28 15 76 10 -62 -28 52 103 20 -34 8 36 43 9 -56 10 19 11 -22 -25 84 55 1 -28 -16 52 -36 -15 24 15 10 19 -40 -14
3973 -14 30 -4 -65 -14 14 77 -28 -27 30 53 -8 -16 27 75 52 -23 -61 -10 28 12 -10 -42 84 12 -8 9 4 55 21 -60 -6
4004 -6 44 36 -5 3 34 63 60 -7 32 56 9 -28 -67 -10 42 -9 -25 -44 45 75 17 -7 18 7 9 -45 -50 26 35 46 22 -28 44 -17
4038 -17 1 40 61 19 9 20 -50 10 26 29 24 15 -10 -27 -48 -17 38 5 5 -40 -60 -51 -66 -26 -34 20 -2 16 17 -13 -12 43 3 -3 38
4073 38 -1 -35 -5 17 18 1 24 23 -10 13 -6 -30 -18 -10 -2 -40 4 -19 -4 -17 4 -20 -44 -12 -29 -14 -21 47 -25 -52 -40 -29 -45
4106 -45 19 -5 -32 13 7 17 -34 -18 -53 -40 15 15 9 15 -38 48 5 -32 -2 1 61 2 -1 50 44 8 -31 34 -14 48 27 -8 -71 56
4140E6l9j6j1j0M2p5L2pO3m5l9J6J7j0J3RJ4j1O4n9J5%l4N5m2k0O3L5q2KJKM3
4173D2l7j8M0L5n9j4K8K5j1o6N1k2KJJ2PNj6J9L5j18L9Pm3L3k1N3m0O7l3l2P5
4205D6mK0j9k1J0k1J2K8l9J4j7m9K6qO9p0M0n9O6J2k7k0K1J3qomj0jj9LL2k7j0
4239b7n0R7K3o9k9J6qP1l2L1j8OJ1m2K0J8N4k5m4L1k0Pj5oj2P7p9pM6nl4k4L0
4272hN7qn7k7L7N3o4l8k8J02k6N0m2J4NJ6o1pQ0k9k1l7Q3J2lk3l8N4m2j9kK3J8
4305B4lk7L6oj6l2k2N7M2m9Mm9L0J4j2k6L7l7lOL9M5l8J5m2J5O7n4mJ9k2L9p3
4338b6L4k1K4J5n3M0pj5l2K1N0l7M3l5k6RQK9qm4K1K9m0N2L8m9kj1o2L7J1K5k0
4371bK3N8m8j02Q6j4J4M3o6K7n7N2QJ3j9K3n9Lk6K6QM3l7j9j3k2N0J8j3Qk3K8
$$ plain form
4140 56 17 1 -10 -20 22 -53 -21 -28 35 -10 -49 -33 -16 -26 -13 -4 10 -1 63 4 19 19 -15 40 -2 -22 41 76 -6 -4 -3 -1 42
4173 42 5 -13 27 62 3 -11 17 42 31 -35 16 -6 -4 -3 9 16 21 5 24 59 -59 -20 -13 -56 -23 -44 9 -31 36 3 -29 46
4205 46 42 62 43 22 32 11 23 51 12 26 9 -40 -14 -22 47 -23 17 -42 24 36 9 -11 10 23 15 9 5 -5 -6 -25 -22 10 -17 -27
4239 -27 -77 20 43 -26 -55 -39 -47 24 -8 23 5 11 22 -20 0 18 72 47 3 34 14 21 6 0 -12 65 -14 -21 25 20 -14 -38 -8
4272 -8 49 41 -16 -43 -6 47 -17 -55 -83 19 -7 43 1 15 20 36 -25 -32 48 19 -2 -39 44 56 53 30 -8 46 4 -15 -17 6 24
4305 24 21 -6 30 24 8 -24 -46 11 53 4 8 -41 -11 3 -9 -35 2 -35 -38 -32 7 52 14 29 -13 2 69 15 11 30 8 47 -26
4338 -26 8 -13 11 26 -27 13 6 -9 -41 -20 30 -7 36 1 -25 -16 -8 21 13 -31 -10 19 -21 31 69 20 18 7 -55 -18 -7 18 -2
4371 -2 21 79 31 -71 15 1 15 58 -8 19 -38 14 22 35 16 39 -20 -17 -43 -17 -9 34 -3 -22 -35 -57 -7 11 -2 6 -17 11
4403A1K9q4pM8K6L5q0K6PO3p8K8J4J7pk6j1oK3k9P1p6M8jo6J9J3Rm6J2OPK1m0
4437b4L1PJ2j8J5oO5p3m1KL0OJ6m6L0J5J8n4OK6L7j3r4O0O2k2m8n8J04J0l0l4
4469iJ2N3J2n3l7K4O0o3n1K8L3j8K0l9L3M2m2l9L5J3j4k3L3L8l0Kn7N0k4j2M7
4500B4Jj1oMj0l6M3P6q6JqO1o3j3n2J12m4j3J5kM5j6n3k5O8L1o5l3L2N8n3m1L8
4533b1M3K8o2J2J0N9k6m5J8J9k3N6j04M9L4l7l2qM2K1m0L7m0k4N2m5Rk3J12j13
4563d2J5mRRN3p6LO5m8L8jl4O3n3j8K5K9Qk3n5L1J5K6n0J9NJ9l9M5j5k2pJ6l9
4597c3j6M7l6k2RO4L7o5J1L6M6m1j8J0k0j2jj4J9J0n0O4m1J1J7j5j2J4kJ7j5K4
4629B3J3ko8J2kj2K8L0l7M5k2ll6pL9k3k0m3P5J2j1L8j8qr3J01J1m5O7k8j4RJ2
$$ plain form
4403 11 40 -44 -51 -3 23 58 -22 4 11 74 -4 24 38 55 48 22 11 5 28 -1 70 -6 42 41 -25 -6 7 16 -30 -18 -12 -5 16 -24
4437 -24 7 14 26 8 23 17 82 9 -32 -30 0 6 22 -24 6 21 39 -15 -9 17 54 41 -53 7 69 47 -1 -59 45 55 25 -9
4469 -9 3 56 68 15 -22 2 62 -1 -52 -24 9 -9 11 -28 5 47 5 -34 1 14 0 -23 10 48 18 20 -37 13 -11 -23 24
4500 24 25 14 8 12 2 -34 9 85 -1 0 -8 53 -10 -23 -75 37 -7 -20 -5 -7 38 22 -31 -56 12 43 -22 -55 -23 35 -18 -59 -21
4533 -21 22 50 -12 0 10 69 43 -2 16 35 12 68 -36 13 47 10 -22 -30 12 33 -7 30 -10 -34 18 -27 -18 -41 71 -42
4563 -42 -27 -31 -22 -13 40 -36 -33 32 -16 22 21 -13 50 -3 -21 4 33 41 18 -37 -6 9 35 -15 4 9 28 -11 34 19 -3 -10 6 -33
4597 -33 -49 -2 -38 -60 -51 13 50 -15 -4 32 78 37 19 29 9 -3 -4 -18 1 11 -39 25 -16 -5 12 -3 -15 -1 -3 14 -1 23
4629 23 36 34 -34 -22 -24 -36 -8 22 -15 30 8 5 -31 -38 1 -22 -42 -85 -10 2 -9 29 11 3 -90 11 22 -23 44 16 2 11 23
4662B3j8JJ9k2J8l5L4k7N5L0j13Q8m5j1M0l8l3R8n4LQo1N4k9M5n7j3P6k4Rm5N
4694a9J9oO2q0J8N1l9K8J3k8mk9O7np8O8kPo5Rk2rM0N7l1k2rO2q6L6L3k9pl5K0
4729a5j7L8mllj2L6j3J8k6j0P9r5O0l0l3l2P2qQl2L8QmJ5k9J6K0m0P8q2Ml9O7
4763C0Ko5Q8q8N0k8K1K1J0m9k5P1j5k5k2RO8o9N8o2Pk9K0N5m0Rk0j7N6o5M8n%
4796aMLK7m0M3m9O3m9%K2Mj7K5m4L0j2mmmJ3o3J0L9n2O8l6MmP9l1l6J4OK8o3Q8
4832F1m3j2L4lo2L7N6m1m2M2n6L2j0M7k6K0Jm1oK9J5p2M2K1j1k7Qj3J4n1P9j5
4864Gl2N9o0K5M1m3K3kj2L8o4K7k5M0Lj4L8n4M3m4K6j6L7o4J9J9lk1K7j3O0o2
4896CM4n6K3k9K9j4j8rJ3j1KJ0J3j0L6l7j0nN8j9j8N0l8QN2m6PJ7J7n6j7M4l9
$$ plain form
4662 23 5 6 25 3 21 -14 20 -7 48 78 -35 53 8 -3 37 -1 -34 64 10 13 21 -40 14 -15 30 -27 -40 36 12 21 -24 -19
4694 -19 0 -6 56 -24 -6 45 6 34 47 19 15 -14 53 48 -30 38 36 43 -22 -13 -35 -44 -4 53 22 0 -9 53 -33 3 36 7 0 -35 -15
4729 -15 -32 6 2 -1 -4 -16 20 7 25 -1 -11 68 -27 33 3 -30 -62 10 2 10 -22 16 24 20 35 6 22 42 2 80 -2 2 -37 30
4763 30 32 -33 55 -33 17 -11 10 31 41 -8 -33 38 23 -2 -24 -15 53 -16 42 -20 -13 -42 -22 33 -7 2 -18 -35 21 -44 4 -1 -1
4796 -1 3 6 33 -7 36 -13 50 1 1 23 27 10 35 -9 21 9 5 1 -3 10 -53 -43 -4 -56 12 -24 -20 -24 55 24 -12 2 8 36 -27 61
4832 61 18 6 40 37 -25 12 68 27 -15 27 -29 3 -7 40 14 34 35 -6 -12 17 32 -40 2 23 12 -15 -7 -20 -6 -57 22 7
4864 7 -25 34 -26 -1 40 -3 20 18 6 44 -20 7 -18 22 25 11 49 -5 38 -6 20 4 41 -23 -4 15 12 -9 18 5 65 3
4896 3 47 -9 14 -15 14 0 -18 -27 -14 -25 -23 -13 0 -10 26 -11 -21 -26 32 13 -5 45 7 15 67 21 28 45 62 6 -11 33 -6
4929fJ7J2mk8O4n2KJ0l1k2P2qk6ll8L4lL2j9j4kL1rM0l6K0l1M9K0r6K6J1M3k2
4963C3l1M2o2nN4oJ1k5K0Nk8L9m8OKO2r8Nl7R1l7j8k9K7oK3o5Q4l2oJ5M9j2J5
4997C8m1J2m%J7l0j6K6%k3R4o3j1J9K3n7Q8q9K7J7J9n0l5J4K0K5j6kk9K9Rol2
5030b7L8J0k9J0k3k0P7k0k6NL8j0n1J5L7j2Mk6L2Rj6k8L6K5n6K3Ool1k0O2nm5
5063b4NJ1j4L4lj4K9l2k9K9J3l4K4J4k6L1O0j02R1np7J6K0n6K6Q0p2kj5j9J2K0
5095il4Q9m3pm8M1K0nj6L4k0l0O7j7k4L8ok7J7j1k1lj3P1p1l0P2L6l7N2o9j7M4
5128B3J3mKMj9l7k1M3kl4Q8j9l3J8k0k6K1K2k5K2l7K5l8O6j01O6n1M1k6K9Lm6
5160e3N3j9K9j5N6o8oM9o2OP5k8NJL0q2Q9p9%LQk3j9P8m2K6k2JJ5j8K6j0J1k3
$$ plain form
4929 -6 11 23 19 -9 55 3 5 15 -16 -38 34 26 0 -3 -41 -7 -10 22 3 -11 -13 18 9 49 13 33 2 51 71 -25 1 12 55 33
4963 33 2 44 -18 -23 31 25 36 11 31 36 8 47 -1 5 7 69 -29 -24 -61 30 -7 -25 -54 -27 -33 -10 -75 9 -23 -29 -14 35 23 38
4997 38 -3 9 5 5 22 -8 -24 2 2 -21 73 10 -1 18 41 -16 72 -17 10 27 46 -4 -39 -25 -5 20 4 2 -27 2 11 5 -27
5030 -27 11 21 -8 2 -21 -41 36 16 -10 -5 33 23 -28 -13 24 12 16 -10 22 31 15 -13 23 48 -8 15 21 15 -16 -36 26 21 -24
5063 -24 -19 -8 -22 12 9 -5 24 -8 -37 -8 5 -29 -5 9 -17 14 74 -28 63 58 -19 -3 17 -39 -13 67 -5 -7 -22 -41 -29 -9
5095 -9 -43 46 3 -4 -52 -11 9 4 -12 22 2 -28 39 22 -2 36 30 3 20 9 -12 -15 -28 43 -28 -58 14 50 13 65 -4 -21 23
5128 23 36 32 34 38 19 -18 -39 4 2 -32 56 37 4 22 2 -24 -3 19 -6 16 -21 4 -34 32 -69 -3 -54 -13 -39 -10 -7 -53
5160 -53 0 -19 10 -5 51 -17 -23 26 -36 -30 45 17 22 23 53 -29 60 -19 -19 -16 -8 -31 -50 28 -14 12 -10 -9 6 -12 14 4 15 -8
5194hmM3O3j05j1M5nL2m8n7M1J0J8n1P3j2n7PKl3O6ol8O3p8K8K9Ok5RQ5j05L7
5227A4Rn4RRl2N9J6m6K3%rJ2j1LQrk2kJ0N5l5j0J4J8m8j4K6m7L9J7l1K4M5k5l4
5262a9N8m5L8o1J6%N1pk3j9j1J3Oj5rP0n8J9k3oj6k9O7j9N2l9k2L0Qj3j8M5k6
5295elL6l7j8Q7m1kj2k7J5j6J0K1ol8N0j3j2M4j3r3L8L6J8o2M3j0LqM7p8R1j0
5328C5p7Q0OJ6n9K2k3L8Jj2l0JL4J2n8P0q5L0Ln6J4m5P7K6o4K7m3P1J8n9J7qM0
5361A9J6JKLj0o8M5l8l7O9pK1l9M7n2J3M6Pl3Q1o2j3K7l9N9j1m6K3J6l6J9n6N5
5394B2j0j6j4J7K0j0l4K7m2O0l6J9QJ8p%j5K1j6j9J0J8rn1R6k0j3l9J2RL0k7N5
5427F4q6jRM4p4N6k2N1r5L9kJ8l2J7J3k4j5N1k9j8N9o9Q0p3LM5j9L4Ll5l6j4N3
$$ plain form
5194 -8 -12 31 94 -11 -22 23 18 50 2 -55 -14 -4 14 -37 36 24 -33 -26 -24 -57 9 3 -35 28 -50 -22 7 13 -12 -3 82 -23 14
5227 14 23 -31 -22 -13 -45 14 30 -16 7 7 -2 10 -1 2 10 1 -21 -23 -13 42 7 -3 11 29 -19 -33 -7 -54 -15 2 -29 -5 40 15 -19
5262 -19 39 -6 32 -29 -13 -13 38 31 8 -11 -22 -9 -3 -18 -27 43 -15 4 -19 -25 -41 -70 -3 -22 30 -9 -31 -1 7 -6 -24 21 -5
5295 -5 -8 28 -9 -27 60 19 17 5 -22 -7 -23 -13 8 2 -36 14 1 -11 33 20 -73 -35 1 19 -43 0 -10 -7 -15 32 -46 45 35
5328 35 -42 38 44 60 1 23 0 38 39 27 -3 -2 32 44 -14 56 -29 1 4 -52 -38 -83 -6 20 -44 -17 -60 11 29 -30 -13 -21 19
5361 19 35 36 38 41 31 -37 8 -30 -67 2 -5 16 -23 24 -28 -15 31 38 5 86 24 11 38 -1 58 47 1 24 40 4 23 -33 22
5394 22 12 -4 -18 -1 19 9 -25 2 -40 20 -16 3 11 29 22 22 7 28 12 -7 3 21 12 -39 57 37 24 -15 -3 6 36 9 64
5427 64 -22 -23 -14 30 -44 12 -10 41 -54 -15 -17 1 -31 -14 -1 -25 -40 11 -18 -36 23 -46 34 -39 -36 9 -10 24 27 -8 -44 -58 -5
5460eO3on8J6J3Pj9k4J3K8Mm2Q4n4j1l0K2K8j3j7J7l4m4J8J2J9L4n8O2l8%kM1
5493B6j5l9J7j2M6j7m6P4Mo5oK6j8O5l6k3L7mM7r1O6m3R5r4Kj0j1K8Kn1P1o7L4
5526hM7j25N1J8L2l5M7l5K8m3JJ02n1m8kO3n7N8k4n2K0P7j04J4N1K2m7LJ8Qn0
5557b1j5M5ql1nL4J4l5j5j1N1L4q7N1mM3m5j2OnK9l8K6k0k0O0j8Ql2L7kJ2j5Q
5591A9kl0L8l4J9Rj4l0RL4J8r5M1J3l2K8p3R9n5J7K2K2n2j9jM5N3o3J4K5J2l4
5623CkKn3J00n3K9k5j0M4l4J4J7O3k6m7j7j6K5j2O0p0Rk5J5J4pL0l8j5M2k8J5
5655Dm0M8m1ml0L1J1pJ02r9j0M8m2O0m3m3N2k0K2L5j7L9n0lK2m4J9l2R9m3k0M7
5687E1n5L4k3mk3K5k3L5rm5K9L9m0K9l8LJ1j1M5p4L5Pk0L6j7J6qJ5J6o0O5Ln3
$$ plain form
5460 -5 58 52 -6 10 23 30 11 -13 0 28 32 -10 74 20 9 -21 1 29 16 -1 16 -18 -62 -44 -32 -13 21 -37 25 -13 -13 -15 26
5493 26 11 -28 -11 -23 23 6 -40 34 38 -27 -33 -7 -25 40 4 -19 18 14 61 -30 36 -7 88 -6 -4 -14 -25 3 5 -46 25 -42 -8
5526 -8 39 -86 -35 -17 15 -20 27 -8 20 -23 -22 80 29 -19 -21 42 -15 43 19 -33 -13 64 -40 -26 25 47 0 3 21 29 -21
5557 -21 -36 9 1 -30 -35 -1 13 -22 -37 -48 3 37 -50 1 -3 40 -5 -17 -11 -16 13 -25 1 -19 -39 21 3 11 -21 16 14 26 11 19
5591 19 17 -13 25 -9 10 19 5 -25 -16 18 36 -59 -18 -5 -37 -9 -82 17 -38 -21 1 23 -29 -48 -49 -4 49 -14 0 25 37 3
5623 3 1 3 -50 50 -3 26 1 -9 35 1 15 32 95 69 22 5 -11 14 2 62 -8 1 -24 -9 5 -2 28 -10 -25 17 -11 4
5655 4 -36 12 -29 -33 -63 -32 -21 -28 74 -25 -35 13 -29 31 -12 -55 -3 -23 -1 34 17 56 6 3 25 -19 0 -32 67 24 4 51
5687 51 -4 30 7 3 -20 5 -18 17 8 -37 -8 31 -9 20 -18 -15 -4 -15 30 -44 -9 -2 -22 14 -3 13 5 20 36 -24 41 44 -9
5720ij6K4m5M3N5m7%K8nk7L5j4m8N8J2p8N5k7K0J6o1N2om2K3l7L6j7jL7j9k7N6
5753B4M1p9K2j6L8j1J1L1j09J31l6n7M7Mq1M2M4j2j2K6k9l2L1%n2mM6J4l4kJ2
5784bj9N2pj9Pj9K7Kj7K5q5P4MoLl2L4k9J9nk6O7n1k5K7nJ3k8J4K7l9L4lj9nm
5820a6L4k5m9N6KL6m0j5K4k8Q3r5QQN4j3j1k5K4MN9p3j1K6l3O2o3K6j5J1m6O8
5852B7n1j0M0J9j1l5K8m6O0j7J9l8NM7q1L5Ol%j9J6pK8n5O8l4L2lNl9R3l7m3n
5886fKM2K4r5RM9l4j0J9QJ7l2j9N4k1l8L1J8j4O1p8J4m0L3j3M4k2j5M1l7L0j0
5918A2m2lK8L0l4L5j8LJJ1j6K4j7QJ8n0K1k0j5QLM0m5KNk0K2j5j5L2Mm3JL2NK9
5954B1j8J8l3Q3p7j6M0k2lM8k1J4k4qM5Nl7Jj5J2o0M1m6N5n5K6L6Pj6m5j2O9L2
$$ plain form
5720 -9 -25 -1 -46 -3 52 5 5 33 28 1 36 22 -26 32 44 -34 21 -6 14 30 -31 21 15 -27 -4 -41 -5 -22 -23 14 -5 -32 24
5753 24 65 -14 8 -8 30 19 30 61 -48 83 47 -10 37 41 -40 2 46 34 22 48 19 -13 18 18 -34 -38 8 22 -12 -14 -2
5784 -2 -21 31 24 5 12 -7 20 22 5 30 -55 19 23 17 20 -12 22 -7 12 7 -19 48 -3 -28 -1 -6 7 -21 -7 20 -19 15 12 -7 -12 -16
5820 -16 18 -7 -56 0 2 38 -2 -17 7 -21 62 -33 -25 -17 37 24 13 -12 12 16 75 2 -9 17 -16 46 -17 9 -6 5 -41 27
5852 27 -24 -34 6 25 14 -21 7 -39 21 4 23 -15 -10 37 -44 -9 -3 -6 -6 -25 -9 -16 12 -43 25 -9 23 20 25 -14 79 42 -1 -6
5886 -6 -4 38 62 -33 -24 25 -9 -19 0 8 25 -7 -26 28 7 -31 0 18 4 65 -13 1 -39 -6 -19 25 3 -12 29 -8 22 12
5918 12 -30 -33 -5 25 -9 26 8 11 12 23 7 31 14 22 40 -10 11 -9 -24 -16 -13 27 -18 -16 -11 -31 -9 -24 -39 -7 -3 -46 -45 -13 -8 21
5954 21 3 21 -12 71 -6 -22 18 -4 -7 41 20 34 10 2 47 52 15 16 1 13 -47 -6 -52 3 -52 -26 10 17 1 -44 -56 13 45
5987D5l0J7n2O7m8o0P4lm3R4m7Nk9K9Rj5j2j4K7J7k5J3j5J9L6m5j4k0N9kkj4o8
6020d7O2j7J1k9R2q5QnJ7j1J6K0j2l3K8J3q3M5j7L1k1L3ql6P4o5rL9J5K9m5m0
6052c0M8oj1rK7M4k4m7M8J7m9L7J7q3KJ9k8J2M2j6J0n3O8n7M4J8l1L6p3NK0m3
6084d6j4O2l8M7J4k0J6j14P4K8j0L9m2N5p1P7p6M5mk4P0j25O8o3M5j5Mk2N5m4
6114b9lL5j6K3m0J9N4j2m8J6k3L0J8J4o0J7L0nk7K3M7l9k1L0k5qL3m1lj8M7j9
6146aL5k5K2k8l9M4j8O8l8Jp1K7K9K4o0rN1j7N4k5K2n4n3J00n0J2K3m4K3N4p2
6177a5QK2mL3j6J7%l8L5N2o5l9l0N6j3n2L9k5K5Q0j18MJ3Q6m4k6K3j6K8j5qk8
6209c1L1N3o5QL5k7j7LJL5l9oK7k%M2p7M5jjK6o1M1m0O7n3M6p4KM3n3L0J4k1J01
$$ plain form
5987 45 15 32 -20 47 -1 -61 13 10 -33 61 14 19 -10 19 28 13 1 -13 14 31 6 19 4 23 59 14 0 -20 39 37 35 21 -47
6020 -47 15 -2 9 -20 72 -13 -5 -10 7 -4 12 32 20 -13 15 28 -55 -10 -27 4 -17 16 8 -28 46 -19 -28 11 26 55 10 -30
6052 -30 18 12 1 -8 19 63 39 -8 40 57 8 45 62 -21 -19 0 -28 -16 26 10 20 -33 35 -22 22 40 9 45 -28 -23 -3 -46
6084 -46 -60 2 -36 11 25 5 21 -93 -19 9 -1 38 -4 51 -20 57 -19 26 22 -2 68 -57 11 -52 -7 -22 -18 -40 15 -29
6114 -29 -32 3 -13 10 -30 -11 43 31 -17 -1 -24 6 24 38 -22 -5 25 20 -7 16 63 24 3 33 8 0 33 -8 -11 -29 18 -1
6146 -1 34 9 31 3 -36 8 -10 58 20 21 -50 -23 6 30 -30 -39 12 -5 49 24 46 -8 -61 39 -11 1 24 -20 3 57 -15
6177 -15 -7 15 11 44 28 45 45 7 42 94 29 -10 -40 16 3 -49 -10 -35 -10 70 -48 -44 -31 55 11 -15 8 -8 20 5 -3 -31
6209 -31 0 53 -12 -4 31 4 -13 -10 -9 26 -13 -19 8 6 6 48 -29 16 15 14 40 -21 20 -20 47 -6 40 -34 -32 11 -42 -12 2 -19 82
6244H2j02M1k3l9k6J12jp0N2m1k3K8M3l4pK2oQ0p8k1O8k0ln9J3K5J4oK6k9L9q3
6276b6L0N6m0m5j2K8j0L0n4KM1L6k1l0J5j0j7L4qL2k7lk1jK1K9l8j9J21o7Jk7
6308@K0n1L3J9j0m8L6k1J2K9m1j7L8nL2l0qK3k5M3J7m4L1l9J4m4N1M0o7K0j9L8
6340B7k4oj3K2J2N5j1m0J8m7K5J4m6K2M0p4P1LJ1r4N8J4j5kl8Nj4RJ5J9K5m1L5
6373C5l5L3j06L6M4j6L5pK0k9J5pm7P0l8m9M5MnL7k1J4J3m1K9K1n0Nk1L6j1K0
6405B9n4J9%L4j0Qnk3P4r8m6O3K4m6M6Pn7J7k3J2N2K5k3n3O2l2k3mK6nj1K4K2
6438C1j8n2j3j9Q6J8k0n3J3J6J5n1K3M2j6m2J8M9n5N7j8j3j6O9k6l6L0q2J8J5
6468c0J9M0L2o7J6Ql8Q3k3Qm6pJ9j4k1J1JoP8o9j3J0K5l1lK3j8l6P2m4M1k6J0
$$ plain form
6244 82 -20 21 -2 -41 -67 45 44 -26 26 -15 -38 -10 33 -1 -8 14 8 88 10 -11 57 37 34 -25 -12 13 27 21 47 18 57 -26
6276 -26 4 60 20 -25 -37 -9 -19 11 -43 -41 0 36 15 -15 0 -10 -27 7 -1 31 4 1 -20 -21 0 29 -9 -28 93 26 27 0
6308 0 20 -31 2 21 11 -37 -1 -22 -10 19 -22 -39 -1 -6 26 -4 -12 11 -14 29 46 2 33 -6 8 -36 15 55 -12 8 -11 27
6340 27 3 -3 -16 6 18 73 62 22 40 -7 18 32 -14 8 48 -26 45 48 59 -35 23 37 22 20 -18 -13 -27 -18 -3 16 41 0 35
6373 35 0 33 -73 -37 7 -9 26 19 39 10 25 18 -29 41 3 -46 -1 3 -2 35 14 28 41 0 29 50 0 5 -16 20 9 29
6405 29 -25 -6 -6 28 18 26 21 -2 72 -26 -72 -9 15 -31 15 22 -35 -18 -41 -29 23 48 25 -28 34 2 -21 -25 1 -4 -15 9 31
6438 31 13 -39 -52 -71 15 33 13 -40 -27 -11 4 -47 -24 18 2 -40 -22 27 -28 29 11 -2 -18 51 25 -11 19 -63 -45 -30
6468 -30 -11 29 61 -6 10 18 -20 63 40 48 2 -5 14 0 -21 -10 -9 -15 63 -6 -19 -9 16 -15 -18 5 -13 -49 23 -21 20 -6 4
6501Dk6M5o9P9l1Rj4K2k8oM9k0qM0n4N4j9l0NKj7L7m8j5L2n1N1k4l6O2qkk3K7
6535a1k0pP6Mo4NN3j4m6KRk4J6L1m9J8J3l2M0N4k0k0m3M3l3M3M0r4K5l3O2n6L9
6568GKqJ0k6oRL1q1J01m3nk0j5N4J3Lm1k2K7M8l9j5qK9J4l5j2K8pJ0K8k4j5QL1
6603C1o5J04p5Q5n5n0Q4p2J3n5M6L5k0k5J7jJ5m3K2lK6k9L1m5K1JN1j8j4ok6J8
6635bL7j1PLp5N3M5k9o1P3r3O9k9jP4p0kl3%O1m1l2Q6p4M0oj0k6J16j24K7K8k4
6668b4N7l0K0K7j06P1l5O2j11R6m9J1K6JK7j0m6Ln3lQ0k9P4j13P3k4j9K0J3k7
6698a8M4k5jRm9L0k4N0l4N0m1J2j0K7rj7Qrl5N1K6n1L0k3k8O6j0j8QPKk0J2j0
6732@k9J7QrN3k7L0k6J0no3N2Mk9L3k4K4%Qm8J3L7Jl6J0k5QJ1K0j8L8m8K3oj3
$$ plain form
6501 4 -22 23 -46 33 2 11 -3 19 -9 -15 34 14 6 46 -8 46 27 -3 2 4 -13 24 -24 -39 -7 -58 -7 -31 -67 -5 -13 -15 -38 -11
6535 -11 -31 -38 38 42 -22 -17 36 22 -24 -22 -13 -37 -21 10 -39 -21 -8 -40 0 54 34 14 -29 14 -19 24 64 -30 -5 -38 24 -32 7
6568 7 9 1 11 -15 -21 -12 19 -62 39 -4 -9 -29 -44 10 23 26 -15 -37 -10 38 -1 -16 -24 5 19 -16 -28 0 -7 3 31 7 -8 0 31
6603 31 -34 70 -5 80 25 -25 59 -13 0 -55 -9 26 6 -19 -2 -3 12 -31 -9 -12 14 -15 16 -29 -8 -7 44 26 12 6 -20 -2
6635 -2 35 24 31 34 -41 12 57 28 -33 40 -53 16 -13 -14 60 -10 -12 -45 -45 16 -25 -57 29 -45 -5 -11 -21 -47 69 -55 -28 0 -24
6668 -24 33 3 23 50 -56 15 -20 42 -69 27 -22 -11 15 16 43 33 -13 -10 -63 -66 14 -15 59 -54 19 -5 -24 -4 9 -18
6698 -18 26 1 0 9 -40 -10 -34 16 -18 32 -9 3 -7 20 11 -6 2 -7 -42 9 35 -16 14 -9 -37 29 19 1 9 16 18 -2 10 0
6732 0 -29 -12 -4 -13 40 13 43 17 27 22 -41 11 15 -14 19 -5 19 19 27 -21 -8 29 30 -6 4 -21 -13 -2 18 0 38 -10 13 7 -6
6767fL4l0J7m8J2mpL3N7k3ml9rN7n3mK9J5j9l1p6Q8j7K4J8l3M0q9N5P1r3M1k9
6800b3M8K5n8M3j1Ok9k2L5qm9N3L2k6J4l4%l1N2p4J14j13R4m1l0JM4kn7P7o0J9
6832a1j7Q1l6Jk5J0jK7m8j4P5j13P9j2QKm0N1k8J8j6k2O4l5N3o2k0N5L4o9L7m1
6864a5K4K7n6N5o5QM3l8kO8l1k5J7k1L3L4o0k7K9j1k0J0M4j3k1QqK4k0pN7k1l7
6897a7qj8N9K7m9O2l1m3M0pn6L9K0o5O3m0J8j6P6q6j4RK5K9l6j3M3m0L4j9J9o
6929aKK7k0M2k3l0PK3J3m8J5Jl3qQR9r0K9j2n2K4L1j8k5N9p7L1J3K9J0o0N0J3
6962B9Mo0QL3o0M0Nlk3RqL6J6m8M8j4l7N4J2k9ml9j1L1koL1Np7R5k6k8j0O0j7
6997A4J1l6k8j3K2J6m4J2M0K7l9O3m1K9nq5K6M3k3M0l7M0j3rjM6M0o8n0j5RM0
$$ plain form
6767 -6 28 -2 15 -33 -21 -25 -32 1 58 35 31 -8 -17 40 -13 -17 12 27 8 -23 -99 -11 -28 -4 14 -19 21 -68 -13 58 -35 6 -23
6800 -23 25 50 -8 35 24 30 1 -21 14 6 -43 10 42 16 30 -4 -4 -35 17 -57 57 -56 38 -3 -33 -32 12 10 -47 30 -30 -11
6832 -11 -28 53 17 18 -7 3 2 29 -19 -33 42 -71 8 -4 4 6 -34 17 -11 7 -9 -31 33 -2 51 -11 -31 24 58 -11 26 -15
6864 -15 9 36 -20 35 -30 -22 21 -17 -19 49 18 -7 10 -11 22 56 -4 -31 -2 -13 -33 -23 21 8 -13 -5 -13 11 -9 -16 41 20 -17
6897 -17 -25 -43 16 43 -6 56 25 -18 22 15 -41 -2 18 -47 16 -24 -6 -22 54 -32 -46 -37 -12 17 -19 -32 11 -29 5 -14 5 -1
6929 -1 1 28 8 50 27 -3 4 27 40 -8 7 8 -25 -33 -25 74 -16 13 1 -51 -27 4 -14 -39 20 -57 -26 -13 16 26 -34 16 29
6962 29 33 -27 -19 14 -46 -6 -1 -4 -27 -18 -26 10 26 -22 26 12 -25 29 41 12 8 -31 -42 -11 -13 -19 12 17 -60 35 9 -19 -29 31 14
6997 14 25 -11 -39 -52 -30 -14 -58 -46 -6 21 -18 45 4 33 28 -57 -31 12 -11 29 -8 32 19 10 9 55 95 27 -23 -38 -29 11
7029A1j1m4J02p0RJ9m2k2O3o1N8m1K2L6j9n6j3L7N2l7%RJ7m2K9M9m5jl5L9J2K5
7061E0p6k8Q0m5Q1q0k5O5L4n6k4nk2O5K2l3k6%K9J0j5oJ0j3ql2L9l5L6K5Pk2l
7094an6N6J7j5lk7K5l7j3R9k4qJ0l1M8l4k2J3P2n3k9K7lkPK7m1Kn0P0k0j8J7R
7128A2p7K2P7lj09R1L8p0QK7rKl6P6pJ5q1J1k3K9n4M5J4m5O8p1L3N6q3j0O2Jj8
7161im4P2j4m4J4jM1j07J10j0l5o1J08k5K7o4M3MJ5rk6PL6m6K4K3l1J8Qj1L4l5
7193A2ol2K2NP5r6j2L8K5Jl6l6O2K0q0N5m3Kj1K4O7m5k4j3qO8l3%K6k0j1N5k5
7226B6K3n1qRK3n0O7Nl3om1QJ8L9j3Jm2jK7J9K4j7q7M3Mlj7KJ8k2P3k9k4L7m2
7261b0N8NJ7q7N3k4m8L0K9jjJ3o1M0rm%L2K3p1RO3m2j3k3M6j2m0mN6ml5J0N1q1
$$ plain form
7029 11 0 -44 58 -12 -3 16 -26 -48 15 -46 12 -29 -7 29 10 -46 -59 -22 30 -7 -7 2 19 -23 6 55 10 9 -26 13 25 50
7061 50 -26 -54 26 -19 62 -18 -43 22 56 0 -24 -29 -51 14 36 3 -23 -23 6 16 1 -5 5 -8 -16 -48 -9 -44 -8 17 24 2 -1
7094 -1 -57 -1 16 1 -2 -29 -4 -41 -54 45 21 13 23 -8 40 6 -16 -3 69 16 -13 14 11 9 16 43 2 4 -46 24 4 -14 3 12
7128 12 -65 -43 34 31 -78 13 51 -19 -11 16 7 9 -27 49 42 57 -24 -13 -36 -7 -61 -16 -2 -47 21 -50 -17 39 -44 -54 8 9 -9
7161 -9 -53 19 5 -39 -25 -26 15 -92 18 8 -27 -88 20 -5 22 -42 1 5 20 11 -15 -8 28 -18 6 29 -2 16 24 13 47 12
7193 12 6 -26 -4 1 76 -20 -32 6 31 32 -4 -40 22 42 -38 17 -26 -24 -35 -11 56 11 -13 -26 -34 34 1 1 27 7 -4 51 26
7226 26 49 -2 -10 -1 22 -28 39 44 11 5 -36 -28 -10 29 16 17 -25 -26 1 20 44 27 -60 -17 -13 -16 -33 -31 -13 -35 38 9 -15 22 -20
7261 -20 38 43 60 -27 26 2 -46 -16 13 12 11 24 -37 3 -6 -10 -10 22 45 -26 -17 46 4 -9 -32 14 2 -38 -42 14 10 -25 -15 36 -45
7296d5J8O8l1K8l8L1p6N4L5q5O8M0p8J8L8o6L0K4l1M2l7l2MJP4n5j9l9N1O4m5
7327A1n1R0k1o2kN8k1p6P8Nk6J8k3R3n3j6mJ1l4N0j5m3L9mk6L2J4l2k3N3OJ3n5
7360a6k3O2rkl4lJ6j6J4N5j9k4kk6M8l5J5K9j9k5k7M8j5L3J3j3m5j3N8Qk1llM
7394A0l0L5l7J3lL7m1PJ6j5J6kJ5J7l8J7Kk6J2K1j6o1P9m2K8MPr6Q3K2p2J32q4
7427A0m2M2m2O6n4K1K7j3L7o9K3N4k1n7O7k1K4p3L5N5n1j6j8K5l1L4j9J9k8pK3
7458@j3l2J3K7K0k9J4ol3J3J6KM5qk5L1p0J4l%k8R2n3J9N2n0M5m7KJK6n0J4Nl0
7493b6M5M1l5k2pm4R5p4L6Kk8R4r4J0J6J9n8M8%m4k3M4O0o5L0n1R3l1L1k5m9K8
7525A6J3M0m3n4L4k1PJ3J6ol7O2n5K5k2NM4r1P6m8N9o2j1R1l9kl3K5Rl9L5l4l
$$ plain form
7296 -45 -27 41 10 38 0 31 -45 9 44 -41 27 67 -11 7 45 -21 9 33 2 44 7 -25 -21 -20 54 -1 -20 -59 -8 56 11
7327 11 -40 50 29 -33 -35 23 2 -74 4 9 -17 1 -22 71 18 2 -2 9 -25 25 10 -33 6 2 -24 8 22 -10 -33 20 26 39 -16
7360 -16 -39 23 14 12 -22 -25 -9 -25 -11 44 25 1 -1 -27 21 -14 1 30 11 -14 -41 7 -8 25 38 25 -20 -33 25 33 12 9 6 10
7394 10 -20 15 -22 -9 -12 25 -16 -9 7 -8 8 6 21 38 0 17 19 -7 5 26 10 -51 28 -14 14 18 25 -71 12 34 -38 94 10
7427 10 -32 10 -32 34 -20 1 28 15 52 -17 6 60 39 -18 49 28 52 -21 14 69 18 2 -16 9 -22 12 -7 12 -16 -23 0
7458 0 -13 -45 -32 -5 15 -14 0 -6 -39 -26 -10 -8 37 29 4 35 -35 -21 -24 -24 -52 40 -13 6 58 8 53 6 8 9 35 -15 -1 4 -26
7493 -26 19 60 25 3 -4 -48 47 -27 9 11 -17 77 -17 -7 9 28 -30 18 18 -26 -49 -5 55 -10 20 -31 62 31 62 37 -12 16
7525 16 29 69 26 -28 6 -15 -8 5 21 15 -22 40 -15 10 -12 -7 37 -54 22 -26 33 -29 -40 51 12 10 -23 2 11 -28 7 -27 -30
7558c0K8N5r8L2j4L3J0k3NM8j5k0J3lm1N2k4pM2n5K7k7Q8r3Q2o2l3O1p6L5qj2
7590c0K0M5K5o3MMk4N5j3%Lm9M1j2kO4j09P1j1qq2R4k1KJ9Pn2N1p7M7K2l7mL9
7624A9m8rK3K8JNk5Jk1n0R4j2J0k4M3k5J1j1m5L5M9k0Op5J08m4%qqO1r6L4K2k9
7658@Q8q3K2l2Jk8M9l0K5%j3Ml7L3K4k5nk5O7j7j6l7N2j8J3Jl9J2L3k4m1K6L1
7691A1jm4N3O0l1j4N6p3m8Q3n8J3Rl0K8J3q1O4k3J3l0L3%jJ7l8J0MMkpN3l6Rj6
7726@L4n0Ro0M7M0k3P6q1P3p6j6NMK4K9pm5M6l7K3j1k1L3omJ3n8R4n1m6M2QJ8
7760B6kk3nJ0j5L2q5R4l7pOk9M9nJ2j6k5O4j7m5N0o2O2jNn4O5j5j8m1J6m0P3P
7794B9l8k9L9Pk3L9j4J2o3M1l9N0n0Q2Ln5nN8p8P5o3J04r5L8l8N5j2J6m8lM7m5
$$ plain form
7558 -30 -2 53 -45 -13 -27 6 16 -7 -2 46 31 11 24 21 -20 32 8 1 43 -12 15 -12 76 -17 65 3 -30 31 -45 -10 -18 -30
7590 -30 -10 35 60 -3 1 5 -19 36 23 23 26 -23 18 6 4 68 -41 30 19 11 -71 23 2 4 23 30 -22 29 -48 -1 21 -16 -20 19
7624 19 -29 -38 -15 13 14 19 -6 -5 -26 -76 18 6 16 -8 35 10 21 10 -35 0 49 29 35 -40 68 24 24 16 8 69 -27 7 29 0
7658 0 88 5 27 -5 -4 -32 17 -13 12 12 -1 3 -34 -1 23 -2 -7 -32 35 18 2 -35 17 -1 12 13 -26 -14 19 -5 -46 -20 11
7691 11 10 -34 19 79 48 34 90 17 -31 52 -6 7 16 -14 14 27 -54 10 -13 0 -30 3 3 2 19 -19 -9 -5 -1 -3 -10 43 7 16 0
7726 0 34 -16 -7 -67 -20 20 -3 73 -8 65 -11 -27 -22 -18 6 35 28 -17 29 -8 15 4 -17 16 10 6 19 -39 55 4 -42 0 8 26
7760 26 24 1 -4 6 -9 23 -62 32 -5 -12 -6 -35 14 9 21 5 -20 44 27 -18 32 -30 32 31 36 -18 47 32 14 -27 -11 -51 22 29
7794 29 -9 -38 1 8 -15 24 10 22 -41 0 -39 11 -39 43 46 -9 -14 44 -34 41 -22 82 -13 25 -13 42 30 46 -2 -5 42 -3
7826ck5L0L2m7j4J1L4q1Q3jqJ8J3l5j2kL4j8mP4j13J6J4Qk0LOJ0l0K3J5l3K4R
7860A1m6J6M2n6J4O7o6N8p2J1Ll0M3Nk8K5K4Ln1L1l6K3K0k1M7p7N6j1Mql1L1K4
7893B5n3K6k9M3j7mK7N9p9K4j1L5p3nN0l8J6m0M8K4l3M8J5j29N0K2k2M0o3L9K4
7924A9J1j7n4OQJ9PL4j7j2N5n9kl1N7K7k3l8M9Rj7l1j3M1jo6O8k0m0K7K5j5j0
7957dK8l8J8k2jPj2pL3n2Q9m2O3n4Rj9J9rMk3K3m0L4j3K9lk1K8rNJ3QlL7j09N1
7993A7j7j6K4m8k6Q1%k9M1m0J1l1oL5n7N4J0K8l5QpL0o2M6M4m1j1L3l3m8P1l8
8025a2L%j5N1k7K8j0KQJOm4Mn0L8OrLL9p3P0k8n9M8K8k2j2QK2l0J3J2J4K4m6N6
8061D7l2j8pl6N6m3K1J3mL3o8L7J8Mj3l3N0K8k5k2L4m2m3M3j0K0k5K2J3j8J8k7
$$ plain form
7826 -3 -28 2 34 -13 -27 -16 18 -63 20 19 11 29 42 7 -5 -7 27 9 5 79 -34 -18 -4 4 -16 -13 -7 3 -27 -4 11 -22 2 11
7860 11 -35 -19 23 -33 -19 48 -18 40 -32 -21 -18 -48 -5 0 -28 -3 21 24 -27 4 -32 -9 11 -10 37 -40 16 5 9 1 -30 1 25
7893 25 -28 -2 -31 12 -5 -9 18 77 -2 22 11 46 -27 -32 18 -20 -4 -44 4 28 -5 43 58 -71 -21 1 -21 19 -44 -5 19
7924 19 30 13 -41 -35 -27 -8 -1 33 16 4 59 0 -2 -33 24 51 28 -10 39 48 31 0 -13 28 27 -39 29 9 -31 -4 21 6 -4
7957 -4 24 -14 4 -18 -19 -12 -24 -31 2 -50 39 -3 60 6 15 -4 15 6 10 -13 10 -30 4 -9 20 17 -4 24 15 20 33 41 38 75 -34 17
7993 17 0 -16 8 -40 -66 15 15 -14 27 -13 -2 -33 -39 -4 -61 -7 3 31 -4 4 -3 27 -35 11 55 14 3 36 3 -45 26 -12
8025 -12 -9 -9 -24 27 0 28 18 20 28 29 35 -9 -5 -55 -17 -11 -20 -17 22 -51 19 -9 -68 -20 8 -14 -26 -18 4 -26 -13 -1 13 37 -9 47
8061 47 15 -3 -10 -46 10 -33 -12 1 -3 30 -38 -1 17 21 8 -25 25 53 28 6 40 -2 -45 -2 -12 8 -17 5 18 0 18 -9
8093ikk4Q3l0l9L9J8m4J9jMkj0L2l6L3mn2M4%OJNq3M2KJ4k2Q2o8J5lmj1L2l6L
8130fjM1m3ok4K5M2mk2on4Q5k2J0N0p5K8mpm4L8Pj9j1N5r0Q3J3p0O3J3o3K6LJ6
8165B7o2K5L8m1N2m8LL1j03O5j6K1N8q6L3j1NqM5j7k7L5lJ3l7L5
$$ plain form
8093 -9 -11 -35 48 18 -21 18 36 -8 11 10 14 12 2 34 -2 31 27 -25 19 19 25 26 31 -52 -10 -8 6 -16 66 -2 13 10 6 -5 27 -9 -6
8130 -6 -7 34 -9 -15 -39 -14 28 24 2 -4 -58 27 5 15 65 -10 18 14 7 -37 1 8 -11 -22 33 -57 26 39 -31 32 45 -18 8 11 27
8165 27 -35 -10 28 -13 39 -9 -6 25 -78 -13 -29 -8 50 -36 -3 -14 -9 -17 28 11 -16 19 16 29 -8 27
8191B7
$$ Imaginary data points
##PAGE= N=2
##DATA TABLE= (X++(I..I)), XYDATA
0@%%%%%%%%%%%%%%%%%%%%%%%%%%%%%kOqQqQrJ4k0K3k5K7l0L5m1M7n1N8o6P2q1
50d3Q9r7J09j18J26j36J45j51J55j56J49j32R2j2j43M52j116K787q368N5286L01281
71C50199k68881l99783K08209L45186j05263k67667J1374J54422P9882l1779j49689
82g3790r6347J99974K10971k20479l03773K15504L59911j84352l75319J37733
92a29967L47143q1959k83556K7826J93610J9528r1362n4869j2856P6766J07123
103A17427q4469j83780P9643K34507o5367k55941M6231K47210k6510k12618J0228
114i3439J59409J039r6350n962L2494O080K5141k387p0880k881J02079P671j16970
127e4956j0591J16311J0146j02605o389P9338o33n1699R025K4074j7479p97K3988
$$ plain form
0 0 0 0 0 0 0 0 0 0 0 0 0 0 0 0 0 0 0 0 0 0 0 0 0 0 0 0 0 0 0 -2 4 -4 4 -4 4 -5 9 -11 12 -13 14 -16 19 -22 25 -26 32 -34 38 -43
50 -43 46 -51 58 -60 66 -70 75 -76 79 -77 72 -60 32 20 -123 329 -787 2000 -6368 48918 350199
71 350199 81318 -318465 -110256 234930 129667 -138000 -126626 27796 107678 75899 -73790
82 -73790 -170137 29837 240808 20329 -283444 -67940 291971 107619 -267700 -129967
92 -129967 217176 135217 -148339 -120513 73097 92625 1263 -53606 -66462 10304 117427
103 117427 32958 -150822 -71179 163328 97961 -157980 -111749 135461 108951 -103667 -93439
114 -93439 65970 67009 -29341 -35303 -2809 3271 28412 26025 -44855 -47736 54343 62014 -54956
127 -54956 -65547 50764 60910 -41695 -48084 31254 30621 -21078 -12053 12021 -5458 -6255 17733
140A7733j6597k6962K7260K5878l1535k0923L0528J3417k4908m162J6427n195
152I61o283J4095l521k0943J1521K4907j6544k5389J8278K2275j7339j6314J3533
165g63Q479p986k77N88p796P869J4728j6653k0009K4638K3236l0615k4163L3807
179E083K3390l3702k0243L0261J5732k3392j0007J4050L502k665L229r599r931
192a4292K1391J6044l1518k1573L8417K5570m1300k8018L9519K7980l3640k5573
204b6993K4466K0753j3002j3949O71O058J1526K579k1959j0949K9728J8734l3771
217f108k4451L3809K7709l0002k8099K3206K5429j4666k0616N209J4195L781p424
230A972j1833P42J8061M792k2041q921K3604J1177k2490j1687J9531J0768j4897
$$ plain form
140 17733 1136 -25826 1434 27312 -4223 -25146 5382 18799 -6109 -10271 6156 961
152 961 -5322 8773 5252 -15691 -4170 20737 4193 -21196 -2918 19357 2018 -14296 -763
165 -763 7716 -270 -547 41 -7755 114 14842 -1811 -21820 2818 26054 -4561 -28724 5083
179 5083 28473 -5229 -25472 4789 20521 -2871 -12878 1172 4674 2009 5238 -4361 -14292
192 -14292 7099 23143 -8375 -29948 8469 34039 -7261 -35279 4240 32220 -1420 -26993
204 -26993 -2527 18226 5224 -8725 -8054 -1996 9530 12109 -9850 -20799 8929 27663 -6108
217 -6108 -30559 3250 30959 957 -27142 -3936 21493 6827 -13789 -8580 5615 9396 1972
230 1972 -9861 -9119 8942 13734 -8307 -17228 6376 17553 -4937 -16624 2907 13675 -1222
243a222q757R610O559l614m580k272L511P930l438j3013M206J7088n555k0070
257a3617O933K1173q018k0873Q331J8511p727j4603N934R056k845k442r19n022
271f128N259J2665r127j9526J2392K4939j4322k7828J5016K8045j4302k5256J2463
284e710J9759r707j2319O345L321k963N963m89j4662L090K1742n303k6211O773
298a0371K7574p632k5887Q381K1506q799j5055R113P876r264k34R056o412q478
312h626J1741P499j5080n961J6089L686j5094r06J2281k454q577N944M349r386
326d495n59J2069k563j3605M436J3943n034j2680M481J0215k926o368Q05K057
340b24J601K635l588o920N013J0346n538j2523N014J3032l788j2110J743R728
$$ plain form
243 -1222 -9979 -369 6190 2576 -2004 -4276 -765 7165 3727 -9286 -5080 12008 6453 -13617
257 -13617 -6684 14489 6471 -14402 -6071 12440 4713 -9890 -3956 5100 2255 -187 -1106 -6128
271 -6128 -869 11796 2669 -16857 -4465 20474 6152 -21676 -6660 21385 7083 -18173 -5710
284 -5710 14049 4342 -7977 -1632 1689 -1274 4689 4200 -10462 -7372 14370 9067 -17144 -10371
298 -10371 17203 9571 -16316 -7935 13571 4772 -10283 -1170 6706 -2558 -2792 6264 -148 -8626
312 -8626 3115 10614 -4466 -10427 5662 9348 -5746 -6652 5629 3175 -5402 542 4891 -4495
326 -4495 -5054 7015 4452 -9153 -4717 9226 4192 -8488 -4007 6208 3282 -3086 -2281 -224
340 -224 1377 4012 424 -6496 -1483 8863 3325 -9198 -4184 8848 5060 -7050 -5307 4421
354D421N68o532l137K598N637J155p674m764R324P535j0038r241J0022J0013r105
369G82r412P427Q053n008n831K186L279J042n04m548k070P685M368j0592o423
384i566J2694P703j3923q419J3800Q372j2611p720J0283O334o797m400K826K060
398F36J839M36o155l033J0031N674j2851p798J4372R342j4344j0066J2804R876
412A0763j0239q615O492O490k423l896j677O98N185K607q055n461R449Q011r723
427c94r435Q804R993o947r136M420P585j717n171p15K432K658L85l908k863M332
443C23M465l885n569K953N360j489m623jL049J316j349k188m30K675J831k579
459a41k457K042K502j110j599R0L03J031J429j908l218K541M764k923n747K838
$$ plain form
354 4421 4989 -1543 -4680 -2082 3555 4710 -2964 -7728 1596 9131 -907 -10148 -126 9887 782
369 782 -8630 -1203 6850 1842 -3989 -1803 1476 2518 2014 -2534 -4604 3081 7449 -3143 -9566
384 -9566 3128 10831 -3092 -11511 2289 10661 -1950 -9670 613 6947 150 -4250 -1424 636
398 636 2475 2911 -3244 -6277 3754 9428 -3423 -11221 3151 12493 -1851 -11917 887 10763
412 10763 524 -8091 -1599 4891 2468 -1428 -3105 -2407 2778 5385 -2670 -8131 1318 9329 -394
427 -394 -9829 -1025 8968 2021 -7115 -2695 4890 3173 -1998 -2713 -281 2377 2762 -1146 -4009 323
443 323 4788 903 -4666 -1713 3647 2158 -2465 -2466 583 1899 550 -1638 -2068 607 2438 -141
459 -141 -2598 -556 1946 836 -763 -673 -370 661 2090 182 -3036 -495 4269 1346 -4401 -1563
475a563N930k566n440K118L901j680j752R76p07n42L308l3n576O03P414r54q561
492e124J449Q943j794q391K285P197k736n223L141K942l362m85L178k026k700
507b706M135J845o003p09P250o07q227J989Q398l129q166M018P332m426n990M355
523f41M401l630k400K585K22r94K042n65m171K119N961l213p425L849Q251l981
539B410q526L399P928k353o784R10M953O71k828k140L85L325K055m039m022M228
555d28N515l712o289K822O427j477n753k3M595J524l031k910J303L925J89m526
571a849j555M681K278m514k621L889K463l087j904J950J203p65k57m91m51J759
587G29J124k893j260L934J150m703o84N285P1n507N20N502j300n024J675M127
$$ plain form
475 -1563 4367 1801 -3639 -1521 2380 700 -1052 -76 -783 -1325 1983 1950 -3626 -3023 4391 3437 -5124
492 -5124 -3675 5268 3474 -4917 -2632 4565 1829 -3394 -253 2689 -673 -1158 2020 -6 -2706
507 -2706 1429 3274 -2729 -3438 3812 3205 -5022 -3033 5365 2236 -5930 -1912 5420 994 -4996 -641
523 -641 3760 130 -2270 315 537 -457 1585 1020 -3151 -1032 4929 1716 -5709 -1860 6391 2410
539 2410 -6116 -2717 5211 2858 -3926 -3016 1937 2608 -220 -2360 -1975 1350 3405 -634 -4656 -428
555 -428 5087 1375 -4914 -2092 4335 2858 -2895 -2918 1677 3201 170 -2740 -1437 2488 2677 -1849
571 -1849 -3404 1277 3555 -959 -3580 309 2772 -315 -2219 -269 934 169 -88 -579 -1030 729
587 729 1853 -1040 -2300 1634 2784 -1919 -2603 2682 2753 -2754 -2234 3268 1968 -3056 -1381 2746
603B746k062k857K037J164j844P21J458k718j048M601N72o074o6P068k28p332
619c862M96P099o20o174J007M425j138k412J425K01j770K009J934l814k358N206
635A654K392n861k470N776K226n232j664M164Q29k753J63J405j372K6K452q84
651H51l356J586L904j656m029J466L743r68k988L73J798O3m96l96r59M74J964
668A374p7k928m41L269J169l271j887K660K649j721l102O75L266M79k921j322
684b129K237K120j423k263L13K043Q15j506j986Q04K786J68l525j089L758J762
700B885l719k288L387K350k842k032K101J481j369o69P55k36O3J105p84j620J406
717b6J998j904k060K420J867k816j503L154Q78l287m14L172j21k984M79K394o86
$$ plain form
603 2746 684 -2173 -136 1028 -816 -95 1363 -1355 -2403 2198 2770 -3304 -3370 3698 3470 -3862
619 -3862 -3366 3733 3113 -3061 -2054 2371 1233 -1179 246 447 -1323 686 2620 -1194 -3552 1654
635 1654 4046 -1815 -4285 1491 3717 -1515 -3179 985 1814 -939 -776 629 -743 -717 1735 851
651 851 -2505 -919 2985 1329 -2700 -1234 2509 1541 -1447 -1074 724 787 291 -105 -1064 -590 1374
668 1374 1297 -1631 -2072 1197 2366 -905 -2792 -132 2517 796 -2306 -1631 1635 2114 -807 -2129
684 -2129 108 2228 805 -1458 -1145 898 1713 207 -1779 -975 1811 1979 -1546 -2635 1123 2885
700 2885 -834 -3122 265 2615 -227 -2259 -158 1323 -46 -715 40 -196 -133 972 188 -1432 -26
717 -26 1972 68 -1992 428 2295 -521 -2024 1130 2008 -1279 -1693 1479 1358 -1626 -1147 1247 561
734E61j646Q15M50o87P74M92j942k72L181J45m080J73M580j42m631N2M334k5l381
753a249j66K095L27n70n74j131N85K617n50l929M54M666l43m956J84M700Qm031
771a863jK801J34j279n1k96J15J763O0l071p6L911J89m464j7M460k14m038L78
790a559L274q70k077J048Q47j403M11J564j607j567K539J483l144j193L517O60
806A923l383m7L062n66k440J358J679j980q34K393J28k778O46K727j204k593J472
823d37K149j716j466J620O10j410K56J135j014r14J760O94k371m05K825L12k938
840a310k22K818L66k393m56J712O14r04p38J8P00Q16o83j503L71J886N8k233n51
859a634K257J007j948j554J429K130r40k299K40K535M09k490q57K267J180j713
$$ plain form
734 561 -1085 -270 180 -507 267 759 -1183 -1455 1726 1871 -2209 -2036 2544 2402 -2229 -2177 2157 2132 -1249
753 -1249 -1415 680 1007 437 -137 -1268 -683 1934 1384 -2545 -2091 2575 2232 -2724 -2540 2160 2168 -1863
771 -1863 -1864 937 1071 -208 -259 -555 -440 1323 1383 -1688 -1764 2147 2336 -2128 -2145 2315 2101 -1937 -1559
790 -1559 1715 845 -1232 -184 663 -740 -329 1235 -372 -1939 600 2083 -1061 -2254 1263 1923
806 1923 -1460 -1507 1555 989 -1451 -93 1586 -394 -1228 1165 1293 -1485 -839 1888 684 -1909 -437
823 -437 1712 -4 -1470 150 760 -650 -394 741 -273 -1187 573 1267 -1104 -1509 1316 1628 -1310
840 -1310 -1532 1286 1652 -741 -1197 515 1129 225 -513 -495 205 1021 338 -1165 -794 1092 1150 -1083 -1634
859 -1634 623 1630 -318 -1872 -443 1687 747 -1552 -1312 1223 1632 -858 -1715 552 1732 19
875A9j206J010J073k91p28n20K74J278K46k046p94K582J051k969j246L175J162
892B070l183r12K967M82k536L2J951n28j232J122M27j422N03J640j375j607K255
909F54J371l017j021L654M36m011J52M070p04l941J065L355j442k397J510J344
925A078j518K3J234j331q66K633O32l802j36M541j94m885M99M835p20m237Q15
942a399L265q79j947P91M11p56R83O56k463m99L644K35m371k1M646k96m344N77
960a767L716q14k661J125J489j297q4J353j138j349K193J098k909p49L318J51
976A675l312N01K958j194k497J896J652k548p93K839L1k948P30K646j278j891
992a533J575J099j848J46J909j348j783K578J557l564j311M322J023m660o83M393
$$ plain form
875 19 -1187 -177 896 605 -123 -643 -369 909 1155 -891 -1685 897 1948 -1021 -2267 908 2070
892 2070 -1113 -2025 942 1424 -1112 -1080 871 343 -889 233 660 -762 -259 1381 6 -1601 654
909 654 2025 -992 -2013 1641 2077 -1934 -1782 2288 1584 -2357 -1292 2063 621 -1776 -266 1078
925 1078 -440 -417 817 -514 -1380 1253 1885 -1917 -2053 2488 2294 -2591 -2092 2743 2023 -2214 -1399
942 -1399 1866 987 -960 -169 242 -514 469 1125 -1338 -1837 1807 2042 -2329 -2350 2296 2000 -2344 -1767
960 -1767 1949 1135 -1526 -401 1088 -209 -293 1060 -78 -1427 766 1864 -1045 -1794 1524 1675
976 1675 -1637 -1136 1822 628 -1869 27 1679 -869 -1662 1177 1208 -1740 -1010 1636 358 -1533
992 -1533 42 1141 -707 -561 1348 0 -1783 795 2352 -1212 -2523 1799 2822 -1838 -2521 1872
1008A872L92l798p4K603k60j107N15o06q45K227J195l684j555M891J748n459j918
1025c863N620J980n153j741M095J494k709r18J038K42P26M72k405j269L862J947
1041C418m878k548N339K858n293l050M687K902l650k466K255J910p63j008p75
1056a062n5K334J030l317k034M116K794m355l357M188L620l611l516K623L065
1071B463j539k245J91J263R27j65j941j025K677K030k955k847K931L258k409l499
1087b885J903L247r30k760Q5J981P30r45j386j33J798J066j908j849J627K476
1103B117j231k776O86K586ok242p54J614J235p77j568l5J670Q58j446j458J056
1120d71J899m84j955k08J774Q99j317j393O90J776n4j827n74J524J112j131j546
$$ plain form
1008 1872 2264 -1534 -1608 995 735 -372 143 -463 -1308 919 2114 -1570 -3125 1766 3514 -1945 -3863
1025 -3863 1757 3737 -1416 -3157 938 2432 -277 -1195 -157 85 811 1283 -1122 -2391 1471 3418
1041 3418 -1460 -4008 1331 4189 -1104 -4154 533 3435 -215 -2681 -426 1484 721 -287 -1062
1056 -1062 -1117 1217 2247 -1070 -3104 1012 3806 -549 -3906 282 3902 291 -3225 -602 2463
1071 2463 924 -1321 -1130 133 1060 895 -1046 -2071 606 2636 -319 -3166 -235 3023 614 -2885
1087 -2885 -982 2265 1335 -1425 -1340 641 1371 426 -960 -1093 705 1771 -137 -1986 -359 2117
1103 2117 886 -1890 -1204 1382 1376 -866 -1620 -6 1229 452 -1116 -1151 519 1377 -69 -1527 -471
1120 -471 1428 944 -1011 -1219 555 1454 137 -1256 -566 1210 1156 -671 -1245 279 1391 260 -1286
1137a286N99J594L3j515o26J056J168n20j599k3J730P21j689j174J464J528r76
1154D85j604M08J577J02j273n96P64J054k26j331l57J413Q24j438j148J223J320
1171A197q68j406N64J075k7r04k42M81N70po97m88R92P06r75q06Q65R73r61p71
1191g29P62N72m97m35L89K4j71K14n2l28J19M82m32n29O20N05p55m08R33L08r82
1212c90j89J032N0r14Q4Q39j56n55J35L43k65J4K78l78k94P05K16r71l13J170
1232D41K24j227j92J083K18r84j35P52R6m70Q1P9p7K09K69m85l73P04N30q16n77
1253f50Q29N76p31n84N85M86l74m49J78K58l0r9j28r9J62K62j24n86J92O22L4
1274C30o36j31O25L44o06m15N67M63m49l75K50K45J2j54j12k08K43N29l59q88
$$ plain form
1137 -1286 -687 907 940 -575 -1201 -145 1023 503 -1096 -1119 611 1332 -357 -1531 -67 1461 485
1154 485 -1119 -711 866 968 -305 -901 -137 917 691 -640 -997 416 1240 -198 -1346 -123 1197
1171 1197 329 -1077 -513 562 535 -369 -611 -130 440 433 -264 -752 240 946 -29 -835 30 1003 42 -729
1191 -729 33 605 108 -327 62 86 -85 129 77 -251 -132 350 -82 -611 9 514 -241 -649 284 592 -390
1212 -390 -579 453 503 -411 -327 512 356 -199 -64 279 14 28 306 -72 -366 339 555 -416 -729 441
1232 441 665 -562 -754 329 547 -437 -572 180 276 -194 -113 -34 -111 98 367 -118 -491 213 743 -73 -650
1253 -650 179 755 24 -560 25 511 137 -312 -134 124 94 -5 -133 -232 -70 192 68 -518 -326 296 330
1274 330 -306 -437 188 532 -74 -489 78 541 92 -283 -33 212 224 70 -42 -250 -7 522 163 -725
1294g25M08J150l91j417L79J434l11j360K77J129k09p39J24L02n2K41J70q34j96
1313f20J441J42j754k14J992K73k176l10K075K55j710k08J191M1n72L5q7k42P19
1332B71N22j292p23J787Q25k015r24K171Q82k004q02J797O34j395l09Q81q2j92
1350C2L00l40o49Q57P92j254r72J466J002j643r07J682P14j599m05J267K32r73
1368c98M6O06k47j31L68k53l80O13M56r06l51J035L59j262j86J274K7j230L4R59
1388D33qp44J1L17J13O1k66m45L55Q02m20j115M98J327m89j355M42J300l07j013
1408e03J37O01J06j87k89l27N14P72o42j239P48J510q47j562P13J431n56j186
1426h06N24O89l48k49K04l03L9Q78k11j211L05J553m87j599N47J483n70j273O17
$$ plain form
1294 -725 -317 833 442 -975 -596 838 527 -833 -556 573 364 -375 -251 51 -1 240 410 -424 -620
1313 -620 821 963 -791 -1005 987 1260 -916 -1226 849 1104 -606 -814 377 418 -154 -119 -206 -448 271
1332 271 793 -499 -1222 565 1390 -625 -1549 622 1504 -500 -1302 495 1129 -266 -575 306 224 32
1350 32 332 -8 -657 200 992 -262 -1234 232 1234 -409 -1316 366 1080 -519 -924 343 575 -398
1368 -398 -352 254 7 -124 244 -9 -389 224 680 -226 -577 458 817 -445 -631 643 670 -560 -526 433
1388 433 425 -319 -308 9 122 183 -83 -528 -173 629 209 -906 -408 919 430 -925 -483 817 510 -503
1408 -503 -366 235 341 154 -135 -462 52 824 182 -1057 -309 1201 354 -1208 -495 936 380 -806
1426 -806 -282 407 59 -190 14 -289 -250 628 417 -794 -489 1064 577 -1022 -475 1008 438 -835 -218
1445b18Q64o26m09O80j04p66O43N97r47n85J221M06j343k22J330o8j058L12Q62
1464E69o40m00R30O0j170L02J303n98j352Q47J168q23r82Q08O29p55k58N98k62
1483b6l20O92J9j059J17J400l29j581M91J539m65j390M89J170l90p44K84K38p6
1502E9K54q5p25K15J078l07j369M08J456m35j554M78J342l60j068J64P96j25l40
1521a18o5j34K61O20m32j040O52J263n94j509O76J536o07j410M12J264k47r12
1539c84j4M56K54J9m50n69O82R17p49j324P51J551o86j591M75J564k74j203NQ74
1559C04J91m05m08o9N19O43o14r99M70J378l95j510K10J489m0j303l29J056M66
1578F54o29n79J91O12K17n03o20L02J002j00j188o2J132L79r59n96P65P24l80
$$ plain form
1445 -218 646 20 -389 291 187 -579 64 661 -286 -871 350 756 -587 -809 521 453 -605 -293 569
1464 569 -71 -471 459 519 -651 -349 954 356 -996 -149 1019 196 -786 22 651 -104 -362 236 -26
1483 -26 -346 346 365 -694 -577 823 494 -1087 -596 943 478 -912 -423 747 357 -387 -103 135 59
1502 59 313 228 -497 -282 796 489 -880 -472 984 549 -1005 -527 815 455 -613 -449 347 222 -118
1521 -118 -183 -317 -56 564 132 -908 -256 1007 413 -1096 -420 1116 509 -901 -489 775 528 -384
1539 -384 -398 58 312 331 -119 -688 -6 911 162 -1162 -411 1140 454 -1137 -662 902 628 -575 -570 304
1559 304 495 90 -318 -387 132 775 161 -838 -368 1010 615 -895 -685 804 764 -539 -868 188 654
1578 654 25 -554 -363 249 466 -37 -657 -355 647 547 -641 -703 429 808 -151 -747 18 742 362
1597C62q10P6P66J73n64m86K80P09r3p16k62N65N49m53p43J51R32P7q55m70R46
1618A34O22o99p66M67P85j87o05j72M58M34r9o77k45P84O18q41r02P84J121p90
1638B24j165N34J185l32j015P0P50J02k91l17k17M87O62n09j110N32J431m59j625
1657a063M59J575k56j427Q7J142L2p35j53K27K25K47k01p29J10J167j00j431j9
1676h43J650J9j614r4J481J59j141k03P52J59k74j04j51M4O07J46j048k37J261
1695E69K39j358k84J262L51j186k82R03J99n80j07K45mO0K35m15k79O21L18p17
1715b10m01Q14M00p97l15P41K00n93o2M25m1k72K02N0k63O7K63k15k99L31J86
1736B11l13j72M58k9l81n9M89o3m66J56L35r7k59J66J54j21M4Q8j86j8J90M6l90
$$ plain form
1597 362 -448 -372 394 567 3 -483 -203 506 413 -303 -565 0 549 96 -647 -496 436 513 -342 -812 134
1618 134 756 57 -709 -242 543 356 -249 -421 37 471 372 -305 -550 234 852 11 -891 -107 1014 224
1638 224 -941 -407 778 446 -569 -499 251 353 62 -255 -472 15 677 168 -942 -410 1021 562 -1063
1657 -1063 -604 971 715 -712 -625 517 549 -186 -339 -112 113 360 159 -570 -460 707 607 -824 -843
1676 -843 807 826 -788 -882 599 758 -383 -586 166 325 51 -53 -204 -160 447 593 -455 -692 569
1695 569 808 -550 -834 428 779 -407 -689 214 413 -167 -274 -29 -33 27 262 -153 -432 189 507 -210
1715 -210 -611 203 603 -194 -509 232 432 -161 -223 202 161 -111 91 141 -122 -55 208 -7 -306 25 211
1736 211 -102 -274 184 155 -226 -285 204 141 -325 -169 166 69 -190 -24 130 9 53 141 -45 -63 127 173 -217
1759b17k5N63j1n47k4M60M8l36k12L13R3m5j50p3R9K49m8k92j52M03K89m52l76
1782d43M49M30k70n45J42M99O2m18k16K85L19q3l54k51M01M03k66o62J03Q16Q5
1803D86r08j75Q41L54p17m43N34M65j87m22j18L22K97k8o07k00Q26M71r69o52
1823h30R49Q25q79r22O93P58m34o51K09L96J9o1k50k90N00O11n77r13O35J107
1843H95n81j162N95J174n58j052M30P87l86l37J74or2L61J4o98R5R51k24j041
1863f61K16J153l07j158L75R39l52p48M74M02m79k0M65k94l85N29K82o53k13P89
1883C54Q0q52R8Q63k68q27M08O60n05n20N80L25o77o9N58r3m67L20L40m25k48
1904c65O32k8o35K20O99l76o52N20O01o71m23N72M02n87j60L32N7k64J08J47k92
$$ plain form
1759 -217 -242 321 310 -237 -261 199 247 -89 -301 12 105 60 -90 -163 -64 185 137 -155 -307 96 385 -67 -443
1782 -443 6 436 166 -379 -237 262 324 -94 -310 -25 294 211 -143 -394 7 410 144 -518 -415 401 486
1803 486 -422 -597 244 598 -119 -562 -28 437 250 -172 -290 32 329 301 -306 -506 320 791 -178 -830
1823 -830 119 944 65 -857 -164 594 160 -491 -282 114 133 72 -178 -468 32 643 66 -847 -212 895
1843 895 314 -848 -253 921 363 -689 -259 528 142 -195 -21 -27 -119 242 256 -442 -347 604 380 -661
1863 -661 -445 708 401 -757 -382 557 205 -543 -69 333 -146 -166 299 5 -380 149 431 -222 -435 354
1883 354 434 -418 -320 543 275 -552 -144 516 11 -509 71 396 -281 -350 208 115 -352 -32 308 -117 -365
1904 -365 267 239 -396 -176 523 147 -505 15 616 -55 -478 94 496 -91 -251 81 138 -126 -18 129 -163
1925a63j1N17k70n66M02O10m54o03M73O33n36m05L58L12k01j64Q7j33J79J99k05
1946E9m32K75N76l43n83K90N52k87m94J60L72m0k19j4P8J7J77o6m25K13M48q8
1968B26n58P1N86l4m77KL53L7j27j12q0O7L26n2n08M1M89J12n89k40N09L30l79
1991gl20R5L61R6l28k59K16M21P4o33j49O37L39n33n33M26N56j48o18k4N11K68
2013D48l81n12J87O19N0p21k18O36M69m84o38K73O79L4p22k32N55M84l10p14J74
2034c24O97J21o97k91N79M37l87n70J03O06J50n41m07M16N50k64o35M2O85J55
2054D25o02l35N56L80k83m82P4L82K46l06l60J50N83r0n40k39N81L53n51m07L89
2075g6M21j80l99k5L47J66k28k09r0M96Q9m10k77L09M11k44m58K00M25l8l70j9
$$ plain form
1925 -163 -174 343 73 -493 -91 519 65 -538 -65 568 32 -373 -15 297 96 -68 19 -114 65 264 59
1946 59 -373 -98 478 135 -448 -158 394 107 -387 -227 145 105 -114 -128 -50 -33 144 78 -347 -134 314 226
1968 226 -332 -261 325 291 -186 -184 169 206 79 -33 -113 -46 280 228 -280 -239 250 362 -227 -467 42 372 -7
1991 -7 -327 -232 129 225 -103 -362 -146 275 349 -284 -433 204 543 10 -523 -97 459 311 -307 -331 180 448
2013 448 67 -445 -258 361 411 -310 -528 108 577 93 -545 -272 407 441 -281 -513 42 526 216 -498 -324
2034 -324 373 494 -203 -494 85 522 135 -435 -332 274 424 -117 -524 -108 442 178 -457 -415 270 425
2054 425 -177 -512 44 424 141 -341 -267 115 361 55 -305 -155 428 338 -202 -441 140 493 -58 -465 -76
2075 -76 345 165 -234 -259 88 254 26 -183 -273 223 312 -98 -375 -66 345 101 -357 -157 268 230 -140 -159
2097a59K09J68j34j86r0L31J95k66l70J88M37j98l64j4M31N7l34j23J59K27q4
2118H0k34j8J84J75j93k32J77K53j07k53M5K78M0j75j50J48J51p2k29m6L16M6
2140A84k40j17J77J70j87j59Q9J63l2j51nJ47O8o4j59K9J37M1j82MJ69J30k74
2163f2q0J45J20j47k6P5M7p9k0K2k4M3K0o1j07J68R2j63r9J79J22k63j02K64J08
2188A72k40l5K34j3j02j5L9k0QJ7q6m9J14M1j52k5K25L5k76kJ49N2j36j4P9Ll5
2215c2Q6r4l8J41l7q9L1J08N8k09K1J67Jj12o7Q8k9P2pj63M9J58n5j67J7J56k2
2242C2r7p2J35n3O6K0k1o3J09N5j85o0K31N4k19o0J64J07j58k2J39j02L9j8J2
2267C3j23O4J80j78k38K82K24k63k09K55J30j77q5J21R7j21L5m2m9N3K07j39k54
$$ plain form
2097 -159 50 218 84 -102 -192 139 334 68 -302 -114 323 125 -239 -253 178 235 -99 -222 -63 164 80
2118 80 -154 -172 12 187 -6 -238 -61 192 85 -168 -123 155 195 20 -130 18 169 97 -132 -178 138 184
2140 184 -56 -173 4 174 -13 -172 -83 80 48 -103 -108 39 107 43 -116 -87 50 91 -91 -87 82 212 -62
2163 -62 -142 3 123 -24 -50 25 72 -7 -27 -5 -29 14 34 -27 -134 34 126 -37 -136 43 165 -98 -200 64 172
2188 172 -68 -103 131 118 16 1 40 20 28 45 -41 -90 24 65 -87 -112 113 148 -128 -130 19 71 -65 -79 0 3 -32
2215 -32 54 -40 -78 63 26 -63 -32 76 134 -75 -54 113 114 2 -65 23 -6 66 59 -104 -55 103 48 -119 -102 54 32
2242 32 -65 -137 -2 -55 11 31 10 -53 56 111 -74 -134 97 151 -68 -128 36 143 -15 -37 102 0 39 21 33
2267 33 -90 -26 154 -24 -262 20 244 -19 -228 27 157 -20 -105 16 113 -8 27 -15 -64 -11 196 57 -197
2290a97K00K80k48k57J75L16k65k66K18J78j44p3P8k5j8J22m8j66Q3K49j18k98
2312b24J77L15k24k50K04K41k38j37J65J45j97k0P1o6J0R6j12j70K16J96k31k71
2334c04L35K17l77j12K80K05k43j31J22K8M9L8j35p4K23J62l65k04L97K53m27
2355f3k79M39K77l54k60K59J34k13L9l3qO9J37k28k43L91K45l97l43M77L28l84
2377a0l49L92K02k39j33J12N8KJ14j23j83J74K78l13l22L54L45l33m45L74L61
2398C16l24k53K31J34j24J5K9j20NK97j33l18J37M09j99m31K06L92j44l79K27
2419b7J91j39k11J70J4q8R5L8j36o5L13p2l01Q8L04o4l57J80K47q9j89L3J70n8
2443D7j06J06l4q8J97k3k74M1K86K1l56l3K91J17l33m7J91O4j42L3Kj3J32k9j93
$$ plain form
2290 -197 3 283 35 -222 -47 269 4 -262 -44 134 -10 -83 -5 -30 -48 74 26 -140 -57 192 74 -224
2312 -224 -47 268 44 -206 -2 239 1 -136 29 174 -23 -43 28 -38 -28 68 -44 -214 2 198 -33 -304
2334 -304 31 248 -129 -241 39 244 1 -130 -8 20 69 107 -28 -102 121 283 -82 -286 111 364 -63
2355 -63 -342 97 374 20 -240 19 153 -60 -21 -54 -62 7 144 -84 -327 64 309 -88 -431 46 374 -10
2377 -10 -359 33 235 -4 -137 -25 33 35 149 26 -157 17 295 -18 -340 14 359 26 -419 -45 316
2398 316 -8 -261 -30 104 -20 -5 24 -96 -91 206 73 -245 -108 301 102 -329 -123 269 125 -254 -27
2419 -27 164 25 -186 -16 -2 -90 5 43 -93 -158 155 83 -218 -130 174 110 -247 -67 180 91 -98 -65 105 47
2443 47 -59 47 13 -75 122 99 -175 -134 152 173 -183 -216 75 192 -141 -188 3 67 -75 -42 -40 -53 79 50 -143
2468a43nK85O2k16j32K05J80k07j80J49K02l9k33K2N6J82j60k08Q4K00j5j95j00
2491b06K15J53j67k48J65K59k6k61j14K24J77r6k43P0K16N4k35j92L20J93k07
2512E1l07J86K55rk89o8K18J45j54k58Q1L13o8k16j20K50K37j78k31M2K33L7k71
2535a21q2K24K13j96j88P4K38j7k00j08J16K56j46k16J0K40Q6k91j30K34K25j67
2557E4k42J07K17K5j91j12J20K45r4k63j1K11K05k45k44J77K92r1l75L2L49L1
2579A97k90r0J23K38j10k15j8J90J75j76k97J41L30k5l78m2L55J47l13j12K35
2600F5J21k4k15p9J64J42j00k20j5L05R1l09k38L29K29k64k65J80K29rk35p7K00
2623EJ23k1k39r2L52J00k27k96L02K79j68k79K7K57oj98o4J76J08J2k30m6J51
$$ plain form
2468 -143 -148 137 199 -17 -149 56 236 29 -151 -2 200 161 -72 -50 6 188 28 -180 -96 104 89 -106 -206
2491 -206 9 162 -5 -253 -88 171 145 -116 -230 -6 171 75 -168 -98 118 172 -63 -255 65 258 51
2512 51 -256 -70 185 176 -113 -181 37 182 28 -230 -149 164 96 -120 -240 10 247 69 -162 -120 113 150 -121
2535 -121 -203 21 234 38 -150 -76 162 145 -55 -163 -47 209 63 -153 -143 97 183 -108 -238 -4 221 54
2557 54 -188 -81 136 161 -30 -142 -22 223 129 -134 -145 66 271 26 -218 -41 251 160 -215 -183 166 197
2579 197 -93 -183 -60 178 68 -147 -165 25 200 24 -273 -132 198 173 -205 -247 108 255 -58 -170 65
2600 65 186 162 -53 -132 32 174 74 -146 -161 144 235 -74 -312 17 246 -18 -283 -103 126 117 -118 -195 5
2623 5 128 107 -132 -224 128 228 1 -295 7 286 118 -161 -134 123 117 -81 -145 31 139 151 -79 -125 26
2646B6J18j26k37J25L05n5k69p8K36J07j55k00J90J25j1j75l3J34P6l3j58j6J70
2669F6L9j46j09J32R2k3k06O1J46j4p1j15J55M5k0k8j12J31J9M6j00J5K8R1j35
2694a3j26J67J18j14p4J7N9qq8K2m1J10K2r2p5J03J30j04j36P9R2k3q4m9K00k8
2720F4n8MK6nK6k8j00K2J39Kj79N0J18Nj03p2P1M8k6j4l0K0j5P7j05q0J33R0j75
2749i5j1J49L2r1n8MR1Lj1%k8P6N6j11r2R6J13q2j16P5L9k5o1k8P6j4N9q3j9P6
2779B0J21j25j03K2J37l5j36K8Q8Ro1J9M1ON8r1n9Q6Q5r7j59N4J58Q6k84L4J68
2806G0Q7k04o9J54q%l8JLJ36p3j51j9K38L7k75k1J78J46k13r2J05J07m8j07Lm3
2833i6J38J6j15j22J93N1q6j37J76J40j53r5J6J49l3j01oJ01KL0q6L1M5K9n7j01
$$ plain form
2646 26 144 18 -219 -94 211 156 -113 -191 45 152 -3 -203 -13 112 101 -74 -107 27 103 70 -88 -104 66
2669 66 105 -41 -150 -18 74 51 -155 -94 52 38 -33 -148 7 52 32 4 -108 23 42 88 -12 3 31 122 -13
2694 -13 -139 28 146 32 -42 -25 34 26 -62 -40 -81 29 51 -41 -116 -13 117 13 -123 -44 48 25 -59 -108 92 64
2720 64 6 10 36 31 57 29 -71 -49 90 92 -87 -37 81 86 -17 -89 -18 30 4 -10 -40 -20 -35 42 -63 -143 -10 80 -95
2749 -95 -106 43 75 -16 -74 -70 21 24 13 13 -15 61 117 6 -86 10 123 41 -75 0 39 14 -47 -75 1 -13 46 -37 -56 20
2779 20 141 16 -87 -65 72 37 -99 -71 17 26 -35 -16 25 31 89 -2 -61 25 110 13 -146 -92 66 152 -132 -98 70
2806 70 157 -47 -116 38 30 30 -8 -7 -4 132 59 -92 -111 127 164 -111 -132 46 192 -21 -113 -8 99 51 -56 -53 -96
2833 -96 42 58 -57 -179 14 65 -21 -158 18 158 5 -90 -74 75 42 -59 -65 36 38 68 -18 13 58 87 30 -71
2859g1L3J31p1j20M8Q5L7j41L4M8k4P5q7q7R2O7j8m5k7O9K9j21P1O7m4l3qL2L2
2888E3ll3J7pOo4Q3k2Kk0j2K9mJ8J0n5k4M4p0L8P2k7q0O0K3p1J2Qk6J14n9r1J06
2921B7M5m6o4n0R9L1j5m1QN5o4M4j00L3J26r1q0mJ27J4j06mQ0P5n8p7QN2N3o7
2951A0p3O3P3k5j45MJ11Pr5q6J53N8m9j09K9J9J24m6m6l1J24Mj39l5J36J03j06
2978C3m9j8J20K8j44j0J09L9p4j30jJ43J6q4q7Q2J21m3j80M9J10N3j48l5J24M7
3004G1k6j36J0J54M4j51n9R4J24o7j72O6J65k5o2r5M2J28m3j54m3K13O4j54j57
3029a69J16J92p7j19K5J16k3j11p7J06J12m1r7k6J47J9r4q7M1J77j07j12K4J09
3053D4O8j59o9O4J18l8q5J2P4N1m8j62P4J21M1k14K8R4Q0r8j06J66O9j08p5j5
$$ plain form
2859 -71 -38 93 22 -98 -50 35 72 -69 -35 13 -11 64 -23 -110 -18 49 31 -14 -41 28 57 -64 7 74 30 -3 -11 21 53
2888 53 50 17 34 27 33 -31 52 30 32 12 0 29 25 43 53 -2 -26 18 -52 -14 58 31 -49 11 34 -37 -25 -17 -43 71 12 -79 27
2921 27 72 26 -38 -88 11 42 27 -14 -6 49 -15 29 -71 -38 88 -3 -83 -87 40 54 -52 -56 24 99 41 -36 -28 24 77 10
2951 10 -63 0 73 48 -97 -93 18 25 -70 -156 -3 55 6 -103 -74 -55 69 23 -23 -54 70 74 -65 -100 36 139 33
2978 33 -16 -34 86 114 -30 -40 69 108 34 -96 -97 46 62 -22 -109 -27 94 51 -129 -80 30 83 -65 -100 24 71
3004 71 45 -91 -81 73 117 -34 -93 1 125 58 -114 -48 117 92 30 -65 -23 105 62 -92 -135 78 142 -12 -169
3029 -169 -53 139 62 -57 -32 84 61 -50 -127 -21 91 50 -47 -73 74 93 -1 -88 -47 130 23 -89 -65 44
3053 44 112 -47 -116 -52 66 28 -57 -45 29 80 32 -130 -56 65 106 -108 -80 14 94 -4 -110 56 125 17 -58 -73
3079g3Q0P0o3m9k4R3K9j02k3J43jj12q3R1J06m5n2l6N0J36j54mJ9L6Rm8p7P9J04
3108I9r6j6M3J1K6j18lM4Q9p9q1M6P3m4oo2j6J62o7p9M4P8n4J1n5N0P8o0j3L0
3138C5K8m0j5k4M6M2m7n2L4N4l4Qr4Q1nNpr3J16J1o8o0Q5L7r4j9L2Q3K0j25M9
3169a1J5N7p1o1L7R4p3p0N9J5J8N3j60L3M5K2k9NM8J3j10Q6nPmm3pL5K7k8RK9
3201C5j8M9l7n9M3K8r1k5N7M7m2l5M7j5O0o4Rl8O6j3j2o5J24J6o9l7M4R1o6n2
3231b2QP8j8o9L3J5j2RM8j06K9Ll5m4K0P3L2o3o1J12m8J3l5L7n2PM4k0rJ4L5o8
3263e2L7N6Po3o0J02Lk2l7O9k8M5j13NL7N4n1l0P0j3L0q1L1L7L2j09j5R1k1L6
3293D7j11N3J8oKm2RJ27j63L0qL3O1q4RK4Pj6LoOj0N1k0m2K0P4p2jL2Q5j09l6
$$ plain form
3079 -73 7 77 14 -35 -59 34 63 -39 -62 81 80 -32 -115 -24 82 37 -15 -51 -1 135 -19 -23 -4 32 41 -7 -84 -5 99
3108 99 3 -13 30 41 67 -51 -54 -10 79 0 -81 -35 38 -6 -12 -74 -90 72 5 -74 -30 48 -6 5 -50 0 78 18 5 35
3138 35 63 23 8 -16 30 72 25 -27 7 61 27 35 -59 22 17 22 15 -78 38 49 -19 -79 6 43 -51 -70 -38 45 65 -60 -11
3169 -11 4 61 -10 -71 -34 60 -13 -83 -24 -9 9 62 -98 -65 -20 2 -27 -22 26 39 -71 15 10 17 13 -30 -37 -2 25 -3 6 35
3201 35 17 66 29 -30 13 41 -50 -75 -18 29 -13 -48 -1 -16 44 -20 -11 -49 17 4 -8 -73 51 67 -2 -39 5 96 30 -22
3231 -22 -14 64 46 -23 10 25 13 22 70 -36 -7 -4 -39 -83 -63 10 42 -21 -82 30 -18 -5 -40 -3 -55 -48 -4 -24 -33 -19 16 -52
3263 -52 -15 41 48 -15 -75 27 30 8 -29 40 12 57 -56 -51 -14 40 -11 -41 29 16 46 -35 -4 33 65 -44 -59 32 11 47
3293 47 -64 -11 7 1 3 -39 -30 97 -66 -36 -44 -11 50 -34 -25 -1 6 -10 -7 -13 -7 -17 34 14 -28 -8 66 -6 -7 25 110 1 -35
3326c5L8N1r3Q4K8l3r7N7l6j2k8P4K6n4%L6n4O7l6O9k4m8N1r6O3L7j7J7k4LkJ0
3358B2mm3O7jp8M5Qk2K7m9K5K8Nl5kl0L1M3n1Lj4L6m9m4J24l7lm8P4n5Q8n1m2
3391c2N2Q1j09l7K8J2N0m9pL8PM3j19K4L5k6O0r1lK7N1n9J2L0K7o4k7M6j4J0q4
3422h8J11n2O8km3l8K7K0J6k3JK4k2m0J8M2j4l1K3N5nj5j07M2P3K2j19O2M9m6
3452HO0q9l0J35K9j33k5O3O1q5m3%L1L3r4L2J8M2j8p7M3J09k8q8K2M2N1j05m8
3481h4M1J06K7p6nj4M4Pq4k9P0J09r1j50J43R8j04r2L7J24l4j10m3J07N6m0r1
3508g8NJ05J09j21j15Q1J29m4j05n1K23j6r6n5J5O0M1j46j1P9J03j28o9K5R2M7
3534G9j32n0R0R7j00j07J01Q9K6j78J4J02P4l9j07K2J19l4j20j3R1P8p5p9M6R0
$$ plain form
3326 -35 3 54 -39 45 73 40 -57 0 -36 -48 -76 -2 24 -30 -30 6 -48 19 -17 52 28 -20 31 -65 -2 35 18 35 11 14 12 22
3358 22 18 -25 42 41 -37 8 16 -6 21 -28 -3 25 30 -5 -7 -37 -6 37 -14 -11 -25 11 -38 -82 42 5 2 -46 28 -27 61 10 -32
3391 -32 20 101 -8 -45 -17 -5 45 -4 -11 27 34 77 -42 -18 17 -9 51 -40 -43 -16 35 -24 -12 18 45 -19 -46 0 -14 -4 -88
3422 -88 23 -29 39 37 -6 -44 -17 3 19 -4 -3 21 -1 -41 -23 19 5 -26 -3 52 47 32 -75 -33 40 62 -57 5 54 8
3452 8 68 -21 -51 84 113 -20 -45 18 79 -6 -49 -49 -18 15 -79 -47 -29 13 -5 -82 -39 70 42 -46 -24 18 69 -36 -84
3481 -84 -43 63 90 14 9 -5 39 46 -38 -67 3 112 21 -129 14 112 8 -84 -47 77 43 -67 -110 -3 53 13 -78
3508 -78 -73 32 141 20 -95 -14 115 71 -34 -85 138 122 26 -29 -14 46 87 -59 -70 9 112 -16 -85 -60 32 79
3534 79 -53 -103 -13 84 -16 -123 -22 67 93 -85 -71 31 105 66 -41 -19 100 66 -54 -67 24 102 27 -52 -6 84
3560H4j5j46K4O2P7n5p2k8J02Q5j29k4K1J2M8j23M8J23j6j09m7Q3R0Kk02P0N2
3587A7J00j09j12J04L6o2k4n0J41M7j23q1P3J48p8j5j0L7N1j04n2N2J13m0o5n3
3613e9O3R5m8j04J0L9Nj0q5J12j8m3n8L7Q4j0j6l9K1P2j7p3M1OQn3l2L7Q6oj03
3644e8N9oQK8p9J7L9J6m0JM3J6n5l3L3J9j4j3N2pl1j3Jj3P8j3m3j2L3kK5o0K8
3677DM5m2k7jL8j7K3m6K4k0N1J0n7k5R0l4n0K0P2j8k4J4J4L7%n3l2JjM0m1RJ4
3710A8L4k9j9l5KP3r7Nj7N6R2r9j6K2J5M2q6M7m5J13l1q0O0rN8o7n5Q5M4o1n9
3741c9J6J07l3l2k9Qk%n1N4rL3k1k2k1L1Rnj5L6MJ4j6m2L4K8m1JO3J8o8Pm0O2
3775C9M9q8J7o5Q2l2jk2NN8p8RK3J7L0l5KJ5k0K5n1k2M3j6J4n5P6M9p4%K3K2m9
$$ plain form
3560 84 69 -77 -53 9 86 31 -41 -69 33 118 -11 -35 -14 -2 46 -77 -29 94 78 -31 -78 5 95 97 -105 -35 17
3587 17 117 8 -104 0 36 -26 -50 -100 41 88 -35 -116 -43 105 27 12 2 39 90 -14 -66 -14 99 59 -6 -59
3613 -59 4 99 51 -53 -43 -4 1 -9 -94 18 0 -43 -101 -64 20 10 -6 -45 -24 48 31 -42 -1 5 13 -40 -72 -35 51 45 -58
3644 -58 1 -5 3 31 -48 -31 8 24 -16 -15 28 44 -11 -44 -11 8 -6 -19 33 26 -5 -18 -17 -30 48 35 -8 -20 13 11 36 -24 4
3677 4 49 7 -20 -21 17 0 23 -23 1 -19 32 42 -15 -40 50 16 -34 -14 58 40 16 30 44 81 81 28 -4 -3 -4 36 -5 4 18
3710 18 52 23 4 -31 -29 44 -53 -48 -65 -9 83 -16 -32 -10 5 47 -39 8 -37 76 45 -35 25 16 74 7 -48 37 81 20 -39
3741 -39 -23 84 51 19 -10 -2 -4 -4 -55 -1 -10 23 2 -20 -41 -10 -1 -6 -21 15 19 33 17 -25 9 37 -4 -3 60 78 10 17 -23 39
3775 39 88 0 17 -48 34 2 1 -21 -16 42 -36 -27 -4 13 43 8 10 25 5 30 -21 -43 0 -16 -2 -57 19 68 -6 -6 17 39 -10
3808a0Qk2M1l6K1m2N7O0j3p4Kj6O8m9J1j3J4K4K7k5j7K7l8QK4Pm5L8o8L0MJ9n4
3841c2j5L0M7m0M3n3m3L3PK3J6oj0k9K1OlJ8jO4q3O3p4M8Lk3K0%o1MO5m3L3J1
3875C9o1qN3m1oK6j8M2pJ1l0J9On5M1J9ll7M3LJ7l5n1J2L8J4n2K5NN0n8n3K9K0
3909cL4j4m0k8R3j7l3j2L9M6q1J0jQ7p8l6MQ7mn6m4O9K1n6n0P2L8o5pKPO9j3r4
3943e4M6O0k5J5m5JJ9j4jk6R8o4k0k7K5N5j6r2M3OO2n9n1Q1j1O6j41L2K8mL4r1
3975g0J07Qj1m8K1pK1m8Rj3N0qj7k2L0M7j6k8j8P3m2p7kkJ00no7k2M0k2L7l8N1
4008A1Qk0n9P1K8k8Nm5L0N4j5m5k3R9p1Kk7J3N6Rj08Q3J1o0L6o6N7l3K1j6m6O5
4040cM5m2p5R6k9mm1M8kL9j3m7L1j2J7m0K5N0l7K1r2P4K8m6JL2L8p3P9o2mO0k4
$$ plain form
3808 -10 -2 -24 17 -19 2 -40 17 77 64 -10 -8 -24 44 -5 6 -7 7 31 58 33 16 43 5 13 37 44 -1 37 -31 -1 3 22 -32
3841 -32 -47 -17 30 -10 33 -20 -63 -30 -23 0 16 10 0 -29 -8 -2 -5 13 12 76 -7 56 -18 30 33 10 30 30 -31 -27 38 -5 28 39
3875 39 -22 -30 23 -18 -24 2 -16 26 19 30 0 19 25 -30 11 30 27 -10 33 36 53 18 -33 -21 17 31 -21 4 9 59 1 -52 -23 -3
3909 -3 31 17 -23 -51 42 25 -8 -20 19 65 -16 -6 -7 80 2 -34 -30 57 53 -3 -47 22 43 -13 -63 9 47 -18 -25 -23 -16 53 40 -54
3943 -54 -8 52 27 42 -3 -2 17 3 2 -24 74 10 -10 -37 -12 43 27 -65 -22 -16 46 -13 -64 17 6 72 -69 -37 -9 -13 21 -70
3975 -70 37 45 34 -14 7 0 21 -27 -18 -31 19 11 -6 -28 2 49 33 5 -13 60 18 -59 -61 -63 37 32 -35 -57 -17 -39 -2 -40 11
4008 11 19 -1 -60 11 39 11 16 -29 1 55 40 -5 -28 71 0 2 -25 -12 44 53 -55 28 39 -21 15 -51 6 -27 -6 -22 -68 -3
4040 -3 42 0 -75 21 -8 -12 -53 -5 -7 32 19 -28 3 -9 8 -32 -7 43 6 27 -65 9 37 -9 -8 24 62 -11 68 6 2 62 38
4073C8l1rL8Jj5m9Q6%ml4j1J0j5k4J6PMl6K4j5j6M6o1k1Q1k3M5m8%N8l7l3O6j7
4107B1P3j01O5p0K9N4j16Q8mPqj9q8O5L8n2PL4k9l1k3N2oK3Jl6K6J0J3o3K8qM8
4140B8njk2KN6n7PQL4k4m5K2J5l7N9k1lPn0L3J1LK0k0n5%N2l9Kj7K1P3o4J6jJ2
4176B0K9m0Pkk9N9n5J7j1J4L2q9K6J0l1M1K4m0NL2L9m3L4n2N8n3L1po2Q8l8j1
4208CmKn7K5JQ5n7l4K4K7l7k1K1l4O4m8jL1kk2K9j5MM3Ll8qK1M3l0jk4K9L0o2
4243a0RP7n1k0m6M7J8p1RN5pn7nK1Lj2RJ5k8M1%m3L4P9o3L3L9o5Rj8k1L5oNO8
4278H3p6o8Q2rj7Ll2J1N3o0P6ll4%m0O8J0j7q5N6%J3n4L9N7jl5o3MN3m1mJ2J3
4312fk8K0L4k9nnN9o0j8O0m4J3oJ6O6j00nMQ4m3K4J0k8P0n2o7K0J4N1l0m1l5K8
$$ plain form
4073 38 7 -2 36 37 22 -27 59 59 55 21 10 20 5 -19 -3 4 8 -28 -4 -19 -35 11 -50 -71 10 -13 32 -16 -16 42 5 -28 38 21
4107 21 94 -7 58 -12 17 71 -45 43 39 46 38 19 -69 -4 34 -18 -11 23 -6 -37 -60 -8 -14 9 10 -26 0 10 23 -40 -12 -20 28
4140 28 23 22 0 2 58 1 8 16 50 26 -19 3 18 -19 40 19 16 23 -27 6 17 20 40 20 -35 -35 17 -22 -20 -37 -16 57 -7 9 8 20
4176 20 49 9 16 14 -15 44 -11 6 -5 9 41 -48 -22 -12 -43 -2 22 -18 -13 19 58 15 49 -3 55 2 33 26 -36 52 14 3
4208 3 -1 1 -56 -31 -30 55 -2 -36 -12 15 -22 -43 -22 -56 8 -40 -41 -10 -12 -34 -5 -20 -16 27 30 -8 -16 5 48 18 17 -7 22 52 -10
4243 -10 -1 76 25 5 -41 6 24 -47 -38 17 10 -47 -52 -31 -28 -40 -31 -16 -44 -3 -3 -46 -12 67 4 37 76 11 20 2 -19 16 10 15 83
4278 83 7 -61 21 12 -5 -2 -34 -23 30 -30 46 43 9 9 -31 37 47 30 -55 1 1 14 -40 -1 56 55 20 -43 -39 14 -27 -31 -19 -6
4312 -6 -34 -14 20 -9 -14 -19 40 -20 -38 22 -22 -9 -15 1 67 -33 -38 -34 50 7 31 41 13 83 31 -36 -16 -2 49 19 -22 -57 -29
4345b9M9p0K6M8j8mp0O2O7o5L1J7n9K3%J3oKk9PM1l3Opk4N9qJQn7J6mj7J3nlJ
4382a8L1m6J0L5n5K4O1p4L8m0M8PQl6M7j1K3n3j1M3J3m0l2P6j7j7m8K2J8J5k7
4413fj7qM6j6J6p4N4Q4j00MRk0N2o9N3k2L3k3m1O7m2j0L8p1O3J4j8o4P8M1n7m
4445a0m0L7R5p0j9jKNM3j5PLn6Mn%J8m7O7PNp2K2%lM5m1%Q3m2o8K8oL4kLpk5J2
4484iK0k7M6j4O3j27L9j9M0j5j5R2qm0p5K2O6j0j25J07j1L9m6j3j2M6J3n4j7O4
4514B0l6O3o1m2J32l7j6k7k3Q1k4Jp4J4N9Lp8P6kJ0l7J3k4R2p0m1P0j4Ro6KL6
4546IM2r0K8n2P6Nk2o2Q4K3M3j04M3K2m8k0l8P2l6K1j0j1J8L2pjrnJ8l1j8O6j3
4579B5j1%nkpN2l3l5OM0k6pL5o7K1pJ1rO1q4QpM5J1q1J30r0P1p7M4K7k1jl0J2
$$ plain form
4345 -29 20 -50 -24 24 6 2 -68 -6 61 -4 27 44 -15 8 8 21 15 17 -12 -5 36 3 9 2 -22 37 29 30 38 -19 -3 -7 -24 -11 -16 -19 -18
4382 -18 13 -33 -23 12 -43 -19 42 -32 6 -34 14 21 29 -7 40 29 52 -1 -12 31 44 4 -28 48 31 14 -34 -12 6 21 -6
4413 -6 -23 -31 15 -1 15 -59 -5 79 -21 -17 -8 -28 24 -45 8 -14 19 -4 -45 22 -20 -30 8 -63 0 14 -4 -68 10 51 -6 -10
4445 -10 -50 -13 82 12 -7 -8 -6 -1 42 27 34 37 -19 -15 -20 -20 -2 -49 18 25 30 -42 -20 -20 -23 22 -19 -19 64 22 -46 -18 -24 10 8 11 4 -21 -9
4484 -9 11 -16 30 16 79 -48 -9 -28 12 -3 -18 74 66 26 -49 -27 39 29 -96 11 0 39 -7 -20 -32 14 27 -27 -44 20
4514 20 -16 47 -14 -56 76 39 23 -4 -27 54 30 31 -43 -29 30 33 -45 31 29 39 2 15 -9 83 13 -28 42 28 37 -29 -27 9
4546 9 51 -39 -11 -63 13 18 -4 -66 18 41 84 -20 23 45 -3 -23 -61 11 -25 -4 -14 -25 -7 25 18 17 8 3 21 -10 -28 38 25
4579 25 14 14 9 7 0 52 19 -16 -10 30 4 -3 32 -35 -14 -21 -10 -19 42 -42 -34 -41 4 15 -66 64 -26 45 -32 12 39 18 17 -13 -1
4614aK4k8J6l5K8O0o2Rl2R3j8pk7o1N8kl3K1Rr2Q3k3k4L2kK3m6J1M3j2l3K5L2
4647B9qn3L6K3j4N3k5k7J6l0RoRm6K5kN0k6k2M7J4m5n7P5l4O0r2L6M3k8oML6o2
4681a8KK8o%l2j6J1LKj2K6L9Qrl7OJ6J7%j4L9j7K4k5m3OK4j1jNk9J8%M3r2M4l7
4718c8k7P4l8L7j1o4J05k6l7Pm1L3L0m7J6L6r%K0K6j9%l6nK1M6n9K7n1O0j2o0
4750d2P5j0m6L4j5N1k8k1n8PJ28r9J0p8N7K2O2k0n7L6j9J5k5K0M9p6LM7j7M1P
4781E3q7M0l7L0K7m9K0j2j8K4M1m5k3P1k9K9l4M5k1k3j9K1Qp8Q7k5Ol0MqJ0K6
4813DnRl4K4jmL8m7K9m9O8n8N3RJ2m0N4p7QM8pk7o3Q3o9J6J6l6L4J9Qk6o5M9j4
4848d1PK3NJ8J5l0PmNJ4K9Kk2m0O0k4k5J1L6K4j1l8j6J0Q5j15j0O7m4J0o6N5j
$$ plain form
4614 -1 23 -5 11 -24 4 64 2 11 -21 72 54 47 20 -41 17 15 -18 3 12 -80 3 -20 -44 -12 -14 9 -37 -26 17 5 -28 -3 29
4647 29 21 -32 4 27 13 66 41 14 30 0 9 3 12 -34 -9 -11 39 13 -9 38 52 7 -50 25 -9 51 -41 -5 38 10 4 8 44 -18
4681 -18 -16 12 6 6 -26 -42 -31 -28 -26 -38 -12 27 35 26 -11 -5 11 28 28 14 53 36 60 35 -8 -2 22 11 10 15 -14 4 4 47 -45 -1 -38
4718 -38 -65 9 -29 8 -3 -67 38 12 -25 -18 -59 -26 4 -43 -27 9 0 0 20 46 27 27 -9 -14 7 53 -6 21 -30 30 18 -42
4750 -42 33 23 -23 11 -4 47 19 -2 -60 -53 75 -24 -14 -92 -35 -13 49 29 -28 8 -11 4 -21 -1 48 -28 -25 22 5 46 53
4781 53 -34 6 -31 -1 26 -23 -3 -15 -33 -9 32 -13 -36 35 6 35 1 46 25 2 -17 4 12 -66 21 -4 2 -28 -24 -32 -22 4
4813 4 -1 8 -26 -2 -3 -7 31 -16 13 -36 32 -26 27 36 48 8 62 -15 -7 41 34 7 -56 27 -42 -26 -10 -46 -12 7 15 -11 -76 -27 -41
4848 -41 -34 -11 -6 12 27 -3 4 0 5 19 48 50 28 -12 48 24 -1 10 46 70 59 21 5 15 100 -15 -25 42 -2 8 -58 -3 -4
4881dk2M3n6M4k0j9%jkJ5k2M2j0PK7j1j3l7L1P0p3L7J8%m3M9o2L2k0J2k8J6%K5
4915B5k2L7k3m4L6o5Q2m9l3R9p3kN3p5K6L1j3J3pkJ5k2M3n0J7j3L4j6J7Pj6kJ3
4948B1N0o8L0k1J0rL0k7k0M7k7k1k2Q4l4pk9Rj3K6J8o2Q1p3P3l2o1P7o9L8l3J9
4980a5j3J5L4m2QK9M9m9%m3N6p1K1J8K7ol2J1K7j8n5L5M3m1m8P7k7J1l1M3j0N
5012Hn4K2m7N6JmpL0k9L3ML4k8k1LJ4l6M8k8K2m1L6L0k6mj5q3Q4lK5l9l2O0J7
5046C0l7oO2lk6j7RmQ2j27N4Kn1K6J2K0Nl8L5k1n6P4m0L4jkl7mJ8L6J3k3L7l2
5080B4nlk4k7K7L5J7n5k6M4k9M8J9qL6o5j5Nj13J13m5P2l4k1J2L6jjl1M5q4J01
5112D7J0m5J4lo1M3J2j6M7n5OkK9l0P7r7RjJ7j2j2k3M6o4Q1j2k4Nk2K2J3OJ0k5
$$ plain form
4881 -4 -26 17 -39 5 -15 -34 -34 -35 -37 -22 -44 -2 -12 -5 22 11 -2 -39 -8 62 -11 26 44 44 1 50 -12 20 0 12 -16 0 0 25
4915 25 3 40 17 -27 9 -56 26 -23 -56 43 -30 -32 21 -54 -28 3 -10 3 -4 -6 9 -13 30 -20 -3 -16 18 2 19 26 10 8 21
4948 21 71 3 33 12 22 13 43 16 -4 43 16 -5 -27 57 23 16 -13 -4 -17 9 27 -35 46 -27 46 14 -47 30 -39 -1 -34 -15
4980 -15 -28 -13 21 -21 -13 16 65 16 16 -27 29 -42 -21 -3 24 18 -14 -3 24 6 -49 -14 29 -12 -60 17 -10 1 -30 13 3 8
5012 8 -46 -24 -71 -15 -14 -18 -25 5 -24 9 13 47 19 -2 1 15 -21 27 -1 21 -20 16 46 20 16 1 -82 2 -1 24 -15 -47 13 30
5046 30 -7 -13 49 46 20 3 12 8 90 -37 17 19 -32 -6 6 26 31 -7 28 7 -49 25 -15 19 18 16 -21 -25 -7 29 42 19 56 24
5080 24 19 16 -8 -35 -8 27 44 -11 -37 7 -22 26 45 37 73 8 -7 -2 -115 -2 -47 25 -9 -30 -18 18 17 16 -15 30 -54 47
5112 47 57 12 26 23 -38 5 17 1 48 -7 -1 -3 26 -4 73 -24 -15 -16 1 -11 -23 -46 0 -64 17 5 -19 -14 -36 -14 -1 5 15 -10
5146a0j5K0K9j5Mm3Q7ko1L8j9l9M3n0n2R2n5L3pl9M9L2jOPo0L7j6L3l7jl9%O7
5180A6j8j3j14J41Nn2N6k5k8K5jM2o9M2j6l2N3Nm2K6J7J3om8O8J1l6%K4p0K8o7
5212f5Q3j9j9j6K7J6L7j7n6M2k6j4j8j3Q9o0K6l5M4M5o0k7K8O2j1J1m3rL5Mn2
5243a1QMOL4l6k7M2k5m3P3k5J8r5J00l8M0k0l0K0rn9Q1p5L7K6Rk1K1j1j0J1k2
5275b7k3P5l6J5lk5K0j2N2j8k3O1q1L7Qn5O2Ok2J7qm3N2k8k2j1kK4n2Q5l1j1L1
5308A2j3lk8RM2OMm9L3Pj2K3j2j1M2Kj9m6Pk5j2K1N0P0m6o9L9J0j2q8P6L0l6K8
5342C0pL1r8R3j11P1k5Pl0K7K8k5j1Q0m2qOj3O9p4k0oK1K7%j4J3k1QJ3K8l2M2
5375E7j24N6J5j1L9m2L5J8m2qJ1q8P8m7J0J0j0L1%P0k9mo2J9R%N0j2J0l3j7L8
$$ plain form
5146 -10 -25 -5 24 9 13 -30 57 55 -6 32 13 -26 17 -33 -85 7 -48 -15 -22 -61 -12 20 19 25 32 -28 9 -7 26 -11 -12 -51 -51 16
5180 16 -2 -15 -129 12 17 -35 21 -4 -32 -7 -8 34 -35 7 -9 -41 12 17 -25 1 18 31 25 -23 45 56 20 20 44 -26 2 -65
5212 -65 18 -1 -20 -36 -9 7 44 27 -29 13 -13 -27 -45 -58 31 -29 -3 -38 6 51 -9 -36 -8 54 43 54 11 2 37 41 -11
5243 -11 -3 1 7 41 5 -22 20 -5 -48 25 0 18 -77 23 -15 25 5 -25 -5 -14 -73 8 -67 -30 -4 5 -16 5 -6 -16 -5 -27
5275 -27 -50 25 -11 4 1 -24 -4 -16 36 18 -5 56 -25 12 20 -35 27 33 11 28 20 -23 29 1 -21 -32 -34 -10 -62 23 -8 -19 12
5308 12 -1 -4 -32 -23 19 25 29 -20 13 20 8 31 19 8 50 52 33 -13 -6 -31 -43 -22 28 98 52 -17 22 32 20 -68 8 38 2 30
5342 30 23 54 -44 49 -62 9 -16 -9 -39 -12 16 -9 -20 60 18 10 16 3 72 -2 -22 -28 -7 20 20 6 19 -2 6 19 47 15 57
5375 57 -67 -11 4 -7 32 -10 25 43 1 -7 4 -84 -6 -53 -43 -33 -43 -12 -12 58 29 25 -37 -18 -9 -9 41 29 39 6 -11 27
5407B7n0J8Nnj0P2on7k0L1MK2m3L7m5MJ3L2m5K4M3k4n8N2n4N1m6N7k3k0K0j0j2
5440a6KRL9l6K7k4J3K3r2O2pJ4m7K1L7K0n6L5o7N3L9n9k8J4J6Nj2J6PM0k4o4j5
5473e5RL9l9O5j02NJ06j30J12n4K7P4j00N1kl3J0J2l0N6L6l8k8QL2j2n0K1M1o9
5503c8J00n3pNK6o1L4M1q3J2J6K5nl2OM6n1k6M2K4J4k0J3m7L8O1j28N3%o%m1R7
5536E5n8NK8J0n4J1M5p3M9RK3n4J3K9o5K1J9k9J8k4M2l9Jj9PM7j0K6p0k1O6k8
5568b0Lj7QL9j9O9p6J4O7j03N7pK2J2q3M4k4nk7Q5m5M3l2Jj0M2k1l7J4j0mrj3
5601d2Q6p0M0j2o5O6qm8R8l1JJ5o3j9O4M8n2M0k2k6j6R1p1kl9L3M4l9k3K7M0k9
5633A6k1K9m3k2l6R9j6JlM5l8K4k3l4NQQK6K1m4oJ4j0k1K6o1M7O6n5moM8o4M4
$$ plain form
5407 27 -23 -5 0 -5 -15 57 51 -6 -26 5 9 31 -12 25 -20 -16 -3 29 -16 8 51 27 -31 21 -33 18 -28 29 6 -14 6 -4 -16
5440 -16 -14 -5 34 -2 25 1 14 37 -55 7 0 14 -33 -12 25 45 -11 24 -43 10 49 -10 -38 -24 -8 -3 -15 1 8 48 24 -40 -55
5473 -55 -46 -7 -46 19 -83 -78 28 -102 10 -44 -17 57 -43 8 6 -27 -17 -5 -35 21 57 19 -9 -1 31 19 -31 -10 31 -38
5503 -38 62 9 2 7 33 -28 6 47 -36 -24 -8 17 12 -20 -14 32 -19 -45 -3 21 35 15 28 -19 19 80 -48 5 5 -1 -1 -42 55
5536 55 -3 2 30 40 -14 -3 42 -31 18 27 50 -4 9 38 -27 -6 13 -16 2 -22 20 -19 -18 -37 -30 17 7 33 -37 -58 8 -20
5568 -20 -17 -34 -26 13 -6 63 -13 1 68 -35 22 15 37 49 -34 10 -14 -19 -46 39 -6 37 5 6 -4 38 17 -20 -6 -16 -20 -29 -42
5601 -42 44 -26 14 2 -63 3 -5 -53 45 14 15 30 -33 -52 12 60 8 48 26 0 -16 75 4 2 -37 -4 40 1 -22 5 45 16
5633 16 -5 24 -19 -41 -77 22 6 7 4 49 11 35 12 -22 -17 -9 -1 25 46 2 -4 10 0 -21 5 -56 -9 57 2 -2 -8 40 -24 20
5667B0nl8LP4qm5J2rJJ8o1PmrN9n4L2N3l7KLk5j6K5j2J6Om9N6l1qO7j3k3k7N5
5703C5j8l3M6k4K6j5K3nj6j0l7K9K1k8QP3l0o2N5m2l5O7J3o9lJ6J9mo6P6k4k7
5735d1N2j4l3L8o1M9rk7Q2k3j8M2j2J6o3K6K3K5KNo0Nl4QL5l4K2j8K4o2P1J6p9
5768d7k9Q7rK0Rp1L2N6m6L7m8J8O4j33N2l1M4m0M2j2J5jk4J6L2p9M9J9k3J5j1
5799COj4J7m8K1L1nl0j1J3N1m5l0M3k5m1P4J5j4K3n7K4J5K8q0P1n0O1n4m4P9j1
5831A6L0l7Rj7M2j8K3l6Pk4N8p2%K6J8l7K9k7j5Rj9Kj6M9j4j3k2K0K9Rj4L9j8
5864A6lk0l4K3m2R2l0LK3Rk5J3L3Ml3rk6Jn5P0k4l3J14n1n3M6J4K2o3K1K1p5O6
5897A5j4K0j8J3j6k6O1mlJml8N2nn0mNk8R4n9N1m6N0n4L0j7K2J7k6m2MQ0n9qj9
$$ plain form
5667 20 15 -23 -20 54 46 1 13 4 5 23 -38 -31 -35 -44 15 -39 -7 46 9 11 14 -11 -27 -2 -14 2 8 -41 15 -16 -24 43 30 7 -20 35
5703 35 17 -16 30 6 32 17 40 35 19 9 -28 1 22 -6 2 75 45 -17 38 -4 -39 28 41 -28 -31 -15 4 0 -66 10 -14 -41
5735 -41 11 -3 -36 2 -59 -10 -19 -46 36 13 -5 37 25 41 -22 4 27 52 54 59 -1 4 -30 -22 13 -21 1 -17 7 -55 16 32 -47
5768 -47 -76 11 2 22 31 -40 -8 48 2 39 -9 9 73 -60 -8 -39 5 -35 7 -5 10 9 -15 1 33 -46 3 22 -1 14 3
5799 3 9 -5 12 -36 -15 16 11 -19 -30 -17 34 -11 -41 2 -23 -64 10 25 11 34 -23 1 16 44 -36 35 -15 46 -8 -52 27 16
5831 16 46 9 18 1 43 25 48 12 19 -5 53 -19 -19 7 25 -12 17 -10 -25 -16 -35 -33 -49 0 -14 -27 -49 -29 0 9 -5 34 16
5864 16 13 -7 -41 -18 -60 32 2 5 28 37 12 25 58 62 29 20 -6 -5 -60 10 -14 -47 67 16 -37 9 23 45 -18 3 24 -51 15
5897 15 1 21 3 16 0 -26 35 31 28 29 25 -13 39 34 -16 -20 -15 -43 51 -8 43 -3 47 -7 23 6 28 45 19 -23 -19 61 2 -6 -25
5932b5j5%N3l4K0mn3J3k0P4kj3j5O2L3q8N1m6NK7l4oM5J1n5QL8N2l5p0M4m5N9
5965C5kl7l5M9oK4l4J0J9m0J7m4L7N0l7K7lRo2L4K5m6k2L9j7LL9mp9M4QJ9QJ%
6000B9j4L0n9K5%JJ9qj6m3j9J7L9lk0j0k5R1p4N3k6N1mj02L2M0l7M2k7L1m4L0
6032aM8j9k3J2m3M0m3J6k7O5l9rK0l0R8n8j6L8nOK9J1q4mO1n0j1K3k4L6K3o2L7
6065A5k1l4Qj4KM2k9R1n8MMJ3K3k2j4j5N8o7M1Pj9Mj4k8J7lLM8mk8l8N1l2Q5m2
6100C4o9K1J6m9M4l4K0M4k3k1m2M5J2L5l6p1N1O2n9LJ0O5k7l9J5K5j4jl1J4K0
6131B0m1K1N3j02J7j1j9M7N3q1lO4k7jRol2O8k1k5OKK6J0m7M9q5M4J3Qk1L2j1
6164IK2m7P3o0L8K8p5J1Rj2N1o3PM8k6m6M7m7M1%n8L8j0L3k9JP5p6J1l1N0m4N7
$$ plain form
5932 -25 -40 -40 13 -21 -1 -5 -58 -45 -65 9 7 -6 -21 41 74 -14 37 -9 -4 23 -11 -17 28 39 -16 -8 30 82 47 -23 21 -24 35
5965 35 33 -4 -39 10 4 28 -6 4 23 -17 0 -44 -7 43 6 33 30 39 -23 11 36 -10 -32 7 -10 -7 32 28 -51 -7 1 20 28 29 29
6000 29 15 45 -14 11 11 12 31 23 7 -36 -55 -38 1 -2 -22 -32 -57 34 -40 13 -13 38 34 -68 -36 4 -33 9 -18 13 -31 -1
6032 -1 47 28 5 17 -26 14 -29 -13 -40 25 -14 -23 -3 -33 65 7 -9 29 24 30 59 70 -14 -18 43 -7 -18 5 -19 17 40 -22 15
6065 15 -6 -40 -32 -46 -44 -2 -31 60 2 6 10 23 46 24 10 -5 53 -14 27 34 15 19 5 -23 -6 -9 -6 42 38 10 -28 23 -9 76 34
6100 34 -35 -14 2 -47 -3 -37 -17 27 4 -17 -59 -14 -2 33 -3 -74 -23 39 -20 -17 -7 58 31 -8 7 32 18 17 -14 0 20
6131 20 -21 0 53 -49 -32 -43 -62 -15 38 -43 -46 18 -9 -10 -1 -7 -39 29 8 -17 -11 -9 17 27 -20 29 -56 -12 1 9 -12 20 9
6164 9 31 -16 57 -3 35 63 -12 -1 8 -4 47 -16 -9 39 13 -33 14 -33 8 8 -50 -12 -22 11 -18 -17 58 -18 -7 -38 12 -32 25
6197B5k6k9J1L6n1P4j6%K7n0oj4M2l0j2j3O4m7K1L0J3l4l4L5L2l3%JJ2o2K4jm
6230a5k1M5n7J5pLR%Q3q6k7L6k5O1k1l9Q7p1k0O7K7l7k8J6Qok9P4o4L0k1K0K6
6263C3jj9Jl3rl3L9L1%j1nl4k9M9O4p7L1oj6N3k8Km9N5Pl3NM3j2J0j3j3K0j8J7
6298B1K9qp3M9n1j8P0k0j5J1K2%l6m8P1K1n0K9k6KK0j6j0JL1nkL5k9l6N5nj9K8
6332B8K6l5Pnl2K7LM4l5M0n2J7p1L2n6R1m7L2Mj8lnJqMK1nOk7J9L7o2l0L4N3m6
6368a1M8jm5K6j2J0j1%NJ5J6Nm0Pkn9K1J6M5l2Jj8L1k6N5o7j9pM9L0rjm1KM8k5
6404Dj3L3Jpm4M7nl8K3L0kj0L3p7J2N6j2j4l8O8k5J7j4J8l1o4K0L0J0l6L9Qpm5
6438c3L0l2L5%O2m7m3j4N0ml4KnR3j3q1N3J1K5o0P8n5nk6O0k8K3ko1j3O7J5Qo
$$ plain form
6197 25 -1 -30 -19 17 -34 40 24 24 51 1 -5 -19 23 -7 -19 -32 32 -15 6 36 49 15 -19 16 48 15 15 16 28 -34 -10 -11 -15
6230 -15 -36 9 -48 -33 -40 -37 -28 -28 55 -31 -58 -22 -47 14 -7 -46 41 -30 -50 17 44 7 -21 -5 3 -3 -32 42 -22 8 -13 7 33
6263 33 32 13 14 -19 -28 -61 -22 9 9 -2 -7 -41 -70 -21 43 -34 -3 -9 -25 28 0 2 -47 8 15 -18 -13 30 18 28 15 2 22 4 21
6298 21 50 42 -31 18 -33 -51 19 -1 -16 -5 17 17 -19 -67 4 25 -25 4 -22 -20 0 -16 -26 -25 6 1 -1 34 5 -31 24 19 0 28
6332 28 54 19 26 21 -11 16 19 63 28 68 16 33 -38 -6 -62 29 -18 14 18 0 -3 -8 -7 -15 -11 10 5 11 -16 3 40 -22 -52 -18 35 -11
6368 -11 37 36 -9 17 5 15 4 4 9 24 40 45 5 12 10 -49 -28 -12 33 1 2 -16 15 -11 44 -23 -42 -49 0 30 21 20 -21 -19 29 4
6404 4 -9 24 25 18 -26 21 16 -22 1 31 29 19 52 -25 -13 43 31 17 -21 47 22 39 25 43 12 -52 -32 -2 8 -28 11 19 12 -33
6438 -33 -3 -35 0 0 62 15 -28 -42 8 4 -30 -28 -33 60 47 -34 19 30 55 -5 73 18 13 -13 47 19 42 40 -21 -34 33 48 56 50
6472E0n1QPk6n8J22n2J0l2LM6o4k4P3qJ7o0N4nJ5lk4K6m3l5O1l9L2L1j1J3nK9
6505E7p0K2M1ro4j1K5j1M9n5L0L5n8MK6l3k7K4JL0k1Kj9K0%%J7N5rn6j4O2J2m4
6539A1KoK7j5j0n5J0N1j4M7k0J7p4O3m5RRJ0pK0k6j8j9J0J5K8j1l8K0j4M8jl2
6572hN1j0o2N6j3j2M4k3oK0j8J5j9L8j0j2m1K8j8M4j4m1O2n1K5J7j8kkj5k7O4
6604D2q0L2kn1K9Pm9P0l4J3K9k4PJ3j2lj3K3P6o4j7lj5J2RJ9J1j6m2J5L3l6O0
6637C9nn1O4Jn2rk7R3q7J4J0k9N1j2L4Mj2p3R3m5KJ8k1K8l1l3L8k1K5K2lj3K4
6670C6k5k2L2J2j8%j4pJ8K%j9J3lj1lj7M0jl6LOkpM0m6j1K8knP3l8J1kjk6M1l
6708C6j1j9M7o6J4k7J2M3o7R3l7NL1n3J9Qm4KL0K2m1P1m5q1O8%l7N2%J2o7K0J6
$$ plain form
6472 50 -1 7 14 -12 -70 52 0 10 -22 -19 27 -37 -61 12 4 21 -39 15 10 25 22 -2 24 -19 -54 7 -32 0 31 20 33 28 57
6505 57 -13 9 50 41 -23 -34 -9 -20 29 -26 4 39 -19 -15 11 -22 -49 -25 -24 6 -15 -13 -32 -12 -12 -12 5 60 51 -5 -19 43 55 11
6539 11 13 7 34 19 9 -46 -36 15 1 48 28 45 -29 34 -11 -2 7 17 10 30 4 -14 -33 -23 -8 20 9 -29 -9 -23 25 24 -8
6572 -8 43 33 -29 27 14 2 46 23 17 37 19 34 15 53 43 31 -10 18 0 44 30 -11 51 0 25 42 24 22 20 5 -22 42
6604 42 -38 -6 -8 -59 -30 -23 -72 -2 -36 -23 6 -18 -11 2 -10 -13 -26 -3 73 9 -8 -11 -26 -14 -5 14 25 9 -33 -18 15 -21 39
6637 39 34 -17 47 48 -4 -13 -40 53 -34 -20 -10 -39 12 0 34 38 26 -47 46 1 3 21 0 28 -3 -36 2 -19 6 28 25 12 36
6670 36 11 -11 21 33 15 15 1 -6 12 14 14 -5 8 5 -6 -9 -26 14 13 -23 -20 -14 -16 -23 17 -29 -40 -12 -14 -19 54 16 27 25 24 -2 39 36
6708 36 25 6 53 -13 1 -26 -14 29 -38 55 18 23 54 1 20 28 -16 -14 16 38 -3 68 23 -58 10 10 -27 25 25 37 -30 -10 6
6741Fk9L6o1O4m9L7j5PM8l3Pk8nL5l1J7J3k2N0j5Pn6M1J3n4J0M1L7n2l8k4M2P
6774Fm1Pl7J2O8l4l5K3L6j1%J2kL6Jm8K4k8nKN2k7J8j7J9m7RJ8L7k5l3J0J6jn8
6809d3R1m9k2L9l8M2jn5L9J3K5l6K2k5L4m5L1j1L2o3O4k4n2P1n1j7L5L2n2K5o
6840EJ3NMl6k2M1P4m3l5qm8J0L0l8M8M1r7M7J0Rk7M6l2k4L4L1l2L8q9N4M4k8J6
$$ plain form
6741 6 -23 13 -48 16 -33 4 -11 -4 44 11 18 -10 -15 20 -11 6 19 -3 47 32 39 -17 24 37 -17 -7 34 71 19 -19 -43 -1 6
6774 6 -35 -28 -65 -53 15 -19 -54 -31 5 -6 -6 6 4 40 41 -7 17 -11 -16 -14 38 11 29 12 31 -16 -7 11 48 23 -10 0 16 15 -43
6809 -43 48 -1 -23 16 -22 20 19 -36 3 16 41 5 27 2 36 -9 22 11 43 -20 44 20 -32 39 -12 -29 6 38 -14 11 5
6840 5 18 23 27 -9 -31 10 84 41 6 -2 -50 -40 -10 -48 0 41 -56 -9 1 10 -17 29 -3 -27 7 38 6 44 -45 9 53 25 41
$$ [...]
8191B3
##END NTUPLES=NMR FID
##END=
