##TITLE=1H_LY-DMAA.Per.2.10
 CDCl3
 8 sc, 
 14.02.2022
##JCAMPDX= 6.0         $$ Bruker NMR JCAMP-DX V2.0
##DATA TYPE= NMR FID
##DATA CLASS= NTUPLES
##ORIGIN= UXNMR, Bruker Analytische Messtechnik GmbH
##OWNER= root
$$ XWIN-NMR		Version 3.5
$$ Mon Feb 14 13:01:44 2022 Russian Standard Time (UT+4h)  she@DPX200
##.OBSERVE FREQUENCY= 200.131346
##.OBSERVE NUCLEUS= ^1H
##.DELAY= (6, 6)
##.ACQUISITION MODE= SIMULTANEOUS
##.ACQUISITION SCHEME= undefined
##.AVERAGES= 24
##.DIGITISER RES= 18
##SPECTROMETER/DATA SYSTEM= spect
##.PULSE SEQUENCE= zg30
##.SOLVENT NAME= CDCl3
##.SHIFT REFERENCE= (INTERNAL, CDCl3, 0, 15.7039)
##AUDIT TRAIL= $$ (NUMBER, WHEN, WHO, WHERE, WHAT)
$$ ##TITLE= Audit trail, XWIN-NMR		Version 3.5
$$ ##JCAMPDX= 5.01
$$ ##ORIGIN= Bruker BioSpin GmbH
$$ ##OWNER= she
$$ F:/spectra/data/she/nmr/H-F/1/audita.txt
$$ ##AUDIT TRAIL=  $$ (NUMBER, WHEN, WHO, WHERE, WHAT)
(   1,<2022-02-14 12:59:47.51 +0400>,<she>,<DPX200>,
      <created by zg, POWCHK disabled, PULCHK disabled
       configuration hash MD5:
       00 E9 B6 7A A2 85 ED C7 34 08 36 98 17 FE 4E 26
       data hash MD5: 16K
       23 A5 4D F4 29 2C C6 20 24 6A 5F 40 94 F8 EB 8D>)
$$ ##END=
$$ 
$$ hash MD5
$$ B6 8D C8 24 ED 94 50 F9 EE DE DE 4D 5D A1 72 D2
##$RELAX= 
##$RELAX= 
##$RELAX= 
##$RELAX= 
##$RELAX= 
##$RELAX= 
$$ Bruker specific parameters
$$ --------------------------
##$DU= <F:/spectra>
##$EXPNO= 1
##$NAME= <H-F>
##$PROCNO= 1
##$TYPE= <nmr>
##$USER= <she>
##$AMP= (0..31)
100 100 100 100 100 100 100 100 100 100 100 100 100 100 100 100 100 100 
100 100 100 100 100 100 100 100 100 100 100 100 100 100 
##$AQSEQ= 0
##$AQ_mod= 1
##$AUNM= <au_zg>
##$AUTOPOS= <>
##$BF1= 200.13
##$BF2= 200.13
##$BF3= 200.13
##$BF4= 200.13
##$BF5= 200.13
##$BF6= 200.13
##$BF7= 200.13
##$BF8= 200.13
##$BYTORDA= 1
##$CFDGTYP= 0
##$CFRGTYP= 5
##$CHEMSTR= <none>
##$CNST= (0..31)
1 1 145 1 1 1 1 1 1 1 1 1 1 1 1 1 1 1 1 1 1 1 1 1 1 1 1 1 1 1 1 1 
##$CPDPRG= <>
##$CPDPRG1= <>
##$CPDPRG2= <>
##$CPDPRG3= <>
##$CPDPRG4= <mlev>
##$CPDPRG5= <mlev>
##$CPDPRG6= <mlev>
##$CPDPRG7= <mlev>
##$CPDPRG8= <mlev>
##$CPDPRGB= <>
##$CPDPRGT= <>
##$D= (0..31)
0 1.2 0 0 0 0 0 0 0 0.06 0 0.03 0 0 0 0 0.0002 0 0 0 0 0 0 0 0 0 0 0 0 
0 0 0 
##$DATE= 1644829186
##$DBL= (0..7)
120 120 120 120 120 120 120 120 
##$DBP= (0..7)
150 150 150 150 150 150 150 150 
##$DBP07= 0
##$DBPNAM0= <>
##$DBPNAM1= <>
##$DBPNAM2= <>
##$DBPNAM3= <>
##$DBPNAM4= <>
##$DBPNAM5= <>
##$DBPNAM6= <>
##$DBPNAM7= <>
##$DBPOAL= (0..7)
0.5 0.5 0.5 0.5 0.5 0.5 0.5 0.5 
##$DBPOFFS= (0..7)
0 0 0 0 0 0 0 0 
##$DE= 6
##$DECBNUC= <off>
##$DECIM= 32
##$DECNUC= <off>
##$DECSTAT= 4
##$DIGMOD= 1
##$DIGTYP= 9
##$DL= (0..7)
0 120 120 120 120 120 120 120 
##$DP= (0..7)
150 150 150 150 150 150 150 150 
##$DP07= 0
##$DPNAME0= <>
##$DPNAME1= <>
##$DPNAME2= <>
##$DPNAME3= <>
##$DPNAME4= <>
##$DPNAME5= <>
##$DPNAME6= <>
##$DPNAME7= <>
##$DPOAL= (0..7)
0.5 0.5 0.5 0.5 0.5 0.5 0.5 0.5 
##$DPOFFS= (0..7)
0 0 0 0 0 0 0 0 
##$DQDMODE= 0
##$DR= 18
##$DS= 0
$$ [...]
##$SUBNAM2= <"">
##$SUBNAM3= <"">
##$SUBNAM4= <"">
##$SUBNAM5= <"">
##$SUBNAM6= <"">
##$SUBNAM7= <"">
##$SUBNAM8= <"">
##$SUBNAM9= <"">
##$SW= 18.0517287032376
##$SWIBOX= (0..15)
0 0 2 0 0 0 0 0 0 0 0 0 0 0 0 0 
##$SW_h= 3612.71676300578
##$TD= 16384
##$TD0= 1
##$TE= 0
##$TE2= 300
##$TE3= 300
##$TEG= 300
##$TL= (0..7)
0 120 120 120 120 120 120 120 
##$TP= (0..7)
150 150 150 150 150 150 150 150 
##$TP07= 0
##$TPNAME0= <>
##$TPNAME1= <>
##$TPNAME2= <>
##$TPNAME3= <>
##$TPNAME4= <>
##$TPNAME5= <>
##$TPNAME6= <>
##$TPNAME7= <>
##$TPOAL= (0..7)
0.5 0.5 0.5 0.5 0.5 0.5 0.5 0.5 
##$TPOFFS= (0..7)
0 0 0 0 0 0 0 0 
##$TUNHIN= 0
##$TUNHOUT= 0
##$TUNXOUT= 0
##$USERA1= <user>
##$USERA2= <user>
##$USERA3= <user>
##$USERA4= <user>
##$USERA5= <user>
##$V9= 5
##$VALIST= <valist>
##$VCLIST= <CCCCCCCCCCCCCCC>
##$VD= 0
##$VDLIST= <DDDDDDDDDDDDDDD>
##$VPLIST= <PPPPPPPPPPPPPPP>
##$VTLIST= <TTTTTTTTTTTTTTT>
##$WBST= 1024
##$WBSW= 4
##$XGAIN= (0..3)
0 0 0 0 
##$XL= 0
##$YL= 0
##$YMAX_a= 212482
##$YMIN_a= -205078
##$ZGOPTNS= <>
##$ZL1= 120
##$ZL2= 120
##$ZL3= 120
##$ZL4= 120
##$ABSF1= 10
##$ABSF2= 0
##$ABSG= 5
##$ABSL= 3
##$ALPHA= 0
##$AQORDER= 0
##$ASSFAC= 0
##$ASSFACI= 0
##$ASSFACX= 0
##$ASSWID= 0
##$AUNMP= <proc_1d>
##$AZFE= 0.1
##$AZFW= 0.1
##$BCFW= 1
##$BC_mod= 2
##$BYTORDP= 1
##$COROFFS= 0
##$CY= 11.3945322036743
##$DATMOD= 1
##$DC= 2
##$DFILT= <>
##$DTYPP= 0
##$F1P= 2.36226072786647
##$F2P= -0.459571619588291
##$FCOR= 0.5
##$FTSIZE= 0
##$FT_mod= 4
##$GAMMA= 1
##$GB= 0.15
##$INTBC= 1
##$INTSCL= 1
##$ISEN= 128
##$LB= 0.24
##$LEV0= 0
##$LPBIN= 0
##$MAXI= 10000
##$MC2= 0
##$MEAN= 0
##$ME_mod= 0
##$MI= 1.114404
##$NCOEF= 0
##$NC_proc= 0
##$NLEV= 6
##$NOISF1= 3.799351
##$NOISF2= 2.8
##$NSP= 1
##$NTH_PI= 0
##$NZP= 0
##$OFFSET= 15.70392
##$PC= 1
##$PHC0= -16329.66
##$PHC1= 35.80078
##$PH_mod= 1
##$PKNL= yes
##$PPARMOD= 0
##$PSCAL= 0
##$PSIGN= 0
##$REVERSE= no
##$SF= 200.130013532006
##$SI= 16384
##$SIGF1= 3
##$SIGF2= 2
##$SINO= 400
##$SIOLD= 16384
##$SREGLST= <1H.CDCl3>
##$SSB= 0
##$STSI= 0
##$STSR= 0
##$SW_p= 3612.71676300578
##$SYMM= 0
##$S_DEV= 0
##$TDeff= 0
##$TDoff= 0
##$TI= <>
##$TILT= no
##$TM1= 0
##$TM2= 0
##$TOPLEV= 0
##$USERP1= <user>
##$USERP2= <user>
##$USERP3= <user>
##$USERP4= <user>
##$USERP5= <user>
##$WDW= 1
##$XDIM= 8192
##$YMAX_p= 0
##$YMIN_p= 0
$$ End of Bruker specific parameters
$$ ---------------------------------
##NTUPLES= NMR FID
##VAR_NAME=  TIME,          FID/REAL,        FID/IMAG
##SYMBOL=    X,             R,               I
##VAR_TYPE=  INDEPENDENT,   DEPENDENT,       DEPENDENT
##VAR_FORM=  AFFN,          ASDF,            ASDF
##VAR_DIM=   8192,          8192,            8192
##UNITS=     SECONDS,       ARBITRARY UNITS, ARBITRARY UNITS
##FACTOR=    0.0002768,     1,               1
##FIRST=     0,             0,               0
##LAST=      2.2672688,     0,               0
##MIN=       0,             -205078,         0
##MAX=       2.2672688,     212482,          0
$$ Real data points
##PAGE= N=1
##DATA TABLE= (X++(R..R)), XYDATA
0@%%%%%%%%%%%%%%%%%%%%%%%%%%J2l6M8m8M8m8M8m8M9o9R2r6R6j04J25j41J47
43G5j62J83k02K25k47K69k98L28l57L92m36M84n36O01o74P58q62R90j153J364
63G42j651K063k700L788n968J1890n5384j57858K09364J83736j69933j69485J13729
76c7667J37244m4724r3798k4875M0259R1660J3824j46395o6355J86149J09012
87A64334k05484j39637K05260J53882j84884j52268J48214J34115r8980j03165
97g8613M3266O2396J4195j7044o6884k8169J11083O8099j42504r8763J59317J16929
109A43308j60596j21098J47470J11392j21924q9521Q7159N8354m7222k2268N873
120i073j4371L2722M7311o5777p2701R0671Q7627j06019r0806J11521Q2352j07596
$$ y = [0, 0, 0, 0, 0, 0, 0, 0, 0, 0, 0, 0, 0, 0, 0, 0, 0, 0, 0, 0, 0, 0, 0, 0, 0, 0, 0, 12, -24, 24, -24, 24, -24, 24, -24, 25, -44, 48, -48, 48, -56, 69, -72, 75, -87, 96, -106, 119, -128, 141, -157, 171, -186, 206, -230, 254, -282, 319, -355, 403, -459, 531, -622, 742, -909, 1154, -1546, 2242, -3726, 8164, -47220, -205078, 4286, 188022, 18089, -151396, -37667, 99577, 54853, -38945, -63820, -23561, 68099, 81923, -64472, -130827, 55322, 164334, -41150, -180787, 24473, 178355, -6529, -158797, -10583, 123532, 24552, -78613, -35347, 27049, 41244, 24200, -42684, -70853, 40230, 108329, -34175, -132938, 26379, 143308, -17288, -138386, 9084, 120476, -1448, -90969, -3810, 54544, 7322, -14946, -9073, -23444, 9278, 56589, -9188, -81889, 8782, 96409, -9610, -100416, 11105, 93457, -14139]
132a4139o3772R5787L8012p7663q481N5552k0654l1474M5865P386o4023J5151
144b2453P2996l4962p1867N1064O0854o3013m1801P0421J7110p3500R801P2222
156D6872l5510o6975N6745N7895p0601m5351P5330K9946p0034j2248N5413o758
168A4724l2991K6116N787m4630K3131O0963n0193p3619P1855Q1208q5446q2712
180h5807Q8904P7516q1915o5642O4888M7550l9846k4598R626j382K2243K8285
192C9822n2141n3753P6789P5350r3091r0729R9257R8449r4463r7221P9210Q7021
204G4500n5118o8370K4833M2748Q339j2623m0881j9573O9325N0586r0646p7464
216i4344J02351R7316j03393j07993R3569J08201p4053r7615M6989P7272j5301
$$ y = [-14139, -77911, 17876, 55888, -21775, -30256, 25296, 4642, -26832, 19033, 26419, -37604, -22453, 50543, 15581, -56286, -5222, 55632, -7381, -49182, 21239, 38349, -35151, -25350, 46872, 11362, -55613, 1132, 59027, -11574, -56925, 18405, 48351, -21683, -33931, 21482, 14724, -18267, 7849, 13636, -30994, -7863, 53100, 2907, -70712, 1143, 82351, -3095, -85807, 3097, 80613, -1302, -66944, -2056, 45494, 5648, -18950, -9324, -10706, 11537, 39822, -12319, -66072, 10717, 86067, -7024, -97753, 1504, 99953, 5490, -91731, -12521, 74500, 19382, -48988, -24155, 18593, 26932, 14309, -26572, -46145, 23180, 73766, -16880, -94344, 8007, 105323, 1930, -106063, -12494, 95707, 21654, -75961, -28972, 48300, 32999]
227C2999m8975j7529J5804M8207J9072p3553n1873R1095P9247r9121r8360R7167
239e820J07137q5705j04914O6133R1952m0761o9977J2270M1247J6370r112m2440
251b3620k3183O3476N2324p7625p5334Q3857R0032q1824r5055P2293R0218n6404
263A9155p6143L6132N4629j3538k8183q970k93K9449K7698m6242n1205N7923O8253
276F8665o3960p7257O4130P7378n9020o9025M9455N3350l6585l2505K1880R175
288E681o523J3910q080l4153K1082M9439l1748n7914L9459N9176m4062n3267M5471
301a529M1384m3987k5270L9747P043l3392J0871K5238k6412j5875L7755N661m3733
314b2499M847M3800j5210l8097K4881K7716l3290j4003L9991j045m4365J5637
$$ y = [32999, -15976, -33505, -17701, 30506, 49578, -23975, -75848, 15247, 94494, -4627, -102987, -5820, 101317, 15612, -89302, -23169, 68783, 28022, -41955, -29685, 11562, 27932, 18820, -23620, -46803, 16673, 68997, -8628, -83962, -105, 89927, 8103, -86952, -14659, 75559, 19155, -56988, -20856, 33773, 20235, -7948, -16918, -17211, 12238, 39936, -6306, -57511, 412, 68665, 4705, -72552, -8422, 68956, 9936, -59089, -9634, 43716, 7131, -25374, -3494, 5681, -842, 13068, 4988, -29165, -8083, 41356, 9608, -48306, -8847, 50329, 6267, -47000, -1529, 39855, -4132, -29402, 10345, 17388, -16004, -5133, 20105, -6307, -22182, 15573, 21234, -22499, -17652, 26148, 10938, -27159, -2278, 25438, -7852, -21855, 18136, 17091, -27274, -11637]
326a1637M5937k7728m4282L5931L9160l9113l0670L6944J9053k9737n228J8577
338G207j0190m772K5542r911l9656K3418N1214l4261n8699M0866O1261m2406n8223
351d8610L8680M9687l0019l6097J7556J8765k698J142j2820k1510K6972M0629
363D1677l8297n6572M5263O7556m7049p2487M3386P0513l4677o1784K1853M6853
375B6235o470k7124r699M332K4973J9296l7577m1380M6124N9772m9691p2345M7985
388a5569P7848m1231p5490L0267O5566j6388m9006J079K7538J3920l381k7305
400a2152k0958L7591M2954m3912o0411M5672P1502m2909p5198L6036P1228k5903
412B3540o0069J3689M3050n54k2121j1947n05K2746K2757l0989m2033L5781N6668
$$ y = [-11637, 34300, 6572, -37710, -1779, 37381, -1732, -32402, 4542, 23595, -6142, -11370, 7207, -2983, -7755, 17787, 7876, -31780, -8362, 42852, 8591, -50108, -9242, 52019, 9613, -48610, -9930, 39757, 9738, -26359, -8803, 9962, 7264, 8406, -4414, -25924, 1048, 41677, 3380, -53192, -7929, 59627, 12578, -59909, -16523, 53990, 19313, -42471, -20618, 26235, 19765, -7359, -17058, -12726, 12247, 31543, -6034, -47414, -1290, 58482, 8791, -63554, -15569, 62279, 21048, -54442, -24175, 41391, 25003, -24003, -22924, 4614, 18534, 15153, -12152, -33110, 4481, 47435, 3523, -56888, -11216, 60286, 17377, -57821, -21785, 49443, 23540, -36529, -22840, 20210, 19656, -2465, -14412, -14917, 7829, 30586, -403, -42436, -6655, 50013]
425E0013l7004o5147L4707O6716k9438o1427K1782N0026j2851l3877L416J4824
437A740N575M886j3228k3416J9224L8695k3234m9205K5232N4037k5237n2818K3648
450a4101M6021k0618l4666J6702K0163j2043m446P161j1031j944K4121l078l3895
463b1654P877L9301j2372m0004J6265L6119j9373k8550K1589J8245k2595o705
475a1857K2373m725k0606J4687J7411k2113j2652K6346O600k7001N60K4269q310
488D982j8780J6138J1289k3299l002K9069n073l2866J1870L3980j6664l2052J8865
501e543K6922j8326j8919J5325Q655j0433L332M130j5629K594K7014q570l6539
514b5987J3396M2919j6184m5427J6743M3488j4895l7269J0995K7034n466j3963
$$ y = [50013, 13009, -52138, -17431, 49285, 19847, -41580, -19798, 30228, 17377, -16500, -13084, 1740, 7315, 12201, -1027, -24443, -5219, 33476, 10242, -38963, -13731, 40306, 15069, -37749, -14101, 31920, 11302, -23364, -6662, 13501, 1458, -2988, 4173, -6858, -8802, 15319, 12241, -21654, -13777, 25524, 13152, -26852, -10587, 25532, 6159, -22391, -802, 17443, -5152, -11857, 10516, 5791, -14815, -128, 17283, -4830, -17482, 8864, 15464, -11537, -10977, 13292, 4982, -13798, 2340, 13629, -9670, -12672, 16397, 11324, -21542, -9672, 24308, 7644, -24408, -5543, 21379, 3053, -15866, -541, 8114, -2319, 1013, 5143, -10486, -7892, 19122, 10552, -25987, -12591, 30328, 14144, -31283, -14540, 28948, 14053, -23216, -12221, 14813, 9347, -4616]
526d616q83j053P241J6355j2720l0513J6613M2107j8464m9767J7939N2719j5093
539A9865n0449J0326M3208m268l1443k356J6497Q840K34j4163j7095J7747L2371
552B9314j9409m4506J8887N2074j6285n4489J2013N1280o551m2975O27L0273N213
565A5466j4675j0385k141J4118J8812j6378l3293J6880M4338j5642n0688J2911
577b0677N1919r031m7830M429L9034L08k6507m707J1559Q409M118j0960j8959
590a8895J2091L1450j2049m0475J0868M5078q825m4972O336M0251l645l1653J163
603a3277K0328R46p401k453n768L492J7587l995k6973M213L3194m352l5732M554
617a5637L4446m935k9731N458K2218o011j3061O532L014o758O749O423j5070n391
$$ y = [-4616, -5499, -6552, 689, 17044, 4324, -26189, -9576, 32531, 14067, -35700, -17761, 34958, 19865, -30584, -20258, 22950, 18682, -12761, -15117, 1380, 10220, 10454, -3709, -20804, -3057, 29314, 9905, -34601, -15714, 36360, 20075, -34414, -22401, 28879, 22328, -20647, -20020, 10253, 15466, 791, -9594, -11735, 2383, 21195, 4817, -28476, -11596, 32742, 17100, -33588, -20677, 31242, 22211, -25619, -21190, 17844, 18152, -8355, -13062, -1503, 6906, 11024, 64, -18895, -6804, 24646, 12597, -27878, -17010, 28068, 19243, -25729, -19393, 20858, 17213, -14440, -13277, 7051, 7997, 596, -1857, -7625, -4133, 13454, 9459, -17514, -13301, 19893, 15541, -20191, -15637, 18809, 13874, -15857, -10399, 11819, 5808, -7253, -721, 2293, -4465, 2284, 8707, -6363, -11754]
631a1754K1169L711k4694j207K5420j884k3406N371J9195q904j3436J2239O706
644H526j4759Q0J6069o140j5877J0794J4038j3759j0700J4925N871j4377Q5J2254
658G030o554r117J2958N411j8437j664K2352j551k4313M088K3911n651k0931O215
672f253J5702n875q474M850j80l308R174J606j7611l2K4448j010k9315J602L1213
687A6537j566l0002R58K5612J14j8563j328R403K456J119l215j1695L500K1154
701A4484l011k8663J974L3368l80l4739j472L2533L335k7027m963J8743O138q622
715A698o534k589O161J3315m925k2694L036K9795p33l3859j658L4449L961l1564
729a2141n784K5508P001j6932p463O845O954M056n705j4265L755K2825j376k9091
$$ y = [-11754, 9415, 13126, -11568, -12775, 12645, 10761, -12645, -7274, 11921, 3017, -10419, 1820, 8526, -6233, -6153, 9916, 3776, -12101, -1307, 12731, -1028, -11728, 3197, 9068, -5309, -5224, 7030, 476, -8641, 4317, 9728, -8709, -10373, 11979, 10428, -13885, -9797, 14114, 8463, -12468, -6253, 9449, 3574, -4900, -50, -230, -3538, 5636, 7242, -10369, -10401, 14047, 13037, -16278, -14676, 16537, 14971, -15031, -14073, 11539, 11653, -6910, -8238, 1165, 3621, 4740, 1525, -10170, -6670, 14484, 11473, -17190, -15216, 18152, 17772, -16967, -18439, 14094, 17429, -9598, -14561, 4182, 10320, 1698, -4836, -7425, -1264, 12051, 7126, -15568, -12532, 17263, 16530, -17329, -18987, 15462, 19423, -12141, -17925, 7583, 14584, -2348, -9811, -2966, 3988, 8044, 2339, -11926, -8171, 14654, 13278, -15813]
743a5813j078L2270L388l2236n181K8835O353k2737o639J4465O210n089m879m619
757f750K979J3444p13k0464j583K5286L508k7302m889K6593N457k3236n238J7837
771D929M232j1068k478L408L13M145J877j0852l829J6036N148j9329n735K0665
785G462N394j9919m168J7369K256j3378K66Q315k907k789N404k571p263P243Q279
800H993j0891q192J3146O993j4011m752J3496J656j1837J894R272n510o222Q658
814B693L023j1028O5J2178k708j1907M760J0254o170p245O960L196p102J466O809
829E244o199o119J0446N231j3724m217J5595L136j5845k018J4257R19j1092J88
843d198O518j292j049K412m835l436J0318M444j4850n177J7823N799j9044o042
$$ y = [-15813, -16891, 15379, 18767, -13469, -18650, 10185, 16538, -6199, -12838, 1627, 7837, 2748, -2131, -6750, -3771, 9673, 8960, -11504, -13087, 12199, 15707, -11595, -16484, 10109, 15566, -7670, -12908, 4929, 9161, -1907, -4385, -977, -664, 3481, 5358, -5494, -9323, 6713, 11861, -7468, -13203, 7462, 12856, -7063, -11231, 6138, 8394, -4984, -4718, 3597, 690, -2099, 3305, 734, -6529, 714, 8993, -1898, -10090, 3056, 10049, -3962, -8714, 4782, 6438, -5399, -3505, 5767, 257, -5965, 2693, 5716, -5312, -5247, 6931, 4223, -7684, -2924, 7330, 1160, -6085, 875, 4071, -3031, -1565, 5244, -955, -7074, 3372, 8603, -5121, -9338, 6257, 9393, -6452, -8470, 5787, 6706, -4386, -4198, 2320, 1028, -21, 2391, -2444, -5880, 4438, 8882, -5968, -11145, 6678, 12477, -6567, -12609]
857a2609J8256N900j5499n331J1097M182n316k515j146M51P513J785j3103m035
871a0370J7252O087j9653p700K0031Q624j8308q810J4740Q165r684o556L540M259
885A617K945j425r021j708J4200M639j7732p264J9562R185j9415j0163J7270J0108
899A2798j3432r115Q339P031k383m202l759Q64R382K566j3935n628J6871Q186
913A3583j8164r724J7566J0250j5249r671J1597P976o879n343J664K157L505J255
927D523q104m435J1621P057j3861q780J4576R445j3906r195J2098P744r188n420
941e825N585K539j709O22k093l625N468O132q050p888R829Q604j0549q266J0348
956A122O935r279m738P475J979n247J079K701l960j80O268k094p844M038Q337
$$ y = [-12609, 5647, 11547, -3952, -9283, 1814, 5996, 680, -1835, -2981, -2530, 4983, 6768, -6335, -10370, 6882, 12969, -6684, -14384, 5647, 14271, -4037, -12847, 1893, 10058, 374, -6182, -2642, 1617, 4562, 3137, -5884, -7592, 6608, 11247, -6485, -13749, 5813, 14998, -4417, -14580, 2690, 12798, -634, -9749, -1410, 5621, 3238, -964, -4723, -3859, 5523, 8089, -5846, -11474, 5397, 13583, -4581, -14305, 3261, 13511, -1738, -11409, 188, 8164, 1285, -4058, -2394, -237, 3268, 4523, -3581, -8016, 3605, 10662, -3199, -11979, 2597, 12042, -1864, -11059, 1039, 8783, -405, -5825, -240, 2299, 590, 1212, -881, -4506, 962, 7094, -956, -8844, 985, 9589, -960, -9226, 1122, 8057, -1222, -5960, 1515, 3494, -1753, -674, 2027, -1933, -2113, 4155, 2061, -5783, -1745, 6592]
971F592n487p802O412O256o793l904O743J034o256J984N458m771m358O962L140
986E210q326j763Q648L35p899J061O161k449l634L714O24m848K505N717n426o233
1002f603P697O416r142o146R507N431q752m197O984K547m311n34J086j656K339
1017F66L846n543n855Q156P422r855q442J0491Q686r928q147Q246O795n706m692
1032c860K432K054J077R38m469l920P357O596r385q731J0439J0100j0339j0484
1046a0195R164R848p012q237M158N755q22k718k495p56N550M137p969p191R539
1061G56R483j0078j0900R590J1172q132j0328N897Q395l102n549J04K127K847
1075B282J528n371m979P283P882q381r898Q588J0840p966j0645O633R293m747
$$ y = [6592, 1105, -6697, -285, 5971, -822, -4726, 2017, 3051, -3205, -1221, 4237, -534, -4892, 2070, 5210, -3116, -4879, 3769, 4104, -3795, -2734, 3427, 978, -2656, 1058, 1682, -3166, -661, 5056, -370, -6603, 1094, 7510, -1632, -7778, 1729, 7160, -1592, -5789, 1195, 3742, -569, -1103, -17, -1673, 666, 4512, -1031, -6886, 1270, 8692, -1163, -9605, 886, 9572, -356, -8503, -257, 6538, 832, -3860, -1428, 626, 1703, 2641, -1828, -5748, 1609, 8205, -1180, -9911, 528, 10628, 289, -10195, -1031, 8817, 1805, -6432, -2274, 3481, 2659, -59, -2554, -3310, 2240, 6377, -1592, -8783, 756, 10239, 161, -10739, -1149, 10023, 1891, -8437, -2540, 5855, 2753, -2796, -2692, -565, 2282, 3810, -1561, -6540, 743, 8625, 244, -9654, -1066, 9774, 1808, -8837, -2204, 7089, 2342]
1089B342o963K477L939j40n66k084k796L944N771n339q039O146R421o344r766
1104g997N994R074n163p382L947N015k542k139J038q91M61L691j764n978K793
1119a843P536l565q218M030P891m192o734M102M815l758k430L257j65k605K655
1134G76J847m692r84O080R1o691Q74O479j787n537K722L916l505j942M138k33
1150A552m537K234M643l897m421M991L841n451k893N203J614m335o1K897j537
1165a57j202L230o09m727K317N905l664o617M562O729m828o232M488N109l618
1180F86l391K265J246o96J146r71l578K510N710l707p352M432Q341m613q530M267
1196b235P819l379o331K114M164n42j545r45j400K419M194l556o616M251Q440
$$ y = [2342, -4621, -2144, 1795, 1655, 1089, -995, -3791, 153, 5924, 585, -7454, -1308, 8113, 1769, -7997, -2003, 7071, 1908, -5474, -1527, 3488, 946, -1193, -155, -1046, -585, 3106, 1342, -4636, -1843, 5693, 2128, -6090, -2060, 5831, 1639, -5095, -993, 3822, 64, -2366, 891, 726, -1879, 776, 2623, -2069, -3053, 3027, 3118, -3573, -2699, 3780, 1993, -3544, -822, 3094, -411, -2353, 1785, 1552, -2985, -751, 3892, -5, -4426, 565, 4406, -1045, -3938, 1265, 2879, -1456, -1517, 1380, -157, -1359, 1871, 1262, -3465, -1148, 4757, 1093, -5524, -962, 5767, 939, -5293, -805, 4304, 686, -2705, -440, 806, 110, 1256, 285, -3293, -783, 4927, 1220, -6132, -1700, 6641, 2028, -6502, -2235, 5584, 2205, -4126, -2012, 2152, 1610, 65, -880, -2280, 139, 4333, 777, -5839, -1588, 6852]
1211F852m466r441M136R497l355q638K224O865q58m425n89J485J928J640k995
1226a40m577L686P072l952q846L814R683l234r542K371Q421j329o405J98L751
1241I71Q59p08j784k347K415N121k812p303K882Q669k654r146K220Q647j613p262
1257c845R40N189k68k590l64j75Q87K844j230n126J415O824j494p711J417P823
1273D536j298p127J122N679r47l742P83J463o61Q27N94k958m90M650L71n774j28
1290c100O217j67n950N59N079j023l712J536K049j997k41K349j457k527K884K469
1306B968l902k152M392J522m360o81L856l80k945J460J808k558n35L469o57m114
1322b809J695M356k366m198K712L652k738k610K385J251j780L14J071k009k59
$$ y = [6852, 2386, -7055, -2919, 6578, 3223, -5415, -3191, 3674, 2816, -1609, -2198, -713, 1215, 2855, -140, -4717, -1031, 6041, 2089, -6757, -2943, 6740, 3506, -6036, -3665, 4756, 3427, -2978, -2780, 971, 1830, 1122, -662, -3009, -594, 4527, 1715, -5588, -2706, 5963, 3309, -5837, -3617, 5030, 3417, -3845, -2905, 2284, 2016, -574, -938, -1113, -226, 2618, 1388, -3738, -2323, 4501, 3007, -4704, -3287, 4536, 3238, -3889, -2767, 2912, 1965, -1777, -994, 469, -192, 635, 1229, -1729, -2219, 2431, 2802, -2972, -3100, 3117, 2950, -3000, -2441, 2638, 1615, -2097, -561, 1488, -509, -750, 1599, 142, -2385, 499, 2968, -934, -3086, 1306, 2828, -1532, -2213, 1643, 1263, -1682, -222, 1586, -972, -1507, 1962, 1305, -2809, -1114, 3242, 876, -3322, -610, 3042, 304, -2306, 79, 1330, -450, -136, 935, -1074, -1333]
1337a333L537m83m792J069N598j434n880J529N538j416m605J121L131o54j285
1352c59J83p66K70K864o79m670R24O051r92o836R03O921o58o273K64M993J56l196
1370i00n57R72Q90J357j084l575J119N424r79o743O77P411k61p312j84O446O45
1387C346m925j014K900J241n51j307j796J182L957q90n689M53O796Qp204m85O857
1404B879Q64n801j140M179J234k160j133p8Q97K267n63m125J66N525K81o345o58
1421c711O517R22n981j049M898J011l313q52J459N22M58j10k249l78L787P37m822
1438b154j044N299J242n268j231M680J004l636o12K309J03q29N21o33j115J951
1454E87J573k974j825L595J909l852j670L668J177l143n09K349k93j419J137M24
$$ y = [-1333, 2204, 1721, -3071, -2002, 3596, 2162, -3718, -2189, 3349, 1933, -2672, -1551, 1580, 926, -359, -176, -942, -672, 2192, 1513, -3157, -2233, 3818, 2826, -4010, -3107, 3814, 3156, -3117, -2853, 2140, 2296, -900, -1457, -485, 405, 1762, 678, -2897, -1778, 3646, 2667, -4076, -3399, 4012, 3751, -3561, -3745, 2701, 3346, -1579, -2593, 307, 1548, 997, -310, -2106, -924, 3033, 2143, -3546, -3093, 3703, 3711, -3493, -3978, 2879, 3743, -2058, -3198, 981, 2215, 55, -1078, -1156, -259, 2008, 1445, -2680, -2514, 3011, 3292, -3053, -3711, 2806, 3728, -2253, -3302, 1596, 2607, -706, -1558, -99, 423, 881, 771, -1478, -1856, 1931, 2668, -2154, -3198, 2101, 3343, -1925, -3156, 1524, 2528, -1108, -1720, 589, 692, -137, 384, -249, -1364, 587, 2160, -814, -2639, 956, 2865, -987, -2657, 1011, 2188, -955, -1464, 885, 592, -827, 310, 734]
1470G34j886N33K460j369k731J922K722k254k336K315J673k145p69J785k85j323
1486i54J391Q02k385k85L167j62l628N36L635p26l318Q33K548q07j489P32K23
1503A13o88J153N98k421n17L467M89m155m57M396N09m187n25L501M87k384l93
1520a014R72K53N27J2k063k75L353N54m335q55M850J109m863j276M342J365l397
1537g41j295K041J101m62p35j149K54K658K91l853q39M650J361m978j717M731
1553A318J954m019j971K878J775j478j331q4P33J585k7k922o93L882J377m446
1569a469j922M552K249m190k309L385K125k258j688R50J064M30k93j712n03K799
1585A210J205l547j825L944K190l883k333L447K180k675j807J690J193n76m23
$$ y = [734, -1152, -619, 1841, 472, -2259, -337, 2385, 131, -2205, 110, 1783, -362, -1131, 654, 369, -954, 437, 1239, -1146, -1431, 1736, 1574, -2054, -1518, 2117, 1391, -1927, -1094, 1454, 647, -842, -110, 113, -575, 578, 1176, -1245, -1762, 1705, 2194, -1961, -2418, 1978, 2487, -1700, -2225, 1276, 1763, -621, -1014, -42, 211, 738, 750, -1313, -1588, 1765, 2319, -2016, -2871, 1979, 3088, -1775, -3051, 1291, 2656, -741, -2036, 5, 1106, 644, -91, -1240, -986, 1672, 1963, -1890, -2729, 1921, 3282, -1696, -3413, 1318, 3272, -747, -2718, 160, 1935, 457, -874, -958, -225, 1360, 1333, -1589, -2282, 1600, 2977, -1469, -3391, 1161, 3410, -780, -3089, 296, 2421, 163, -1525, -575, 489, 919, 626, -1086, -1589, 1210, 2415, -1132, -2957, 987, 3177, -706, -3039, 408, 2588, -87, -1894, -204, 989, 413, -10]
1600a0n11m00J484J159k241j792K755K199k931k335K787K200k398j783J825J155
1616A163j126l93L93m55L00J215r19j811J359K210j646k323J757K147j695j724
1632a548J509J076j187k88Q74n55n41J363J75j965J32K356m03k449O02K237p14
1649F74j745P47J055p91k35Q27o61q44J469Q14k078q06K484P40k601o12K355M87
1667A279j863k63J144nk96L60o11p21J483J054k136j352K550J546k702j614K556
1684D09J536k092j317J387R07n05l99m13k09J272Q25k037j361K551J799k767k084
1701b498K676K200k319k045J689J702q68j156k9M48R05L31j672j110K238J784
1717B276k537k303K573K559k312k550J805K306j132j790L57J073M08k13j130o44
$$ y = [-10, -521, -921, 563, 1722, -519, -2311, 444, 2643, -288, -2623, 164, 2364, -34, -1817, 8, 1163, 37, -356, 37, -418, -118, 1097, 178, -1633, -274, 1936, 290, -2033, -276, 1871, 176, -1548, -39, 1037, -150, -438, 436, -119, -660, 703, 878, -1087, -955, 1401, 998, -1451, -849, 1388, 674, -1071, -324, 731, -60, -295, 532, -129, -973, 496, 1310, -768, -1574, 910, 1650, -951, -1563, 792, 1279, -584, -847, 297, 292, -4, 356, -255, -976, 507, 1561, -575, -1927, 623, 2169, -533, -2147, 409, 1945, -147, -1464, -77, 830, 325, -74, -487, -696, 576, 1401, -636, -1997, 554, 2353, -414, -2498, 178, 2378, 59, -1986, -297, 1405, 537, -619, -648, -200, 705, 1036, -636, -1746, 492, 2276, -261, -2564, 9, 2568, 256, -2294, -489, 1817, 685, -1105, -748, 325, 733, 520, -610, -1254]
1733a254J721J421k070k084K196K545k127k705J820K565j326k175P11J555r2p50
1749d9n25j18J029J000j437j703J610K286j685k558J552K573j281k264Q84J736
1765A050m34j021J3J96L60O17o30j383Q65J911r01k296R34K334q56k159O98J730
1783A028n20j128L42M13k00L25Q8r93J8J516q2j864J67J982j97j883K47J568l16
1802E11j075M17M63n00J77N78p77o31J225O71j556o29J656N34j571l33J254J20
1820E34q61J73L63n10J72Q40o69j111J063J309j304j380J394J286j239j110R74
1837g6P72n83l42J68j97K57P40o41j250R33J658j122j883J160J936j023j797P59
1855e31J466m23r66N4L41K91L98o43j062Q68J660j013k067R79K299q57k291O35
$$ y = [-1254, 467, 1888, -182, -2266, -70, 2475, 348, -2357, -537, 2028, 702, -1473, -762, 793, 701, -49, -574, -692, 337, 1337, -100, -1803, -193, 2093, 408, -2150, -598, 1975, 694, -1570, -686, 1050, 616, -405, -392, -196, 164, 781, 151, -1232, -367, 1544, 643, -1653, -719, 1615, 759, -1400, -702, 1028, 508, -620, -278, 135, -65, 260, 348, -645, -627, 889, 807, -1057, -890, 1092, 895, -988, -741, 827, 511, -564, -147, 316, -184, -7, 571, -206, -837, 388, 1059, -497, -1126, 530, 1064, -507, -840, 414, 534, -327, -154, 209, -301, -129, 711, 42, -1069, -6, 1303, -1, -1381, 13, 1299, 60, -1050, -76, 696, 113, -229, -61, -258, -1, 739, 98, -1152, -219, 1439, 317, -1566, -406, 1530, 507, -1290, -531, 935, 512, -454, -400, -59, 232, 630, -13, -1075, -207, 1453, 440, -1627, -648, 1651, 794, -1497, -862]
1873h62K001l08j538j2Q52L38q5n89p02P74J433q70j988Q28K377o93k486M75K363
1892A308k19j976m7J375K93o27n24j29O06R10o48j597O07K123n21k390L48K410
1910A302j31k173r8J725K39j094l44L32M32M16l75j151L31J699j93k095R5K188
1928A105N6k088j49J755K46j277k38O62J82mp2o62m8J182J72j574k77J773L50
1947A094j787l75J656K72j266j94Q27K5l04J66j86m02O77N58j034o70J257P24
1965A038j356o48J257N14j072k63P41j8l96L61K1o64L07R33n84j080P54J123q18
1984A50j021P73Q14o57m77M66P4k94M02R3q68J31J192k54j457L40J541l63j469
2003h84L25J235k60q18J20L47k7K10j5p91J00J255r5j633P4J841j3j828n9J613
$$ y = [-862, 1139, 831, -707, -719, 133, 471, 386, -203, -905, -131, 1302, 432, -1556, -728, 1649, 956, -1530, -1055, 1308, 1089, -887, -934, 441, 734, 107, -417, -546, 60, 970, 322, -1275, -668, 1455, 934, -1456, -1108, 1302, 1171, -1002, -1100, 625, 864, -230, -574, -242, 190, 606, 231, -920, -589, 1110, 917, -1178, -1083, 1105, 1161, -927, -1076, 679, 925, -352, -590, 72, 254, 250, 178, -484, -532, 650, 822, -752, -1029, 744, 1094, -693, -1068, 588, 860, -406, -600, 227, 252, -52, 114, -72, -474, 203, 761, -273, -943, 314, 1038, -318, -966, 291, 805, -267, -530, 211, 193, -203, 158, 179, -485, -178, 755, 171, -909, -155, 968, 150, -871, -98, 716, 59, -418, 48, 122, -172, 230, 323, -545, -414, 778, 524, -933, -593, 948, 585, -884, -559, 676, 416, -402, -282, 65, 38, 248, 233, -558, -458, 797, 702, -931, -857, 984, 971, -857, -916, 697]
2023F97J45j228k31P03K67r6k44n40J36J153n1j601q7J925K11k042l23J893M53
2042A140j589n10J080N06m31m51k22L15Q40p9j394j24J817L00k015n06K014O41
2060A332j804o93J387O95q66n89K43M05L91j65r81p9J425L68j767n74J859P46
2078A333j755q48J531P90j076o92N61M75pj70n42j65J020M40j354o87J553Q54
2096A261j549r10J394Q45j106o92P31M57l15j31j20k21N18N52q71p67J038R39
2114A053j120r74J083R03r39p37P33M33m40r7J54k88J18O15l36q81N05J061n99
2133B47j101O11J023n86p71M74M36l50n6K77l80j51P60L5j040L7J218q0j240R4
2153e43J130j24q97J41N00j41n8J67m25j91Q60K08j163k69J366L11j411l27J302
$$ y = [697, 842, -386, -617, 86, 353, 257, 13, -527, -391, 762, 711, -890, -977, 948, 1159, -883, -1206, 687, 1140, -449, -959, 121, 627, 196, -255, -477, -162, 678, 599, -795, -919, 898, 1198, -817, -1323, 691, 1332, -472, -1165, 222, 917, 51, -538, -295, 110, 501, 336, -645, -724, 701, 1069, -698, -1272, 587, 1333, -422, -1270, 261, 1051, -25, -717, -156, 319, 312, 142, -400, -565, 455, 895, -459, -1146, 407, 1261, -288, -1198, 196, 1041, -65, -757, -26, 431, 116, -15, -135, -356, 162, 714, -157, -924, 114, 1053, -67, -1041, 42, 945, 6, -731, 2, 435, -5, -102, 52, -236, -118, 497, 161, -720, -215, 846, 247, -854, -243, 780, 194, -577, -103, 333, -17, -73, 204, -176, -327, 433, 468, -572, -535, 683, 603, -637, -543, 587, 463, -434, -293, 207, 66, 8, 175, -250, -441, 419, 627, -536, -805, 561, 872, -539, -866, 436]
2172D36L19j039k92O69J94j74q1l05r1P93K43j159m28J415N94j534o75J441P41
2191A067j219o91Q26N67l50l94j37J27O50J51j072m38J373O94j522r08J540R73
2209A237j353r67J006Q84n67o80Q1L81L93k5q38l22J192O54j400r13J445J089
2227A297j340j154J100J087p57q88L41N81J08k02n33j88Q71N68j098r01J201J138
2245A231j189j217J020J179p78j024M73P18j20l18k39q2N09M93p19q51Q74J084
2263A044r04j190Q27J202p28j003M99P28k56l86N4m2J87M36l52p90M63J032m99
2282C22j170M90J151m20j029L46P44k49l77J38j1p1M26np57L2J023l0j155L3J143
2303E74m4r71M5O70n5l16R8o6j63M65K28q01k90J016L49j144l54J110L80r66l35
$$ y = [436, 755, -284, -576, 93, 287, 113, 32, -273, -364, 429, 672, -487, -915, 500, 1094, -440, -1115, 326, 1067, -152, -843, -17, 550, 200, -194, -331, -204, 446, 597, -475, -913, 460, 1154, -368, -1276, 264, 1237, -116, -1083, -77, 807, 240, -440, -359, 22, 415, 390, -448, -770, 422, 1076, -324, -1237, 208, 1297, -43, -1197, -97, 990, 233, -655, -314, 267, 375, 173, -360, -548, 323, 891, -207, -1108, 93, 1231, 42, -1175, -155, 1024, 246, -778, -305, 413, 293, -25, -264, -346, 163, 656, -63, -914, -40, 1044, 140, -1050, -223, 979, 251, -752, -253, 475, 219, -167, -113, -155, 32, 468, 116, -674, -211, 821, 322, -848, -358, 793, 373, -656, -310, 434, 185, -192, -54, -65, -136, 290, 285, -472, -440, 583, 553, -602, -569, 574, 530, -441, -396, 274, 219, -97, 1, -65, -228, 237, 465, -336, -626, 390, 739, -405, -759, 351, 731, -235, -570]
2324e70O87K52l50r8n0p4M55K40p89m20J021N73j133p22J148P45r94p02P22O01
2344E42l61m06k2J29M20J78p53m83J005P42j144r22J128J030r94j027P40R39m27
2363C14p00N0L94L15j7o55l79R33P02j081r69J074J167r94j222P99J126m89r35
2382e67J42O43J95k55m96j79P56N70r06r22R54J171q96j281P41J263n06j086K07
2401d52Q12P2m33l30lN24M50o81q10P09J115o80j282N88J285m16j169K14R15k4
2421D04n72j35J33L06K87l85o96M71R56m27j142L42J220k84j105J57Q92l8n55
2440a71q7J95J46K11j67n81J59Q72j29j038N4J099Pj018o5Q36Q3n36q3J81M5J80
2462A93J4n33q1P95K00r80k75J010L34r30l56P61K88m69k15J43J03J89P2n08k26
$$ y = [-570, 117, 369, 19, -79, -129, -203, 252, 492, -297, -717, 304, 877, -256, -978, 170, 915, -79, -781, -59, 542, 181, -225, -247, -118, 302, 480, -273, -756, 249, 991, -153, -1075, 53, 1083, 89, -938, -198, 741, 314, -386, -336, 58, 373, 356, -299, -678, 255, 957, -124, -1093, -19, 1148, 154, -1068, -269, 857, 368, -567, -425, 218, 413, 158, -338, -517, 239, 809, -97, -1019, -65, 1106, 210, -1071, -330, 933, 427, -659, -452, 360, 432, -1, -331, -334, 190, 640, -41, -851, -142, 973, 293, -989, -401, 884, 468, -701, -487, 428, 404, -168, -303, -170, 136, 423, 38, -658, -187, 769, 342, -800, -458, 762, 478, -627, -470, 422, 384, -171, -258, -63, 83, 294, 127, -454, -295, 577, 448, -590, -536, 563, 570, -448, -513, 323, 406, -130, -213, -32, 13, 193, 207, -326, -407, 388, 588, -392, -667, 343, 677, -253, -609, 152, 440, -29, -244, -101, 2, 191, 263, -245, -471]
2483d71P15M24q95n38R35O27q61o36O80N73m14m46J00K30K23J0m92k89P26N50
2503G51q82p30Q66Q88p95r25O23Q38l43p07P7M42K14j14m90k06O73N65p94q22
2523h71Q12J014p29j106N54J090l27r41P9O47J95l20m20p5O00M63p15p87P36J023
2543I22o72j168N34J159l07j061P6Q27J52m71l89J01N31L37o34o93O20R75n38
2562C01j160M23J203k37j116M0R10J59o22k80J92M37J63m50n76M53Q78l84j081
2581g47K71J153j26j097kR02J48o65k48L24L01N0k98m07K58P23j86r46J04J016
2601E28M3j015j35Q73K08o27k48L11K60K7k03l37Q7O29np99j52R25K50q80l50
2622f10P45L90n68l18K60K66J0j22l39jN63J75p31l30P91M59p50n50O66N39m51
$$ y = [-471, 244, 668, -227, -765, 170, 797, -64, -700, -20, 553, 139, -307, -207, 23, 246, 256, -236, -525, 201, 751, -131, -861, 5, 893, 98, -827, -204, 634, 291, -416, -339, 103, 317, 203, -287, -493, 180, 745, -49, -871, -59, 955, 226, -880, -326, 764, 437, -504, -425, 222, 417, 97, -323, -398, 202, 665, -50, -837, -101, 922, 250, -918, -384, 775, 468, -593, -517, 310, 462, -9, -398, -297, 234, 571, -63, -756, -136, 839, 301, -859, -436, 767, 530, -586, -546, 364, 523, -99, -379, -187, 250, 413, -37, -613, -160, 718, 334, -747, -476, 677, 551, -546, -548, 354, 502, -163, -411, -87, 214, 264, -34, -441, -183, 540, 354, -592, -488, 528, 571, -444, -579, 294, 502, -125, -373, -62, 198, 225, 22, -315, -228, 401, 396, -403, -555, 370, 620, -260, -610, 135, 525, -43, -361, -101, 165, 175, 53, -286, -287, 276, 451, -280, -610, 181, 640, -110, -660, 6, 545, 94]
2643I4m88K11L58M1j59k86n4N03K62o45m75P11O28o62p19N46P25l68o33J22M50
2664A62J40k33l46m2M98L21o20n47O18P78n90q64M46Q82k76p82N8O02J60l47l38
2685c20L4N05K65n85n46N88P76n06r41L91R76k00q99k5P68J83n13l24J70M45J76
2706D18n02m94N12P39m36r32L03J011j33r70m0Q19K18o09l30K65M46P6m81m04
2726e24M27O83l13r08K02R85l1r68j11Q28K62o23l37L28L94k3l86l03L29N83k28
2747B66p78R7Q72N4q93k08P98L12o22l62L59L83o2l38k16K46M70j22o55l6P66
2768C31J83p82l01O99L91n36m12L15L87m7k97k03J61M35j7n93j40O42L09o47m30
2789e52N78M97m66m72K53M21k5l19j76J40L51N6m86k46N68L97n55n16M79N75l29
$$ y = [94, -394, -183, 175, 216, 57, -229, -283, 220, 482, -163, -638, 73, 701, 39, -680, -134, 591, 223, -410, -288, 162, 302, 69, -277, -319, 179, 500, -120, -667, -49, 729, 139, -725, -279, 603, 327, -455, -397, 205, 365, 18, -320, -286, 219, 484, -101, -647, -59, 717, 211, -730, -339, 637, 437, -462, -487, 281, 464, -49, -373, -203, 242, 418, -84, -578, -66, 673, 237, -695, -392, 619, 486, -484, -524, 295, 513, -96, -426, -161, 285, 361, -120, -524, -97, 586, 273, -635, -433, 552, 521, -447, -558, 270, 532, -91, -428, -100, 294, 271, -115, -418, -89, 494, 266, -512, -415, 457, 511, -382, -590, 208, 520, -102, -464, -105, 278, 216, -122, -338, -92, 378, 256, -399, -435, 331, 514, -268, -569, 130, 521, -15, -427, -112, 275, 228, -69, -272, -111, 324, 307, -286, -426, 216, 525, -122, -552, 26, 523, 57, -415, -162, 259, 234, -85, -261, -121, 230, 286, -200, -446, 122, 519, -36, -552, -73, 502, 173]
2810A73n91J60M99K0l46j93J63L38Q5m53l03M94M92m55o44L82P05k50o69O4N55
2831B26J24l99k78J72L80J08m65l35M56N45l96o77K80P56j45p42k4O30J84m76
2851g6k80K24M02K3m13l02M16N21l48o63J83Q02q9p75o6O81K00m95l32K96L96
2872C05k2m05k51L70M76k90o48J46P42j9p62j27O85K64n40l64L23M03o7l96j80
2893c57L30M21k34n75Q2P24N0p18j92O37L21n34l78L30M27j25l83j15K97L45j84
2914A69n13N3O03J16o26k66N88L42m73m11K91M32r8l64j32K70L10j30m52l4N52
2935B27J95n85l28N39M04l92m63K52M26m6l60j42K65K90r8m02q5M78K58n03l80
2956d50M36M53l09n25J87M78k0l95j29K37K67m0l77j11L89K92l85m41L25N12j95
$$ y = [173, -418, -258, 241, 261, -85, -278, -115, 223, 308, -145, -448, 46, 538, 83, -561, -179, 526, 276, -393, -329, 226, 350, -49, -327, -155, 225, 333, -132, -467, -11, 534, 138, -539, -259, 497, 352, -390, -414, 216, 400, -76, -356, -132, 270, 293, -120, -422, -6, 515, 167, -496, -313, 489, 400, -375, -441, 240, 440, -55, -387, -91, 305, 283, -122, -373, -3, 473, 183, -465, -319, 423, 404, -358, -485, 200, 464, -76, -440, -117, 286, 219, -177, -357, -27, 394, 160, -415, -333, 391, 441, -277, -469, 168, 489, -45, -423, -93, 334, 209, -174, -289, 8, 353, 169, -344, -291, 312, 428, -198, -464, 124, 466, -7, -418, -127, 305, 207, -157, -289, -19, 291, 161, -291, -325, 227, 422, -163, -491, 48, 452, 60, -403, -151, 275, 229, -131, -273, -8, 282, 184, -218, -303, 175, 433, -70, -450, -14, 439, 130, -395, -208, 270, 250, -145, -274, -37, 230, 190, -187, -298, 91, 383, -2, -443, -118, 394, 199]
2977A99n63J04M75P2l89j99K49L03o6l54j35L73L29l35m71K34N68j25n73NN33
2998B34J09m15k25K41L18p8l23j65L53L10k79m73J91N62q4n91m4N29J79m30k60
3019c41K66L51j00l52j09L14L19k45m57J47N49k6n60j26N25K35m10l32K89L71
3039C08j17l69j03L15K93k12m52J02N27M8n63j68N14K74m35l38K71L81r7l59r5
3060b75K99K72k04l99P8M89N3m99j75M51K85l61l76K52M05j00l59o7K87K06j63
3081I9l66M7M12J20m45k37L98L38l11m01J97M18n0l79r1K56K43j63l34L3L79J27
3103B90l84k50L24L66k59m03J44M07ol55j20K68K22j31k98k9L48J60l37k74K75
3124d2L64j72m38Q7M19J9l65j48K84K18j16k87l0L07J77k68l20K10M03j38m26
$$ y = [199, -364, -260, 215, 287, -102, -301, -52, 251, 185, -169, -304, 69, 398, 63, -408, -174, 394, 269, -304, -299, 234, 343, -72, -297, -56, 262, 184, -139, -304, 49, 359, 80, -393, -202, 360, 276, -315, -359, 170, 349, -81, -341, -75, 276, 176, -176, -285, 29, 348, 103, -354, -207, 342, 316, -244, -370, 155, 390, -20, -352, -63, 308, 191, -178, -281, 34, 327, 115, -337, -235, 292, 340, -223, -391, 123, 397, -38, -376, -105, 276, 179, -180, -275, 24, 296, 92, -307, -229, 260, 313, -186, -361, 90, 375, 14, -362, -110, 295, 195, -164, -231, 56, 262, 99, -267, -220, 192, 312, -133, -370, 28, 366, 55, -346, -149, 269, 219, -160, -251, 5, 248, 85, -249, -216, 163, 290, -94, -344, -20, 346, 87, -316, -172, 235, 229, -126, -246, 22, 244, 113, -185, -214, 134, 294, -43, -317, -42, 322, 150, -288, -201, 218, 237, -128, -276, 8, 226, 110, -177, -207, 100, 277, 9, -311, -101, 302, 164, -262]
3145b62MM40R8l92j53K50K66j44k89k5L05J78k58l00J61L87n7m24m6M27J42l62
3167e4k30K55K73j01l04l9K67J77k24l12J46L86l8m11o2L91J75l30k59K27K95
3188B28q4l22n2K91J80k16k73J06L79j5l94j10L77K04l10k86K16L47j08l13k9
3209a84K45J73j93k77R1L35K3l45j51L40K33k84l09K10K96n2l34k5K67J52j75
3230C6k58P8L03O4l45j71L30K46k53l25J88L16k5l22p2K63J77j70k44N0K93N4
3252B13l18j46K55K57j96l20J17L22Ol12j10K42J87j60k24L2K64P3k49k02K22
3273d7K75j49l22P1L52Nk93r7K33J75j42k22NK77P7k31j90K01K64j08l37K0L37
3296A54N3k87j40K24J92j10k56J6K44R9k24j96J61K76p6l25QK97R8k68j58J72
$$ y = [-262, -258, 182, 280, -112, -265, -15, 251, 107, -182, -207, 98, 276, 18, -282, -121, 266, 209, -215, -261, 166, 308, -54, -284, -29, 244, 143, -161, -200, 67, 244, 20, -292, -146, 240, 202, -209, -271, 120, 295, -35, -294, -67, 228, 144, -178, -230, 61, 241, 25, -248, -142, 237, 222, -172, -282, 95, 299, -11, -297, -81, 266, 158, -155, -184, 61, 234, 41, -236, -145, 190, 213, -132, -283, 57, 290, 6, -303, -93, 203, 151, -183, -208, 59, 211, 36, -222, -144, 159, 223, -122, -293, 37, 283, 30, -295, -107, 209, 184, -138, -210, 53, 230, 60, -184, -134, 159, 213, -105, -251, 4, 261, 65, -255, -138, 184, 190, -122, -232, 10, 197, 37, -187, -155, 109, 182, -67, -269, -47, 228, 79, -243, -172, 180, 185, -108, -205, 28, 203, 61, -161, -156, 121, 198, -33, -223, -22, 242, 134, -203, -183, 154, 207, -80, -220, 4, 196, 86, -170, -154, 90, 189, -35, -231, -70, 206, 130, -195, -187, 110, 208, -60, -218, -46]
3318d6K41j27k14NK33Q9j86j82J25K59o2k85l3L09R7k49j88J90K11p8k52j3K23
3341F7J08j78k13J35K45k8k78n4K73J37k31k04J59K47q3k47j9K26J10j84j86J16
3363h2K30J2k67r0K68J50k29j86J20K60m3k74k7K20J18j41k10Q3K19K7k68q5K24
3386B9J69j65k37J20K40l5k52k8J97J21j37j87O5K33J5k44r9K04J92j78k23Q6
3408a14K73j5k50o9K15J35j36k06O5K26L2k18j08J72J88j19k60O4K53K4k43r0
3430a81K08J49j31j98N2K00M0j97j26J68J96j11k32L7K54M0k37j04J84J67j25
3451E3j86L5K11N1j97j34J62J84r7k37L7K48N8k40j14J73J79j18k22L4K15M5j66
3474b6j46J23K01p7k04j5K32M9j91j20J54J88j04j98K6K01O1j77j41J41J83n0
$$ y = [-46, 195, 68, -146, -141, 92, 181, -5, -187, -62, 197, 135, -150, -183, 126, 223, -26, -214, -24, 187, 109, -143, -156, 67, 175, -3, -216, -81, 164, 136, -142, -196, 77, 214, -17, -221, -62, 185, 102, -145, -164, 62, 172, -12, -198, -82, 148, 160, -107, -197, 71, 221, -8, -194, -74, 186, 143, -131, -158, 62, 180, 39, -171, -88, 131, 158, -110, -195, 29, 198, 33, -204, -84, 156, 121, -131, -159, 38, 159, 22, -165, -100, 133, 148, -96, -195, 9, 201, 23, -200, -114, 159, 144, -106, -175, 40, 175, 39, -167, -102, 124, 156, -62, -170, 2, 190, 71, -189, -125, 128, 152, -91, -181, 27, 176, 45, -153, -101, 99, 139, -58, -184, -16, 180, 69, -163, -126, 128, 168, -69, -173, 11, 178, 53, -133, -98, 113, 164, -33, -167, -5, 179, 82, -155, -118, 130, 188, -52, -166, 7, 186, 68, -154, -120, 95, 140, -26, -172, -49, 152, 75, -129, -144, 88, 137, -54, -174, -20, 168, 64, -134, -108, 93, 154, -23, -164, -23, 160, 110]
3496A10k23qK17O7j61j40J26J72p5j95RK00O3j51j47J13J60l6k00l7K11Q4j76
3519a7j57J42J78o6j77m3J94P5j45j32R8J80k8k00l3K05R9j60j44J01J84l1k17
3542i4nJ65Q4j29j39N7J87mj87o5J65J05j33j56P8J87j3j98n0J68J20j35j54O9
3566g7J62K5j76n3J31J51j26j63N2J82Lj84n9J67J19j19j56N8J68J2j73n6J40
3589B8J17r9j61M4J81Mj76o0J45J09j18j29K2J78L0j63q4J36J25j09j42L3J66
3612G7L8j71p1J43J11q8j51J8J75M4j36j16J47J17q0j72K1J81M1j66r1J31J19
3635A21p3j47J8J59N0j51j03J09J26m8j66MJ77K8j34j20J38J26n4j67K6J52N1
3658A22j38q5Q6J50n5j44j5J69M2j44r6J04J19n9j33J0J44N2j27j14J10J26m2
$$ y = [110, -113, -121, 96, 163, 2, -138, -12, 160, 85, -110, -101, 99, 162, 11, -136, -23, 137, 101, -99, -136, 75, 159, -17, -174, -32, 146, 80, -97, -140, 54, 129, -16, -148, -50, 130, 102, -98, -131, 74, 173, 13, -131, -30, 154, 123, -94, -99, 66, 150, 21, -118, -61, 126, 122, -65, -130, 35, 140, 7, -149, -71, 116, 103, -95, -145, 23, 143, 8, -146, -77, 85, 110, -66, -119, 12, 163, 37, -126, -74, 108, 111, -73, -132, 35, 154, 35, -121, -63, 105, 117, -56, -112, 28, 145, 46, -115, -71, 110, 114, -62, -122, 23, 132, 14, -115, -93, 85, 115, -48, -132, 4, 129, 20, -122, -89, 77, 115, -56, -127, 16, 127, 39, -112, -94, 81, 125, -11, -127, 20, 137, 57, -115, -94, 87, 128, -38, -129, 2, 121, 48, -99, -81, 78, 128, -23, -126, -17, 109, 61, -105, -101, 76, 104, -30, -150, -12, 114, 60, -107, -81, 71, 122, -16, -101, -15, 135, 80, -64, -79, 90, 132, -12, -108, -4, 115, 56, -77, -67, 77, 129, 2, -112, -2, 124, 82]
3681H2j73oJ55O8j51r5J02J16m8j19k5J47M1r7j08Q0J34j8j52j2J24O8j26q2O2
3706c3J45m4j42rJ50O1j26r1N6J37j7j43l4J31O3r8j12O5J28j1j19p0J49O5r4
3731Gj29P0J35pj28n6J13J04j06j11O5J28Kj47l5J34O2q1r4K8J37j2j31l9J24
3756C3Q8q8j31N1J35%j27o4J22P4q0j11M9J12Jj04o4J19P0m9j25M0J30j7j07o4
3782a07J17Q8p1j11K7J24L1j25q1J16J12r0j21M3J33K1j25p0J10R0r4r7K8J13
3806F1K7j29n5Q8J09r2j01J2J43Kj12o1J04P2m7j07K0J12J7j11m6P4R8m6j00Q
3832f0J22K4j01o1P1J18o9j00pJ11L7p6r2O9J30o9j02j1J08L4r0p7O6R7m3q7j0
3859f8J14J0q1n4N8R5k9j14%R2P4j21o6R9Q5m4j17OJ13L5r0p0O6P4j3r4k1R3O7
$$ y = [82, -91, -97, 58, 126, -25, -120, -18, 98, 50, -69, -94, 53, 94, -3, -111, -31, 103, 85, -67, -79, 45, 113, -13, -95, -33, 112, 68, -74, -83, 67, 128, 2, -89, -33, 104, 87, -56, -90, 41, 104, 6, -106, -41, 87, 76, -43, -113, 36, 101, 7, -122, -52, 83, 76, -52, -108, 5, 109, 3, -108, -43, 85, 87, -60, -95, 39, 101, 20, -74, -46, 91, 79, -52, -91, 33, 121, 33, -98, -47, 88, 88, -39, -103, 19, 93, 13, -98, -49, 63, 64, -40, -104, 15, 85, 36, -89, -49, 81, 64, -43, -107, 10, 98, 27, -84, -57, 67, 98, -27, -108, 8, 120, 30, -91, -48, 85, 106, -19, -89, 21, 111, 17, -80, -52, 61, 88, -41, -96, -8, 101, 9, -92, -80, 63, 65, -47, -108, -4, 68, 21, -86, -66, 46, 63, -48, -94, -20, 78, 32, -68, -60, 62, 86, -15, -76, -5, 113, 44, -56, -63, 48, 85, 9, -83, -14, 116, 47, -55, -66, 42, 76, -14, -91, -25, 72, 29, -58, -68, 46, 56, -25, -79, -21, 74, 45, -69, -69, 23, 97, -24, -90, 9, 94, 50, -67, -61, 52, 87, -3, -73, -7, 67, 54, -40, -61, 32, 99]
3888I9r0r5P1J00k8j21JP9O8p8q3M0P3K5j02n5J18L8m9p8K8R4j1r1k7Q7N3n5q1
3917g0L7P5K0j14j1P5O8n7j12O1J00j6r2j9Q1N7p3r5L8R7J0r7m9R1P0p6q2M7Q1
3946D5Qj01l9R0N7n7m7NQ8J5q7m1P0Q2p2p9K6J10j2p0o7R4O0p1p8K0J00Qo5o6
3976g4P0M9l5q4K0J04j3q0l6O9O2m9o4J7Q1pp9k8N3O7m4n2J2P7K1p5n9P3O6m9
4006A3o1K0O2K0n9o6O7O2l6o2J0O7K1q8l3N8N6m3o9KO5M6q1l3L1R0l4p6rP2M0
4037E2n3p1N5O9l7m5k1J16j2n6l4K1Q5l9p0j1P5M4o8o5N7O3l6m2k5P8L3p3n1M5
4067a6L7ll0n3Q4J9m8m6M5L7Mq0LP0M2p2l7L5M3J7p3j7O8L8l3q4L8N1J5p3k8P1
4099B4K7m4n2J4Q2k7o0jM5K7m2n9L0O8j5p1J8L6M8n1o2L4O2on9l0N9M9l1p2N6
$$ y = [99, 9, -86, -15, 85, 57, -64, -63, 16, 84, 6, -77, -37, 36, 61, -41, -96, 22, 60, 11, -67, -39, 55, 44, -47, -74, 13, 66, 11, -70, -33, 42, 62, -52, -63, 12, 80, 23, -89, -28, 72, 56, -36, -55, 26, 83, 10, -85, -47, 50, 60, -37, -86, 5, 75, -1, -83, -36, 45, 53, -48, -87, 3, 60, 3, -44, -39, 49, 64, -23, -64, 6, 88, 16, -63, -37, 73, 61, -9, -76, 18, 78, 7, -71, -51, 49, 57, -8, -74, -4, 45, 10, -74, -54, 50, 37, -43, -79, -10, 52, 3, -61, -44, 37, 30, -49, -77, -24, 43, -1, -53, -41, 36, 57, -18, -77, -4, 62, 13, -48, -28, 34, 54, -5, -71, -4, 58, 22, -40, -30, 37, 58, -30, -63, -5, 51, 8, -61, -59, 6, 52, -29, -62, -31, 59, 25, -51, -60, 12, 52, -1, -72, -17, 52, 15, -30, -51, 65, 53, -3, -37, -16, 69, 30, -40, -51, 24, 68, 0, -65, -8, 55, 19, -23, -48, 30, 63, -10, -61, -16, 21, 18, -12, -65, 19, 38, -10, -56, -11, 26, 30, -50, -47, 23, 65, -7, -44, -9, 34, 51, -22, -39, 29, 67, 34, -50, -12, 39, 54, -19, -47, 24, 51, 7, -45, -31, 51, 24, -36, -37, 8, 35, -7, -66, -36, 32, 17, -54, -36, 0, 48, -3, -65, -31, 31, 25, -34, -64, -5, 44, 13, -59, -3]
4130cO2k2p5pO0N6p0o4N4L9Po0j8M9M5m4n3J0O9mn8l5N2M8o4l7L1O4j1n7j1K9
4162a8M1j6n1J5N6Ro7j8M8N6m7m1RO6J2o5qL9K5k0m7j4P6%n4l9N0M1n8l0K1M8
4194A9ok7m7L8M5k5m2pP1Ro9j4O0K4l2l8OO5rk7k3M0J9jm9rN3J5n3m1O4J0Jn1
4228c1J6L1Rl2k8K2L4j6m6kN9Ln5LJ9L7j3n1NM5Pl2k4L1O0m4l4QO1Mm6m6L3M8
4262C5j6k9k4N7Pj8m6K1M5k1m4JJ9M0m6k7J8N9k4p0J0N5J3l8k0J1M9j2l3MK7J4
4294A7j6k8JM8Ln9J9J7L4k9n0N2K3om4k1K8L9j2n3K4J7Qn1kN1J9l8l6M1K9k5l0
4327c0qL7K5l1k3J6L4j3k0nK5K9l0m7M6K1pm4LL5K5k7l6J6J7jk4j7L4L0m4k3J0
4360b7K9K2l9j2K5K9k7l1ML6Mk9j2J2L6j8k3J5L0j0j9k0L7Nqk8nM6K5m9k0M0J3
$$ y = [-3, 59, 37, -38, -45, 15, 71, 1, -63, -9, 30, 37, -23, -41, 8, 53, 9, -44, -34, 35, 31, -27, -62, -10, 38, -26, -63, -32, 32, 21, -36, -47, -18, 23, 7, -44, -29, 27, 36, -31, -49, -1, 55, 8, -33, -24, 42, 54, -11, -19, 20, 45, 25, -22, -36, 40, 40, -14, -53, -3, 38, -20, -50, -29, 19, 13, -14, -61, -23, 22, -3, -45, -52, 19, 28, -41, -55, 5, 29, -3, -41, -35, 30, 21, -6, -29, 11, 30, 29, -20, -29, 24, 39, -14, -55, 9, 19, 20, -31, -15, 16, 25, -7, -35, -13, 21, 5, -41, -43, 16, 19, -36, -33, -14, 23, 10, -41, -36, 9, 16, -16, -40, -9, 51, 7, -27, -19, 42, 46, 0, -46, -13, 35, 19, -10, -34, 23, 30, 12, -34, -13, 32, 11, -33, -32, -13, 27, -19, -46, -28, 31, 7, -63, -53, 2, 15, -23, -43, -32, 17, 5, -28, -24, 3, 17, 1, -27, -26, 22, 25, -34, -15, 2, 36, 7, -43, 9, 32, 26, -18, -39, -11, 28, 16, -37, -13, 4, 12, -39, -41, 10, 29, -9, -45, -4, 25, 0, -30, -38, -1, 24, -7, -30, -14, 20, 7, -13, -18, 7, 36, 6, -41, 5, 26, 19, -25, -22, 13, 38, 11, -25, -9, 8, 7, -17, -34, 0, 30, -14, -37, -27, 2, 24, -15, -27, -2, 27, 0, -31, -27, 9, 13, -16, -28, -16, 20, 2, -21, -6, 24, 14, -5, -25, 12, 17, 9, -19, -24, 22, 47, -2, -22, 18, 31]
4393C1k0l1L4KRl7kjJ7pl5MM1lk1j8L1L1k6m1K8K8pl3j8M4K6l0j0oK9J4k5j0J9
4428GL9l5l0jL0Nk2k2L6Qrm0J6L3Ll1j7PM3j4n1PL6Jj9j6L3PK2k6k0K0Kjl4J5
4464a8M6j1j8j2M1j9j3kK1mj5l2M1NJ4l4rK6Oj8k7J7J3J5m4kK2J7pm4L4Rj0j2
4498b4pJ1K1Mk1mM5j6k8oK4L0l5JJ5PJ4l9j6K5K5jk8pK5J3j9l0L0J7mm4K5j6M
4533ik1OOL0j6j1KJ1LkLkK9rl2kL9j2%kj7M4k7nnJ2OnmNOj6oLOJ0l9LOMlk6K5
4576a2j1K0j6jNJ3Rl6J2RJ3nqJK1j0j5rL2J2l9K2oJ9pmj4QJ8j9kLOJ1l2J1NJ1
4614A5k1j5LK1Rm0OK7Pk9j1J7RNl1K7QJ3j1j9PK6k3Pj2K2K4k8j8OLJ9j8j4nJ0
4650dNoJrK5rk7L1j2Pj9J1jj2j3K0KOqj0K1oL0k7j5L3lNpMJ1jnj2j8J9Rk8J5Q
$$ y = [31, 11, -20, 14, 16, 25, -12, -14, -15, 2, -5, -40, -36, 5, 2, -19, -37, -6, 25, -1, -42, -14, 14, 7, -26, -44, 0, 26, -4, -14, -20, 9, 23, -2, -12, 7, 46, 11, -19, -20, 10, 15, -7, -29, 7, 15, 6, -34, -18, 15, 18, -13, -30, -23, 20, 6, -45, -38, -2, -1, -20, -36, -3, 4, 26, 0, -20, 0, 2, 1, -33, -18, 28, 17, -1, -13, 28, 9, -4, -6, 15, 11, -4, -36, 5, 10, 24, -10, -19, 7, 13, -5, -32, -15, -2, 13, -31, -33, -11, 6, -1, -45, -11, -2, -12, -24, -31, -20, 1, 5, -16, -20, 25, 9, -19, -25, -1, 29, -6, -5, 10, 17, 31, -8, -24, 1, 26, 25, -3, -10, 15, 28, 9, -21, 9, 26, 22, -22, 3, -13, -9, -30, -24, -18, 12, -4, -15, -13, -2, 1, -1, 2, 0, 29, 20, -12, -14, 25, 13, 13, 11, -6, 38, 11, 6, 1, 13, 19, 14, 10, 15, 21, 5, -1, 2, 8, 18, -21, -18, -12, -8, -11, -37, -12, -23, -3, -19, -20, -15, -2, 7, -29, -17, -8, 5, 0, -8, -7, 14, 4, -11, -20, 12, 24, -15, 7, 1, 20, 13, 9, -5, 3, 21, 2, 0, 3, 9, 20, -12, -1, 4, 15, -6, -21, -18, 3, 12, -28, -22, 5, 12, -17, -28, -11, -2, 3, -28, -1, 7, 20, 9, -10, -3, 23, 0, 7, -5, 17, 41, 13, -5, 1, 4, 23, 5, -9, -14, -4, 1, -5, -4, -13, 12, 3, -24, 7, -5, 2, -17, -6, -7, -19, -32, -12, -10, -4, -12, -22, -1, -7, 23, -4, -19, 14, 11, 16, 9, 13, 24, 23, 18, 6, -12, 7, 16, -12, 3, 11]
4690A1j8qJ3J0J0k5KlJ3j4Lj3J0J2j6j1jK5J3k8qJ2K3j2j5PNokkJ4J6j1pPNMj4
4728AJmL3l1j4K4O%k2rJ9%j6QMk5Jl%J5NJ5m3J2K1jk2NpJ9oKlJ8Ok1RmM1k3Lr
4770EJ7%m7K1LOKj0j8J9Mj1j2PJPj1j9L5j7j5pJ6J0PLk0L0j3j1L0rJ0nprJ6j2
4808dLQj6K1nj7LnJ5j0lJ8pLk9K2pQj7lNJ8j2k3KJ0K0j2j3POlLJ2j2L4k6OJ1j3
4848bPPj0jJ1rqJ5Nj2rnOjqPKq%lj0RJ4%j9KJ8pLj4J1J1j0J0k7J9MrLJ6oj2oJ4
4892bJ0nJ3j8J3Mj0j3pK7jj3j3kJ3nj1PK3nl5OJ1J7j4k0RJ2%k0K0J7Jk3QOrPO
4931Dj4KL7k6j6pK3J0k9JJ3K0j9qmJ3j5PqQQj7Pj2J2Ql5NOqJ8rJ2MNj0o%K2Kl5
4972c1K7JJ5j9PPJ3j7mNjPk7J2Qnj2k3K0QJ9k8MqK3rlk4J6J2j3nJ1Nj3j%J5Qr
$$ y = [11, -7, -15, -2, 8, 18, -7, -5, -8, 5, -9, -6, -19, -9, 3, -13, -24, -25, 0, 13, -15, -23, -11, 12, 0, -15, -8, -3, -9, -11, -13, 1, 17, 6, -1, 6, 11, 15, 1, 2, -2, 31, 0, -14, 10, 16, 16, -6, -15, 4, 4, -12, -4, 0, -25, -24, -27, -27, -12, -7, 8, -35, -23, -2, -3, -25, -20, -27, -8, -14, -12, -15, 3, 9, -12, -3, -7, 34, 11, 14, 5, 22, 22, -25, -4, -1, 5, 7, -3, -21, -2, 2, -9, -21, -14, -13, -6, -17, -36, -1, -18, -33, -40, -24, -14, -7, -4, -24, 6, -7, -18, 12, 3, 13, 8, 1, -8, 8, -4, -1, 7, -9, 12, 7, -10, -7, -12, 3, -7, -10, 8, 1, 4, -25, -3, -10, -2, -19, -22, -17, 1, -11, -34, -32, -22, -2, -14, -27, -20, -14, -17, -14, -2, -14, 20, -6, 0, 11, -2, 5, 12, 2, 1, 12, 3, -5, 10, 15, 3, -6, -11, -5, -6, -14, -7, -5, -13, -13, -16, -26, -17, -3, -3, -22, -20, -2, -9, -6, -20, -9, 2, -8, 2, -25, -6, -2, -11, -8, 8, 2, -10, -16, -2, 8, 3, 16, -2, 11, 15, 5, -8, -15, 12, 11, -2, -15, -17, -4, -9, -20, -13, 10, 5, -30, -24, -13, 4, -10, -30, -21, -9, -9, -29, -9, 8, 9, -14, -6, 0, -9, -2, 4, -10, -8, 29, 3, -13, -20, 3, 13, -16, -15, -2, 18, -1, -9, -13, 0, -15, -8, -16, -8, 0, -17, -10, -22, -10, -2, -37, -32, -26, -34, -16, -25, -13, -9, -4, -14, -20, -20, 2, 4, -31, -4, -3, 12, -7, 0, 7, 20, 3, -1, 4, 3, 10, -17, -5, 3, -2, -14, -37, -17, -9, 10, -18, -14, -22, 1, -8, -11, -35, -19, -7, -20, -25, -14, -9, -22, -23, -23, -8, 0, -9]
5012ioK2kj9NJ0J8nj5RJ6mnj3nK2qj7RrJ2oqqKrJ0rNJ7pj7RkKJ8j8J0oOoqJ0P
5056bj1JK3mjk6K4QJqj6QJ4j1k3J6RNml1K2jNk1JK3mj0k0pK1J7J0k9NJ9j9qJ7
5095glJ9l5OK4K%k3J1OLoQJ1oj3KpK0j4lj8J2NJ7l6NJ0J3j3j1MJ3k3K0j0J6Ol9
5134c4J8NL8k3k2NK4kj9LJ3j1pJJ0J1j2mj4J5J1k1QmJ2nj1j3K4oj7j7K2J3q%p
5171b4KRJ1j3J2j5L6l9KOJ4LJ0j9J9lk5mL4J0l3mKK4Jj5j5JK4l2mJ8%Ol0J1K1
5208Ak7Jj1RPPQk2J0K4j0j1LK3k7J7Knj0K6j4JJ6oj4j0J8Lkk3%K1k1K0rqJ7nj2
5247a3j7mJ3mlJ4Oj4k8L5RrMj2K0j1pJ6Mj2RLj1J5oJ5k7oK5J3j2qKK4k4%k3K0
5285dK2l4mQJ0j4j2qJ3Rj7JOJ0LoLNljk5K2J5k4J7j4K7J0j5kOK1k5j3%J9ojj1
$$ y = [-9, -15, 7, 5, -14, -9, 1, 19, 14, -1, 8, 24, 20, 15, 2, -3, 19, 11, -6, 3, -6, 6, 0, -8, -16, -14, -23, -13, -22, -17, 0, -7, -24, -15, -17, -15, 3, -15, -5, -11, -5, -11, -19, -9, -2, -13, -12, 11, 7, 6, -20, 4, 12, 13, 5, -11, -3, 11, 0, -23, -7, 2, 7, 3, -28, -6, -7, -2, -23, -22, 1, -3, -13, -33, -40, -19, -2, 8, -21, -16, 3, -16, -24, -7, -10, 9, -26, -20, 4, 6, 6, -17, -6, 0, 3, -3, 5, 16, 10, -3, -1, -8, 12, -2, -5, -23, -11, -6, 11, -25, -20, -10, 3, -10, -21, -17, -4, -27, -7, -17, -1, 5, -34, -16, -11, 27, 4, -18, -13, 11, 9, -10, -7, 6, -5, -12, -11, -1, 10, -2, -6, -20, -5, 6, -15, -7, -11, 1, -4, -15, -28, -4, -10, -27, -44, -22, -9, -17, -17, -24, -22, -13, -2, -15, -3, -18, 18, -21, -19, -13, 1, 4, 14, -5, 14, 11, -14, -18, 16, 26, -7, -11, -9, 15, 16, 1, -14, -13, 11, -21, -25, -7, -7, -1, -31, -20, 1, -26, -25, -36, -27, -20, -13, -5, -27, -17, 7, -3, -14, -11, 12, -15, 2, 4, -1, -11, 15, 1, 2, 18, 12, -2, -12, 6, 9, 7, -16, -16, 5, -16, 4, -5, -13, 4, -1, -13, -30, -34, -21, -25, -28, -14, -8, -22, -50, -15, -6, -15, -11, -23, -3, -14, -21, -5, -1, -13, -4, -1, -12, 3, -3, 12, -15, -21, 4, 17, 5, -3, -1, 23, -1, -1, -24, -4, 18, -16, -20, -12, -2, -16, -28, -36, -23, -14, -31, -30, -24, -14, -11, -17, -14, -9, -12, -13, -38, -16, -1, -25, -8, -22, 5, 15, 0, -2, 4, 25, 0, -13, -13, 6, 0, -1, -12]
5324a2NJ2mk2OKKj8jjJ4j1KrJ9J1j3pJ1rJ4L%lKOk8J6K4j8J4n%J1kj1j1K0KJ1
5364B2l1OPk4jj0K6%k7kJ1J3j1kllRj5K1j6L8l6OjNJ8k5J1pKJ6%j3K2j%j8J3J0
5403A0krPMj0Nll1K0lKmJJ7k5j7J7J9j0l1%K3%j4j7L0J6j6ljJ8LkkJ1j7N%J4j
5443Dj2OrJ7J5k0KlPj2J7k5rJ6rPj8J6j3J8j8oK1j7J3jj2MJkLkJ0j0J6J8nj9j0
5482b1L0Nj4jj4L0Rk6J1k0K9lk2pJ3j8J2j9OJ6j5oK%MPj1j0J4Qk1J4J6j0rl1L5
5519a7K9k2j3NL3j8NlpL0j6j5LJ4j5Pj1j3K8j7j1OLQk3POj3J8ml1M2j0%k4K6k
5556a5J0k3J8nMrJ4J3JLk8K8qPj3j8RJ5j8Qj6J5J1j8j2L0k0ORj9J0Nk5oMJ3%k1
5594d1LJ8Pj0j6K0L0j3j3qPK4j1k6K7JkJ1pJ4Jrj6MK6l2J4j2K2nk3k3J4J0mOj
$$ y = [-12, -7, 5, 1, -21, -15, -13, -11, -29, -30, -31, -17, -28, -26, -35, -16, -5, -18, -25, -14, -23, -9, -6, -6, -9, -7, -1, -29, -13, 11, -7, 7, 2, 2, 13, 11, 0, -11, 9, 11, 22, -9, -3, 4, -20, -21, -31, -5, -5, -32, -34, -23, -10, -21, -23, -26, -29, -20, -35, -14, -30, 8, -28, -22, -23, -18, 0, -25, -14, -21, -19, -3, -3, -16, 6, 5, 5, -13, 0, 10, 8, -1, 6, 10, 0, 5, 2, -29, -9, -12, -10, -14, -13, 4, -21, -38, -21, -2, -12, -43, -43, -20, -20, -34, -51, -21, -5, -21, -24, -25, -7, -4, -6, -8, 3, -14, -9, -9, 5, 4, -8, -2, -11, 6, 21, 1, 3, 0, 7, -5, 12, -13, -22, -6, -15, -8, -26, -10, -23, -5, -23, -29, -8, -25, -12, -13, -25, -21, -20, -22, -19, -21, -11, -21, -5, 13, 8, -11, -21, 9, 14, 0, -1, -15, 15, 24, -2, 9, -11, 18, 15, -7, -14, -1, -19, -7, -26, -20, -4, -19, -25, -23, -23, -19, -12, -23, -33, -19, -11, -32, -18, -2, -12, -21, -52, -17, 12, -10, -23, -18, 15, -3, 2, -1, -8, 22, 6, -9, -6, 8, -7, 0, -11, -24, 4, -13, -24, -18, -15, -7, -30, -23, -17, -30, -12, -16, -47, -5, -15, -15, -39, -13, -15, -5, -28, -10, -15, -11, -20, -6, 7, 8, 11, -17, 11, 3, 10, -3, -21, -12, 3, -15, -7, -23, -8, 3, -15, -27, 3, -17, -11, -2, -21, -11, -6, -31, -37, -33, -20, -20, -41, -38, -20, -13, -23, -39, -19, 11, -2, -15, -23, -16, 8, -3, -29, -2, -1, -3, 8, 1, 15, 16, 7, -9, -5, 21, -11, 3, -9, 13, 8, -15, -38, -24, -14, -18, -12, -13]
5631a3Lj1nkOK0pqk1K3LJ2pKJ1KJ0l9L3Lkk6J3J1jj2k1J4J3j2QJjJj1nK2pk4R
5671a5J8j1K4k0l3L0nq%j0J5J6l3J2J7qqJ1nQK1pQllRj6j7J1J2j4PPpj2mjJ3N
5710DprJ1j4Qj5J8kqorRJ5j1%QmJ3nj6PK2npmL0Jl2JJ4RlqllONj0jJ2k6J4k0R
5754a2J9k8J6j1J4rqk3K3J0j4J8%%rNQJ2krk1OL5j9qRJ6Pl9L2j3JLl3J9K5rk1
5792a0pK8k1mLOmNj5k6N7k2Kj4PMK1k8j0K4Rrk0J3K4%nj7K2Lj5j0OJK2j8KRj4
5831ajpJ3Rk1j3K2mQj1j7J1k4K0nRk0K7Mk2J1K0k3RprK3mLj4L5j4J6j9j0K0J4
5868B8m5OOK0j8j5J5J9k2J4j2KpjOj9K4j2%kQOrk1RLPRj3J3Qj1J1j1J1J8j4j7
5906fK9rJ2rjJ0j8mj0J2Jj9MNOj7prJ4Qmj3OQQk0K1j1QnJ0qJ5Qmk5J8j5K5j7K4
$$ y = [-13, -10, -21, -26, -28, -22, -2, -9, -17, -38, -15, -12, 0, -7, -5, 6, 8, 18, -21, 12, 15, 13, -13, 0, 11, 10, -2, -23, -9, 4, -8, 0, 1, 0, 1, -10, -15, 7, 0, -24, -15, 3, -8, 16, -4, -37, -7, -12, -20, -20, -30, -15, 1, -32, -20, -3, -11, -19, -8, -13, -5, 16, 9, 17, 14, 11, 20, 4, -13, -2, 10, -4, 3, 10, 3, -9, -13, -14, -1, 4, -3, -12, -1, -15, -7, -22, -4, -6, -14, -20, -29, -20, -5, -16, -16, -8, -12, 1, -4, -20, -13, 9, 4, -3, -7, 23, 24, -8, -7, 7, 16, 13, 5, 2, -1, 5, 10, 0, -1, 11, -15, -1, -21, -12, 7, -21, -5, -16, -2, -11, -19, -42, -19, -9, -23, -5, -5, -5, -14, -9, -1, 11, 9, 0, -21, -15, 20, 1, -7, 2, 18, 25, -14, 18, 5, 6, 9, -24, -5, 20, 11, -10, -17, 11, -10, -14, -11, -5, -9, -4, -19, -45, 12, -10, -8, -22, -15, -11, 10, -18, -28, -4, 5, -4, -24, -11, 13, 13, 8, -9, 13, 16, 1, -9, -3, -2, 20, 2, 4, 13, -1, -2, -9, 4, 13, -8, -21, 1, -3, 5, -6, -23, -12, -36, -16, -21, -12, -32, -5, -1, -23, -12, 8, -15, -6, -13, -22, 1, -3, 0, -14, 21, 7, 23, 4, -6, 14, 28, -17, -11, -5, 15, -3, -18, -3, 16, -6, 8, -4, -2, -9, -10, -4, -23, 1, -11, -11, -13, -5, 1, -8, -29, -20, -17, -10, -1, -14, -1, 7, -4, 7, -4, 7, 25, 11, -6, 23, 14, 26, 17, 16, 26, 8, 4, -6, 6, 7, -12, -8, -3, 3, -14, -21, -30, -16, -8, -12, -25, -19, -11, -3, -23, -2, -13, -5, -10, 0, -8, 7, 15, 11, -14, 4, -11, 14, -3, 21]
5947B1nj8RJMj2J1j0J3J5om2K8PJnj4oK3j5k1lK7j3kQKk3J1j1MMOJ5k5J2K1pj0
5986eMJ4qQj3JQ%lkJ6Nm6J8J8j3J3mm5L0oqJ4Lj4KKNLjpj8J4KOJ1j0J3Lj0nOP
6029HJ2j9J2oJ5lo%MjpkrK5j7j8nL3mj9kj2RL5l1j1RJ8l0RJ3j4J4j2K0j0Pj9%
6068a4J4J7j5Rj3J8K0k6j1J5pJkKLj1Lj7jJ9rj5OJ3%j7J3j8K7pj9OMJ5j2lRRm
6107Bj2J9kJ5j2l0K8J5%j9OJRrqmRJ0Lqj0J3j3j5J0Mj1qKJ1nKk1J4j0NMJ1Pj0
6147gplJ7lJ4j0j0OJ8j2oJ0Lj2K0j0k0J5Nj3oNK0k2j2J2J2k0pJ2J0j3prJ6Pj1
6184a8J3%p%krJ1K6k7nK8nJ9k0oK0Rj9jn%K7k3Jj0QJlKoPk1LRjj1K2j7%J1Jk5
6226b3P%Rjj7J0KJ0j0Rj0K3ooJ5qKJ5j0J7ol1QJ2K1k2j1J8mrj3OJj0J4j3mJ4j0
$$ y = [21, 16, -2, 7, 8, 12, 0, 11, 1, 14, 29, 23, -19, 9, 16, 17, 12, -2, -8, 15, 0, -21, -24, 3, -10, -12, -4, -2, -25, -14, -25, -21, -17, -11, 4, -21, -9, 12, 5, -5, -1, 13, 5, 13, 0, 1, 9, 9, 6, 4, 20, 25, -21, -3, 15, 2, 15, 11, -34, -4, -10, -18, -4, -1, -15, -13, -11, -6, -3, -4, -11, -29, -15, -13, -7, 4, -6, 7, 10, 0, -5, 1, 8, 20, 1, 13, 7, 22, 19, 13, 13, 17, 16, 9, 7, -2, 23, 6, -12, -17, 16, 12, -7, -9, -21, -12, 23, -8, -19, -10, 8, -22, -13, 0, -14, 0, -12, 8, -2, 5, -14, -14, 0, 17, 2, 11, -2, 16, 36, 10, -1, 14, 7, 8, 6, 8, 11, 0, 3, -14, -15, 4, -5, -20, -14, -1, -1, -18, -5, -23, 4, -3, -22, -16, -12, 3, -9, -12, -3, 6, 2, -10, 9, 7, 22, 10, -20, 8, 23, 23, 4, 10, 11, 20, 11, 3, -1, 8, 18, 21, 13, 3, 16, 3, -12, -2, 2, -9, -17, -15, -4, -9, -7, -28, -14, -24, -19, -15, -4, 3, -7, -14, -17, 0, -3, 11, 1, -9, -3, 15, 3, -3, 7, 10, -2, 18, 8, -12, 3, 8, -5, -11, -6, 14, -8, -20, -8, 4, -16, -23, -11, -1, -14, -21, -30, -14, -7, -18, -5, -5, -12, -12, -14, -23, -12, 14, -13, -18, 10, 5, 24, 4, -2, 18, 27, 8, 7, 2, 2, 29, 6, 7, -3, 5, 6, 3, 5, -1, 6, -15, -12, -3, -4, -15, 7, -10, -10, 1, 2, -23, -16, -16, -7, -8, -25, -15, -13, -3, -13, -4, -14, 9, 3, -3, 12, 4, 6, 21, 11, 28, 22, -9, -1, 11, 32, 10, -1, 17, 13, 4, -9, -3, -2, -12, 2, -11, -15, -1, -11]
6265a1k1OJ2qJ0pQJ3k1LjqK5RjNj2j7kK3lJ9pKP%Ok1J6j5nJ5j6mJ2j1k6K5Jmr
6306a3oJ4MrPj5MOpJ8pPJ7j7k2L9k6PLlJ0RkkNMmlj6K7oj5k2M2j6j1rK1j1j2R
6347aj9J7j0J4j5j9L1j3J2k4J1K4OkJ2rrrRrK4rJ6j3rOJ1j4j0K0kj3LOkj5J4R
6385A9j8j1Kq%K0l0QNnQj5KJ1Pj7%L3j1jjpOJ5Nj0J2mJ1k0rJ9KMl3J0joj1PK3
6426A1J6j9k9PJ0lOnk7L2k2MJ3Njj9J4J6j6LoK0j1J0Lk7J7jOj8K4qqQKlNJ2rj2
6466@J2pj9kJ5rnJ7Lkk5%LJ7k2J6lRj2LJ7j5nPJ4k3K5Rk8J8PnklJ6j9lJ2Oj4l
6507@JrLoJ1j7PPKk6J0J1k1J3mRk0RjJ7lnNJ7%kPj3J7j3LJ6Ok2J2n%QrJjJ4k7
6550BkMJ9k9POk6K7Nk6PmMrj1L9k0k2J5J3j3QrJ6KLQj3LLQ%j2ONj2K2nLk7J6p
$$ y = [-11, -32, -26, -14, -22, -12, -19, -11, 2, -19, -16, -17, -25, 0, 9, 8, 13, 1, -16, -18, 5, 2, 21, 14, 16, 23, 23, 29, 8, 24, 9, 4, 19, 3, -1, 11, 0, -26, -1, 0, -4, -13, -19, -5, -1, -10, -3, -18, -14, -8, -15, 3, -4, 3, 20, 3, -19, 20, -6, 1, 4, 1, 11, 20, 18, 16, 21, 25, 21, 18, 2, 29, 23, 8, -14, 28, 12, 1, -8, 13, 2, -10, -1, -20, -3, -13, 1, -14, -33, -2, -15, -3, -27, -16, 8, 14, 12, 24, 15, 6, -3, 6, -3, 21, 12, 28, 15, 6, 12, 23, 9, -1, 19, 17, 4, 7, 13, 11, -4, 10, 19, 1, -10, -8, -16, -16, 4, -26, -18, -13, -18, -10, -25, -23, -12, -5, -22, -22, 11, 0, -1, -2, -9, -3, 12, 17, 7, 19, 15, 26, 6, -3, 16, 18, 22, -11, -1, -2, -8, -19, -12, 11, 27, 8, -21, -14, -4, -7, -1, -6, -33, -1, -23, -19, -6, -1, -2, -21, -7, 9, -7, -4, -10, 10, -1, 9, 12, -15, 2, 1, 7, -11, 13, 5, -3, 5, 7, 4, 9, 21, 12, 0, 12, 5, -14, -16, -1, -10, -15, 2, 5, 3, -22, -22, -19, -2, -24, -8, -11, -2, -14, -11, 6, -9, -14, -7, 7, -16, 9, 18, -10, 8, 15, 10, 8, 5, 21, 2, -1, 11, 17, 3, 0, 1, -8, -5, -11, 0, -17, -10, -3, -1, -27, -17, -6, -27, -14, -18, -9, -29, -20, -21, -4, -7, -12, -7, 10, 10, 8, 15, 2, 19, 6, 9, 25, 31, 9, 21, 16, 16, 24, 15, 16, 15, 29, 2, 0, 4, 23, -6, 1, 7, -19, 8, 13, -13, -6, -10, -6, -15, -26, 13, -7, -29, -14, -1, -14, -6, -15, 1, 3, 6, 14, 1, 4, 7, 15, 15, 3, 9, 14, 2, 24, 19, 22, -5, 11, 4]
6592DPj7J3j1j1J6j4J4l3J3Nj3rJ4J4k5oK0qJ7rKj0K7j4J2j4RK7k8J9KPj8RkO
6629A5L%qkk6J8j9rJ3MnrJ8Mj3j0J1pJ2kjj3J6OLj8OJ0j2RK2j3j5J7K5k4JLj0
6668@jJ1Mj1J4nmoj0J6j8oPLjj5J2j3J2j2rJ5Lk4K9Lj0MJ0kpkjrK5Mk1L2k3K0
6708A4j2nK0oj0qJ2OJ1l5K4j4kk0J5jKKj5k7L6Lml4K6jpJ3J5kj0j5RJ4Kkj2J0
6746hJ2J1j0J7Rpk9KPJ9k5J1J1pj2Kj4PJ9ll1pJ4Ook2J3Ll2K1K0qJ1k2J8J1lO
6784Dj7J0jj1RjJ3OqmJ7K3l4MQqKj3J5pJ4k3Qj3loJj5K5pj5lL1pk9L8Jqj7L0j7
6825hOjOlLJ1poRLmj3K4jj3j3K7nrj0J7KNoj5JoPj1j4J5%j1J3Kjk6jRRKJ5rkJ5
6870Fjj2nK7k5M1k6NK4k5jQkqj6L0j5Pk1qJ5QRm2RpOJj6L2Pk4nQK3l4J9jPJ7m
$$ y = [4, 11, -6, 7, -4, -15, 1, -13, 1, -32, -19, -14, -27, -36, -22, -8, -33, -39, -19, -27, -10, -19, -17, -27, 0, -14, -2, -16, -7, 20, -8, 11, 13, 20, 2, 11, 9, 15, 18, 18, 10, 8, -18, 0, -19, -28, -15, -11, -16, -25, -7, -3, -16, -26, -15, -22, -10, -12, -13, -26, -10, -4, -1, -19, -13, -3, -15, -6, 16, 3, -12, 5, 30, 6, 7, 10, 0, -1, 10, 14, 3, 17, 12, 8, 2, -8, 8, -10, -16, -9, -6, -7, -22, -10, -23, -11, -23, -32, -17, -14, -38, -9, -6, -16, -12, -2, -4, -11, -13, -14, -23, 2, 6, -15, 17, -6, 14, 2, -3, 17, 11, 1, -7, 5, 11, 22, -13, 11, -3, -5, -25, -10, -11, -9, -7, -22, -49, -13, -10, -14, -48, -22, -23, -30, -17, -2, -4, -14, -29, -20, -6, -4, -6, -18, -8, 4, 15, 5, 22, 31, 24, -5, -3, 4, 23, -2, 9, 20, 13, 1, 3, -11, -4, 15, 12, -19, -26, -12, -6, -12, -34, -21, -18, -50, -29, -9, -17, -6, -28, -10, 1, -2, 4, -13, -3, -4, -15, -6, -7, 6, 12, 4, 0, 17, 40, 6, 10, 18, 10, 12, -1, 14, 7, 21, -2, 6, -7, -10, -16, -15, -30, -5, -12, -27, -30, 1, -6, -35, 3, 4, -4, -21, 9, -8, -2, -3, 3, 0, 3, 14, 7, 1, 10, 13, 9, -4, 20, 19, 6, -7, 20, 15, 6, -4, 13, 15, 20, 14, -1, 0, -6, 1, -10, -24, -9, -9, -20, -7, -5, -6, -32, -33, -24, -15, -13, 2, -7, -9, 6, 5, -7, -12, 15, -10, 31, 5, 10, 34, 9, 8, 16, 14, 6, -10, 20, 5, 12, -9, -17, -2, 6, 15, -27, -18, -25, -19, -18, -34, -2, 5, -19, -24, -16, 7, -27, -8, -9, -2, 15, 11]
6911A1l1K2J8lJNj4J6nj0L4k5KKjJ4m2RJ5oj8J9k7QqLqLK7j2j9oK0k7J5J0ppK4
6950Bmk3J6K2kk0PJ3lk1J2L3Mj7j0J6J5l0O%Lj9JKlpNPj9J4qj8KpJ5%qJ3j1RQ
6991ekKNlQmj1J3lpK4koj9K4%j4QnOj0MkppJ6j3Pmj1Kj4K1Mk0K1j1k0oK3kKPj2
7035b3J0KJ4pJQJ8j7%nlnMKJ9j6jOJ5k2j8J7J0mk7QL%J8k4jK2Lk7j8L1K7l1k4
7074c5L9jj2NjJ2jnkOJ2Lk8PJ4K5l4Pj0L2k9lL3qnj3j7LJ9j7k6J0jJ2ok1L0Kk0
7113b4LQkJ7Jk3J6nJ4kpL1j0qrK2qNk7J1L3l0%LK0k1QK0l2R%pj0J9j5j4oJ0Jn
7153a4pJ3Mj7NPlNLOlJ6j6J1lJ0o%J3mj7K2jqj7KJ8%Kk4J4Pk4jK8k1lnNj3K4M
7195A2m9L5NopkK0k2QkjJ5Lj0nJ7J3kj2kL6j7j6j3K0J9l7J0J4lmj5RrJ2j1j8J3
$$ y = [11, -20, 2, 20, 17, 18, 23, 9, 25, 20, 10, 44, 19, 21, 23, 22, 36, -6, 3, 18, 12, -6, 13, -14, -6, -14, -11, -19, -16, 11, -1, -20, -26, -6, -33, -18, -8, -15, -22, 2, -2, -25, -9, 13, 11, -9, -2, 11, 8, -13, -1, 32, 36, 19, 9, 25, 40, 10, 16, 16, 19, 0, 1, 3, 0, -7, -2, 5, -14, 0, -8, -26, -24, -31, -16, -16, -24, -11, -22, -13, -5, -7, -5, 0, -3, 5, 1, -10, 3, 0, -7, 17, 15, 9, -10, 14, 14, 0, 8, 3, 9, -1, 3, 1, -6, -13, 3, -10, -3, -7, -18, -16, -30, -9, -5, -25, -4, -15, -35, -41, -18, -20, -18, -11, -23, -13, -11, 3, -4, -3, 5, 23, 6, 6, 1, -2, -7, -3, -1, 18, 2, 1, 7, 22, 0, -18, -1, 9, 5, -22, -14, -11, -11, 7, -17, -18, 4, 7, -20, -38, -7, 20, -11, -35, 4, 3, -9, -4, -5, 7, 6, 1, -1, 5, 17, 20, -8, -1, 13, 38, 4, 11, 1, 33, 4, 1, 34, 26, 21, 8, -9, -6, 13, -4, -30, -20, -21, -9, -15, -36, -6, -4, -24, -21, -13, -15, 2, 3, -20, -4, -9, 5, 3, -4, 27, 17, 9, 0, 22, 14, 19, -8, 3, 36, 6, 6, 9, 29, 8, 16, 36, 4, 13, 13, 6, -4, 15, 0, -14, -20, -10, -9, -14, -21, -8, -4, -21, -16, -9, -12, -7, -4, 2, -1, 15, -1, 10, 7, 17, 11, 11, 24, 20, 3, 25, 24, 16, -1, 1, 19, 19, 21, -3, 11, 18, -6, -7, 21, 0, -3, -8, -3, -16, 8, 12, -37, -2, 3, -3, -10, -12, 8, -14, -6, -8, -9, 6, 9, -1, -6, 11, 24, 22, 10, 8, 44, 27, 11, -2, 18, 37, 0, 10, 24, 21, 17, 2, 11, 2, 14, 3, -15, -2]
7233bPjj5oJ4J1j8mj2K4Ok8J9QqnQMlPkKJ8J5l1j3L1%Rk9J4nj3J1jj6Lj0Nj0P
7274iJ8k7j2K6Nl7J2J6kj9J5nR%Oj5KJ5%JPj0J5k8J1J8lLm%NkjmMorJ9k4J0j2
7315a2mMkk1J3QLj9jL5k3MkMrJ1Oj8J6J2k6K8pPlJ5Nj9J0k2J3J4lj2pOJ9k2qp
7355a4OpJ4kj0NJj2mJ5rJ7j8j3JJ5KLlQNqJ5Rj8J7Mj5J2j1qL3oj6J3J3j4jk1j
7395cJ0Rj8k4PK0j7j9J3J1K7l8j1K8j2J2k6K1lJ0j1QMJ5oklPPj7PkK5rk6OK9j4
7433A5k0J1kojOj0NrJ8k7K8Jj6mlnKkJ6krnJ0RMK1l1NK0k9J2J2RJ3k0qJ0J5k3
7473A0QknJ4nk1JJ1j6J0j3j1K3j7NK4l6oRmJ6j3RkmJ9j4%K1k3J8Mj9L5k6J6J4
7510C0pj4RJ3j2mj0J4pRlrj1j3J7Onj2oPlkJ8k7J3oj4J2J6pJ8mnj1RJ1noJJ0k
$$ y = [-2, 5, 4, -11, -17, -3, 8, -10, -14, -26, -2, 4, -24, -5, 3, -5, -10, -2, 2, -1, 6, 4, 6, 24, 39, 8, -5, 26, 26, 35, 6, 20, 15, 2, 13, 12, -4, -1, -11, -6, -16, -9, 9, -18, -30, -4, 1, -36, -24, -8, -10, -29, -14, -19, -10, -10, -4, -19, -17, -2, -2, -1, 6, -4, 11, -17, -6, 12, 9, 12, 8, 8, 13, 11, 10, 6, 10, 4, -5, 14, -10, 0, -12, -16, -12, -14, -35, -22, -14, -11, -30, -31, 4, -19, -15, -17, -13, -22, -11, -5, -23, -7, 5, -21, 7, 0, 7, 4, 19, 24, 5, 15, -7, 6, 20, 17, 5, -2, 4, 23, 1, -7, -14, -8, -15, -1, -3, -13, -8, -7, -19, -23, -8, -17, 0, -18, -31, -30, -15, -13, -10, -13, -5, 0, -8, 7, 16, -2, 15, 19, 4, 16, 5, -3, 30, 24, 8, 21, 34, 20, 19, -2, -3, 7, 16, -2, -26, -19, 1, -16, -35, -22, -11, 16, -22, -33, -5, -17, -5, -31, -10, -13, -3, -14, -6, -2, 13, 7, 5, 2, 9, 16, -1, 6, 4, 29, 20, -6, 0, 29, 15, -5, 6, 4, -2, -3, 3, -7, -2, -11, 7, -20, 8, 9, -7, -11, -14, -19, -17, -19, -3, -5, -14, -19, -9, 0, 4, 25, -6, -1, 19, -10, 2, 14, 23, 36, 16, 8, 18, 33, 10, 18, 16, 11, 25, 20, -1, 0, 11, -5, 5, -8, -19, 4, -13, -8, 16, -20, -26, -17, -21, -5, -18, -9, -11, -15, 4, -10, -10, 11, -12, 6, 10, -9, 26, 0, 16, 30, 23, 9, 18, 31, 19, 15, 5, 19, 12, 21, 18, 9, -2, -15, 2, 8, 3, -9, -15, -8, -11, -13, 5, -22, -9, -15, -29, -17, -1, -8, 10, 6, 1, -10, -1, 10, 5, -1, 0, 10, 8]
7551HmqJ2J9j3JMmMj4lj2J7%Nmj0Kj2jQJjrkPKqjJ7Jj3j2K8j3J7QkONrLLKqj5
7597BJ5K0j6rOJmj7JrJ9l0LkJ2LKkoRk8PKJ5J1nQk3NLJ0l%%j0kJ8nJ2jRMqoK6
7642C7j3Rk4K2pk5J7mj3JJ2k3kPRrj1J1Nk3J7%Mj1jQJ5nOqnK2k4K1l%Pj9J6J0
7682B6j6Oj0J0JmMJ6j6r%opK3j5j0pJ2oj1jJ7rj2J3J2kMmRj9NK6j1J2Oj1mQNO
7723C1k3J3K0j1k0RpJ3j7jJ3j2Qk6K8k3lQj0nJ5k6j0M1Jqkj9K4Pj2LKkJ1j0J2
7760A2NnNkMK1j5j4J1J0k7QORk0oKMjKj2oMK7l4KNOPnNj5Ok3L9j9nK2Rjj5MMJ3
7804B7j2LJJ4kq%pJ5pj8K1pj7J1kqm%jj0%llmrJ2Kj3J4qL2k1MpL4j5nPmjJ4j4
7847A%J2jkpK7nj6j7J0M%j3J0J4k0jMMj7Pk2J3Pj0Kj3K2j2PNJ9Mk1jJK9j6PpJ5
$$ y = [8, 4, -4, 8, 27, 14, 15, 19, 15, 19, 5, 2, -10, 7, 7, 12, 8, -2, 0, -12, -13, -5, -4, -5, -14, -16, -9, -7, -15, -16, 1, 2, -11, -23, 5, -8, 9, 17, 15, 21, 26, 17, 20, 23, 25, 17, 2, 17, 37, 21, 12, 18, 19, 15, -2, -1, -10, 9, -21, -18, -20, -8, -5, -3, -5, -11, -2, -30, -23, -21, -6, 5, 0, 8, -15, -10, -7, 3, 0, 0, 0, -10, -12, 6, 1, 13, 12, 21, 25, 17, 11, 37, 24, 33, 9, 31, 24, -1, 16, 12, -1, 0, 12, -11, -13, -6, 3, -6, -17, -6, -1, -24, -7, -7, -3, -14, -15, -7, 8, 3, 9, 1, -4, 18, -6, 15, 12, 12, 19, 0, 16, 26, 10, 16, 6, 16, 17, 13, 17, 33, 17, 8, 8, 2, -5, 18, 3, -7, -14, -2, -8, -19, -20, -3, -12, -24, -11, 1, -1, 3, -1, 8, -11, -6, 20, 9, 21, 27, 16, 12, 20, 25, 31, 8, 21, 41, 30, 10, 19, 12, 25, 8, 7, 20, 8, 16, -10, 18, -5, -8, 0, -10, -15, 0, -26, -36, 5, 6, -2, -4, -23, 1, 8, -4, -1, 1, -1, 10, 0, 12, 17, 12, 17, 15, 19, 40, 25, 11, 22, 32, 5, 13, 19, 28, 8, 2, 4, 8, 7, 9, -3, -9, -5, 22, -12, -10, -5, 1, 8, 3, 8, -7, -1, -24, 15, -4, -9, 13, 22, 21, 6, 10, 14, 27, 15, 18, 19, 33, 31, 23, 23, 16, 31, 24, 6, 27, 20, 3, 14, 12, 4, 0, 0, -1, -11, -11, -14, -17, -21, -30, -18, -16, -29, -15, -23, 9, -12, -8, -15, 19, 4, -1, 6, 2, 1, 15, 1, 1, 13, 12, 10, 3, 30, 25, 9, -8, 2, 6, 6, -7, 3, 17, -3, -4, 0, 4, -13, -6, -28, -15, -8, -18, -16, -29, -7, -19, -12, -7, 12, 16, -5, -6, -5, 24, 8, 15, 8, 23]
7888B3j0PPj2K8l0Nl%Kj9K1J1k5LkrjnJ0j3nK3j4k3K3pM%lK0j2kJ1LRJOj4RNp
7930A5%Lj5LJ0KkRj5K7j6kjLk9J5Qj2qj1J0Kj0oK6l3L3j9J1pP%loNJ5j9lJ9PR
7971B2lj2R%J0J0kpJl4L4JkRl0njmkPMoLj1j8RjkJ5JlqmJ5MqqJ9j1J2mJ3Mj4L4
8016C6k5mJ4qj4J8j3J2j1JkJ6l2J2%lJ0j5J3k4K5j3j8J5j2kJ5kj2J8j8K3j9K0
8050AJ3j3K4m5M2k3jK0lMkMQj0KmrJ6kj8Jpj5L5k8NQrKj8NkJ2pLloKlOPlj2J6
8094gpJ5qJ3JpJ8Lj2J5J7l4OJ0j5J3%k8lK7k3nLJLrJ6j9rPjj4J3NKqMK9k0K4j2
8135Dk2J1K8rk7M3k0lJ8j5PmjK0qrJ5j3kj8Qj9J5LlNk0J9k9J3Mr%J0Oj0mNjJ1
8175aj8K5j0NorK8J0j7j5J9J1Jmj4Q
$$ y = [23, 13, 20, 27, 15, 43, 13, 18, 15, 15, 17, -2, 19, 30, 5, 8, 6, -3, -4, -9, 1, -12, -17, 6, -8, -31, -8, -15, -11, -11, -14, 6, -6, -8, 3, 6, 15, 16, 22, 8, 17, 22, 15, 15, 18, 3, 6, 16, 18, 16, 25, 10, 37, 21, 19, 18, 21, -8, 7, 15, 3, -5, -16, -6, -4, -14, -20, 6, -27, 6, -13, -2, -9, -2, -2, -5, -11, -6, 9, -10, -13, 6, 13, 22, 19, 7, 16, 16, 26, 36, 34, 27, 28, -6, 28, 29, 27, 36, 6, 1, 0, -4, -6, 1, 5, -1, 2, -9, -27, -18, -19, -21, -6, -5, -8, -16, -20, -5, -1, -9, -17, 2, -9, 3, -1, 12, 16, 2, 36, 11, 7, 21, 13, -1, 17, 4, 16, 5, 6, 4, 20, -12, 0, 0, -3, 7, -8, 5, -19, 6, -7, -25, -10, -22, -24, -9, -11, -23, -5, -23, 0, -19, 1, 14, 1, 25, -20, 22, -1, -2, 18, 15, 19, 17, 21, 29, 19, 21, 17, 8, 24, 22, 4, 5, -2, -17, 18, -10, -5, 3, -6, -4, -22, -17, -19, -7, -14, -11, -14, -20, -18, -21, -15, -8, -11, -23, -7, -14, 1, -7, 6, 7, 0, 18, 21, 9, 24, 41, 7, 13, 23, 8, 21, 21, -7, -10, 17, -6, -11, -8, -7, -4, -13, 3, -16, -25, -18, -19, -33, -20, -15, -13, -21, -17, 12, -8, 16, 4, -18, -7, 21, 12, -15, 28, 8, 5, 23, 8, 15, 11, 10, 30, 22, 13, 28, 15, 13, -5, 3, -16, -1, 2, -1, 4, -16, 3, -26, -13, -9, -18, -18, -8, -2, -12, -16, -11, -12, -1, -19, 6, -4, 1, -5, -14, 14, 24, 7, -8, 11, 22, 23, 19, 5, 13]
8191A3
$$ Imaginary data points
##PAGE= N=2
##DATA TABLE= (X++(I..I)), XYDATA
0@%%%%%%%%%%%%%%%%%k4M8m8M8m8M8p2R6r6J20j44J45j69J93k17K64l03L28l62
36a93M10m62N33o01O62p34Q18r14J010j107J221j353J492j640J806j993K191k412
54a266K671k957L273l635M060m559N147n862O750p890R414j1562J4837k0518L3031
69B0934j07715Q0589K18674k14583j63205J31703J64878q8023j10115L947P2892
80I976N4678r047j24351l7492J65618R1789k00802j23958K05927J50580j99075
91a6157j53696J66953J46242j25936j19099P0701Q4511j5100l9356m2027n420
102d8384Q9887M9461j28867q4493J52580J09844j62015j20578J55599J18098j36167
113e035j01710J05385P4949o7648m0610K6376L749J3969L1601n0191o1195P9308
$$ y = [0, 0, 0, 0, 0, 0, 0, 0, 0, 0, 0, 0, 0, 0, 0, 0, 0, 0, -24, 24, -24, 24, -24, 24, -48, 48, -48, 72, -72, 73, -96, 97, -120, 144, -159, 169, -193, 217, -245, 288, -313, 349, -385, 433, -481, 529, -578, 643, -710, 782, -858, 948, -1045, 1146, -1266, 1405, -1552, 1721, -1914, 2146, -2413, 2734, -3128, 3622, -4268, 5146, -6416, 8421, -12097, 20934, -86781, -6192, 212482, -2101, -165306, -33603, 131275, 43252, -66863, -62916, 9976, 64654, 55607, -68744, -106236, 59382, 151171, -49631, -173589, 32338, 182918, -16157, -169853, -2900, 143342, 17406, -101693, -30992, 53519, 38419, -937, -42964, -48384, 41503, 90964, -37903, -122396, 30184, 140028, -21987, -142565, 13034, 131132, -5035, -106745, -1360, 73589, 5941, -34669, -8293, -4544, 9425, 41026, -9165, -70360, 8948]
125H948Q1540r9626r0738J09964Q7952j10661p4192J02576N1619q7383k3448O7008
137B3559o380m3561L3988J9370n5961M168O9783k5452p3653M3533O7502n7604
149g08n2195O7280K9923p2511l743P3350k3054p0109M6857O2837o4747n2040P4157
162A5297L7987p3927k1348O3831K858m4982J6481J9813l5477Q671N3210l7097
174E317o7835O1928P8121p9792q2735Q8495Q0954q6726p2386P4513N7263n3241
186C876l6591K5146J1917O247J4767l7637m1375O5336O5155q6143q3885R7501
198D314R5656r8187r8958Q8084R3242o8069p8668M0600N6353q392k8114k4884
210b7023l428N5833L5410q1037o4784R7791Q8394j04257j03930R9755J09441q4929
$$ y = [8948, 90488, -9138, -99876, 10088, 98040, -12621, -86813, 15763, 67382, -20001, -43449, 23559, 17179, -26382, 7606, 26976, -28985, -24817, 44966, 19514, -54139, -10606, 56896, -708, -52903, 14377, 44300, -28211, -31954, 41396, 18342, -51767, -4910, 57927, -6820, -58860, 15297, 53284, -20643, -41991, 21840, 24698, -20284, -3803, 16010, -19467, -10796, 42414, 5317, -62518, -590, 77531, -2261, -84996, 3499, 84453, -2273, -74659, -146, 57117, 3876, -32715, -7569, 4348, 10595, 25362, -12275, -53650, 11686, 76841, -9302, -93187, 4314, 99970, 1783, -97175, -9091, 84151, 16082, -62586, -21986, 34367, 25975, -2139, -27023, -30451, 25382, 60792, -20245, -85029, 12762, 101156, -3101, -107031, -7276, 102165, 17236]
222A7236j04243O1275Q8542l1515o3930j174L2806L3333J687o1730l5916Q3453
234A9824O6462r6330q9961R9413J04125r2543j07402P6817R9717n4046q1974K6713
246b9185N6244K208k5449k9909p231N3705L8299p1514o4758Q1739Q3832q3853
258D128r3793P7936R3881o5041q4213M6708O6216k4982m1790K161J3982J9653
270A4846J4315l8425m0079N2763O0649o1671p3857O4754P8424o2221p4234N4683
282a0053O1972m3361m3430K9363K0942j4196K638r24k4596J4837M2554k6759n4528
295d5541L5995N9463m2102n7048M5162M8008m5065l3715M2220J6250l6820K078
307a1115K9489j9064k0693L2659J0843m1488m52M4504j0111m1642K0153L3413
$$ y = [17236, -87007, -25732, 62810, 31295, -32635, -33809, -1003, 32330, 34017, -27713, -63629, 19824, 86286, -10044, -100005, -592, 103533, 10990, -96412, -19595, 80122, 26076, -55898, -29185, 27059, 29267, 3818, -26091, -33322, 20383, 58682, -12832, -77590, 4149, 87981, 4128, -89665, -11729, 82152, 17111, -67102, -20394, 45822, 20840, -20950, -18789, -4807, 14846, 29161, -9264, -49343, 3420, 64069, 2398, -71459, -6705, 71719, 9498, -64736, -10053, 51919, 8558, -34872, -5509, 15433, 1237, 3875, 2951, -21645, -6808, 35746, 8987, -45541, -9546, 49917, 7815, -49233, -4071, 43937, -1128, -34843, 7377, 23627, -13193, -11115, 18374, -690, -21383, 11276, 22119, -19369, -19821, 24683, 14572, -27070, -6917, 26496]
319B6496k9279k1163L6883O542m2495Q558M5518k2064m5501L2422M2159l8152
331g6l5329L8725K5208l3898j2363K4606k358j1941J7913k643l2785J6865M5846
344C7770k9285n5560L8143O0649m2332o0452M1165N4650l4921m3496K4222K7779
356A8332j0265q961n120j1260K0092L1419l3106m9093M2366O2802m6859p0840
368f0493M5907P2389l9631o7003K8673N5020j4415l7454j634J5896J7593P451
380B2299l1682l0708M2471N1192m8579o6893M9533P6036m5170p7654L6216P1478
392D8539k3571n8020Q810L8740O583j5619k0972q882L2907L2386m1320n2377M5336
405g460O6812m4852p4290L9919P4114l1326o6479J9962N2191p143l2961n785J0803
$$ y = [26496, -2783, -23946, 12937, 19479, -23016, -14458, 31060, 8996, -36505, -4083, 38076, -76, -35405, 3320, 28528, -5370, -17733, 6873, 4515, -7426, 10487, 7844, -24941, -8076, 37770, 8485, -47075, -8932, 51717, 9385, -51067, -9902, 44748, 9827, -33669, -9447, 18332, 8067, -894, -6014, -17274, 2818, 34237, 1131, -47962, -5596, 57206, 10347, -60493, -14586, 57803, 18172, -48831, -20158, 34862, 20447, -17007, -18641, -2745, 14848, 22299, -9383, -40091, 2380, 53572, 4993, -61900, -12367, 63669, 18499, -59155, -22939, 48539, 24968, -33052, -24242, 14498, 21081, 5462, -15510, -24392, 8515, 40901, -419, -52796, -7460, 59352, 14500, -59790, -19871, 54243, 22917, -43562, -23600, 28591, 21448, -11513, -17298, -6495]
418f495J7689J1828k7214l2869L3852N0070l6841o1723L6290O6828l2396o4898
430d5879K5832N6420j7427m2427Q104K4596J110m865r656j4419J6412L1575k1521
443G855m4655K4485N2362k5449n4179K4637N0092k2280m0816J8787K7691j4424
455D106j2390R710l452m578J7986o09k9453N500L7163j0187m0233J4360L8597
468B6520j7931l2760K0603K3613k2259j2542K2638Q73k1687R968J9207j8781j5225
481a7763K4696R788k7098l108K6038m387k1805J2271J5215j9840p164K6395j133
494A2105l1244Q668L3767j4579l3404J8083K9877j8937k3289J7109J4012j3080
506i12k829P426r573p62K1545n693l2118J1212M0230j5069m4696J6781M5037j6097
$$ y = [-6495, 11194, 23022, -4192, -37061, -3209, 46861, 10020, -51703, -15413, 51415, 19019, -45879, -20047, 36373, 18946, -23481, -15377, 9219, 10329, 5464, -4192, -18611, -2199, 29376, 7855, -36800, -12315, 40047, 14598, -39581, -14944, 35148, 12868, -27948, -9161, 18530, 4106, -8284, 1426, -2026, -6604, 11382, 10773, -18680, -13180, 23983, 13796, -26437, -12077, 26520, 8589, -24171, -3568, 20045, -2214, -14756, 7882, 8755, -12932, -2964, 16243, -2538, -17763, 6933, 16721, -10377, -13485, 12553, 8166, -13639, -1368, 13847, -5993, -13157, 13238, 12105, -19139, -10471, 23296, 8717, -24687, -6604, 23273, 4336, -18953, -1844, 12168, -912, -3741, 3685, -5888, -6650, 14895, 9202, -22916, -11704, 28526, 13457, -31239, -14458, 30579, 14482]
520A4482m0909J3179L2613q373k0860K373O621M118Q727j0143k3657J4866L6698
533B9735j7847m6492J8470N1884j6808n2239J2927M7439p439l7794R65K4325N605
546A2731q173j1634q713J6157K5051j8825l8942J9450M8923j7816n3985J4313
558b1463N3588r401m7772L615L7066K367k2796p869O253J2433J0627j5471k6402
571b5225J6843L9343j6490m8137J4459N1992j1083n0525O801M4017k053l3129
583a3187k583J9251O749l787r827j1684J1644K5535j2217l6476J1579M3344r957
596A8384m5622P623M3117m965l6399K387K6207m0j3937j804P79L058J1891l779
610F900k2602M089L0585m305l4917M467L5535m738l2454N153K6261n694j7847
$$ y = [14482, -26427, -13248, 19365, 10992, -9868, -7495, -874, 3244, 11971, 1828, -21829, -6963, 29735, 11888, -34604, -16134, 35750, 18942, -33297, -20370, 27069, 19630, -18164, -17199, 7126, 12731, 4558, -7076, -15789, 368, 25419, 6594, -32348, -12898, 36025, 18209, -35776, -21463, 32125, 22724, -25048, -21433, 15633, 18000, -4796, -12665, -6412, 6021, 16648, 1177, -25225, -8382, 30961, 14471, -33666, -19207, 32785, 21702, -28823, -22022, 21995, 19942, -13187, -15770, 3481, 10230, 6443, -3384, -15068, -3424, 22111, 9894, -26582, -15003, 28341, 18384, -27238, -19615, 23502, 18537, -17862, -15475, 10732, 10692, -3245, -5049, -4270, -1212, 10679, 6900, -15702, -11613, 18972, 14667, -20250, -15783, 19752, 15014, -17440, -12287, 13974, 8280, -9567]
623i567O251Q093o703J987O645j1175o010J8439M623k3259k541K5391k66k4727
637a2819L616K1548p168j6464J0653J0167j3608l256J5580l217j6178Q680J5132
650A2666j2480j2545J4538Q477j4896l034J3464l269j0820R809P306j5859l494
663a0137K0584l9k3611K926K4428m967k2731O057J8594o146j2258N425M310m112
677a677M673K457j3516p72K1257n49k7230J412L0636j665l1008J291K8196m85
691A3020k2388p19J4144J930m223k927o481L447J6616l323k5198K560L1450j235
705A6673l4484n20L4111K400l0146m209K3184N592j3812o423L058O417Q088n626
719D303j8282M030K6573j956l2215m86L4601K832l3427m944K8908O468k1473p283
$$ y = [-9567, -3316, 4777, -1926, 61, 6706, -4469, -10479, 7960, 12583, -10676, -13217, 12174, 11908, -12819, -9203, 12345, 5177, -11287, -634, 9533, -4075, -7331, 8249, 5032, -11146, -2466, 12666, 186, -12359, 2179, 10656, -4240, -7274, 6190, 2921, -7899, 1910, 9216, -6643, -10137, 10447, 10408, -13203, -10277, 14151, 9184, -13547, -7490, 11104, 4958, -7300, -1875, 2435, -1677, 2996, 5453, -8063, -8835, 12422, 11873, -15357, -13945, 16691, 15026, -15982, -14691, 13505, 13020, -9368, -10087, 4057, 5987, 1764, -1163, -7644, -4197, 12419, 9096, -16102, -13542, 17908, 16673, -17811, -18331, 15780, 18180, -11966, -16175, 7009, 12601, -1211, -7634, -4576, 1841, 9929, 4303, -13979, -9949, 16624, 14668, -17547, -18033, 16568, 19400, -14027, -18971, 9937, 16405, -5068, -12351]
733a2351J2006P317j418o400r313M811J8845k586k6317J35L1107K282l2664m381
747a8927L0923N847k6083o636J8817O568r956n612J83L962R206j833j7247m56
761a1244K3193K624k6641m304K7314N283k5182n456K0769M799j4552l398P274
774D79J413M30Q23p675k925J3690M545j7953n565K0266N667k0542m902J8861L259
789I871j5505j058J0933j587n573M233M4o407N038P884r194q368J2203P735j3740
804c491n988J3921L276j2790O7J0649l716p813P183M595r991j424J1743j463j2239
819g481L826J1267n599q873O647N312p099r10P020l857o486Q432N700j2215m743
834i059J4857L693j5942k555J5270J457j2887l42Q948p28l893J841j897k947P666
$$ y = [-12351, -345, 6972, 5554, -846, -10159, -5348, 13497, 10911, -15406, -15271, 15836, 18118, -14546, -18927, 11996, 17843, -8240, -14876, 3941, 10509, 553, -5059, -4876, -914, 8292, 6459, -10788, -11244, 11949, 14573, -12068, -16372, 10942, 16225, -8957, -14413, 6356, 11155, -3397, -6795, 479, 1892, 2322, 3145, -4530, -7455, 6235, 10780, -7173, -12738, 7528, 13195, -7347, -12249, 6612, 9871, -5634, -6692, 4241, 2654, -2919, 1314, 1358, -5049, -11, 7873, -1321, -9689, 2514, 10249, -3491, -9479, 4442, 7718, -5072, -5005, 5644, 1928, -5885, 1298, 5893, -4098, -5522, 6221, 4758, -7481, -3655, 7612, 2013, -6860, -213, 5099, -2000, -2910, 4110, 253, -6233, 2199, 7899, -4316, -9059, 5798, 9491, -6451, -9006, 6264, 7721, -5166, -5508, 3440, 2712, -1181, 660, -1237, -4184, 3482]
849C482L932j2740m857J6559N522j8666n975J8913O058j7134n694J3522M821q324
863e81l390K153J510M386O59j0445k952J5409N069j8655o995K0128Q244j9437
877d897q862J6763Q557j2350p473O683N519l23k887o059j52J1810L226j6207o019
892a2671J8898Q331j9745r761J8563J0294j5558r767J1060Q180n437n685p02K544
906a456O670Q68j1831m223J5662O975j7748r096J8076J0151j6613j0083J3554
919I06Q955r315o740M267L834R85m58n917k867J0013N858j2899q064J4394R272
934A2224j4417r472J3140Q591j0758o690P443M053l693r50k51k191L867M963o852
949i93p128R072Q371j0320q565J0572P741r923n895Q442L410o404m47M006k560
$$ y = [3482, 7414, -5326, -10183, 6376, 11898, -6768, -12743, 6170, 12228, -4906, -10600, 2922, 7743, -581, -3971, -1818, -308, 4078, 4737, -5708, -8660, 6749, 11818, -6837, -13832, 6296, 14540, -4897, -13759, 3004, 11561, -789, -8262, -1579, 3940, 3617, 730, -5329, -5481, 6329, 9555, -6652, -12671, 6227, 14558, -5187, -14948, 3615, 13909, -1649, -11416, -356, 7824, 2387, -3298, -4000, -1456, 5214, 6082, -5749, -9972, 5690, 12665, -5083, -14179, 3897, 14048, -2565, -12648, 906, 9861, 546, -6194, -1927, 1907, 2892, 2434, -3483, -6350, 3663, 9521, -3378, -11442, 2952, 12224, -2193, -11665, 1475, 10066, -692, -7382, 61, 4114, 421, -529, -780, -2971, 896, 5859, -993, -8121, 951, 9322, -998, -9563, 1009, 8750, -1173, -7068, 1374, 4784, -1620, -2067, 1939, -621]
964f21j440N193r97p168L138Q183m822q208N993P155o670n166O840K498o563M94
980b161N894l445m915N967L756p763k448Q605J090q390L62P121j749m983L106
995D7K194m333R66N279m039o000O644O383q540o364R470N817r266m846P962L407
1011D781n699j581K731n20O19K771l964m883O932O714r138q011J0341Q667j0377
1026f17q528R240P581p079n839M124L413o95n93k818k442O001N297q507p759J0067
1042H46R527j0548j0403R903J0296q210r155N671P107k538m273q46R90M085K486
1057D938o852n757Q897Q449r942j0336R947J1208q988j0913P106R470m558p077
1071d408J615L884J430l13m178l304O424O520p928r009Q587J0539q374j0923P417
$$ y = [-621, -2061, 3132, 2135, -5033, -1895, 6288, 1466, -6742, -749, 6406, -264, -5430, 1410, 3908, -2655, -2161, 3733, 288, -4627, 1340, 5096, -2667, -5115, 3490, 4580, -3810, -3448, 3673, 1924, -3059, 47, 2241, -2092, -1126, 4153, 114, -5886, 758, 7141, -1399, -7763, 1707, 7524, -1742, -6588, 1374, 4781, -918, -2499, 232, -288, 331, 3102, -862, -5745, 1187, 7901, -1237, -9248, 1093, 9760, -617, -9145, 95, 7676, 597, -5242, -1118, 2295, 1600, 1007, -1811, -4253, 1748, 7045, -1462, -9221, 846, 10373, -175, -10578, -675, 9621, 1411, -7744, -2073, 5034, 2496, -1777, -2623, -1633, 2452, 4938, -1914, -7671, 1226, 9675, -267, -10603, -656, 10552, 1564, -9349, -2243, 7227, 2669, -4408, -2793, 1091, 2521, 2208, -1970, -5274, 1150, 7670, -258, -9267, -680, 9859, 1485, -9438, -2021]
1086b021J0103n740q232L630N537j319k280r97j151L061M338m711p007N791Q879
1101G881o333r728O256R500n619q305M578O278l268l606J778O48k76K345j134
1116I95m915K331O867l241p971L824Q153m123p421M154N832l942l676L533J142
1131A542k959J431K254l737j433N464N55o506L97O700j356o064K284M801l139
1146B34k960L850Q55m394J317M613l129m580M529M171n338l368N382K290m843
1161a371q82L668p41k083K379L11m025J509N361l040o315M178O739m743o560M748
1177h67N739m105m314K997K363j494o2j64k367J769M676l173o609M144P944m612
1193A865q529M496Q293l877p189K758N350j369k859k26Q2J741K823l032n492L976
$$ y = [-2021, 8082, 2342, -5890, -2260, 3277, 1958, -322, -1319, -2470, 591, 4929, 218, -6789, -998, 7881, 1548, -8180, -1924, 7576, 1957, -6348, -1770, 4508, 1240, -2366, -588, 60, -216, 2129, 995, -3920, -1589, 5278, 2037, -5934, -2110, 6043, 1920, -5501, -1347, 4485, 543, -3133, 400, 1542, -1417, 14, 2268, -1469, -2902, 2562, 3117, -3389, -2992, 3708, 2352, -3712, -1428, 3373, 234, -2726, 1124, 1979, -2415, -1098, 3515, 386, -4194, 335, 4506, -832, -4200, 1182, 3472, -1371, -2253, 1415, 674, -1409, 970, 1281, -2744, -1235, 4126, 1086, -5229, -1051, 5688, 945, -5615, -867, 4872, 767, -3547, -550, 1813, 319, 257, 93, -2274, -505, 4171, 998, -5611, -1467, 6477, 1865, -6664, -2168, 6125, 2248, -4941, -2183, 3167, 1798, -1061, -1287, -1205, 536, 3359, 327, -5165, -1189]
1209a189P613m406r030M336R590l793r181K799P900j548n764J05L019J269Q6k492
1225f86l156L372N905l878q043L937R367l539r772K867R089j867p500P73N142
1240B011L56k256j350q48K162L791k685o282K866Q097k785r045K475Q969j920
1255C556q055J281O281n68l940j13J242O44J538j088m025J370O037j477p343J466
1271c194P882j356p556J185O498j030m776Q60K647p50l11O29j926n61L879M15
1287B535n307k59O080ro172L65N574p66m456J305K875j759j129K180o25k460K229
1304B01K544l457k329M211J844m419j139M176J48l441R32K369k015j184L035o3
1320A413l855J205M294k057m366K602L967k755l180K600J979k102m96J431j134
$$ y = [-1189, 6424, 2018, -7012, -2676, 6914, 3121, -6060, -3261, 4639, 3091, -2673, -2568, 451, 1720, 1806, -686, -3842, -470, 5435, 1557, -6486, -2549, 6818, 3279, -6493, -3626, 5463, 3596, -3904, -3131, 2011, 2367, 111, -1239, -2087, 75, 3866, 1181, -5101, -2235, 5862, 3077, -5968, -3493, 5476, 3556, -4499, -3218, 3063, 2495, -1445, -1558, -316, 328, 1866, 778, -3247, -1877, 4160, 2683, -4660, -3194, 4688, 3332, -4224, -3039, 3459, 2429, -2347, -1487, 1160, 410, 99, 728, -1198, -1759, 2120, 2535, -2772, -3031, 3049, 3040, -3132, -2767, 2807, 2041, -2415, -1110, 1765, 6, -1123, 1057, 432, -2028, 201, 2745, -712, -3041, 1170, 3014, -1405, -2544, 1632, 1780, -1661, -729, 1640, -375, -1559, 1476, 1413, -2442, -1237, 3057, 1000, -3366, -764, 3203, 448, -2732, -132, 1847, -255, -751, 680, -454]
1335d54o80K812j32m218P96N279j277n811J511N770j503n152J280L933r03k245
1351i94M20K58N7J820m88l805Q42N417r85o516R70O983p94o692M59N726n3m141
1369a516l66K099P37J77j003k479J119M541j071o176Q56P153m75p447N2O929M36
1386C566n754q53L954J163j747j300o06J259K926j037m895O82O334k55p059k53
1402c875P135O72o408j028N038J213l217j208J050J048J175p65l229L74M867J01
1418B943o035m82O501Q22o335r92N501J079m169r55K444O83m94l09j389j38L080
1435A755N41m347r14N130J162n363j245N023J146m241q13K999L65j584J97J14
1451g5q33J328J341k481j729L341J885l773j790L797J461l464q63K793J13j877
$$ y = [-454, -1134, 1678, 1546, -2672, -1876, 3403, 2126, -3685, -2174, 3596, 2093, -3059, -1779, 2154, 1251, -994, -574, -316, -259, 1561, 1073, -2732, -1890, 3527, 2542, -3974, -3004, 3979, 3185, -3507, -3048, 2678, 2625, -1516, -1882, 217, 954, 1131, 128, -2351, -1232, 3309, 2238, -3938, -3082, 4071, 3596, -3851, -3799, 3130, 3566, -2188, -3041, 913, 2076, 329, -971, -1577, -318, 2608, 1571, -3324, -2642, 3692, 3437, -3622, -3875, 3260, 3932, -2476, -3504, 1534, 2747, -470, -1678, -628, 420, 1595, 830, -2399, -2025, 2842, 2943, -3092, -3574, 2927, 3749, -2586, -3578, 1923, 3002, -1167, -2122, 322, 1005, 511, 202, -1187, -1325, 1755, 2296, -2051, -2965, 2165, 3327, -2036, -3281, 1742, 2888, -1353, -2166, 833, 1198, -386, -189, -75, -908, 420, 1761, -720, -2449, 892, 2777, -996, -2786, 1011, 2472, -992, -1855, 938, 1051, -826]
1467h26O98R16j543O1K205r54k639J659K748k112k572K321K039k254j253J989
1483D83K82j601Q54J060j901n20K820K9l441L86L682o47l518P72K959q16k030
1500a147P60Q70p16M55O45j814n62K973N02l866m89M361M73m332n07L899M80k957
1518i72m38J705L01k06j18j303j04K729L96l875p09M624R98m931j199M651J340
1535B889l917j375K763J213j277r11l63M98J926J8l305n69M328J108m878j560
1551c412M940J877m456j984L514J887k218j557O95J037Q64l78k275l52L427J060
1567B669m222j659M530K102m421k283L820K233k851j915J605J383k27p04j092
1582a032q5K290Q28l177j532L761K037l935k315L724K299l119k005K201J496j117
$$ y = [-826, -128, 788, -755, -694, 1511, 557, -2082, -423, 2325, 213, -2359, -38, 2001, -253, -1506, 483, 765, -836, 18, 1078, -823, -1343, 1477, 1506, -1935, -1549, 2133, 1486, -2032, -1260, 1699, 883, -1147, -387, 483, -233, 222, 867, -947, -1509, 1464, 1966, -1900, -2389, 1972, 2445, -1887, -2394, 1505, 1985, -972, -1410, 295, 596, 390, 272, -1031, -1135, 1594, 1990, -1885, -2594, 2030, 3028, -1903, -3102, 1549, 2889, -1028, -2403, 360, 1573, 296, -615, -978, -480, 1446, 1464, -1841, -2410, 1918, 3026, -1852, -3412, 1528, 3405, -1051, -3035, 479, 2366, 148, -1409, -714, 323, 1187, 809, -1466, -1818, 1609, 2669, -1553, -3212, 1318, 3420, -1001, -3284, 536, 2769, -82, -1997, -392, 991, 764, 60, -1032, -1117, 1173, 2001, -1176, -2708, 1053, 3090, -845, -3160, 564, 2863, -256, -2261, -60, 1436, 319]
1598C19q27KM0J004Q02j915j468K512K033k899k286K903K298k648k007K162J500
1615A525j484q12P64j3l6Q36o19j563J167K062j530k340J739K271j730k006J635
1632a34J427j374o92J029j22o90R69L36j685pK197k80k414M94K372o51k015P44
1650d96J421p59o76Q08j98q41J063Q33j791q23K334P53k588o85K519N54k142l84
1668a098J526J30p14J72j73n50J068Q96j808j194K383J427k661j589K683J563
1684B061k313j457J739J150r79o69O2R8Q61M99j698j079K329J617k735j973K781
1701B94K180k560k149K017J926j299j426M14P90M83m2j292p37J974J468k425k066
1718b450K592K455k474k616K117K443j476k069P40J439O0o59p95k09J433J044
$$ y = [319, -508, -506, -466, 538, 1340, -575, -2043, 469, 2502, -397, -2683, 220, 2518, -130, -2137, 25, 1525, 41, -771, -7, -20, -56, 780, 161, -1402, -235, 1827, 297, -2043, -304, 1967, 237, -1769, -134, 1293, -81, -773, 256, 134, -556, 413, 749, -936, -943, 1254, 974, -1440, -946, 1426, 775, -1240, -496, 925, 166, -510, 298, 100, -741, 322, 1155, -636, -1459, 875, 1628, -960, -1645, 874, 1428, -714, -1098, 428, 558, -156, 16, -157, -707, 361, 1257, -551, -1745, 638, 2065, -596, -2185, 498, 2061, -252, -1709, 30, 1180, 201, -468, -406, -308, 553, 1052, -646, -1725, 604, 2221, -514, -2487, 294, 2474, -86, -2235, -218, 1708, 409, -1017, -603, 187, 670, 628, -664, -1401, 573, 2041, -384, -2450, 142, 2597, 123, -2493, -376, 2067, 591, -1478, -738, 701, 761, 102, -693, -902, 531, 1575]
1734A575j903j787K170K349k197k637J973K713j604k426J048J892m27j122k44
1749f27L10P76N81j266j384J551K037j686k445J618K599j405k459J054K045o37
1765F62j404K10O08J98K27n11j015P55J699r29k119R70K330r02k255P56J955n98
1783F37j456M14P94k70n0J36o68m5J288o5j735J32J968j80j947K13J745k99j328
1802g16L60P93m58j42N65n08n80R81O71j416o59J634O02j651m47J432K51j085
1820c73K8N98l43p9O82m26r90Q63J237j187j379J347J374j316j241J138R51p95
1838H9n67M04O3M4M69m57r94P96J434j033j764J135J947j124j899R43J638o20
1856E04j216K30O78J28L4m90p28P70J371r67j883J035K221r57k317P69K155m82
$$ y = [1575, -328, -2115, 55, 2404, 207, -2430, -457, 2256, 652, -1774, -726, 1166, 739, -383, -627, -317, 459, 1040, -226, -1610, -59, 1978, 292, -2153, -535, 2064, 659, -1800, -746, 1299, 662, -742, -532, 76, 274, 501, -10, -1025, -270, 1429, 500, -1619, -649, 1681, 779, -1476, -720, 1235, 637, -819, -405, 389, 119, 69, 205, -463, -508, 780, 715, -1020, -888, 1080, 900, -1047, -834, 911, 612, -716, -356, 437, -21, -163, 402, -106, -686, 295, 966, -450, -1109, 525, 1127, -524, -971, 461, 712, -373, -345, 253, -90, -169, 513, 87, -903, -40, 1197, 10, -1369, -22, 1352, 36, -1205, -67, 884, 89, -478, -74, -11, 33, 502, 45, -949, -153, 1281, 248, -1516, -381, 1566, 442, -1457, -514, 1124, 504, -712, -482, 196, 324, 358, -132, -860, -90, 1281, 314, -1569, -534, 1687, 730, -1587, -818, 1337, 855]
1874H55j770J48J178J82m50n02l12O87J069q17j723Q33K222p75k467O11K468l66
1892A071k194O3J723K02j032m12K49N74N61o54j283O44J881n76k285M42K436k38
1910A172k341J3J982J77j428l26P42L87N4m33p70L57J439k86j907J56K166mk208
1929a058r4J969K00j532k54R97K13l39j28l43K7R39J09j413k29J673L40j806l65
1948a094J722L37j445k42J054Q3n70Q6M6k73M25M86q49o35J156O93j296p05J317
1967B96O00j155m12R27J05n75K02K02n38J58Q02m47j012O62J145q08j106Q19R63
1986H28p48o64N89K68l76J61J61o02M2J036k13j352L13J509l52j543L57J372k97
2005D89j040J65O22q1p4k0m85R0R95q5j463J00J753n0j853j0J752Q3j439j78R65
$$ y = [855, -915, -767, 411, 593, 143, -359, -671, 16, 1085, 268, -1455, -622, 1600, 825, -1642, -1031, 1437, 1071, -1123, -1060, 663, 865, -167, -579, -330, 244, 805, 151, -1132, -488, 1393, 817, -1468, -1026, 1410, 1172, -1169, -1156, 826, 1003, -425, -751, -9, 378, 432, -1, -771, -414, 1025, 739, -1168, -1012, 1154, 1150, -1058, -1152, 817, 1017, -515, -769, 228, 441, 102, -26, -369, -342, 597, 706, -707, -936, 737, 1077, -729, -1094, 628, 965, -480, -722, 332, 415, -155, -69, -23, -296, 129, 615, -234, -869, 287, 980, -316, -1021, 296, 896, -259, -671, 256, 361, -214, -12, 190, -348, -190, 612, 165, -847, -185, 960, 152, -954, -135, 828, 80, -584, 5, 273, -103, 58, 219, -383, -341, 695, 482, -870, -557, 952, 600, -943, -586, 786, 489, -551, -386, 236, 155, 81, 61, -424, -334, 661, 576, -887, -787, 966, 916, -937, -947, 805, 888, -551, -729, 236]
2026B36K61m01k65k35K31Q51j39j379QJ768J41j999k62J978L74j751m83J337N23
2045G94p64n01J25L79N44k12j146QJ616K21j930m10K028N60j896o74J605P14j139
2064g8o40N23N20R3l04o89K1J221K48j626m81J815O92j826q09J664Q18j298p55
2083h91Q08N85k65l23k89jQ24L11j212n79J467P67j559q71J473Q98j269p83R13
2102DN87n02l20R6o5L70L45o87o40R47Q61j098r50J114R50j024q31Q60N97o07
2122Gk81L17q9l2M60k42p65M38R74n48j112O17J071o06r20N39O42m20k62L04j70
2143g8j87N79Q9r43K5J178q9j246P9J231j21j029J39P12j52k60J41j93j72O30
2163C33J94j012k29J270K92j405l43J396L44j203l25Q69K46m24j54n7J0N51J73
$$ y = [236, 497, 96, -169, -404, -173, 678, 539, -840, -832, 936, 1077, -922, -1184, 794, 1168, -583, -1066, 271, 794, 30, -471, -346, 33, 577, 365, -781, -773, 843, 1064, -866, -1276, 752, 1312, -584, -1258, 347, 1061, -78, -718, -195, 325, 418, 114, -575, -554, 667, 915, -711, -1192, 623, 1315, -511, -1320, 344, 1162, -136, -891, -83, 502, 237, -86, -375, -376, 448, 759, -453, -1032, 435, 1202, -357, -1228, 245, 1143, -126, -909, 4, 591, 89, -231, -135, -200, 170, 515, -172, -812, 135, 996, -102, -1052, 62, 1012, -12, -843, 17, 614, 7, -274, 43, -46, -78, 382, 140, -625, -187, 787, 239, -873, -256, 815, 209, -711, -172, 470, 50, -212, 92, -78, -265, 314, 403, -540, -515, 663, 574, -672, -593, 638, 517, -512, -373, 339, 187, -73, 68, -125, -297, 333, 527, -485, -714, 556, 848, -557, -900, 496, 840, -363, -688, 181, 427, 3, -151, -208, -198, 353, 526]
2182E26r83l51J322M84j484o47J519P13j330p41J035O53o02m97J13K80L80Pq77
2201d80k84J241N65j498p73J565R44j474r70J167R57q14p72L34N22J68k03o29
2219d34j47J009N10j315q04J461J000j426j140J265J131r38r99N18P72j11m05
2236e3l10j0P06M12j024p35J171J025j211j183J114J228r26j110O42Q41k73n36
2254b32m9J13L77L00o29o90Q05R98r05j159Q83J180p60j114O10Q98m00n45J57
2273a62J52N5K63k74n90L93R22n04j085N13J153m78j103M19Q77k95n78J87J92
2292E7j21K50L2o08LR20n7j084M5J137j9j072M4Q33l3n31P9J47j19K56J76o40
2314c05k33R04L31j100l63J134L90j059l44Q13L12n44j69J66j8K61J79o45l26
$$ y = [526, -457, -808, 514, 998, -486, -1133, 386, 1099, -231, -972, 63, 716, 114, -383, -270, 10, 390, 397, -480, -764, 477, 1042, -456, -1229, 336, 1280, -194, -1164, 3, 960, 146, -626, -292, 230, 398, 195, -434, -581, 428, 938, -377, -1181, 280, 1280, -146, -1286, -21, 1110, 172, -827, -309, 463, 352, -53, -363, -373, 333, 745, -279, -1014, 157, 1182, -29, -1212, -98, 1130, 204, -906, -264, 577, 304, -232, -281, -168, 209, 509, -120, -810, -5, 993, 88, -1071, -188, 992, 232, -882, -272, 626, 226, -319, -162, -10, 45, 308, 34, -556, -163, 759, 255, -830, -317, 836, 358, -745, -326, 551, 256, -322, -135, 57, -64, 186, 218, -390, -387, 533, 476, -608, -563, 574, 555, -517, -473, 360, 327, -204, -125, 22, -97, 159, 335, -305, -538, 366, 697, -403, -766, 368, 758, -301, -645, 168, 480, -64, -233, -67, -85, 176, 355, -290, -616]
2333f16R00N37j098o67J179P08j053p51Q65O44n24n07J49K84K31%n81l23R03N95
2353H75j073q54J147J020j104j046Q81R94n94q10K25N52J54k16m81j86P94N36
2371H14j000q42J090J070j049j203Q89J212o58j054L32P93K2m59l40M2O10L81
2389F50q36p63R71J054r40j254Q40J279o26j203L70R68p1o34j91K29M15K36n93
2408i9o46P02R63p12j200O50J294n19j234L25J031j11p38p4L34K44R7l72m82M24
2428a23Q35m40j072L88J205l07j199K01J041r0p50l9M02J06Kj56l83J56P56j47
2448C86r84J01J099k8j096oR36P4p08r8L82O3K4m7l60n0O50J73q91k68R88L42
2470F82r88l55Q58L33o12l01L17J77K9ol43j82O55L23q38m62R05N81r00o37P89
$$ y = [-616, 284, 821, -277, -944, 235, 943, -110, -861, 4, 648, 124, -383, -234, 50, 281, 281, -300, -623, 280, 875, -198, -1052, 95, 1115, 11, -1035, -154, 840, 246, -564, -339, 213, 367, 151, -330, -516, 278, 814, -186, -1028, 62, 1132, 83, -1120, -231, 981, 323, -731, -399, 394, 416, -43, -383, -341, 269, 650, -186, -949, 22, 1076, 136, -1118, -278, 1001, 375, -828, -458, 510, 439, -195, -386, -157, 258, 494, -99, -745, -43, 920, 208, -992, -342, 952, 433, -801, -476, 555, 444, -294, -368, -34, 210, 307, -65, -547, -123, 712, 272, -800, -412, 793, 486, -713, -512, 529, 439, -311, -350, 52, 158, 160, 4, -379, -223, 533, 386, -598, -497, 602, 574, -522, -528, 408, 482, -226, -324, 58, 121, 145, 98, -262, -312, 338, 511, -380, -648, 340, 682, -306, -661, 197, 530, -82, -383, -66, 111, 140, 134, -209, -391, 264, 587, -251, -713, 192, 773, -127, -764, 25]
2491B5O12n53n07K73L24M7r4l63j64O31M17p97o46Q68Q23q61q91O97Q93m94p75
2512e35K36N54O6k79l53p3O22L78p56o94Q46Q97p70j080O81J099m79r71J93P90
2532C72O8n14k94J19N21K57o53o32P39R04p26j092N91J198m30j130K09R55J8o40
2552a60k65K76M48J25n47n30O14Q61o03j091N03J189l28j202J59J022O8p54k34
2571d49L94L81k2m45l73M77O87l97r73L09J110j70j152O5J005J02p92k16M88K74
2591C03j20l10k56K89N82k24q34J17J004k9j018r9R49J84p52k52M91K52j50k29
2611a02j84J52N08n6p36n2Q61J93r05l00Q50L57o53l77M10L09j07k17j76N9M37
2632B71R2o30k64P72L94p94n20P33N39n54n39L52M24r8k67j45N5L93J63n64l72
$$ y = [25, 637, 84, -423, -150, 174, 221, 127, -236, -400, 231, 648, -149, -795, 73, 896, 35, -856, -159, 734, 240, -535, -299, 255, 321, 42, -311, -384, 238, 616, -140, -834, 12, 909, 139, -941, -260, 839, 360, -611, -418, 372, 440, -74, -368, -249, 272, 529, -124, -756, -17, 887, 161, -931, -340, 858, 428, -702, -493, 462, 480, -160, -425, -149, 299, 424, -123, -653, -39, 822, 219, -872, -369, 820, 492, -710, -551, 471, 539, -215, -449, -55, 326, 304, -141, -514, -37, 650, 253, -720, -411, 699, 529, -623, -558, 447, 549, -243, -459, 29, 303, 183, -127, -383, -94, 488, 264, -570, -453, 551, 522, -496, -595, 354, 538, -214, -466, 25, 277, 127, -102, -286, -134, 374, 318, -418, -470, 391, 584, -321, -621, 229, 586, -67, -444, -34, 275, 168, -49, -225, -166, 271, 363, -267, -531, 241, 635, -159, -679, 54, 593, 39, -500, -148, 276, 178, -89, -234, -179, 214, 377, -187, -559]
2653e59O56N81o87p00O23P24m47p01K47N73rl65k31R7M33J70n66m27O17O79o20
2674H8q18N07Q86l43q52J47P20N8n08k38J98M21R1n21m19N82O91n65q61M58R59
2695F81k73r85J18Q52Q0o20k77L36M02kn02l10M99O46m82q49L73R74k14j013M7
2716e19R02J65p46k66M21M03r4m60k55M67N45l90p91K72R27j05j001k5Q95J94
2736E39p21l22M71M09j74m03j60L71M46k83o66J51Q24oq86j37Q62K43p12l48M94
2757hL81k18l81m9K87L53j88n94O8P15J13p82k61P74L10o13m08M40M17j90l70
2778b04n1K47L14r0n24p4O38K58o85l81O31M79n49m66L14M85j43l77p2K26K60
2799B36l3m27j60N38L28n69m84N44N66m22o01K80N06n3m04j33K31K90l2l96k10
$$ y = [-559, 97, 678, -9, -709, -86, 638, 191, -510, -263, 310, 301, -64, -295, -198, 235, 405, -161, -588, 29, 708, 88, -730, -223, 663, 320, -532, -385, 335, 393, -115, -353, -155, 266, 357, -164, -583, -1, 690, 125, -736, -278, 681, 408, -577, -459, 393, 473, -147, -424, -88, 314, 312, -190, -500, -1, 645, 163, -686, -313, 661, 447, -566, -519, 383, 548, -198, -464, -43, 360, 266, -194, -449, 18, 563, 173, -618, -346, 581, 476, -525, -550, 345, 539, -182, -504, -33, 376, 202, -201, -361, 10, 456, 173, -493, -342, 482, 476, -410, -547, 315, 558, -154, -502, -8, 373, 155, -226, -275, 12, 365, 177, -417, -349, 366, 479, -303, -564, 210, 520, -93, -501, -61, 356, 166, -204, -255, -8, 306, 216, -308, -382, 256, 514, -171, -552, 79, 558, 9, -457, -143, 342, 199, -178, -250, -24, 236, 203, -224, -384, 154, 482, -87, -571, -27, 539, 117, -484, -204, 302, 249, -155, -288, -57, 233, 201, -195, -405]
2820d05M94M17n07n62M25O65k91o94J41O34K6m93j80K73L32rm35k20M72M11m29
2841F5o18L57P33k34p55P3P04P9n61k20L22L75j11m26j44M09M17l68o12K91P25
2862E01j49p84MP30J62o14k78L91L92j48m09j17L99L74l49n79K03P40q5p84p3
2883d73P64K12o42l14M32L93j95m26o3L90L04k79n23J73O50k6p19j24P09K51o04
2904a10l49M19M05k09m02k6L55K44k47m40J38N64K6o40j86O43K98n51l70L84M18
2925C64j82m28j9L50K06k01l85O3M72J29n69k72N51L75m46m42L16M64j48m20k9
2946b51L03K11j72l48j8M72J67m84l17M59M34l68m93K44M75p8m19p1K97K34j74
2967A03l40NL85K00m02l77L73M79k74n55J60N31km61j29L16K58j49l37m4L70K40
$$ y = [-405, 89, 506, -1, -563, -138, 527, 236, -458, -317, 317, 343, -150, -330, -57, 275, 266, -169, -389, 83, 494, 65, -553, -196, 537, 303, -452, -379, 325, 404, -157, -377, -55, 320, 209, -217, -361, 48, 465, 97, -515, -224, 501, 352, -432, -428, 302, 464, -150, -428, -37, 355, 207, -202, -319, 80, 454, 105, -474, -271, 469, 384, -400, -473, 291, 503, -139, -453, -21, 372, 177, -249, -312, 78, 382, 103, -420, -247, 403, 377, -342, -466, 243, 494, -110, -459, -40, 365, 156, -246, -272, 83, 327, 80, -360, -222, 342, 368, -272, -458, 185, 483, -68, -438, -54, 364, 182, -246, -265, 85, 291, 90, -295, -232, 240, 369, -200, -472, 79, 454, 8, -434, -118, 346, 198, -222, -251, 52, 263, 91, -257, -275, 197, 364, -120, -437, 22, 456, 88, -405, -161, 314, 236, -183, -254, 43, 277, 103, -237, -232, 153, 353, -49, -426, -53, 426, 152, -403, -243, 288, 286, -175, -304, 12, 270, 121, -216, -260, 110, 350]
2989C50l62l92K87N18j94n65N9N50Q3m77j84L51K86j71l62k0L44K49l23l98K15
3010a56N43j39n81J4N57J13n11k09L63L21j92l60j2L49K15l09l77K05N25r1n59
3031b91o4N71J87n16k76L56L85k12l84J4L26K16k64l92J76M93n5n46o5N27K11
3052C97m73l15L49L76j86l77J2L25J45k24l21J34M38k5m77j38N04K43m28l34K89
3073h6L98j57l80k1L54J59k53k63J09L67M3m30j81M46K81l80l69K63M25j43m04
3094b22lL23J64k33k69P1L59M8l59k18L75L22l19l94J96M30o9l92p1L46J53j99
3116C9k60O0L38P0l43k06L11L30k38l97J40M16j9l98r6L14J91j97k52M9K99J01
3138B52l05k32K41L52j80l94O5M24K9l93j35K87K43j78l02N2L04J18k67k72K27
$$ y = [350, -12, -404, -117, 401, 207, -358, -299, 251, 334, -143, -327, 24, 310, 139, -223, -243, 101, 350, 27, -371, -156, 387, 248, -333, -319, 238, 351, -160, -369, -6, 315, 123, -237, -249, 100, 315, 6, -371, -166, 359, 268, -291, -355, 216, 403, -113, -389, -33, 352, 140, -244, -230, 96, 312, 48, -344, -168, 325, 270, -276, -341, 186, 397, -76, -391, -42, 334, 148, -229, -217, 108, 253, 29, -292, -158, 280, 255, -222, -360, 144, 387, -41, -375, -86, 312, 155, -225, -246, 108, 267, 14, -249, -140, 227, 270, -160, -341, 105, 386, 6, -363, -100, 325, 182, -222, -225, 98, 262, 29, -240, -169, 190, 238, -121, -339, 36, 358, 39, -355, -159, 271, 202, -190, -261, 85, 238, 39, -221, -161, 177, 247, -96, -302, 9, 339, 101, -296, -156, 260, 241, -157, -253, 61, 252, 55, -197, -148, 151, 252, -53, -285, -44, 308, 128, -266, -201, 223, 252, -141, -276, 11, 254, 76, -226, -174, 130, 248, -19, -291, -64]
3159f4L44j27m28K9M30J02m01j77K84K69j73k86L5K83J04k32k57J99L37q5m17
3180b31k7M18J25l77k12K94K60j62l03L3L10R7k40k46J52L61m9m25m7L96J73l63
3202f3k36K64L08j40l17PK94J03k18k38J46L13k7l70q6L55J95l20k67K48L04j27
3224A28l26K8K83R2k22j87J01K72K0l46j00L27J97k81k75J91L38r8l10l6L08J08
3246B12k06k05J06K51J8k88j32L14K10k36l11J45L58q1l11m4K70J45j91k20R7
3267i9K53J1k67j41K60K32j99k74R4L37l9l17n3K61J46j79k00N6K58M0k40j51
3289b11K08K34j53k99P8L25J2k97j03K36J89j53k33N8K50M4k42j48J87K41j38
3310H5k89M1L28M1l10j36K68J99j75k15M3K48M6k09j68J79K36q6l03K2K92J00
$$ y = [-64, 280, 153, -275, -246, 184, 286, -115, -292, -8, 261, 88, -198, -163, 120, 224, -8, -265, -66, 271, 186, -231, -258, 160, 285, -92, -304, -10, 250, 88, -215, -182, 128, 225, -15, -261, -109, 252, 203, -222, -269, 127, 300, -63, -299, -35, 273, 133, -184, -177, 117, 220, 2, -236, -90, 223, 196, -174, -260, 95, 290, -30, -297, -49, 255, 128, -198, -170, 113, 205, -17, -204, -103, 169, 189, -157, -257, 70, 267, -14, -289, -98, 240, 142, -168, -204, 104, 212, 6, -199, -93, 158, 176, -112, -244, 70, 280, 44, -267, -122, 236, 155, -156, -200, 70, 215, 24, -196, -99, 154, 165, -102, -243, 17, 249, 50, -224, -130, 207, 168, -149, -202, 59, 205, 26, -174, -118, 140, 180, -60, -211, -3, 231, 78, -221, -143, 182, 194, -103, -206, 30, 219, 66, -167, -109, 141, 185, -57, -205, -18, 223, 85, -204, -163, 165, 206, -104, -240, 28, 227, 52, -163, -120, 128, 174, -35, -203, -24, 212, 126, -177, -155, 137, 237]
3332B37l10j50K39K04j50k32M1K28P1k04j49J48J99n9k76lK82J02k86j60K07K35
3354B14j31k64L0K49N2j89j58J27K30m1k66l7K77J15k33j98J94K32j16k42J5K55
3376A15O1k03j51J39K24o3k31p6K60J31k20j97J63K33p9k50NK41P0j85j65J12
3398f6K20l1k42n6K24J40j87j95J17K42l8k55j5K19R6j60j65Q5K17k2k08q6K24
3421E8J38j53k16Q1K62k1k63j9K01J05j65j64Q7J90nj93p7J60J71j39k32R3K43
3444A42j3k40p5K34J13j45j69O2K20nj82j07J70J84j37k20P8K20J7k15r2J97J44
3467A81j35j66M9J83K8k03q3J54J58j10k09N8J94M2k05j27J92J72j24j98N0K01
3489A02Mj55j06J40J69r5j83J6K09L8j88j24J65J76j21j68K3K09L1j71j23J32
$$ y = [237, -73, -223, 16, 220, 70, -162, -121, 107, 178, -26, -175, -27, 172, 113, -163, -166, 116, 218, -68, -228, -21, 214, 83, -181, -151, 98, 150, -39, -197, -70, 160, 119, -147, -184, 93, 208, -25, -223, -29, 203, 87, -155, -140, 115, 176, -27, -178, -39, 185, 122, -109, -185, 75, 206, -14, -211, -48, 185, 106, -144, -139, 102, 172, -13, -178, -66, 154, 123, -119, -175, 49, 189, 2, -193, -76, 166, 128, -127, -142, 77, 173, 13, -152, -67, 150, 128, -80, -166, 58, 196, 43, -173, -92, 170, 149, -114, -133, 68, 173, 8, -156, -69, 121, 116, -77, -154, 6, 177, 38, -194, -101, 142, 129, -111, -186, 48, 161, 16, -153, -91, 129, 124, -58, -165, 5, 189, 52, -168, -90, 130, 147, -68, -160, 37, 181, 46, -120, -71, 112, 140, -63, -146, 8, 166, 56, -153, -95, 99, 141, -64, -191, 1, 173, 49, -149, -99, 102, 106, -49, -155, -15, 154, 59, -124, -108, 101, 139, -49, -173, -8, 168, 47, -121, -98, 111, 142, -29, -152, -20]
3511b0J72p8k12J7K03P6j84j13J32J79r1k08L3J92L4j58j23J24J64p2j88nK07
3534H1O6j83j39J37J81p3k04RK08O5j63j22J04J53l4j89j1J85O8j57j36J38J60
3557A44p2j74k0J86Q0j50j37J03J48k6j73l5J74Q7j41j33R4J60k1j75l7J75O7
3580A24j23j17P1J51jj70o0J61J10j35j44R1J90n3j79j6J51R2j42j23Q2J26Pj82
3604h9l9J43J10j09j56O5J86j0j72o4J49J00j04j50P1J66J5j63q2J52J07j01j41
3627a16L8J84%j66o2J29J06q3j44L8J86%j61n8J28R7q4j45M0J56K2j80n5J45J18
3652A33j01j48L8J50Rj44o3J34J08p5j43L2J56K3j56o8J38J18j08j39K5J69K5
3675A13j47p6J15J14p6j42K6J53J3j30r3J09J41p6j36J0J36N1j48o7R4J00m9j20
$$ y = [-20, 152, 74, -138, -121, 82, 158, -26, -139, -7, 172, 81, -127, -94, 98, 132, -26, -149, -25, 139, 67, -121, -126, 81, 147, -36, -175, -38, 143, 70, -134, -125, 83, 148, -15, -137, -33, 120, 86, -103, -114, 71, 139, -18, -154, -16, 144, 72, -102, -122, 64, 144, -6, -143, -40, 108, 82, -91, -126, 48, 135, -6, -139, -45, 115, 94, -81, -118, 57, 124, 1, -116, -45, 106, 105, -65, -125, 36, 146, 11, -133, -42, 148, 95, -84, -100, 51, 143, 1, -122, -40, 86, 93, -89, -128, 15, 125, 16, -140, -75, 111, 101, -71, -135, 14, 114, 10, -140, -69, 97, 112, -51, -133, 19, 126, 25, -116, -78, 106, 106, -60, -122, 7, 113, 30, -114, -76, 110, 110, -51, -109, 19, 116, 32, -113, -73, 83, 105, -75, -130, 15, 133, 32, -116, -78, 72, 81, -63, -126, 8, 116, 41, -102, -70, 86, 109, -47, -115, 23, 141, 33, -106, -81, 88, 113, -34, -110, 5, 119, 43, -99, -73, 80, 93, -37, -130, -21, 120, 44, -92, -82, 54, 105, -43, -110, -16, 84, 35, -85]
3699h5qJ50M4j39o1J01J02o1j28J8J24M6j22o6O9J15k8j55NJ46O6j53o5P3J13
3724A01n0j24qJ29O3j24r6Q0J37m6j40j6J17O8j21q7Q2J35l3j50l4J42L6q2q8
3749a09O1J41j0j47l4J32O9r4r1N0J34j5j42l6J32O6r8q5N7J03qj52j7J22P4q5
3775A8j20L9J35j3j18n1J21Q0q5j20P4J21rj31l8J15Q0q3j04L8J18oj36j8J19
3800B6N9o3r7QJ53j9j20j9Q4P2o8j02L9J19lj12m1Q8O8o2j13M1J20Kj27l2J03
$$ y = [-85, -93, 57, 101, -38, -99, 2, 104, 43, -85, -67, 57, 103, -19, -85, -16, 99, 71, -84, -79, 67, 133, -20, -85, -12, 101, 51, -73, -81, 48, 111, -13, -109, -29, 108, 62, -78, -94, 23, 91, -30, -117, -35, 100, 67, -83, -117, 25, 61, -21, -109, -48, 93, 83, -64, -98, 34, 103, 9, -82, -32, 102, 87, -55, -91, 41, 107, 9, -76, -19, 84, 76, -76, -93, 29, 103, 18, -102, -63, 72, 59, -59, -110, 11, 91, 6, -114, -40, 81, 72, -59, -97, 18, 98, 15, -89, -51, 67, 61, -75, -93, 26, 85, 22, -75, -67, 86, 67, -53, -72, 12, 84, 16, -86, -47, 72, 69, -43, -84, 4, 72, 10, -103, -62, 58, 60, -67, -99, 4]
$$ [...]
8191B4
##END NTUPLES=NMR FID
##END=
