##TITLE=1H_LY-DMAA.Per2.23
 CDCl3
 8 sc, 
 14.04.2022
##JCAMPDX= 6.0         $$ Bruker NMR JCAMP-DX V2.0
##DATA TYPE= NMR FID
##DATA CLASS= NTUPLES
##ORIGIN= UXNMR, Bruker Analytische Messtechnik GmbH
##OWNER= root
$$ XWIN-NMR		Version 3.5
$$ Thu Apr 14 13:49:33 2022 Russian Standard Time (UT+4h)  she@DPX200
##.OBSERVE FREQUENCY= 200.13135
##.OBSERVE NUCLEUS= ^1H
##.DELAY= (6, 6)
##.ACQUISITION MODE= SIMULTANEOUS
##.ACQUISITION SCHEME= undefined
##.AVERAGES= 8
##.DIGITISER RES= 18
##SPECTROMETER/DATA SYSTEM= spect
##.PULSE SEQUENCE= zg30
##.SOLVENT NAME= CDCl3
##.SHIFT REFERENCE= (INTERNAL, CDCl3, 0, 15.7039)
##AUDIT TRAIL= $$ (NUMBER, WHEN, WHO, WHERE, WHAT)
$$ ##TITLE= Audit trail, XWIN-NMR		Version 3.5
$$ ##JCAMPDX= 5.01
$$ ##ORIGIN= Bruker BioSpin GmbH
$$ ##OWNER= she
$$ F:/spectra/data/she/nmr/H-F/1/audita.txt
$$ ##AUDIT TRAIL=  $$ (NUMBER, WHEN, WHO, WHERE, WHAT)
(   1,<2022-04-14 13:47:51.93 +0400>,<she>,<DPX200>,
      <created by zg, POWCHK disabled, PULCHK disabled
       configuration hash MD5:
       00 E9 B6 7A A2 85 ED C7 34 08 36 98 17 FE 4E 26
       data hash MD5: 16K
       42 FB 06 57 1B BF 5B 8E 68 F4 52 FD 4F 91 B3 01>)
$$ ##END=
$$ 
$$ hash MD5
$$ A2 67 98 D2 58 7F 65 AA EB A4 54 EC 9A 01 4B 66
##$RELAX= 
##$RELAX= 
##$RELAX= 
##$RELAX= 
##$RELAX= 
##$RELAX= 
$$ Bruker specific parameters
$$ --------------------------
##$DU= <F:/spectra>
##$EXPNO= 1
##$NAME= <H-F>
##$PROCNO= 1
##$TYPE= <nmr>
##$USER= <she>
##$AMP= (0..31)
100 100 100 100 100 100 100 100 100 100 100 100 100 100 100 100 100 100 
100 100 100 100 100 100 100 100 100 100 100 100 100 100 
##$AQSEQ= 0
##$AQ_mod= 1
##$AUNM= <au_zg>
##$AUTOPOS= <>
##$BF1= 200.13
##$BF2= 200.13
##$BF3= 200.13
##$BF4= 200.13
##$BF5= 200.13
##$BF6= 200.13
##$BF7= 200.13
##$BF8= 200.13
##$BYTORDA= 1
##$CFDGTYP= 0
##$CFRGTYP= 5
##$CHEMSTR= <none>
##$CNST= (0..31)
1 1 145 1 1 1 1 1 1 1 1 1 1 1 1 1 1 1 1 1 1 1 1 1 1 1 1 1 1 1 1 1 
##$CPDPRG= <>
##$CPDPRG1= <>
##$CPDPRG2= <>
##$CPDPRG3= <>
##$CPDPRG4= <mlev>
##$CPDPRG5= <mlev>
##$CPDPRG6= <mlev>
##$CPDPRG7= <mlev>
##$CPDPRG8= <mlev>
##$CPDPRGB= <>
##$CPDPRGT= <>
##$D= (0..31)
0 1.2 0 0 0 0 0 0 0 0.06 0 0.03 0 0 0 0 0.0002 0 0 0 0 0 0 0 0 0 0 0 0 
0 0 0 
##$DATE= 1649929671
##$DBL= (0..7)
120 120 120 120 120 120 120 120 
##$DBP= (0..7)
150 150 150 150 150 150 150 150 
##$DBP07= 0
##$DBPNAM0= <>
##$DBPNAM1= <>
##$DBPNAM2= <>
##$DBPNAM3= <>
##$DBPNAM4= <>
##$DBPNAM5= <>
##$DBPNAM6= <>
##$DBPNAM7= <>
##$DBPOAL= (0..7)
0.5 0.5 0.5 0.5 0.5 0.5 0.5 0.5 
##$DBPOFFS= (0..7)
0 0 0 0 0 0 0 0 
##$DE= 6
##$DECBNUC= <off>
##$DECIM= 32
##$DECNUC= <off>
##$DECSTAT= 4
##$DIGMOD= 1
##$DIGTYP= 9
##$DL= (0..7)
0 120 120 120 120 120 120 120 
##$DP= (0..7)
150 150 150 150 150 150 150 150 
##$DP07= 0
##$DPNAME0= <>
##$DPNAME1= <>
##$DPNAME2= <>
##$DPNAME3= <>
##$DPNAME4= <>
##$DPNAME5= <>
##$DPNAME6= <>
##$DPNAME7= <>
##$DPOAL= (0..7)
0.5 0.5 0.5 0.5 0.5 0.5 0.5 0.5 
##$DPOFFS= (0..7)
0 0 0 0 0 0 0 0 
##$DQDMODE= 0
##$DR= 18
##$DS= 0
##$DSLIST= <SSSSSSSSSSSSSSS>
$$ [...]
##$SUBNAM2= <"">
##$SUBNAM3= <"">
##$SUBNAM4= <"">
##$SUBNAM5= <"">
##$SUBNAM6= <"">
##$SUBNAM7= <"">
##$SUBNAM8= <"">
##$SUBNAM9= <"">
##$SW= 18.05172834244
##$SWIBOX= (0..15)
0 0 2 0 0 0 0 0 0 0 0 0 0 0 0 0 
##$SW_h= 3612.71676300578
##$TD= 16384
##$TD0= 1
##$TE= 0
##$TE2= 300
##$TE3= 300
##$TEG= 300
##$TL= (0..7)
0 120 120 120 120 120 120 120 
##$TP= (0..7)
150 150 150 150 150 150 150 150 
##$TP07= 0
##$TPNAME0= <>
##$TPNAME1= <>
##$TPNAME2= <>
##$TPNAME3= <>
##$TPNAME4= <>
##$TPNAME5= <>
##$TPNAME6= <>
##$TPNAME7= <>
##$TPOAL= (0..7)
0.5 0.5 0.5 0.5 0.5 0.5 0.5 0.5 
##$TPOFFS= (0..7)
0 0 0 0 0 0 0 0 
##$TUNHIN= 0
##$TUNHOUT= 0
##$TUNXOUT= 0
##$USERA1= <user>
##$USERA2= <user>
##$USERA3= <user>
##$USERA4= <user>
##$USERA5= <user>
##$V9= 5
##$VALIST= <valist>
##$VCLIST= <CCCCCCCCCCCCCCC>
##$VD= 0
##$VDLIST= <DDDDDDDDDDDDDDD>
##$VPLIST= <PPPPPPPPPPPPPPP>
##$VTLIST= <TTTTTTTTTTTTTTT>
##$WBST= 1024
##$WBSW= 4
##$XGAIN= (0..3)
0 0 0 0 
##$XL= 0
##$YL= 0
##$YMAX_a= 306931
##$YMIN_a= -314800
##$ZGOPTNS= <>
##$ZL1= 120
##$ZL2= 120
##$ZL3= 120
##$ZL4= 120
##$ABSF1= 10
##$ABSF2= 0
##$ABSG= 5
##$ABSL= 3
##$ALPHA= 0
##$AQORDER= 0
##$ASSFAC= 0
##$ASSFACI= 0
##$ASSFACX= 0
##$ASSWID= 0
##$AUNMP= <proc_1d>
##$AZFE= 0.1
##$AZFW= 0.1
##$BCFW= 1
##$BC_mod= 2
##$BYTORDP= 1
##$COROFFS= 0
##$CY= 11.3945322036743
##$DATMOD= 1
##$DC= 2
##$DFILT= <>
##$DTYPP= 0
##$F1P= 2.36226072786647
##$F2P= -0.459571619588291
##$FCOR= 0.5
##$FTSIZE= 0
##$FT_mod= 4
##$GAMMA= 1
##$GB= 0.15
##$INTBC= 1
##$INTSCL= 1
##$ISEN= 128
##$LB= 0.24
##$LEV0= 0
##$LPBIN= 0
##$MAXI= 10000
##$MC2= 0
##$MEAN= 0
##$ME_mod= 0
##$MI= 1.114404
##$NCOEF= 0
##$NC_proc= 0
##$NLEV= 6
##$NOISF1= 3.799351
##$NOISF2= 2.8
##$NSP= 1
##$NTH_PI= 0
##$NZP= 0
##$OFFSET= 15.70392
##$PC= 1
##$PHC0= -18662.56
##$PHC1= 15.20075
##$PH_mod= 1
##$PKNL= yes
##$PPARMOD= 0
##$PSCAL= 0
##$PSIGN= 0
##$REVERSE= no
##$SF= 200.130013532006
##$SI= 16384
##$SIGF1= 3
##$SIGF2= 2
##$SINO= 400
##$SIOLD= 16384
##$SREGLST= <1H.CDCl3>
##$SSB= 0
##$STSI= 0
##$STSR= 0
##$SW_p= 3612.71676300578
##$SYMM= 0
##$S_DEV= 0
##$TDeff= 0
##$TDoff= 0
##$TI= <>
##$TILT= no
##$TM1= 0
##$TM2= 0
##$TOPLEV= 0
##$USERP1= <user>
##$USERP2= <user>
##$USERP3= <user>
##$USERP4= <user>
##$USERP5= <user>
##$WDW= 1
##$XDIM= 8192
##$YMAX_p= 0
##$YMIN_p= 0
$$ End of Bruker specific parameters
$$ ---------------------------------
##NTUPLES= NMR FID
##VAR_NAME=  TIME,          FID/REAL,        FID/IMAG
##SYMBOL=    X,             R,               I
##VAR_TYPE=  INDEPENDENT,   DEPENDENT,       DEPENDENT
##VAR_FORM=  AFFN,          ASDF,            ASDF
##VAR_DIM=   8192,          8192,            8192
##UNITS=     SECONDS,       ARBITRARY UNITS, ARBITRARY UNITS
##FACTOR=    0.0002768,     1,               1
##FIRST=     0,             0,               0
##LAST=      2.2672688,     0,               0
##MIN=       0,             -314800,         0
##MAX=       2.2672688,     306931,          0
$$ Real data points
##PAGE= N=1
##DATA TABLE= (X++(R..R)), XYDATA
0 0 0 0 0 0 0 0 0 0 0 0 0 0 0 0 -8 8 -8 8 -8 8 -16 16 -16 24 -24 32 -32 40 -48 52 -58 66 -78 88 -98 110
36 110 -122 138 -154 170 -189 209 -232 256 -283 312 -345 378 -416 461 -506 559 -615 681 -752
55 -752 836 -932 1044 -1174 1329 -1522 1762 -2074 2495 -3098 4022 -5602 8818 -17846 94059
70 94059 306931 -70085 -278487 30545 234138 5044 -163098 -50542 83859 87775 2014
81 2014 -124776 -80018 149660 148150 -166195 -196015 166911 223155 -156120 -225707 130983
92 130983 208581 -94678 -171027 50062 122064 -791 -64786 -48973 7779 94971 45293
103 45293 -132666 -87494 158733 116252 -171670 -129969 168701 127771 -151870 -112529 121087
114 121087 86095 -81252 -53958 34565 19531 13056 12002 -57737 -37064 95320 53276 -121786
126 -121786 -58422 136234 53932 -136500 -39907 124559 20351 -101281 2417 70636 -24068
137 -24068 -35776 41356 493 -52145 30787 53723 -56051 -46769 71978 30867 -78761 -9031
149 -9031 75278 -17033 -63792 43559 46077 -67271 -24773 85273 3352 -94513 15946 94346
161 94346 -29541 -82975 36861 62405 -36066 -33576 28223 -204 -14288 35711 -3605 -69571
173 -69571 22112 97288 -39371 -117037 51365 125460 -57036 -122619 53953 107816 -42576
184 -42576 -83068 23454 50845 1715 -13878 -29542 -23451 57593 58619 -81417 -87245 98907
196 98907 108076 -106598 -118628 103551 118752 -89069 -108866 63877 90053 -30563 -65063
207 -65063 -8683 35353 48874 -4840 -87001 -24971 118026 50675 -139175 -71033 147517
218 147517 84456 -141651 -89992 122217 88502 -89990 -79860 48816 66426 -1592 -48844
229 -48844 -45985 29892 89928 -10689 -125596 -6913 149248 21581 -159018 -33231 153230
240 153230 40631 -133648 -45091 101274 46100 -60368 -45051 14437 42001 31429 -37936
251 -37936 -72948 33203 106449 -27587 -128284 21930 137569 -15266 -132921 8566
261 8566 116334 -825 -89011 -7102 54612 15313 -16888 -23640 -20462 31168 53182 -37987
273 -37987 -78866 42539 94262 -45325 -99162 45032 93046 -42006 -77608 35793 54990
284 54990 -26706 -28062 15536 838 -2348 24224 -11044 -43532 24418 55757 -35816 -59186
296 -59186 44767 54437 -50182 -42502 51453 25124 -48808 -5468 41999 -14361 -32453 30775
308 30775 20244 -42455 -7402 47118 -5441 -44476 16842 34704 -25888 -18896 32280 -476
320 -476 -35062 21754 35227 -41353 -32296 57393 27585 -67035 -21367 69140 14730 -62953 -8548
333 -8548 48431 2990 -27511 824 1644 -3528 25693 4378 -52300 -4478 74419 3804 -89808
346 -89808 -3222 96557 3399 -93417 -4501 81006 7366 -59646 -11222 32279 16624 -810
358 -810 -22229 -30976 27707 60321 -31759 -84155 33401 99942 -32119 -106722 26828 103081
370 103081 -18196 -90318 5751 68904 8717 -41690 -24647 10877 40060 20377 -53308 -48981
382 -48981 63012 72529 -67439 -88393 66283 95976 -58578 -94033 45318 83820 -26909
393 -26909 -66116 5231 43333 17935 -17960 -40639 -7720 60174 30581 -75309 -49204 83564
405 83564 61442 -84820 -67259 78011 66050 -64177 -58923 44247 47171 -19978 -32177 -6047
417 -6047 16170 31830 -427 -54194 -12946 71734 23431 -82181 -29897 84892 32332 -79602
429 -79602 -31067 66816 26495 -48401 -20168 25683 12517 -1703 -5481 -21736 -679 41835
441 41835 4588 -56991 -6176 65769 5405 -67363 -2296 62322 -1979 -50965 7099 35461
453 35461 -11419 -17150 14575 -1398 -15450 18294 13759 -31784 -9533 40237 2803 -43362
465 -43362 5205 40538 -14216 -33112 22467 21677 -29459 -8448 33865 -5057 -35337 16881
477 16881 33532 -25282 -28161 29605 20151 -28664 -9566 23243 -1983 -13479 14002 1251
489 1251 -24932 12201 33987 -24948 -40324 34944 43081 -41115 -42449 41855 37797 -37535 -30373
502 -30373 27566 20198 -13413 -8725 -3700 -3150 21932 14457 -38984 -23969 53239 31447 -62197
515 -62197 -35769 65308 37481 -61252 -36009 50716 32312 -34077 -26560 13093 19477 10035
527 10035 -11890 -33396 3936 53943 3344 -70097 -10244 79361 15850 -81339 -20504 75161
539 75161 23713 -61631 -25631 42023 26333 -18046 -25544 -7487 23998 32638 -21071 -54216
551 -54216 17599 70744 -13083 -80125 8175 81848 -2772 -75732 -3090 62372 8897 -43564
563 -43564 -14881 20897 20179 2753 -25059 -25587 28721 44972 -30828 -59295 31057 67347 -28979
576 -28979 -68394 24770 62988 -18040 -51478 9696 35882 155 -17590 -10325 -1006 20239
588 20239 18221 -28883 -32390 35149 41887 -38869 -46491 39030 45477 -36242 -39863 30057 30162 -21569
602 -21569 -18213 11267 5262 -102 6957 -10730 -16877 20625 23808 -28145 -26512 33343 25472 -35160
616 -35160 -20506 33976 12885 -29725 -3638 22925 -5969 -14606 14257 5222 -20535 3713
628 3713 23290 -11872 -22733 17891 18285 -21737 -10948 22751 1325 -21207 9362 17643 -19455
641 -19455 -12320 28125 6551 -33645 -604 35835 -4094 -33627 7450 27613 -8766 -18014
653 -18014 8071 5877 -5665 7381 1798 -20760 2454 32250 -6947 -41204 10265 45997
665 45997 -12314 -46543 12238 42359 -9985 -33895 5675 22061 604 -7743 -7708 -7209 15456
678 15456 21918 -22224 -34338 27609 43729 -30350 -48924 29990 49576 -26306 -45736 19103
690 19103 37661 -9312 -26603 -2650 13198 15127 716 -27251 -14274 37275 25920 -44238
702 -44238 -34814 47213 40327 -45487 -41813 39423 39735 -29053 -34125 15746 26103 -384 -16211
715 -16211 -15244 5825 29746 4175 -41788 -12988 49870 19644 -53547 -24123 51934 25749
727 25749 -45686 -25221 34894 22446 -20901 -18242 4865 13256 11544 -7954 -26619 3216 39195
740 39195 1058 -47620 -4060 51497 6164 -50146 -7114 44072 7257 -33895 -6946 20691
752 20691 6189 -6177 -5652 -8400 5119 21252 -5161 -31449 5290 37615 -5920 -39652 6618
765 6618 37399 -7205 -31338 7570 22485 -7227 -11674 6358 668 -4507 9670 2062 -17944
778 -17944 1167 23543 -4694 -25741 8247 24499 -11630 -20276 14123 13478 -15784 -5421 15958
791 15958 -3234 -15039 10832 12585 -16827 -9124 20107 4814 -20341 -53 17569 -4548
803 -4548 -11856 8857 4365 -12110 4429 14494 -12861 -15447 20219 15337 -25263 -13979 27316
816 27316 11667 -26092 -8902 21330 5577 -13912 -2409 4166 -754 6404 3322 -17087 -5531
829 -5531 26336 7001 -33199 -7921 36895 8407 -36656 -8415 32772 8375 -25116 -8063
841 -8063 14765 7877 -2427 -7581 -10436 7330 22627 -6950 -32946 6141 40022 -5054 -43449
854 -43449 3181 42469 -852 -37503 -2240 28744 5623 -17325 -9246 4328 12814 8951 -15681
867 -15681 -21097 17774 31080 -18411 -37671 17715 40654 -15261 -39557 11340 34787 -6079
879 -6079 -26981 -123 16780 6616 -5701 -13178 -5605 18777 15617 -23264 -23782 25685 29113
892 29113 -26079 -31380 24140 30546 -19911 -26654 13849 20686 -6218 -12926 -1997 4758 10419
905 10419 3348 -17864 -10167 23851 15345 -27601 -18337 28760 18906 -27301 -17419 23148 13912
918 13912 -17094 -9426 9326 4177 -1127 732 -7068 -4948 14181 7916 -19624 -9230 23025
931 23025 9081 -23820 -7223 22420 4449 -18673 -791 13431 -2786 -7034 5969 444
943 444 -8263 5735 9224 -10872 -8889 14311 6899 -15975 -3885 15399 -211 -13185 4497
956 4497 9266 -8795 -4517 12312 -579 -14663 5298 15615 -8914 -14743 11123 12328 -11429
969 -11429 -8290 10023 3373 -6842 2243 2527 -7747 2396 12680 -7382 -16503 11458 18717
982 18717 -14319 -19350 15214 18030 -14230 -15214 11139 10924 -6383 -5757 366 175 6196 5367 -12549
997 -12549 -10270 18034 14326 -21803 -16901 23483 18096 -22603 -17686 19270 15869 -13629 -12896 6156
1011 6156 8922 2230 -4652 -10940 92 18813 3963 -25205 -7570 29116 10171 -30283 -11854
1024 -11854 28393 12508 -23599 -12125 16462 11028 -7463 -9154 -2157 7120 11805 -4763 -20156
1037 -20156 2483 26604 -312 -30419 -1657 31166 3271 -29065 -4765 24028 5788 -16965
1049 -16965 -6773 8181 7357 942 -7826 -9862 7986 17650 -7807 -23396 7396 26786 -6389
1062 -6389 -27277 5161 25249 -3363 -20623 1361 14213 999 -6621 -3401 -1172 5748 8355
1075 8355 -7911 -14408 9490 18313 -10628 -20210 10782 19541 -10292 -16936 8803 12465 -6652
1088 -6652 -7022 3907 1180 -799 4276 -2372 -8785 5380 11905 -7827 -13141 9682 12757 -10511
1102 -10511 -10555 10516 7136 -9501 -2847 7624 -1681 -5290 5749 2485 -9099 238 10987 -2844
1116 -2844 -11419 4835 10151 -6268 -7405 6847 3482 -6607 1137 5740 -5767 -4229 10082
1129 10082 2544 -13230 -648 15025 -922 -14989 2125 13179 -2710 -9734 2635 4931
1141 4931 -2043 458 796 -6198 593 11335 -2143 -15578 3392 18199 -4151 -19083 4216
1154 4216 18053 -3511 -15115 2093 10763 93 -5158 -2567 -821 5307 6851 -7715 -12245
1167 -12245 9649 16474 -10685 -19146 10604 19925 -9408 -18870 6965 15896 -3687 -11679 -425
1180 -425 6288 4745 -540 -8983 -5098 12563 10161 -15098 -13956 16387 16370 -15913 -16966 14082
1194 14082 16136 -10575 -13673 6053 10251 -669 -6049 -4890 1575 10103 2554 -14558 -6268 17597
1208 17597 8972 -19160 -10768 18743 11295 -16616 -10875 12822 9438 -7842 -7387 2136 4914 3813
1222 3813 -2260 -9248 -70 13844 2228 -16920 -3666 18419 4588 -17929 -4776 15750 4456
1235 4456 -12105 -3681 7282 2586 -2032 -1590 -3381 543 8047 76 -11803 -438 14036 364
1249 364 -14740 -8 13842 -570 -11433 1259 8020 -1788 -3857 2226 -405 -2234 4417 1977
1263 1977 -7592 -1287 9740 362 -10551 718 9934 -2012 -8192 3094 5388 -4113 -2132 4653
1277 4653 -1410 -4950 4589 4753 -7110 -4155 8646 3166 -8858 -1798 7991 397 -5799 1208
1291 1208 2903 -2621 641 3852 -4185 -4739 7347 5214 -9798 -5331 10991 4870 -10981 -4224
1305 -4224 9450 3173 -6808 -2055 3160 871 1055 279 -5351 -1233 9280 2129 -12337 -2683 14259
1320 14259 3229 -14602 -3452 13530 3678 -10917 -3657 7157 3608 -2560 -3477 -2460 3121
1333 3121 7242 -2772 -11499 2123 14477 -1480 -16204 550 16173 423 -14680 -1560
1345 -1560 11602 2656 -7400 -3728 2547 4757 2563 -5441 -7271 5971 11369 -5981 -14106 5640
1359 5640 15506 -4730 -15346 3398 13668 -1651 -10763 -434 6827 2546 -2535 -4745 -1976
1372 -1976 6533 5965 -8009 -9330 8715 11542 -8726 -12526 7943 12252 -6404 -10727 4312 8336
1386 8336 -1674 -5132 -1063 1788 3824 1638 -6122 -4542 7969 6779 -9033 -8075 9227 8366
1400 8366 -8609 -7759 7115 6181 -5075 -4134 2527 1771 148 611 -2820 -2663 5097 4201 -6776 -4994
1416 -4994 7785 5122 -7917 -4420 7297 3185 -5874 -1529 3972 -281 -1756 2019 -585 -3484
1430 -3484 2663 4348 -4382 -4754 5385 4349 -5769 -3462 5318 1979 -4327 -249 2789 -1649 -959
1445 -959 3495 -872 -4880 2578 5867 -3778 -6155 4479 5838 -4448 -4792 3799 3193 -2527 -1198
1460 -1198 830 -1079 1030 3193 -2927 -5112 4410 6460 -5620 -7345 5973 7345 -5689 -6766
1474 -6766 4600 5483 -2855 -3691 593 1645 1936 644 -4330 -2708 6546 4593 -8040 -5954 8810
1489 8810 6832 -8584 -7044 7434 6666 -5462 -5718 2739 4263 267 -2657 -3478 710 6232 1053
1504 1053 -8641 -2716 10137 4028 -10642 -4942 10099 5389 -8485 -5332 6058 4945 -2911 -4090
1518 -4090 -417 3149 3873 -1942 -6886 780 9289 323 -10778 -1314 11142 2076 -10550 -2701
1532 -2701 8778 3018 -6257 -3207 3103 3157 268 -3035 -3556 2691 6375 -2237 -8487 1722 9740
1547 9740 -1125 -9912 550 9105 151 -7357 -706 4979 1289 -2211 -1787 -704 2100 3357 -2370
1562 -2370 -5530 2453 6965 -2414 -7648 2201 7391 -1933 -6404 1477 4734 -951 -2618 356 357 318
1578 318 1885 -907 -3664 1545 5002 -1953 -5579 2258 5493 -2357 -4714 2206 3321 -1936 -1661
1593 -1661 1419 -378 -893 2154 228 -3712 306 4654 -844 -5086 1163 4802 -1338 -3900 1353
1608 1353 2512 -1147 -682 914 -1190 -494 3099 180 -4538 167 5547 -349 -5928 394 5580
1623 5580 -377 -4654 117 3097 161 -1237 -622 -1051 938 3046 -1376 -4894 1527 6249 -1586
1638 -1586 -6983 1415 6986 -967 -6213 382 4921 476 -3004 -1298 820 2244 1544 -2960 -3694
1653 -3694 3457 5457 -3687 -6764 3471 7296 -2936 -7174 1957 6298 -813 -4898 -622 2983
1667 2983 1957 -832 -3291 -1392 4270 3362 -4917 -4991 5197 6124 -4868 -6590 4176 6456 -2943
1682 -2943 -5687 1484 4427 229 -2881 -2028 1099 3590 708 -4910 -2373 5746 3654 -6136 -4566
1697 -4566 5867 4921 -5060 -4805 3733 4215 -2035 -3297 176 2147 1793 -763 -3457 -464 4824 1596
1713 1596 -5637 -2423 5912 2923 -5598 -3096 4673 2854 -3412 -2417 1768 1696 -106 -900 -1684 63
1729 63 3078 638 -4164 -1223 4761 1584 -4784 -1648 4407 1547 -3498 -1204 2318 728 -867
1744 -867 -152 -579 -375 1951 825 -3018 -1174 3665 1235 -3899 -1212 3578 945 -2960 -603 1828
1760 1828 43 -619 433 -762 -989 1944 1413 -2864 -1655 3403 1776 -3462 -1684 3130 1464 -2323
1776 -2323 -980 1264 511 52 144 -1344 -776 2469 1323 -3432 -1794 3890 2042 -4036 -2238 3579
1792 3579 2118 -2779 -1924 1544 1497 -127 -1023 -1397 393 2798 207 -3956 -792 4741 1302 -4980
1808 -4980 -1713 4741 2021 -3929 -2131 2766 2120 -1236 -1942 -551 1570 2199 -1157 -3702 617 4767
1824 4767 -79 -5413 -533 5466 1014 -5031 -1462 4023 1840 -2681 -2078 1039 2200 750 -2091
1839 -2091 -2363 1895 3752 -1568 -4779 1111 5295 -590 -5345 -2 4790 581 -3865 -1203 2497
1854 2497 1650 -1011 -2072 -667 2266 2169 -2331 -3393 2179 4275 -1838 -4628 1403 4572 -782 -3956
1870 -3956 153 3080 571 -1789 -1171 474 1687 904 -2054 -2108 2209 2942 -2224 -3551 1961 3593
1886 3593 -1616 -3398 1063 2712 -505 -1853 -155 837 758 226 -1268 -1212 1708 2026 -1877 -2471 1934
1903 1934 2746 -1740 -2542 1430 2157 -913 -1466 394 628 199 261 -726 -1133 1096 1748 -1459 -2287 1498
1921 1498 2352 -1449 -2267 1154 1788 -755 -1128 229 319 285 569 -724 -1348 1103 2024 -1295 -2445 1362
1939 1362 2620 -1183 -2430 875 2020 -416 -1379 -129 525 671 317 -1202 -1229 1519 1936 -1762 -2528
1956 -2528 1788 2827 -1610 -2897 1166 2608 -578 -2086 -68 1359 829 -456 -1447 -459 2037 1376
1972 1376 -2390 -2106 2465 2607 -2317 -2888 1890 2876 -1283 -2600 447 2014 392 -1335 -1333 461 2078
1989 2078 397 -2648 -1192 2982 1875 -3013 -2317 2770 2610 -2219 -2566 1455 2347 -492 -1927 -493
2005 -493 1291 1434 -624 -2275 -96 2851 738 -3225 -1355 3176 1721 -2933 -2017 2315 2014 -1508
2021 -1508 -1892 516 1579 521 -1146 -1418 632 2265 -50 -2771 -396 3081 878 -2970 -1127
2036 -1127 2659 1336 -1982 -1366 1203 1251 -245 -1057 -717 764 1447 -464 -2149 71 2501 200
2052 200 -2633 -495 2467 638 -2032 -753 1426 794 -663 -697 -134 580 905 -356 -1516 187 1982
2069 1982 56 -2137 -218 2120 373 -1843 -463 1315 507 -705 -493 -60 365 707 -222 -1345
2085 -1345 5 1754 137 -1989 -333 1920 457 -1638 -523 1212 524 -510 -502 -137 399 843 -252
2102 -252 -1423 89 1880 112 -2101 -318 2071 510 -1848 -690 1363 727 -749 -777 4 729
2118 729 683 -632 -1409 465 1907 -245 -2222 -26 2346 328 -2166 -574 1788 824 -1190 -956
2134 -956 470 1056 317 -1031 -1089 898 1719 -733 -2256 411 2447 -132 -2476 -196 2180 546
2150 546 -1708 -845 1062 1076 -274 -1212 -466 1335 1231 -1194 -1769 1075 2233 -787 -2390 462 2345
2167 2345 -54 -2066 -318 1556 711 -965 -1062 230 1264 428 -1438 -1144 1380 1638 -1266 -2012 978
2184 978 2137 -634 -2059 230 1734 214 -1254 -617 699 975 -44 -1206 -524 1369 1113 -1328
2200 -1328 -1474 1233 1695 -996 -1732 652 1553 -281 -1262 -160 794 531 -343 -878 -218 1052 662 -1225
2218 -1225 -1015 1195 1263 -1089 -1343 835 1324 -520 -1076 173 799 263 -383 -568 -3 867 459 -1021
2236 -1021 -796 1082 1038 -1006 -1166 793 1125 -586 -989 199 709 143 -356 -477 -52 764 400 -918
2254 -918 -757 1024 992 -937 -1122 843 1152 -518 -1002 194 759 167 -455 -513 70 793 303 -1033 -654
2273 -654 1098 906 -1123 -1120 932 1165 -667 -1109 345 966 58 -682 -448 376 857 85 -1069 -385 1258
2292 1258 781 -1267 -1030 1193 1184 -908 -1215 536 1098 -143 -971 -307 640 706 -306 -1100 -98 1335
2310 1335 417 -1450 -750 1407 974 -1256 -1115 926 1171 -510 -1099 78 936 451 -643 -831 377
2327 377 1241 -9 -1422 -278 1524 581 -1445 -807 1224 942 -919 -1041 435 924 16 -838 -549
2344 -549 592 897 -345 -1238 42 1434 232 -1463 -476 1369 690 -1096 -800 769 852 -318 -776
2361 -776 -110 661 550 -488 -935 277 1174 -78 -1315 -144 1291 361 -1168 -525 923 582 -553
2378 -553 -617 120 597 289 -524 -631 399 916 -223 -1078 34 1155 149 -1089 -332 904 370 -602
2396 -602 -490 245 478 121 -458 -499 321 760 -228 -1010 41 1050 124 -1017 -275 850 386 -573 -426
2415 -426 293 478 86 -412 -371 369 717 -227 -873 89 1005 74 -1010 -235 860 322 -698 -477 313
2434 313 468 -48 -524 -356 417 616 -356 -889 206 1015 -39 -1071 -128 978 335 -797 -431 530
2452 530 554 -167 -547 -165 545 528 -453 -811 348 1019 -215 -1133 -28 1090 179 -984 -377 702 506
2471 506 -446 -627 62 648 316 -651 -660 569 900 -455 -1060 260 1134 -25 -1044 -134 919 383 -634
2490 -634 -529 327 647 78 -687 -385 670 692 -609 -928 450 1040 -308 -1078 62 959 149 -804 -409
2509 -409 511 546 -225 -636 -115 699 421 -692 -692 622 883 -448 -962 265 971 -75 -861 -154 629
2528 629 340 -398 -524 79 597 207 -660 -471 616 675 -555 -774 431 835 -223 -779 64 676 172
2547 172 -454 -350 216 514 60 -590 -302 593 503 -584 -667 447 719 -327 -762 113 598 44 -452 -248
2567 -248 248 406 -25 -507 -212 570 443 -525 -573 495 683 -357 -673 210 631 24 -477 -216 314 325
2587 325 -70 -446 -115 526 334 -587 -508 508 578 -431 -669 238 605 -73 -569 -129 355 330 -171 -480
2607 -480 -44 579 272 -614 -424 601 620 -485 -650 352 685 -137 -609 -44 505 272 -309 -470 65
2626 65 570 111 -675 -366 654 528 -623 -652 477 685 -294 -684 72 602 146 -466 -372 286 553 -51
2646 -51 -681 -144 759 378 -719 -494 644 616 -491 -674 285 629 -29 -569 -235 412 450 -218 -629 17
2666 17 736 146 -785 -340 748 496 -616 -576 435 637 -182 -586 -53 496 294 -351 -501 178 662 1
2686 1 -759 -208 733 332 -698 -441 540 482 -397 -525 123 477 81 -398 -293 265 540 -112 -624 -24 708
2707 708 194 -674 -301 615 405 -430 -447 246 426 -15 -388 -194 304 390 -219 -559 26 603 78 -661 -238
2728 -238 575 296 -481 -388 274 404 -106 -388 -116 323 340 -194 -472 84 620 59 -633 -147 622 275 -496
2749 -496 -323 351 364 -183 -354 -66 318 243 -254 -440 126 555 -23 -641 -123 616 203 -573 -339 412 369
2770 369 -238 -388 27 380 219 -307 -375 222 564 -97 -630 -9 685 167 -639 -270 511 365 -346 -405 137
2791 137 418 107 -393 -329 322 478 -233 -656 109 701 58 -684 -131 612 263 -455 -350 300 431 -72
2811 -72 -457 -205 388 406 -348 -563 242 652 -120 -730 -33 702 163 -594 -275 394 372 -210 -457 -15 458
2832 458 254 -452 -433 365 602 -240 -671 160 678 2 -648 -170 503 264 -350 -393 129 461 74 -439 -310
2853 -310 408 445 -376 -582 232 632 -106 -621 -22 555 164 -372 -264 225 355 -22 -412 -146 446 354 -388
2874 -388 -473 321 576 -194 -576 68 545 59 -449 -200 272 280 -125 -389 -92 402 242 -400 -420 334 499
2895 499 -270 -561 165 515 24 -439 -140 318 213 -141 -333 18 400 180 -393 -324 383 434 -288 -487 192
2916 192 505 -94 -481 -84 336 197 -244 -325 53 381 99 -437 -256 401 387 -359 -494 269 510 -128 -488
2937 -488 0 425 164 -296 -301 127 412 2 -469 -211 446 344 -430 -451 356 524 -217 -521 89 450 93
2958 93 -387 -223 267 342 -91 -450 -50 521 227 -498 -349 438 492 -358 -504 198 493 -44 -481 -144 336
2979 336 278 -245 -437 75 507 112 -572 -277 540 378 -475 -517 320 516 -166 -464 14 418 199 -327 -354
3000 -354 178 491 -20 -499 -116 585 265 -525 -381 431 446 -300 -437 123 425 39 -377 -246 270 356 -143
3021 -143 -496 -4 543 122 -555 -237 496 348 -355 -386 231 413 -26 -376 -102 324 270 -200 -423 89 524
3042 524 25 -539 -148 512 265 -446 -343 277 367 -147 -374 -45 305 190 -253 -347 159 467 -50 -541 -44
3063 -44 525 173 -440 -257 359 333 -206 -363 37 346 128 -296 -295 203 405 -109 -497 -13 528 121 -492
3084 -492 -248 391 282 -278 -357 103 343 69 -333 -243 276 384 -180 -479 51 522 74 -546 -165 463 244
3105 244 -372 -367 191 346 -1 -404 -174 366 313 -313 -467 172 492 -46 -563 -77 510 215 -406 -291 297
3126 297 365 -166 -409 -40 399 219 -362 -385 260 494 -153 -545 17 570 82 -532 -251 380 322 -264 -422
3147 -422 63 402 109 -418 -309 350 417 -273 -513 143 553 -26 -541 -122 458 234 -321 -310 199 373 -8
3168 -8 -414 -172 378 322 -337 -474 251 495 -140 -547 -17 480 134 -418 -277 272 327 -122 -425 -41 424
3189 424 219 -393 -343 324 474 -200 -472 120 494 68 -429 -162 368 298 -186 -378 56 399 120 -392 -277
3210 -277 359 386 -302 -421 167 463 -60 -471 -98 376 216 -263 -311 108 397 28 -427 -155 436 293 -368
3231 -368 -406 251 429 -161 -477 -42 382 134 -328 -274 192 363 -72 -405 -108 419 237 -386 -355 312 432
3252 432 -188 -446 65 422 95 -369 -221 275 321 -140 -422 20 429 147 -446 -280 376 368 -290 -442 134
3273 134 430 -42 -440 -146 314 249 -234 -361 97 471 45 -462 -183 465 316 -399 -412 251 436 -121 -430
3294 -430 -37 428 206 -308 -336 196 433 -74 -464 -82 474 209 -435 -331 331 415 -232 -437 70 414 78
3315 78 -399 -214 278 365 -189 -449 31 501 91 -470 -228 418 328 -296 -379 176 421 -17 -410 -116 347
3336 347 257 -248 -400 133 453 -29 -486 -155 455 232 -398 -309 286 402 -114 -387 -12 367 207 -321 -309
3357 -309 232 412 -97 -475 -24 478 143 -465 -270 354 341 -203 -390 36 387 70 -348 -245 293 333 -177
3378 -177 -420 74 467 59 -445 -159 420 285 -274 -345 157 377 0 -387 -150 323 272 -269 -395 116 400
3399 400 -36 -489 -131 432 202 -347 -312 241 348 -73 -405 -65 379 185 -330 -341 235 423 -105 -455 -5
3420 -5 444 134 -391 -203 292 324 -174 -372 23 363 118 -360 -287 295 346 -208 -437 68 434 29 -425 -170
3442 -170 354 291 -265 -339 101 371 25 -375 -182 364 349 -278 -378 172 470 -55 -451 -89 412 231 -350
3463 -350 -308 230 372 -58 -393 -96 370 216 -363 -339 275 404 -165 -469 5 427 115 -372 -219 276 333
3484 333 -155 -399 19 418 114 -382 -260 329 340 -211 -402 119 438 7 -421 -141 377 255 -236 -346
3504 -346 109 405 -2 -414 -160 382 279 -314 -362 212 440 -72 -411 -49 393 186 -299 -309 180 383 -93
3525 -93 -418 -73 390 182 -351 -320 278 383 -186 -424 23 412 83 -372 -209 278 328 -145 -381 49 452
3546 452 136 -408 -240 339 337 -240 -353 140 418 -7 -392 -137 324 261 -237 -352 107 392 -17 -424 -151
3567 -151 350 244 -333 -374 201 366 -99 -396 -70 365 190 -284 -274 226 386 -97 -383 -30 399 188 -332
3588 -332 -291 274 356 -158 -379 36 376 102 -355 -234 247 320 -129 -390 44 391 78 -387 -225 318 308
3609 308 -258 -352 81 386 0 -335 -157 316 277 -246 -362 103 396 10 -401 -143 366 247 -288 -305 195
3630 195 387 -72 -395 -87 355 197 -286 -297 193 346 -71 -409 -6 413 140 -358 -274 267 333 -155 -383
3651 -383 47 387 111 -364 -252 244 320 -173 -386 38 413 41 -398 -182 331 311 -239 -359 134 387 32
3672 32 -377 -134 333 287 -237 -343 137 407 -19 -393 -92 361 212 -296 -302 237 345 -102 -387 -58 352
3693 352 153 -340 -301 207 357 -105 -434 -18 400 115 -367 -245 262 326 -187 -366 27 411 115 -336 -211
3714 -211 301 307 -207 -395 85 408 27 -371 -169 326 245 -243 -360 125 351 21 -363 -145 336 246 -252
3735 -252 -317 155 348 -31 -385 -95 379 179 -306 -274 216 344 -84 -341 -31 333 170 -312 -274 211 322
3756 322 -129 -411 -6 367 109 -344 -224 259 286 -140 -341 2 351 88 -354 -201 264 305 -196 -383 64
3777 64 377 50 -353 -173 281 247 -233 -330 111 372 13 -361 -121 315 235 -228 -327 148 352 -43 -372 -65
3799 -65 336 211 -248 -272 187 325 -64 -349 -52 346 172 -311 -255 217 349 -125 -397 -8 346 94 -339
3820 -339 -257 250 287 -149 -364 10 372 76 -329 -205 287 309 -214 -369 119 393 42 -366 -153 322 252
3841 252 -210 -325 115 375 8 -362 -139 313 236 -267 -313 143 348 -69 -388 -70 323 175 -312 -259 202
3862 202 322 -105 -363 -10 345 148 -323 -265 234 342 -134 -358 30 368 89 -314 -204 249 282 -182 -348
3883 -348 52 357 58 -340 -158 271 262 -205 -349 121 351 25 -376 -134 300 221 -227 -301 125 333 -24
3904 -24 -328 -91 290 200 -242 -277 146 332 -72 -351 -36 307 140 -266 -239 182 305 -74 -349 -13 339
3925 339 147 -298 -226 220 290 -147 -312 46 327 76 -284 -188 276 266 -131 -308 43 329 25 -340 -157
3946 -157 267 236 -198 -338 89 324 23 -307 -128 265 177 -220 -296 147 324 -12 -336 -95 327 185 -235
3967 -235 -259 189 318 -41 -323 -37 322 141 -267 -229 164 302 -97 -348 -35 314 108 -302 -223 228 279
3988 279 -153 -351 3 335 47 -332 -216 262 269 -177 -309 85 344 69 -316 -143 286 235 -214 -304 122
4009 122 329 -2 -341 -130 301 206 -248 -277 133 335 -49 -328 -54 320 154 -276 -242 192 271 -69 -335
4030 -335 -32 304 130 -299 -222 194 290 -106 -328 3 314 86 -300 -194 249 273 -173 -320 62 323 43
4051 43 -307 -149 247 247 -162 -308 79 318 -1 -310 -123 267 215 -212 -272 121 304 -31 -315 -96 270 186
4073 186 -206 -245 115 281 -26 -319 -51 295 150 -253 -207 162 279 -94 -289 -22 259 124 -250 -187 201
4094 201 254 -98 -308 48 303 98 -264 -170 241 234 -164 -298 39 309 43 -302 -159 183 205 -183 -310 64
4116 64 304 22 -326 -127 254 199 -212 -260 116 279 10 -285 -81 260 195 -209 -250 149 308 -33 -316 -46
4138 -46 304 156 -252 -201 180 255 -67 -279 -20 293 115 -251 -218 178 249 -124 -301 14 315 75 -296 -149
4160 -149 224 225 -154 -272 52 281 41 -265 -131 223 213 -200 -270 84 318 -14 -290 -104 271 182 -195 -241
4182 -241 107 271 -44 -281 -52 274 141 -238 -238 151 302 -82 -312 -20 288 106 -285 -199 185 258 -131
4203 -131 -285 -2 273 87 -279 -197 195 257 -160 -299 58 296 46 -275 -125 243 195 -122 -256 80 306
4224 306 54 -277 -121 242 199 -157 -269 103 269 -11 -299 -64 243 134 -196 -226 95 226 -42 -282 -63
4245 -63 255 132 -230 -195 164 253 -59 -253 -25 271 105 -229 -132 148 262 -83 -260 8 273 97 -262
4266 -262 -159 208 217 -152 -244 44 292 16 -248 -117 184 156 -147 -267 35 249 36 -291 -122 229 167 -178
4288 -178 -237 114 255 -24 -254 -36 221 151 -214 -210 106 237 -49 -270 -59 269 155 -236 -204 197 244 -91
4310 -91 -271 -19 269 76 -255 -175 174 249 -111 -271 24 279 83 -242 -140 199 202 -165 -239 75 255 28
4332 28 -290 -141 197 191 -136 -246 94 264 -3 -286 -102 241 181 -180 -194 120 247 -28 -255 -29 243 127
4354 127 -183 -206 140 234 -34 -281 -44 263 85 -219 -169 200 216 -91 -263 18 228 59 -233 -147 160 195
4376 195 -110 -228 41 266 40 -228 -113 211 163 -133 -208 80 228 18 -221 -75 232 150 -150 -208 72
4397 72 231 -51 -236 -49 216 119 -178 -191 116 202 -45 -214 -39 208 115 -186 -188 123 220 -78 -246 -22 227
4420 227 94 -184 -139 149 177 -92 -228 3 228 79 -212 -127 163 188 -99 -223 24 240 10 -217 -83
4441 -83 186 159 -123 -177 44 224 21 -215 -81 192 165 -150 -230 81 223 -18 -244 -45 206 80 -174 -191
4463 -191 116 217 2 -215 -43 213 113 -197 -192 144 220 -68 -244 -6 239 82 -192 -143 152 181 -67 -223
4485 -223 19 230 84 -214 -121 180 169 -119 -225 62 225 23 -244 -78 176 148 -157 -202 79 230 -5
4506 -5 -242 -110 205 131 -176 -180 122 255 -31 -233 -29 186 114 -164 -156 112 203 -51 -235 -40 235 84 -205
4529 -205 -159 130 159 -127 -227 27 208 7 -188 -97 152 147 -88 -225 26 210 48 -206 -82 205 174 -133
4551 -133 -170 60 188 0 -196 -82 176 141 -122 -181 51 189 -18 -229 -72 213 101 -170 -145 105 173 -42
4573 -42 -198 -37 165 100 -158 -130 86 178 -54 -220 -1 199 87 -180 -144 145 166 -88 -204 39 186 50
4595 50 -136 -101 122 179 -47 -196 41 190 27 -183 -67 154 119 -105 -165 78 182 49 -186 -69 139 130
4617 130 -116 -220 60 184 0 -213 -81 191 120 -147 -149 72 163 -55 -192 -50 193 98 -130 -143 98 191
4639 191 -33 -231 4 219 69 -185 -107 124 160 -96 -199 19 196 35 -189 -113 124 158 -105 -199 33 189
4661 189 -1 -227 -108 167 136 -136 -169 62 156 20 -186 -84 163 104 -140 -155 96 226 -62 -194 3 195
4683 195 89 -173 -108 102 150 -48 -178 -21 173 67 -158 -140 133 163 -75 -196 2 179 27 -164 -73 137
4705 137 118 -100 -160 37 181 25 -151 -95 135 137 -101 -183 94 169 -16 -167 -17 161 103 -122 -128 68 131 -4
4729 -4 -161 -47 147 141 -119 -123 94 148 -51 -188 -11 158 54 -106 -98 95 129 -35 -146 -44 142 53 -155 -131
4753 -131 104 130 -72 -157 4 156 26 -132 -67 120 109 -54 -133 22 142 61 -120 -92 124 145 -70 -145 46
4776 46 158 -7 -166 -32 145 101 -90 -138 45 152 1 -178 -70 142 102 -122 -162 100 137 -38 -158 3
4798 3 185 62 -141 -104 88 147 -30 -167 -5 188 94 -153 -106 126 140 -98 -170 28 172 11 -165 -91 110
4821 110 120 -64 -177 -1 173 27 -187 -97 167 115 -118 -142 90 150 -12 -156 -29 135 79 -104 -116 52
4843 52 168 -17 -174 -26 178 65 -150 -106 135 146 -70 -146 18 132 53 -112 -85 89 132 -49 -147 24 165
4866 165 15 -138 -72 115 101 -72 -132 53 134 27 -123 -49 98 103 -71 -143 50 141 -54 -172 -38 141 76
4889 76 -115 -90 73 120 -12 -100 -24 123 80 -83 -113 77 130 -26 -146 -26 157 43 -131 -82 82 92 -31
4912 -31 -118 18 108 45 -123 -111 76 95 -58 -147 6 123 23 -138 -60 100 91 -50 -99 -10 97 27 -95 -62 86
4937 86 149 -59 -122 31 155 -3 -142 -38 114 65 -123 -78 53 114 -6 -137 -70 95 98 -86 -125 64 147 -6
4961 -6 -139 -6 153 93 -129 -67 57 116 5 -102 -19 129 90 -153 -110 95 127 -54 -149 32 137 17 -144
4984 -144 -70 109 79 -88 -126 38 149 36 -140 -86 121 107 -103 -137 60 126 -41 -159 -17 113 53 -128 -90
5007 -90 56 113 -3 -128 -28 133 52 -135 -85 75 106 -45 -139 12 130 16 -110 -54 92 87 -60 -100 -8 111
5031 111 24 -101 -49 111 76 -90 -102 31 91 -42 -115 -30 96 67 -61 -87 17 115 16 -114 -45 89 62 -87
5055 -87 -89 85 79 -23 -69 -3 66 47 -43 -79 55 84 -4 -107 -18 104 89 -105 -94 71 86 -59 -99 8 79 24 -81
5082 -81 -57 29 40 -4 -96 -13 107 41 -118 -70 97 93 -46 -88 39 129 10 -84 -48 70 90 -28 -125 -12 116 28
5108 28 -121 -45 122 74 -69 -92 51 71 -12 -116 -30 90 73 -68 -100 27 124 9 -143 -39 152 57 -112 -77
5132 -77 90 121 -56 -112 1 87 32 -101 -68 83 138 -45 -138 9 145 13 -131 -55 99 72 -72 -103 33 122
5156 122 8 -94 -31 93 80 -82 -125 36 141 -25 -160 1 120 43 -95 -71 93 78 -49 -88 -21 82 31
5179 31 -83 -70 69 93 -38 -128 25 129 5 -123 -13 94 52 -47 -70 22 82 16 -68 -35 63 96 -62 -100 32
5204 32 99 -15 -116 -10 74 24 -69 -49 5 79 6 -77 -20 56 60 -73 -97 38 82 -26 -93 -23 101 14 -40 1 27
5231 27 64 6 -92 -25 54 55 -79 -80 41 75 -23 -84 27 71 47 -56 -24 10 51 -25 -82 -21 97 40 -61 -61 55 106
5259 106 -34 -103 17 65 -11 -86 -49 83 65 -25 -89 -8 67 43 -91 -44 87 90 -72 -115 71 114 -19 -87 -16 84
5285 84 55 -72 -81 14 101 11 -100 -33 104 74 -89 -96 81 79 -67 -94 30 92 -13 -94 -45 46 62 -29 -83 18 130
5312 130 48 -103 -43 118 98 -75 -89 45 103 -22 -69 -2 74 43 -89 -93 16 97 31 -110 -33 120 15 -113 -50
5337 -50 79 65 -66 -73 28 76 9 -55 -18 50 70 -33 -100 24 91 30 -77 -10 103 57 -68 -45 23 66 -32 -67 -13
5364 -13 18 48 -36 -86 22 98 0 -99 -35 96 25 -62 -24 43 28 -29 -29 -24 31 23 -24 -46 3 69 16 -78 -13 75 28 -51 -48
5395 -48 17 14 -45 -38 -27 40 42 -41 -53 18 81 -12 -74 -20 76 14 -63 -36 40 31 -50 -26 -7 26 46 -57 -75 14 105 5 -92
5426 -92 10 106 14 -83 -62 64 46 -42 -66 17 58 16 -45 -72 62 65 -26 -113 32 126 -15 -115 -11 94 28 -46 -51
5453 -51 12 55 -12 -47 -8 73 25 -57 -94 56 75 -32 -120 -20 98 11 -90 -22 89 59 -53 -68 15 56 35 -78
5479 -78 -51 74 71 -58 -86 36 101 -44 -103 30 92 3 -50 -10 24 58 -4 -84 -22 84 34 -85 -83 90 74 -25 -75
5506 -75 55 51 -11 -70 -36 44 25 -21 -47 -16 58 32 -54 -26 59 55 -56 -48 27 24 -19 -39 22 42 -1 -14 -33 -18 15 31 -47
5537 -47 -15 47 37 -44 -56 30 53 -43 -45 37 12 12 -4 -7 -10 34 3 -19 -44 12 33 -69 -42 32 45 -26 -8 9 26 17 -5 -28
5569 -28 -17 27 32 -72 -13 65 49 -58 -55 36 42 -19 -49 -1 61 -9 -33 -34 -21 34 2 -64 -71 60 37 -61 -68 44 60 -34 -69
5600 -69 32 55 8 -55 -33 31 60 -9 -64 -6 84 -3 -92 -47 71 30 -78 -69 51 48 -37 -69 18 53 0 -64 -60 18 58 -23
5630 -23 -101 -5 92 -19 -85 -14 86 32 -51 -47 51 61 7 -28 -8 45 61 -24 -56 45 103 10 -95 10 83 9 -74 -48
5658 -48 45 12 -44 -52 22 46 3 -36 -58 34 78 -29 -82 63 64 8 -79 -3 30 -1 -49 -18 21 22 7 -19 -18 18 47 -12 -48
5689 -48 33 55 -22 -33 4 57 -10 -12 9 -10 15 -8 -10 -26 9 31 -34 -31 15 51 -25 -52 -2 12 -13 -26 -4 -16 -11 10 -39 -20
5721 -20 -3 36 -4 -55 33 45 -3 -39 -2 55 -6 4 -9 -2 10 -8 -17 -17 25 57 -25 -88 27 100 -13 -59 12 45 6 -42 -7
5752 -7 17 42 8 -19 -25 31 42 -46 -68 55 96 -42 -46 35 108 -26 -51 6 48 29 -13 -43 -2 76 10 -74 -49 73 69 -68
5782 -68 -65 69 72 -39 -82 18 79 -14 -67 -27 21 40 -17 -53 -25 93 29 -68 -15 61 68 -59 -44 47 76 -20 -18 39 52 13
5812 13 -25 -50 20 79 4 -77 -7 103 31 -80 -28 69 59 -44 -37 37 28 -10 -24 -10 25 34 10 -47 5 53 8 -62 11 69
5842 69 14 -80 -11 61 -7 -43 -15 2 -7 12 -10 -26 4 51 -6 -36 -2 60 12 -56 -5 42 6 -33 17 6 -12 -18 -7 -44 -12
5873 -12 51 14 -46 -18 21 -8 -27 -7 17 -8 -6 24 -8 22 34 9 -64 -12 20 45 -34 -24 53 9 -35 -15 33 -5 5 19 -5
5904 -5 13 55 8 -41 -18 61 10 -51 -12 58 -6 -37 -29 14 38 -17 -22 -10 34 29 -29 -33 27 80 -11 -66 -15 100 22 -86 -9 57
5936 57 34 -39 -30 26 33 0 -8 -22 45 53 -14 -73 53 83 -19 -75 29 113 -11 -59 5 55 13 -37 -12 4 51 39 -41 -59
5966 -59 50 59 -76 -62 50 72 -60 -68 21 38 -20 -31 0 50 41 2 -20 7 35 24 -65 -28 56 42 -65 -45 57 63 -18
5995 -18 -41 56 34 17 -16 -6 0 19 18 -44 -24 46 26 -59 -54 66 -5 -66 -38 36 14 -20 7 12 -9 -4 -13 -12 -22 8 4 -19 -10 32
6029 32 20 -28 10 30 -17 -19 -4 9 -26 8 22 -28 -26 25 53 -43 -37 30 -2 -10 -15 -29 -1 -2 2 -25 -24 24 53 -33 -40 62 36 -19
6063 -19 -32 59 44 -23 -15 4 25 16 7 -40 -10 34 53 -51 -29 52 54 -43 -69 38 56 -39 -25 43 35 11 -16 -12 21 22 8 -54 7
6096 7 66 30 -77 -19 63 34 -57 -50 64 52 -47 -43 18 22 39 -22 -42 31 61 -17 -65 -13 64 3 -71 -11 73 16 -57 -33 35
6127 35 28 6 -33 -27 31 7 -21 -40 13 60 -27 -82 22 87 5 -77 20 61 -9 -53 -2 22 20 -5 -1 -22 71 44 -18 -48 65
6158 65 79 -41 -44 21 55 -43 -44 19 9 -14 -2 -1 -38 18 18 -26 -51 9 41 -33 -35 -3 21 -25 -15 30 32 -14 6 20 38 -32 35
6191 35 18 -4 8 34 -8 -22 36 -14 -30 -11 26 -30 -15 -3 5 -5 -22 26 1 -47 -14 35 -6 -21 -3 16 -16 2 -4 -21 -2
6222 -2 19 13 -23 -5 44 3 -43 31 60 -1 -37 -21 55 13 -29 -4 1 6 -6 -14 -18 34 58 -24 -68 -8 58 -31 -78 37 52 -17 -44
6255 -44 4 37 3 -15 -23 -16 51 48 -34 -42 34 44 -53 -69 44 71 -24 -48 19 70 1 -37 -6 20 1 -9 -19 1 59 1 -36 -49
6287 -49 64 48 -43 -31 41 41 -34 -25 14 30 -5 -19 -10 2 26 0 -47 -1 68 19 -63 -19 70 11 -47 2 62 21 -28 -33 -17 48
6319 48 31 -13 -16 17 49 -18 -28 4 63 -5 -36 -13 56 -26 -37 3 23 -23 -33 1 4 16 0 5 -26 0 10 -30 -15 13 19 -23
6351 -23 -25 1 28 -14 -15 18 -19 -23 27 22 -20 -9 33 -6 -38 29 -3 -25 4 19 -7 -5 -1 38 -19 -25 31 60 -20 -7 7 18 -14 -18
6385 -18 4 14 -7 3 -14 -29 34 22 -31 -7 48 9 -57 -57 34 26 -25 -61 38 19 -19 -23 -18 42 37 22 -45 7 68 -9 -48 -21 52
6418 52 -5 -59 -20 43 14 -69 0 15 14 -6 -47 -22 -1 51 -30 -58 31 59 -29 -75 -12 78 -13 -71 3 44 2 -29 -1 14 10
6449 10 13 -24 -47 46 73 -66 -64 33 59 -51 -68 18 65 -11 -54 -11 21 -1 -20 -13 14 13 23 -46 1 34 27 -30 -29 48 25 -33
6481 -33 -36 17 35 -27 -24 3 -10 2 21 -6 12 13 29 -28 -2 43 7 -33 3 37 7 -40 -5 45 -8 -30 10 -2 -10 -6 10 -30 -29
6514 -29 56 -12 -37 -8 33 -1 -35 17 10 -46 3 25 7 -56 -8 50 5 -12 17 -15 -14 -12 -3 -23 -1 27 0 -49 14 28 -16 -50
6546 -50 32 15 -15 -22 8 41 -15 -31 29 -11 19 -4 -24 -22 -15 9 -25 -52 37 43 -37 -44 32 41 -42 -36 8 16 9 -1 -27 -2 12 0 -53
6581 -53 -17 35 3 -46 -19 31 2 -63 -19 40 11 -23 -23 -2 9 13 12 -28 1 31 21 -55 3 46 8 -64 -11 53 11 -51 -7 60
6613 60 55 -10 -6 12 7 13 -18 -21 -2 31 -21 -53 4 55 -15 -22 9 29 -23 -31 -6 52 -7 -12 -16 -4 13 13 -29 -27 25 30 -26 -48 20 35
6649 35 -32 -33 15 -8 -16 9 -9 17 31 20 1 -16 19 26 -26 -13 6 8 -42 -16 40 16 -52 2 36 0 -35 1 35 22 -19 -3
6681 -3 14 -8 -12 6 -30 -13 31 -37 -40 4 21 -6 -32 13 4 -34 2 6 34 -22 -13 -7 -14 10 17 -40 -7 46 18 -50 -24 32 4 -42 -28
6716 -28 34 10 -43 -16 12 7 -1 -18 -15 12 0 -8 -31 3 28 -21 -46 20 71 -13 -63 8 58 5 -19 13 30 11 -15 -22 -14 9 30
6749 30 -25 -12 36 19 -15 -57 39 48 -10 -10 14 23 -1 11 6 16 10 -8 -14 -11 40 31 -20 -37 37 41 -35 -39 49 24 -26 -25 14 25 -16 -23
6785 -23 -26 11 20 -28 -28 -6 36 3 -54 5 35 6 -54 -21 36 -1 -6 -18 5 -25 -22 -14 -24 6 10 -21 -35 25 24 -18 -48 22 7 -18
6819 -18 -34 4 3 -31 -45 25 -41 -2 5 -25 14 3 26 -18 -2 23 32 -10 8 45 30 -30 -6 2 24 -17 3 13 -7 -31 3 0 -4
6852 -4 -4 6 -13 9 16 1 -21 4 33 -16 -16 16 40 -3 13 12 11 -9 3 6 17 18 8 -11 -17 12 50 -49 -2 16 12 -64 -33 37 24
6887 24 -10 -29 36 7 5 7 5 17 29 2 10 11 69 3 -57 14 40 -10 -29 8 74 16 -20 17 35 14 -6 4 -6 8 34 -43 -44
6920 -44 20 54 -16 -28 9 45 -4 -56 16 35 8 -36 4 8 -2 -13 -10 -16 39 43 -21 -38 44 10 -5 -31 26 19 -24 -38 -3 34 0
6953 0 -34 -32 15 -5 20 -41 -18 39 31 -26 -4 44 14 -36 -27 17 -12 -19 -35 -11 -1 -13 -11 -21 17 18 5 -33 4 17 -18 -16 22 68
6987 68 -26 -17 -2 22 15 -18 4 22 7 -2 0 -6 15 18 17 -35 5 22 -22 -6 17 7 14 -20 37 -1 -56 10 12 -7 1 14 -5 -14 -1 28
7023 28 -13 11 41 25 -1 -12 25 -10 -12 -6 32 4 -1 20 32 -7 -14 -7 7 20 8 -7 -10 27 23 -19 -34 27 24 -16 -27 23 -2 5 -13
7058 -13 25 -1 -18 -14 9 17 20 23 0 17 18 5 -13 -21 40 30 -37 8 26 26 13 -22 21 17 -10 -1 -17 8 3 1 -18 6 42 18 -37 -5
7094 -5 24 39 -18 -4 28 2 -23 -23 5 4 11 7 -3 -1 20 -16 -38 26 3 -3 -25 14 17 -7 -20 2 11 -11 -2 21 -4 25 -3 -1 -23 23
7130 23 -19 -5 -30 17 31 -20 -48 25 30 -25 -12 22 26 -25 8 -3 4 -7 21 -12 -15 22 14 -15 5 29 15 -36 9 13 11 -7 9 34
7164 34 -8 25 18 0 18 -11 -1 -15 -16 18 -9 -18 22 16 -16 -35 7 11 -41 1 1 16 -17 -9 12 -15 2 17 4 7 10 5 -24 -7 47
7199 47 -16 -36 15 16 12 -28 -10 9 21 -27 -13 12 8 13 -11 -12 -4 48 23 -9 9 25 -13 -17 33 29 -8 -12 -16 16 -7 -7 -3 -23 14 47
7235 47 -29 -21 26 36 -34 -49 9 33 -6 -46 11 16 -4 -8 -5 22 0 -4 15 -19 9 10 -11 5 13 28 -35 -44 26 11 -20 -15 10 26 -7
7270 -7 -22 15 0 5 -13 5 -5 28 11 -14 8 34 9 -22 4 51 -10 -34 42 26 2 -1 -37 -29 16 8 -3 -19 20 16 -10 -18 -5 1
7304 1 -27 -24 31 3 3 -13 4 -10 11 -15 6 17 13 3 -7 -9 9 4 -12 10 11 31 -6 -12 -6 -10 -3 2 -8 11 21 -19 18 -7 5 -1 -36
7341 -36 1 28 23 -19 0 31 2 -28 24 26 -5 -4 4 10 -6 -12 -5 -5 -22 29 -9 3 12 7 -15 4 -2 25 -15 0 2 4 -28 -40 3 14 2
7378 2 -21 -14 20 27 13 -1 9 38 -11 -8 -11 17 7 -11 9 26 0 -33 -4 2 -1 1 18 20 -1 8 -16 -21 -8 13 -3 -23 7 25 -9 3
7414 3 -8 29 -18 -31 -3 19 20 9 -14 0 21 10 1 -16 21 26 -20 -13 27 34 -39 -12 15 32 -14 -16 -17 -14 2 14 -11 -17 19 -20 0
7449 0 9 22 22 -21 -16 31 16 1 -12 4 28 2 10 6 -6 -4 -9 -4 6 16 9 0 -9 15 11 -34 8 9 4 -14 -3 3 2 -11 17 15 -4 18 -6
7488 -6 -8 4 7 -5 -12 10 -3 -3 -17 -13 14 11 0 25 -17 -6 0 6 -39 5 33 -7 8 10 -3 -24 12 34 -2 -14 -12 7 15 -18 13 13 7
7525 7 2 0 26 -7 16 19 -2 11 16 -16 -14 -9 32 -3 -13 2 32 9 -13 4 5 -14 13 0 -16 21 -1 -6 -2 12 23 -12 -30 12 -1
7560 -1 -8 -7 12 -9 -17 -23 2 13 9 -16 -19 2 22 9 -7 -6 17 -8 -25 20 23 27 -13 -12 21 12 7 -18 -8 30 3 -5 -13 3 0 -6 -10 3 5 -3
7600 -3 -26 -7 25 -11 8 14 -9 -7 14 13 15 13 21 -23 -10 15 11 -18 -8 21 6 -10 -21 8 8 6 13 -4 11 3 -7 -36 15 1 -6 -11 11
7637 11 15 7 -4 -7 13 25 -19 2 15 22 0 3 32 2 5 10 -1 -18 21 -1 -14 1 16 -16 -6 -7 20 2 -14 30 10 -18 -14 14 -10
7672 -10 35 -13 -13 -25 22 26 -6 17 16 2 -24 -36 0 3 -5 -11 3 18 -27 0 19 18 7 23 2 -20 -11 5 -4 29 19 -16 -18 -1 19
7707 19 -2 -19 10 14 -7 12 4 -4 -3 -15 16 20 -1 20 -2 3 -23 19 -21 -8 -1 35 -2 -22 12 -7 -20 -26 9 20 -15 7 -9 4
7741 4 32 3 -1 -15 -5 35 -11 -7 18 -16 -20 15 -7 -3 -24 -1 -8 -4 2 8 -11 10 0 0 2 -8 10 -6 -36 6 10 16 -3 -22 -6 5 7
7778 7 -7 -6 9 19 -4 -2 6 8 4 35 4 -15 -5 -7 -3 9 8 7 6 2 20 35 17 19 -21 22 3 -18 -13 -7 -9 -10 8 10 -29 -9 18 -30 -11
7817 -11 -13 -5 -14 -21 -7 -14 -5 7 24 1 -8 -6 -14 5 23 26 15 11 10 17 -6 -11 1 17 -6 21 12 -12 8 -18 2 -9 22 15 1 -6 25 6 -3
7856 -3 -17 31 21 -11 -11 10 8 4 3 -22 13 4 -2 11 -4 11 -4 10 9 1 -7 14 -1 4 17 -13 -5 13 -10 -6 -29 -17 12 17 18 26 17 2 -31
7895 -31 -4 26 4 6 6 -2 1 11 5 13 16 35 -3 4 -1 -16 -1 -19 15 13 4 -4 -16 25 5 -20 6 32 29 2 11 -1 32 -24 25 4 25
7932 25 -3 3 11 3 22 -2 10 -35 20 3 -27 -23 4 14 -10 -14 5 0 15 3 3 -17 10 4 8 17 11 21 -1 27 -2 26 6 26 12 14
7968 14 -13 15 -6 12 -10 -11 14 -22 -11 36 8 12 5 -1 4 18 5 20 -2 16 13 25 28 -10 6 2 15 -2 20 0 26 -9 8 -1 9
8003 9 23 16 22 7 -11 12 2 -18 -26 9 12 1 5 4 18 9 -11 7 17 -17 -9 17 27 -7 17 2 -18 -5 7 26 8 -5 20 9 23
8038 23 18 1 0 25 18 26 5 9 -15 5 -11 10 6 12 3 4 19 -1 6 -3 7 1 -9 11 -19 22 38 8 -14 2 19 -20 -4 -16 5 -11
8074 -11 7 -3 -24 4 -14 17 23 -9 0 16 -3 17 13 6 5 -4 5 1 6 6 -16 -5 -9 8 1 -29 -8 -7 -9 -12 4 16 -14 10 6 16 19 -1 -27
8113 -27 -13 -9 6 -2 4 23 -1 4 -16 5 15 10 8 -16 2 16 9 5 15 -10 9 32 -1 3 19 -2 -17 -7 24 11 -15 -4 -13 -3 11
8148 11 -2 5 30 -21 6 11 28 -2 0 43 3 16 -12 2 25 12 17 9 -1 -4 0 24 -7 -16 13 23 -5 19 2 2 5 -13 16 -9 -8 -2
8184 -2 1 9 -5 10 0 -3 -35
8191c5
$$ Imaginary data points
##PAGE= N=2
##DATA TABLE= (X++(I..I)), XYDATA
0 0 0 0 0 0 0 0 0 0 0 0 0 8 -8 8 -8 14 -16 16 -24 25 -32 40 -48 56 -64 77 -89 102 -118 137 -154 177 -201
33 -201 227 -256 289 -327 364 -407 455 -506 562 -624 691 -765 842 -931 1027 -1132 1247 -1373
51 -1373 1513 -1668 1841 -2035 2252 -2498 2781 -3112 3496 -3961 4526 -5236 6161 -7413 9213
66 9213 -12041 17142 -29169 116871 -48531 -314800 63873 249846 -5622 -206831 -22343
77 -22343 120171 73784 -44133 -104019 -45056 140682 113448 -157813 -176805 169719 210801
88 210801 -162026 -228741 146017 218432 -113383 -192764 73947 147161 -25064 -94424 -23698
99 -23698 35678 73327 19612 -114432 -67897 147842 103711 -166703 -125118 172352 130714
110 130714 -161827 -121695 138065 100216 -102326 -70843 58171 36425 -10804 -3378 -36223
121 -36223 -25748 77466 46203 -110242 -57344 130645 57426 -137921 -47769 132184 30839
132 30839 -113992 -8945 86926 -13345 -53193 33697 18114 -47582 15880 54130 -44372
143 -44372 -51324 65232 39733 -76689 -20782 77950 -3943 -70730 30218 55391 -56100
154 -56100 -35812 77028 13734 -91237 6682 95719 -23506 -89840 34291 73977 -37293
165 -37293 -48662 33161 17270 -21654 18222 5893 -52901 13037 84377 -31165 -108436 46058
177 46058 122638 -55220 -125628 56396 116394 -49514 -96801 33685 67539 -11546 -32798
188 -32798 -15544 -4959 43725 41537 -70205 -73813 91299 98976 -103915 -114477 106616 120113
200 120113 -97580 -114836 77873 100631 -47957 -78121 11447 50538 28817 -20136 -68600
211 -68600 -10446 103501 38293 -130212 -61837 144846 78454 -146531 -88297 133541 90069
222 90069 -107559 -85026 70317 73722 -25573 -57909 -22222 39635 68879 -20041 -108918 1757
234 1757 139192 14781 -155855 -27739 158107 37422 -145184 -43342 118775 45836
244 45836 -81774 -45907 37591 43592 8610 -40257 -53173 35514 90867 -30506 -118975 24801
256 24801 134602 -18669 -136889 12060 126186 -4629 -103607 -2878 72644 11375 -35815
267 -35815 -19385 -1967 27602 37699 -34691 -67102 40490 87805 -44371 -98227 45433
278 45433 97302 -43992 -86497 39138 66828 -31737 -41992 21287 14279 -9109 12214 -4317
290 -4317 -34660 17875 50730 -30295 -58435 40838 57968 -47817 -49103 51438 34395 -50551
302 -50551 -15384 45935 -4575 -37537 23056 26494 -37470 -14015 45576 745 -46836 11261
314 11261 40278 -21860 -27578 29347 9426 -34108 11131 35530 -31875 -34007 50074 30218
326 30218 -62983 -24462 69257 18213 -66939 -11433 56750 5691 -38661 -846 15011 -2378
338 -2378 11974 4055 -39423 -4626 63905 4033 -83207 -3579 94261 3066 -96352 -3891
350 -3891 88281 5663 -71291 -9112 46652 13883 -16728 -19334 -15121 25161 46268 -29832 -72907
363 -72907 33072 93266 -33112 -104492 29994 106131 -22960 -97829 12309 80458 1145
374 1145 -56018 -16736 26384 32397 4800 -47124 -35252 58614 61462 -65973 -81532 67661
386 67661 93349 -63149 -96053 52714 90023 -36569 -75653 16483 55307 6455 -30701
397 -30701 -29400 5039 50947 19595 -68443 -40562 80280 56089 -85202 -65285 82268 67298
409 67298 -72096 -63298 54727 53442 -32568 -40006 6957 24156 19110 -8126 -43495 -6502
421 -6502 63847 18744 -77784 -27046 84658 31699 -83098 -32001 74155 29206 -58175 -23471
433 -23471 37380 16347 -13769 -8938 -10294 2119 32230 2812 -50298 -5834 62108 5973
445 5973 -67529 -4133 65578 250 -57317 4542 43668 -9342 -26417 13336 7899 -15187
457 -15187 10279 15010 -25476 -11841 36751 6501 -42411 1123 42646 -9715 -37401 18403
469 18403 27705 -26280 -15258 31943 1525 -35138 11146 34732 -21659 -31300 27988 24440 -29769
482 -29769 -15102 26540 3919 -18765 8094 7670 -19529 5588 29855 -18690 -37467 30424
494 30424 42240 -38552 -43155 42201 40553 -40412 -34489 33104 25431 -21055 -14653 5005 2666
507 2666 12694 8824 -30832 -19591 46550 28018 -58402 -33952 64581 36995 -64115 -37014
519 -37014 56878 34526 -42962 -29494 24126 23248 -1584 -15671 -21836 7949 44151 -245 -62746
532 -62746 -6922 75562 13104 -81432 -18408 79157 22165 -69365 -24919 52401 26036 -30450
544 -30450 -26112 5313 24920 20325 -22609 -43913 19477 63308 -15368 -76269 10827 82089
556 82089 -5429 -79646 -82 69904 6048 -53522 -11907 32538 17589 -9107 -22818 -14546
568 -14546 26964 35699 -30085 -52969 31131 64101 -30380 -68804 27122 66434 -21684 -57864
580 -57864 14117 44171 -4819 -26868 -5187 8307 15504 9985 -24708 -25718 32422 37814 -37332
593 -37332 -44802 39375 46629 -38085 -43267 33438 35361 -26153 -24485 16473 11627 -5770 950
606 950 -5460 -12353 15801 20790 -24720 -25651 31128 26497 -34589 -23292 35026 17064 -32091 -8287
620 -8287 26693 -1144 -18853 10396 9990 -17705 -648 22326 -7996 -23492 15127 20860 -20186
633 -20186 -15039 22476 6223 -22396 3883 19597 -14597 -15176 24075 9457 -31331 -3521 35278
646 35278 -1826 -35160 6070 31152 -8286 -23104 8742 12281 -6998 721 3925 -14121 277
659 277 26768 -4765 -37216 8681 44109 -11599 -46941 12481 44911 -11515 -38711 8003
671 8003 28297 -2767 -15151 -4057 283 11602 14737 -18942 -28383 25262 39576 -29251 -46795
684 -46795 30654 49884 -28489 -48137 23139 42217 -14495 -32469 3476 20062 8839 -6281
696 -6281 -21429 -7728 32508 20313 -41297 -30869 46174 37973 -46987 -41609 43000 41273 -34670
709 -34670 -37293 22761 30451 -8159 -21204 -7358 11112 22806 -647 -36089 -8717 46435
721 46435 16642 -52295 -22179 53403 25232 -49428 -25805 40696 23971 -28272 -20576 12939
733 12939 15719 3310 -10669 -19397 5478 33310 -957 -43969 -2675 50218 5290 -51414
745 -51414 -6667 47775 7348 -39374 -7103 27672 6639 -13471 -5894 -1199 5380 15117 -5095
758 -5095 -26793 5131 34992 -5657 -39268 6215 38988 -6990 -34855 7380 27137 -7506
770 -7506 -17269 6865 6138 -5502 4697 3391 -14069 -468 21194 -2804 -24972 6589 25588
783 25588 -9934 -22716 13000 17139 -15041 -9554 16015 1038 -15663 7151 13897 -14171 -11051
796 -11051 18752 6990 -20668 -2511 19299 -2332 -15049 6723 8307 -10593 -13 13482
808 13482 -8643 -15073 16833 15597 -22990 -14715 26790 13062 -27056 -10341 24156 7306 -17944
821 -17944 -3993 9196 732 1006 2042 -11901 -4533 21885 6235 -30211 -7573 35424 8157
834 8157 -37312 -8480 35169 8440 -29352 -8197 20325 8021 -8707 -7662 -3942 7558 16783
847 16783 -7095 -28054 6642 36965 -5637 -42242 4173 43487 -2112 -40519 -666 33503
859 33503 3823 -23379 -7506 10868 10992 2316 -14385 -15277 16871 26404 -18303 -34820 18298
872 18298 39706 -16615 -40554 13534 37702 -8798 -31165 3114 22176 3391 -11284 -9917
884 -9917 5 16122 10773 -21239 -20043 24669 26787 -26243 -30682 25320 31263 -22365 -29007 17050
898 17050 23902 -10206 -16944 2136 8870 6241 -629 -14218 -6886 21165 13076 -25942 -17055 28589
912 28589 18974 -28319 -18352 25541 15896 -20334 -11826 13327 6786 -5294 -1724 -3099 -3005 10722
926 10722 6582 -17207 -8827 21590 9331 -23736 -8332 23402 5954 -20745 -2673 16258
938 16258 -964 -10267 4513 3799 -7201 2770 8953 -8424 -9191 12858 8050 -15380 -5503 15902
952 15902 1892 -14551 2303 11315 -6773 -7037 10620 1901 -13746 2965 15324 -7295 -15410
965 -15410 10221 13699 -11510 -10457 10978 5993 -8571 -508 4848 -4957 -47 10367 -4857
978 -4857 -14702 9560 17867 -13071 -19272 15012 18904 -15014 -16858 12880 13191 -9021 -8503 3440
992 3440 2938 2836 2575 -9467 -7994 15450 12465 -20140 -15800 22983 17725 -23348 -18067 21284
1006 21284 17041 -16652 -14457 10142 11054 -2021 -6796 -6592 2374 15017 1965 -22302 -5902
1019 -5902 27443 8933 -30142 -11167 29662 12236 -26389 -12469 20246 11628 -12132 -10154
1031 -10154 2689 8199 7086 -5921 -16140 3656 23705 -1342 -28807 -663 31232 2528
1043 2528 -30494 -4022 26923 5331 -20747 -6342 12709 7055 -3678 -7656 -5549 7907 13936
1056 13936 -8009 -20854 7604 25383 -6976 -27412 5822 26604 -4301 -23182 2455 17633
1068 17633 -166 -10463 -2148 2790 4653 4932 -6855 -11549 8808 16621 -10158 -19565 10809
1081 10809 20152 -10677 -18505 9613 14837 -7833 -9889 5289 4046 -2457 1619 -828 -6716 3929
1095 3929 10533 -6682 -12762 8891 13197 -10157 -11808 10682 9026 -10031 -5000 8702 638
1108 638 -6496 3820 3935 -7574 -1129 10203 -1612 -11443 3878 10931 -5709 -9003 6606 5511
1122 5511 -6881 -1270 6233 -3499 -5071 8010 3409 -11809 -1552 14368 -122 -15186 1650
1135 1650 14337 -2460 -11601 2818 7514 -2390 -2284 1491 -3341 -103 8832 -1419 -13654 2764
1149 2764 17076 -3855 -18952 4220 18761 -4021 -16844 2840 13078 -1094 -8081 -1296
1161 -1296 2257 3964 3884 -6499 -9649 8802 14578 -10250 -17980 10860 19837 -10137 -19598 8363
1175 8363 17635 -5433 -14005 1662 9058 2554 -3447 -6949 -2397 10809 7710 -14038 -12247 15874
1189 15874 15332 -16380 -16911 15192 16744 -12487 -15071 8486 12143 -3374 -8155 -2071 3884 7612
1203 7612 544 -12441 -4490 16308 7777 -18605 -10026 19152 11120 -17919 -11226 14880 10207
1216 10207 -10504 -8504 5001 6117 834 -3647 -6632 1046 11696 1234 -15574 -2989 17939
1229 17939 4244 -18364 -4729 17115 4712 -14012 -4038 9811 3148 -4650 -2055 -744 1038
1242 1038 5782 -227 -10106 -306 13078 414 -14640 -252 14443 -322 -12828 884 9818
1255 9818 -1576 -5979 2037 1747 -2246 2531 2152 -6078 -1653 8873 912 -10257 228 10450
1269 10450 -1308 -9187 2586 6917 -3615 -3800 4404 317 -4894 3009 4829 -5987 -4539 7987
1283 7987 3659 -8966 -2557 8560 1092 -7019 419 4463 -1928 -1156 3314 -2394 -4302 5887
1297 5887 5079 -8647 -5297 10582 5179 -11116 -4584 10429 3727 -8304 -2642 5037 1425 -1162
1311 -1162 -342 -3265 -839 7359 1643 -10997 -2447 13457 2946 -14634 -3347 14276 3571
1324 3571 -12387 -3650 9180 3672 -4874 -3516 81 3362 4890 -2970 -9468 2484 13154 -1789
1338 -1789 -15537 1017 16390 -110 -15667 -1016 13261 2056 -9672 -3214 4997 4224 -18
1351 -18 -5150 -5010 5765 9477 -6028 -12913 5881 15047 -5221 -15605 4153 14713 -2543 -12320
1365 -12320 672 8928 1502 -4667 -3663 245 5688 4021 -7348 -7821 8419 10525 -8873 -12268
1379 -12268 8430 12513 -7319 -11679 5416 9590 -3010 -6799 326 3529 2520 17 -4981 -3095
1393 -3095 7156 5797 -8555 -7528 9284 8374 -9014 -8151 7971 7083 -6190 -5241 3806 2954 -1239
1408 -1239 -601 -1575 -1722 3978 3470 -6045 -4766 7353 5139 -7980 -4842 7737 3864 -6638 -2364
1423 -2364 5010 660 -2865 1240 620 -2768 1697 4023 -3549 -4597 5000 4652 -5692 -3968 5634
1438 5634 2760 -4918 -1168 3594 -749 -1952 2555 -15 -4251 1737 5432 -3224 -6119 4176 6098
1453 6098 -4495 -5372 4204 4057 -3203 -2194 1752 117 115 2157 -1986 -4188 3745 5895 -5093 -7013
1469 -7013 5875 7420 -5955 -7182 5215 6146 -3849 -4658 1738 2692 641 -485 -3183 -1686 5507
1484 5507 3690 -7351 -5301 8569 6502 -8769 -6982 8171 6939 -6525 -6197 4168 5069 -1290
1498 -1290 -3499 -1865 1673 4896 121 -7581 -1958 9471 3384 -10571 -4556 10479 5189 -9426
1512 -9426 -5455 7354 5174 -4534 -4563 1284 3685 2191 -2500 -5389 1394 8200 -179 -10137 -804
1527 -804 11135 1733 -10945 -2406 9762 2866 -7596 -3133 4704 3182 -1478 -3169 -1991 2850
1541 2850 5003 -2511 -7602 1984 9223 -1446 -9948 830 9652 -166 -8325 -427 6268 1031
1555 1031 -3595 -1510 775 1990 2131 -2221 -4495 2409 6381 -2444 -7422 2313 7620 -2111 -7006
1570 -7006 1680 5581 -1276 -3727 623 1460 -45 779 -685 -2852 1217 4411 -1758 -5364 2153
1585 2153 5660 -2285 -5164 2334 4110 -2094 -2512 1717 625 -1161 1281 572 -2999 30 4216
1600 4216 -624 -4980 989 4989 -1307 -4462 1332 3226 -1258 -1669 1027 -249 -684 2187 360
1615 360 -3849 -10 5107 -231 -5788 405 5881 -364 -5155 278 3948 45 -2173 -386 111
1630 111 804 2066 -1183 -4032 1437 5626 -1633 -6715 1521 7017 -1255 -6740 674 5640 23
1645 23 -3999 -888 1965 1830 405 -2608 -2620 3270 4656 -3575 -6159 3649 7118 -3236 -7334 2489
1661 2489 6821 -1402 -5662 83 3943 1234 -1953 -2681 -299 3779 2374 -4672 -4242 5095 5609 -5091
1677 -5091 -6436 4585 6616 -3603 -6116 2256 5139 -610 -3669 -1101 2013 2864 -130 -4292 -1563
1692 -1563 5424 3049 -6015 -4157 6033 4769 -5555 -4956 4434 4523 -2959 -3815 1075 2725 801
1707 801 -1477 -2668 134 4179 1070 -5255 -2042 5876 2737 -5775 -3044 5239 3058 -4087 -2672
1722 -2672 2609 2109 -880 -1311 -835 495 2410 296 -3686 -971 4462 1419 -4864 -1671 4644 1615
1738 1615 -4025 -1388 2936 980 -1590 -437 149 -93 1350 632 -2496 -943 3445 1206 -3815 -1254
1754 -1254 3796 1080 -3280 -808 2414 331 -1239 174 -113 -737 1347 1192 -2485 -1562 3135 1735
1770 1735 -3476 -1752 3353 1588 -2766 -1217 1845 769 -611 -149 -662 -406 1987 1094 -2981 -1552
1786 -1552 3723 1943 -4001 -2152 3842 2185 -3232 -2060 2171 1739 -882 -1304 -641 688 2098 -120
1802 -120 -3452 -487 4382 1063 -4908 -1543 4944 1887 -4373 -2076 3434 2155 -1956 -2014 381 1793
1818 1793 1373 -1380 -2980 913 4293 -360 -5154 -228 5503 764 -5321 -1277 4561 1639 -3427
1833 -3427 -1971 1871 2137 -165 -2186 -1569 2043 3119 -1755 -4269 1370 5112 -812 -5366 319
1848 319 5191 350 -4365 -874 3252 1452 -1749 -1876 136 2171 1462 -2328 -2855 2269 3846 -2045
1864 -2045 -4510 1619 4663 -1106 -4307 477 3581 189 -2478 -851 1165 1458 285 -1878 -1496
1879 -1496 2198 2608 -2237 -3270 2151 3632 -1819 -3501 1361 3070 -805 -2335 140 1347 450
1894 450 -313 -1029 -762 1480 1634 -1820 -2281 1939 2654 -1835 -2680 1609 2430 -1156 -1807 692 1078 -56
1912 -56 -177 -454 -689 978 1487 -1309 -2038 1498 2354 -1513 -2364 1283 2036 -972 -1504 467 740 -5
1930 -5 93 -517 -992 930 1682 -1222 -2253 1373 2555 -1266 -2522 1064 2301 -645 -1704 164 994
1947 994 408 -98 -910 -750 1381 1598 -1713 -2300 1785 2705 -1731 -2909 1390 2748 -950 -2414 263
1964 263 1725 439 -909 -1163 -16 1774 919 -2211 -1719 2485 2419 -2407 -2787 2188 2942 -1608 -2742
1981 -2742 895 2351 -10 -1685 -888 897 1712 -44 -2391 -841 2844 1560 -3057 -2151 2911 2467
1997 2467 -2537 -2597 1842 2511 -991 -2139 21 1641 961 -959 -1874 294 2612 463 -3056 -1036
2013 -1036 3266 1554 -3085 -1894 2680 2047 -1972 -2001 1014 1774 -47 -1392 -1007 868 1857 -343
2029 -343 -2565 -186 2972 650 -3048 -1031 2875 1265 -2330 -1338 1606 1327 -689 -1163 -214 929
2045 929 1096 -596 -1821 252 2343 75 -2611 -387 2587 553 -2300 -715 1732 748 -1108 -748
2061 -748 272 631 501 -485 -1207 300 1764 -56 -2072 -124 2208 341 -1991 -433 1604 513
2077 513 -1031 -485 343 423 387 -301 -1057 112 1552 32 -1912 -255 1957 356 -1820 -519 1415
2094 1415 530 -875 -536 183 441 488 -331 -1138 185 1721 30 -1972 -177 2144 417 -1975 -557
2111 -557 1626 748 -1061 -778 386 797 320 -714 -1076 526 1627 -359 -2120 89 2306 199
2127 199 -2303 -477 2019 711 -1501 -868 860 1030 -60 -1034 -701 1019 1469 -846 -1969 617
2143 617 2369 -299 -2485 -44 2377 354 -1975 -694 1383 956 -683 -1182 -105 1288 868 -1272
2159 -1272 -1536 1143 2046 -940 -2355 626 2417 -253 -2234 -96 1850 548 -1275 -863 622 1208
2175 1208 129 -1367 -807 1412 1401 -1348 -1867 1133 2070 -841 -2137 422 1898 -8 -1539 -456
2191 -456 988 790 -387 -1103 -261 1312 854 -1367 -1295 1301 1623 -1106 -1738 861 1706 -455 -1428 70
2209 70 1045 351 -591 -738 57 987 396 -1229 -859 1230 1136 -1205 -1326 985 1348 -716 -1220 348 965
2228 965 69 -596 -401 193 741 275 -940 -622 1076 944 -1023 -1102 931 1185 -690 -1056 367 843
2246 843 -43 -552 -339 152 580 203 -875 -616 959 872 -992 -1095 889 1135 -681 -1064 405 904
2264 904 -18 -613 -323 278 697 130 -920 -482 1102 787 -1121 -1047 1042 1158 -823 -1153 502 1033
2282 1033 -147 -827 -307 503 655 -153 -979 -235 1199 588 -1296 -916 1217 1125 -1044 -1232 748 1217
2300 1217 -317 -1035 -89 823 565 -481 -939 116 1230 241 -1420 -611 1451 843 -1369 -1091 1112
2317 1112 1129 -714 -1125 249 1002 177 -789 -626 518 1071 -163 -1326 -145 1509 466 -1505 -662
2334 -662 1373 900 -1068 -986 693 962 -213 -917 -268 733 686 -494 -1114 159 1333 85 -1473
2351 -1473 -362 1423 584 -1268 -767 960 832 -516 -791 122 750 380 -586 -736 431 1068 -182
2368 -182 -1260 -56 1315 251 -1254 -430 1019 551 -724 -630 316 586 64 -589 -484 432 793 -327
2386 -327 -1042 118 1150 53 -1141 -231 1004 391 -748 -453 441 536 -27 -472 -269 412 651 -266
2404 -266 -883 128 1031 42 -1034 -213 912 329 -763 -439 444 464 -122 -468 -239 390 581 -299 -815
2423 -815 184 977 9 -1019 -120 980 319 -781 -390 515 496 -202 -518 -142 477 472 -393 -766 263 959
2443 959 -135 -1083 -82 1039 223 -906 -369 689 507 -337 -575 6 595 360 -517 -676 433 949
2461 949 -269 -1081 104 1108 116 -1051 -300 861 443 -575 -575 249 646 109 -667 -486 587 760
2479 760 -505 -993 325 1101 -158 -1117 -63 1001 261 -787 -432 504 609 -140 -634 -179 716 539
2497 539 -654 -796 560 991 -367 -1070 182 1007 13 -900 -297 628 441 -389 -640 7 665 274 -720
2516 -720 -567 627 788 -520 -922 405 986 -147 -909 -11 760 249 -519 -435 247 577 71 -650 -344
2535 -344 653 557 -615 -744 502 817 -366 -847 159 706 39 -575 -278 347 422 -39 -524 -139 623
2554 623 406 -576 -577 559 702 -407 -737 241 693 -32 -531 -149 386 333 -121 -458 -99 530 289 -551
2574 -551 -519 496 601 -433 -670 243 663 -88 -541 -81 407 290 -171 -413 -21 537 250 -547 -412 533
2594 533 565 -461 -648 338 635 -158 -624 -34 450 214 -311 -411 26 517 162 -602 -369 592 530 -534
2614 -534 -640 422 732 -203 -663 67 549 183 -378 -354 198 524 40 -659 -249 665 452 -663 -591 527
2634 527 640 -410 -730 172 628 -1 -539 -255 348 454 -168 -576 -41 723 270 -710 -418 696 592
2653 592 -554 -642 399 669 -120 -615 -108 505 355 -325 -565 112 664 59 -799 -264 765 416 -684
2672 -684 -554 510 609 -304 -605 97 518 190 -401 -397 263 589 -53 -705 -71 741 268 -721 -386 625
2692 625 488 -449 -537 269 522 -11 -457 -217 341 403 -201 -580 26 649 91 -711 -248 648 367 -517 -429
2713 -429 348 429 -158 -413 -69 379 310 -234 -488 138 603 26 -644 -167 651 269 -558 -361 393 360 -217
2734 -217 -412 -38 316 191 -270 -401 156 532 -34 -635 -87 646 207 -568 -309 448 357 -285 -349 61 333
2755 333 141 -288 -355 177 498 -62 -595 -72 636 153 -587 -280 488 356 -322 -377 105 397 106 -365 -341
2776 -341 271 499 -152 -608 22 682 74 -639 -204 569 314 -420 -387 233 410 2 -422 -216 345 410 -284
2797 -284 -593 154 652 -56 -700 -93 658 200 -546 -351 379 395 -193 -452 -53 439 300 -370 -483 303
2817 303 619 -167 -693 59 722 88 -637 -236 481 316 -316 -431 80 455 125 -471 -343 388 516 -293
2837 -293 -635 208 701 -84 -668 -75 562 229 -396 -318 241 412 -15 -441 -193 435 357 -398 -520 312 611
2858 611 -204 -656 54 580 76 -485 -252 314 334 -128 -394 -79 407 252 -391 -431 383 497 -251 -590 139
2879 139 585 24 -493 -136 347 243 -201 -342 15 412 170 -399 -349 370 442 -308 -522 154 530 -87 -521
2900 -521 -78 380 149 -268 -283 87 393 130 -402 -215 398 403 -336 -456 235 505 -131 -495 5 408 142
2921 142 -336 -282 141 334 5 -437 -216 427 343 -385 -475 306 513 -208 -531 67 484 94 -385 -240 246
2942 246 359 -32 -440 -82 488 273 -461 -387 411 474 -309 -535 154 514 -10 -448 -160 311 297 -198 -426
2963 -426 6 473 133 -510 -277 484 404 -430 -506 278 516 -127 -478 -39 420 198 -306 -342 135 512 26
2984 26 -545 -174 551 328 -504 -455 381 484 -251 -506 82 454 108 -383 -238 269 431 -125 -516 -29 564
3005 564 212 -538 -325 499 404 -344 -454 189 454 -16 -396 -156 325 297 -211 -460 55 507 56 -540 -190
3026 -190 512 302 -446 -378 318 411 -168 -395 -12 354 239 -239 -338 157 465 -6 -511 -96 546 230 -481
3047 -481 -323 382 388 -219 -399 32 355 130 -296 -281 217 396 -124 -481 -6 495 153 -486 -230 395 298
3068 298 -264 -344 135 356 67 -314 -179 275 361 -160 -445 49 524 62 -496 -175 414 276 -350 -351 169
3089 169 334 -14 -353 -175 304 334 -225 -415 151 535 4 -540 -105 500 231 -387 -315 288 366 -101 -380
3110 -380 -83 353 214 -295 -382 220 471 -131 -552 -4 540 127 -490 -253 362 343 -230 -354 37 385 134
3131 134 -371 -300 326 458 -208 -520 99 550 20 -558 -191 460 281 -336 -368 150 407 13 -421 -219 373
3152 373 340 -315 -480 209 526 -88 -543 -56 509 178 -390 -283 264 349 -84 -398 -72 393 245 -379 -341
3173 -341 309 496 -182 -527 66 530 53 -468 -201 344 282 -196 -377 78 409 124 -403 -283 368 416 -265
3194 -265 -501 174 531 -24 -458 -115 416 234 -291 -291 139 388 34 -432 -181 401 305 -334 -445 234 462
3215 462 -110 -485 -15 408 139 -332 -254 202 362 -50 -409 -83 411 272 -368 -362 311 413 -186 -433 83
3236 83 454 82 -360 -182 272 353 -99 -397 -48 404 170 -394 -286 374 402 -288 -435 101 482 -27 -432
3257 -432 -145 319 267 -220 -394 55 455 98 -444 -210 432 345 -343 -401 232 456 -72 -434 -66 404 168
3278 168 -298 -332 166 395 -25 -435 -112 454 254 -427 -351 340 438 -191 -431 56 440 118 -356 -263 279
3299 279 404 -131 -429 -30 477 152 -454 -258 395 365 -296 -436 173 450 19 -418 -167 337 277 -227 -404
3320 -404 119 465 20 -500 -154 465 276 -348 -343 270 421 -110 -414 -66 394 193 -306 -344 191 426 -94
3341 -94 -487 -38 472 199 -425 -297 327 345 -214 -398 56 405 109 -360 -243 261 384 -179 -441 57 498
3362 498 93 -455 -195 378 311 -264 -345 152 389 24 -390 -179 323 273 -241 -403 106 454 -17 -456 -113
3383 -113 436 227 -325 -288 219 361 -81 -363 -81 364 219 -281 -324 229 410 -93 -436 -16 451 152 -394
3404 -394 -261 284 333 -156 -363 33 361 145 -356 -273 255 371 -189 -444 82 450 67 -434 -165 357 270
3425 270 -225 -353 104 399 72 -365 -188 319 333 -242 -398 144 448 -28 -457 -111 390 216 -291 -313 178
3446 178 345 -59 -379 -82 398 206 -321 -329 236 452 -81 -473 4 449 162 -376 -266 300 358 -140 -389
3467 -389 -8 415 133 -380 -289 303 368 -224 -450 102 466 49 -413 -183 330 280 -218 -369 117 436 79
3488 79 -403 -182 352 313 -270 -404 169 427 -41 -413 -79 368 217 -299 -312 184 388 -54 -411 -103 393
3509 393 230 -364 -327 261 423 -103 -420 16 409 129 -353 -225 276 335 -161 -431 -11 430 102 -392 -249
3530 -249 335 351 -224 -387 109 428 12 -394 -157 330 247 -209 -365 75 404 2 -391 -151 372 293 -282
3551 -282 -339 207 385 -53 -402 -86 363 196 -265 -283 184 381 -57 -420 -105 376 192 -343 -292 262 381
3572 381 -162 -387 5 403 118 -336 -236 251 353 -119 -390 8 435 114 -381 -251 328 301 -215 -384
3592 -384 69 401 14 -361 -167 300 264 -226 -377 84 432 35 -413 -146 365 249 -293 -339 158 365 -47
3613 -47 -378 -77 370 232 -301 -287 185 389 -72 -398 -74 384 191 -337 -265 269 351 -133 -405 -13 364
3634 364 133 -329 -232 254 337 -153 -380 8 389 109 -385 -230 327 303 -222 -350 106 383 57 -357 -154
3655 -154 326 292 -221 -369 140 416 9 -416 -130 382 233 -297 -328 183 375 -34 -385 -39 358 234 -316
3676 -316 -301 212 399 -101 -423 -26 399 169 -350 -274 267 340 -144 -366 -5 390 98 -331 -230 265 324
3697 324 -181 -406 55 397 64 -390 -150 331 276 -200 -318 117 374 13 -354 -169 342 254 -237 -351 144
3718 144 415 4 -407 -60 376 197 -307 -312 180 345 -52 -393 -79 350 198 -308 -288 204 367 -129 -377
3739 -377 -32 383 132 -303 -216 261 321 -120 -340 21 394 139 -290 -202 290 345 -158 -369 76 358 58
3760 58 -378 -182 282 238 -193 -340 81 357 45 -334 -154 314 253 -232 -321 144 383 -43 -391 -116 356
3781 356 214 -276 -296 163 349 -20 -361 -82 348 198 -286 -282 208 357 -105 -359 -3 366 144 -328 -237
3802 -237 225 322 -130 -335 21 357 106 -336 -201 275 293 -169 -352 62 374 48 -344 -176 293 278 -211
3823 -211 -337 101 335 47 -358 -152 328 260 -243 -347 131 387 -38 -374 -92 352 204 -289 -278 190 345
3844 345 -56 -339 -81 373 216 -274 -260 222 345 -121 -392 -4 378 112 -298 -238 209 291 -145 -336 27
3865 27 345 73 -348 -172 307 275 -200 -318 87 392 26 -339 -140 308 225 -193 -322 112 347 12 -358
3886 -358 -129 339 227 -262 -304 152 323 -51 -384 -51 315 176 -275 -283 192 311 -83 -331 -63 345 163
3907 163 -296 -227 248 312 -93 -320 -6 322 91 -304 -179 248 288 -148 -287 20 336 67 -335 -211 263
3928 263 255 -207 -305 73 366 10 -320 -129 276 211 -207 -285 125 351 16 -332 -106 301 213 -222 -268 171
3950 171 330 -46 -330 -79 296 161 -251 -252 163 284 -63 -333 -10 331 159 -297 -203 219 332 -126 -297
3971 -297 46 327 108 -293 -179 231 287 -119 -334 26 340 82 -321 -209 271 291 -173 -312 78 361 26
3992 26 -305 -150 274 237 -225 -276 119 328 -15 -331 -63 318 195 -221 -271 170 332 -62 -326 -43 333
4013 333 172 -256 -240 168 306 -59 -344 -6 349 132 -285 -210 226 300 -126 -336 27 342 95 -296 -148
4034 -148 256 250 -140 -320 84 349 37 -328 -137 277 242 -183 -276 110 316 17 -325 -90 274 186 -221 -291
4056 -291 133 320 -43 -358 -90 285 172 -249 -195 169 313 -67 -294 -32 301 152 -231 -222 170 282 -74
4077 -74 -309 -24 300 103 -285 -174 220 240 -116 -272 54 274 81 -255 -133 227 218 -164 -282 54 305
4098 305 51 -283 -135 257 200 -165 -249 100 301 27 -278 -88 274 185 -178 -235 152 311 -19 -303 -67
4119 -67 300 160 -232 -237 157 270 -54 -289 -40 292 153 -227 -212 178 305 -96 -282 8 341 122 -301
4140 -301 -162 232 242 -146 -279 31 294 67 -236 -170 226 261 -161 -299 81 313 12 -293 -114 239 209
4161 209 -176 -235 126 296 9 -277 -74 278 197 -206 -243 129 292 -33 -289 -38 272 145 -232 -197 179
4182 179 258 -101 -285 -32 298 119 -218 -180 200 274 -91 -284 17 307 61 -272 -119 229 220 -118 -261 43
4204 43 275 70 -295 -147 259 222 -178 -260 77 279 -8 -280 -85 269 164 -200 -230 96 283 -6 -268
4225 -268 -70 275 171 -190 -213 165 266 -82 -258 0 261 116 -243 -163 181 228 -91 -255 -13 275 97
4246 97 -266 -185 191 218 -149 -280 34 288 29 -212 -136 217 187 -120 -236 72 286 59 -258 -125 254 207
4268 207 -160 -240 91 256 -6 -245 -81 227 156 -151 -211 102 267 -12 -253 -104 258 128 -218 -238 149
4289 149 252 -76 -277 -9 254 117 -191 -176 138 251 -71 -255 -10 273 78 -228 -154 194 243 -133 -262
4310 -262 30 266 49 -239 -148 210 209 -148 -251 30 261 56 -268 -88 220 205 -159 -225 111 231 -5 -247
4332 -247 -78 239 159 -163 -214 107 262 -30 -255 -48 276 107 -213 -190 174 220 -104 -249 -27 255 102
4353 102 -237 -158 178 231 -73 -270 24 326 53 -252 -79 213 194 -138 -233 73 250 2 -242 -83 199
4374 199 176 -159 -229 76 238 3 -251 -70 251 130 -179 -179 125 220 -39 -225 -39 205 111 -154 -185 130
4396 130 268 -54 -237 -27 249 82 -216 -157 161 199 -77 -206 -17 214 63 -206 -176 158 184 -115 -241
4417 -241 37 212 48 -221 -109 172 151 -120 -185 58 206 26 -201 -96 203 182 -118 -229 87 220 -7
4438 -7 -231 -44 213 128 -135 -196 99 224 -10 -247 -55 192 152 -176 -170 129 246 -61 -225 2 249 94
4460 94 -198 -149 170 227 -68 -202 12 221 96 -183 -156 176 216 -110 -196 43 253 67 -203 -81 178 144
4482 144 -112 -171 35 226 18 -220 -111 191 176 -159 -189 103 245 -6 -221 -27 230 115 -157 -171 108
4503 108 222 -16 -236 -59 213 141 -194 -177 133 224 -64 -243 16 227 53 -192 -108 156 206 -64 -219 20
4525 20 241 64 -242 -117 153 165 -142 -211 44 223 -18 -225 -50 177 143 -135 -187 76 228 -25 -218 -70
4547 -70 197 89 -164 -173 99 204 -41 -189 -32 199 99 -133 -141 79 205 -46 -199 -17 203 104 -142 -134 149
4570 149 150 -106 -204 18 199 52 -188 -118 137 162 -64 -178 21 224 57 -194 -106 179 140 -128 -144 49 223
4593 223 6 -176 -72 135 127 -104 -174 48 193 13 -210 -60 184 128 -123 -151 87 171 -26 -178 -31 178
4615 178 108 -135 -125 81 199 -28 -202 -13 212 69 -208 -146 133 157 -100 -167 10 184 55 -171 -97 136
4637 136 149 -65 -176 14 216 54 -180 -98 184 153 -90 -176 55 196 14 -161 -82 165 149 -127 -185 68
4659 68 199 -18 -209 -31 194 92 -137 -150 93 192 -32 -180 -26 180 86 -165 -142 98 181 -48 -197 -1
4681 -1 222 37 -186 -84 168 142 -70 -151 40 197 49 -170 -125 149 157 -92 -208 58 160 -14 -207 -59
4703 -59 169 103 -96 -156 62 194 22 -159 -65 149 110 -111 -142 100 194 -31 -188 -18 164 61 -119 -102 87
4726 87 145 -25 -162 -23 148 79 -140 -137 117 171 -67 -141 -9 177 37 -111 -105 115 121 -46 -164 2 157 44
4750 44 -156 -97 118 127 -74 -175 44 154 15 -172 -66 132 112 -100 -106 37 129 24 -160 -92 159 109 -123
4773 -123 -156 84 149 -18 -164 1 165 64 -100 -123 59 152 -21 -142 -56 160 95 -157 -131 108 143 -63 -155
4796 -155 0 163 29 -158 -110 87 148 -22 -164 -2 171 60 -125 -55 168 162 -95 -141 79 171 14 -145
4818 -145 -55 134 89 -111 -126 49 176 -2 -177 -65 152 88 -134 -121 98 139 -77 -134 15 162 53 -144
4840 -144 -113 87 148 -63 -172 1 178 57 -157 -82 137 143 -67 -116 52 154 16 -145 -65 108 112 -79 -133
4863 -133 26 156 -4 -165 -52 155 74 -108 -121 82 130 -19 -153 -41 122 117 -84 -98 64 127 -14 -175
4885 -175 -8 161 47 -105 -98 85 105 -76 -109 -14 116 60 -84 -98 79 137 -37 -137 8 151 58 -128 -52
4908 -52 109 81 -46 -95 -12 123 49 -98 -66 81 99 -44 -138 27 139 16 -134 -48 116 81 -56 -109 57 110
4932 110 14 -114 -31 99 97 -107 -149 65 166 -32 -152 -30 153 66 -100 -104 61 133 -16 -116 -20 129 88 -97
4956 -97 -109 69 140 -39 -139 14 166 32 -137 -66 91 86 -51 -111 12 133 37 -123 -75 131 157 -95 -122 46
4980 46 168 -7 -162 -46 127 83 -92 -113 44 122 -3 -152 -44 106 72 -140 -137 57 151 -53 -125 -4 162
5003 162 60 -104 -67 85 116 -38 -140 -13 140 28 -122 -87 125 124 -100 -103 43 112 -12 -113 -48 78 90
5026 90 -69 -89 14 128 21 -92 -48 113 74 -84 -95 91 97 -52 -102 9 98 15 -93 -77 37 99 -27 -125
5050 -125 -15 128 52 -121 -70 82 89 -62 -103 23 98 16 -64 -51 60 72 -2 -104 -5 99 41 -92 -64 104 68
5075 68 -40 -83 13 84 -18 -71 -44 50 94 -44 -104 -10 128 4 -101 -81 93 82 -79 -94 43 113 11 -100 -47
5100 -47 81 81 -72 -109 38 116 -1 -153 -46 113 76 -104 -101 111 83 -47 -121 -16 83 56 -70 -106 45 130 -18
5125 -18 -139 -41 128 48 -122 -70 82 80 -55 -88 22 97 23 -80 -77 75 110 -57 -112 38 162 -26 -159 -45
5149 -45 130 61 -115 -97 67 94 -8 -99 -21 91 40 -84 -101 69 113 -27 -122 8 138 26 -111 -44 62 72
5173 72 -55 -60 16 112 32 -83 -73 57 81 -73 -126 40 113 -41 -113 -30 105 24 -62 -62 31 62 24 -54 -14 66 67 -61
5201 -61 -69 57 96 -40 -112 17 81 23 -71 -18 25 40 -29 -69 -29 47 71 -40 -79 43 107 -51 -109 17 113 -4 -73
5228 -73 -36 44 33 -7 -39 -17 69 54 -49 -78 55 81 -47 -111 16 97 1 -48 -29 52 63 -11 -68 -9 67 31 -68 -85
5256 -85 57 81 -49 -117 11 112 -1 -84 -24 77 85 -26 -73 22 64 56 -84 -60 97 68 -86 -86 44 100 -27 -130
5282 -130 13 103 22 -70 -54 32 97 -18 -98 4 100 50 -92 -77 103 111 -63 -101 43 102 3 -105 -37 76 35 -53
5308 -53 -84 22 91 16 -105 -52 108 67 -88 -96 102 89 -19 -80 -12 76 29 -64 -51 36 102 -30 -107 -4 116 47
5334 47 -117 -64 100 72 -49 -72 48 75 -15 -86 -28 68 39 -33 -95 8 92 1 -93 -43 73 21 -79 -52 71 49
5360 49 -42 -23 -8 64 13 -51 -50 22 86 4 -98 1 63 -11 -72 -19 39 35 -22 -41 5 4 2 -11 -44 19 57 5 -78 -21 72 3
5392 3 -60 -37 54 32 -10 -43 -1 26 26 -53 -35 0 87 -7 -70 6 67 36 -73 -38 52 32 -57 -55 -23 35 26 -62 -23 38 76 -21
5424 -21 -110 6 85 -1 -98 -44 73 43 -53 -54 22 56 2 -46 -20 72 89 -39 -89 38 113 -14 -113 4 95 26 -68 -23
5452 -23 68 34 -13 -68 7 63 64 -67 -42 49 115 -32 -118 15 123 -13 -96 -9 88 48 -56 -61 26 72 -7 -68 -20 92
5480 92 50 -68 -102 61 108 -39 -59 24 119 12 -56 3 48 57 -18 -94 -37 75 35 -61 -44 62 67 -75 -73 41 83 -25
5508 -25 -51 8 41 15 -51 -53 37 49 14 -61 -33 77 30 -71 -49 34 40 -26 -25 41 57 26 -10 -15 11 38 6 -52 -8 53 42
5539 42 -54 -42 24 20 -29 -38 25 20 -9 -20 -10 10 23 38 -34 -40 32 47 -65 -47 70 35 -25 -29 29 1 10 -17 -16 14 24 4 -58
5572 -58 -45 65 32 -42 -57 60 60 -11 -53 -10 62 -5 -23 -31 15 49 4 -69 -18 70 47 -88 -52 78 60 -60 -60 40 87
5601 87 1 -56 -22 48 56 -28 -62 -20 76 7 -56 -32 71 40 -90 -59 62 81 -65 -52 50 77 15 -33 -61 52 71 0
5629 0 -113 25 100 -3 -121 -13 73 28 -69 -43 83 47 -35 -55 20 47 44 -48 -58 31 85 -19 -87 22 93 -13 -72
5656 -72 -11 57 40 -28 -50 30 31 11 -39 -18 66 67 -44 -60 30 91 -28 -56 34 86 0 -65 -9 31 22 -10 -34 -20 11 16 -39
5687 -39 -28 13 49 -17 -39 10 11 -33 -39 12 5 9 -3 15 -41 15 57 -8 -6 4 34 -8 -51 37 32 -44 -12 24 -1 17 -1 -13 -23
5720 -23 -5 58 -14 -52 10 49 21 -32 6 41 6 -21 4 9 5 13 20 -5 10 53 -11 -30 32 54 6 -75 13 74 0 -42 3 39
5752 39 6 22 -31 -7 48 27 -30 -45 47 54 -25 -77 45 78 -11 -74 19 70 52 -28 -39 22 46 37 -39 -15 62 52 -58 -62 59
5783 59 73 -50 -64 21 74 -30 -51 -14 11 25 -41 -48 3 78 16 -78 -31 98 54 -62 -50 59 59 -51 -56 30 43 22 -50
5812 -50 -31 14 41 0 -64 -11 88 0 -98 0 93 46 -85 -16 55 31 -23 -25 -3 36 0 -7 -24 28 55 7 -46 -19 61 -6 -55
5843 -55 16 83 20 -38 -12 8 15 13 28 -30 -2 14 21 -35 7 56 -8 -31 28 59 -32 -1 10 51 -8 1 17 -7 -5 6 21 -31 -9
5876 -9 56 42 -11 18 44 30 0 13 -11 -6 14 22 -26 -28 26 33 -43 -30 34 29 -64 -22 24 34 -21 -19 -3 -2 27 10 -37 2 57 9
5910 9 -72 -24 81 30 -66 -23 60 30 -23 -40 0 3 21 -15 -30 33 68 -42 -84 26 69 3 -67 -14 97 20 -66 -20 21
5939 21 42 -21 -60 3 64 73 -30 -46 37 65 -14 -78 24 54 -9 -71 -23 67 8 -59 -34 12 24 1 -48 -19 60 31 -55 -61
5969 -61 58 77 -19 -68 24 59 -23 -47 -4 41 18 -13 -65 -16 15 -5 -55 -32 57 43 -31 -51 78 45 -58 -39 49 26 -24
5998 -24 -10 8 5 2 7 -56 -12 59 24 -61 -17 85 21 -43 -25 43 15 -40 -15 34 2 9 28 -8 -20 22 16 -27 -7 47 27 -25
6030 -25 2 34 -11 -24 33 30 10 10 35 -8 -6 -4 31 -6 5 2 21 -15 -42 36 8 3 15 13 -7 -2 11 -49 -35 11 41 -41 -53 44
6064 44 25 6 -38 33 32 20 -11 -2 19 40 -1 -3 -38 40 50 -43 -59 38 45 -50 -40 10 63 -23 -25 -20 35 19 -25 -72 6 47 9
6097 9 -55 -26 41 43 -76 -53 56 39 -31 -33 9 50 -11 -42 -23 27 84 -8 -54 -5 79 6 -80 -10 91 18 -58 -15 25 38
6127 38 -34 -54 -4 2 39 -7 -34 46 50 -21 -49 23 98 -10 -36 14 63 2 -43 2 33 -5 -2 -51 -3 39 18 -8 -64 15 51
6158 51 -53 -46 57 41 -6 -50 37 45 17 -22 13 -23 11 42 -26 -14 31 20 -17 -34 20 42 -48 -23 9 7 -11 -18 -6 -13 -14 23
6190 23 13 -34 4 14 9 -17 0 28 4 -21 34 9 -29 8 20 -18 -30 61 -6 -32 17 47 3 -15 3 12 13 -15 -4 -10 0 29
6222 29 -14 -49 5 55 -13 -68 19 35 -4 -37 5 67 30 -16 -31 50 19 1 -20 -15 23 35 -6 -51 27 62 -34 -61 40 65
6252 65 -25 -34 10 23 26 -11 -10 6 45 38 -34 -20 35 53 -34 -46 36 34 -23 -72 38 58 -17 -52 10 37 16 3 -25 -6 25 11
6284 11 -37 -26 70 52 -51 -37 43 44 -65 -27 8 43 -13 -35 -18 20 30 1 -46 21 41 8 -55 -24 67 0 -58 -17 50 31
6314 31 -53 -23 25 1 -1 -14 -8 27 47 -4 -34 32 58 10 -60 22 70 5 -58 27 43 0 -6 31 9 -12 6 19 -8 -1 43 -19
6346 -19 -25 27 33 -36 -24 14 37 -20 -5 35 -9 1 -3 12 -19 -4 22 2 -28 41 9 -5 -18 24 6 -25 13 26 -38 -34 45 34
6378 34 -26 -8 55 10 -16 -2 7 33 24 21 -3 -48 30 35 -17 1 48 25 -22 -46 71 36 -66 -5 32 29 -16 -47 15 32 9 -10
6410 -10 -22 15 52 -10 -62 13 42 41 -54 -29 70 17 -51 -6 32 35 -3 -21 -4 16 32 -18 -33 19 54 -9 -67 38 63 1 -77
6441 -77 4 57 2 -26 -11 6 35 15 -33 -17 27 48 -28 -49 49 47 -44 -40 46 40 -42 -32 14 41 18 -14 13 9 14 2 -29 -3 42
6474 42 42 -53 -28 69 49 -20 -17 43 25 -42 -30 1 -7 -1 1 -9 9 23 25 -35 -4 49 20 -23 -11 62 -1 -46 -7 22 20 -13 19 7
6508 7 21 6 0 2 17 28 24 -15 15 46 12 -12 27 49 -27 -14 21 -7 6 -11 53 2 -42 16 14 11 27 15 3 -17 29 10 -10
6541 -10 24 31 -23 -30 28 45 19 -33 23 42 10 -15 5 18 19 18 10 -13 18 47 -20 -34 46 45 -41 -55 31 37 -21 -39 31 58 -22 -21
6575 -21 17 19 15 8 -33 2 37 22 -53 -23 55 27 -27 -28 46 26 -18 -18 13 47 4 -11 -25 -5 43 5 -61 -12 70 6 -37 -15 69
6608 69 17 -41 -3 39 17 -21 4 8 21 8 -5 -1 14 56 -18 -63 14 71 -12 -44 29 55 -22 -41 4 16 9 -44 -9 3 2 33
6640 33 9 -31 28 28 -13 -41 12 51 -42 -30 13 10 -29 -3 1 11 -8 -4 -18 -11 20 29 -26 -29 26 12 -24 7 46 -17 -14 18 22 -5 -18
6675 -18 3 21 -15 0 35 10 18 4 27 -2 4 38 -9 -34 25 30 -32 -14 30 39 -1 -25 9 5 -29 -30 2 2 -1 -10 -10 16 -2 25 -26
6710 -26 2 31 24 -11 -15 40 8 -28 -8 42 31 6 -6 8 3 7 -12 -63 5 22 1 -23 2 67 -16 -37 -5 19 -2 -28 34 14
6742 14 9 -8 -23 9 27 18 -33 -19 47 42 -19 -37 50 73 -11 -45 48 44 -8 -18 18 34 -24 -12 -37 -15 36 10 -42 -12 52 40
6774 40 -37 -21 77 20 -36 -32 43 23 6 6 -23 34 -1 -5 -16 5 54 -27 -45 -22 41 -7 -22 -9 31 22 -34 -8 26 -3 -24 -11
6806 -11 10 21 2 9 -14 20 31 11 -38 17 52 8 -50 19 40 -5 -13 -15 11 18 3 -12 16 7 21 -19 -14 52 34 5 -7 32 22
6839 22 -36 -1 9 2 -19 -7 19 1 -21 3 20 -20 -1 6 -17 13 19 5 -21 19 28 -8 -22 -12 43 -18 3 23 18 -13 -7 27 9
6872 9 22 34 -5 10 6 17 33 -19 51 26 -12 -46 59 22 -25 -30 25 25 -31 -7 9 23 4 -5 -5 -3 33 -2 -54 -2 39 8 -29
6905 -29 0 73 33 -34 15 29 8 -16 -4 -7 19 10 -8 -33 13 46 5 -53 4 46 -11 -32 17 41 2 -5 -14 33 6 9 -25 -1 10
6938 10 -6 -17 -21 10 29 -38 -18 31 37 -39 0 11 16 -6 -8 19 2 -1 18 -22 -9 51 20 -19 -41 61 15 -17 -14 38 3 -9 -9
6971 -9 4 11 7 -21 2 -4 23 0 -3 -3 18 6 -24 -3 28 -8 -37 -15 11 6 -40 -3 1 -10 -9 12 32 -2 22 -15 -3 18 54 -2 -32
7006 -32 16 10 -19 -3 31 44 -24 -13 23 -12 -7 5 -13 -8 12 20 16 18 22 13 -20 -2 15 11 -30 14 31 13 -37 0 32 -8 0 -11 9
7041 9 16 25 20 -12 19 21 -7 3 19 36 -18 -22 48 32 -28 -2 31 11 -6 -4 5 -8 9 -1 -17 6 22 9 4 1 40 16 -39 -19 40
7076 40 13 -20 -19 19 -3 0 -7 -7 14 26 -13 -44 4 42 2 -24 -2 37 31 -19 -12 26 3 -21 14 15 1 12 -14 -28 -14 16 -14 -37
7110 -37 4 38 -4 -12 1 12 6 -40 27 29 8 9 19 47 16 0 7 17 12 36 -24 -20 11 36 -6 -20 40 34 2 23 35 31 -20 9 -4
7145 -4 24 20 -8 -10 8 7 12 -27 -1 58 -3 -47 -9 26 -3 3 -15 27 -3 -17 -15 19 -6 10 12 -16 25 31 30 7 21 28 -8 -16 12 13 1
7182 1 5 9 31 -3 -18 -13 -14 -5 26 -2 -16 15 -7 -29 -3 28 18 -5 -17 37 29 -3 -5 9 9 6 -20 22 19 -4 -4 6 17 8 0 -14 19
7219 19 46 28 -51 -7 21 6 -21 -4 50 -5 -26 17 7 7 0 -12 -25 5 4 -26 -7 17 36 -7 -28 17 46 -11 -23 2 21 41
7251 41 -12 8 8 28 8 -23 -24 29 21 -21 -23 45 31 -21 -9 28 6 10 -10 -6 13 13 7 -7 -1 21 7 -13 6 30 15 -38 11 25 10
7286 10 5 -3 10 -7 -2 8 17 15 0 24 -21 23 35 20 8 -4 43 -17 -20 20 27 12 -20 4 21 20 15 5 7 -8 21 -12 -10 23 9 2
7322 2 -1 17 15 -28 -9 20 5 14 -15 25 3 11 11 21 19 10 -9 -2 13 9 17 30 -15 43 35 -29 10 31 10 5 12 23 4 -10 26 -7 39
7359 39 32 2 14 19 20 3 24 23 27 -8 6 32 22 7 8 25 6 0 18 8 38 8 34 -10 -2 31 23 -6 11 23 37 -25 -2 24 19
7394 19 -8 -6 3 27 -36 -2 16 12 -14 -4 -21 -3 29 -10 -15 5 21 18 6 17 41 6 -11 7 7 14 -11 -7 8 25 16 0 -1 30 46
7429 46 -12 -3 11 22 -12 -17 18 -4 11 12 -7 14 32 -6 -13 5 6 6 14 -27 17 31 -24 -8 44 4 -8 7 37 24 -18 10 -2 5
7463 5 -4 1 2 0 -1 -13 -11 2 11 -1 -13 -11 32 9 3 19 39 22 -12 10 18 15 32 17 -2 8 13 -8 -26 20 8 -7 -29 7 18 3 17
7500 17 8 8 9 14 8 -16 5 -7 -40 -5 7 13 -7 -2 14 14 -12 3 37 4 -19 24 15 6 -29 -14 1 11 -2 20 -17 14 15 10 4 7 29
7537 29 16 -19 20 38 -3 8 14 19 -10 11 2 31 -2 5 -4 14 10 3 -8 -2 13 23 -6 15 18 7 4 1 8 4 -12 2 -20 -21 -11 -9 -19 -11
7575 -11 -1 2 -34 1 42 0 6 12 68 25 -31 -2 9 10 27 1 4 22 24 22 -11 25 22 2 -11 3 29 20 -15 43 43 15 -3 15 24 14
7611 14 15 12 -2 7 1 1 0 14 15 -2 -7 -3 22 4 9 24 -7 -14 3 9 -7 13 2 5 -13 13 24 -19 -3 34 4 8 13 23 -6 -10 -13 13 -9
7650 -9 -13 7 9 30 -7 5 -8 34 24 14 24 34 24 4 -14 3 1 -2 4 21 13 3 10 30 7 13 16 5 -4 27 3 13 7 18 25 8 -10
7687 -10 32 33 -7 -12 4 29 -1 10 -15 27 18 0 15 12 -13 -4 -11 -3 38 -14 -2 -4 -22 5 -4 -5 16 17 9 -1 19 30 1 4 11 14 -3 14
7725 14 2 -4 30 -2 -11 10 2 3 1 21 22 4 7 -18 0 15 18 -4 -7 43 -17 10 10 23 14 20 27 7 15 15 -7 8 17 -7 7 11 25 33 5
7764 5 11 31 5 10 -8 4 22 18 -4 2 10 28 20 12 21 16 16 15 19 3 10 16 35 -16 17 -9 3 10 31 7 25 16 10 15 4 10 13 -11 11 -2 -11
7805 -11 20 30 -3 17 -2 31 7 -3 6 3 -11 19 3 28 8 16 19 -7 15 -5 7 0 14 21 1 -12 -3 11 8 14 2 8 8 25 52 11
7841 11 8 16 21 34 33 25 23 41 27 13 -1 7 23 14 -2 20 15 19 -7 18 -4 -9 11 15 4 -11 3 -19 9 -8 19 11 -9 18 5 -9 8
7878 8 11 8 4 2 17 3 3 -6 -7 19 7 2 24 0 22 5 -10 2 -12 -13 1 0 -1 -5 -19 0 18 9 10 -22 7 8 -10 -32 6 14 15 -9 16
7917 16 39 20 18 9 9 16 5 11 5 2 14 0 -3 -1 14 19 10 4 23 13 7 -5 22 27 15 4 30 26 13 8 -17 15 32 19 -2 3 14 -13 7
7956 7 -4 -3 8 -11 19 29 22 1 9 15 -2 -18 22 23 13 26 10 6 26 8 -6 15 16 15 9 5 34 4 8 7 3 -5 -14 -6 15 7 30 -2 -6 2
7996 2 15 4 4 -2 2 22 -2 -11 18 13 -16 34 37 33 9 -15 24 8 11 26 13 13 -6 -6 29 8 20 4 -19 4 -22 -24 0 24 -2 11
8032 11 -4 -7 11 2 4 5 0 28 -9 -21 -8 8 17 -12 3 5 7 17 36 22 1 5 -6 7 10 26 18 -4 -5 -6 15 6 17 35 -6 -1 -24 7
8070 7 26 6 18 9 10 30 3 -8 6 12 20 7 12 27 -2 -19 15 20 17 17 -11 -2 3 18 20 7 19 -5 -15 19 4 7 26 27 3 5 -10 4
8108 4 -18 2 -7 28 19 8 24 -27 2 9 -15 -20 12 7 -4 12 -3 17 29 43 23 5 7 5 -11 -6 13 19 20 11 21 -12 13 -8 1 3 -8
8145 -8 -11 -19 7 -10 20 4 7 -15 11 11 27 -4 9 -1 -10 2 4 5 -15 2 14 3 -17 0 1 16 -9 -23 11 8 21 7 27 3 20
8180 20 -9 -5 4 17 9 24 28 3 -8 12 -17
8191a7
##END NTUPLES=NMR FID
##END=
