##TITLE=1H_LY-DMAA.Per.1.9
 CD3CN
 8 sc, 
 11.02.2022
##JCAMPDX= 6.0         $$ Bruker NMR JCAMP-DX V2.0
##DATA TYPE= NMR FID
##DATA CLASS= NTUPLES
##ORIGIN= UXNMR, Bruker Analytische Messtechnik GmbH
##OWNER= root
$$ XWIN-NMR		Version 3.5
$$ Fri Feb 11 13:01:34 2022 Russian Standard Time (UT+4h)  she@DPX200
##.OBSERVE FREQUENCY= 200.1305
##.OBSERVE NUCLEUS= ^1H
##.DELAY= (6, 6)
##.ACQUISITION MODE= SIMULTANEOUS
##.ACQUISITION SCHEME= undefined
##.AVERAGES= 8
##.DIGITISER RES= 18
##SPECTROMETER/DATA SYSTEM= spect
##.PULSE SEQUENCE= zg30
##.SOLVENT NAME= CD3CN
##.SHIFT REFERENCE= (INTERNAL, CD3CN, 0, 15.7039)
##AUDIT TRAIL= $$ (NUMBER, WHEN, WHO, WHERE, WHAT)
$$ ##TITLE= Audit trail, XWIN-NMR		Version 3.5
$$ ##JCAMPDX= 5.01
$$ ##ORIGIN= Bruker BioSpin GmbH
$$ ##OWNER= she
$$ F:/spectra/data/she/nmr/H-F/1/audita.txt
$$ ##AUDIT TRAIL=  $$ (NUMBER, WHEN, WHO, WHERE, WHAT)
(   1,<2022-02-11 12:59:46.25 +0400>,<she>,<DPX200>,
      <created by zg, POWCHK disabled, PULCHK disabled
       configuration hash MD5:
       00 E9 B6 7A A2 85 ED C7 34 08 36 98 17 FE 4E 26
       data hash MD5: 16K
       BB DF 8C 8F D9 13 34 73 77 C9 75 3F E9 81 54 FF>)
$$ ##END=
$$ 
$$ hash MD5
$$ 13 68 44 4A D4 BE AD EC B7 AD 1A 21 05 42 58 69
##$RELAX= 
##$RELAX= 
##$RELAX= 
##$RELAX= 
##$RELAX= 
##$RELAX= 
$$ Bruker specific parameters
$$ --------------------------
##$DU= <F:/spectra>
##$EXPNO= 1
##$NAME= <H-F>
##$PROCNO= 1
##$TYPE= <nmr>
##$USER= <she>
##$AMP= (0..31)
100 100 100 100 100 100 100 100 100 100 100 100 100 100 100 100 100 100 
100 100 100 100 100 100 100 100 100 100 100 100 100 100 
##$AQSEQ= 0
##$AQ_mod= 1
##$AUNM= <au_zg>
##$AUTOPOS= <>
##$BF1= 200.13
##$BF2= 200.13
##$BF3= 200.13
##$BF4= 200.13
##$BF5= 200.13
##$BF6= 200.13
##$BF7= 200.13
##$BF8= 200.13
##$BYTORDA= 1
##$CFDGTYP= 0
##$CFRGTYP= 5
##$CHEMSTR= <none>
##$CNST= (0..31)
1 1 145 1 1 1 1 1 1 1 1 1 1 1 1 1 1 1 1 1 1 1 1 1 1 1 1 1 1 1 1 1 
##$CPDPRG= <>
##$CPDPRG1= <>
##$CPDPRG2= <>
##$CPDPRG3= <>
##$CPDPRG4= <mlev>
##$CPDPRG5= <mlev>
##$CPDPRG6= <mlev>
##$CPDPRG7= <mlev>
##$CPDPRG8= <mlev>
##$CPDPRGB= <>
##$CPDPRGT= <>
##$D= (0..31)
0 1.2 0 0 0 0 0 0 0 0.06 0 0.03 0 0 0 0 0.0002 0 0 0 0 0 0 0 0 0 0 0 0 
0 0 0 
##$DATE= 1644569985
##$DBL= (0..7)
120 120 120 120 120 120 120 120 
##$DBP= (0..7)
150 150 150 150 150 150 150 150 
##$DBP07= 0
##$DBPNAM0= <>
##$DBPNAM1= <>
##$DBPNAM2= <>
##$DBPNAM3= <>
##$DBPNAM4= <>
##$DBPNAM5= <>
##$DBPNAM6= <>
##$DBPNAM7= <>
##$DBPOAL= (0..7)
0.5 0.5 0.5 0.5 0.5 0.5 0.5 0.5 
##$DBPOFFS= (0..7)
0 0 0 0 0 0 0 0 
##$DE= 6
##$DECBNUC= <off>
##$DECIM= 32
##$DECNUC= <off>
##$DECSTAT= 4
##$DIGMOD= 1
##$DIGTYP= 9
##$DL= (0..7)
0 120 120 120 120 120 120 120 
##$DP= (0..7)
150 150 150 150 150 150 150 150 
##$DP07= 0
##$DPNAME0= <>
##$DPNAME1= <>
##$DPNAME2= <>
##$DPNAME3= <>
##$DPNAME4= <>
##$DPNAME5= <>
##$DPNAME6= <>
##$DPNAME7= <>
##$DPOAL= (0..7)
0.5 0.5 0.5 0.5 0.5 0.5 0.5 0.5 
##$DPOFFS= (0..7)
0 0 0 0 0 0 0 0 
##$DQDMODE= 0
##$DR= 18
##$DS= 0
##$DSLIST= <SSSSSSSSSSSSSSS>
$$ [...]
##$SUBNAM2= <"">
##$SUBNAM3= <"">
##$SUBNAM4= <"">
##$SUBNAM5= <"">
##$SUBNAM6= <"">
##$SUBNAM7= <"">
##$SUBNAM8= <"">
##$SUBNAM9= <"">
##$SW= 18.0518050122584
##$SWIBOX= (0..15)
0 0 2 0 0 0 0 0 0 0 0 0 0 0 0 0 
##$SW_h= 3612.71676300578
##$TD= 16384
##$TD0= 1
##$TE= 0
##$TE2= 300
##$TE3= 300
##$TEG= 300
##$TL= (0..7)
0 120 120 120 120 120 120 120 
##$TP= (0..7)
150 150 150 150 150 150 150 150 
##$TP07= 0
##$TPNAME0= <>
##$TPNAME1= <>
##$TPNAME2= <>
##$TPNAME3= <>
##$TPNAME4= <>
##$TPNAME5= <>
##$TPNAME6= <>
##$TPNAME7= <>
##$TPOAL= (0..7)
0.5 0.5 0.5 0.5 0.5 0.5 0.5 0.5 
##$TPOFFS= (0..7)
0 0 0 0 0 0 0 0 
##$TUNHIN= 0
##$TUNHOUT= 0
##$TUNXOUT= 0
##$USERA1= <user>
##$USERA2= <user>
##$USERA3= <user>
##$USERA4= <user>
##$USERA5= <user>
##$V9= 5
##$VALIST= <valist>
##$VCLIST= <CCCCCCCCCCCCCCC>
##$VD= 0
##$VDLIST= <DDDDDDDDDDDDDDD>
##$VPLIST= <PPPPPPPPPPPPPPP>
##$VTLIST= <TTTTTTTTTTTTTTT>
##$WBST= 1024
##$WBSW= 4
##$XGAIN= (0..3)
0 0 0 0 
##$XL= 0
##$YL= 0
##$YMAX_a= 23009
##$YMIN_a= -24325
##$ZGOPTNS= <>
##$ZL1= 120
##$ZL2= 120
##$ZL3= 120
##$ZL4= 120
##$ABSF1= 10
##$ABSF2= 0
##$ABSG= 5
##$ABSL= 3
##$ALPHA= 0
##$AQORDER= 0
##$ASSFAC= 0
##$ASSFACI= 0
##$ASSFACX= 0
##$ASSWID= 0
##$AUNMP= <proc_1d>
##$AZFE= 0.1
##$AZFW= 0.1
##$BCFW= 1
##$BC_mod= 2
##$BYTORDP= 1
##$COROFFS= 0
##$CY= 11.3945322036743
##$DATMOD= 1
##$DC= 2
##$DFILT= <>
##$DTYPP= 0
##$F1P= 2.36226072786647
##$F2P= -0.459571619588291
##$FCOR= 0.5
##$FTSIZE= 0
##$FT_mod= 4
##$GAMMA= 1
##$GB= 0.15
##$INTBC= 1
##$INTSCL= 1
##$ISEN= 128
##$LB= 0.24
##$LEV0= 0
##$LPBIN= 0
##$MAXI= 10000
##$MC2= 0
##$MEAN= 0
##$ME_mod= 0
##$MI= 1.114404
##$NCOEF= 0
##$NC_proc= 0
##$NLEV= 6
##$NOISF1= 3.799351
##$NOISF2= 2.8
##$NSP= 1
##$NTH_PI= 0
##$NZP= 0
##$OFFSET= 15.70392
##$PC= 1
##$PHC0= -16303.5
##$PHC1= 3.200787
##$PH_mod= 1
##$PKNL= yes
##$PPARMOD= 0
##$PSCAL= 0
##$PSIGN= 0
##$REVERSE= no
##$SF= 200.130013532006
##$SI= 16384
##$SIGF1= 3
##$SIGF2= 2
##$SINO= 400
##$SIOLD= 16384
##$SREGLST= <1H.CDCl3>
##$SSB= 0
##$STSI= 0
##$STSR= 0
##$SW_p= 3612.71676300578
##$SYMM= 0
##$S_DEV= 0
##$TDeff= 0
##$TDoff= 0
##$TI= <>
##$TILT= no
##$TM1= 0
##$TM2= 0
##$TOPLEV= 0
##$USERP1= <user>
##$USERP2= <user>
##$USERP3= <user>
##$USERP4= <user>
##$USERP5= <user>
##$WDW= 1
##$XDIM= 8192
##$YMAX_p= 0
##$YMIN_p= 0
$$ End of Bruker specific parameters
$$ ---------------------------------
##NTUPLES= NMR FID
##VAR_NAME=  TIME,          FID/REAL,        FID/IMAG
##SYMBOL=    X,             R,               I
##VAR_TYPE=  INDEPENDENT,   DEPENDENT,       DEPENDENT
##VAR_FORM=  AFFN,          ASDF,            ASDF
##VAR_DIM=   8192,          8192,            8192
##UNITS=     SECONDS,       ARBITRARY UNITS, ARBITRARY UNITS
##FACTOR=    0.0002768,     1,               1
##FIRST=     0,             0,               0
##LAST=      2.2672688,     0,               0
##MIN=       0,             -24325,          0
##MAX=       2.2672688,     23009,           0
$$ Real data points
##PAGE= N=1
##DATA TABLE= (X++(R..R)), XYDATA
0@%%%%%%%%%%%%%%%%%%%%%%%%%%%%%%%%JqJ5j6J6j6J6j6J6j6J6j8K5l1L2l2L4
49A8m0M6m9N3o0O6p3Q1r1J05j20J37j60J92k35K98l97N67r06J812q010j7559L7961
72A3636K804l5216J2541K2614j6630j0842J1645P369n992j1895P383J7594j7434
85b423j5680K9762L333l5155J4576K8527k8299j2993L1070k591k3403J0113J2698
98I535q078p261K080J0168l81j7164P022K0192j9120j3828K8600n48k8686J5486
112a983J8574k2891m469J9882n055j0923N617M217K2m942m534J1918K015j8559
126a1111P862J8008j9017q542K3907m902j9093J4400P895j4935K092Q027m879
139b88l75K51j655O280l636p974J1706K070j5769Q116J1768j5725j702J5609q011
$$ plain form
0 0 0 0 0 0 0 0 0 0 0 0 0 0 0 0 0 0 0 0 0 0 0 0 0 0 0 0 0 0 0 0 0 0 1 -7 8 -8 8 -8 8 -8 8 -8 8 -10 15 -16 16 -16 18
49 18 -22 24 -25 28 -32 34 -39 42 -49 56 -64 73 -87 105 -130 168 -229 338 -568 1244 -6766 -24325 13636
72 13636 16440 -18776 -6235 16379 -251 -11093 552 7921 1929 -9966 -2583 15011 -2423
85 -2423 -18103 11659 14992 -20163 -5587 22940 -5359 -18352 12718 10127 -13276 -3163 9535
98 9535 1457 -5804 -3724 6444 6063 -11101 -4079 16113 -3007 -16835 11765 11217 -17469 -1983
112 -1983 16591 -6300 -10769 9113 4058 -6865 -1248 2969 2991 -1951 -6485 5433 7448 -11111
126 -11111 -3249 14759 -4258 -12800 11107 6205 -12888 1512 9407 -5528 -3436 4591 -288
139 -288 -663 -412 -2067 4213 577 -7397 4309 6379 -9390 -1274 10494 -5231 -6933 8676 665
154F65q015J1229j391o641O128j425l275O320m057m027R375l438q010J0228M71
169D137j0801P868M345j0915M623O377r686K323P205q798P40Q278q123j510R506
184E569o236m215R076l305n170P135k145m179O852l257m836R285k655r039J0400
199C280K294j2739O424Q155j1279k5R405n809l087N641k286n49K256m611L212
214B82M663r632J313J1667r814o951J5141k050j3707R716O730j1526P09P486l590
229D37j854Q71k49M148l312o022R874J862j4078O649J1990j4336m051J6307n072
244C164j1746J0025M335q828N81M016r4p15m204K444P453q434n642J4342j591
259E106j5354J0379R992j5494j144J4221n888q312P591K552m490j060P51M147
$$ plain form
154 665 -7350 3879 2488 -4153 1975 550 -2725 3595 -462 -4489 4886 1448 -6562 3666 4137
169 4137 -6664 1204 5549 -5366 -743 5634 -4052 -1729 5476 -3322 -2582 5696 -2427 -3937 5569
184 5569 -667 -4882 4194 889 -4281 2854 709 -3470 3382 125 -4711 4574 1919 -7120 3280
199 3280 5574 -7165 -741 7414 -3865 -3890 5515 -294 -3381 2260 -26 -575 1681 -2930 282
214 282 4945 -4687 -3374 8293 -1521 -8472 6669 4619 -9088 628 7358 -4168 -3459 4027 437
229 437 -1417 -546 -795 3353 41 -5981 3893 5755 -8323 -1674 10316 -4020 -8071 8236 3164
244 3164 -8582 1443 5778 -3050 -2469 1547 1453 738 -3466 -1022 6431 -2003 -7645 6697 5106
259 5106 -10248 131 10123 -5371 -6515 7706 1818 -6494 1097 3649 -841 -1901 -1150 2997
273B997o85q286N530Q854j2349l746J6239m968j3993J2269O646j4146J313J0280
287E955n246m467L838J369J36l140j991P749j080j0626P793Q349j3787j111J4814
302H555p037j0004J1426K556j0044K734N102l084j012m71J220L724n413k887R849
317E214k451j0521R210N838j2874J685J1016p620n045Q605q28n029K860L88k86
332A62J208l931J807N483o942k299J0084l997q312R326K302j0058M150N855o913
347b075N3M678l461K09K112l513K410K322o049K524N400p239n82Q108n183m253
363d539P840j694n606N602L07m878M109M15m375M147N44n144M227J870o109L188
379i6L534o068J593M520n420L59N006m935o44N745m490k158O524l183m059O330
$$ plain form
273 2997 2312 -5974 -444 8410 -3939 -7685 8554 3586 -10407 1862 8508 -5638 -4325 5955
287 5955 709 -3758 80 1449 1585 -1555 -3546 4203 3123 -7503 290 8639 -5148 -6259 8555
302 8555 1518 -8486 2940 5496 -4548 -1814 3288 204 -808 -1279 -59 3665 -1748 -4635 5214
317 5214 2763 -7758 1452 7290 -5584 -3899 7117 -503 -5548 3057 2229 -2800 60 448 162
332 162 1370 -2561 -754 4729 -2213 -4512 5572 1575 -6737 2589 4891 -5167 -1017 4838 -2075
347 -2075 -2022 2656 -805 -596 1516 -1997 413 2735 -3314 -790 4610 -2629 -3211 4897 -286 -4539
363 -4539 3301 1607 -3999 1603 1910 -2968 1141 1556 -2819 1328 1872 -3272 955 2825 -3284 -96
379 -96 3438 -2630 -1037 3483 -1937 -1578 3428 -1507 -2151 3594 -896 -3054 3470 287 -3772 2558
395B558r90n132M790P02m570L355O99l769L599J67m710M715J426o916M001M664
411D589p703O77P127n410k842O474j928l564L752o53j565K515k451l96M671m217
427i24k793P609k261p126P208K714q793K785O167n902j472M998j817j404J430
442D19j383J867P59m892L172M586p476m37Q866n139o005Q665N52q003L967M077
458C595m918n7K358j044R17j405j610M933j386o189O121L460r231J973Q334o829
474i78l859Q201j225n727L755J754k591M85m92P45K303m214o38O728l747n795
490e295P964J435r091L899O241o930j443O164k179k753K410k69K08K98k894K668
506D33K822o147O50P077n377m284Q228p69p222M918L233n706R08L143k337K72
$$ plain form
395 2558 1568 -3564 1226 1928 -2642 713 1412 -2357 1242 1409 -3301 1414 2840 -4076 -75 4589
411 4589 -3114 -2437 4690 -720 -3562 2912 984 -2580 1172 519 -1046 1469 -982 -1378 3293 -924
427 -924 -3717 3892 1631 -5495 1713 4427 -4366 -1581 4586 -1316 -2788 2210 393 -1011 419
442 419 -964 903 1662 -3230 -58 4528 -2948 -3385 5481 342 -5663 3002 3554 -4449 -482 3595
458 3595 -1323 -1380 978 -66 851 -554 -2164 2769 1383 -4806 1315 4775 -4456 -2483 5851 -978
474 -978 -4837 3364 2139 -3588 167 1921 -670 -185 -677 68 2371 -1843 -2481 4247 500 -5295
490 -5295 2669 4104 -4987 -1088 5153 -1777 -3220 2944 765 -1988 422 153 361 659 -2235 433
506 433 3255 -2892 -2242 4835 -542 -4826 3402 2633 -4589 329 3562 -2144 -1236 1907 -430 -158
522a58M31j551K783n12m220M350K184o866K235N924o177j867O950k650m265M756
538A347J82l373K284J6j465K339j648j641M300j694m079N200P47o073L475L583
554C500n718P09M436l724q11L550k427n77K820k658k03L442l242j076M680k746
570d5k819N071j098m107M221N10m262L046J300l980K404J682m007J999K367m176
586a894J222L219l925J09L699l234p25L733k681j219L872k389j913M330j793l127
602b716M471l83m216L622J239m269K124K028l407J238J726k905J502J579l581
617a948J791K705m550O57M592m170j690N357k110l428M196l2l252K407L14j986
633a147K061p44j828L380j009l623M323R43n620K939L790n437o4M915l027k037
$$ plain form
522 -158 273 -1278 1505 993 -3227 1123 3307 -3559 -1324 4600 -1577 -3444 3506 856 -3409 1347
538 1347 1529 -1844 440 456 -1009 1330 -318 -1959 2341 647 -3432 1768 2515 -3558 -83 3500
554 3500 -2218 -1509 2927 -797 -1608 1942 -485 -1062 1758 -900 -1103 2339 -903 -1979 2701 -45
570 -45 -2864 2207 1109 -2998 1223 1733 -2529 517 1817 -2163 241 1923 -2084 -85 2282 -1894
586 -1894 -672 2547 -1378 -1269 2430 -804 -1529 2204 -477 -1696 2176 -213 -2126 2204 411 -2716
602 -2716 1755 1372 -2844 778 2017 -2252 -128 1900 -1507 -269 1457 -1448 54 1633 -1948
617 -1948 -157 2548 -2002 -1345 3247 -923 -2613 2744 634 -2794 1402 1370 -1882 525 839 -1147
633 -1147 914 170 -1658 1722 713 -2910 1413 2356 -3264 -325 3465 -1972 -2036 2879 -148 -2185
649b185L522r14j437J705j198J48K020k938q9M258l291k695N685r33n270M299
665F87K285n242J242L385k943m15J926j312N92M22k276K270J381m483J716M191
681C426m900j284N923k520l993M685N52m038K023J430k061Q99m8r93K301j234
697A68k487L962J54m943L286L170n464L54M902l334k111L920q49k100J912m41
713I9n70J504j860j56L134k640j929M664j136m277M052J544m813J721L021l351
729i93p6K450j811L6J293j894J046J506l146R52L149l652p81M493k389k761M152
746A574l50l389K689P49k665J669N29k029J836J64k483K372P90l499K016K219
762B192l809O31L265l023p34L273j895j311K753j322j285K562j239j512K819r89
$$ plain form
649 -2185 1337 423 -1014 691 -507 -359 1661 -1277 -1366 2892 -399 -3094 2591 1658 -3612 687
665 687 2972 -2270 -1028 2357 -586 -1001 925 -387 205 627 -1649 621 2002 -2481 -765 3426
681 3426 -1474 -2758 3165 645 -3348 1337 1889 -2149 -126 1304 -757 142 94 -899 1402 168
697 168 -2319 1643 1797 -3146 140 3310 -2154 -1800 3102 -232 -2343 1577 728 -1372 540 99
713 99 -471 1033 -827 -983 2151 -489 -2418 2246 1110 -3167 885 2429 -2384 -663 2358 -993
729 -993 -1069 1381 -430 -394 899 -995 51 1557 -1589 -637 2512 -1140 -1921 2572 183 -2578 1574
746 1574 1224 -2165 524 1273 -1392 277 806 -1223 613 777 -1706 666 1456 -2043 -27 2192
762 2192 -1617 -986 2279 -744 -1478 1795 -100 -1411 1342 20 -1265 1297 58 -1454 1365 376
778C76k181K957k11k894K592P51l130J858J410k990J260J791k865Q09K200k815
794a082K18K723k533o04L002j903j289K868j230j606K623q77j787K636o38k271
810a750K788kl014K493J105l385J517K053k961M12K264k183n8J938j860P7J918
827A352k170m9K671k362j044L480j578k420L352p0l045K237J000k559J167R88
843I50j819J114M83j968J714P53k957J702K087l558L62L428k778j372L463j147
859D57k090K356j74j520J522m86r05J922j116j475K903o50k934K974J033l788
875a971J578K536l111j44K640j680p22J692j056j04J229j683L48K049k431n37
891a367L322j890k241L530k04l208K313J254k715Q72J365j654N78O24j457J290
$$ plain form
778 376 -1805 1152 941 -1953 639 1390 -1740 118 1528 -1462 -202 1589 -1276 -467 1733 -1082
794 -1082 -864 1859 -674 -1278 1724 -179 -1468 1400 170 -1436 1187 310 -1477 1159 521 -1750
810 -1750 1038 1036 -1978 515 1620 -1765 -248 1805 -1156 -744 1520 -663 -721 1217 -643 -566 1352
827 1352 -818 -867 1804 -558 -1602 1878 300 -2120 1232 1162 -1883 354 1354 -1205 -38 950
843 950 -869 245 728 -1240 474 1227 -1730 -28 2059 -1499 -1137 2291 -487 -1859 1604 457
859 457 -1633 723 549 -971 551 65 -840 1082 -34 -1509 1394 744 -2190 784 1817 -1971
875 -1971 -393 2143 -968 -1112 1528 -152 -874 818 -238 -342 887 -796 -448 1601 -830 -1367
891 -1367 1955 65 -2176 1354 1150 -2058 255 1509 -1206 -334 1031 -623 -45 579 -878 412
907D12M92k373J609J611l207O12L036k764j094L373j288k048K448j23j751J496
923D41j19j112J533o39j311K247m63k368K474P21l177J555K035k900J79K416j881
940c69n65J935j189m30J524j319j96J855j662o87K574j388j696K782l61k489K195
957E14O63k472J319J061k021Q65R87j817Q82J065k082P88J622k306K09K250k031
974e04o46K504j360j250K277p28j469J983l95j563J867j45j815J805K94k131J518
991B42Q77k248J014J337k118N25J576j904J43J778j776k22K034j567p46K235j117
1008F3j298K157n20j610J840o3j659J572J38j711J527L62k017J458Q91k334J009
1025a95J592k290K20K030j777m72J943j179o83J658r72o35J695j060q69K065q91
$$ plain form
907 412 904 -1469 140 1751 -1456 -844 2192 -572 -1666 1707 419 -1629 819 696 -1055 441
923 441 322 -790 743 104 -1207 1040 577 -1791 683 1404 -1773 -218 1817 -1083 -904 1512 -369
940 -369 -934 1001 -188 -618 906 -413 -609 1246 -416 -1103 1471 83 -1613 1169 808 -1681 514
957 514 1177 -1295 24 1085 -936 -71 916 -901 -19 1046 -1036 -248 1374 -932 -723 1527 -504
974 -504 -1150 1354 -6 -1256 1021 293 -1176 807 412 -1151 716 571 -1244 561 855 -1276 242
991 242 1119 -1129 -115 1222 -896 -371 1205 -699 -556 1222 -554 -776 1258 -309 -1055 1180 63
1008 63 -1235 922 402 -1208 632 569 -1090 482 620 -1091 436 798 -1219 239 1130 -1204 -195
1025 -195 1397 -893 -673 1357 -420 -892 1051 -128 -811 847 -125 -760 935 -125 -994 1071 180
1042A80j560K280j42k239J834Q08k319R77J309j815L48J185j362L26R91j511N26
1059a84J282j894J93K038j869p68K517j088j642K178p3j840J443L41j402J008
1075B40J49j175J249K5j619J571N62k295J182J580k396J84K168j697p23J952q43
1092A14q92J388n97n80J280q74o11J765r64j278K161k76k101J832P52k291R18
1109b54J390j769J82J271j202R8R50j183L33J108j600J91J732j664n94K256j070
1126A75j469K081j50j745J421L76j473R59L28j219J002K19j445J207N65j904R57
1143a15J306k039K22J836j584n07J816r53p96J489o15p64J367o12q20J521n41
1160B11j209J677j03j693J474N44j866R27J018j675M15J148j380J71J155j284
$$ plain form
1042 180 -1380 900 758 -1481 353 1161 -1158 -181 1128 -687 -339 846 -516 -190 801 -710 -184
1059 -184 1098 -796 -603 1435 -434 -1202 1315 227 -1415 763 690 -1150 293 634 -768 240
1075 240 389 -786 463 488 -1131 440 1002 -1293 -111 1469 -927 -743 1425 -272 -995 957 114
1092 114 -778 610 13 -567 713 -161 -772 993 29 -1249 912 636 -1465 367 1119 -1172 -254
1109 -254 1136 -633 -451 820 -382 -284 666 -517 -184 924 -676 -485 1247 -417 -1011 1245 175
1126 175 -1294 787 637 -1108 313 689 -784 175 503 -716 286 505 -940 267 832 -1072 -115
1143 -115 1191 -848 -626 1210 -374 -881 935 -18 -814 675 60 -704 663 51 -769 752 211
1160 211 -998 679 576 -1117 357 901 -965 -38 980 -695 -280 868 -512 -341 814 -470
1176d70N6J279j278k08J563j154o67J753p68j095J637k80j325J403M7j381J199
1193C11K70j451J056N51j583Q44Q94j608M59J209j478O0J380j240k39J401j038
1210b02m65J476q84p53J589n99j126J544j54j401J295K86j450R41N51j357P11
1227BO47j308N99Q20j423M31J171j480J4J537j247n42J623p69q92J416l73r35
1245g09J169k38r05J165k00j096J258P7j490J182O15j721P12J145j532J13J296
1262H41j125k05J125q39k05J045q85k42J262r32n92J579o55j179J588l1j496J141
1280A95N18j420O49O74j110M42N56j027N15O27j261M74J047j442M6J512j215n81
1298h01J590o20r90J308j79r64R74o5q31R50j37r42J119M1j334J102N44j598O68
$$ plain form
1176 -470 -414 865 -413 -621 942 -212 -879 874 106 -989 648 368 -957 446 493 -888 311
1193 311 581 -870 186 737 -846 -2 892 -716 -257 952 -526 -466 914 -326 -565 836 -202
1210 -202 -667 809 -75 -828 761 162 -964 580 426 -975 320 606 -844 97 648 -709 2
1227 2 649 -659 -60 760 -663 -232 939 -541 -527 1010 -237 -779 844 75 -817 599 226 -709
1245 -709 460 222 -683 482 282 -814 444 521 -969 213 828 -893 -181 964 -568 -455 841
1262 841 -284 -489 636 -203 -408 637 -248 -490 772 -160 -752 827 172 -1007 581 550 -946 195
1280 195 713 -707 -58 616 -494 -52 504 -523 -8 619 -642 -168 879 -563 -517 995 -220 -801
1298 -801 789 169 -821 487 308 -656 318 253 -578 372 235 -707 412 453 -881 221 765 -833 -165
1317a65J077j446O5J262j024k75J083o93l02R65p04k84J098p67n40J366n64j022
1335h70J409m7j364J081M66j336O20O55j092L76O33r78L54O77j093L07R44j200
1353d58j1J284j001n01J390o22q27J221k28r07R89n0q71Q96K3r71R18K14j186
1372f98Q20N41j289N01Q84j207J24J043r88j46J043p93k95J027o54m51J093n36
1390A9o72J142k85r25J070K2j063Q73K97j087O54M73j065N05O34j077L32Q30j071
1409c94Q0J015r40k13J098p13m64J075n11n81J021l41p22J014j93q97R97N0j083
1428g02Q33M10j156N60O35j043K67P58r10J01P69q15PQ73q26j77J057p29m84J159
1448E87m36q07J063p3r38Q16J64q75O16K52q41N81K96r43N58N31j091L59Q59j076
$$ plain form
1317 -165 912 -534 -469 793 -231 -506 577 -116 -418 547 -157 -441 657 -110 -650 716 152 -870
1335 -870 539 492 -872 209 675 -661 -41 614 -478 -102 531 -447 -93 584 -509 -202 742 -458
1353 -458 -469 815 -186 -687 703 81 -746 475 247 -660 329 279 -592 304 327 -644 274 488 -698
1372 -698 122 663 -626 -125 759 -448 -324 719 -269 -415 628 -165 -460 567 -87 -538 555 19
1390 19 -653 489 204 -721 349 371 -692 181 478 -609 45 518 -547 -42 592 -485 -153 677 -394
1409 -394 -314 701 -239 -452 646 -67 -531 544 33 -548 473 132 -590 424 231 -666 331 381 -702
1428 -702 131 541 -615 -55 580 -463 -196 562 -348 -247 522 -293 -286 587 -239 -416 641 -88 -572 587
1448 587 151 -656 407 334 -604 212 376 -499 117 369 -472 109 405 -538 20 551 -540 -181 678 -398
1468c98qJ062q22l51J039n09n04Q70l23m86Q18l24n60R15k40q00R87L7j072Q13
1488A44M36j123M48O92r44J29P22p41J7O65o87J0P22p34j26R67o99m58J097m15
1508A22p72R86qr06P24K26q26N23K63p42M88K82q24M86M66r77L51P58r71MR69
1529F22p59l33R63m62m86Q07k75m92P42k39n40Q05j94p11Q47N0r28P05L71r91
1549d98M15O03q59J36O69o97PO51o28n5P10o28j83Q57n67m23R42l40o56Q49n1
1570B54p70O81J52p57N32K54p51M55L29p75L75M87q36K20O79p99j5Q06o49k46
1590c74Q24m69l72P77l35m64P44k20n69P39o9p03O78J32q06N45L31p95L59M64
1610D17p38J98N63p07P7O42o45o9P19n50k68P96l93m54P59k08n59O80n4o11N97
$$ plain form
1468 -398 -406 656 -166 -517 522 13 -491 379 56 -430 388 64 -496 419 179 -621 366 403 -669 144
1488 144 580 -543 -95 597 -347 -218 504 -237 -220 445 -242 -232 490 -244 -370 597 -102 -560 537 122
1508 122 -650 336 328 -578 146 372 -454 69 332 -410 78 360 -464 22 488 -489 -138 620 -351 -347 622
1529 622 -137 -470 493 31 -455 352 77 -415 327 88 -452 353 159 -552 295 345 -583 122 493 -498
1549 -498 -83 520 -339 -203 466 -231 -224 427 -201 -256 454 -174 -357 500 -67 -490 452 112 -544 305 254
1570 254 -516 165 317 -440 92 346 -405 50 379 -396 -21 466 -370 -150 529 -270 -285 521 -128 -374
1590 -374 450 -19 -391 386 51 -413 331 111 -458 281 212 -491 187 319 -487 58 389 -406 -47 417
1610 417 -321 -123 440 -267 -190 452 -193 -262 457 -93 -361 435 42 -412 347 139 -420 260 206 -405 192
1631A92M0o61N56J76p31M69L47q01L14N41p47R4O47o30q3O60m93j82O50m16k59
1652c17O88l68l92P52k29n91P37j9p14N84K21p32L95L52o61K63L61n95J92M26
1672C53o26J15N73o39o0P30n51k86P67l34m63O81j16n25N60j7m83M82K1n42N15
1693A55J12o68M85L02p52L04N16p09O4O16n44j34N89l97j84N50l56k15N94l36
1713hl52O86k41n20O66%o71N26K28o76L37L48n92K06L59n32J70L80n42J01N11
1734C84n63m6O37m69k68O84l01m12O09j07m74N00j8m65M54L7n09M43J22n83L92
1755D7K82o59K55M51o08M8N44m94r3N49l84j80N30l22k29N49k70l32N83j46m82
1776c61N62J5n58M35J86n78L08K78n38K12L27n03J36L86n05M7M89m69r2N57l77
$$ plain form
1631 192 232 -429 127 303 -428 41 388 -413 -99 442 -305 -211 436 -194 -277 383 -110 -292 358 -58 -317
1652 -317 371 3 -389 363 134 -457 280 261 -453 131 352 -380 15 367 -294 -31 330 -265 -73 353
1672 353 -273 -158 415 -224 -284 446 -105 -391 376 42 -421 260 144 -381 179 162 -321 161 182 -360 155
1693 155 267 -401 84 386 -366 -62 454 -255 -191 425 -119 -253 336 -61 -245 305 -51 -266 328 -8
1713 -8 -360 326 85 -435 231 231 -440 86 314 -362 -25 323 -269 -63 296 -236 -66 314 -228 -127 384
1734 384 -179 -225 412 -57 -325 359 58 -354 255 148 -326 174 156 -309 145 182 -327 116 238 -345 47
1755 47 329 -330 -75 376 -232 -184 360 -134 -227 322 -62 -242 288 -34 -263 286 16 -316 267 121 -361
1776 -361 201 216 -342 93 279 -299 9 287 -251 -39 288 -215 -79 307 -198 -151 338 -131 -223 334 -43
1797d3k46N65k35l59N36j22l97M74k2m52M30N8m88L92J65n67L11L10n71J71L93
1818C03m93M3M52m31n9M82l75j44N24l24k52N49k18l69N41q0m55M48M6m73L64
1839G9J47m87K79K15m78K23K95n07J33M07m88j0M91m02j38M98k64k56M74j68k91
1860b48M32j14l25M30n0m08M42M3n07L85J98n49K39L24m83J06L65m21K1L80l71
1881a11m6M08l39j10M73l07k41N15j88l60M68k8m33L75R8m24K74J64m02K50J69
1902B05m13K09K60m50J16L80m47j1M64l67j56M65k33k47M20j41k65L76j07k92
1922b34L79m7l71L88N1m69L35J95m84J98L05m29P8L33l51jL45l10m5L66l03j03
1944a74M26k55k37M74j63l31M21j3l97L41Q2l86K51J43l69J93J87l92J69K39l94
$$ plain form
1797 -43 -289 276 41 -318 218 96 -301 173 151 -301 129 187 -301 91 256 -311 0 310 -261 -90 303
1818 303 -190 -147 305 -126 -185 297 -78 -222 302 -22 -274 275 57 -312 229 149 -306 142 188 -285 79
1839 79 226 -261 18 233 -245 -22 273 -234 -101 306 -182 -192 299 -103 -241 257 -7 -263 211 43 -248
1860 -248 184 70 -255 175 125 -283 159 202 -305 80 278 -271 -32 292 -191 -85 280 -141 -120 260 -111
1881 -111 -157 251 -88 -198 275 -32 -273 242 54 -306 162 134 -299 76 174 -250 24 188 -214 36 205
1902 205 -208 1 261 -189 -73 307 -140 -151 313 -54 -210 255 22 -225 195 54 -211 165 58 -234
1922 -234 145 98 -273 115 166 -303 32 227 -257 -59 246 -183 -105 228 -123 -124 221 -89 -134 232 -71 -174
1944 -174 252 -3 -240 234 71 -260 161 148 -249 92 174 -212 39 182 -187 6 193 -199 -30 209 -185
1965a85Q7L44l89k2M16l23j29M09j90k29L86j23k60L66p9k90L41ml53L35O5m03
1987b30K74J81m22J71K60l87P3K98l31jL27l07n8L66k80j23L96j99k33L95r8l02
2009b30L54j5l24K76P6l48K43J42l60J87J88l57J24K75l67M1L34l31m0L44k45
2030c3j30L54j97j62L34j28k33L45p4k93L34Ml35K78J00l59K07J73l41J30K11
2051A85l16P4K44k99K7K82k79n4L40k38j48L75j66k27L35n7k68K98qk75K48N3
2073A26k91K17R8l24J89J73l43J13K58l26K0L06k65p8L05j98j30L05j61j48L00
2094A46j38j86L05o8k69L09Ml12K57J06l24J61J69k98R9J96k66N7K21k68K5K71
2116A97k60n1L14k16j48L40j35k15K99m4k48K47K1k54K10M8k68J89R4k81J51J70
$$ plain form
1965 -185 -98 246 -143 -165 251 -72 -201 208 18 -211 175 52 -208 158 79 -211 130 126 -227 108 173 -230
1987 -230 44 225 -197 -26 234 -153 -80 218 -113 -114 213 -94 -152 214 -66 -189 207 8 -225 170 72 -230
2009 -230 124 109 -215 61 137 -211 32 174 -186 1 189 -168 -44 231 -136 -95 239 -92 -132 212 -33
2030 -33 -163 191 -6 -168 166 38 -195 150 76 -217 117 121 -214 64 164 -195 12 185 -156 -26 185
2051 185 -131 -57 187 -112 -85 197 -82 -136 204 -34 -182 193 27 -200 135 78 -190 108 100 -175 73 126
2073 126 -165 52 150 -174 15 188 -155 -42 216 -110 -90 216 -49 -127 178 -20 -150 155 -6 -154 146
2094 146 8 -178 127 59 -210 99 103 -209 48 154 -170 -9 160 -138 -39 157 -109 -52 169 -99 -74 197
2116 197 -63 -114 200 -16 -164 176 41 -174 125 81 -167 80 101 -153 57 105 -163 26 120 -161 -10 160
2138A60l11Q5K39k88J1K67k13p1K77j81j04K74j41j43K80j09j78K79o2k32K53
2159I2J5k72K07J00k84J42J49k59Q4J67k54N7K17k46%K43k30n5K83j88j25K73
2181A16q6j91K63l9k17K33J3k26J93M4k37J73J12k82J38J62k75P6K09k52kK32
2203A57k08m5K37j62r2K43j28j42K56r8j73K53l4k17K08L3k36J72R2k48J27J24
2225A19k16P9J55k23M4J94k19lK23j82o6K35j31j28K56q5j79K25m0j82K11j1k08
2248a32J83N2k42J46J05k34R7J44k26M9J86j94lJ87j69l9K08j38q1K22j19j17
2270a15K17o2j68K18j7k02J82M8k14J37Q2k00J02J12k15P9J49k20M7J83k15oK09
2293A31j57p4K13j02j25K02p8j29J86m7j38J70mj82J71M4k07J45Q9k19Q2J54k11
$$ plain form
2138 160 -151 -66 173 -115 -104 163 -50 -121 156 -25 -129 145 4 -139 141 32 -146 133 71 -161 92
2159 92 107 -165 42 142 -142 0 149 -110 -26 141 -113 -56 161 -85 -85 158 -72 -127 156 -32 -157 116
2181 116 30 -161 102 63 -154 79 92 -134 59 103 -134 39 151 -131 7 169 -106 -30 179 -73 -75 157
2203 157 -51 -96 141 -21 -113 130 2 -140 116 18 -155 98 64 -153 55 88 -148 24 116 -132 -5 119
2225 119 -97 -18 137 -86 -42 152 -67 -70 153 -29 -95 140 9 -119 137 52 -127 98 58 -124 87 76 -132
2248 -132 51 103 -139 7 112 -122 -25 119 -107 -58 128 -66 -69 118 -51 -90 118 -20 -101 121 2 -115
2270 -115 102 40 -128 90 73 -129 53 101 -113 24 106 -94 8 120 -95 -16 133 -87 -40 143 -72 -78 131
2293 131 -26 -100 113 11 -114 88 10 -119 67 20 -118 52 48 -134 37 81 -126 19 108 -111 -29 125 -86
2316h6M2J65j76kJ72j45l3J89j58n1J93j05j16K10n5j70K09k6j78J68L4j87J07
2339AQ8j77Q0R5j85Q5J18k01M6J63j76j4J89j33p4K00j01j00J77o2j21J70k6j40
2363i8J68Kj69J49M2j82J12R5j90O2J29j88K2J47j57OJ47j32l5J66j23o6J86j01
2387hr2J84o0j37J74j1j53J44L4j66J09O4j55Q8Q9j74O7J13j67L6J35j56oJ62
2411A14j20o6J64q5q6J52n1j18J56k6j31J33J1j52J20M2j60R5Q3j71P5J06j50
2434f5K9J35j47J1J34j28j4J53j09o4J65q2j01J58k9j32J46mj40J12L1j44J02
2457A7M8j51P6Q1j55N9J12j43QJ27j17k8J55j12n6J49p1o4J45n5r7J45m1j16J38
2482E4Mj33J13L9j37O9O4j28N0Q7j28L3R4j27kJ28j26kJ35j10n3J44o0r3J38j0
$$ plain form
2316 -86 -44 121 -55 -57 115 -30 -63 126 -32 -83 110 5 -111 99 44 -126 83 57 -121 47 81 -106 1
2339 1 89 -88 -8 87 -98 -13 105 -96 -50 113 -63 -77 112 -21 -95 105 4 -96 81 19 -102 68 42 -98
2363 -98 70 72 -97 52 94 -88 24 119 -71 -9 120 -68 -46 101 -56 -50 97 -35 -70 96 -27 -93 93 -8
2387 -8 -100 84 24 -113 61 50 -103 41 75 -91 18 82 -73 15 104 -70 -3 110 -57 -21 114 -42 -48 114
2411 114 -6 -72 92 7 -79 73 22 -96 60 34 -97 36 47 -105 15 57 -103 -8 75 -96 -21 85 -65
2434 -65 -36 99 -48 -37 97 -31 -45 108 -1 -65 100 18 -83 75 46 -86 60 56 -84 28 59 -85 17
2457 17 65 -86 -10 71 -84 -25 87 -56 -48 79 -38 -66 89 -23 -79 70 -1 -65 80 25 -72 73 32 -84 54
2482 54 58 -75 38 77 -60 9 73 -55 -5 82 -46 -13 81 -46 -48 80 -46 -48 87 -23 -76 68 8 -85 53 43
2508D3j21J16mj08R7L4j24Q6L9j26O1R2j48N6R5j24jJ23j00k4J23q6m8J24o1p3
2534e9J21m2p8J19l2j04J24Lj27Q9M9j33P1O4j23L6Q1j11K5R5j03PJ05j04m0J43
2560G6q1n4J23n8p7J20j9r2R6Rj10R8J9j04Q1L7j20O2O3j12K9Q9j10JR4r1j6J13
2588F6q7k1R8o1n5J00l7q4J17j7r3J04J5j17Q1L7r8N8N4j10N0O5j02J9Q6r5qJ03
2616F8q7j9R8o7m8J14n0o6J06k8p8Q9nr0O8J7r0P3L3r9M8P0j12L1Q7r7NQ1p5j4
2646c7R7o7l4R6m0o0J03k9q6J04j2q0P2K9j02P1K7j05M8N3j01L7N8q6K2P7r6R
2674c2P3o3l4J00n0n8J08l4n8P6rp1Q7Jq7P7K1r5P7L9j12M3O3r2K4P4q3mQ0p7
2704a6j8P7n7k0P4n0l7Q5k9o8P7Mq2P2J2p6O2K7p8N0L1p4L1M8p8K7O3p6JP7o9
$$ plain form
2508 43 -78 38 34 -74 23 57 -67 19 58 -68 -7 85 -63 -7 88 -36 -37 86 -14 -38 85 -1 -49 75 14 -59
2534 -59 62 20 -58 61 29 -75 49 52 -75 14 63 -70 1 65 -58 -22 59 -52 -27 68 -35 -28 77 -27 -67 76
2560 76 -5 -59 64 6 -71 49 30 -62 34 43 -67 31 50 -54 27 64 -56 6 69 -43 -14 75 -35 -34 60 -31 -47 66
2588 66 -21 -42 56 -5 -60 40 3 -81 36 19 -74 30 45 -72 9 46 -52 6 60 -50 0 65 -37 -18 68 -27 -35 68
2616 68 -19 -38 60 -7 -55 59 9 -57 49 21 -57 32 27 -63 5 22 -68 5 38 -61 -13 57 -55 -24 63 -34 -29 52 -23 -37
2646 -37 60 -7 -41 55 15 -45 58 29 -57 47 35 -45 27 56 -46 25 52 -53 -5 48 -53 -16 42 -44 -22 55 -41 -32
2674 -32 41 -22 -56 44 -6 -64 44 10 -48 28 19 -52 35 36 -51 26 47 -48 29 68 -44 -1 62 -30 -6 68 -15 -19 61 -16
2704 -16 -34 43 -14 -34 40 -10 -47 38 9 -59 18 22 -60 12 24 -52 10 37 -41 9 40 -34 -3 45 -33 -6 57 -19 -18 59 -10
2735a0j6P2m1m8Q3k5o5Q4k0m4N5mo1M6K2p7M6M2q1L2N4p7J5O0p5JP6o3j3P2m6
2766fj9O4l7m8Q3k2m6N7%o7P5jp2M9L0p4L0M8p5K4M8p0J3N5o3oQ2o1l3O9l9k7
2798c9O8k0n1P0qo7O3Rp6O2J4n9L0L6o6K2N2o2J6M4m6oN4l5j9N9l8l5P4l1n0O7
2830C2j8m6N4J5p7N6Oo7M6Qm6K6K9n1K6L8n6jO3m9j0N8m6j9N9j9l9N6j2m0N9j6
2862A9n2N8Nn4M0K0n5L1K2n7J6M0n6J0L6m2nN4m1k1M9m0j8P0l6l6O0k0k6M5No1
2894d0N6J7n5K9K7m6K0K6m8J6N1o0J1M5m7k2O0m3j3M0k2l3N3j8l9N1%m7M3J8o7
2925c7L8K0n9L2K8n3L0K0l8J1L7l4NM1m5lM0k1k5N2j3m9N2pm4L7ll5K8qj2J3J4
2958A2l0J3J9m8L0J9l8J0L0l1j2M5k6j4L1lk7L3j1k4L8Nm1L0J6m6L5J9n1J8K8
$$ plain form
2735 -10 -26 46 5 -43 40 15 -50 34 14 -30 25 21 -40 6 28 -49 -3 39 -42 -10 44 -33 -18 42 -33 -32 44 -19 -32 40 -6
2766 -6 -25 39 2 -46 37 15 -31 26 26 -41 34 33 -39 10 40 -34 -4 44 -31 -7 41 -29 -16 39 -24 -30 52 -9 -42 27 -12 -39
2798 -39 29 9 -42 28 20 -47 16 25 -51 11 25 -34 -4 32 -34 -12 40 -22 -6 38 -8 -14 40 5 -14 45 7 -28 46 15 -35 32
2830 32 14 -32 22 37 -40 16 22 -45 1 9 -37 -11 18 -33 -7 31 -25 -26 37 -12 -22 36 -10 -29 30 11 -28 28 16 -24 35 19
2862 19 -33 25 30 -24 16 36 -19 12 34 -23 -7 33 -23 -13 23 -19 -24 30 -11 -32 17 -23 -41 29 -7 -43 17 -3 -29 16 21 -40
2894 -40 16 33 -22 7 34 -12 8 34 -14 2 53 -7 4 49 2 -20 40 -3 -16 24 2 -31 22 4 -35 16 16 -31 12 30 -37
2925 -37 1 21 -38 -6 22 -31 -1 19 -19 -8 29 -5 0 41 -4 -7 33 12 -13 39 26 -23 29 22 -22 15 12 -23 5 -3 -15 -2 12
2958 12 -18 -5 14 -34 -4 15 -23 -13 17 -14 -26 19 -7 -21 10 7 -20 13 2 -22 16 21 -20 10 26 -20 15 34 -17 1 29
2989B9m3J8J4l1ML4l9JL0k8j8M8k1j8K5kl0L3pk0K6%k3L5j4k3K9J1l1ML1m0J5
3022aM1l6pL1k4j2L2j7j9L9j7j7K9k3j4K7Qm7L1J3l6J8J1k8QK2l5J3K2l0NK1k0
3055a2nL6l0qM1j8k0L8j5j9K9j5j3K4jl2L7nk7J9J7l3lL0l7J7L1m1ML4m1oK6j2
3089a0kJ7lk3L8j1l5L6Mk6J8J9l5K7J2k6kJ5j7OK5l4OK0j0j5L4m8K0J9j7k1K9
3122A0qj9K1mk5K4Kl0K6kj6K3Kk8J7K2k7%K7k1MK1j5j3L3l3%L0nk3L0qj6QQk1
3158fRJ6k8RJ5k9J4Rk6PJ7k0jJ9k1RK1k6mK8ok1J5Nj2K9Ll1K3nj8K1J0k8J0K4
3194C1l5%J7j6qK6k0j1K0k0j0L4j7kK0j2j4J9Lk9K7onJ3oj0J9kj1J9%k2J2K2k8
3229bNK2j6j2J7qj4J6j0j3L2j6k7L2j0j6J6jj1J4Lk0RJ4j6jQjLJ1j9%L0j1j7K0
$$ plain form
2989 29 -14 4 18 -13 -9 25 -14 -13 17 -11 -29 19 -2 -20 5 3 -27 6 -1 -21 5 5 -18 17 3 -20 9 20 -11 -7 24 -16 -1
3022 -1 40 4 -3 28 4 -8 24 7 -12 27 10 -7 22 -1 -15 12 20 -27 4 17 -19 -1 10 -18 -10 12 -23 -10 12 -18 -13 8 -12
3055 -12 -17 19 -11 -19 22 4 -16 22 7 -12 17 2 -11 13 12 -20 17 12 -15 4 21 -12 -15 15 -22 -5 26 -15 -11 23 -18 -24 2 -10
3089 -10 -12 5 2 -21 17 6 -29 7 11 -15 3 22 -13 14 26 0 -2 13 -4 2 27 -7 -1 19 9 -6 28 -20 0 19 2 -19 10
3122 10 2 -17 4 0 -25 -1 1 -29 -3 -5 -21 2 4 -24 -7 15 -12 -12 15 -6 -2 19 4 -9 24 -9 -9 21 16 -7 23 15 -1 7 15 -6
3158 -6 3 19 -9 0 15 -14 0 9 -17 -10 7 -13 -14 5 -16 -7 14 -12 -16 12 6 -15 0 5 -7 22 25 -6 17 12 -6 15 25 -3 7 31
3194 31 -4 -4 13 -3 -11 15 -5 -16 4 -16 -26 8 -9 -11 9 -3 -17 2 5 -24 3 -3 -8 5 -1 -11 8 6 -5 14 14 -8 4 26 -2
3229 -2 3 25 9 -3 14 6 -8 8 -2 -15 17 1 -26 6 -4 -20 -4 -5 -16 -2 1 -19 -10 4 -12 -13 -5 -6 -3 8 -11 -11 19 8 -9 11
3265A1qMJ7k0j4K0Lj3J2rkJ0mj1NPj5PK1k8POk0MJ7k5%K0k0kK5j0j0J8pj1K1r
3303clJ9nj7J2Oj3RQj5JJ8j8PJ7j9j4K8k6LK1j5jRjj8K1kl0K6Jj4%J3k1J3J1l3
3341b5RK3k2QJ2k6K2J3k0OK0k3J0J5jj3J0j9PRnj4J9j4qQPk0PLj6J3PrJJ6j9r
3379a8J9noPpjJ4qoJ6KpMPj2K0nj0J1Jj4J8Mj9mJ8rlRj7KRmj4J2mj1RnpJ3lj3
3422a7J5Rk3K0Jk%MmJJ2j6J0J5j3rJ9prRj7KK3j3pROj1jlrNJ0j9J4mrJJ9j9Rj
3464@kkK0j5lK3qj0J1j3lJ9Nj6J4%j5PRj2mOpMMj3mPj4nK5j7KPmkoOj6K2pKMM
3508CpRopJ1NnQLj2J1Oj5J2lpJ0%j3PJ8k8RJrj1J8j9NJ7j5%kKpJ0mKlLJkJ2j0
3552bPOqMrJ1KQmk0K3qj1PlPj2MkQooRj1KOJ1j7PLj0PpmjJ1k%NlLNrJMOj1J0k
$$ plain form
3265 11 3 7 24 4 -10 10 13 0 12 3 1 11 7 -4 1 8 -7 0 21 -7 0 6 -14 -10 7 -18 -18 2 -18 -20 5 -5 -15 3 -4 -15 6 -3
3303 -3 -6 13 8 -9 3 9 -4 5 13 -2 -1 17 -1 6 23 4 -10 18 -8 -5 16 1 0 9 8 -10 11 9 -21 5 6 -8 -8 5 -16 -3 8 -25
3341 -25 -16 7 -15 -7 5 -21 1 14 -6 0 20 -3 7 22 21 8 18 -1 6 15 10 -4 15 1 -7 1 8 -12 -5 -2 -18 -5 2 -7 -6 10 -9 -18
3379 -18 1 -4 -10 -3 -10 -11 3 -5 -11 5 7 0 4 11 -1 19 14 4 15 16 2 20 24 5 1 19 10 7 16 -1 1 10 6 -8 4 0 -11 -2 -7 -14 -1 -4 -17
3422 -17 -2 7 -16 4 5 3 3 7 3 4 16 0 10 25 12 3 22 15 6 15 -2 0 23 10 3 12 18 7 6 3 -6 -1 9 -10 4 0 -9 -8 11 -8 1 0
3464 0 -2 -4 16 1 -2 21 13 3 14 1 -2 17 22 6 20 20 5 12 21 9 5 11 4 8 12 -1 -5 2 -12 -17 8 -9 -7 0 -4 -6 -12 -6 -22 0 -7 -5 -1 3
3508 3 -4 5 -1 -8 3 8 3 11 14 2 13 19 4 16 13 6 16 16 3 10 28 0 9 10 1 -10 8 -11 -6 11 -4 -4 -6 -4 -11 -1 -5 -3 -6 -3 -2 -4 8 -2
3552 -2 5 11 3 7 -2 9 11 19 15 -5 18 10 -1 6 3 10 -2 2 0 8 2 -4 5 -6 -4 2 13 -4 3 6 -4 3 -4 -8 -9 2 0 0 5 2 5 10 1 2 6 12 1 11 9
3601IkPOpJMpNokLN%qLpj6K2qpJ4lj3PKpQj5RlmOjJ0nj1J9j0J3jkLJmlO%Kn%J
3652I%nRqlJ0k3J3onOmMqPJ1j6JQjkoOlmJ8mj0J4pJRllOnJRj9QPkKrLn%qJ1k0
3702a6J1p%JMjknJ2J6k4PJ7j7LPMj1OjMJ0j3PoO%%JmNJJj1nLqRnkJ3jpnJ5j5M
3749AnLMjlNlOj1PnRkRpOjj0J2olJjJJJjnJ3j2nOjLOj4NJpRrKpRL%J4k7J0LnN
3801DLo%N%JMj1J2Oj2MnJ4mpPoj3QrKLmj0J6Pk4J4lkKkJj2J0%PoMlNLjkjPJmL
3851FklJKPJoLj0RLqK%j1Rjj5J2KKrQkmlLJ%klJ1NpKJ2j1J6mj1ROj7NnJ4p%Kk
3901A0MnPj0j0LK0j9J4j3j4MkOj4J8LqkNlNqRQkoOJ5j4KRj1Rkj1NMqNjj1J8j7
3945bMKjpJ2kj0KkNjj2OjKqLjJ5j1QlPj%JJ1lPl%mqKkPOj4KJnjKPj2K%JnKj0R
$$ plain form
3601 9 7 14 20 13 14 18 11 16 10 8 11 16 16 8 11 4 -12 10 2 -5 9 6 -7 0 2 -5 3 -12 -3 -6 -10 -4 -5 5 0 -11 8 -2 11 10 8 11 12 8 5 11 11 13 8 8 9
3652 9 9 4 13 5 2 12 -11 2 -4 -9 -3 -7 -3 -11 -4 7 -9 -8 0 -1 -3 -9 -3 -6 -10 8 4 -6 8 1 2 11 8 5 11 6 7 16 -3 5 12 10 12 3 6 1 1 -7 4 -16
3702 -16 -5 -12 -12 -11 -7 -8 -10 -15 -3 13 -11 -4 13 -4 -1 6 10 -1 5 4 8 18 5 12 6 12 12 12 13 9 14 15 16 5 0 3 -5 4 -1 -3 10 9 2 -3 12 -3 1
3749 1 -4 -1 3 2 -1 4 1 7 -4 3 -2 7 5 14 7 13 12 2 14 8 5 6 5 6 7 8 7 2 15 3 -2 4 3 6 12 -2 3 4 -3 6 -3 -1 -8 1 4 4 18 -9 1 4 -1 4
3801 4 7 1 1 6 6 7 11 0 12 18 6 10 5 19 15 8 15 9 -4 4 -5 -3 0 -4 -14 2 9 -15 -1 -4 -6 -4 -6 -5 -17 -7 -7 0 -6 -2 -5 0 3 2 0 -1 6 7 3 6
3851 6 4 1 2 4 11 12 6 9 -1 8 11 3 5 5 -6 3 2 -13 -1 1 3 -6 2 0 -4 -7 -4 -3 -3 -5 -8 3 8 1 3 15 4 20 16 5 14 20 3 8 3 17 10 10 12 10
3901 10 14 9 16 6 -4 -1 19 0 14 1 -13 -9 -11 -5 -19 -1 2 -6 -8 -3 -6 -1 -9 0 8 6 0 6 21 7 9 18 7 16 14 3 8 12 4 9 8 -3 15 -2
3945 -2 2 4 3 -4 8 6 -4 -2 -4 1 0 -12 -6 -7 -5 -13 -10 -11 4 -7 1 -2 5 4 4 5 16 13 20 17 17 13 5 7 5 12 18 4 6 7 2 1 3 10 -2 0 0 1 -4 -2 -12 -3
3997cl%KoJ4j1PLMmmNmQkJJjNpjMJ0j3mK0j0LrJ1nJqoOnQo%MrlQmKlMNKj3%Qk
4050@LLjJ2krNl%PlrNmKNkrkkJ0nN%JqLj1RljjjlJ2KLj8J3lmJ0p%RnMQLj1j0J1
4102HPj1QpNll%nJ3j2kNJj6J1kkj1MLJ1j0J8j8OqOLlPkOnRpPkmNJ0j6P%NpQmq
4151ENjmJoMj7J2oMj3J5KjnMomQMOlLlNj9J2LlNmkPMj1NJ0Kmj1j1J8oNj3JQo%
4200a%Klo%o%NKQ%JkJpKMjPJNNLqJ1j5%jkQpKmmKknQ%okMKjnJqJ8j1K%MNpPnO
4257GjLqJ2J%mjj0J4JpNoQj1J1pLjpKmmkRomK%kJ1lkjKJJklmQqJ0%NrJ0qOJ1r
4309I%JOpqOJ3j5lj0J0JrPpJ1mj0J5j7QKKQj5J1pqQlQlNMOnl%Oj5J2OkklKror
4358a3J5qJ8k0M%OlnNj7J4j4QknQmOmMJ9j9jQjnJ5j1J4l%PJmj1Rj0%K%KnkpLQ
$$ plain form
3997 -3 -6 -6 -4 -10 4 -7 0 3 7 3 -1 4 0 8 6 7 8 7 12 5 4 8 18 5 1 21 11 14 5 16 11 12 4 -2 4 -1 7 1 1 5 -4 -7 1 -3 -1 -4 0 5 7 -6 -6 2 0
4050 0 3 6 5 17 15 6 11 8 8 15 12 3 8 4 6 11 9 0 -2 -4 6 1 6 6 7 -1 2 -9 0 -3 -4 -5 -6 -9 3 5 8 -10 3 0 -4 6 -1 -1 8 3 7 15 18 7 -3 8
4102 8 15 4 12 5 10 7 4 4 -1 12 0 -2 3 4 -12 -1 -3 -5 -16 -12 -9 2 -8 10 -8 -2 -10 -4 -1 -4 3 1 7 2 11 4 11 9 5 10 20 4 11 11 16 9 17 13 5
4151 5 10 9 5 6 0 4 -13 -1 -7 -3 -16 -1 1 0 -5 -1 -7 -11 -3 1 7 4 7 4 9 -10 2 5 2 7 3 1 8 12 1 6 16 18 14 3 -8 10 4 9 -4 -3 5 -1 -1
4200 -1 -1 1 -2 -8 -8 -14 -14 -9 -7 1 1 2 0 1 -6 -4 0 -1 6 7 12 17 20 12 23 8 8 7 5 13 6 8 4 0 2 0 -5 3 3 -3 -5 -1 1 0 -5 -4 -12 6 -5 -3 -3 1 6 -1 6 1 7
4257 7 6 9 1 13 14 14 10 9 -1 13 14 7 12 6 14 3 14 7 10 9 2 4 0 -4 -6 3 -3 -7 -5 -5 -7 4 1 -1 -2 0 1 2 0 -3 -7 1 -7 3 3 8 -1 9 1 7 18 9
4309 9 9 10 16 9 1 7 20 5 2 -8 2 3 -6 1 -6 5 1 -9 6 -11 -3 -1 1 9 -6 5 -2 -10 -2 -5 3 0 5 9 15 10 7 7 13 -2 10 16 14 12 9 11 2 -4 -13
4358 -13 2 -6 12 -8 -4 -4 2 -1 -6 -1 -18 -4 -18 -10 -12 -17 -9 -13 -7 -11 -7 12 -7 -8 0 -1 -6 9 -2 12 9 9 16 17 13 2 11 1 1 3 3 5 0 -2 -9 -6 2
4405Bj1OKnJnKJRnnoRlJ1pMNqNlJ9j4Nj2J3j1MJ1q%LJj2MP%Nk0NkmMj0K1j1qP
4453dnJ6j2NjnPKRj6J2JMK%pj2RlNLkNoNlLj9K1j2NJj3LR%j7J7j3LJJ1mmj3J4
4499BJj2J1nJ0qQklJ3rPnlJ5j0pQlKQpmlJ1j1oLnQK%lLnj%j1LJ1qNk%NnOLmMp
4550@JMNnOj%oOKkJlMmmLnoLkPKj4PjKJL%j1J1nNmlRJnmPJpJ3klll%J2j0jRLr
4605EJ0j3pJ3j5RJ2j8Nmj4J5j0J5qKpJ2qNj7J3lNLMjKMNj0%lMOomjLmLMj1Rj0
4650f%J4j7J2mqkNoPmkMj%ljJ2j6J0QkqLQ%%O%j2LKJ8j4Kj1N%oLJkNMo%rRpko
4701a4QkNpMQmpJ8pj0RKKnJNj2MlJ6qJKnRlMj1Ljj5J1%ljnQJlkomJ4%oJ1lJNl
4752Bj2QJ1lKppJ1qOPrJoPNrkPmJ%qLLolJ%KoP%nRKqOrNnRnJ0jK%J2oOj1kQlo
$$ plain form
4405 2 -9 -3 -1 -6 -5 -10 -8 -7 2 -3 -8 -14 -5 -8 3 -4 0 5 -3 2 -1 18 4 9 -3 10 -1 3 14 6 6 9 10 -2 2 9 9 14 -6 -1 -3 -7 -3 -13 8 -3 -11 -4
4453 -4 -9 7 -5 0 -1 -6 1 3 12 -4 8 9 13 15 15 8 -4 5 2 7 10 8 13 7 12 9 12 -7 14 2 7 8 -5 -2 7 7 -10 7 -6 -3 -2 9 5 1 -12 2
4499 2 3 -9 2 -3 7 -1 7 5 2 15 6 13 8 5 20 10 3 11 8 10 18 11 7 4 15 4 -2 1 -4 4 6 6 3 6 1 0 0 -11 -8 3 -5 0 -2 -2 3 -2 4 7 3 7 0
4550 0 1 5 10 5 11 10 10 4 10 12 10 11 8 12 8 4 7 2 -4 -1 -3 4 6 -8 -1 -2 0 1 4 4 -7 4 -1 4 0 -3 6 7 2 -2 5 6 -1 12 10 7 4 1 1 13 3 2 11 14 5
4605 5 15 2 -5 8 -7 2 14 -4 1 -3 -17 -2 -12 3 -5 -3 -10 2 -6 -1 -18 -5 -8 -3 0 4 3 5 9 14 4 4 1 5 11 5 1 0 3 -1 2 6 -5 4 -6
4650 -6 -6 8 -9 3 -1 -9 -11 -6 -12 -5 -9 -11 -7 -8 -8 -11 -12 0 -16 -6 2 0 -8 -5 3 3 3 9 9 -3 0 2 20 6 8 -3 2 2 -4 -1 0 -2 3 7 1 1 -8 1 -6 -8 -14
4701 -14 -6 -8 -3 -10 -6 2 -2 -9 9 2 -8 1 3 5 0 1 6 -6 -2 -5 11 3 4 6 1 10 7 11 0 3 2 -13 -2 -2 -5 -6 -11 -3 -2 -5 -7 -13 -17 -3 -3 -9 2 -1 0 5 2
4752 2 -10 -2 9 6 8 1 -6 5 -3 3 10 1 2 -4 3 8 -1 -3 4 0 1 1 -7 -4 -1 -7 -10 -9 -9 -7 -13 -6 -6 -11 -2 0 -8 -2 -11 -6 -11 -2 -7 3 2 4 4 16 10 16 5 3 11 8 2
4807BNlJ4j4JLp%NjkKlqJ1rlJ3qJoJ0jqLMqKJmPoJ1PKoMJqJ3j5J4m%j5J1plNr
4857fPJlOj3kJ0qkLLpKLKOqMmNNj0OKQnlklJ2%qOJpLJRk0MLQj8J1polmJ6krkO
4910iNj1LJ0%mjQrJ2%oNPj1PmJ6j2P%j4K2j3j1J1jLj0MMpoLnpkK1j4MPj5JOKj
4956ejjJrJ4MjLOjJ%pkKOpKRj1mJ5j5lPkkkrK%jPjkNqlJKOPmJklNmKJ1lLnJ%o
5012aMLkMlJJoNLrOlnJKj5RoNLJklMLkknJ2J3j0lLpLKJ0j1%jmJ1JLkj0MjNMj1
5064BKqpMj1JOlJ2Nk0PMmKkJ1kJ0pNLj1J0%lJ1qJJj6J5j1J0njlQroQokJLo%Ko
5113a3JK0j8jPlNj1OJ0mplJ4nJKQnOPj3ROj5J6nkj1J0Lk1RRrmNqlmPJjjOpkPk
5162cLK%onJ2Nj9J6MqNJOn%J0nojMjjmjln%Rj5%Qn%jRpjQj1nK6nj2OMkJ2J1j3
$$ plain form
4807 2 7 4 18 4 5 8 1 1 6 5 3 5 2 -6 5 -4 -7 6 -2 -1 -7 3 2 -6 -3 1 -7 -5 -4 -8 -1 -7 4 11 13 7 11 12 4 17 2 16 12 12 -3 8 1 -2 3 -6
4857 -6 1 2 -1 5 -8 -10 0 -8 -10 -7 -4 -11 -9 -6 -4 2 -6 -2 -6 -1 4 -6 0 2 10 5 2 0 -3 9 9 1 7 8 1 4 5 14 -6 -2 1 9 -9 2 -5 -11 -14 -18 -2 -4 -13 -15 -9
4910 -9 -4 -15 -12 -2 -2 -6 -7 1 -8 4 4 -2 3 10 -1 6 2 18 6 13 13 -1 21 8 -3 8 7 10 0 4 8 1 -5 -2 -7 -14 -16 5 -9 -5 2 -13 -12 -6 -4 -5
4956 -5 -6 -7 -6 -15 -1 3 2 5 11 10 11 11 4 2 4 10 3 5 14 3 -1 14 -1 -4 3 1 -1 -3 -12 -10 -10 -11 -4 -5 -7 -2 -10 -13 -12 -10 -4 3 -1 0 -2 -5 0 -4 -2 9 6 9 4 5 5 -1
5012 -1 3 6 4 8 5 6 7 1 6 9 0 6 3 -2 -1 1 -14 -5 -11 -6 -3 -2 -4 -7 -3 0 -2 -4 -9 3 16 6 3 6 -1 2 4 14 3 3 2 -2 9 10 13 11 1 5 4 9 13 2
5064 2 4 -4 -11 -7 -18 -17 -11 -14 -2 3 -17 -10 -6 -10 -8 -10 1 -1 9 2 7 10 -1 9 9 6 17 9 10 11 -5 10 -1 9 4 3 0 8 -1 -7 1 -5 -7 -6 -3 -9 -9 -7 -13
5113 -13 -12 8 -10 -11 -4 -7 -2 -13 -7 3 -1 -8 -11 3 -2 -1 1 9 4 10 17 4 13 19 4 20 15 13 2 12 15 -6 3 12 3 -1 4 -4 -7 -11 -4 -3 -4 -5 1 -6 -8 -1 -3
5162 -3 0 2 2 -4 -9 3 8 -11 5 9 1 6 7 13 8 8 18 13 7 6 10 9 8 4 3 0 -5 -5 4 -11 -11 -3 -8 -8 -9 0 -7 -8 0 -11 -16 10 5 -7 -1 3 1 13 24 11
5212A1j2J1pMPMj0nK4j6kmQj1j5J5Rj2LNj0qkQMMj1MKJrmQJN%JLKOmmNKQMqjK
5261A6Ok4J0MqkJ1j7%JJ1lLpKoJ%oJ%PNMj7%J5NqKj3J2lpJ7qMNpJ4lnJqmMjjl
5310@Rj0P%j5J1j0RnKKlqNJ0nlQ%q%J7pMpj%%J1rmMMRr%Qj0mJ3j0rJ2moRnpNj1
5360a1J1mmJj5K0oOj5NORnmJ4loPNnnJ1rQpJ4%qkMLj5NKj1Q%m%Oj1MoRk%KqNJ
5410@nPpJ2j5MkJ0NpOkOkKj%Mnmjko%NLqMpkLJ4j4MrJJ3j1Ln%%J2j0KOLkJlQk
5462FMmkJ0JmkjrJ2j4J0lpjMj1PjljkQPj3jNMPllnJ0kLnJ3j4PmoJ2kOnj0J3%j
5511A0j1Pn%QnjklRrj4J3kQq%mkOOo%nJ1kmJ1oLJJLnMLJrLLlOmoMJ0j7NoqROK
5564Fj2k%j1J7j3OQjpLOqMmOJ1j7J0Pjq%J3j1Qp%J4pKLj4%mLJ0j5J0ojlKKnJN
$$ plain form
5212 11 -1 10 3 7 14 18 8 3 27 11 9 5 13 2 -13 2 11 -1 2 7 -3 -11 -13 -5 -1 3 -8 -4 -2 -1 -10 -14 -6 -5 0 0 1 4 6 12 8 4 9 11 19 23 15 14 16
5261 16 22 -2 8 12 4 2 13 -4 -4 -3 8 5 8 1 3 -3 -2 -2 -8 -7 -7 0 5 9 -8 -8 7 12 4 6 -7 5 2 -5 12 4 8 13 6 20 17 12 13 5 1 5 4 3 0
5310 0 9 -1 6 6 -9 2 -8 1 -4 -2 0 -3 -11 -6 4 -1 -4 4 4 -4 -4 13 6 10 3 2 2 2 13 4 0 4 8 17 8 8 16 6 2 15 5 -4 8 4 -2 7 2 -5 0 -11
5360 -11 0 -4 -8 -7 -22 -2 -8 -2 -17 -12 -6 3 -2 -6 8 5 -1 6 11 6 1 12 3 11 4 18 18 10 8 12 15 0 5 7 -4 4 4 0 0 6 -5 -1 -7 2 0 0 2 -6 -1 0
5410 0 -5 2 -5 7 -8 -4 -6 4 9 2 8 6 12 10 12 11 11 15 10 6 5 3 -3 -3 2 5 -3 1 -6 -8 -5 9 -5 -1 -10 -9 4 -7 -4 -9 -9 -9 3 -7 -5 1 4 2 3 0 8 6
5462 6 10 6 4 14 15 11 9 8 -1 11 -3 7 4 -3 -4 0 -11 -4 -5 -8 -9 -11 -3 4 -9 -10 -5 -1 6 3 0 -5 5 3 6 1 14 0 7 3 -3 9 7 13 8 -2 11 11 10
5511 10 -1 6 1 1 9 4 3 1 -2 7 -2 -16 -3 -5 3 -5 -5 -9 -11 -5 1 -5 -5 -10 1 -1 -5 6 0 3 4 5 8 3 7 10 11 2 5 8 5 11 7 1 5 15 -2 3 -3 -11 -2 4 6
5564 6 -6 -8 -8 -19 -2 -15 -9 -1 -2 -9 -6 0 -8 -4 -8 -2 9 -8 2 9 8 0 0 13 2 10 3 3 17 10 12 15 1 1 -3 0 10 -5 5 -1 -2 -5 -3 -1 -6 -5 0
5611@j0j5K2Nmj1J6j3J0MJnljMLkOjMMqJmJ0j9P%mLmNRj4pPmlkJ4noJ5k1JJ5o
5658fmJ3mqNJ1MrJOnMMm%pQJp%LnoQLj1%LlOJj0KJkLOj5QrMoMLKJJ0j0%K3j4%
5710CoJ0MrOnQJqqQnNpqJ2j4Qj%nNj%j1J6mlMkJQj1%LMNqJ0j0J0%OkpQjOqj4K2
5761A5j0KJnoJ2jj5lMNkoOnLMj0lQK%PmP%j0J0j2ROj0LLPj1kPlpOM%nOqjJkLn
5812emJKllkJ3lpJ1mj3RPJoPoPLjLLj8J3J1j1J0ljJj3PQppPJmoMj0J2j8OJ%NO
5861Dj2O%lRmPPojplJ0lLqR%%Lj0%NKkLmJMlj0QrJ0j5jJ6qKjjkPqJjOopK0Kln
5914BkMKkJkM%j%J4j2KoJjrjJ1j1J3kj2%mJ0j3QNojPJj2kPNKmJ2nNqNKnLoQj2
5964eQOlj2J7lomJ1Jj6jOk%kjqRQKj3MnJmJ5j4KJ5j1KJ2mkkJ1njJMlJl%J2j7R
$$ plain form
5611 0 -10 -25 -3 2 -2 -13 3 -10 0 4 5 0 -3 -4 0 3 1 7 6 10 14 6 7 3 13 -6 1 1 -3 0 -4 1 10 -4 -11 -4 -8 -11 -13 1 -4 -10 5 -16 -15 0 -6
5658 -6 -10 3 -1 -9 -4 7 11 2 3 9 4 8 12 8 8 1 9 10 3 3 6 1 -5 3 6 -5 -5 -2 -5 1 2 -8 -6 -5 -7 -4 2 -13 -5 -14 -10 -16 -12 -9 -7 -6 4 -6 -6 17 3 3
5710 3 -3 7 11 2 8 3 11 12 4 -4 4 -1 4 -3 -11 1 -13 -5 -6 -6 -11 -6 -7 -7 -18 -2 -6 -9 -5 -7 -6 2 -9 -9 -6 -2 3 -5 5 -5 5 5 11 9 2 10 9 15 7 -7 15
5761 15 5 7 8 3 -3 9 8 -7 -10 -6 -1 -3 -9 -3 -8 -5 -1 -11 -14 -6 -4 -4 3 -1 6 6 -4 6 -6 3 9 -1 2 5 12 1 -1 6 3 -4 2 6 6 1 7 -1 -2 -1 -3 0 -5
5812 -5 -9 -8 -6 -9 -12 -14 -1 -4 -11 0 -4 -17 -8 -1 0 -6 1 -5 2 5 4 7 10 -8 5 16 5 15 12 11 12 -1 6 14 7 0 7 8 4 -2 2 -8 4 -14 -8 -7 -7 -2 4
5861 4 -8 -2 -2 -5 4 0 7 14 8 7 0 -3 7 4 7 -1 8 8 8 11 1 1 6 8 6 9 5 6 10 7 -3 5 -4 6 -9 -10 6 -2 0 -1 -2 -4 3 -5 -4 -5 1 -5 -12 8 10 7 2
5914 2 0 4 6 4 5 3 7 7 6 6 20 8 10 4 5 4 -5 -6 5 -6 7 5 -7 -7 -11 -1 -14 -6 -1 -7 -8 -1 0 -12 -14 -7 -2 0 -4 8 3 8 0 5 7 2 5 -1 7 -5
5964 -5 3 9 6 -6 11 8 2 -2 9 10 -6 -7 -1 -3 -3 -5 -6 -14 -5 3 5 -8 -4 -9 -8 -12 3 -11 -9 6 -5 -3 9 5 3 1 12 7 6 7 11 8 9 6 6 18 1 10
6012A0ppnPLokrjJ2lLKlLjNmqJ1moQjJ1%j0PomK7j7J5j0lolM%MpQJqJpRm%Nj2
6063hjKj0J2Pj4J4pjKKMj0QOkjkjMJPj8POLmJLmqPoLkkJ0rprJ3MplmjKlMPKj1
6115a4MNNjlQRJj1kPRmnjoJljnKNjJ5j6jOj3P%Oj5KJ0j3J0j0J1mlJRLqmQPj3l
6164iJ1LpJ5oNLp%jjKnLj0Rj7NJ0lol%OrJ7j2JJ0j2J7j8KKPj3J1MkJRk1J0J1r
6209CJkMNjMkpLmJ1j1qMKojpOJkOrlqJ2mJ1JLkKPlMoNJjLlrJ7j5jRJnpkLJ0j4
6262dNMlj0J0j0pNj3L0olj3PoJ1mmLlOoJ5Ppo%J3Q%Kj0Oj0%kPrlQn%jojnnMNM
6312boMj3MJ0mMOmKLmoKLjkQkRpMmJ1pmnKJ1oKKMj7J2rokPn%j1Qk%LmNMl%%Qn
6366cNMj1J2nl%JRlMnRj1Qj2KOlPqJjlQk2J1nkJ4j3Rj6PJ2onPolRJjLMKmQlok
$$ plain form
6012 10 3 -4 -9 -2 1 -5 -7 -16 -17 -5 -8 -5 -3 -6 -3 -4 1 -3 -11 0 -4 -10 -2 -3 8 8 -2 5 -1 -5 22 5 20 10 7 1 -2 2 2 6 -1 7 8 0 1 -6 3 -1 -1 4 -8
6063 -8 -9 -7 -17 -5 2 -12 2 -5 -6 -4 -2 2 -8 0 6 4 3 1 0 4 5 12 -6 1 7 10 6 7 10 6 -2 5 -1 2 0 -2 8 -1 -8 -17 -4 0 -7 -10 -14 -15 -13 -16 -12 -5 -3 -14
6115 -14 -10 -5 0 -1 -4 4 13 14 3 1 8 17 13 8 7 1 2 -1 -2 -7 -5 0 -1 14 -2 -3 3 -10 -3 -3 3 -12 -10 0 -13 -3 -13 -2 -6 -9 -8 1 4 -4 -8 0 7 -6 -9
6164 -9 2 5 -2 13 7 12 15 8 8 7 6 8 3 6 -4 5 -12 -7 3 0 -6 -9 -9 -3 -12 5 -7 -6 4 -8 9 -9 -7 -5 2 -11 0 4 2 3 12 -9 1 12 3
6209 3 4 2 6 11 10 14 12 5 8 4 15 4 -4 0 2 -4 -5 -12 -6 -5 -7 -1 -10 -13 -21 -9 -13 -2 -1 2 0 2 9 6 10 4 9 10 9 12 9 0 17 2 1 10 11 6 -1 -3 0 10 -4
6262 -4 1 5 2 -8 2 -8 -15 -10 -23 7 1 -2 -15 -8 -14 -3 -7 -11 -8 -11 -5 -11 4 11 4 -2 -2 11 19 19 21 11 17 7 7 5 12 3 0 8 3 3 2 -4 -5 -10 -15 -11 -6 -2
6312 -2 -8 -4 -17 -13 -3 -7 -3 3 -1 1 4 0 -6 -4 -1 -2 -4 4 2 11 4 8 4 15 8 4 -1 1 12 6 8 10 14 -3 9 0 -6 -8 -1 -6 -6 -17 -9 -11 -11 -8 -12 -7 -3 -6 -6 -6 2 -3
6366 -3 2 6 -5 7 2 -1 -1 0 9 6 10 5 14 3 11 -1 1 7 4 11 3 4 3 0 8 -14 -3 -8 -10 4 -9 0 -16 -9 3 -3 -8 -1 -7 -10 -1 0 -1 2 6 8 4 12 9 3 1
6417APJRj7M%jmkJ1j7PmPqKJ2j1J3j2kJj0PRoMJmjm%J0qNOLpOoJ3j1KQrLmPlq
6467@KKJj5RJ2j5NpkJ1qNpljP%J0j1MjJLKjoKLJJJ7pj8K4kljJj3PmojjJMmoOo
6518hJJoJ3Nj4jnJ3%j4J1NJLnjOnKPmQJj2KKLqQpoNkljJ3npjMmQmrLQmqOlQp%
6572gJ4j0%J0j%loMPJlkJNj2kLmJ1mQrpJ3j6jLrP%J0oj2J7jmoLLL%jRj2NPkON
6622A5rLqLOooNQj6LMJJ0j8jKmMj4J0j2NPoKjKJMLmMMmLkjjOJ5rnJJMplNJMmj
6675D%kMmkpPk%j9J8%rkJ0%Nn%LoRJKkkKrJ6oJ3J%jlj3nJ0%Oj1LkjMkmMjjj1N
6727ejoJ0qoJ5mPokOjPlnj0J3LKQmJnNmkj2knK0lrQoKq%jMMmNqRonLK%jKQj0M
6781dLLJ0mnk%KjJ1j0QoQj1jKjKlk%Lj2Mmk%kPmlRlnMJ2qjOKlJnRkJOrOljjR%
$$ plain form
6417 1 8 9 18 1 5 5 4 0 -2 9 -8 -1 -5 2 -6 -4 8 -3 10 -2 -4 -3 -13 -6 3 -3 1 2 -2 -3 -7 -7 3 -5 0 6 9 2 8 2 15 4 6 14 5 8 4 11 8 0
6467 0 2 4 5 -10 -1 11 -4 1 -6 -8 3 -5 0 -7 -10 -11 -4 -4 6 -5 -1 -2 -1 2 4 3 -3 -1 2 3 4 21 14 -4 20 18 15 14 15 2 9 5 -1 -2 -3 -2 2 -2 -8 -2 -8
6518 -8 -7 -6 -12 1 6 -8 -9 -14 -1 -1 -15 -4 1 2 5 0 -1 5 0 2 9 5 13 14 2 4 6 9 1 9 2 -4 1 -1 -4 -5 8 3 -4 -5 -1 -5 3 -1 -10 -7 1 -3 -11 -5 -8 0 -7 -7
6572 -7 7 -3 -3 7 6 6 3 -3 1 8 9 6 4 5 10 -2 -4 -1 -5 6 2 10 1 -6 7 -9 -10 -7 -16 -9 -9 1 -5 -17 0 -1 -5 -11 -8 -5 -2 -2 -3 6 -6 -1 6 4 10 15
6622 15 6 9 1 4 10 4 -2 3 11 -5 -2 2 3 13 -5 -6 -4 -8 -4 -18 -8 -20 -15 -8 -14 -12 -13 -11 -10 -6 -3 -7 -3 1 -3 0 -2 -3 -4 2 17 8 3 4 5 9 2 -1 4 5 9 5 4
6675 4 4 2 6 2 0 -7 0 -2 -2 -21 -3 -3 -12 -14 -4 -4 1 -4 -4 -1 -7 2 3 5 3 1 3 -6 10 4 17 18 18 17 14 1 -4 6 6 12 1 4 2 1 5 3 -1 3 2 1 -10 -5
6727 -5 -6 -12 -2 -10 -16 -1 -5 2 -4 -6 0 -1 6 3 -2 -12 1 4 6 14 10 11 6 11 7 5 -7 -9 -14 6 3 -6 2 -4 -2 -10 -10 -11 -7 -3 -7 -2 -10 -1 -7 -12 -9 -7 -7 -8 -6 2 -8 -4
6781 -4 -1 2 12 8 3 1 1 3 2 13 3 11 5 13 2 1 3 2 4 1 -1 -1 2 -10 -6 -10 -12 -12 -14 -7 -11 -14 -5 -8 -13 -9 3 -5 -6 0 2 -1 0 -5 4 2 3 9 0 6 3 2 1 10 10
6836A0mJ0j1pjjKJjKllMlNojmjmOMnJ2j0%RkLNj0J1lOmrN%llLMJLj1lKnOKj8J
6888a9J1n%%LNlmjlJ0%LqLKj%NmJ3qPj2J2%jmRNj2N%oLqj1LLJlLnkLNoJj2J5q
6939a6nJ6P%Jm%%Rj0JjjRjn%jJ0pRpjJ2qqlRplknRNj6OmJ3krnJ1nKNMklmOJ0L
6991A2pNKNj0J3pmonRQk5LjJ0NJpj3OnPmnJ7j2PqoMNLlNjmNKljPqJPomRQjKj7
7043eLJ0j1kQlj8Rj%J2j7NJ4okmJJJJkpRNrLnMMmJ2pJ3Jjj8RrK1qrJ0j0Qnp%%
7092fjmJJnNkNk%lJKLLNjm%J0plQrJ0jmMn%PqLmNMoJpKlJ%kjJkmPj6QkPPj1kM
7149a0JLoJ6j0RPrKpLLqJJ2mkJKmJo%jNpOmKj0LNj0J3oJLOk3J3KmRpPn%jPmP%
7201BKNrJ1Oj4jMjKnlpJKlmlQqQj0Pj1J4kOjkRk2LPQkkNojOMkJjjPpPoLkkJMr
$$ plain form
6836 10 6 16 5 -2 -3 -4 -2 -1 -2 0 -3 -6 -2 -5 0 -6 -7 -11 -12 -16 -10 -6 -11 1 -9 -9 0 -2 1 6 -4 7 4 10 6 -3 2 2 -1 -4 -1 3 4 7 -4 -7 -5 -10 -4 -2 -20 -19
6888 -19 -8 -13 -13 -13 -10 -5 -8 -12 -13 -16 -6 -6 -3 -11 -8 -6 -7 -7 -2 -6 7 -1 6 -6 6 6 5 1 10 15 3 8 8 2 5 -3 -14 -11 -8 -7 -10 -7 -12 -14 -11 -6 -12 -11 -23 -8 -16
6939 -16 -21 -5 2 2 3 -1 -1 -1 8 -2 -1 -2 -3 6 5 0 0 -1 9 2 11 4 3 15 7 -1 -4 5 -2 -5 -7 -12 -3 2 -14 -8 -12 1 -1 -10 -15 -4 -9 -7 -2 2 0 -3 -7 -1 9 12
6991 12 5 10 12 17 7 20 13 9 3 -2 7 15 -10 -7 -8 2 7 8 1 -12 -6 -11 -4 -8 -13 4 -8 -1 -9 -15 -11 -6 -3 -6 -1 -2 -6 -1 1 -2 -3 4 -4 -3 4 -2 -6 3 11 10 12 -5
7043 -5 -2 8 -3 -5 3 0 -18 -9 -10 -10 2 -15 -10 4 -2 -4 -8 -7 -6 -5 -4 -6 -13 -4 1 -8 -5 -10 -6 -2 -6 6 -1 12 13 12 -6 3 -6 15 7 -2 8 -2 6 1 -6 -6 -6
7092 -6 -7 -11 -10 -9 -14 -9 -11 -6 -8 -8 -11 -10 -8 -5 -2 3 2 -2 -2 8 1 -2 6 -3 7 6 2 6 1 1 8 0 3 -1 4 8 2 3 -4 -2 -5 -4 -4 -6 -7 -6 -8 -12 -5 -21 -13 -15 -8 -1 -12 -14 -10
7149 -10 -9 -6 -12 4 -6 3 10 1 3 -4 -1 2 -6 -5 7 3 1 2 4 0 1 -5 -5 -6 -1 -8 -2 -6 -4 -14 -11 -6 -16 -3 -9 -8 -5 1 -22 -9 -7 -11 -2 -9 -2 -7 -7 -8 -1 -5 2 2
7201 2 4 9 0 11 17 3 2 6 5 7 2 -1 -8 -7 -5 -8 -12 -15 -7 -15 -7 -17 -10 -21 -7 -9 -3 -4 -6 3 -19 -16 -9 -1 -3 -5 0 -6 -7 -1 3 1 2 1 0 7 0 7 1 4 2 0 1 5 -4
7256d%LjNj0J1j7MLkQmojOmJ4j7LKQjONpjJlNQj4NmJOq%nQnMmkLo%%J0j6MqPo
7309a6mNLkLlmOJ3onJ3jnLJ5mmmOpQr%k%%lKjPj2J2rpLLnPpJJ6oj3J3j6J7jLj2
7359iJ0npJ4m%%NjJ1j0kMnj%mN%Rj4PMj6RjMrn%%KKJpRj0J1QjljMqOjPNrKNoK
7412G%NqQj1J5j0JpKQj3mNnqJ1jnMqJQnNPj3NOmOOqO%nKrJ0NKj1K%JlQloMmmO
7465AOjj3%jmMlQkkPj2J0lj1OJ3p%%Oj%NkJ1j4LKqJ6j3qJ2rjKMrJ0JmjkqKjON
7515@jNqJ0j7J0j1J0K%JkLJ0lnMkNLj0lJJ0oj0J6j2Rn%LlnmKkj4K0j7KkPOk%j
7562fkPOj0J4qlJJ5j0JoQrNLJLj0J2kj0J0nj2J0%lNj9mRlRq%lJ0Nqj0QjJJ6j1
7608dKJ1pnJ1lKkJ2r%jMlnPkplLOj1LJp%npJ4r%QJljpQJPom%MJ0oKJ2o%OonMM
$$ plain form
7256 -4 -4 -1 -2 3 -7 4 -13 -9 -6 -8 0 -4 -10 -11 -5 -9 5 -12 -9 -7 1 0 6 11 4 3 4 1 6 14 0 5 1 2 8 0 0 -5 3 -2 2 -2 -4 -1 -7 -7 -7 3 -13 -9 -17 -10 -16
7309 -16 -20 -15 -12 -14 -11 -14 -18 -12 1 -5 -10 3 2 -3 0 15 11 7 3 9 2 10 1 1 -1 -1 -1 -4 -2 -3 4 -8 4 -5 -12 -9 -6 -11 -4 -11 -10 6 0 -13 0 -16 1 0 3 -9
7359 -9 1 -4 -11 3 -1 -1 -1 4 3 14 4 2 6 1 0 0 -4 1 1 10 -4 3 7 -9 0 -1 3 -6 -11 -11 -11 -9 -7 -6 -13 -4 -14 -3 5 4 1 0 4 -4 2 1 8 13 4 6 11 5 7
7412 7 7 12 4 12 1 16 6 7 0 2 10 -3 -7 -2 -7 -15 -4 -5 -10 -6 -14 -13 -5 -10 -5 2 -11 -6 0 -4 2 8 0 6 6 1 3 -6 4 9 11 0 2 2 3 0 8 5 -1 3 -1 -5 1
7465 1 7 6 -7 -7 -8 -12 -8 -11 -3 -5 -7 0 -12 -2 -5 -16 -10 3 -4 -4 -4 2 1 1 6 4 15 1 4 6 -2 14 1 -7 5 -4 -5 -3 1 -8 2 3 -1 -2 -4 -12 -10 -11 -5 0
7515 0 -1 4 -4 6 -11 -1 -12 -2 0 0 1 -1 2 12 9 4 8 6 11 14 4 1 2 12 6 -4 12 0 9 4 4 7 4 -1 -5 -3 -5 -19 1 -16 -14 -16 -9 -3 -5 -5 -6
7562 -6 -8 -1 5 -5 9 1 -2 -1 14 4 5 -1 7 -2 3 6 7 10 0 12 10 0 10 5 -7 3 3 0 5 -14 -18 -9 -12 -3 -11 -11 -14 -4 1 -7 -17 -9 -10 -9 7 -4
7608 -4 -2 9 2 -3 8 5 7 5 17 8 8 7 11 8 3 10 8 1 -2 1 7 -4 -1 0 -7 -7 -12 -19 -5 -14 -14 -6 -5 -8 -9 -16 -8 -7 0 -6 -10 -10 -6 4 -2 0 12 6 6 12 6 1 5 9
7662IoKqJ0j5QJ%nKmoNnK%PmkomJ6KJrMPnLNj0KJJ0j2JJMLj%KpQjjJj7QKMmjj
7716cMj0JLokPpNLlNLkMJmMj%kNJJ0j2j1MQjLj0J3j4J1oJPj0mLoLOpJ%j0%%O%
7767iJPlm%LmJ1j0J8j4J3j0jOjKJ3j9QKrMjJj0MJOlloJkKknP%Oj5QL%jMJLmLK
7818DjMqPKnmJ0roQJ2ojj2JmOMmokJ0j4LP%jkoO%Rj0jJ2qRrRJkJJ%jkQkKj0Jl
7871bkRjNj1mKljQjqJ2%j2LjjMmkPLpNJJ2nmMjPj2J1JmnjjJ9k1mJ4j0PjJj1Mk
7921cPo%Qj6lkNJ0qMjOrJ1rLoRRjlkRqPj3J2JKkj0J0JlpJkqJ3j1KojPmnPnNqM
7973ijJLNj3K1j0%JJ0lqJ3kK%jKmqkJ9j2nJ0KlpoKOp%pJ3j3nOKM%j1QOnOMpjP
8023CoPM%njNJj2LMLqOPKj7mJ0NqoPkkJLQj1l%jnJJ3rklJ0nKMMlpJ0mMMlNqJ2
$$ plain form
7662 9 3 5 -3 7 -8 0 1 1 -4 -2 -6 -12 -7 -12 -10 -10 -3 -7 -9 -15 -19 -3 -1 0 -9 -5 2 -3 0 5 -5 -3 -2 8 -4 -3 -2 2 5 4 4 6 -1 7 6 5 6 -11 -3 -1 3 -1 -2 -3
7716 -3 1 -9 -8 -5 -11 -13 -6 -13 -8 -5 -8 -3 0 -2 2 3 -1 3 2 2 0 5 6 16 4 -7 -3 5 4 7 -3 10 -4 7 1 2 9 -1 -5 -2 -8 -5 1 -6 -5 -5 -15 -15 -15 -9 -9
7767 -9 -8 -1 -4 -8 -8 -5 -9 2 -8 10 -4 9 -1 -2 4 3 5 18 -1 7 9 0 4 3 4 -6 -2 -1 5 2 -1 -7 -6 -8 -6 -8 -13 -6 -6 0 -15 -7 -4 -4 -5 -1 0 3 -1 2 4
7818 4 3 7 -1 6 8 3 -1 9 0 -6 2 14 8 7 -5 -4 -8 -2 2 -2 -8 -10 0 -14 -11 -4 -4 -5 -7 -13 -7 -7 2 -8 -9 3 -5 4 -5 4 5 3 4 5 5 4 2 10 8 10 0 1 -2
7871 -2 -4 5 4 9 -2 -6 -4 -7 -8 0 -1 -9 3 3 -9 -6 -7 -8 -4 -8 -10 -3 0 -7 -2 -1 11 6 2 6 5 12 0 11 12 8 3 2 1 20 -1 -5 9 -1 6 5 6 -5 -1 -3
7921 -3 4 -2 -2 6 -10 -13 -15 -10 0 -8 -4 -5 1 -8 3 -6 -3 -9 0 9 8 5 3 12 4 11 -2 10 11 13 11 1 11 12 9 2 3 1 -7 6 -5 -3 -9 -10 -3 -7 -12 -5 -10 -5 -13 -9
7973 -9 -10 -9 -6 -1 -14 7 -3 -3 -2 8 5 -3 10 8 10 10 9 11 7 -1 -3 16 4 -1 9 11 8 1 -5 -3 3 -4 -4 -11 2 -11 -16 -10 -8 -4 -4 -15 -7 -1 -6 0 4 -3 -4 3
8023 3 -3 4 8 8 3 2 7 8 -4 -1 3 6 -2 4 11 13 -4 -8 2 7 -1 -7 0 -2 -4 -3 0 8 -3 -6 -6 -7 -12 -11 2 -7 -9 -12 -2 -7 -5 -1 3 0 -7 3 -1 3 7 4 9 1 13
8076A3j9J1Lj1jNqRojQoLj7J1OmqNnPMjqjLkJ4pRj5J4j9QKOQn%%%jKmQqnJ2j5
8125flQjllNnJKlKkNmLk%MLnqMPLlMmkJ1oJ0mmj%LnKojLnLj4J7oOmJrNj3K2mj1
8180a3QmLJ1j1KJlJ1j2J1
$$ plain form
8076 13 -6 5 8 -3 -4 1 -7 2 -4 -5 3 -3 0 -17 -6 0 -4 -12 -7 -12 -5 -1 -2 -10 -11 -8 -10 4 -3 6 -9 5 -14 -6 -4 2 10 5 5 5 5 4 6 2 10 2 -3 9 -6
8125 -6 -9 -1 -2 -5 -8 -3 -8 -7 -5 -8 -6 -8 -3 -7 -4 -6 -6 -2 1 -4 -12 -8 -1 2 -1 3 -1 -3 8 2 12 8 4 3 3 6 1 3 -3 -4 -1 -6 -3 -17 0 -6 0 -4 -3 -12 -7 -20 2 -2 -13
8180 -13 -5 -9 -6 5 -6 -4 -3 -6 5 -7 4
8191D
$$ Imaginary data points
##PAGE= N=2
##DATA TABLE= (X++(I..I)), XYDATA
0@%%%%%%%%%%%%%%%%%%%%%mJ2j6J6j6J6j6J9k7L2l2L9m7M9n7O4p2Q1q9R7j06J22
43F5j37J51j67J85k02K18k41K67k93L24l57L94m36M83n37O00o74P59q62R93j159
64f26J378j687K154k946M636j4154J6907J7347m1574Q351K7701j4610j7214J5868
78A531O993p529r613O102J4670j1072j8395K4318J0316l3487N216L3607k2778
91a21k1171L1002M786k8361P788J7717r967r063N134P687k31j3698K741J9574
105A3817j2791j8313K4768P242l0030Q498K4667k0503j1428K2545j274j5651O461
118a992O812l145l539k885P958M336j5784K301J9448j3791j4224K2619J812k2669
132a2743J0581J3846j5856k286J2062m554l837L262j616L247k36q043P768N879
$$ plain form
0 0 0 0 0 0 0 0 0 0 0 0 0 0 0 0 0 0 0 0 0 0 0 -4 8 -8 8 -8 8 -8 11 -16 16 -16 23 -24 25 -32 32 -40 41 -48 49 -57 65
43 65 -72 79 -88 97 -105 113 -128 139 -154 170 -187 207 -229 254 -283 317 -357 402 -460 533 -626
64 -626 752 -935 1219 -1727 2909 -11245 5662 23009 -18565 -10214 17487 2877 -14337 1531
78 1531 8524 995 -8618 -2516 12154 1082 -17313 7005 17321 -16166 -10950 22657 -121
91 -121 -21292 9710 14496 -13865 -6077 11640 1673 -7390 -2256 5431 5200 -8498 -5757 13817
105 13817 1026 -17287 7481 14723 -15307 -6809 17858 -2645 -14073 8472 7198 -8453 -1992
118 -1992 4820 1675 -1864 -4749 3209 7545 -8239 -5938 13510 -281 -14505 8114 9926 -12743
132 -12743 -2162 11684 -4172 -6458 5604 1050 -2787 475 -1141 2106 1870 -6173 1595 7474
146G474j4600K899J4803j2680p134J6771l648j2484J0676L075r730M660K631n600
160b887M642k30o091P358O04r633P324M766j1486M016Q262j0317K25R503p978
175a922k158R379o228l583R499m913n406R743k642p534Q536L57p863N997J561
190B823o481N198O75o730O820J492j0085O886O292j2457K195J1208r649m179J1161
205E169l532o488O528n4l485L071k388J7N430o642k306J1449n584j0116J3220
220D289K651j5304O419J0654j1463k718J0043k880m534K831J09J699r09n739O529
235A677M696j2604K117J3904j0982q510J6184p29j4693Q296Q041j0124j284O573
249B562j024j882j837Q83O279n100p311J1737K547j5650O142J3376j3668n669
$$ plain form
146 7474 -7126 -4227 10576 -2104 -9238 7533 3885 -8599 2077 5152 -4578 82 2713 -2887
160 -2887 1755 1525 -4566 2792 3396 -6237 1087 5853 -5633 -1617 6645 -3672 -3447 6056 -1922
175 -1922 -4080 5299 -929 -4512 4987 74 -5332 4411 1769 -5765 2771 3128 -4735 1262 2823
190 2823 -3658 1540 2215 -4515 2305 3797 -6288 598 6890 -5567 -3372 7836 -1813 -5992 5169
205 5169 1637 -4851 1677 1623 -1862 1209 -1179 -1162 4268 -2374 -4680 6769 1185 -8931 4289
220 4289 6940 -8364 -1945 8709 -2754 -5472 4571 1691 -2843 -12 97 1796 887 -4852 1677
235 1677 6373 -6231 -4114 9790 -1192 -9702 6482 5753 -8940 -644 7397 -2727 -4011 2562
249 2562 1538 -344 -2181 -1298 4981 -119 -7430 4307 6854 -8796 -2654 10722 -2946 -8615
263h615J5660k909j1575P480N099o452j158K391K180o1o398K571R232r006o991
278h552J4950m45j5944R117J0724j4009k406J2766l959p305N111K361j868j675
292a134j602N380J089r676M232J0212j1205n135J5067l167j3006R918O299j1415
306d143O26P734l560k668J578M81K408k985l946P883O57j0859N947Q780j1671
321c738k162J2651n122q332Q801J818p220K473K559k019R83j900j93N254m368
336e15m464R025o85r871P069N630j0381J160Q426o144k838O342k313k303L372
351A510k336oL504m609j51O353n178l363Q298k455o661P089J282p295M133L119
367C234n849K271K936m853K127K831n224J981L949n700O94N326n123j066N850
$$ plain form
263 -8615 7045 4136 -7439 41 5140 -1312 -2470 -79 2101 2040 -4358 -1787 7445 -1561 -8552
278 -8552 6398 5953 -9991 -874 9850 -4159 -6565 6201 2242 -5063 48 2409 541 -1134
292 -1134 -2736 2644 3733 -5943 -1711 8501 -2704 -7839 7228 4061 -8945 973 7272 -4143
306 -4143 -3517 4217 657 -2011 -433 48 2456 -529 -4475 3408 4065 -6794 -847 7933 -3738
321 -3738 -5900 6751 1629 -6703 2098 3916 -3304 -831 1728 -291 692 -1208 -1401 3853 -515
336 -515 -4979 4046 3361 -6510 559 6189 -4192 -3032 5394 -750 -3588 2754 441 -1862 1510
351 1510 -826 -832 2672 -1937 -2088 4265 -913 -4276 4022 1567 -5094 1995 3277 -4018 115 3234
367 3234 -2615 -344 2592 -2261 -134 2697 -2527 -546 3403 -2297 -1603 3723 -1400 -2466 3384
382C384l914k300N814k945l169N936k103m379O052n40n794N207J653o283L271
397a10L112n232J632K929m128J682K344m714K379L541o334J250O337o280k185
412c777Q003l358n296O500K78n421L352J375l087K047m26j945L982j804m253O275
428B445M87p924M986N300q572J61P926m800l866N920n41l324K095k91K2J560l625
445b041R23N255n500k912Q700k405p939P365L382q871K024O269m946j842L924
460A386r67n77J74j720L245N20o011L755N314q095r04R349m690o390Q042J164
476C595p326K941L714l587k61J079k79J754k396j927N778j366o767O077L956r047
492d062J323Q090n856l893P014p01m622K743J020j313P07j731R21L319m557j415
$$ plain form
382 3384 -530 -2830 2984 39 -3130 2806 703 -3676 2376 1836 -3958 1249 2902 -3381 -110
397 -110 3002 -2230 -598 2331 -1797 -115 2229 -2485 -106 3435 -2899 -1649 4688 -1592 -3777
412 -3777 4226 868 -4428 2072 2350 -3071 281 1656 -1431 616 190 -1755 2227 423 -3830 2445
428 2445 2932 -4992 -6 5294 -3278 -3117 4809 9 -3857 2063 1522 -1802 293 2 24 1584 -2041
445 -2041 -1118 4137 -1363 -4275 4425 2020 -5919 1446 4828 -4043 -2019 4250 -696 -2538 1386
460 1386 419 -158 16 -1704 1541 2061 -3950 -195 5119 -2976 -3880 5469 779 -5611 2431 3595
476 3595 -3731 -790 2924 -663 -924 155 -124 1630 -766 -2693 3085 1719 -5048 1029 4985 -4062
492 -4062 -2739 5351 -505 -4398 2616 1915 -2707 36 1056 -257 450 -1281 -360 2959 -1598 -3013
508c013P075l053o104P208J853q217L162N442n792r73M724k080j341J724j330
523g15J211R01l900K384L638n957j17O879m472m161P031n14n967M143K199m461
539a878J421J773k291J472N2k417L223J83m621L628K700o078J461N185m999j458
555b644N488k533k789M094j055k291L058j219j781L457j621k595M364q54m142
570c063M261R51n012K938K489m676J472L060l939O54L177l610J74L552l411o52
586a635M110k849j712M229j885k448L892j104k781L657o36l230L704J00m121L429
602G20J510m773K229K962m359N63L444l131l40K877k399j41K612k844J1L544l411
619i26j221M987k569l421N150k62m756L507J736m099J498J903k582J097Q12k343
$$ plain form
508 -3013 4062 1009 -5095 2113 3966 -4251 -1089 4353 -1439 -2412 2312 232 -1109 615 -715
523 -715 496 1397 -2503 -119 3519 -2438 -2555 4324 -148 -4309 2722 2208 -3759 384 2583 -1878
539 -1878 -457 1316 -975 497 549 -1868 1355 1538 -3083 545 3245 -2833 -1372 3813 -1186 -2644
555 -2644 2844 311 -2478 1616 561 -1730 1328 109 -1672 1785 164 -2431 1933 1079 -3063
570 -3063 1198 2149 -2863 75 2564 -2112 -640 2420 -1519 -865 2312 -1298 -1124 2428 -983 -1635
586 -1635 2475 -374 -2086 2143 258 -2190 1702 598 -2183 1474 838 -2392 1312 1412 -2709 720
602 720 2230 -2543 -314 2648 -1711 -1148 2296 -835 -1175 1702 -697 -838 1774 -1070 -1059 2485 -926
619 -926 -2147 2840 271 -3150 2000 1738 -3018 489 2225 -1874 -376 1527 -1055 42 854 -1489
635a489K238O43l891K773K575n339J025N070m504k027N563j714l637L646L99k699
651a368J655M0j045J932j580j361L922j574l839M757J021n858K803L997n155m23
667b076M600k436j880K739p34p10J194j691Q35K175l590nM724l461k992N794o83
684A803n278L925K314m704R81K865k390p2J164j288J318R7k744K682J593m798
700b532J580M387m659j507N540k054l685L987N00l243J720P57j501J274o58j120
716a214K791j212k841L877N46m811K759L128m787J71M181k839j549L196j131j268
732a003J840j172k32K025k291m45L472k418k206M398q56l920L567J250m099J757
748c33K184k980O09J772k145P61J314k453J160J881l197N90L158l162q59L854
$$ plain form
635 -1489 749 1392 -2499 274 2849 -2490 -1465 3605 -899 -2926 2637 923 -2714 932 1331 -1368
651 -1368 287 327 -718 1214 -366 -1727 2195 621 -3218 1539 2560 -3298 -495 3502 -1653 -2076
667 -2076 2524 88 -1792 947 213 -497 697 -994 -159 2016 -1574 -1579 3145 -316 -3308 2486 1803
684 1803 -3475 450 2764 -1940 -959 1906 -484 -556 608 -680 638 735 -2009 673 2266 -2532
700 -2532 -952 3435 -1224 -2731 2809 755 -2930 1057 1557 -1686 34 791 -710 564 -94 -1214
716 -1214 1577 365 -2476 1401 1947 -2864 -105 3023 -1764 -1593 2588 -251 -1800 1396 265 -1003
732 -1003 837 -335 -567 1458 -833 -1278 2194 -224 -2430 1968 1112 -2808 759 2009 -2090 -333
748 -333 1851 -1129 -520 1252 -893 -132 1182 -1271 -111 1770 -1427 -837 2321 -841 -1700 2154
764B154k024k145L443p06k482K604n5k282K213K4k318K273L26k800K175J107l232
781a725J532J998l138O21K508k710o1K676k305n50K826j997j109L068j511j814
797a691L035p29k363K661Rk504K171M01k495J971O73k748J877J286l200J345K269
814A968l229K29K974k485q60K878j485j255K332j042j065K158j229j162K707j213
830B21k101L196k54l220K690J251l489J309K179k670J73J956j764J26J356j799
846h40O40J591k567M24K802k815r72L773j700k572L401K9k986J995R62k166J047
863D6N67j466J393j7j950K154N56l207J907K182l635K98L399k571j387L127r39
880D57j782J932k79j036J375q83o08K108j424j489L084o70l000K903J101l622
$$ plain form
764 2154 130 -2015 1428 722 -1760 844 789 -1493 720 744 -1574 699 1025 -1775 400 1507 -1725
781 -1725 -193 1805 -1333 -712 1796 -914 -975 1701 -604 -1154 1672 -325 -1434 1634 123 -1691
797 -1691 1344 615 -1748 913 922 -1582 589 990 -1505 466 1139 -1609 268 1554 -1646 -301 1968
814 1968 -1261 -1032 1942 -543 -1403 1475 -10 -1265 1067 25 -1040 1118 -111 -1273 1434 221
830 221 -1880 1316 1062 -2158 532 1783 -1706 -397 1782 -888 -715 1241 -523 -397 959 -840
846 -840 -200 1391 -1176 -752 2050 -765 -1737 2036 336 -2236 1165 1194 -1792 203 1165 -1001 46
863 46 613 -853 540 523 -1427 727 1283 -1924 -17 2165 -1470 -1172 2227 -344 -1731 1396 457
880 457 -1325 607 328 -708 667 -216 -824 1284 -140 -1629 1455 785 -2215 688 1789 -1833
896a833J387K370k779r3K217j500l55J318j218L35J194k037N03K252k581o04L370
913A946j797k222L307j48k909K097R62k325J012Q56j531R78L32j667J581N48k549
930a529J545J737l063M27K829k434r54K889j193j576K135m33j310J586n15j026
946h85J792p63j454K307l41k347K265P37k880J404J697k558M13J929j883p9J691
963A045j530o5J650j652j78K067j695p80K515j246j590K495m12k061K039K55k081
980a224J530N87j991J267Q03k069J057J190k185O64J672k093J01J978j749m29
996h91K042j347p98K060j061j119K112p44j524K092k02j948J835M11k089J329
1012A58Q33j946R28R97j850P62J175j967N79J621k077L5K170j807p59K369j121
$$ plain form
896 -1833 -446 1924 -855 -948 1269 -231 -586 732 -486 -151 1043 -994 -491 1761 -820 -1424 1946
913 1946 149 -2073 1234 1086 -1823 274 1236 -1089 -77 779 -752 226 558 -1109 472 1020 -1529
930 -1529 16 1753 -1310 -883 1946 -488 -1442 1447 254 -1322 813 380 -930 656 141 -885
946 -885 907 144 -1310 997 656 -1691 574 1311 -1569 -165 1532 -1026 -613 1316 -567 -646 1045
963 1045 -485 -550 1100 -552 -730 1337 -358 -1138 1377 131 -1459 1036 624 -1437 602 857 -1224
980 -1224 306 893 -1098 169 972 -1097 -40 1150 -1035 -371 1301 -792 -691 1287 -462 -891
996 -891 1151 -196 -994 1066 5 -1114 998 254 -1270 822 620 -1328 507 918 -1171 158
1012 158 991 -955 -27 970 -880 -118 1057 -910 -331 1290 -787 -752 1418 -389 -1148 1221 100
1029A00j346K058m20j446J606j81j306J513k23j444J737L5k015J721P90k470J087
1046b04J651k271J23J974j573m69J651j010m50J344j048k91J570j305o62K159
1062A189j077j557K380j80k254J798Q17k189Q76J159j599M22Q93j289O20P34j614
1079h71P99J253k098L06K123j936p65K470j043j546K023j32j551J292J17j133
1095f92J088j47j096J443j26j683J653N77k316J136J559k258J20J994j504o21
1111h73J701q16o40J250p51l79J322j051n53J828r67j314K134k34k016J717O77
1128A035k080R11J112j611L87R87j258L93Q32j384N19J150j696J58J774j620n93
1145i84K117j005j267J876k80j444J387Q0j273J130R5j239J176J89j538J216O28
$$ plain form
1029 100 -1246 812 392 -1054 552 371 -935 578 355 -1089 648 683 -1332 389 1179 -1291 -204
1046 -204 1447 -824 -701 1273 -300 -769 882 -128 -578 766 -282 -573 997 -308 -970 1189
1062 1189 112 -1445 935 755 -1499 299 1116 -1073 -197 962 -637 -215 678 -611 9 743 -871
1079 -871 -72 1181 -917 -611 1512 -424 -1189 1281 238 -1308 715 583 -968 324 441 -692
1095 -692 396 249 -847 596 470 -1213 440 1017 -1299 -163 1396 -862 -742 1252 -252 -873
1111 -873 828 12 -628 622 -129 -508 814 -237 -790 1038 71 -1243 891 657 -1359 358 1035
1128 1035 -1045 -134 978 -633 -246 741 -517 -124 708 -676 -157 993 -703 -545 1229 -391 -984
1145 -984 1133 128 -1139 737 457 -987 400 480 -793 337 432 -807 369 558 -980 236 864
1162H64j855Q48J237j828K24J571j436l12J564j032n25J418q16o21J448p44q47
1179h42J591n04j249J605o1j545J333M14j627R46P39j539O60R06j488M35J123
1196H97j467J54J373j351k41J552j085o14J571p37q81J478m53j044J406k17j233
1213h92J352R2j484J183N23j625Q10R19j521L78J105j292J08J124j147l6J215
1230H12j133k39J447j047o63J661o87j135J569j47j376J222K77j310Q75M03j203
1247f74Q03M18j275Q02O85j530N94J171j579N6J546j245n34J566p16q03J258l79
1265A64p57J079l78p43J201l71j047J385k0j503J199O22j696O71J092j427J09
1282d20J137r92r5R36q32m0R60r87j11J276j031n68J615o67j147J538m2j410J088
$$ plain form
1162 864 -991 -143 1094 -734 -510 1061 -375 -687 877 -155 -680 738 -78 -699 749 5 -842
1179 -842 749 245 -1004 601 540 -1005 328 742 -885 61 800 -739 -79 827 -661 -226 897
1196 897 -570 -416 957 -394 -635 917 -168 -782 789 52 -829 649 196 -848 558 341 -892
1213 -892 460 552 -932 251 774 -851 -41 878 -643 -265 840 -452 -344 780 -367 -403 812
1230 812 -321 -560 887 -160 -823 838 151 -984 585 438 -938 284 561 -749 126 529 -674
1247 -674 129 547 -728 74 759 -771 -177 994 -585 -529 1017 -228 -762 804 88 -715 543 164
1265 164 -593 486 108 -635 566 195 -852 533 513 -990 209 831 -865 -194 898 -529 -420
1282 -420 717 -275 -370 566 -266 -306 654 -333 -444 832 -199 -767 848 181 -966 572 530 -880 208
1301B08M27j265O65M75j017N74L99j073O79N72j363N79J031j469O0J467j167n44
1319g62J503o38q37J196k68p74R56k20p07J000k41r28J165K5j316J059N42j512
1337g57O06R91j319J21J074r63j36R64p90j48R28q00k26J144q13n65J374n41r74
1356h30J320o5j224J025L13j177P05M53j057N50N15j057M81O76j151L34R51j173
1374d11j7J205r63m11J249o31o39J132l72p47J001j92q30R79l6r92R23K31j154
1393f75P48N31j183M76P40j084K22Q69r77J5R55q79j75J052p64m11J129n54o66
1412f31J116k80q48R93l4r30Q60J37r72P52L01j069O53N38j141M20Q25j099Q2
1431c27J011r06j97R97o65l65R49n19m46R57m52n99J051l06q48J029L7j094Q30
$$ plain form
1301 208 635 -630 35 510 -507 67 466 -607 72 644 -719 -140 891 -578 -518 949 -218 -762
1319 -762 741 103 -734 462 194 -580 376 156 -551 449 208 -720 445 470 -846 213 755 -757
1337 -757 -151 840 -479 -358 716 -247 -383 581 -209 -357 571 -229 -455 689 -124 -689 685 144 -830
1356 -830 490 425 -799 226 539 -638 67 520 -537 13 528 -529 -48 628 -523 -189 762 -411
1374 -411 -428 777 -186 -597 652 21 -618 514 142 -605 396 204 -626 353 317 -675 248 479 -675
1393 -675 73 604 -579 -103 637 -447 -225 644 -333 -318 637 -242 -417 635 -129 -540 589 35 -631
1412 -631 485 205 -643 350 316 -614 246 383 -589 163 464 -605 48 586 -555 -135 690 -409 -327
1431 -327 684 -222 -419 578 -87 -452 497 -22 -468 489 37 -562 489 183 -665 364 401 -693 137
1450A37L97j098M98O04r46K60O29q33K03O50q47J22Q25q89j07J058p75m80J173
1469E81m38p65J014r2q47P79O5p66O61J00p83O80J89r58O60M76j116M11Q21j065
1489c93J2J008p82l09R30m98l76P88l99l75Q21m24m84R38k87p84R81K8j033P76
1509A38M03j042M29N92q48J84N92p16J28N82p47J14P17q12p3R52p16m16J062m22
1529A01p09R62r4p83P07J07p30N84J34p10N70K11q34N62M26r66L45P35r50L2Q86
1550E86p28k44Q51m79l65P60l67l95P51l27m98Q12j98p10Q20M7q75O64L30r08
1570d73M07N17p96K27N55p13J21N97o80J1P25o77j50Q37n55l88Q83l54n62Q09
1590C41j37o70O90K7o91O04J32p40N27K90q12M21M67q22K30O21p42MP10o15j54
$$ plain form
1450 137 534 -564 -66 538 -408 -148 481 -352 -149 501 -346 -224 601 -288 -395 663 -112 -592 581
1469 581 143 -622 392 300 -547 232 297 -469 192 292 -491 189 378 -580 80 556 -560 -149 672 -393
1489 -393 -381 627 -155 -464 466 -32 -408 380 -19 -394 427 3 -481 457 170 -614 367 395 -638 138
1509 138 541 -501 -72 520 -328 -144 448 -268 -140 442 -305 -191 526 -286 -359 593 -123 -539 523 101
1529 101 -608 354 260 -523 184 291 -439 145 279 -431 139 350 -484 78 504 -462 -117 618 -332 -300 586
1550 586 -142 -386 465 -14 -379 381 14 -381 370 43 -455 357 159 -551 269 316 -559 105 435 -473
1570 -473 -66 451 -345 -118 437 -276 -155 442 -238 -227 498 -179 -329 508 -47 -435 448 94 -468 341
1590 341 204 -466 224 251 -440 164 296 -444 83 373 -439 -18 449 -373 -143 478 -264 -260 450 -165 -319
1611c19P22m84k73P54m01m02P78k71n64P57p8o74O39J25p28M86K76p21L74L69
1631C65p05K88M55p15J64O04p05k7P41n87k50P81m06l98P14k30m73O45j40n02
1651c81O25o6n99O11Q9p36N33L11p81L16N18p20R1O02n94l8N78m91r9N92m75j62
1673b76O62m10l59P64k82n51P19k4o75N44J96o63L81K70n81K94K83n72K62L72
1693C54o56J79N54o82rP02n40k63P33l41m07O38j57m46N47j02m23N27p0n14N66
1714A90N7o55M96K84p32K81N05o81P8N50n14p4N35m28j10N26m12j64O05l73l11
1735c47O62k45n04O58k6o14N12J65n95L49K40n27K60K86n44K35L53n72J49M89
1755C84n83k7O17m77k16O32l00l47N74j74l86N02r6m27M88k4m96M77J01n90L99
$$ plain form
1611 -319 403 -81 -354 400 -1 -403 375 104 -460 297 219 -455 184 309 -419 67 343 -378 -4 365
1631 365 -340 -52 403 -312 -148 456 -249 -276 465 -122 -372 409 3 -395 319 89 -384 261 121 -381
1651 -381 244 178 -421 190 279 -457 76 387 -394 -78 440 -280 -189 413 -181 -219 359 -132 -231 361 -114 -276
1673 -276 386 -24 -383 381 99 -452 267 243 -432 112 308 -355 26 296 -285 9 292 -280 -18 354
1693 354 -302 -123 431 -251 -260 442 -98 -361 372 31 -376 262 105 -341 206 104 -319 208 138 -376 190
1714 190 247 -408 88 372 -360 -79 426 -255 -177 373 -141 -215 320 -108 -218 308 -104 -268 337 -36 -347
1735 -347 315 70 -434 224 198 -416 96 261 -334 15 255 -272 -12 274 -270 -35 318 -254 -105 384
1755 384 -199 -226 391 -86 -302 330 30 -317 257 83 -303 199 103 -324 164 140 -356 121 222 -368 31
1776C1K73o25K40M15n72P4M87m76m5M94m01j12N14l47k00N55k79l29N71j55m43
1797c30N23%n21M36J17n11L27K00n10K64K82n39J93L73n29O7M76m68p5N29l71
1818f7j89N22k62k69M84j76l26M90q9m26M72J2m88M10J65n46K88K88n21J66L57
1839B95m77Q7L66m29J2M35m07r8N08l41k27N37k18l55N14q7m23M29K9m25L52R8
1861A75m37L13J53m68K74K58n13J61M07n11J0M92m07j14M75k95j98M43k15k27
1881b24M30j85k84M46r4l90M50K5m84L61J88n01K32K83m59J19L28l94M7L32l67
1902a41RL76l51q0M63l15k20M98j91l41M63n3l83L60O1l88L01R6l80K70J36m25
1924b35K45K39m74J52L61m46kM38l55j15M20k44j87L80j56k31L95j53k74L98p2
$$ plain form
1776 31 304 -321 -81 334 -238 -164 323 -153 -198 296 -105 -217 297 -50 -250 305 26 -303 268 113 -330
1797 -330 193 193 -328 108 225 -286 41 241 -269 -5 277 -262 -69 304 -225 -158 318 -150 -225 304 -67
1818 -67 -256 266 4 -265 219 43 -283 207 118 -308 164 176 -312 98 263 -283 5 293 -228 -62 295
1839 295 -182 -95 271 -158 -146 289 -118 -216 292 -49 -276 261 43 -312 202 115 -308 121 150 -275 77 175
1861 175 -262 51 204 -264 10 268 -245 -84 323 -188 -178 314 -93 -207 268 -27 -225 218 3 -224
1881 -224 206 21 -263 183 89 -301 149 174 -310 51 239 -262 -30 253 -206 -87 241 -153 -106 226 -141
1902 -141 -132 244 -107 -187 276 -39 -259 239 48 -293 170 117 -266 94 155 -233 68 164 -216 54 190 -235
1924 -235 10 249 -225 -73 288 -158 -160 278 -77 -192 228 -16 -203 177 21 -210 185 32 -242 156 84
1945H4l64L98L5m29L19J77m56K03K62m01Q8K97l40M1L00l23j0L60l22r4M18k54
1967a1k08M32j57k99L90l1l54L24M8l63K87Q6l56K26J59l92K02K28l98Q5L32l69
1989a39j4L78k99j00L77k29j60L66j73k06L61j12k65L61m0l37L28N7l75K57J64
2010B00l77J53K17l46J01K52l35K5L11l13k7L51k81j20L75k12j95L76j22k54L34
2031A13m4k75K93L8l29K70Q9l52K23J66l71J43K42l53O0K98l05k2L13k50q8L18
2053A77k08j34L42j89j91L48j10k59L24Jl24K64R8l45K08J55l15J30J80k95R8
2074d5K23l00M4K76k78m5L29k38j40L64j66k08L12p0k38K81k5k44K48J8k77K33
2096E4P5l28K07J61l51J22K48l28L4K83k57m4K85k05q2K77j69j24K92j41j84L18
$$ plain form
1945 84 -280 118 153 -276 43 220 -236 -33 229 -172 -84 213 -127 -86 214 -109 -119 241 -81 -175 243 -11
1967 -11 -219 213 56 -243 147 116 -238 86 134 -229 58 144 -212 14 173 -219 -17 211 -187 -102 230 -139
1989 -139 -153 225 -74 -174 203 -26 -186 180 7 -199 162 50 -215 146 106 -231 97 154 -221 36 200
2010 200 -177 -24 193 -153 -52 200 -135 -110 201 -112 -139 212 -69 -189 186 -26 -221 155 33 -221 113
2031 113 69 -206 87 125 -204 66 155 -197 26 192 -179 -36 206 -147 -87 211 -94 -116 197 -53 -141 177
2053 177 -31 -165 177 -12 -203 145 35 -224 100 101 -223 41 139 -206 2 157 -158 -28 152 -143 -45
2074 -45 178 -122 -78 198 -80 -125 204 -34 -174 190 24 -184 128 58 -180 101 76 -168 80 98 -179 54
2096 54 129 -199 8 169 -182 -60 188 -140 -106 177 -80 -124 161 -44 -126 151 -18 -142 150 9 -175 143
2118A43r7k47L11Ml00K33R5l00J65J45k91J28J50k59P8K03k65K7K61k68l7K95
2140A74j99j34L05j32j91K89o3k11K48j4k33K32J8k57K22P3k91J75J34k87J00
2161d2K06k75L2K41k32k8K45j91p5K69j70j15K74j26j72K76n8k27K48L1k72J98
2183C7Q9k75J53J17k45R6J58k49O7J91k41J9K37k29m3K65j63j22K63j22j51K46
2205I8o4j74K28k1k17K17K8k44K02O9k66J40J38k40N8J96k31K2K07k13k1K14j62
2228c6p1K27j43j08K51j13j52K24l5k02K14J7k13J76N7k18J36R2k19J12J23k10
2250i1M9J90k20rK35j95n4K24j43j00K31j12j24K05n1j65J96k9j80J91J8k15J61
2273A2Q1k30J21J16k15N7J75j96K3J67j67j1J78j48n1K19j47j01K38q9j55K09
$$ plain form
2118 143 46 -201 110 114 -186 47 142 -158 7 152 -139 -11 139 -120 -42 161 -104 -77 184 -84 -121 174
2140 174 -25 -159 146 14 -177 112 49 -162 86 72 -161 71 89 -168 54 127 -164 11 145 -142 -42
2161 -42 164 -111 -79 162 -70 -98 147 -44 -119 150 -20 -135 139 13 -159 117 59 -168 80 111 -161 37
2183 37 126 -149 4 121 -124 -28 130 -119 -52 139 -102 -83 154 -75 -118 147 -16 -138 125 3 -148 98
2205 98 34 -140 88 67 -150 67 95 -149 53 122 -144 -4 134 -106 -48 148 -83 -61 146 -67 -88 126 -36
2228 -36 -107 120 -23 -131 120 7 -145 79 44 -158 56 73 -140 36 93 -125 11 103 -116 -4 119 -91
2250 -91 -42 148 -72 -81 154 -41 -95 129 -14 -114 117 5 -119 86 35 -130 66 37 -143 48 66 -149 12
2273 12 93 -137 -16 100 -115 -58 117 -79 -56 111 -56 -67 111 -37 -88 131 -16 -117 121 32 -123 86
2295H6k1j79J70K7k02J46M4j84J26Q0k04R1J22k21O4J63j92j5K20j80o4K11j07
2318a9j00J95p9j14J94n1j43J94k2j82J88J3k05J55Q0k23R8J30j91M5J42j73J2
2341e6J58j60rJ68j48o0K03j17j07K18q6j29J87l3j58J62K2j61J17M8j65J00Q3
2364G7j74P6J25j82L1J62j76j4J84j44n2J82j06r4J96r0j07J76n6j12J45j2j57
2387a22J46L2j74J22Q1j89P7J03j61M0J31j45JJ44j34j5J57j21o1J72r6q7J75
2410G6n0j25J38kj39J36K1j45J06M3j58J10P5j68O4J03j61K7J56j63rJ64j43m0
2434h4J53p9p4J51n9j00J55l8j26J58j4j48J35L1j54Q6Q1j63O9R5j43L6J09j31
2458e4K0J19j26j4J47j13n7J54o9r1J48m1j13J44k3j27J23J0j41J14M0j46P9Q3
$$ plain form
2295 86 65 -114 56 83 -119 27 71 -113 13 93 -111 -20 102 -119 -55 108 -84 -99 121 -59 -123 88 -19
2318 -19 -119 76 -3 -117 77 26 -117 77 55 -127 61 74 -131 24 104 -119 -21 109 -82 -37 105 -68 -56
2341 -56 102 -58 -67 101 -47 -107 96 -21 -128 90 4 -125 62 29 -129 33 55 -106 11 59 -106 -6 77
2364 77 -97 -21 104 -78 -47 115 -61 -75 109 -35 -87 95 -11 -105 91 1 -106 70 14 -98 47 35 -122
2387 -122 24 56 -118 4 85 -104 -27 76 -85 -45 86 -59 -58 86 -48 -63 94 -27 -88 84 -12 -99 76
2410 76 26 -99 39 37 -102 34 55 -90 16 59 -99 11 86 -82 -18 85 -76 -49 107 -56 -65 99 -44 -84
2434 -84 69 -10 -84 67 8 -92 63 25 -101 57 43 -105 30 61 -93 -7 74 -89 -20 75 -68 -32 77 -54
2458 -54 -34 85 -41 -55 92 -21 -78 76 7 -84 64 23 -90 54 31 -96 27 37 -104 10 50 -96 -17 66
2482F6j65P4J11j59L3J14j20k3J35r4m3J32o8o2J32o8o6J44m6j12J32Pj39J14
2506B9L4j43Q7O7j45O4P2j28L8Q6j20J5J14j26oJ24q9n6J32o2q3J43k8r1J14m
2532C8j09J05Qj09R9K4j22P4P4j40M2J08j27PJ21j25j5J11q4m0J24q1m4J22o6
2557ep2J16k4j00J16Lj23J12K2j26P6N6j10N6O4j09L9P8j08RJ01j02j8J26r5k5
2583d3J04m3o9J09l1q7R5pq4P7Nr9Q3L6j23O4P0j21M3Q0j24K5R8j01MR7r2rJ01
2612E8o8m7J21n7o7J02k0q9J02kr6Q3K1j02P0M2j09N6N8r6K2P4j03J9Q3r6qR6
2640D7p2m0J02m9n8R5j4p6Q4j2q2R4Kq9Q1L9j06N1O3j06L8O5r9J9P6q1rQ1p4j8
2670d8R2n2m5Q6l0p4J10k0p9R0Jr4O8J8q2N8L4q5K8O1q6K7P0q9RQ1p6k5Q9m8l2
$$ plain form
2482 66 -99 -25 86 -73 -40 74 -46 -69 66 -28 -71 61 -7 -69 63 -5 -71 73 27 -85 47 54 -85 29
2506 29 63 -80 7 74 -71 -7 65 -63 -25 61 -59 -44 70 -56 -62 62 -27 -83 49 -13 -96 47 19 -72 42 38
2532 38 -71 34 42 -67 32 56 -66 8 82 -58 -16 92 -35 -28 93 -32 -47 64 -20 -60 64 -17 -61 61 -5
2557 -5 -77 39 15 -85 31 34 -89 23 45 -81 -5 51 -59 -3 61 -48 -9 69 -39 -30 71 -31 -49 77 -18 -43
2583 -43 61 18 -51 58 27 -60 35 28 -56 21 26 -73 10 46 -77 -13 57 -64 -21 59 -65 -40 58 -43 -39 58 -34 -43 58
2612 58 -10 -57 64 7 -60 42 22 -67 35 33 -63 20 41 -61 9 51 -58 -2 56 -40 -18 56 -47 -28 55 -41 -49 47
2640 47 -25 -65 37 -12 -70 25 11 -65 19 7 -75 19 21 -68 13 52 -54 -3 60 -46 -8 57 -42 -23 53 -28 -37 44 -30 -48
2670 -48 44 -8 -53 33 3 -71 39 19 -60 30 31 -63 5 23 -59 -1 33 -52 -24 37 -49 -22 48 -41 -32 49 -27 -52 37 -11 -43
2701d3Q0l9m1P4j9n9P5kr5Q8Op9O3M0r4L9M1p9L1N7q2PO7o4pP3o5j3Q0n5l3Q2
2733C4k6o2P2pp2P7jp1P3J5o5L1N0q8M4N0q1L0N1p9MP7p9j0P8n5k2O5l4m5P7l5
2765dn5P5j4n7N8J6p8O4K4p9L9M9q0K8M8o4J3N7o0MN5l9k1P5m8l6P4l2m7P2k0
2796A7n8N5J0o6L9M1q5N2J8p0M0K5n9J0O2o2nO7n9qP5n0k0O5l3k9N6j4m7O1lm9
2828b4L9J5o1M4K0o3J8M1n0RL9n8J3M5n5LN8n3j0M8k2m9O8j9m3O9k4m8N3K0n7
2859c4M1J4n1L7J4m7K7L0n3PM9m9kN6m7j0M5l1k9N6k4l2M7k6k3L9ol8M6Qn3L8
2891aK2o2L9K9n9J3M1n1J1N2n0nN5l9j5M3k2l1M8nm4M4lm3N1ll9N0jn6K4L8n7
2924b6J5L4m6NL9l9LM3l6rM1l1j5M3l1l6N7om0M9%l7L5K0n6K9J7m2J9K9n3K0K6
$$ plain form
2701 -43 37 -2 -43 31 12 -47 28 26 -69 19 25 -54 9 49 -45 -6 35 -44 -13 44 -38 -31 36 -28 -35 38 -27 -40 40 -15 -48 34
2733 34 8 -54 18 11 -61 16 15 -56 17 32 -33 -2 48 -40 4 54 -27 3 54 -25 -21 56 -23 -33 45 -10 -32 33 -1 -46 31 -4
2765 -4 -59 16 2 -55 3 19 -59 5 29 -50 -11 38 -42 -14 34 -30 -17 40 -20 -16 39 0 -21 54 6 -30 44 12 -35 37 17
2796 17 -41 14 24 -42 -3 38 -47 5 23 -47 -7 18 -41 -31 31 -31 -36 31 -28 -36 39 -11 -31 34 1 -28 28 14 -33 28 25 -24
2828 -24 15 30 -31 13 33 -30 -12 29 -21 -12 27 -31 -18 27 -28 -25 33 -20 -30 18 -4 -53 15 -4 -47 22 -2 -50 3 23 -34
2859 -34 7 21 -30 7 21 -26 1 31 -22 -15 34 -15 -17 39 -8 -18 27 -4 -33 23 -1 -33 14 -12 -35 4 -2 -40 6 14 -39 -1
2891 -1 21 -41 -2 27 -32 -19 22 -29 -18 34 -16 -21 34 -5 -20 23 1 -30 18 13 -31 13 10 -33 18 15 -24 26 25 -31 -7 31 -26
2924 -26 -11 23 -23 -18 21 -18 -15 28 -8 -17 24 -7 -22 21 -10 -46 11 5 -35 14 14 -23 12 32 -24 5 22 -20 -1 28 -25 -5 21
2957B1l0jL6l3mM2l1k1L9j6l7M6j2k6L1Pm1J1L2m3K3Nl7L5J4m9J9M0m8QM2l7q
2990b3M1k6oM5l2k3M9k2k0M3k0k7L7Jl4L8nk4J5J1m4K0K6m3RK9l0%L3l4lL4k1
3023fj8M1j9k1M0j1k1L0j0l0L1K0l3J6J2l0J1K3l3J2L1m3qL6l7OK6qk1L0j5l3
3055c2L9j8j9K6Kl1L9Mm0K9J1k8J8J6k8QK7l6J7L1m4NL7l1j1M1k9pK6k1j6L3j7
3088Ak4K7%j1J1%k7K1jj9J4J6l2J9K5m3J9J8k2oK7j9mL0j2j8L1rk4L9j7j8K6%
3122A8k4J2Rl4K7Nl5K8Rl3J7J3k6lL2k5LK1k0j5L4k0j7K5jj4L0ql1K4J5l2J7J7
3156A8l0J3J2k4MK2j7QJ4j9kJ5k0mJ7j3oJ8mk5K2Mj9J5Ql5K8Pj8%K3j9O%j4QK9
3193B2k8%J9j6nK7j7j7K1kmJ0%k4K9j5qJ2Lk0J5J4l3J5Qk7K6Qk7MJ5j5Rp%qK2
$$ plain form
2957 21 -9 -10 26 -7 -11 31 0 -21 18 2 -35 11 -1 -27 4 11 -30 -19 13 -30 -7 -2 -39 -4 10 -39 -20 20 -28 -20 22 -15 -23
2990 -23 18 -8 -14 31 -1 -24 25 3 -17 26 6 -21 16 17 -17 21 16 -8 7 18 -26 -6 20 -23 -14 15 -15 -15 18 -16 -19 15 -6
3023 -6 -24 17 -2 -23 17 6 -15 15 5 -25 6 26 -7 9 21 -9 2 25 -8 4 35 -8 -16 20 -17 -11 15 7 -14 16 1 -32
3055 -32 7 -11 -30 -4 -2 -33 6 10 -30 -1 10 -18 0 16 -12 -4 23 -13 4 35 -9 -4 33 2 -9 32 3 -4 22 1 -15 18 1
3088 1 -23 4 4 -7 4 4 -23 -2 -3 -22 -8 8 -24 -5 20 -23 -4 14 -8 -14 13 -6 -10 20 8 -10 21 12 -12 27 10 -8 18 18
3122 18 -6 6 15 -19 8 13 -22 6 15 -18 -1 12 -14 -17 15 -10 -7 14 -6 -21 13 -7 -24 1 0 -14 16 8 -23 1 16 -16 1 18
3156 18 -12 1 13 -11 -7 15 -2 6 20 1 -1 14 -6 -10 7 -6 -12 6 2 -23 -1 3 -16 -1 7 -28 0 7 -11 -11 12 -7 -1 -1 -15 -7 22
3193 22 -6 -6 13 -3 -8 19 2 -15 6 4 0 10 10 -14 15 0 -8 4 7 -13 2 16 -17 -2 6 -21 5 13 -14 -10 5 -10 -1 -8 -8 -16 6
3230Fk1pK7j1nK0lj4QRj0J1J0l3J5J0j8RJ5k3PJ3k2nJ2nJqj0NJ8qj1K2ok4J8%
3268hj9K3Kj9QJ2j3jJ3pROoOJ3j4mJ2j8oL2j9kK2j5nLKj7J1Kk1J2J2j8lJ9k5J4
3307gJ1k4J7Nj1mK1j6%K2j0j1OJ2k0K3jj4J4qpRJj5J4J0k1nK0rnJ0k0QjpnJ5j2
3346a5lJ9lqK0j4j0J4Lj3J9pj0J3Mj5MJ6k8J9J0j8NJ5j9KJ0j4pJ1Lj5J4pOPpj6
3384a5OOj3QJ2j4nK0j3PJ4j4rJ0mJJJj2K0qkL0k4lJ4Kk3J9Jj4J1j0j2NK0j4%J4
3423A3k0PNonNNoJ2j9MQqRoLj5J6Mj4J4kk1J3J1ljnLNJmNmopJ6j2MKj7jK5pmP
3469DLrlPj8J0lpJ1qm%K0q%K1j6O%nN%j9J8MjlRj3rJ8lpMpj0J0Qj3P%rJ%j2PK0
3516Fk8J1j0J1lJ8j3KRj5RRnmNJljRj6J8noJ0j2OqQj1QLj5MNj1J6ppmJ2%j1Qj
$$ plain form
3230 6 -15 -22 5 -6 -11 9 6 -8 0 9 -1 10 20 -13 2 12 -6 3 18 -5 2 15 -7 -12 0 -5 -4 -12 -22 -17 1 -7 -18 4 -2 -26 -8 -8
3268 -8 -27 -4 -2 -21 -13 -1 -14 -15 -2 -9 0 6 0 6 19 5 1 13 -5 -11 21 2 0 22 7 2 5 7 -10 1 3 -18 -6 6 -12 -15 4 -21 -7
3307 -7 4 -20 -3 2 -9 -13 8 -8 -8 14 4 -7 -1 11 -9 14 13 -1 13 5 -2 7 8 -7 7 17 -4 -9 11 2 -3 7 -13 -5 -6 -13 -18 -3 -15
3346 -15 -18 1 -2 -10 10 -4 -14 0 3 -10 9 2 -8 5 9 -6 -2 14 -14 5 15 -3 2 17 -2 0 10 -4 -11 0 3 -12 2 -5 1 8 1 -15
3384 -15 -9 -3 -16 -8 4 -10 -15 5 -8 -1 13 -1 -10 0 -4 -3 -2 -1 -13 7 -1 -3 27 3 0 14 16 -7 12 13 -1 10 0 -12 -7 13 -1 -1 13
3423 13 -7 0 5 -1 -6 -1 4 -2 10 -9 -5 3 -5 4 -2 1 -14 2 6 -8 6 4 -17 -4 7 4 3 -2 1 6 7 3 8 4 -2 -9 7 -5 -1 1 -16 -17 8 1 -3 4
3469 4 7 -2 -5 2 -16 -6 -9 -16 -5 -13 -17 -17 3 -5 -5 16 0 6 6 1 6 6 -13 5 9 8 5 14 1 -8 10 7 0 4 -3 -13 -3 5 -8 -1 -1 -10 -9 -9 -21 -14 6
3516 6 -22 -11 -21 -10 -13 5 -8 -6 3 -12 -3 6 1 -3 2 3 0 -1 8 -8 10 5 -1 9 -3 3 -5 3 -8 0 3 -12 -8 -3 -14 2 -5 -12 -16 -4 -4 -15 -7 -8
3560hnNLmJ3Pk2KK2j6J4mroJ4nqJ9rNNj1j2J4jpOmj5J5j4Rj1ONkOj8MNO%OomJ0
3606@rNlRMOpLl%pJ3j7%K2j1oJJj1K0j2Kj4JpQRoOknJMOj3J9j4jJ2j4RpOkNMp
3654bLMj0N%pJ2Nj3JOLj1J2j7JJ2j6MJ1j5Jj3J7j%qMQjjjJ3j8%J1nPPj0jQnmJ1
3699GqLO%pMQqoNqLmpJ2rJ0j0J6j4LMj1J%kOkjJ%MmOqQJJ1m%lJJ1%rLkJj2J3j0
3750akJokNqMQj1%jMLKj1OmRj4K0kQrMpJkMNjkKQpoRlj0J4k2RR%qmloQQlRj4j3
3803b2J0Jj6K0Qk0J3jMMOqJ1LpmmMnLjJ2%Jj2K%nkJ3kj9LjkmKJ0Jj0LNpJ3jkj1
3850a4LPO%l%J1n%LlMrJ0j1kJ0lOLmkL%j4J%oNlkqMJ1Oj0LQj2lJ2pqQLpOmKQM
3901Gkj3KMRkknNjoMjRmpNj0Jj3LJ7j3NkJnOJnpJ6m%pKj%JRPj5J4J1j9KO%lko
$$ plain form
3560 -8 -13 -8 -5 -9 4 11 -11 -9 13 -3 11 7 -2 -8 6 1 -7 12 3 8 13 2 -10 4 3 -4 2 -2 -17 -2 -16 -7 -18 -12 -7 -9 -3 -21 -17 -12 -6 -6 0 -6 -10 0
3606 0 -9 -4 -7 2 6 12 5 8 5 5 -2 11 -6 -6 16 5 -1 0 1 -10 10 -2 0 -14 -13 -20 -12 -3 -9 -3 -5 -10 -9 -5 1 -12 7 -7 -8 4 -10 -1 -8 -2 -4 1 5 -2
3654 -2 1 5 -5 0 0 -7 5 10 -3 -2 4 7 -4 8 -9 -8 4 -12 -8 3 -12 -11 -24 -7 -8 -8 -16 -12 -4 -5 -6 -7 6 -12 -12 -1 -6 1 8 -2 -3 5 0 -4 7
3699 7 -1 2 8 8 1 5 13 5 -1 4 -4 -1 -5 -12 0 -9 1 -9 7 -7 -4 0 -11 -10 -10 -12 -6 -8 -9 -8 -8 -4 -8 -2 -10 -2 -1 10 6 6 3 4 15 15 6 9 7 8 -4 9 -1
3750 -1 -3 -2 -8 -10 -5 -13 -9 -1 -12 -12 -13 -9 -6 -4 -15 -9 -13 -4 -18 2 0 8 -1 3 -4 -3 -5 -1 4 3 1 3 11 4 -2 7 4 -6 8 -14 -5 4 4 -4 -8 -11 -17 -9 -1 -4 5 -9 -22
3803 -22 -12 -11 -27 -7 1 -19 -6 -7 -3 1 7 -1 10 13 6 2 -2 2 -3 0 -1 11 11 12 0 2 2 -3 -5 8 6 -13 -10 -11 -13 -17 -15 -5 -4 -14 -11 -6 -13 0 -1 -3 -14
3850 -14 -11 -4 2 2 -1 -1 10 5 5 8 5 9 0 10 -1 -3 7 4 10 13 9 7 10 10 -4 -3 -3 -9 -4 -7 -9 -17 -13 -2 4 -6 -3 5 -7 -10 2 -5 -13 -5 -2 -9 -3 -7 -5 3 7
3901 7 5 -8 -6 -2 7 5 3 -2 3 2 -4 0 -1 8 4 -3 2 -8 -7 -20 -17 0 -13 -8 -10 -9 -14 -8 -7 -12 -19 -3 -7 -7 -14 -12 -13 -13 -12 -3 4 -11 3 14 -5 -3 3 3 0 -2 -8
3952hjQ%nOLMlk%rNjkj1J0JKnPkj4J3oJ5njrJ7mnJLpjQKMqjJ1KqpJ4nooJJ0k2
4003a7J8jj4RpLjj4J6mjJ7j2KmPNj1J2j0LJ0jjrK0oOolnPlOj0nNj5J6oKnkJ1L
4048Ej8J2j3J1jnlNlOJqPJ5lkpJ5mnKnPkPmjlmJ5rmpPj1%%MmMPk2J2qNrP%nOQ
4099bjmPJK%PnJ0j0lpPNJj1NMkj1Q%qknQlLj2lOJ4mjKmKkpJ%MQ%nQqOMoPoJJN
4154EKpmMkOjopKJ8j8nQmjRj1Lj1nJ3N%qLpJ2pOONokkJ1j0J0lpJ0ooQPoNrmMK
4205aLjpjmQj3MoRLJllKrJ0J1pjpPLPqMOplRqOJ1j0rpJ0Jj5J2qJNKlmJ0pLj7R
4256a2KjKPqQkKj4KLQlMjKJ2pJkLqJ0ojjKOkjqMjj%%j0mlJ0Ppj5J2RpmkQK%%J0
4309Ej1kNJMPknJ0oKpKMpjQrjMLqKj1J1rJO%j5RjNj0KJ0qPjOjlKN%nlOnPnORo
$$ plain form
3952 -8 -9 -1 -1 -6 0 3 7 4 2 2 -7 -2 -3 -5 -16 -6 -5 -3 -8 -1 -3 -17 -4 -10 5 0 -1 -10 7 3 -2 -1 2 -5 -6 2 4 8 0 -1 10 12 4 -3 11 6 0 -6 -5 5 -17
4003 -17 1 0 -14 -5 -12 -9 -10 -24 -8 -12 -13 4 -8 -6 -10 -3 2 -9 3 -7 -4 6 5 4 -5 15 9 15 9 6 1 8 5 11 1 -4 1 -14 2 -4 -2 -7 -9 2 5
4048 5 -13 -1 -14 -3 -4 -9 -12 -7 -10 -4 -3 -11 -4 11 8 6 -1 14 10 5 7 2 9 7 14 10 9 6 2 17 8 4 -3 4 -7 -7 -7 -3 -7 -3 4 -18 -6 -14 -9 -18 -11 -11 -16 -10 -2
4099 -2 -3 -7 0 1 3 3 10 5 15 5 2 -5 2 7 8 -3 2 6 4 -7 1 1 -7 -9 -14 -6 -9 -6 -18 -21 -15 -1 -5 -6 -4 -8 -6 -8 -15 -14 -14 -10 -2 -2 -7 1 -7 -1 3 -3 4 -2 -1 0 5
4154 5 7 0 -4 0 -2 4 3 -3 -10 -8 10 -8 -13 -5 -9 -10 -1 -12 -9 -20 -25 -12 -7 -7 -15 -12 -19 -7 -14 -8 -2 3 -3 -5 -7 4 -6 4 1 -6 4 -2 -8 0 7 1 6 -3 -7 -3 -1
4205 -1 2 1 -6 -7 -11 -3 -16 -12 -18 -9 -6 -5 -8 -11 -9 -18 -8 3 -4 -5 -12 -5 -2 5 -3 1 7 0 -3 6 -2 4 15 5 -4 -11 -1 0 -15 -3 -11 -10 -5 -3 -6 -10 0 -7 -4 -21 -12
4256 -12 -10 -11 -9 -2 -10 -2 -4 -2 -16 -14 -11 -3 -6 -2 -3 -1 11 4 5 3 6 -2 8 2 1 0 2 8 6 5 -3 1 0 -1 -1 -1 -11 -15 -18 -8 -1 -8 -23 -11 -2 -9 -13 -15 -7 -5 -5 -5 5
4309 5 -6 -8 -3 -2 2 9 7 2 12 6 8 1 3 7 0 -1 7 -2 -3 1 4 -4 -2 -13 -2 -11 -10 -4 -4 -19 -10 -11 -6 -16 -14 -4 -12 -5 -6 0 -1 -4 -2 3 3 -2 -5 1 -4 3 -2 4 13 7
4363GnMOroPjqLj1LJ3j0mQJnoLoK%k%PqK9j1Oj0J4Jj1mRo%J2jj0OPj1MKmmQj6
4412gJ1j0JJ1k1J0ljJJJqLmQJj1KNOkPmKMqMJ1mrMjQlj5PRMo%Kj4Qj1PoNpQmL
4463eJ0j0jlJ1%j1JQmnjJ4KqJ5j0J1j7KQmJ1ojJMkjlM%poJNj2kRqjJMkKNqJ1J
4512Cj2MoM%oJ8JRj9PkOQj2NpOj0%J1j1NNrMj2NJrKlRpoJ3JkkqRNkJ%OjklRM%
4564A0Nj0O%j6NMjkjKjj3QMMj8MMJMj0KpJMlPjJlRKQrLpJ0%j0OkMNoJ1pjOrOq
4616ANkpQj0KmRmMolLJmjPrRpOpJ1Oj7J8j0KQj0QqNKmOm%nJ3nolOpnKmRJqJ3j0
4669ekNj2kPrJ2jmJ0JJ%lJ1oJlQj1MnJJkQ%Nj5OmjljjJ0plRpljjKoJ4j4J3j1J1
4719cqKlLJ1Nm%PLnmOmMqlQJ0j3J%jj0J5pj4mJ6JlmjOrjMKlj4J6j1J9%JnPOll
$$ plain form
4363 7 2 6 12 3 -3 4 3 -5 -2 -13 -10 3 -7 -11 -3 -2 -7 -13 -10 -16 -14 -14 -16 -16 -9 -17 12 1 7 -3 11 12 1 -3 6 0 0 12 11 1 7 14 3 7 9 5 1 9 -7
4412 -7 4 -6 -5 6 -15 -5 -8 -9 -8 -7 -6 -14 -11 -15 -7 -6 -17 -15 -10 -4 -6 1 -3 -1 3 -5 -1 10 6 -3 1 0 8 5 -10 -3 6 10 4 4 6 -8 0 -11 -4 -10 -5 -12 -4 -8 -5
4463 -5 5 -5 -6 -9 2 2 -9 -8 0 -4 -9 -10 4 6 -2 13 3 14 -3 -1 7 3 14 8 7 8 12 10 9 6 10 10 3 -3 -2 3 -9 -11 -2 -10 -11 -10 -6 -8 -6 -1 -9 2 3
4512 3 -9 -5 -11 -7 -7 -13 5 6 15 -4 3 1 7 15 3 8 1 7 -3 -3 8 -3 2 7 -2 2 -10 -5 -4 -13 -11 -14 -5 -12 -18 -5 -4 -6 -8 -16 -7 -2 -4 -3 -3 3 2 0 -3 6 10 10
4564 10 15 5 11 11 -5 0 4 3 1 0 2 1 -12 -4 0 4 -14 -10 -6 -5 -1 -11 -9 -16 -15 -11 -14 -7 -8 -7 -10 -1 1 9 0 3 -4 6 6 -4 2 0 4 9 3 14 7 6 12 3 9 1
4616 1 6 4 -3 5 -5 -3 -7 2 -2 2 -4 -7 -4 -3 -7 -8 -1 -10 -1 -8 -2 -9 2 8 -9 9 -1 1 9 -1 7 -1 4 6 2 8 4 4 -1 12 7 1 -2 4 -3 -8 -6 -10 -1 0 -8 5 -5
4669 -5 -7 -2 -14 -16 -9 -18 -6 -7 -11 -1 0 1 1 -2 9 3 4 1 9 -2 2 -3 -2 -1 -3 5 5 10 -5 1 -3 -4 -7 -8 -9 1 -6 -9 0 -7 -10 -11 -12 -10 -16 -2 -16 -3 -14 -3
4719 -3 -11 -9 -12 -9 2 7 3 3 10 13 8 4 10 6 10 2 -1 7 17 4 5 5 4 -6 9 2 -12 -16 0 1 -2 -6 -7 -1 -10 -11 -7 -5 -8 -22 -6 -17 2 2 3 -2 5 11 8 5
4769EK%pKKlLnJ4j2%oRmrJ5j4O%nj4J3kM%j0NKPj4J2oPoj0J3jLPnRJLKllJ1rj5
4818fNMjkNMjnmrJLjJjjlJ0j5RnJ3qJ0pQoj3J6nkN%KjRPj3jKJNj3QLj2J1joJN
4869Fj5J1poJ5ollj0K0qnjJ0Rp%lPkj5J5mQnLjJONmqQnoKmmMLmoJ0nLnj1J3Pr
4919fj4J1jJKNoQLKjomRlj2J6%l%RpjJ0mlQpKmrmQRj7MKjj0PlnOmLLrRkLOqJ3
4972Ekj0mOPNKj2LLMj0J3Nj9QNq%jrJ4j0jNmnPlNj2%J0mjrNLQnmKJ4qJ6j0%K%
5021Fjj1J6KLokQj1Pj2oPLnjr%NnJQLj0LkJLlRmJQj4J3oMnJ1Qj2J0pJj5J3kjJ3
5070A7qlnM%nOmoqPoKnJ4j0nQOnQqkOKNjjlNJ0j7J7nllJ0poLlQj2J3Jj5RqKj0
5120a1MnJ2j0mLJqJ9%j0LNnJ3oj3J3KlRKkPj3J2nMj6PjmMPj0OqLMj5QKkprQJ1
$$ plain form
4769 5 7 7 0 2 4 1 4 -1 13 1 1 -5 4 0 -9 6 -8 -2 -2 -7 -21 -8 -10 -6 -6 -16 -11 -9 -2 -16 -4 -10 -3 -9 -19 -6 -7 -4 3 -2 7 8 11 13 10 7 18 9 -6
4818 -6 -1 3 2 0 5 9 8 3 -1 -10 -9 -6 -7 -6 -7 -8 -11 -1 -16 -7 -12 1 -7 3 -4 4 -2 -15 1 -4 -6 -1 -1 1 0 9 16 3 2 4 5 10 -3 5 8 -4 7 6 0 1 6
4869 6 -9 2 -5 -11 4 -2 -5 -8 -18 2 -6 -11 -12 -2 7 0 0 -3 4 2 -13 2 -2 6 1 4 3 4 10 15 11 3 11 6 0 2 -2 -6 -2 1 -3 -9 1 -4 -1 -6 -17 -4 3 -6
4919 -6 -20 -9 -10 -9 -7 -2 -8 0 3 5 4 -2 -6 3 0 -12 4 4 1 1 10 3 2 12 8 5 13 6 8 4 -5 -9 -1 8 -9 -5 -3 -4 -14 -7 -10 -15 -9 -13 -10 -7 -16 -7 -9 -6 0 -8 5
4972 5 3 -7 -11 -5 2 7 9 -3 0 3 7 -3 10 15 -4 4 9 1 1 0 -9 5 -5 -6 -1 -5 -10 -3 -6 -1 -13 -13 -3 -7 -8 -17 -12 -9 -1 -6 -10 -8 6 -2 14 4 4 6 6
5021 6 5 -6 10 12 15 9 7 15 4 11 -1 -7 0 3 -2 -3 -12 -12 -7 -12 -11 -3 0 -10 -7 -9 -8 -5 -8 1 -3 -2 6 -8 5 -1 3 -2 9 17 5 15 8 9 -6 7 5 4 17
5070 17 9 6 1 5 5 0 6 2 -4 -12 -5 -11 -9 -14 0 -10 -15 -7 -1 -6 2 -6 -8 -2 0 5 4 3 0 5 15 -2 15 10 7 4 14 7 1 4 1 9 -3 10 11 -4 5 -3 -1 -11
5120 -11 -7 -12 0 -10 -14 -11 -10 -18 1 1 -9 -6 -1 -6 7 1 -12 1 3 0 9 11 9 16 3 15 10 14 -2 5 4 0 4 11 1 7 -1 2 6 -9 -1 1 -1 -8 -17 -9 2
5167Bj0KKjoJ1%jlpJ4knJ6qonPQnNJ0noJj9J4j0LN%onOnMoNj3MJKOOJKmjjJj2
5218a4J8j3QlL%KLlqJ0J0omqJ3npJ0%m%kJmmnNpJ7j0Rj1nJ3rPnmj%J1PJ1pj0R
5265HlLnJlLnOKj1NQlj2PPr%lkOjrRloNpJ2ojPljPnkKKNMlpJ4j0oJ2rkMkPlOq
5320BLkj8J3jqOLpJ0roRj1KLQlmNLJKo%MoK1jqNk%Mklj2ROnKKj3kMpj1K2j9J2
5370eojNLLopRMjlJOrKN%mJ3nj4J4nL%JLK%pmJ0knMJkpllPlmJnJ0Mj1jOmJ3qR
5424DjKoQkkJP%%lNooJ1rLJjqRj3J2nplPNqrKKKk%Pj2K3qmk%jJ6k0J0kQj2LJ2
5475HJpJ3mo%Oj6ORj6kRmNmNpkLMj2J2j3Pj1J4j0J1RrrQLlJ6k5J0KJ1opmJ3LK
5521A3kJpjrlJ7qQj2kmJ0j1mLkJLqpRqKQQ%QkkkNnjNPnmJ6j8NjMkL%lMn%kkmj1
$$ plain form
5167 2 -8 -6 -4 -5 -11 0 0 -1 -4 -11 3 1 -4 12 4 -2 -7 0 8 3 8 18 13 7 8 -11 3 -7 -4 1 1 -5 -10 -4 -9 -5 -11 -6 -19 -15 -14 -12 -6 0 1 3 -1 -2 -3 -2 -14
5218 -14 4 -9 -1 -4 -1 -1 1 4 1 -7 3 13 7 3 -5 8 3 -4 6 6 2 2 0 1 -3 -7 -12 -7 -14 3 -7 2 -9 -14 -1 -10 -3 -8 -12 -13 -13 -2 5 16 9 -1 8
5265 8 5 8 3 4 1 4 -1 5 7 -4 1 9 6 -6 1 8 -1 -1 -4 -6 0 -1 -10 -1 -4 -10 -5 -12 0 -6 -7 0 -3 -4 3 -2 -4 -2 0 5 9 6 -1 13 3 -3 9 0 -2 2 0 7 4 10 2
5320 2 5 3 -15 -2 -3 -11 -5 -2 -9 1 -8 -14 -5 -16 -14 -11 -3 -6 -10 -5 -2 -1 1 -5 -5 -1 -7 14 13 5 10 8 8 12 10 7 -5 4 10 5 7 9 -4 -6 -2 -9 -20 2 -17 -5
5370 -5 -11 -12 -7 -4 -1 -7 -14 -5 -1 -2 -5 -4 2 -7 -5 0 0 -4 9 4 -10 4 -1 2 2 3 6 8 8 1 -3 7 5 0 4 5 3 -4 -7 -10 -3 -6 -10 -9 -14 -4 0 -11 -12 -6 -10 3 -5 4
5424 4 3 5 -1 7 5 3 4 11 11 11 8 13 7 1 12 3 6 7 6 -2 7 -6 6 1 -6 -9 -2 3 -5 -14 -12 -10 -8 -10 -10 -3 -15 8 0 -4 -6 -6 -7 9 -11 -1 -3 5 -7 -4 8
5475 8 9 2 15 11 5 5 11 -5 1 10 -6 -8 1 -3 2 -2 3 -4 -6 -3 1 -11 1 -12 -5 -16 -2 -12 -1 8 -1 -10 -2 1 -2 14 -11 -1 1 12 6 -1 -5 8 11 13
5521 13 11 12 5 4 -5 -8 9 1 9 -3 -5 -9 1 -10 -14 -11 -13 -12 -9 -17 -24 -15 -23 -21 -13 -5 -5 3 1 -1 -3 2 -3 -4 1 8 3 -1 15 -3 2 1 5 3 6 6 3 7 2 2 0 -2 -6 -17
5575a7J7mm%Qj1Jj2J4oKQkoQOqJ2j0J0nL%Mj5LML%J2j3JOj1RoLqQj6KmJ1JjKn
5622fjjmMNqJ4KnJ%qJ7j6QmlK0oqN%OJnMjqLQjj8LoJ0Lj1jj3OLMJmL%LpPlrJ2
5674dJ3LqjlnJ4PrQprJ0j5JOKjnRmjlMj6RoLLkNjj%mJ1lj0Rj2J9j0JJ3j1KQLN
5723A7j9LRJnKMpKKjoKjll%kKOnj4J0mJMlkNoPoJ0j2J7rmJ1kJ0nJ1kj1QJkplQ
5773InlJjj1JJ4lkqn%nJJ4j4QjPklJ2j0J0jk4K7%jk%PkkM%Kj7J6loqNlRj4KJ0
5821Cr%LPpoj0J7JoMRj5LkJ4NrrOKmKQm%%MMlOOpkj5NRkj0oJ1Mj0jLj1NkkRNj5
5873a2PjmJ2njPPj0PKLomQLrKmPKj0jRrmmNkjpKoKRj%kNj1MlOmNMmjRjPj%Kmm
5929@L%KknJ4prOjLMpjkm%rJ2koLPkojRkj1MNNrJ1j5J2lOMJNj0RMqKpjRllJNl
$$ plain form
5575 -17 0 -4 -8 -8 0 -11 -10 -22 -8 -14 -12 -4 -6 -12 -4 2 -6 6 -4 6 1 4 4 8 -7 -4 0 3 3 15 2 3 9 -2 7 1 4 -4 4 -12 -10 -14 -3 -2 -3 -1 -6
5622 -6 -7 -8 -12 -8 -3 -11 3 5 0 1 1 -7 10 -6 2 -2 -5 15 9 1 6 6 12 13 8 12 11 3 6 14 13 -5 -2 -8 2 5 -6 -7 -20 -14 -11 -7 -6 -10 -7 -7 -4 -11 -4 -7 -16 -4
5674 -4 9 12 4 3 0 -5 9 16 7 15 8 -1 9 -6 -5 1 3 2 -3 6 2 1 -2 2 -14 -5 -11 -8 -5 -7 -2 -3 -4 -4 -8 3 0 -10 -1 -13 6 -4 -3 10 -1 1 9 12 17
5723 17 -2 1 10 11 6 8 12 5 7 9 8 2 4 3 0 -3 -3 -5 -3 3 -2 -16 -6 -10 -9 -5 -8 -10 -5 -11 -4 -10 0 -12 5 -4 -8 3 1 11 6 17 15 4 12 13 11 4 1 9
5773 9 4 1 2 1 -10 -9 5 2 0 -8 -13 -13 -18 -17 -3 -17 -9 -10 -3 -5 -8 4 -6 4 3 -21 6 6 5 3 3 10 8 6 10 10 12 -5 11 8 2 -6 -1 -4 5 -9 -7 3
5821 3 -6 -6 -3 4 -3 -9 -19 -2 -1 -7 -3 6 -9 -6 -8 6 11 2 -7 -1 1 -3 -1 7 3 3 3 7 11 8 14 20 13 11 -4 1 10 8 -2 -8 3 7 -3 -4 -1 -12 -7 -9 -11 -2 3 -12
5873 -12 -5 -6 -10 2 -3 -4 3 10 0 7 9 12 6 2 10 13 4 6 2 9 11 1 0 9 0 -4 -8 -3 -5 -6 -13 -11 -17 -15 -6 -7 -7 -9 -4 -15 -11 -14 -8 -12 -7 -3 -7 -8 1 0 7 6 6 8 4 0
5929 0 3 3 5 3 -2 12 5 -4 2 1 4 8 1 0 -2 -6 -6 -15 -3 -5 -11 -8 -1 -3 -9 -10 -1 -3 -14 -10 -5 0 -9 2 -13 -1 -4 2 6 7 12 2 11 15 7 9 2 1 10 7 4 5 10 7
5983GljkkkJlNj8K0nmJ1j1oNQoJLNj0LMLKRp%%Jm%LnJjJ2%n%nnmkMLOqPnpOj0
6037a1J3j8J0LnJ2j1J1kj3J8Kj0RKMJnJ0j2nO%Mj0RJmo%J0j2KpMlkpJ0JnkLNj1
6082a1MQj1ORMplRj0J1qOKLQrJ0k1PMJrnPqKjjj2RkjJ0pmjNjkjQpJ9noJ0j2P%
6132Dj6K0qljJ1MqPMj6PoKQj6mNkQljOpjKkKoJKn%MJOPQj6PJmRnpqJ6JKkLj1J2
6185A2j5NJ0nrnNl%MlQKomkQj5OqLJ4j2J2j2J7kJ2mj2KMj1J1nKQj0RJ1j3jj1O
6229CMPooj0MJojQLj3J5j1QlRlj8J6mLM%KlPLqPj2NNlMl%KLomM%%KPrkj3RpPp
6282fmL%Ol%MJjJqPKj1QJ0nOPMj1J4j3j9K1JqOJj3J1k%m%Lqj2RLLmRk1LJ1n%q
6331a2LKJ0j0J2lNnKJ%MMpNmRrmNNqmlLmJ1krj2K0j7J0Nk0lONNOopJ3oJ1j0Nl
$$ plain form
5983 7 4 3 1 -1 -3 -2 -5 0 -18 2 -3 -7 4 -7 -13 -8 0 -6 -5 -2 3 -7 -4 0 3 5 14 7 7 7 8 4 4 7 2 3 2 14 14 9 9 4 -1 -5 -7 -3 0 6 -2 5 0 -7 -1 -11
6037 -11 2 -16 -6 -3 -8 4 -7 4 2 -11 7 9 -1 8 10 14 15 10 20 8 3 9 9 13 3 12 13 9 3 3 13 1 3 -4 0 -3 -5 -12 -2 -1 -6 -8 -5 0 -11
6082 -11 -7 1 -10 -4 5 9 2 -1 8 -2 9 1 7 9 12 20 11 21 0 7 11 12 3 -2 5 -3 -1 -2 -3 -15 -6 -8 -9 1 -6 -10 -11 -6 -7 -9 -10 -2 -9 10 5 -1 9 -3 4 4
6132 4 -12 8 0 -3 -4 7 11 3 10 14 -2 5 -1 1 9 -7 -11 -6 -8 0 -3 -4 2 -5 -6 -4 -6 -4 -10 -9 -7 -12 -12 -8 -7 -1 6 14 -2 5 6 2 11 6 -1 -9 7 8 10 8 11 0 12
6185 12 -3 2 12 7 -2 -7 -2 -5 -5 -1 -4 4 6 0 -4 -6 2 -13 -7 -15 -12 2 -10 2 -10 7 5 17 13 1 3 7 -4 7 2 4 12 2 11 22 9 8 -3 3
6229 3 7 14 8 2 -8 -4 -3 -9 -10 -2 1 -12 3 -8 0 -3 6 3 -15 1 -3 0 4 4 6 3 10 13 5 12 0 5 10 7 11 8 8 10 13 7 3 7 7 7 9 16 7 5 -8 1 -6 1 -6
6282 -6 -10 -7 -7 -1 -4 -4 0 1 0 1 -7 0 2 -9 -1 9 4 10 17 21 10 24 11 -8 13 14 6 12 13 0 11 9 9 5 5 8 0 -12 -3 0 3 -1 8 -13 -10 1 -4 -4 -12
6331 -12 -9 -7 3 -7 5 2 7 2 4 5 5 9 13 6 11 7 16 7 3 8 13 5 1 -2 1 -3 8 6 -3 -15 5 -12 -2 3 -17 -20 -14 -9 -4 2 -4 -11 2 -4 7 -3 2 -1
6379aKRp%mJ2Rj7kRLpJj2RnpQJ0j0KojJ1j5LMj7NJOQj4lQQ%mlROm%QjqKJ0j7P
6429EMOKj5j0J1QqlNMj3nMMnpJ3poK%ONj3RnJ7plnJJOJ2j0mQMOJpLlmK0k4Oll
6479CqJ1qKnklJ5lj1J6j9J7j4NkJ0mj4QOoJ4JoKnLJRj2RmkpJ2LLpj2MJpMlJj2
6526a6J2omJ5lj7NJ7j2J5lj2PoJ3lnJ0lOrjkJ4MqlmLRrjMLj0%J7lj9KJpNMLp%
6573dj1K1jj8J4j7J4JpJ2jMjRlmKLNj1%pKkMqJJ3J0rrMj3MNmKnj0J2Lj3J0j1J0
6618dj3QQK%%qJ5J0k4J4jOqOjQokLoJOj4NnmMjrJ2%lJj3J6qJjnLqJ9jMpoNjjl
6669fMKJ0qRoJ4j5NLj3QlLkmkLnjRokNkJ2rnjj3K0jKj0OQj0J4j4jmQLNkLknKJ0
6719A6mJPj3J7j1j0kMoJjlJ2pJj2JJ0j4%koQOjMmOKj0K1j1OnJJRjJmNnOqnRlL
$$ plain form
6379 -1 1 10 3 3 -1 11 20 3 1 10 13 6 7 -5 4 -1 -8 0 10 0 2 -4 -5 6 -9 -6 -2 -19 -14 -13 -7 1 -13 -16 -8 0 0 -4 -7 2 8 4 4 12 11 3 5 15 -2 5
6429 5 9 15 17 2 -8 3 11 3 0 5 9 -4 -9 -5 -1 -6 -13 0 -7 -13 -11 -11 -5 0 -13 -4 -9 8 1 -2 -7 -6 -5 1 13 3 -1 7 11 17 18 11 14 11 7 27 3 9 6 3
6479 3 -5 6 -2 0 -5 -7 -10 5 2 -9 7 -12 5 -9 -4 -6 4 0 -14 -6 0 -6 8 9 3 5 0 3 4 13 1 10 6 4 -3 9 12 15 8 -4 0 1 -6 -2 -5 -4 -16
6526 -16 -4 -10 -14 1 -2 -19 -14 3 -9 6 3 -9 -2 -8 5 2 -3 7 4 10 1 0 -2 12 16 8 5 1 4 13 4 3 7 10 0 0 17 14 -5 -3 -2 -9 -4 0 3 -4 -4
6573 -4 -15 6 5 -13 1 -16 -2 -1 -8 4 3 7 6 15 12 8 10 13 18 7 7 0 2 0 4 -4 -3 10 20 11 2 6 -7 -3 2 -2 0 -5 -15 -3 0 -13 -3 -14 -4
6618 -4 -17 -9 -1 1 1 1 -7 8 18 -6 8 7 13 5 11 10 18 12 10 13 7 8 14 0 5 0 -4 0 -1 -10 2 2 -1 0 -13 3 -5 -4 -5 -10 -7 -15 4 3 7 0 -6 -1 -2 -3 -6
6669 -6 -2 0 10 2 11 5 19 4 9 12 -1 7 4 7 5 1 -1 2 -3 -4 5 -1 -3 2 0 12 3 -2 -3 -16 4 3 5 -5 1 9 -1 13 -1 -2 -6 2 5 10 8 11 9 4 6 16
6719 16 12 13 20 7 24 13 3 1 5 -1 0 -1 -4 8 1 2 -10 -9 1 -13 -13 -15 -21 -13 -7 -8 -4 -8 -2 0 -10 11 0 6 1 2 3 12 11 12 8 13 8 14 6 1 10 7 10
6768A0kj3J0qLj1QLrl%RqLQj6NRqMNlQmkNnJ3Lkj0J2rOJ1j9J2jnQk1J1%Pj1qJ
6815djjlKmJ6j4jJ3opLlNJ1nnjJ1LjMJJoLjrJ4Pj3jkPj1nQmojRqkj2J5Jj2J7l
6864amOqRj2J7pMq%J3j0MNjmOJjnKOqKjJ2j7OJqJKLkkj0jmRj0QLJ5j4rJ5mqL%
6914fOMMrOjOmJ3ojJnMpn%qJ0LJmLNj2mOprMPoKnnJ6JKKKj4MOmLKjJ6j2J4oJp
6967FkkJ0Kj0KLkKnKMoj1kJoJ0j0jKOoNkPPj4J5p%JM%MRj2JOJJ0j3PolQoRk4J
7017emQJoJ6qkkkJmmKj4J0JM%kJ0kQmKk%JKjmJ4j0J4oJ0j8Qj1JQk1RnJ4rpQok
7066iMjqJ0mjKlkkJ0JQKlnRrkJ1%pNmJ4kkMj1OLj3%Rj3lNjlLqM%pJ0KmRj8NOo
7118iRkmJ1qRMkjPJmrNlOqJ1n%lLJnL%j7PlK%mmOORoJmj0J6j4JKJ1j4J0kQ%jk
$$ plain form
6768 10 8 -5 5 -3 0 -11 -3 0 -9 -12 -12 -3 -11 -8 0 -16 -11 -2 -10 -6 -1 -4 4 0 -2 3 -2 11 14 12 2 14 5 11 22 3 15 14 9 17 -4 7 7 14 3 -5 -4
6815 -4 -5 -6 -9 -7 -11 5 -9 -10 3 -3 -10 -7 -10 -5 6 1 -4 -5 6 9 8 12 13 14 8 11 10 1 15 22 9 8 6 13 2 -3 5 1 -5 -6 3 -5 -7 -19 -4 -3 -15 2 -1
6864 -1 -5 1 -7 2 -10 7 0 4 -4 -4 9 -1 3 8 7 3 9 10 9 4 6 12 4 6 5 17 0 6 7 -1 0 2 5 3 1 -9 -10 -14 -5 -15 -7 -4 11 -3 -12 3 -1 -9 -6 -6
6914 -6 0 4 8 -1 5 4 10 6 19 13 12 13 8 12 5 0 0 -8 2 5 6 2 5 10 -2 -6 0 -7 -16 -12 -5 -11 -9 -14 -19 -3 -2 0 2 4 -10 -6 0 -4 -1 1 0 16 4 18 12 13 6
6967 6 4 2 12 14 4 6 9 7 9 4 6 10 4 -7 -9 -8 -14 -4 -14 -15 -13 -7 -13 -8 -10 -3 4 -10 5 -2 -2 -1 3 3 7 16 4 5 11 12 22 9 16 10 7 15 9 18 -6 -5
7017 -5 -9 -1 0 -6 10 2 0 -2 -4 -3 -7 -11 -9 -23 -13 -12 -8 -8 -10 0 -2 6 2 4 2 2 3 5 4 0 14 4 18 12 22 4 12 1 2 10 -11 -2 -7 7 -2 -9 -1 -7 -9
7066 -9 -5 -6 -14 -4 -8 -9 -7 -10 -12 -14 -4 -3 5 7 4 -1 8 -1 -3 8 8 1 6 2 16 14 12 16 5 11 14 1 1 10 -3 -6 -1 -2 -5 -2 -10 -6 -6 -13 -3 -1 -5 4 -14 -9 -3 -9
7118 -9 0 -2 -6 5 -3 6 10 8 7 14 15 11 2 7 4 10 2 13 8 8 5 8 9 4 7 7 -10 -3 -6 -4 -4 -8 -12 -6 0 9 3 4 0 -10 6 -8 -7 -5 6 -8 2 0 8 8 7 5
7170EQmmKkJ3j1jNLlL%j1Oroj%Nj7J4%mNQmmJ2j3J4qPolJ4j0LNOmMno%NoNPj2
7220ELkM%oJLj2Qj0JOkrLRLonJ1MqjOqOLKlMRo%jrPJ3j2LMk2RJLoJ5j7LnmJ%m
7273h%OknJJ1%qRroJ6LklNnJ3nNKnjJ0jm%mOrkM%qJ3j0nOKoJ2k3ORj4J0pnK1l
7323A0j4J8j5OnPmQj0J2j2RPpJkLmkPJoPj3Om%J0nJj0Mj1MRrOqQoMj0J7j9RJJ1
7370A0JkmnJ0nKlJ2pPPj0MnPoj1mMnOPj1Kj0J2j2%KnJ6%j4MNpPPkj1LJ0QooRj1
7418@JLRQj4%J3ooPjpojJ5j3j2OmPln%Qj1KPpJ1KjoQmkjOLJL%oPk0J8Jm%jQqJ
7470Fjk%Pj2%NKnpKjJ1j2lNPqJ1lpJ0mPjMNj2Ok%J2nNqpPRpqjLRqnlRjj6l%MJ7
7523A1j5JJJ0j0loPJ3j0OnNj3OLPjJOMoj0J8lk0PjLj2J1j4JLJ6j2Lkj0QjpLkQ
$$ plain form
7170 5 13 9 5 7 5 18 7 6 11 14 11 14 14 3 9 0 -6 -7 -7 -2 -19 -5 -5 -9 -4 4 0 -4 8 -5 9 1 8 2 -1 13 3 6 11 17 13 17 12 6 6 11 5 10 17 5
7220 5 8 6 10 10 4 5 8 -4 4 -6 -5 1 -1 -10 -7 2 5 -1 -6 5 9 1 0 6 -2 4 7 9 6 10 19 13 13 12 3 10 23 11 14 18 -4 5 6 9 3 18 1 4 -1 -5 -4 -4 -8
7273 -8 -8 -2 -4 -9 -8 3 3 -5 4 -5 -11 5 8 6 3 8 3 16 11 16 18 13 12 22 21 17 17 13 19 10 8 12 12 4 17 7 2 8 10 4 16 -7 -1 8 -6 4 -3 -8 13 10
7323 10 -4 14 -1 5 0 7 3 11 1 13 1 10 17 10 11 9 12 8 6 13 14 8 15 2 8 4 4 14 9 10 0 4 -7 -3 6 -3 3 -5 3 -3 1 -9 8 -11 -2 -1 10
7370 10 11 9 5 0 10 5 7 4 16 9 16 23 13 17 12 19 13 2 -2 2 -3 3 10 -1 1 -9 3 -9 -9 -7 -12 4 4 -10 -6 -1 -8 -1 6 4 -7 -4 6 14 8 2 11 0
7418 0 1 4 13 21 7 7 20 14 8 15 14 7 1 0 15 2 -10 -4 -8 -1 -4 -9 -9 -1 -12 -10 -3 -10 1 3 2 -4 4 0 -2 -3 3 6 7 10 10 4 11 -9 9 10 6 6 5 13 5 6
7470 6 5 3 3 10 -2 -2 3 5 0 -7 -5 -6 5 -7 -10 -5 2 -6 5 2 -5 5 1 8 7 11 16 4 10 8 8 20 15 20 12 5 12 21 14 6 5 8 17 9 4 1 10 9 -7 -10 -10 -6 11
7523 11 -4 -3 -2 8 -2 -5 -11 -4 9 -1 5 0 5 -8 -2 1 8 7 8 14 18 12 2 20 17 -3 4 3 6 -6 5 -9 -8 -5 11 -1 2 0 -10 -2 -3 -10 -7 -9 -1
7568aPj2%JJ0olMJ%OLj1J0M%qQpJ6j5lMKmnkQ%j1MJ3joLj0nQrkMn%J1Kj2J0jO
7617Fm%P%qOpPNoLQ%%ljjmnJqklJ8rnmKkkRklQlrMkP%%NKklkJJ1oJ1o%jJ3jJj3
7674H%kMlLqKnjjllPnRkNj4N%p%Qj0J9oOmnOKNMj5R%j2J7Lj1JJ3j1nPklJmj0O
7725bOpKm%kkMmKoQKj1J3%MnJ5j1ROj1KLQj0oJ5j4MNmMpLj%j2%MnkjMOlnLLj0
7776a0QJ4j6Oj0RJ1j8LJ4JloMLPJlpjjnQJKrJ0mmpmJkLkq%LPkLoJ1LrjjLjNRj3
7828cMONrjQMj0pJ3rJ5nplJ4j2Nloj%nKj0J0jj1LJ0lkNL%NrJNkOJ3j5M%LNjNk3
7878dJ8lpRpJn%mMRj3%oJ2k4NJ2mmjNNJl%j0J9p%QnjOj0J2moJ7Kq%j%JokPmnN
7929DrLJ0j3J2Nk7J0Jj0LlOPrLOOlMrOJ1j6J2pMnNmJ0j0MLNj1J3j9PKj2J4pKj0
$$ plain form
7568 -1 6 -6 -6 -5 5 -1 -4 0 1 1 7 10 -1 9 13 13 5 13 6 22 7 4 8 10 6 1 -1 7 7 -4 0 13 12 6 9 -1 -6 2 -7 -9 -5 -10 -10 1 3 -9 1 0 6
7617 6 2 2 9 9 1 7 0 7 12 6 9 17 17 17 14 13 12 8 3 4 -4 -6 -9 9 0 -5 -9 -7 -9 -11 -2 -4 -7 1 -2 -11 -7 -9 -2 -2 -2 3 5 3 0 -2 -1 10 4 15 9 9 8 21 20 21 8
7674 8 8 6 10 7 10 2 4 -1 -2 -3 -6 -9 -2 -7 2 0 5 -9 -4 -4 -11 -11 -3 -13 6 0 6 2 -3 3 5 10 14 -1 8 8 -4 13 16 5 6 19 8 3 10 8 5 6 2 -8 -2
7725 -2 4 -3 -1 -5 -5 -7 -9 -5 -9 -7 -13 -5 -3 -14 -1 -1 3 -2 13 2 11 17 6 8 11 19 9 3 18 4 8 13 9 13 6 9 8 8 -4 -4 0 -5 -7 -8 -4 2 -1 -6 -3 0 -10
7776 -10 -2 12 -4 2 -8 1 12 -6 -3 11 12 9 3 7 10 17 18 15 8 7 6 1 9 10 12 3 13 9 5 -2 -6 -5 -7 -4 -6 -14 -14 -11 -4 -6 -3 -9 2 5 -4 -5 -6 -3 -4 1 10 -3
7828 -3 1 7 12 3 2 10 14 4 -3 10 1 16 11 4 1 15 3 8 5 -1 -2 -2 -7 -5 -15 -5 -6 -17 -14 -4 -7 -9 -4 -1 -1 4 -5 -4 1 -1 5 18 3 7 7 10 15 14 19 -4
7878 -4 14 11 4 13 6 7 2 2 -2 2 11 -2 -2 -8 4 -20 -15 -3 -7 -11 -12 -7 -2 -1 -4 -4 -14 5 -2 -2 6 1 0 6 -4 8 4 -2 15 17 9 9 8 8 9 3 1 8 4 -1 4
7929 4 -5 -2 8 -5 7 12 -15 -5 -4 -14 -11 -14 -8 -1 -10 -7 -1 5 2 6 -3 3 14 -2 10 3 7 2 7 3 13 3 7 10 15 4 17 -2 5 7 -5 9 2 4 -6
7974fJqNMjKMNj6J3j2Rj2PJ3j0jJpJ0MmlkQLQj8J5qM%Oj2j4J2oJ0ppKqRj0J6j0
8020a1LPpMrmJ0qNJLqJ8kjJ4j2nRnjNmQjMolJj0JJ6qlmrRmj0J8j0MrJ2nNlnkJ
8070a1J2KolJ8rj2J5nJ2rMLpK3j2qj0OPnNlLplqJ4po%LMj6LKJ7q%QklNrlPjkJ2
8119A0Mk%kM%pKJLrjLMllJmKOj8pRjKrJ2KKkMqJPj1J3kqO%NlRj0%QlNrNlrLMN
8174HrRpOJqKqNJqnLqQmJ3
$$ plain form
7974 -6 -5 -13 -8 -4 -5 -3 1 6 -10 3 -9 0 -12 -5 8 -2 -3 -2 -9 1 5 1 -2 -4 4 7 15 -3 12 4 8 8 14 2 -12 0 -6 4 -3 -10 -8 -16 -7 -17 -1 -11
8020 -11 -8 -1 -8 -4 -13 -17 -7 -15 -10 -9 -6 -14 4 2 1 15 3 -2 7 2 1 6 2 10 9 13 7 4 5 -5 -4 12 4 1 -3 -12 -3 -7 -17 1 -9 -5 -14 -2 -7 -2 -5 -10 -12 -11
8070 -11 1 3 -3 -6 12 3 -9 6 1 13 4 8 11 4 27 15 7 -3 3 10 5 10 7 10 3 0 -8 6 -1 -7 -7 -4 0 -16 -13 -11 6 -2 -2 6 4 1 6 -3 -6 1 0 -2 10
8119 10 14 12 12 10 14 14 7 9 10 13 4 3 6 10 7 4 5 1 3 9 -9 -16 -7 -8 -6 -15 -3 -1 1 -1 3 -5 -4 3 -8 5 3 -5 1 1 6 3 12 2 2 10 7 12 3 8 5 -4 -1 3 8
8174 8 -1 8 1 7 8 0 2 -6 -1 0 -8 -13 -10 -18 -10 -14 -1
8191a
##END NTUPLES=NMR FID
##END=
