##TITLE=1H_LY-DMAA.Per.1.8
 CDCl3
 8 sc, 
 11.02.2022
##JCAMPDX= 6.0         $$ Bruker NMR JCAMP-DX V2.0
##DATA TYPE= NMR FID
##DATA CLASS= NTUPLES
##ORIGIN= UXNMR, Bruker Analytische Messtechnik GmbH
##OWNER= root
$$ XWIN-NMR		Version 3.5
$$ Fri Feb 11 10:12:09 2022 Russian Standard Time (UT+4h)  she@DPX200
##.OBSERVE FREQUENCY= 200.131346
##.OBSERVE NUCLEUS= ^1H
##.DELAY= (6, 6)
##.ACQUISITION MODE= SIMULTANEOUS
##.ACQUISITION SCHEME= undefined
##.AVERAGES= 8
##.DIGITISER RES= 18
##SPECTROMETER/DATA SYSTEM= spect
##.PULSE SEQUENCE= zg30
##.SOLVENT NAME= CDCl3
##.SHIFT REFERENCE= (INTERNAL, CDCl3, 0, 15.7039)
##AUDIT TRAIL= $$ (NUMBER, WHEN, WHO, WHERE, WHAT)
$$ ##TITLE= Audit trail, XWIN-NMR		Version 3.5
$$ ##JCAMPDX= 5.01
$$ ##ORIGIN= Bruker BioSpin GmbH
$$ ##OWNER= she
$$ F:/spectra/data/she/nmr/H-F/1/audita.txt
$$ ##AUDIT TRAIL=  $$ (NUMBER, WHEN, WHO, WHERE, WHAT)
(   1,<2022-02-11 10:10:32.56 +0400>,<she>,<DPX200>,
      <created by zg, POWCHK disabled, PULCHK disabled
       configuration hash MD5:
       00 E9 B6 7A A2 85 ED C7 34 08 36 98 17 FE 4E 26
       data hash MD5: 16K
       80 15 1C 7D 84 EC 24 9D 16 2A E2 DF DD 2B D4 F5>)
$$ ##END=
$$ 
$$ hash MD5
$$ 42 B9 E5 4F 5A 54 81 04 D9 49 EB 1B 94 32 94 19
##$RELAX= 
##$RELAX= 
##$RELAX= 
##$RELAX= 
##$RELAX= 
##$RELAX= 
$$ Bruker specific parameters
$$ --------------------------
##$DU= <F:/spectra>
##$EXPNO= 1
##$NAME= <H-F>
##$PROCNO= 1
##$TYPE= <nmr>
##$USER= <she>
##$AMP= (0..31)
100 100 100 100 100 100 100 100 100 100 100 100 100 100 100 100 100 100 
100 100 100 100 100 100 100 100 100 100 100 100 100 100 
##$AQSEQ= 0
##$AQ_mod= 1
##$AUNM= <au_zg>
##$AUTOPOS= <>
##$BF1= 200.13
##$BF2= 200.13
##$BF3= 200.13
##$BF4= 200.13
##$BF5= 200.13
##$BF6= 200.13
##$BF7= 200.13
##$BF8= 200.13
##$BYTORDA= 1
##$CFDGTYP= 0
##$CFRGTYP= 5
##$CHEMSTR= <none>
##$CNST= (0..31)
1 1 145 1 1 1 1 1 1 1 1 1 1 1 1 1 1 1 1 1 1 1 1 1 1 1 1 1 1 1 1 1 
##$CPDPRG= <>
##$CPDPRG1= <>
##$CPDPRG2= <>
##$CPDPRG3= <>
##$CPDPRG4= <mlev>
##$CPDPRG5= <mlev>
##$CPDPRG6= <mlev>
##$CPDPRG7= <mlev>
##$CPDPRG8= <mlev>
##$CPDPRGB= <>
##$CPDPRGT= <>
##$D= (0..31)
0 1.2 0 0 0 0 0 0 0 0.06 0 0.03 0 0 0 0 0.0002 0 0 0 0 0 0 0 0 0 0 0 0 
0 0 0 
##$DATE= 1644559832
##$DBL= (0..7)
120 120 120 120 120 120 120 120 
##$DBP= (0..7)
150 150 150 150 150 150 150 150 
##$DBP07= 0
##$DBPNAM0= <>
##$DBPNAM1= <>
##$DBPNAM2= <>
##$DBPNAM3= <>
##$DBPNAM4= <>
##$DBPNAM5= <>
##$DBPNAM6= <>
##$DBPNAM7= <>
##$DBPOAL= (0..7)
0.5 0.5 0.5 0.5 0.5 0.5 0.5 0.5 
##$DBPOFFS= (0..7)
0 0 0 0 0 0 0 0 
##$DE= 6
##$DECBNUC= <off>
##$DECIM= 32
##$DECNUC= <off>
##$DECSTAT= 4
##$DIGMOD= 1
##$DIGTYP= 9
##$DL= (0..7)
0 120 120 120 120 120 120 120 
##$DP= (0..7)
150 150 150 150 150 150 150 150 
##$DP07= 0
##$DPNAME0= <>
##$DPNAME1= <>
##$DPNAME2= <>
##$DPNAME3= <>
##$DPNAME4= <>
##$DPNAME5= <>
##$DPNAME6= <>
##$DPNAME7= <>
##$DPOAL= (0..7)
0.5 0.5 0.5 0.5 0.5 0.5 0.5 0.5 
##$DPOFFS= (0..7)
0 0 0 0 0 0 0 0 
##$DQDMODE= 0
##$DR= 18
##$DS= 0
##$DSLIST= <SSSSSSSSSSSSSSS>
$$ [...]
##$SUBNAM2= <"">
##$SUBNAM3= <"">
##$SUBNAM4= <"">
##$SUBNAM5= <"">
##$SUBNAM6= <"">
##$SUBNAM7= <"">
##$SUBNAM8= <"">
##$SUBNAM9= <"">
##$SW= 18.0517287032376
##$SWIBOX= (0..15)
0 0 2 0 0 0 0 0 0 0 0 0 0 0 0 0 
##$SW_h= 3612.71676300578
##$TD= 16384
##$TD0= 1
##$TE= 0
##$TE2= 300
##$TE3= 300
##$TEG= 300
##$TL= (0..7)
0 120 120 120 120 120 120 120 
##$TP= (0..7)
150 150 150 150 150 150 150 150 
##$TP07= 0
##$TPNAME0= <>
##$TPNAME1= <>
##$TPNAME2= <>
##$TPNAME3= <>
##$TPNAME4= <>
##$TPNAME5= <>
##$TPNAME6= <>
##$TPNAME7= <>
##$TPOAL= (0..7)
0.5 0.5 0.5 0.5 0.5 0.5 0.5 0.5 
##$TPOFFS= (0..7)
0 0 0 0 0 0 0 0 
##$TUNHIN= 0
##$TUNHOUT= 0
##$TUNXOUT= 0
##$USERA1= <user>
##$USERA2= <user>
##$USERA3= <user>
##$USERA4= <user>
##$USERA5= <user>
##$V9= 5
##$VALIST= <valist>
##$VCLIST= <CCCCCCCCCCCCCCC>
##$VD= 0
##$VDLIST= <DDDDDDDDDDDDDDD>
##$VPLIST= <PPPPPPPPPPPPPPP>
##$VTLIST= <TTTTTTTTTTTTTTT>
##$WBST= 1024
##$WBSW= 4
##$XGAIN= (0..3)
0 0 0 0 
##$XL= 0
##$YL= 0
##$YMAX_a= 42971
##$YMIN_a= -41840
##$ZGOPTNS= <>
##$ZL1= 120
##$ZL2= 120
##$ZL3= 120
##$ZL4= 120
##$ABSF1= 10
##$ABSF2= 0
##$ABSG= 5
##$ABSL= 3
##$ALPHA= 0
##$AQORDER= 0
##$ASSFAC= 0
##$ASSFACI= 0
##$ASSFACX= 0
##$ASSWID= 0
##$AUNMP= <proc_1d>
##$AZFE= 0.1
##$AZFW= 0.1
##$BCFW= 1
##$BC_mod= 2
##$BYTORDP= 1
##$COROFFS= 0
##$CY= 11.3945322036743
##$DATMOD= 1
##$DC= 2
##$DFILT= <>
##$DTYPP= 0
##$F1P= 2.36226072786647
##$F2P= -0.459571619588291
##$FCOR= 0.5
##$FTSIZE= 0
##$FT_mod= 4
##$GAMMA= 1
##$GB= 0.15
##$INTBC= 1
##$INTSCL= 1
##$ISEN= 128
##$LB= 0.24
##$LEV0= 0
##$LPBIN= 0
##$MAXI= 10000
##$MC2= 0
##$MEAN= 0
##$ME_mod= 0
##$MI= 1.114404
##$NCOEF= 0
##$NC_proc= 0
##$NLEV= 6
##$NOISF1= 3.799351
##$NOISF2= 2.8
##$NSP= 1
##$NTH_PI= 0
##$NZP= 0
##$OFFSET= 15.70392
##$PC= 1
##$PHC0= -16310.7
##$PHC1= 11.80078
##$PH_mod= 1
##$PKNL= yes
##$PPARMOD= 0
##$PSCAL= 0
##$PSIGN= 0
##$REVERSE= no
##$SF= 200.130013532006
##$SI= 16384
##$SIGF1= 3
##$SIGF2= 2
##$SINO= 400
##$SIOLD= 16384
##$SREGLST= <1H.CDCl3>
##$SSB= 0
##$STSI= 0
##$STSR= 0
##$SW_p= 3612.71676300578
##$SYMM= 0
##$S_DEV= 0
##$TDeff= 0
##$TDoff= 0
##$TI= <>
##$TILT= no
##$TM1= 0
##$TM2= 0
##$TOPLEV= 0
##$USERP1= <user>
##$USERP2= <user>
##$USERP3= <user>
##$USERP4= <user>
##$USERP5= <user>
##$WDW= 1
##$XDIM= 8192
##$YMAX_p= 0
##$YMIN_p= 0
$$ End of Bruker specific parameters
$$ ---------------------------------
##NTUPLES= NMR FID
##VAR_NAME=  TIME,          FID/REAL,        FID/IMAG
##SYMBOL=    X,             R,               I
##VAR_TYPE=  INDEPENDENT,   DEPENDENT,       DEPENDENT
##VAR_FORM=  AFFN,          ASDF,            ASDF
##VAR_DIM=   8192,          8192,            8192
##UNITS=     SECONDS,       ARBITRARY UNITS, ARBITRARY UNITS
##FACTOR=    0.0002768,     1,               1
##FIRST=     0,             0,               0
##LAST=      2.2672688,     0,               0
##MIN=       0,             -41840,          0
##MAX=       2.2672688,     42971,           0
$$ Real data points
##PAGE= N=1
##DATA TABLE= (X++(R..R)), XYDATA
$$ [...]
$$ plain form
149 -8279 -12252 7906 10965 -7538 -8680 7255 5623 -7475 -2576 7770 -378 -8227 2668 8318
163 8318 -4424 -7931 5541 6810 -6246 -4860 6908 2392 -7523 504 8536 -3134 -9571 5374
177 5374 10662 -6668 -11312 7012 11229 -6448 -10150 5177 7786 -3760 -4407 2482 42 -1971
191 -1971 4535 2196 -8936 -3451 12392 5329 -14396 -7418 14722 9248 -13138 -10036 10187 9582
205 9582 -6094 -7333 1907 3609 1923 1390 -4499 -6960 5507 12301 -4895 -16669 2692 19095
219 19095 301 -19380 -3635 17106 6166 -12828 -7444 7001 6831 -646 -4262 -5245 95 9950
233 9950 5244 -12521 -10596 12972 15291 -11137 -18183 7769 18849 -3511 -16972 -700 12718
246 12718 3889 -6775 -5605 -152 5262 6815 -3190 -12554 -483 16270 4815 -17709 -9062
$$ packed form
149h279l973K0158L059j8503j142J5935j632j3098M899J0346q148p849J0895N650
163H318j2742l507J3472J269j3056J386J1768m516r915Q027Q032j1670o437J4945
177E374N288j7330m644J8324M217j7677l702J5327K609j1546o47O889k440k013
191a971O506k339j1132N485J5843p063j9725O978K2140n474k2386L102K0223o05
205I582j5676j239R240J702j686n33n889k461J2467O794j7196j1774J9361J6403
219A9095j8794j9681J5745K0741j0940j8994N384J4445j70p477l616r83N340R855
233I950m706j7765J925K3568K319k6428p046K5952J1080k2360j3461J6272J3418
246A2718q829j0664J170N453N414J553j0005r364J2071J6753j1455k2524Q647
$$ plain form
259 -9062 16667 12299 -13488 -13759 8912 13123 -3654 -10176 -1138 5459 4850 496 -6769 -6714 6795
274 6795 12269 -5037 -16340 2000 18191 1454 -17812 -4666 15119 6663 -10889 -7182 5633
287 5633 5853 -420 -3040 -4093 -931 7306 5368 -8815 -9407 8793 12539 -7298 -14022 5102 13833
302 13833 -2592 -11870 474 8546 843 -4406 -1174 -54 384 4008 1122 -7222 -3201 9134
316 9134 5134 -9876 -6684 9382 7337 -8085 -6976 6346 5606 -4497 -3357 3064 723 -1965
330 -1965 2165 1469 -4614 -1299 6555 1401 -7699 -1465 8036 1224 -7758 -692 6907 -352 -5941
345 -5941 1566 4812 -3018 -3877 4254 3005 -5217 -2243 5685 1426 -5583 -419 5084 -742 -4178
360 -4178 2255 3247 -3853 -2321 5555 1720 -6985 -1409 7966 1383 -8286 -1535 7725 1535 -6466
$$ packed form
259i062K5729m368k5787k71K2671M211j6777o522R038O597o09m354p265N5J3509
274F795N474j7306j1303J8340J6191j6737j9266J3146J9785q456j7552L707J2815
287E633K20o273k620j053L162Q237j938j4183n92J8200L746j9837o724J9124Q731
302A3833j6425r278J2344Q072p703n249L232J120M38L624k886q344M021J2335
316I134m000j5010L192J6066k045j5422J109J3322p40j0103J140O421k341k688
330a965M130o96o083L315P854n154r100O234R501o812q982P066P599p259n589
345e941P507L246p830q59Q131j249q222K974P928m259p009N164N503n826l436
360d178O433R92p100J532P876l835q705N576R375o583r669O751R260o190q001
$$ plain form
375 -6466 -1329 4425 539 -2141 748 -320 -2660 2344 4834 -3770 -7069 4348 8982 -4008 -10084
390 -10084 3047 10225 -1558 -9055 158 6804 939 -3633 -1287 -55 742 3694 663 -6767 -2756
405 -2756 8814 5091 -9679 -7298 9110 8773 -7446 -9230 4929 8353 -2092 -6146 -485 2920
419 2920 2470 1124 -3287 -5161 3041 8859 -1651 -11424 -416 12628 2801 -12199 -4884 10241
433 10241 6146 -7156 -6270 3342 4998 396 -2605 -3672 -819 5783 4529 -6664 -8052 6190
447 6190 10753 -4598 -12104 2404 11977 20 -10218 -1927 7271 3087 -3432 -3068 -585 2001
461 2001 4267 39 -7108 -2626 8706 5219 -9058 -7432 8073 8662 -6258 -8795 3853 7594
475 7594 -1497 -5312 -449 2260 1681 1250 -1927 -4480 1393 7217 -124 -8890 -1356 9508 2814
$$ packed form
375f466N137N754l886k680K889j068k340N004K490q604l299J1417M634j2990o076
390a0084J3131P178j1783p497R213O646n865m572K346J232P97K952l031p430M011
405b756J1570l723j4770K381J6408l37j6219j784J4159L424j0445m054N661L405
419B920m50j346m411j874Q202N818j0510r773J1008J3044r827j5000P315J5125
433A0241m095j3302Q86R612J656m602l001j067K853O602j254j1193j388J4242
447F190M563j5351p506J4508R573j1957j0238Q291R198m184o519L64K483K586
461B001K266m228p147M482J1332l487j4277J626J5505N89j4920k537J2648L741
475G594r091l815M863K709n79m31l177k553N873N824p341q766P534J0864o694
$$ plain form
490 2814 -8925 -3767 7442 3996 -5356 -3417 3058 2040 -942 -99 -825 -2194 1865 4270 -2341
505 -2341 -6035 2236 7070 -1820 -7340 1313 6842 -898 -5655 831 4100 -1049 -2321 1646 618
520 618 -2403 898 3222 -2001 -3853 2721 4171 -3171 -4151 3310 3629 -3463 -2858 3499 1743 -3682
536 -3682 -654 3843 -414 -3970 1268 3980 -1850 -3722 2227 3203 -2384 -2304 2548 1145 -2692 252
552 252 2979 -1604 -3375 2757 3834 -3582 -4290 3902 4465 -3819 -4388 3247 3717 -2534 -2639 1650 969
569 969 -961 978 558 -3022 -555 4872 975 -6229 -1674 6974 2523 -6866 -3158 6025 3470 -4497
585 -4497 -3165 2584 2217 -592 -599 -1228 -1526 2434 3731 -3004 -5889 2759 7461 -1964 -8317 705 8099
602 8099 594 -6930 -1651 4926 2172 -2355 -1931 -377 964 2944 700 -4825 -2647 5913 4651
$$ packed form
490B814j1739N158J1209l446r352J939O475j018k982Q43p26j369M059K405o611
505b341l694Q271M834q890n520Q653N529p740m757O486L269n149j272L967j028
520F18l021L301K324n223j852O574J450p342r80P461L19p092O05O357j756n425
536c682L028M497m257l556N238K712n830j872N949R76n587Q0M852j403l837K944
552B52K727m583j771O132J077p416p08Q192N63q284n69P635M70o251j05M289o81
569I69j930J939m20l580K467N427l897p204M555Q648m451r389L708R183k555p967
585d497J332N749l67k809po29k98L960J297o735k885Q648M702r425o353R022P394
602H099p505p524N279O577k754m527M24J554J341J980k244n525K178Q560j262
$$ plain form
617 4651 -6055 -6301 5299 7217 -3910 -7244 2115 6216 -413 -4339 -1005 1769 1740 1105 -1756
632 -1756 -3875 999 6128 290 -7571 -1827 8048 3353 -7451 -4385 6032 4788 -3972 -4301 1753
647 1753 3040 335 -1053 -1944 -1362 2800 3718 -2929 -5787 2323 7117 -1346 -7655 116 7183 928
663 928 -5930 -1584 4067 1691 -1882 -1145 -279 93 2161 1382 -3410 -2852 4091 4220 -4105 -5094 3630
680 3630 5407 -2829 -5048 1909 4037 -1154 -2622 594 814 -469 948 600 -2552 -1067 3703 1572
696 1572 -4375 -2058 4556 2317 -4286 -2223 3738 1811 -2996 -1023 2297 49 -1648 1058 1187
711 1187 -2050 -870 2844 642 -3373 -483 3515 171 -3442 166 3054 -727 -2649 1330 2123
726 2123 -2006 -1697 2581 1302 -3003 -960 3188 662 -3064 -256 2709 -207 -2096 872 1409 -1645
$$ packed form
617D651j0706k46J1600J918j1127l334R359M101o629l926L334K774k9o35k861
632a756k119M874N129n838p861N744R875m695j0804L066J0417j244q760l29O054
647A753J287k705j388q91N82M162R18o647k858Q110M794q463o309P771P067o255
663I28o858M346N651k376l573P37Q66L72K068p79m792N58O943J29q325r89Q724
680C630J777q236k219O957K128n191j468L216K20j283J417l48l152J485M770k131
696A572n947K317O614k239o603K063N961j927m807J973L320k248j697K706J29
711A187l237J180L714k202m015K890L998l344l613L608K888l781j922L979P93
726B123m129L09M278j279m305K043M148k526l726K808K965k916j889K968N37l054
$$ plain form
742 -1645 -717 2483 154 -3315 185 3942 -371 -4337 283 4304 -165 -3910 -7 3048 1
757 1 -1882 216 527 -736 811 1515 -1913 -2414 2696 3332 -2949 -4059 2834 4476 -2281 -4386 1522
774 1522 3763 -731 -2652 36 1076 286 655 -279 -2411 -195 3808 916 -4780 -1838 5120 2666
790 2666 -4849 -3251 4020 3414 -2753 -3002 1338 2071 56 -602 -1132 -1154 1748 2942 -1811 -4462 1371
807 1371 5499 -614 -5934 -348 5605 1154 -4664 -1739 3151 1785 -1406 -1357 -405 378 1922 918
823 918 -2972 -2341 3457 3647 -3316 -4590 2762 5011 -1830 -4784 855 3962 29 -2609 -607 927
839 927 748 843 -475 -2467 -213 3660 1061 -4374 -1984 4464 2675 -4078 -3074 3254 2977 -2199
855 -2199 -2405 1130 1394 -168 -56 -459 -1329 759 2647 -678 -3646 375 4190 60 -4271 -473
$$ packed form
742a645R28L200k329l469L500L757m313l966M620M021m469l745L903L055l047
757Aj883K098L11j263J547P04l428n01N110O36o281j110O893J642o757k105N908
774A522K241m494j921K688J040p90L69r34k132K216M003k892n696K942O958k454
790B666p515J598P271o06o167k49M340P33k015o58n30k2K902J194m753k651N833
807A371M128o113n320N586N953m451n818K925M890j366l191M9R52P83J544j004
823I18l890O31N798J90o963j274P352K249o841k954N639L107l933k638K002J534
839I27j79R5j318j992K254L873k599n435K390O448j789o753J004O328k77n176
855b199k06L535K64j562J12m03q70K088J888l325k968M021L815m130m331L798
$$ plain form
871 -473 3906 689 -3214 -706 2216 370 -1209 169 212 -924 544 1669 -1068 -2361 1334 2836
887 2836 -1395 -3009 1326 2920 -1200 -2489 1147 1874 -1134 -1106 1260 319 -1450 391 1653 -1000
903 -1000 -1831 1371 1854 -1656 -1753 1758 1415 -1825 -990 1833 399 -1878 219 1940 -772 -1986 1232
920 1232 2006 -1487 -1905 1611 1687 -1560 -1243 1452 675 -1287 59 1197 -841 -1188 1564 1245 -2188
937 -2188 -1429 2535 1558 -2662 -1660 2471 1580 -2059 -1302 1456 769 -815 -14 252 -883 189 1872
954 1872 -347 -2716 325 3366 -67 -3681 -276 3596 619 -3113 -838 2264 791 -1242 -487
969 -487 101 -136 893 951 -1679 -1889 2073 2724 -2119 -3364 1806 3652 -1273 -3513 646 2955 -33
986 -33 -1975 -333 759 453 568 -232 -1783 -276 2730 962 -3311 -1702 3390 2280 -3107 -2674 2448
$$ packed form
871d73M379l217l903K508K922j846j579J378M3j136J468J125k737j293L695J502
887B836m231j614M335J594m120j289L636P27l008K8K366r41j769J841J262k653
903a000q31L202M83l510r7L511l43l240Q35K823j434k277K097J721k712j214L218
920A232P74l493m18L516P6l247L17K695p77j962J346J138k038l47K752l19l433
937b188P59L964r77m220J002M131q91l639P57K758o87j584Q01K66j135J072J683
954A872k219k369L041L041l433l614L405L872k977l732K275L102j473k033P55
969d87N88k37J029N8k630k10L962O51m843j245N170J846m925k240M159K309k988
986c3j942J642J092l06J15q00j551J507L006j768m273J609N092j110n387M33N122
$$ plain form
1003 2448 2640 -1597 -2252 651 1425 126 -325 -690 -918 933 2121 -809 -3093 438 3719 111
1019 111 -3855 -641 3592 1067 -2901 -1231 1930 1072 -855 -605 -198 -160 1010 1023 -1570 -1936 1747
1036 1747 2638 -1655 -3123 1305 3209 -848 -2933 421 2306 -84 -1435 -29 460 -58 537 359
1052 359 -1370 -781 1966 1245 -2276 -1645 2283 1861 -2095 -1872 1708 1578 -1294 -1128 861 424 -582
1069 -582 304 398 -1032 -342 1651 410 -2046 -471 2237 535 -2186 -475 1996 316 -1650 -4
1085 -4 1285 -380 -901 807 589 -1231 -355 1517 146 -1734 -33 1727 -153 -1628 322 1376
1101 1376 -580 -1074 870 742 -1199 -446 1498 213 -1725 -35 1841 -57 -1796 157 1593 -249
1117 -249 -1221 394 758 -644 -268 932 -233 -1315 593 1650 -848 -1957 905 2085 -859 -2046
$$ packed form
1003B448J92m237o55K903P74j299m51l65k28J851J188k930k284L531L281l608
1019A11l966L214M233k525l968J670L161q58j927K50M07L8J170J3k593l66L683
1036A747Q91m293j468M428J904m057k085L354J885k390j351J406M89n18N95j78
1052C59j729N89K747p21l521O31L928m22l956K23L580j30k872J66J989m37j006
1069e82Q86R4j430O90J993j241k456J575K708j702k721J711K471j680j966J646
1085dJ289j665n21J708k18j820Q76J872j371j880J701J760j880j475J950J054
1101A376j956m94J944j28j941P53J944j285j938J690J876j898j739J953J436j842
1117b49r72J615L64j402L76J200j165j082J908J057k498j109K862J180k944j187
$$ plain form
1133 -2046 701 1770 -525 -1302 370 655 -318 93 426 -825 -640 1456 972 -1860 -1312 2047 1600
1150 1600 -1979 -1788 1662 1718 -1222 -1450 695 892 -231 -199 -156 -648 291 1450 -266 -2143 33 2603
1168 2603 310 -2746 -654 2597 965 -2133 -1059 1486 932 -693 -561 -81 -51 698 757 -1127 -1521
1185 -1521 1259 2130 -1191 -2585 860 2699 -480 -2528 77 2012 213 -1292 -334 418 235 461
1201 461 62 -1213 -505 1765 1042 -2031 -1514 2029 1850 -1764 -1978 1341 1822 -840 -1423 346 789
1218 789 15 -40 -226 -778 199 1465 -60 -1997 -245 2260 522 -2285 -775 2044 881 -1608 -799
1235 -799 1081 543 -504 -100 43 -436 327 995 -520 -1481 562 1811 -512 -1968 363 1884 -280
1252 -280 -1649 184 1211 -227 -739 323 223 -534 234 788 -596 -1013 815 1182 -937 -1260 953
$$ packed form
1133b046K747J069k295p77J672K85r73M11L33j251J85K096m84k832N48L359m47
1150A600l579J91L450N6k940k28K145J97j123L2M3m92R39J159j716j877K176K570
1168B603k293l056K092L251j632l098J074K545n54j625J32M80L0P49N9j884l94
1185a521K780Q71l321j394L445J839l179k048K605J935j799j505R58P52j83K26
1201D61l99j275P08K270p23l073N17L543j79l614k14L319M81k662n83J769M43
1218G89p74n5j86n52R77J266j525j937J752K505j738k807J510K819j163k489Q09
1235g99J880n38j047M04J43m79P63O68j515r61K043J249k323j456K331J521k164
1252b80j369J833J027j438n12J062j00p57P68N54j384m17J828L67k119l23K213
$$ plain form
1269 953 1215 -911 -1026 847 727 -805 -360 782 -39 -800 379 828 -695 -870 876 847 -990 -790
1287 -790 984 606 -940 -351 887 41 -811 318 777 -656 -773 939 787 -1112 -773 1176 728
1304 728 -1113 -596 969 370 -765 -66 532 -343 -381 733 243 -1143 -234 1429 239 -1623 -318
1321 -318 1610 384 -1469 -402 1172 322 -761 -135 319 -161 101 567 -420 -1000 617 1384 -669
1338 -669 -1684 560 1795 -400 -1737 171 1451 -9 -1031 -108 439 51 137 120 -720 -420 1143
1355 1143 776 -1403 -1121 1467 1397 -1320 -1501 1040 1441 -671 -1169 294 696 -9 -124 -180 -520 194
1373 194 1113 -83 -1597 -151 1838 413 -1923 -693 1735 833 -1380 -870 904 692 -387 -358 -87
1390 -87 -105 439 649 -630 -1147 671 1557 -538 -1790 321 1802 -88 -1632 -136 1251 210 -778
$$ packed form
1269I53K62k126j15J873j20j532M45J142q21p61J179M49j523j75J746k9j837K00
1287g90J774l78j546N89J238q46q52J129M59j433j17J712j52j899L39J949m48
1304G28j841N17J565n99j135O99N98q75l8J114m90j386R09J663j190j862J305
1321c18J928j226j853J067J574q50j083O26M54m80K62M66r87n80J617P67k053
1338f69j015K244J235k195j337J908J280j460j022R23N47l88Q6j7q40L00J563
1355A143l67k179K82K588p0k717j81K541M01k112m98J463M02p05j15n6l40P14
1373A94R19j196j514J446J989j425k336J230K428r02k213N10J774k12j079K9K71
1390h7j8N44K10j279n17J818Q86k095j252K111J481j890j544J496J387j041r88
$$ plain form
1407 -778 -203 198 1 286 251 -730 -604 996 914 -1111 -1194 1058 1331 -908 -1300 695 1105 -448 -769
1426 -769 258 355 -158 119 150 -577 -233 934 340 -1190 -491 1258 581 -1246 -638 1071 548 -858
1444 -858 -394 603 114 -384 191 223 -520 -102 814 86 -1000 -57 1111 68 -1094 -31 983 -23
1462 -23 -802 145 579 -325 -362 496 155 -719 -18 844 -95 -960 139 939 -198 -854 246 680 -324
1481 -324 -451 430 227 -563 17 723 -195 -853 334 965 -368 -976 378 918 -352 -757 300 488
1499 488 -307 -206 326 -135 -429 422 557 -667 -702 798 823 -840 -900 752 876 -601 -735 432 502
1518 502 -236 -158 125 -224 -70 619 95 -949 -190 1168 318 -1286 -481 1216 573 -1038 -586 742
1536 742 467 -403 -278 59 -67 199 432 -376 -797 424 1135 -358 -1336 223 1391 -31 -1296 -131
$$ packed form
1407g78N75M01j97K85l5r81J26J600q2k025q3K252K73k239l92J995M10j553l21
1426g69J027R7n13K77L1p27L44J167n94j530O99J749o77j827O08J709n23j406
1444h58M64R97m89m98N75L2p43M18R16p28j086R43J168j043j162J063J014j006
1462b3p79R47M34r04l7Q58l41q74P01Q62r39q65J099Q00j137o56J100M34j004
1481c24j27Q81k03p90N80P06r18o58J187O31j333o08J354N40j270m05J057J88
1499D88p95J01N32m61k94Q51J35j224l5J500K5j663o0J652J24j477j34J167P0
1518E02p38P8K83l49J54O89n24j044P59J358q50j604Q05J697o43j611M52J328
1536G42k75q70J25L37j26K66K33q08m21J221P11j493r78J559J168j422j265J165
$$ plain form
1554 -131 1037 223 -677 -229 240 111 179 95 -544 -392 779 681 -899 -965 854 1114 -721 -1185 495
1573 495 1066 -263 -802 68 453 73 -13 -82 -399 19 788 137 -1058 -322 1187 526 -1162 -667 1014
1592 1014 687 -784 -630 466 423 -182 -141 -30 -225 170 560 -220 -860 192 1071 -85 -1142 -29
1610 -29 1107 134 -930 -168 671 135 -386 -25 100 -156 145 379 -330 -595 424 751 -458 -864 400
1629 400 841 -350 -765 277 579 -234 -355 235 96 -268 161 356 -363 -427 509 505 -573 -523 585 513
1649 513 -542 -432 475 284 -409 -98 346 -113 -338 316 329 -488 -357 580 362 -620 -353 575 285 -511
1669 -511 -180 419 33 -312 161 244 -353 -197 546 199 -672 -199 730 209 -719 -216 626 170 -496 -112
1689 -112 306 -57 -134 227 -17 -438 116 627 -175 -777 152 860 -108 -858 43 749 17 -559 -25 321
$$ packed form
1554a31J168q14r00M48M69j29O8q4o39J52J171r8j580o6J819K60j835m64J680
1573D95N71j329n39Q70L85l80q6o9l17M18P69o51j195P36J509o61j688M95J681
1592A014l27j471J54J096m3o05M1J11j95L95L90p80o40J052Q79j156j057J113
1610b9J136r73j064P62Q39n36n21L61J25k56L01K34p09k65J019L27j209m06J264
1629D00M41j191m15J042L02q13j21N90j39l64M29J95p19o4R36mj078N0J108p2
1649E13j055J10R07j91o93L11M44m59k25O54J3q17J31R37k18r82K67R28k90p96
1669e11L31N99l86l45M73Q3n97J56P43l47q71M73R29n21r28N03Q42m56o66L84
1689a12M18l63p7L61k44m21N54N11q02o02R29P08r68p50R01P06p32n76N34L46
$$ plain form
1709 321 1 -40 106 -209 -274 411 440 -545 -621 564 760 -523 -827 398 767 -262 -630 109 400 -5
1729 -5 -109 -36 -208 9 491 89 -711 -223 857 386 -866 -496 787 554 -617 -540 392 420 -157 -219 -41
1750 -41 -58 157 343 -219 -618 198 831 -115 -952 2 961 130 -834 -217 641 251 -366 -186 94 53 169
1771 169 158 -348 -359 471 574 -474 -726 420 802 -314 -785 181 656 -68 -466 -12 204 18 53 28
1791 28 -304 -140 480 263 -587 -378 640 482 -573 -497 494 478 -347 -352 217 191 -104 23 43 -235 -37 424
1813 424 44 -572 -90 633 126 -634 -172 576 161 -445 -112 315 13 -178 127 72 -262 12 407 -51
1833 -51 -493 74 545 -68 -538 52 485 -52 -382 75 242 -155 -111 219 -19 -316 105 402 -173 -465 196
1854 196 481 -182 -449 160 365 -145 -241 158 93 -183 70 248 -186 -291 301 375 -371 -414 349 425 -319 -400
$$ packed form
1709C21l20m1J46l15o5O85K9r85p6J185J96j283l04J225L69j029l68P39K91m05
1729ej04P3j72K17M82m02q00M88J080m71j252L70J283k33j171P7R32K8n77o2J78
1750d1j7K15J86n62l99Q16O33r46q37R54R59q31r64O17Q58l90o17J80K80m1J16
1771A69j1n06j1Q30J03j048k52J146L82j116m71R66M75p24l98M54K16j86L5k5
1791B8l32J64O20k17q50K09J018j58j055P6R91j6q25nN69k6k95J27K0k78J98M61
1813D24l80o16M82P23n07p60M62P48m15o06L33M27l02j91L05n5l34K74L95m58
1833e1m42N67M71o13m70N90M33n37l30M57J67l97M4L30k38k97M21K97n75k92O61
1854A96K85o63k67O09K05n10r6L99o5k76K53J78m34j05N92P4p46m3P63P6p44q1
$$ plain form
1876 -400 237 292 -172 -176 117 -22 -98 188 106 -356 -145 472 208 -538 -261 551 332 -465 -307 374 285 -224
1898 -224 -168 102 20 16 156 -102 -363 114 496 -87 -624 18 652 52 -623 -123 502 150 -353 -146 149
1919 149 72 49 64 -186 -205 325 370 -343 -502 332 601 -270 -619 159 558 -65 -422 -28 238 59 -34 -52
1941 -52 -185 -32 364 126 -492 -251 536 347 -514 -428 441 433 -298 -382 166 287 -44 -105 -45 -90 85 281 -71
1964 -71 -431 32 557 48 -593 -140 546 181 -465 -213 318 165 -169 -98 18 -40 94 191 -163 -322 190
1985 190 438 -173 -501 137 508 -73 -456 22 356 -4 -220 7 63 -69 66 122 -198 -227 256 280 -292
2006 -292 -348 276 363 -234 -333 183 259 -137 -158 102 20 -100 101 118 -204 -147 291 195 -330 -216 323 210 -294
2029 -294 -194 227 117 -181 -42 105 -83 -84 181 80 -276 -76 320 83 -360 -100 353 106 -301 -72 220
$$ packed form
1876d00O37N5m64mK93j39p6K86q2m62K11O17k64p46K77Q12k19p97J58O81q9n09
1898b24N6K70q2mJ40k58k61M77L82n83n37O42O34o00o75N00O25l52n03K07K95
1919A49p7k3J5k50j9N30M5p13j59Q34K69q71l49P78L99o23l57L94K66j79r3j8
1941e2j33J53L96k38o18K41P87j89q61Q6Q69qp31q4N48J21l31o1O0m5J75J96l52
1964g1l60M63N25n09o41M53O86l65o46K52N31j53l34P1J16n8J34R7l54j59N12
1985A90K48o11l28O38L71n81l83M78L34l60k16K27N6j32J35N6l20k9M83K4n72
2006b92n6O24Q7n97r9N16P6l96k1K60q2j20K01J7l22N7M38r6n25J14N39j13n04
2029b94J00M21j10k98J39J47j88jK65j01l56K00L96k37m43K60M53k47m07K29K92
$$ plain form
2050 220 41 -135 45 61 -135 8 231 -42 -329 45 363 -49 -413 5 369 8 -308 -31 204 4
2070 4 -96 37 -23 -105 113 186 -191 -275 222 360 -200 -385 175 384 -99 -325 60 224 -3 -102 -1 -56 -29
2093 -29 184 72 -299 -146 358 224 -390 -282 327 302 -273 -294 166 233 -73 -135 -3 -5 48 151 -72 -287 47
2116 47 377 10 -444 -79 438 115 -396 -174 287 177 -180 -134 38 43 58 70 -151 -189 176 305 -170 -381
2138 -381 140 422 -77 -408 7 350 42 -237 -65 107 43 30 11 -146 -82 228 169 -277 -250 286 302 -249
2160 -249 -308 170 299 -118 -230 44 129 -19 -10 -6 -112 -1 211 48 -292 -98 332 139 -315 -167 281 184
2182 184 -203 -153 127 85 -60 7 -3 -105 22 185 -42 -270 2 291 5 -309 -29 286 37 -226 -27
2203 -27 144 9 -57 47 -3 -99 69 188 -81 -220 101 267 -85 -272 66 237 -56 -186 37 109 -40 -27
$$ packed form
2050B20j79j76J80J6j96J43K23k73k87L74L18m12l64M18L64l61l16K77K35k00
2070Dj00J33o0q2K18P3l77q4M97J38n60j85N60K09m83k26L85J64k27r9J01n5K7
2093b9K13j12l71J53N04j34o14J08O09k5n75k1M60O7l06o2J32kN3J03k23k15L34
2116D7L30l67m54L65N17l23n11K22M61j10l57M6J72NJ5J2k21l8L65J29m75k11
2138c81N21K82m99l31M15L43l08k79J72J72o4j3j9j57O4L10n9m46K7N36J6n51
2160b49n9M78J29m17j12K74Q5j48RMj06J11K12j63l40J94M30j93m54J48M48r7
2182A84l87N0K80m2j45O7j0j02J27J63k27k28K72K89k86l14K80L15k49k63J99
2203b7J71j35o6J04n0r6J68J19k69j39L21J66l52j87L38J71k93j30K23P2j49J3
$$ plain form
2225 -27 68 -57 -94 120 158 -144 -185 163 212 -153 -208 124 196 -87 -134 72 69 -37 16 38 -105 -69 177 98 -224
2250 -224 -127 233 163 -224 -170 194 161 -120 -108 67 57 -14 44 -12 -116 36 211 -11 -259 -5 311 62 -280
2273 -280 -69 250 92 -172 -85 102 53 -3 18 -56 -78 118 158 -140 -233 126 280 -92 -296 41 279 3 -209
2296 -209 -30 142 54 -23 -14 -57 -8 157 84 -199 -129 227 203 -206 -229 175 241 -122 -209 48 146 -6 -69 -37 -23
2321 -23 38 123 -17 -208 -16 263 75 -266 -104 260 140 -210 -129 146 122 -67 -74 -3 9 53 77 -79 -168 83
2345 83 219 -59 -254 31 266 8 -232 -54 185 53 -93 -35 32 6 51 57 -108 -104 132 157 -141 -198 124 215
2369 215 -96 -191 51 170 -18 -109 12 35 -3 38 29 -110 -49 146 87 -176 -125 179 141 -142 -135 109 116 -74 -48
2394 -48 42 8 -9 60 13 -108 -12 158 29 -173 -49 185 66 -163 -85 123 58 -103 -34 39 -11 -6 73 -26 -115 27
$$ packed form
2225b7R5j25l7K14L8l02m1L48M9l65n5L32P2k83m7K06lj06N3K2j43L6K46p9l22
2250b24R7L60p0l87N4L64l3k81J2J75j0p1N8n6j04J52J75k22k48K54L16k49l42
2273b80K11L19j58k64Q7J87m9n6K1p4k2J96M0k98r3L59J54l72k04L37K38k76k12
2296b09J79J72q8p7Rm3M9J65p3k83P0L56k4m09k3M04O6l63q7K57R8j52o3L2J4
2321b3O1Q5j40j91J92K79j88l41J62L64j20l50Q1K75k4j89pP1J2M4K4j56q9K51
2345H3J36k78j95K85K35k58k40J78K39j32j46N8O7k6M5Oj65MK36K5k98n7L22R1
2369B15l11r5K42J19j88r1J21K3l8M1rj39O1J95n9k63N1L04l8k83PK44Pj90K6
2394d8R0l4j7O9m7j21R6J70j29k02J24K34j19k29P8K08o5j61O9P3n0NP9r9q9J42
$$ plain form
2420 27 165 -15 -182 10 181 12 -171 -20 145 36 -78 -2 25 -20 34 55 -70 -110 91 141 -89 -177 87
2443 87 181 -52 -167 33 138 1 -78 -3 13 10 53 19 -104 -51 154 107 -149 -121 152 154 -124 -148 81 120 -36
2468 -36 -75 -4 23 35 52 -36 -109 19 161 19 -187 -36 207 77 -172 -100 139 104 -75 -70 22 46 43 29 -53 -74
2494 -74 87 140 -73 -174 62 201 -16 -200 -18 167 44 -118 -46 47 34 7 -13 -62 -21 110 95 -129 -120 125
2518 125 156 -94 -167 62 166 -19 -122 -2 70 27 -14 -23 -43 8 101 17 -145 -49 159 82 -149 -110 121 106 -89
2543 -89 -89 61 69 1 -15 -23 -32 32 93 -18 -121 22 162 16 -162 -38 147 53 -108 -50 72 40 -8 -17 -15 -25 41 68
2571 68 -49 -81 57 137 -37 -136 27 134 2 -108 -8 69 14 -18 13 -6 -7 65 51 -71 -78 86 99 -73 -107 55
2597 55 107 -43 -91 10 64 0 -11 8 -26 -4 61 26 -97 -34 105 64 -109 -88 97 93 -53 -53 41 56 5 -12 -8 -39
$$ packed form
2420B7J38j80j67J92J71j69j83J51J65j09j14P6K7m5N4K1j25m0K01N0k30q8K64
2443H7R4k33j15K00J05j37p9P5J6lM3l4j23N3K05m7k56K8K73Kk78k4K29L9j56
2468c6l9P1K7J2J7q8p3J28J42j42k06J51K43j30k49P2K39l5j79NR2K4lj4q2k1
2494g4J61N3k13j01K36J39k17j84J82J85j23j62P2R3j3k7k0m9M1J31j5k24RK45
2518A25L1k50p3K29J04j85j03J20P2m3m1rk0N1R3q4j62R6K08p7k31L9K31j5j95
2543h9%J50Qo8j6qrO4O1j11j03J43J40j46j78J24J85r4j61N8J22l2m8rKj0O6K7
2571F8j17l2J38Q0j74r9J63J07j32j10J00P7n5l2L1j9jP2j4j22pJ64J3j72l4J62
2597E5N2j50m8J01N4o4j1J9l4K2O5l5j23O3J39m1j73K1J85mj46%R4J5n1j7Ml1
$$ plain form
2625 -39 17 63 -17 -113 -2 127 23 -140 -35 124 47 -97 -52 50 49 -8 -11 -10 -4 58 63 -53 -93 56 125 -38 -134
2652 -134 17 129 10 -100 -20 64 30 -20 -23 -20 12 55 28 -75 -52 91 87 -84 -112 70 120 -41 -97 19 80 9
2678 9 -44 -27 -7 24 44 -7 -83 -11 102 32 -106 -60 105 76 -91 -81 45 86 -25 -57 -18 2 35 39 -39 -59 26 98
2706 98 -20 -116 -11 116 29 -102 -37 83 51 -45 -36 -1 13 26 16 -56 -47 54 67 -57 -105 48 102 -27 -104 -1
2732 -1 76 8 -50 -26 16 21 24 -7 -44 -24 64 40 -85 -62 75 77 -58 -84 37 78 -19 -60 -4 19 18 16 -14 -58 6 73 21
2763 21 -69 -37 93 39 -72 -55 57 48 -26 -35 12 21 15 11 -17 -45 32 60 -3 -80 12 95 12 -78 -37 69 26 -45 -23 15 14
2794 14 8 -6 -37 -38 35 61 -44 -71 38 78 -19 -77 12 72 11 -42 -14 18 14 15 -13 -38 -15 52 32 -72 -55 60 59 -49
2824 -49 -68 34 62 -7 -45 2 31 9 13 -20 -38 17 61 12 -82 -27 88 44 -81 -47 43 54 -41 -53 3 31 9 -2 -30
$$ packed form
2625c9N6M6q0r6J11J29j04j63J05J59p7j44M5J02jn7lJOO2Nj16m0J49O9j63r6
2652a34J51J12j19j10Q0Q4l4n0lLL2M3k7j03K3J43mj71k8J82N0j61n6J16O1p1
2678In3J7K0L1K0n1p6P2J13p0j38M6J65k9j67J0J26M1j11l2L9K0L3Mp8k0Q5P2
2706I8j18r6J05J27q7j31O5J20l2r6RL5J4J3j0p2RJ01J3j24m8J53N4j29p7J03
2732aP7o8n8K4M2NLl1l7K0Q8k4j25K3J37Kj35k6J21M1r7m1N6K3jkl0m4O4O7n2
2763B1r0L2J30n4j11J7J12rp4rM7Romk8k8P7K8o3p7R2Q3q3r0M1J06m3p1K2L8j
2794A4oj4l1jP3K6j05k7J09M0r7n8Q9O0o1n3K8L2mJk8k5K3O7k0j04J7J15jj08
2824d9j9J02K8o9l8M7K9k2Ml3j8N5M4m9r4N5J15m4j25L4R0J1r5j2N6K8k2j1k8
$$ plain form
2853 -30 -18 41 54 -27 -74 18 83 4 -88 -21 73 32 -51 -32 24 25 -1 -20 -19 -9 47 26 -50 -51 43 87 -39 -78 17 72 0
2884 0 -65 -22 35 21 -8 -18 -25 17 46 6 -54 -22 63 44 -54 -43 43 47 -34 -51 13 38 1 -23 -24 -21 12 29 -15 -60 -5 58 12
2917 12 -76 -36 54 35 -48 -43 27 36 1 -31 -12 -1 25 20 -28 -44 21 60 -24 -71 -1 53 9 -55 -22 25 21 -13 -26 -22 -3 26 10
2950 10 -38 -31 55 38 -31 -64 23 46 -15 -46 -3 34 26 -17 -21 -7 5 17 -5 -49 -6 47 20 -55 -36 30 45 -23 -36 8 21 -1
2982 -1 -12 -13 1 21 21 -26 -50 -7 48 9 -60 -19 51 29 -47 -41 16 30 -22 -26 -22 -7 13 11 -25 -42 24 46 -29 -58 1 51 2 -53
3016 -53 -18 45 28 -19 -21 -4 15 24 8 -33 -18 38 30 -46 -47 18 51 -17 -52 -9 25 -9 -40 -16 -3 14 21 -10 -39 4 35 12 -55
3049 -55 -19 50 37 -38 -42 15 35 -9 -16 -15 0 7 6 -28 -26 13 29 -8 -57 4 54 -1 -49 -29 31 20 -24 -29 -8 16 13 0 -21 -12 25
3084 25 31 -14 -35 20 42 -7 -41 -15 37 19 -18 -11 13 17 2 9 -28 -17 32 14 -37 -31 23 37 -30 -41 7 37 1 -25 -10 13 8
$$ packed form
2853c0J2N9J3q1m7R2O5p9r2O7R4m1q3J9N6Jk6j9JJ0N6k1p6jR4M4j26l9R5N5p2
2884@o5M3N7j4k9j0pM2K9m0o0L2Q5j9r8J1Q6Mq1j7O4K5l7k4jLL3J7m4m5N5O3m6
2917A2q8M0R0j9q3NP0Rl5l2J9J1K6nm8j6O5L9q4m7P0N4m4o4L3M7ml4j3MJ9K9j6
2950A0m8PQ6j7o9l3Q7K3o1l1M3L7qm3mJ4J2J2k2m4M3N3k7p5J9O6J5o8j3M4J3k2
2982aj1jJ4K0%m7k4M3N5l9o9M1P0k2p6ON7J4n2mMJ5K0kl6j7O6K2p5k9N9N0m9n5
3016e3L5O3j7m7kJ7J9Rj6m1J5N6qp6jO5L3o8l5M3L4l4l1K4J3J7Pl1k9M3L1k3o7
3049e5L6O9j3p5mN7K0m4pJJ5Pjl4KL9J6l7m9O1N0n5m8K0O0j1m4nK1K4lj3k1RL7
3084B5Om5k1N5K2m9l4K6N2j8l7PK4Mj5Pl7J1M9j8n1ON4J4o7j1M8L0l6k6J5K3n
$$ plain form
3117 8 -2 -16 -23 13 42 1 -37 -14 32 4 -40 -30 9 26 -24 -25 -16 8 6 -11 -22 -13 10 22 -10 -46 2 35 2 -38 -8 31 26 -22
3151 -22 -19 7 18 13 -18 -31 -22 17 14 -19 -42 13 29 -29 -46 -1 33 9 -32 -20 -3 12 -6 -11 -15 -5 26 6 -34 -19 33 27 -21 -28
3185 -28 15 22 -10 -31 -13 17 8 -7 -27 -12 18 25 -8 -35 -7 28 8 -41 -21 31 18 -21 -28 -2 22 16 -14 -21 -5 15 17 -16 -30 14
3219 14 32 5 -32 -9 22 4 -22 -13 13 17 -7 -27 -23 -8 22 -3 -25 -21 19 25 -22 -34 10 29 -16 -33 -16 10 6 -6 -26 -10 9
3252 9 7 -9 -26 -9 12 5 -35 -23 17 22 -22 -22 -22 22 4 -2 -13 0 15 12 -30 -29 3 29 2 -33 -19 21 16 -23 -21 1 11 -1 -9 -18 -2
3289 -2 5 -1 -19 -5 16 6 -10 -25 13 31 0 -24 -21 6 14 -10 -13 -3 3 7 -14 -24 -20 22 21 -24 -26 12 19 -3 -30 -14 22 7 -12 -11 -5
3326 -5 0 4 -8 -24 -14 9 7 -25 -16 5 20 -13 -21 -7 10 -8 -17 -9 5 9 1 -21 -23 -1 10 -17 -34 -18 16 9 -16 -10 9 10 1 -13 -6 8
3364 8 7 -10 -21 -9 9 18 -14 -25 -9 13 -13 -33 -16 7 1 -17 -30 -1 11 -2 -11 -33 -1 10 3 -26 -10 11 10 -4 -29 -2 12 2
$$ packed form
3117Hj0j4pL6K9m1l8K3M6k8m4J0L9J7n0jRK4kj7j1RK3J2l2l6M8L3l3m0L0L9nm8
3151b2LK6J1nl1j3RL9ll3k3N5J6n8j7M5L4k4m1J2J7J5j8nmJ0L1k0m0J5N2om8p
3185b8M3Pl2k1J8L0rj5k0J5L0Pl3k7K8L5k0m9K0N2j3l9pK6K4ol0pJ6K0Kl3j4M4
3219A4J8k7l7K3L1j8k6RK6Mk4k0MJ5L0k5k2MM0Om7j2M4J9m5j7J7K6mj2k0J6J9
3252Ikj6j7J7K1pm0J2M0Nm4%%M4j8oj1J3J5lm2JL2K6k7l5J4M0nl9KK2J0j2qrJ6
3289bPoj8J4K1j0j6j5L8J8l1k4LK7Qk4lJ0OMk1j0MM2jm5kL8Pk2k7J6L6j5j9JO
3326eNMj2j6J0K3kl2RK1J5l3qJ4J7j8rQJ4Mqk2kK2J1k7j7J6L4pk5OJ9Jrj4PJ4
3364Hjj7j1J2J8Rl2j1J6K2k6k0J7K3oj8j3K9J2j3rk2L2J1pk9J6K1jj4k5K7J4j0
$$ plain form
3398 2 -24 -13 1 11 6 -25 -12 -1 6 -8 -19 -8 11 7 -21 -14 3 9 -3 -16 -13 8 2 -17 -16 -8 19 19 -16 -29 -3 19 7 -18 -11 8
3434 8 12 -12 -12 1 4 -1 -13 -11 -18 15 9 -19 -27 7 6 -5 -29 -3 4 2 -12 -22 -5 9 -7 -13 -9 -4 1 3 -18 -6 20 8 -6 -18 6 9 -4
3473 -4 -8 -6 8 3 1 -10 -12 0 7 -11 -20 0 18 13 -22 -9 7 7 -6 -15 -17 -2 3 -6 -29 -12 11 10 -14 -20 1 15 -8 -19 -3 9 6 -3 -7 3
3513 3 17 7 -4 -8 -1 10 -3 -26 -11 23 18 -14 -13 8 21 3 -14 -9 2 7 -6 -14 -15 14 12 -18 -25 -7 7 9 -12 -16 0 17 -10 -6 0 5
3551 5 7 -5 -16 0 17 15 6 -17 9 15 -6 -18 -2 11 3 -19 -14 1 13 8 -9 -19 8 8 -1 -15 -3 10 12 -4 -11 6 1 7 -12 8 8 11
3589 11 5 -16 -12 5 10 -12 -10 -5 6 3 -6 -5 3 20 2 -10 -13 -3 3 -6 -12 4 6 -3 -2 -10 8 15 0 -9 -6 9 6 -9 -18 -9 11 11 -2 -1 2 2 -2 -20
3633 -20 -3 9 7 -9 -20 8 5 -6 -6 -8 3 5 -1 -7 4 2 4 -1 -14 -2 9 9 -13 -11 -1 8 -4 -11 -4 2 -1 -19 -10 -7 14 8 -17 -15 8 2 7 -6
3675 -6 -2 13 19 -4 -9 4 9 7 2 -5 2 14 2 -8 -13 -3 18 4 -21 -11 10 -7 -23 -7 -3 6 3 -11 -11 -2 8 5 -4 -7 1 9 4 -11 4 18 4
$$ packed form
3398Bk6J1J4J0nl1J3J1Pj4j1J1J9mk8PJ7Oj2j3LK1oj9JQK7%l5j3K6K2j2k5PJ9
3434HMk4%J3Lnj2KpL3ok8qL4jj1k4K6Pkj4j0J7J4j6oMNNKk1J2K6j2j4j2K4Lj3
3473dmKJ4nkj1kJ2Pj8rK0J8nl5J3J6%j3rkJ5Nrk3J7K3jk4oK1J4k3j1J6J2lrmJ0
3513CJ4j0j1mPJ1j3k3J5L4nl2JK1J3j8j7NJ1Nj3qjK9kl0pJ8J4Kk1mJ6J7k7MON
3551EKj2j1J6J7krk3K6Ok1j2J6J3qk2NJ5J2nj7j0K7%rj4J2J3Kj6pJ7nOj9K0%L
3589A1ok1MJ7Nk2KNJ1lrJQJ7j8j2lJ0OroJ6KrJqJ8Pj5rLJ5lj5rRK0%j3JL%mj8
3633b0J7J2kj6j1K8lj1%kJ1KooJ1kKnj3J2J1%k2KJ0Rj2pPOlj8RLK1ok5KK3oNj3
3675fMJ5Ok3nJ3NknpPJ2j2j0nJ0K1j4k5J0K1j7j6J6MRlj4%RJ0lrlQQnj5J5J4j4
$$ plain form
3716 4 -9 -4 7 17 -2 -7 -3 1 9 -5 -12 3 16 11 -7 -10 5 15 -1 -21 2 11 -2 -9 -12 1 -7 0 -12 -6 0 11 -3 -22 -9 3 3 -12 -9
3755 -9 -6 2 7 -7 -13 -3 -4 0 -14 -2 18 12 -4 -10 2 14 9 1 2 -4 8 -7 -14 1 4 -2 -12 -8 -3 -11 0 -13 -13 -2 7 -9 -9 -4 2 5 -13 -9 -1 0
3799 0 4 2 -7 3 8 0 -7 -6 13 3 -5 -8 1 7 7 -4 -5 -1 1 4 -10 -6 -5 3 -14 -11 -8 11 -1 -4 -11 3 10 -9 -8 -2 2 18 -6 -14 2 8 2 3 -3 21 6
3846 6 10 -8 -3 10 8 -4 -14 -8 -5 -1 -4 -7 1 1 -3 -11 -3 6 11 -13 -17 -6 10 -2 -6 1 4 4 -8 -5 -5 9 -1 -7 -11 -6 11 8 3 -8 1 8 7 -1 12 5 -1
3893 -1 2 -16 -8 9 4 -13 -15 -11 10 3 -9 -12 4 -1 -3 -12 -14 -5 -9 -16 -21 -9 -5 4 -5 -9 17 5 9 -22 2 11 -6 -16 -13 8 13 2 -6 -11 1 -1 -9 -8 -3
3938 -3 11 10 -4 -11 18 8 -10 -2 10 -7 2 -4 -14 0 -6 -9 -14 -14 1 6 -2 -9 -5 -1 5 -4 0 1 -1 3 -4 -16 3 11 4 -11 -3 2 3 -2 -12 -9 -1 3 -7 -3
3984 -3 -3 7 -9 -8 -1 3 8 0 -13 -3 16 3 -8 -12 -3 -1 -4 3 -6 6 9 -1 -6 5 -2 -4 -7 -6 -2 5 8 -4 -4 12 0 0 -9 7 0 3 -11 5 -3 1 10
4029 10 -7 -9 -3 -4 -6 -1 -5 3 -2 -2 -6 -9 4 3 0 3 -11 -4 -5 -6 -14 2 -2 1 -13 -1 5 5 -6 -2 -2 13 5 -2 7 19 -3 -2 -1 -5 1 -13 -10 -9 1 -1 4 -13
$$ packed form
3716Dj3NJ1J0j9nMMQj4pJ5J3nj8lJ5J0j6k0K3Rj3plJ3qPj2OOJ1j4j9J3J2%j5L
3755iLQNj4oJ0jMj4J2K0oj6oJ2J2nqJoJ2j5pJ5Loj0MNqJ1j3%J1Rj6%NOLj8MQJ
3799@MkrJ0NqpJJ9j0qlRO%j1jMKLj4MJQj7LLJ9j2lpJ4Pj9JOMJ6k4qJ6OoJoK4j5
3846FMj8NJ3kj2j0OLMllQ%mqQRNk4mJ1J6j2mPL%j2L%J4j0omNJ7lnj1RPjqJ3po
3893aLj8QJ7nj7kMK1pj2lJ6nkrkRmpnJ2MRrmK6j2Ml1K4Rj7j0LK1Nj1qnJ2kqJN
3938cJ4jj4pK9j0j8QJ2j7Roj0J4oln%J5NqpMMOrMJkMpj2J9Qpj5QNJnj0LQMj0M
3984c%J0j6JPMNqj3J0J9j3j1mRKlPrJ2Lj0nJ1pklJMPLj2%J6j2%rJ6pLj4J6qMR
4029A0j7kOjkNmQn%mlJ3jlLj4PjjqJ6mLj4J2O%j1M%J5qpRJ2k2JJmOj4LJJ0kNj7
$$ plain form
4077 -13 2 3 -4 -7 -5 -5 6 -4 -10 -11 -9 1 -1 -11 -13 -3 0 -19 -6 0 1 3 -7 0 3 14 6 -9 0 11 4 -7 -4 -2 2 -1 -4 -5 1 -3 -9 -2 7 6 4 10 -16
4124 -16 -7 3 1 -18 -3 1 6 -1 -17 8 10 14 0 0 5 7 7 5 -1 0 7 2 -5 3 6 11 1 -2 -5 11 -8 2 7 8 17 1 -2 -11 1 11 -1 -12 0 -2
4168 -2 2 -7 -11 6 8 -1 4 5 8 9 9 -5 -3 9 8 0 6 1 5 3 -2 3 -1 -4 -3 2 4 2 6 5 -11 7 5 1 -2 -1 5 4 1 11 -5 -4 12 -4 -7 -4 6 9 1 -5 3
4219 3 5 1 -1 -4 1 -4 -4 -11 9 10 6 -1 0 0 9 6 -1 -3 11 8 -6 -5 5 11 1 -3 4 -2 10 2 -3 4 10 17 5 -3 7 17 -5 8 2 16 2 -1 2 5 0 2
4267 2 0 -6 9 0 6 -8 4 -2 11 6 -8 2 11 4 -5 -10 8 6 4 -7 -4 0 8 -5 -9 8 7 10 0 0 9 7 12 3 4 14 17 6 -7 9 8 0 11 0
4311 0 -2 11 10 -7 0 2 0 6 1 3 5 14 8 -8 4 4 1 -12 -13 4 9 2 -4 5 12 3 4 -1 3 2 6 -3 -2 6 6 -5 -3 10 6 16 6 -2 -3 -2 1 2 0 3 -3 -4 -11
4362 -11 5 5 9 1 -9 3 5 8 -1 -13 -9 15 7 -2 -1 8 2 7 -4 10 6 -5 -3 -3 1 1 8 2 2 9 19 4 4 8 21 8 3 -9 2 6 4 -2 1 -7 0 10
4408 10 0 -3 5 1 -3 -6 -6 -3 -2 4 -11 3 -5 7 5 4 4 0 5 -2 4 4 2 -8 2 5 4 2 4 5 -8 2 0 3 3 5 7 0 -1 1 4 12 1 4 3 8 9 -4 9
$$ packed form
4077a3J5JplK%J1j0ojKJ0kj0kJ0Lj9J3OJKj0PLJ1qj5RJ1pj1LKMlljOmoPRjkOk6
4124a6RJ0kj9J5MNpj6K5KMj4%NK%koJPnpQLNj0llJ6j9J0NJRj6lrJ2J0j2j1J2k
4168bMrmJ7KrNJLJ%j4KJ2jqOnMknNmlJNKkMjj6J8kmlJOjlJ0j6JJ6j6lLJ0LqoQ
4219CKmklNn%pK0JmpJ%RlpkJ4lj4JJ0Oj0mPoJ2qnPOPj2qJ0J0k2J3oJ4j4lLLnK
4267BkoJ5rOj4J2oJ3nj4J0RprnJ8kkj1LMQj3mJ7jLj0%RkNrJJ0Lj1j3J6jqJ1j1
4311@kJ3jj7PKkOnKKRoj6J2%lj3jJ7NpoRPrJnMjMrJQ%j1KJ3mJ0j0qjJLJkLojp
4362a1J6%Mqj0J2KLrj2MK4qrJRoNj1J4mj1K%M%Po%PJ0j5%MJ3j3nj2J1MkoLqPJ0
4408A0j0lQmml%LJOj5J4qJ2kj%mNpO%kj0J0LjkKJj3J0kL%KKpjKLQj1LjNJj3J3
$$ plain form
4457 9 7 -11 -8 6 6 6 2 2 2 2 5 -3 -6 12 6 -8 -4 -7 0 1 0 -12 1 -7 -1 -1 -11 2 6 5 -4 -1 6 4 -5 -1 4 -3 -11 3 -6 9 5 0 -4 -10 6 10 1 -4
4507 -4 -7 6 9 2 -2 2 3 7 -1 6 -2 3 2 -9 -4 11 0 -4 2 6 8 -6 -5 -9 0 -2 1 -4 -3 5 -8 1 -2 3 -5 -11 -6 -11 9 -4 -11 -13 10 0 7 -1 2 7 -1 -1 8
4558 8 -5 5 7 -1 6 3 8 6 2 -2 13 4 -15 -8 0 -5 4 -7 -6 -8 1 -3 -6 -3 0 6 -7 -5 -11 3 0 0 -2 -10 2 11 3 2 16 12 8 10 -3 4 -8 0 -6 3 10 6
4608 6 -1 -1 5 -4 -3 -2 -3 11 4 -8 -19 -6 -14 -1 -3 1 2 0 1 -6 -11 -5 3 -8 0 -9 -2 -4 4 -4 5 -2 1 -1 -14 11 0 7 4 6 -6 4 -9 -3 1 11 6 0
4656 0 -5 -2 4 -2 -8 8 -3 -2 2 -6 0 10 1 -3 2 -2 13 -5 -2 1 8 -1 1 -7 6 -4 6 0 1 6 4 4 -4 -3 7 11 3 3 3 7 3 -1 -11 -4 8 2 -6 0 6 -4
4706 -4 2 0 -2 1 1 7 10 7 1 8 -3 0 3 -1 -6 -6 1 6 5 8 -1 -12 5 7 11 13 3 7 2 -14 4 1 5 -3 -5 -4 3 9 3 -5 -5 7 -9 -3 4 5 5 3 -7 -1 14
4757 14 5 8 5 1 2 -4 1 12 8 9 0 1 3 14 6 -5 2 3 9 -4 -2 -5 4 4 4 -1 1 4 7 -3 -4 2 -4 0 0 1 -4 0 6 -6 -6 6 5 5 -1 5 5 10 7 -3 9
4808 9 4 3 -4 6 1 5 -8 4 7 3 3 -8 -5 -4 0 -4 -10 1 -11 5 11 -8 5 1 -3 -6 -11 2 3 5 0 4 6 2 -3 -2 1 9 6 2 1 15 0 -9 2 7 11 8
$$ packed form
4457Ikj8LJ4%%m%%%LqlJ8oj4MlPJjj2J3qO%j0J3MjrLPkrMNpqJ4rJ5mnmoJ6Mrn
4507dlJ3LpmMJMqPqNjj1NJ5j1mOMKj4JmRkLnJQj3RlNqoNnK0j3pkK3j0PqLNq%R
4558Hj3J0KqPlNkmmJ5rj9PQnRj1JkRmlLLOj3KoJ4l%kqJ2RqjJ4mmKj3Pj2QoRPm
4608Fp%OrJJjJ4pj2j1J3qJ3kMJkJpnOQj1QrPkQqRpLkj3K5j1PlKj2J0j3OMJ0no
4656@nLOooJ6j1JMqOJ0rmNmJ5j8LLPrKqJ3j0J0oJNk%qJJ0Mq%%Mmmj0PJ2oqOOj0
4706dOkkL%OLloPj1LLmn%PNjLrj1J7KMKj0Mnj6J8lMqkJPOoq%J2j6OPJ%kj0OJ5
4757A4rLlmJoNJ1mJrJKJ1qj1PJOj3KlR%%nKLLj0jOoM%JnMOj2%J2j%oO%Nlj0J2
4808InjpJ0nMj3J2Lm%j1LJMmoJ1j2J6Oj9J3mmlnJ3JKnMKmnJLQlmjJ4j5rJ1NMl
$$ plain form
4856 8 -7 1 0 9 -2 -1 -5 -2 0 -7 -5 -6 9 0 -2 7 1 -4 6 4 2 4 1 2 -4 2 13 4 -6 -6 1 6 -2 1 1 3 -5 -5 0 -4 2 8 -2 -7 2 11 0 4 -7 0 -14
4907 -14 -1 6 4 -2 0 -8 1 -7 -4 0 -7 9 -9 -11 0 -6 -4 3 5 -4 2 8 9 2 -3 5 1 1 -1 -3 -5 2 6 -6 -13 -4 9 1 -1 -10 3 -1 -12 -19 2 0 -5 5 4 -6
4957 -6 2 -2 -2 -1 0 -5 -7 -7 -3 6 -5 4 -2 -10 4 -8 2 1 -3 0 5 -4 -1 7 3 -4 -4 2 -4 -2 -7 -3 -2 -2 -5 2 -1 0 -4 -6 -3 3 4 7 -4 5 -1 -2 4 0 3 4 -5 3 -8
5012 -8 -3 4 2 4 -7 4 12 2 4 2 12 -2 -2 11 10 13 -1 5 -4 0 7 -4 -3 -10 -8 -1 -8 -8 4 9 -2 -11 -5 -1 5 -4 5 7 -3 -4 -7 4 2 10 6 6 0 -1 -2
5061 -2 3 -5 1 10 13 0 6 3 -3 8 9 7 11 13 -1 3 4 5 0 -2 -2 -7 -6 1 -2 5 -3 -5 0 7 -6 16 11 1 3 2 9 7 0 1 6 2 12 5 3 4 2 3 -8 -2 -2 -3 0
5114 0 3 3 1 -5 -5 -3 1 2 1 -4 -10 -4 -2 0 -10 1 8 3 -3 4 1 0 -4 1 0 5 7 2 2 8 6 4 3 -5 -2 2 2 2 9 4 -2 -1 1 -3 -2 -1 -1 3 1 2 6 -1 -5 -1 0 -8 6 -1
5172 -1 0 7 -5 6 5 7 2 2 2 -3 7 -1 8 18 4 3 0 0 14 15 17 8 -2 0 -2 -3 -4 2 -4 -2 3 0 -10 -6 -4 -9 -9 -1 11 -3 1 2 -1 -11 -4 6 4 10 8
5221 8 0 4 19 11 14 -2 3 2 14 15 2 9 14 7 1 -6 -2 6 5 -3 -2 -1 13 1 -11 3 10 6 3 13 1 4 1 3 0 5 6 8 2 5 11 7 14 3 13 8 9 10 3
$$ packed form
4856Hj5QjRj1JmLKpKjJ5rkRonJ0kkKlJoOJ1rj0%PNqL%Kq%NmOOj0nRRj1Mj1Pj4
4907a4J3PkoKqRqLMpJ6j8kJ1oKPKrOOJpnQm%kkkPMj2pRJ3qkrJ3mj1pK1knJ0jj0
4957fQm%JJnk%MRj1RoqJ4j2J0jmLNrLQmp%OoKnMJ%lPlJmkLOJLj1RojOmLJrQj1
5012hNPkKj1J1Qj0KkJ0j4%J3jLj4OrMPj1JpKPp%J2Nj1rOMOrRKj0jlJ1kQm%ojj
5061bNqORLj3OloJ1JkMKj4MJJnk%nJPlPqkNPj3K2nj0KjPkpJNmJ0pkJkJj1O%jL
5114@L%ko%KMJjnoOKKj0J1PnoPljmNjNKn%OkkjqLM%%PnoJKmJJ%MkJMpmMJqJ4p
5172aJPj2J1jKn%%nJ0qRJ0j4jl%J4JKrj0KkjjOoKNlj0MKn%QJ2j4MJlj0PJ0kOk
5221HqMJ5qLj6NjJ2Jj3PNpopMQjqJJJ4j2j2J4PmlJ0j2LlKlNJKoLOmPj1J0nJJp
$$ plain form
5270 3 7 8 8 2 9 7 21 8 16 4 2 -4 1 -2 6 -10 2 4 9 0 2 9 -2 -1 -3 0 -4 6 1 3 -1 8 12 3 14 -4 0 20 5 14 14 12 15 5 6 6 7 10 12
5319 12 10 0 4 4 0 1 -4 5 -4 -8 3 -7 5 8 8 1 -2 2 0 5 -6 1 0 2 -7 -5 2 8 7 3 9 -9 1 4 7 2 9 6 1 6 2 10 10 4 3 11 -2 1 4 2 10 -1
5371 -1 -3 1 10 1 9 -3 -3 10 2 -9 7 1 0 0 -13 1 -2 -4 -4 1 7 -1 2 -2 -1 15 3 5 -6 1 3 6 3 1 3 1 17 -6 -3 8 4 -4 1 -2 2 1 3 2 -2
5420 -2 3 7 15 -2 5 2 -6 4 -5 0 -3 -1 0 1 2 6 4 6 0 6 12 5 4 2 6 2 11 6 9 2 1 8 6 2 -9 -4 -6 15 1 -2 -2 0 13 8 2 -2 10 6 3 1 -7 1 10 7
5474 7 9 -1 5 -1 11 3 0 12 -1 1 -3 5 2 0 4 -1 -13 -6 1 2 6 0 5 3 9 -1 -1 -2 0 -3 5 1 9 4 14 3 -5 3 5 1 6 3 -2 2 0 17 12 4 8 7 9 -7
5526 -7 0 3 4 7 -7 1 3 8 6 -3 -1 -3 2 -8 -5 3 -4 -5 -4 -1 -4 3 2 -11 4 0 -1 3 6 6 13 1 3 4 10 5 6 17 8 -2 2 -8 -1 -4 5 2 -7 2 -1 0 0 10
5578 10 1 4 -3 3 -5 3 0 -4 1 5 8 2 3 2 14 19 11 11 9 7 8 12 8 0 6 13 3 9 22 -1 -2 -3 7 6 11 1 -2 7 -6 0 1 6 12 14 0 3 9 3 6 0 -4 8
5630 8 1 -4 4 8 6 8 6 6 9 -5 4 3 0 17 0 -2 10 2 7 5 10 7 3 6 2 7 4 10 8 4 14 3 -2 3 0 -13 8 1 0 -2 6 -8 -2 3 -5 -2 -4 0 3 -2 -1 10
$$ packed form
5270CMJ%oPkJ4j3Qj2koNlQj6J2KNrKPj1JkLmJ0nKmRMrJ1j8MK0j5R%kLj0J%JLK
5319A2kj0M%mJnRrmJ1j0J2L%plMkNj1PjKrKPOjmOj8J0LLnPlnNmQ%ojQj3LLkQj1
5371akMRrQj2%J3qj1J6oj%j3J4lk%NOqLmJJ6j2Kj1PKLlkKkJ6k3LJ1mqNlMjKjm
5420bNMQj7PlqJ0rNlKJJJMkKoOOpjkMmRnLpjPkmj1NkK1j4l%KJ3nomJ2mlkqQRl
5474GKj0OoJ2qlJ2j3KmQlkMnj2PPJMoNkOj0%jKlQmQnJ0j1qQKmNlnMkJ7nqMjKj6
5526gPLJLj4QKNkrKkNj0LQpjJLlPjj3J5mjML%Pj2KJOnJJ1rj0Mj0PlRlrRlJ%J0
5578A0rLpOqQlmNMLoJjJ2Nq%kkJMmqOPj0OJ3k3jjJ0jNj0lRj3OJNOKj4LOoLomJ2
5630HpnQMkKk%Lj4RjlJ7j7kJ2qNkNlmLmNlOkmJ0j1nNlj3K1pjkQj4ONqLkMLnJJ1
$$ plain form
5682 10 1 5 1 2 6 -5 -6 -6 5 -8 -2 15 2 9 7 -1 15 4 -3 10 -4 -6 -1 0 1 -2 0 -2 0 -8 7 7 1 -4 -8 2 -2 4 3 11 -3 0 20 7 2 1
5728 1 -1 5 4 -8 4 7 2 -6 -6 1 -3 -1 -2 -10 -10 -1 0 -7 -5 -7 4 5 -5 3 -3 6 4 8 4 -5 -4 8 1 7 4 6 3 1 0 9 9 6 8 13 1 0 9 -1 7 -2 6 11 2 3
5782 3 1 -4 -10 -13 -4 8 5 12 1 6 -6 7 1 3 5 7 -4 5 1 1 -4 2 -2 -2 5 4 9 -5 1 3 2 4 2 8 11 -3 7 5 5 3 2 0 3 -9 0 5 6 8 -3 -1 0
5833 0 7 -4 -3 -3 2 -1 -1 1 1 6 5 -9 -2 12 -6 -1 8 9 9 -1 2 6 6 3 7 2 1 7 12 4 1 2 -1 3 2 -9 -3 4 1 8 -1 -4 3 -3 -3 -1 -14 -9 -7 -8 2 12
5885 12 -1 5 9 -2 2 -7 3 7 1 3 9 9 9 2 13 8 1 1 -2 -10 -1 1 4 4 3 4 2 7 8 -1 4 -1 5 -1 6 3 5 -1 -7 2 -1 3 7 -6 0 5 7 2 3 8 6 8 3 9 9
5940 9 8 12 0 2 8 -8 4 -2 4 -4 2 -6 -2 4 -5 -1 -5 7 12 6 -2 1 -3 4 4 13 1 11 1 1 3 6 8 -1 -4 -4 -4 11 2 -6 -4 0 3 4 3 19 -5 5 13 5
5990 5 -2 5 4 3 -2 12 3 -5 2 3 2 2 0 3 1 7 7 6 11 9 10 16 13 15 7 7 6 14 3 17 4 -4 8 0 6 -2 6 12 5 11 8 7 4 3 2 5 4 8 6 -2 -6 -6 4 -3 -7
6045 -7 -3 -3 1 6 -1 2 -1 3 7 1 7 10 0 4 3 5 18 8 10 15 9 17 8 13 11 16 2 4 13 6 9 17 -8 0 5 -7 6 10 11 0 2 4 -1 -2 11 -1 13 7 5 9
$$ packed form
5682A0rMmJMj1j%J1j3OJ7j3PkqJ6j1pJ3j4kNJJlKkKqJ5%onmJ0mOjQj4LK0j3nj
5728AkOjj2J2Lnq%PmKjq%RJpKkJ1Jj0QoRkMmrJJ2pOlKlkjR%lKNj2jRj0QrQNrJ
5782CknolRJ2lPj1Nj2J3oKKKj1Rm%nOm%PjNj4OKjKkOLj4J0k%kjkLj2RNJKj1KJ
5833@Pj1J%Nl%K%Njj4PJ4j8NRJ%j0LM%lMnjONqlJlMjj1OPlPrlPo%Kj3NKjJ0J0
5885A2j3OMj1MrJ0MoKO%%pJ1np%lqRKL%jJkNJrNnOoPlKooRlMMj3ONKnJNkKnO%
5940IjMj2KOj6J2oOqOqMOrMmJ2NoqLmP%Rj2J0j0%KLKrl%%J5rqKMLJjJ6k4J0Qq
5990EpPjjnJ4rqPJj%kLkO%jNkJOlKq%jQj1J4j3qJ2qOqQOpOljljjLjMkqm%J0pm
6045gM%MNpLlMMoOLj0MjKJ3j0KNoQrNkNj4KRpLQk5QNj2J3MJj1KKnjJ3j2J4okM
$$ plain form
6095 9 7 4 1 19 9 19 8 13 3 5 3 1 10 5 5 4 6 11 12 9 10 5 1 3 1 3 2 0 2 4 -10 0 5 0 2 7 15 6 -2 8 8 12 2 3 2 7 1 5 1 4 7 0
6147 0 1 6 -2 5 4 0 -2 -1 12 9 8 -3 4 0 -11 -9 0 -5 -15 -9 10 6 -1 5 -4 3 -4 1 -1 11 4 -1 2 3 5 6 8 -2 12 -1 11 12 3 4 2 -2 4 4 -2 11
6197 11 4 7 -1 -7 9 8 14 10 7 2 1 -1 -3 4 4 1 10 4 13 -1 12 4 9 5 -2 8 -10 5 13 3 1 5 9 13 7 2 6 -5 -2 1 3 0 1 5 -4 4 -3 2 2 5 10 4
6249 4 0 11 -5 12 5 -10 2 6 -4 9 -5 2 2 10 4 5 13 5 5 3 7 4 9 12 12 10 12 5 8 -2 2 9 4 6 -4 4 9 4 0 -4 7 1 -4 4 1 9 16 1 -2
6298 -2 5 9 19 14 7 10 -1 8 1 14 5 16 10 6 9 11 6 4 8 11 14 4 16 15 8 17 3 7 3 11 4 -5 4 8 13 0 7 -1 -9 -5 6 3 5 0 13 6 1 16 3
6347 3 -2 9 1 -3 6 2 8 14 6 14 8 9 -7 -2 11 2 1 0 0 1 -2 -1 7 -5 -1 14 2 3 2 -4 4 5 -1 -9 -4 4 -11 -2 0 3 6 5 6 6 10 2 14 -3 5 4 13 10
6399 10 5 13 -1 3 3 16 14 6 3 4 -4 -10 -3 -3 4 4 -3 5 2 -14 7 2 4 -12 0 -1 8 -1 2 1 2 1 -5 -1 4 0 -1 3 0 -7 14 6 9 8 13 0 7 9 15 -1 -1
6450 -1 1 7 -2 8 -8 -1 -4 3 3 0 -6 -2 0 -2 0 1 -6 -1 7 2 -3 -2 0 11 12 12 9 5 10 6 1 7 2 2 3 -3 7 -4 0 -3 2 -3 -5 -7 -2 -10 -7 -13 -2 0 -3 -2 -5 1 4
$$ packed form
6095IkllJ8j0J0j1Nj0KkkRn%jKNJlJnmKkKjkKKj4J0NnKNQrqJ0%Mj0JjNoMmLLp
6147@JNqPjmkJJ3ljj1Pmj1KRnj0OJ9mpOrPpNkJ2pnLJKJKj0J4j3J2JrJkmO%oJ3
6197A1pLqoJ6jOmlnjkkP%lRoRj4J3qNmpJ0j8J5Qj0kMMMonMj1LLKlJMrQpN%LNo
6249DmJ1j6J7pj5J2Mj0J3j4P%QoJQq%kMlNL%kKpLj0MPnKj0QNnmmJ1onQlQPj5l
6298bPMJ0npLj1RpJ3rJ1omLKnkMLLj0J2jpRj4MmQprRMNj3PqqMJ1lKnJ3pnJ5j3
6347CnJ1qmRmOOqQoJj6NJ3rjj%JlJQj2MJ5j2JjoQJoqNQj5RKLLjJ%MqJ2j7QjRl
6399A0nQj4M%J3kqlJqoP%P%pQlj6K1nKj6J2jRrLjJjoMNmjMlpK1qLjNj3PKOj6%
6450aKOrJ0j6PlP%loMKkKJpNQnnJKJ1J%lmNmnOn%JoJ0j1MlNnkkNqLoJ1KlJlOL
$$ plain form
6505 4 -1 -3 0 -4 -4 1 -7 10 10 1 4 3 0 8 7 10 6 11 4 8 -3 2 5 10 8 5 12 11 9 -2 6 -8 -9 1 -1 -5 -3 -4 -2 7 2 3 -1 2 -1 -2 0 -5 -7 -7 -5 11 4 10 6
6560 6 16 6 15 8 12 5 11 0 8 4 -1 7 9 6 7 2 10 5 -9 -4 0 4 4 -2 -7 -8 -3 0 -3 5 6 1 13 3 4 7 2 -5 10 1 7 0 2 4 15 -1 -8 1 4 -4 0 1
6612 1 8 -4 3 3 6 -7 4 -3 6 8 -4 0 -11 8 1 -4 -5 -4 -5 -3 -9 5 -2 6 -12 11 15 11 12 -2 6 6 2 8 4 13 7 13 10 4 7 6 14 12 4 -4 -4 6 6 6
6662 6 2 7 9 -3 -6 -8 5 -4 -19 -2 8 -2 -5 -5 1 4 -1 5 -1 3 5 4 6 1 7 11 13 13 18 2 9 2 2 14 8 4 -4 9 -2 -9 -1 0 0 4 9 3 2 -5 -3 3 -3
6713 -3 -2 -6 1 -14 -2 0 1 8 11 10 0 6 1 9 8 9 2 3 -1 0 3 6 9 7 2 0 5 5 -9 -2 -9 3 -3 -6 -3 -2 0 1 -1 0 -8 -10 -5 -3 1 4 3 1 -6 8 12 -3 9
6766 9 6 3 -2 -7 4 0 15 4 9 3 6 22 9 16 4 3 -6 -3 6 3 5 -4 -4 -14 1 0 5 -14 -5 4 -1 0 2 4 4 -8 -1 0 7 -2 5 7 9 6 10 11 2 1 -5 2 3
6817 3 1 1 2 -11 0 3 -6 5 2 5 1 -1 -9 -5 -14 -7 -3 -6 -8 4 2 5 0 6 -8 -5 1 -2 6 5 11 6 -4 1 6 -5 5 16 11 9 4 2 4 4 12 6 9 -2 -1 1 0
6868 0 -2 -2 -5 3 2 -8 -7 2 0 -1 5 -2 2 -4 10 2 -1 4 -1 0 -2 -4 7 9 2 11 6 4 10 9 16 12 7 11 7 5 -1 4 6 11 6 -4 -1 -3 0 -5 -9 -5 -5 5 -2 -5 -9 -3 -9 -3
$$ packed form
6505DnkLm%NqJ7%rLjlQjLmNpMj1NLNklPjkj1Qj4jJ0kmKjKRnJmLljKnk%KJ6pOm
6560FJ0j0RpMpOj1QmnQKlJnQnj4NMM%onjNLlQJnJ2j0JLnpJ5rOpKKJ1j6pRLqMJ
6612APj2P%Lj3J1pRKj2Mj1J9pnjJjKoJ4pQj8K3MmJj4Q%mOmRoOloLjQkqq%J0%%
6662FmNKj2lkJ3rj5J7J0j0l%OLnOoMKjKnOMK%Nj6Pp%J2omqJ3j1pQJ%MNojpKOo
6713cJmPj5J2KJPLjj0OnQjJpJmJLLLknkN%j4PpJ2olLJKJkJqkNKMLjkpJ4Mj5J2
6766IllnnJ1mJ5j1NoLJ6j3Pj2jrLRlKr%j0J5jNj9RRnJKK%j2PJPrPKKlMJrjoPJ
6817Ck%Jj3J1LrJ1lLmkqMrPMlkJ2kLnOj4LOlQjOnj0NNj1J0J1nknkK%QoLj1JKj
6868@k%lQjj0JRkjOpMoJ4qlNnJkkJ1KpRnkOjPmnMmkoNKNnj0LkLnmM%J0plmOoO
$$ plain form
6924 -3 0 4 6 2 8 6 9 1 -3 -5 0 0 -4 4 9 14 10 -1 5 7 14 10 3 1 -4 5 1 9 4 -4 -8 -7 5 -10 0 -12 -8 5 3 1 4 1 5 -5 -10 -2 2 15 3 -6 7
6975 7 4 6 12 9 11 10 11 4 7 11 10 3 -2 -1 1 12 -5 -1 2 -2 8 -2 5 5 3 -5 -9 -8 2 7 -1 -2 -5 4 2 2 -1 -1 -4 4 -6 -2 7 1 8 2 2 5 3 2 11 14 7 8 3
7030 3 -4 -1 4 -7 -13 -18 2 -5 0 -2 -10 -6 -2 -5 -1 -3 -4 3 9 3 -2 6 1 1 -3 3 4 5 2 1 -4 4 -1 4 3 7 9 5 -4 12 5 4 5 8 -1 -3 2 -4 -3 -5 12 5 3 2 -4 -3 8
7087 8 4 4 -2 -7 5 0 9 12 7 8 1 8 8 17 -1 0 -4 -1 1 1 11 5 8 -5 2 -10 2 4 -3 6 4 -5 6 4 3 -13 -9 -3 0 -6 -19 -1 -2 -4 -4 -17 -1 0 -2
7136 -2 -3 -2 6 6 1 12 5 3 -1 2 8 6 -9 -6 -3 -8 2 7 6 -9 0 -1 3 0 -10 -7 -4 -4 -6 -6 4 -2 3 0 5 -2 -14 -5 1 -4 -18 2 1 -13 -5 -3 -8 -4 -18 2
7186 2 1 1 1 -6 2 7 -4 7 -10 0 5 8 7 -2 5 -5 -4 1 -2 -12 -10 -5 -2 -8 -3 -7 5 6 0 -6 10 -4 -5 -5 -1 0 -4 -16 3 5 3 1 10 -2 -1 7 3 12 9
7235 9 2 -7 6 5 5 3 0 1 -3 -2 2 6 6 -13 -7 -1 8 -6 8 -1 -5 3 -4 2 5 -8 2 4 -7 5 1 3 6 0 2 12 6 -1 11 11 4 8 6 2 5 1 8 -6 1 8
7285 8 15 -8 4 5 3 0 -2 -3 -11 -6 -7 -3 2 3 -3 -5 -9 5 -3 4 10 -6 -10 -8 13 10 14 15 11 9 7 6 4 7 4 5 -1 -2 -1 6 2 -3 -4 -2 -3 4 -1 -2 -8 1 -14 -7 -3 -4 -1
$$ packed form
6924cLMKmOkLqmkN%mQNNmj1OKPmpknRmQnqmJJ2j5J0j2MJ3kkLlMj0nQMJ3j2rJ3
6975GlKOlKjJpLMjpnJKJ1j7MLmJ0j0P%kqmJJ0NqjlRk%l%lQj0MRoPo%LkjRLpJn
7030CpLNj1onK0pNkqMMlMkjPOonQn%mOJJljnQnNjMKmrJ6pjJLrkNoJkJ7pkjoJJ1
7087Hm%onJ2nRLnJpP%Rj8JmLK%J0oLj3Pj2J2KpRkrJ1kjj6MOLoj3J8jk%j3J6Jk
7136bjJQ%nJ1pkmLOkj5LLnJ0Njj5RjMlj0LL%k%J0oNlNpj2ROnj4K0jj4QKnMj4K0
7186Bj%%pQNj1J1j7J0NLjrPj0JNlj0KNLoNmJ2JooJ6j4j%MJmj2J9KkkRj2JQmRl
7235IprJ3j%klJmJMM%j9OORj4J4rmQpOLj3J0Kj1J2mKLoKJ0opJ2%pMkmLmPj4PP
7285HPk3J2JklkjqNjMNJokmJ4qPOj6mKK1lMJmkkjkLlJojJPmnjKjPnjoRj5PMjL
$$ plain form
7340 -1 -1 5 3 3 13 13 8 5 0 -4 -5 -3 0 4 -1 10 14 13 5 8 0 8 9 -2 9 8 11 4 -2 -1 -6 0 1 2 -7 -11 -7 -7 -5 2 3 3 8 2 7 4 2 -4 4 -8 4 14 4
7393 4 7 4 7 5 16 7 -6 8 14 7 8 -3 -8 1 2 5 -4 4 3 -1 7 12 -6 -7 5 -12 -11 -2 -1 -1 -9 -4 4 7 -3 -1 1 8 -2 1 9 11 2 9 2 3 10 12 18 15 7 6
7445 6 1 -1 -1 5 2 2 2 9 0 -3 6 7 7 -3 2 6 1 -1 2 -8 -5 -1 -5 4 4 0 0 -4 13 9 9 7 6 9 0 9 3 4 18 7 7 -2 8 16 8 12 1 -1 -5 2 6 -6 2
7498 2 0 5 0 -7 5 0 -1 -2 8 4 -5 10 7 10 1 9 7 13 15 0 8 2 3 5 7 6 7 0 -1 4 14 9 13 11 11 6 2 2 -2 -1 1 2 -2 4 -6 -10 -4 -5 3 4 4 5 -4 5 4
7553 4 9 -5 21 10 4 4 13 7 3 12 11 4 5 2 10 11 5 22 17 16 16 11 11 8 10 1 -1 2 -4 -6 11 -3 2 1 -5 2 2 0 -5 12 9 3 9 7 -3 3 14 15 1 2 14
7604 14 14 4 2 15 11 -1 -2 8 -5 -3 -2 1 2 15 5 11 3 5 0 3 -2 -13 -2 -2 2 -10 -1 -9 -2 -2 -9 0 0 1 -7 3 7 0 0 1 -6 7 4 13 -1 4 15
7651 15 12 2 4 -4 4 3 7 9 0 -4 -5 3 1 -1 10 -3 1 3 0 -1 9 -4 -6 7 2 -2 -4 0 -2 -3 -5 -2 -3 2 -2 -2 8 5 11 13 11 15 13 6 5 12 4 12 9 1 8 -3
7703 -3 -8 5 4 -1 1 -4 -14 -16 -14 -2 0 -3 -9 2 1 4 3 -1 4 6 0 5 10 5 5 13 3 9 3 13 2 3 7 10 12 16 0 7 -11 0 1 12 0 5 15 14 4
$$ packed form
7340a%Ok%J0%nlnmjKLMnJ1MjqLqQJj1J1jLpoJnOJJrmM%KPJ%NoNlkoQj2J2J0j0
7393DLlLkJ1rj3J4OpJj1nRJLrQjmQNj8jJ2j7JRJ%qNQLj0KKPj0LQKrPpJPKOlqj
7445Fnk%Ol%%PrlRJ%j0NMnkLj0LMmR%m%mJ7m%kjLrRoJJ4j1%rJ0QqMj1kmPMj2Q
7498BkNnpJ2njjJ0mrJ5lLrQkOKj5QoJKKjJpjNJ0nMk%nm%mJKJmOj0mOjQJ%JrRj
7553DNj4K6j1o%RomRjpJlQJoJ7nj%n%lKrkLokJ7j4NjoP%knJ7loOkj0OJ1Jj4JJ2
7604A4%j0kJ3mj2jJ0j3KJLJJ3j0OqKnLnj1J1%Mj2RqP%pR%JqJ0Mp%JpJ3lRj4NJ1
7651A5lj0KqQjMKrmjQkkJ1j3MKljJ0j3kJ3nmkMkjkLjNm%J0lOKkMkpjPqQlqPj1
7703cnJ3jnKnj0kKJ2KloJ1jLjmNKoNNn%Qj0OoJ0j1JMLKMj6Pj8J1JJ1j2NJ0jj0
$$ plain form
7750 4 -6 3 4 0 -5 6 -4 -1 -3 -6 -4 3 -1 7 -4 0 6 2 14 6 8 5 11 9 1 0 8 1 18 11 5 8 5 7 0 1 11 -2 -7 11 2 3 -1 3 6 -7 -11 -13 -6 7
7800 7 4 1 -1 6 -3 8 9 -4 5 2 8 5 4 1 1 2 8 7 18 13 4 3 -1 8 5 8 -6 4 -12 -9 4 -2 -13 7 -4 -6 1 -10 -5 -9 -10 -14 -7 4 -10 4 -4
7847 -4 5 -1 -1 3 7 2 9 7 5 10 9 3 14 3 8 18 9 5 9 11 0 -1 9 4 -6 -7 -1 3 5 3 -4 -4 -1 -4 1 -7 -3 -5 2 -3 -3 10 1 4 7 -1 9 4 4 16 10 9
7899 9 6 1 3 5 6 13 4 3 -8 2 9 3 1 -3 -5 1 4 9 -6 -2 -5 -7 -3 3 7 2 0 4 -11 -3 2 9 0 11 7 2 -5 14 12 10 9 -4 7 2 9 3 6 2 2 2 -4 -7 -5
7952 -5 -10 2 -5 -2 -7 -11 -1 -5 -12 -6 -4 -4 -5 -3 -4 4 -4 14 -7 2 9 4 4 -1 3 13 0 -5 2 6 8 -1 11 5 5 5 8 13 4 -3 5 11 11 5 7 7 -8 -9 -5 3 5 1 -8
8005 -8 -7 -5 1 -2 5 -3 -5 3 8 0 6 7 2 11 6 5 18 17 3 4 13 8 6 13 8 -3 7 8 11 -1 4 3 1 8 -2 4 -1 4 -17 -12 -20 1 -2 -13 4 6 -4 -5 0 -7
8055 -7 -7 -9 -6 -10 -4 7 12 12 8 7 11 12 15 13 -11 -2 3 -5 -1 6 3 -7 2 1 3 6 8 8 0 -3 -3 -9 1 -13 -3 1 5 -4 1 -4 -5 5 6 12 8 18 2 8 6 0 6 10
8107 10 14 14 9 5 6 4 -1 7 -2 13 4 2 7 4 -5 -1 1 -3 3 9 -4 -8 0 -3 -1 -8 8 -1 7 -10 5 4 5 -2 11 -4 7 -5 3 0 7 5 5 17 5 3 13 15
$$ packed form
7750Dj0RJmnJ1j0LklKPmQj1MOmJ2qKlOkqjQpJ7poLlKpJJ0j3nJ8rJmMLj3mkPJ3
7800GllkPrJ1Jj3RlOljl%JOjJ1nrjmRlLj4J0j6LJ3oj1K0j1kPj1NmjmPJ1j4J4q
7847dRo%MMnPkkNjoJ1j1NJ0rmMKj1jJ0nj0jOMKkp%LlNqMkPn%J3rLLqJ0n%J2oj
7899IlnKKJPrjj1J0PokmkOLNj5MlkMOMnkMj5QNPrJ1mnpJ9kkjj3J1nPoLm%%olK
7952enJ2pLnmJ0mpOK%jKjQqJ8k1RPn%nMJ0j3nPMKrJ2o%%LNrpQO%oK%j5jMQKmr
8005hJKOlPqkQNqOJnRnjJ3jj4JRnkPnj1J0JLj2NjkPj0OnNk1NqK1lj1J7Kj0jNp
8055g%kLmOJ1N%mjMJLkk4RNqMPlj0RjKLK%ql%oJ0j4J0MMrNnjJ0JOmJ0j6OkoOM
8107A0M%nmJknQrJ5rkNlrMKmOOj3mQlKpJ6rQj7J5jJpJ3j5J1j2QlPk%J2j2kJ0K
$$ plain form
8155 15 8 0 1 15 9 2 8 -3 4 2 -8 -1 -2 4 12 0 -4 6 -13 6 -4 2 11 -1 15 6 10 13 -4 4 13 12 15 18 10 19
$$ packed form
8155A5pqJJ4opOj1Pkj0PjOQj2mJ0j9J9j0ORj2J6rMLj7QRjLLqR
8191A9
$$ Imaginary data points
##PAGE= N=2
##DATA TABLE= (X++(I..I)), XYDATA
$$ plain form
0 0 0 0 0 0 0 0 0 0 0 0 0 0 0 0 0 0 0 0 0 0 8 -8 8 -8 8 -8 12 -16 16 -16 24 -24 25 -32 33 -40 45 -49 56 -64 72
41 72 -77 88 -96 105 -114 129 -140 153 -169 188 -208 229 -252 278 -309 342 -382 427 -479 543 -623
62 -623 722 -850 1025 -1278 1679 -2419 4201 -17690 -3234 42971 5570 -32042 -14667 22896
76 22896 15375 -8071 -15110 -4305 8637 16979 -692 -24487 -10145 28903 19726 -27321 -27727
89 -27727 22863 31414 -14984 -31181 6944 26219 943 -18077 -6492 7035 9218 4364 -8554
102 -8554 -15308 4876 23333 736 -28166 -6982 28912 12409 -26231 -15845 20745 16704 -13527
115 -13527 -14346 6093 9420 568 -2329 -5110 -5368 7495 12754 -7559 -18505 5932 21947 -3411
129 -3411 -22833 616 20971 1308 -17182 -2178 11861 1356 -6309 650 1086 -3625 3121
$$ packed form
0@%%%%%%%%%%%%%%%%%%%%Qj6J6j6J6j6K0k8L2l2M0m8M9n7O5p3Q5r4J05j20J36
41G2j49J65j84K01k19K43k69K93l22L57l96M37m81N30n87O51p24Q09r06J022j166
62f23J345j572J875k303K957m098O620k1891J4456M6205l7401l7612J7375L7563
76B2896p521k3446p039J0805J2942Q342j7671k3795J4342L9048r177m7047m06
89b7727N0590Q551m6398j6197L8125J9275k5276j9020J1585J3527K183m854j2918
102h554o754K0184J8457k2597k8902K1184L5894j6503l8640J0386L6590m041l0231
115a3527q19K0439L327q852k897k781k58J2863N259k0313j0946K4437J6015k5358
129c411j9422K3449K0355j9663j8490J5004J4039j0505p665O959M36m711O746
$$ plain form
142 3121 6809 -6044 -9619 7767 11675 -8252 -12348 8178 11813 -7663 -9898 7379 7211 -7313
156 -7313 -4088 7587 1022 -8048 1562 8278 -3688 -8262 4988 7404 -5977 -5961 6532 3642
170 3642 -7212 -955 8000 -1855 -9026 4375 10194 -6093 -11022 7015 11434 -6790 -10795 5913
184 5913 9140 -4456 -6211 3053 2297 -2147 2234 1932 -6849 -2757 10772 4284 -13646 -6420 14749
199 14749 8379 -14168 -9809 11815 9997 -8206 -8644 4007 5686 156 -1198 -3345 -4099 5251
213 5251 9749 -5369 -14629 3968 18160 -1263 -19550 -2019 18516 5003 -15232 -7058 9999
226 9999 7336 -3868 -5791 -2460 2323 7776 2472 -11521 -7961 13053 13119 -12277 -16970 9654
240 9654 18860 -5660 -18182 1385 15139 2489 -9887 -4941 3390 5677 3562 -4454 -9893 1474
$$ packed form
142C121L688j2853l575J7386L908j9927m096K0526L635j9476k235J7277j68j4524
156g313L225J1675o565r070R610O716j1966m574J3250K416j3381J6J2493k890
170C642j0854O257Q955r855p171J3401N819j6287m929J8037M419j8224m005J6708
184E913L227j3596j755R264p56m444M381l02q781M092J3529o488j7930P226K1169
199A4749o370k2547M359K1624j818j8203m38J2651J679n530j354k147p54R350
213E251M498j5118r260J8597J4192j9423j8287J7531K0535j3513k0235Q174J7057
226I999k663j1204j923L331M783N453n304j3993L560K1014O6k5396m693K6624
240I654R206k4520j2522J9567J3754j2650j2376M946Q331K287k115q016n439J1367
$$ plain form
254 1474 14653 2573 -17326 -7047 17438 10808 -15332 -13296 11299 13704 -6310 -11907 1173
267 1173 8023 3207 -2550 -6011 -3581 7060 9674 -6069 -14480 3659 17587 -257 -18277 -3137
281 -3137 16723 5835 -13186 -7161 8298 6707 -3020 -4634 -2018 1117 5854 3114 -8303 -7500
295 -7500 8981 11129 -8185 -13471 6287 14168 -3811 -13010 1500 10401 347 -6495 -1099 2229
309 2229 931 2147 301 -5747 -2132 8321 4176 -9700 -6010 9723 7097 -8857 -7322 7212
323 7212 6375 -5438 -4589 3704 2067 -2448 740 1659 -3425 -1310 5682 1369 -7176 -1408 7988 1420
339 1420 -7937 -989 7402 226 -6438 921 5368 -2308 -4353 3643 3399 -4824 -2639 5485 1807
354 1807 -5725 -979 5362 -135 -4666 1473 3719 -3033 -2744 4731 2001 -6280 -1490 7580 1394
$$ packed form
254A474J3179j2080j9899J0279K4485o630k6140K036K4595K405k0014n597J3080
267A173O850m816n757l461K430J0641K614j5743q411J8139J3928j7844j8020J5140
281c137J9860j0888j9021O025J5459j591r727j614K616L135M737k740j1417Q03
295g500J6481K148j9314n286J9758P881j7979r199J4510Q901j0054o842N396L328
309B229j298J216j846o048L615J0453m145j3876L690J5733k626j5954J535J4534
323G212q37j1813Q49Q293j637m515L188R19n084K115O992m313q545N768R396o568
339A420r357O948Q391p176o664P359M447p676k045P996k44q223K185Q124l678
354A807p532M746O341n497m531O139K246o752K89P475k730q281M790R070o186
$$ plain form
369 1394 -8180 -1416 8143 1575 -7175 -1484 5508 1005 -3339 8 880 -1684 1384 3697 -3186
384 -3186 -6007 4126 8083 -4301 -9664 3597 10310 -2321 -9768 853 8077 478 -5255 -1173
398 -1173 1858 1168 1940 -116 -5288 -1634 7943 3928 -9408 -6255 9535 8135 -8434 -9190 6237
413 6237 8928 -3556 -7439 727 4609 1564 -969 -3034 -3186 3312 7112 -2447 -10283 713 12244
428 12244 1642 -12583 -3882 11423 5675 -8791 -6353 5307 5821 -1449 -3943 -2141 964 4853
442 4853 2638 -6416 -6387 6567 9508 -5539 -11632 3544 12224 -1179 -11281 -1064 8899 2656
456 2656 -5395 -3197 1461 2716 2554 -1039 -5799 -1253 8100 3971 -9050 -6400 8706 8175 -7268
471 -7268 -8886 5072 8325 -2669 -6601 424 3835 1160 -541 -1952 -2952 1737 5938 -810 -8173
$$ packed form
369A394r574O764R559o568q750N691O992m503m344L347Q72k564L068K313o883
384c186k821J0133L957j2384n363J3261O713j2631p447J0621P224p599n733M082
398a173L031o90P72k056n172L654R577m015j3336L153J5790j400j6569p56J5427
413F237K691j2484l883Q166L882l045k533k065j52O498L800r559p836J0996J1531
428A2244j0602j4225Q701J5305n748j4466K438J1660N14p270k494J802L105L889
442D853k215r054K9J2954K941j5047o093J5176Q680j3403j0102J0217R963o243
456B656q051K198M658J255j62l593m760M546R353m129j3021K650J5106n31j5443
471g268j618J3958L253j0994l932P025L411k675j701j411j000M689M201o748p363
$$ plain form
486 -8173 -585 9359 2148 -9316 -3339 8305 4003 -6416 -3772 4223 2828 -1924 -1120 -15 -1043
501 -1043 1431 3280 -2198 -5236 2318 6616 -2083 -7326 1548 7163 -1102 -6333 811 4917 -892
516 -892 -3220 1333 1457 -1997 211 2849 -1472 -3545 2432 4090 -2954 -4191 3284 3961 -3392 -3271
532 -3271 3465 2312 -3595 -1217 3759 78 -3937 858 3968 -1615 -3911 2044 3499 -2334 -2799
547 -2799 2477 1764 -2597 -431 2842 -908 -3138 2240 3610 -3195 -4034 3820 4427 -3911 -4471 3593
563 3593 4114 -2915 -3243 2074 1847 -1293 -50 684 -2046 -526 3967 696 -5632 -1310 6688 2093
579 2093 -7022 -2855 6551 3379 -5309 -3366 3592 2793 -1560 -1472 -347 -403 1922 2655 -2805 -4842 2961
596 2961 6755 -2436 -8022 1347 8302 -66 -7659 -1192 5998 1978 -3704 -2163 983 1548 1730 -185
$$ packed form
486h173P588R944p211j1464N977J1644m302j0419K644P995j395m752Q04J105j028
501a043K474J849n478l038P554M298q699n243Q874N615q265n231P144M106n809
516h92k328M553J24l454K208K638m321k073N977J658p044j237P475O77p353J21
532c271O736j153n907K378M976l681m015M795L110n583k296N955J455n833m65
547b799N276p13m361K166L273l750k230N378J370o805q39P854O07q338n60Q064
563C593N21p029l28N317k27l140J243P34k730J520M493l271o328M322P998m595
579B093r115M167R406l172q688J943O958p99m353Q8J125n6K325P33n460k037P803
596B961L794r191n586R369O955q368p593O467P190m020n682J541L146N65J82j915
$$ plain form
612 -185 -3962 -1619 5506 3704 -6088 -5516 5805 6887 -4664 -7336 3052 6848 -1244 -5379 -359
627 -359 3127 1448 -370 -1867 -2570 1443 5065 -442 -6990 -1067 7923 2606 -7865 -3954 6838
642 6838 4688 -5048 -4637 2879 3771 -643 -2099 -1197 -112 2490 2590 -2950 -4816 2715 6551 -1892
658 -1892 -7511 719 7504 423 -6674 -1346 5018 1688 -3029 -1522 768 669 1272 624 -2866 -2130
674 -2130 3839 3577 -4142 -4705 3938 5367 -3229 -5287 2389 4627 -1496 -3372 843 1739 -486 69
690 69 491 -1793 -837 3169 1307 -4128 -1850 4505 2195 -4484 -2332 4023 2052 -3396 -1453 2645
706 2645 565 -1941 511 1417 -1555 -989 2507 768 -3140 -547 3495 355 -3510 -31 3257 -429
722 -429 -2880 1008 2355 -1689 -1922 2290 1469 -2838 -1144 3120 799 -3176 -463 2910 40 -2409
$$ packed form
612a85l777K343P125j802r792N72J1321J082j1551k672J0388L796q092m135N020
627c59L486j679j818j497p03M013L622n507o548N923Q990n317j0471L911J0792
642F838k150r736M11P516Q92m414j456R02J085K602J00n540j866P531L836q443
658a892n619Q230O785p081p097N328O364l330m717J507K290r9O03o48l490P36
674b130N969k62p719n63Q643J429q596k058P676K238o123j876M215Q96k225N55
690F9M22k284R56M006j862n435K278O355k310o679K152O355j971n448J943M098
706B645k080k506K452R06k972N66L496j739l908K593M042l140l865L479L288l686
722d29k451L888J347m044k33M212q21m307J694M264k321l975K713L373k870k449
$$ plain form
738 -2409 536 1764 -1231 -1044 2066 418 -2900 61 3661 -297 -4180 350 4363 -241 -4166
753 -4166 52 3523 22 -2524 60 1197 -460 140 1082 -1414 -1967 2347 2892 -2884 -3723 2957
769 2957 4329 -2572 -4485 1934 4153 -1104 -3259 360 1902 180 -215 -340 -1558 86 3152 506
785 506 -4371 -1383 5009 2243 -5086 -3039 4480 3386 -3433 -3291 2044 2614 -617 -1379 -651 -249 1517
802 1517 2073 -1833 -3728 1670 5074 -1014 -5800 139 5869 786 -5206 -1494 3941 1805 -2313
817 -2313 -1659 469 922 1195 220 -2535 -1651 3270 2994 -3464 -4174 3082 4867 -2317 -4979 1349 4450
834 4450 -380 -3344 -349 1814 746 -33 -646 -1679 174 3133 617 -4083 -1527 4486 2349 -4355
850 -4355 -2929 3684 3058 -2763 -2770 1646 1933 -626 -770 -186 -643 658 2004 -753 -3174 571 3977
$$ packed form
738b409K945J228k995J87L110j648l318K961L600l958l883M530M013m604l925
753d166M218L471l501k546K584J137j657O00R42k496n53M314N45n776q39O680
769B957J372o901j913O419K219n257k155L619J542j722l95j25j218J644L066k646
785E06m877K988O392k766p329K047P519j094o819J42N335N70l231p62P28M02J766
802A517N56l906j895N398L404o088m786N939N730n083n992L712N435k136m118
817b313O54K128M53K73r75k755Q84M921k76o458p10P256J785p184k662O328L101
834D450m830k964K995K163j068p79o13j033J853K959k516m700K556O013k137o704
850d355J426O613o26n821pM416K87k559j44N84m57J301J346k757k421L745L406
$$ plain form
867 3977 -159 -4290 -261 4162 615 -3596 -725 2743 569 -1705 -140 688 -543 170 1273 -860
883 -860 -2062 1216 2620 -1403 -2976 1367 2992 -1266 -2734 1157 2205 -1125 -1487 1209 724 -1341
899 -1341 75 1566 -692 -1749 1209 1868 -1536 -1822 1711 1606 -1806 -1240 1825 686 -1870 -113
915 -113 1885 -520 -1976 1000 1995 -1388 -1971 1574 1823 -1604 -1484 1518 995 -1359 -314 1248 -422
932 -422 -1169 1215 1216 -1903 -1326 2397 1487 -2646 -1624 2591 1634 -2296 -1482 1764 1058 -1164 -444 501
950 501 -436 -27 1377 -303 -2312 363 3090 -197 -3567 -98 3706 462 -3392 -740 2741 848
966 848 -1773 -675 663 215 427 514 -1332 -1426 1903 2304 -2152 -3096 1985 3531 -1577 -3658 943
983 943 3285 -332 -2505 -188 1402 436 -88 -379 -1193 16 2305 611 -3055 -1327 3412 2020
$$ packed form
867C977m136m131M029M423l547m211K871L468k174k274J565Q28j231P13J103k133
883h60j202L278J404m023j573M343J625m258j468L891J048l330l62K696m85k065
899a341J416J491k258j057K958O59l404k86L533j05l412N66L065j139k556J757
915a13J998k405j456K976R95l383n83L545K49l427J20L002n23k354J045J562j670
932d22p47K384Jl119N77L723r10m133J022M215r57l930Q14L246p06k222P20R45
950E01r37M09J404j680k009K675K727l287l370L469L804l244l854K652L481j893
966H48k621J098J338m48K12Q7j846r4L329M01m456r44N081J546n108k081M601
983I43K342l617k173K317J590r66n24k91q14J209K289j694l666J728M739j392
$$ plain form
999 2020 -3295 -2519 2809 2713 -2037 -2508 1109 1861 -247 -922 -464 -314 844 1521 -915 -2666 652
1016 652 3456 -169 -3836 -380 3791 896 -3278 -1179 2454 1209 -1385 -885 320 253 642 584 -1338
1033 -1338 -1496 1698 2314 -1753 -2947 1490 3191 -1108 -3129 618 2636 -237 -1909 -12 951 18
1049 18 57 195 -969 -553 1701 1024 -2138 -1447 2331 1784 -2208 -1891 1912 1756 -1498 -1379 1074 781
1067 781 -726 -84 462 -703 -389 1353 362 -1884 -451 2163 496 -2237 -510 2113 414 -1816
1083 -1816 -164 1481 -173 -1073 611 761 -1018 -462 1391 254 -1648 -88 1759 -60 -1713 227
1099 227 1509 -461 -1240 704 898 -1048 -596 1348 307 -1631 -118 1793 -17 -1840 106 1727
1115 1727 -190 -1410 320 1015 -497 -496 784 16 -1120 429 1481 -745 -1810 897 2018 -921
$$ packed form
999B020n315P76N328r6m750m71L617P52k108o75M58J50J158O77k436j751L318
1016F52K804l625l667L456M171k895m174K099L633j245k594N00J205o7L89n8j922
1033a338j58L194O16m067j194M437J701m299k021L747K018k873j672J897R63r33
1049A8L9J38j164M16K254o77l162O91L778n47l992L17L803j56l254J19K453k93
1067G81j507O42N46j165L14J742r91k246J433K614j667k733J727K623j699k230
1083a816J652J645j654r00J684J50j779N56J853j137j902J560J847j819j653J940
1099B27J282j970p79J944J94j946M52J944j041j938J513J911j810j823J946J621
1115A727j917j220J730O95j512JJ280p68j136J549J052k226j065K707J121k939
$$ plain form
1131 -921 -2096 779 1932 -620 -1562 430 975 -346 -289 347 -456 -515 1164 798 -1677 -1131 2007 1487
1149 1487 -2030 -1706 1862 1777 -1460 -1596 971 1195 -450 -574 16 -232 227 1041 -321 -1835 149
1166 149 2394 120 -2723 -509 2699 818 -2405 -1028 1832 1015 -1091 -769 314 287 427 387 -940
1183 -940 -1133 1237 1854 -1237 -2397 1046 2679 -691 -2663 264 2300 83 -1696 -314 858 303
1199 303 15 -120 -857 -280 1519 765 -1928 -1281 2081 1707 -1932 -1943 1568 1948 -1078 -1648 595 1142
1217 1142 -142 -422 -128 -369 234 1127 -155 -1761 -86 2155 374 -2316 -676 2189 848 -1855
1233 -1855 -879 1355 694 -791 -333 261 -149 173 730 -435 -1241 579 1675 -540 -1902 463 1956
1250 1956 -318 -1791 215 1428 -196 -992 256 468 -439 11 657 -440 -919 717 1111 -891 -1248
$$ packed form
1131i21j175K875J153k552r42J992N45j321N7O36q03n9J679l66k475N46L138n20
1149A487l517L24L568q5l237j36K567K24j645j24N90k48M59Q14j362j514J984
1166A49K245k274k843K214L208j881l223J377K860q17k106L22J083k7J40m0j327
1183i40j93K370O17l091j160L443J633l370j972K927K036k217j779J382J172n55
1199C03k88j35p37N77J799p54k693O47L362l74l639j1L511L80l026n70K243N47
1217A142j284k80K94k41O03Q93j282j606J675K241j781k690J640K865j341k703
1233a855R76K234o61j485M58N94m10L22N57j165q06J820J096k215j362K365J493
1250A956k274j473K006J213j624p96J248K12r07M50O46j097m79J636L94k002l57
$$ plain form
1267 -1248 958 1242 -935 -1126 888 881 -803 -536 791 171 -769 230 825 -554 -855 799 862 -952
1285 -952 -831 996 707 -983 -495 909 184 -854 140 789 -492 -779 811 777 -1039 -775 1159 762
1303 762 -1153 -657 1050 497 -850 -219 662 -128 -443 548 295 -946 -225 1300 225 -1548 -285
1320 -285 1635 344 -1565 -398 1326 361 -980 -249 530 -8 -103 369 -270 -773 545 1205 -649 -1542
1338 -1542 635 1775 -470 -1784 289 1631 -66 -1252 -63 741 89 -143 14 -450 -278 943
1354 943 591 -1315 -956 1443 1266 -1403 -1475 1196 1513 -852 -1322 490 965 -139 -415 -116 -194 221
1372 221 835 -158 -1356 -7 1735 279 -1904 -572 1844 777 -1581 -885 1140 791 -648 -557 134
1389 134 122 271 376 -559 -893 672 1374 -607 -1685 450 1832 -193 -1750 -29 1462 182 -1017
$$ packed form
1267a248K206K84k177j91K014pj684K67J327o20r40R99N95j379l01J654O3j814
1285i52J21J827k89j690M88J404p25j038R94O49j281k87J590l4j816K64J934l97
1303G62j915M96J707n53j347O31Q81p90l15R91k53j241P21J525j075j773J263
1320b85J920j291j909J167J724r65j341P31P79n38r5M72o39n03J318O60j854q93
1338a542K177J140k245j314K073J342j697j186J189Q04o52k32J57m64J72J221
1354I43l52j906L59K399j77k669p2K671L17k365m70J812M75j104k76K99p8M15
1372B21O14r93j198J349J742j456k183J332K416j067k358O96K025l49j439R1O91
1389A34j2J49J05r35l34J565P02j981j078K135J382k025j557J721J491j280j199
$$ plain form
1406 -1017 -217 489 111 47 109 -534 -421 874 748 -1090 -1087 1084 1260 -1005 -1336 795 1223 -568 -967
1425 -967 354 581 -191 -112 147 -343 -164 777 278 -1066 -413 1244 552 -1261 -627 1158 602 -973
1443 -973 -485 712 246 -496 21 289 -370 -166 672 75 -924 -61 1076 64 -1112 -50 1047 8
1461 8 -893 88 697 -215 -456 410 256 -614 -93 782 -43 -923 113 951 -181 -910 207 766 -285
1480 -285 -577 360 339 -500 -99 641 -110 -792 278 919 -359 -977 395 961 -354 -837 334 637 -286
1499 -286 -343 303 27 -375 295 479 -571 -630 748 756 -837 -887 790 902 -696 -832 512 626 -334 -331
1519 -331 181 -31 -78 432 82 -780 -133 1080 272 -1234 -403 1265 536 -1148 -586 892 538 -579
1537 -579 -385 224 111 56 236 -293 -634 411 981 -411 -1258 310 1392 -123 -1373 -42 1193 199
$$ packed form
1406a017Q00P06l78o4O2o43J13J295j26j838LK171J76k265l31K131M28j791l99
1425i67J321K27p72P9K59m90J79R41m99j344O53J657o92j813O34J785n56j575
1443i73M88J197m66p42N17K68o59K04Q38n97r99Q63J137j012j176J062J097j039
1461Hr01R81O09r12k41Q66j54q70N21Q75q25q80J036Q38j132p29J117N59j051
1480b85k92R37k1q39M01P40p51o82J070O41j278o18J372N66j315m83J171L03r23
1499b86n7O46k76m02O70J84j050n9J378Qj593n0J677J12j598j36J344J14r60L
1519c31N12k12m7N10l50q62O47J213q08j506Q31J668p29j684N62J478l54j117
1537e79J94O09j13n5J80n29l41J045N70j392q47J568J082j515j250J331J235r94
$$ plain form
1555 199 -870 -241 464 193 -22 -20 -357 -237 684 530 -854 -837 895 1052 -813 -1173 600 1129 -388
1574 -388 -960 142 631 5 -244 -91 -204 58 614 50 -934 -231 1150 434 -1190 -597 1115 682 -891
1593 -891 -660 634 533 -326 -285 62 -47 106 381 -222 -740 210 972 -144 -1138 16 1150 87 -1034
1612 -1034 -156 818 165 -539 -84 247 -50 34 267 -246 -480 386 686 -448 -821 447 858 -388 -819
1631 -819 293 682 -258 -475 206 209 -252 11 298 -265 -385 432 466 -557 -526 590 535 -574 -471 517
1651 517 364 -435 -191 389 -3 -342 221 329 -401 -351 532 358 -611 -373 603 316 -567 -239 449 102
1671 102 -371 60 276 -267 -217 446 194 -615 -184 713 209 -733 -216 694 206 -566 -148 388 22 -223
1691 -223 128 56 -344 60 526 -163 -726 162 814 -148 -869 74 796 -13 -666 -36 432 32 -164 54
$$ packed form
1555A99j069O29P05k71k15Kl37J20R21j54j384J7J732J57j865l60J773N29j517
1574c88n72J102M89o26k49J53j13K62N56n64r84P03J381p16j624N93J712m33j573
1593h91K31J294j01q59M1L47j09J53K75o03n18R50P62j116r94J154J134j063j121
1612a034Q78R74o53p04M55L31k97Q4K33n13k34Q66L00j134l73J268M11j246m31
1631h19J112L89r40k17O81Lm61K63K87n63j20Q17L4j023L1J116n5j109J03R88
1651E17j53p99K44N80l92l39N63J08p30N0Q83j74r69K38R76k87q83L28O88l47
1671A02m73M31K16n43N0O63k52q09M31Q97n04r42N17R10m88p72M18N36l66k45
1691b23L51p2m00M04M66o89n63Q88O52r62p21R43P22q09o53O30M68m00j96K18
$$ plain form
1711 54 -86 -182 327 360 -488 -529 573 704 -559 -796 470 807 -332 -704 181 517 -59 -266 -37 -47
1731 -47 17 345 27 -613 -167 794 307 -864 -443 842 547 -709 -556 512 510 -258 -325 64 97 116 204
1752 204 -194 -487 228 729 -176 -894 53 954 63 -914 -188 749 237 -512 -223 233 129 50 49 -250 -244 416
1774 416 482 -466 -655 475 775 -362 -804 243 734 -107 -566 16 342 21 -96 -5 -200 -83 393 190
1794 190 -550 -330 626 435 -626 -506 533 494 -418 -421 282 281 -157 -76 76 -122 -22 343 42 -501 -76
1815 -76 617 124 -649 -152 608 161 -516 -148 381 60 -251 38 108 -197 -21 333 -45 -456 69 533 -71
1836 -71 -548 54 526 -57 -425 74 298 -114 -180 186 39 -285 66 360 -154 -450 172 471 -194 -479 177
1857 177 407 -167 -312 148 162 -176 -15 208 -135 -261 255 339 -330 -399 361 428 -340 -415 282 348 -217 -236
$$ packed form
1711E4j40r6N09L3q48m1J102J31j263k37J266L37j139l72Q85L36n76k07K29j0
1731d7O4L28l18o40M46R61m87j171M21J285k95j256J53J068kp68o7L89L3J9Q8
1752B04l98k93P15N01r05p18R47R01q91r77P26R37n12p49K89M56j04p9jk99OO60
1774D16O6r48j89J130L00j137m42J047M91q41m59N82L26l21j17R1j95J17M76k03
1794A90p40K20R56j91j061J20J039l9r12lP03jm38Q1J52j98J00L65l01n43M25
1815g6O93m93p73M97P60m47o77L68N29l21l11K89P0l05J76L54l78m11N25M64o04
1836g1m77O02M72n83l68M99K24m12o6L66j47l24L51K94n14k96O22K99o65k85O56
1857A77K30n74j45M60J4l38J61K23l43j26N16Q4o69o9P60O7p68p5O97O6n65j9
$$ plain form
1879 -236 140 82 -102 84 89 -289 -127 411 165 -525 -247 537 290 -523 -326 424 292 -294 -234 153 110 -27
1901 -27 71 -63 -254 103 434 -111 -565 57 637 11 -649 -97 559 140 -441 -163 247 105 -57 -23 -132
1922 -132 -136 252 290 -347 -445 354 560 -314 -601 220 596 -105 -494 19 347 58 -136 -53 -88 11 291 77
1944 77 -436 -184 508 296 -533 -403 479 437 -384 -432 241 342 -104 -187 -6 14 71 187 -84 -373 52 506
1966 506 11 -574 -91 585 163 -526 -213 397 199 -248 -136 86 30 43 104 -147 -270 178 387 -197 -479
1987 -479 156 516 -92 -476 53 404 -11 -273 10 139 -21 11 98 -144 -168 233 252 -279 -318 286 347 -262
2009 -262 -354 214 302 -157 -216 120 98 -105 37 105 -157 -127 250 154 -310 -199 334 217 -309 -200 268 159
2031 159 -199 -81 140 -20 -101 115 72 -236 -87 303 87 -358 -102 362 105 -327 -111 256 64 -169 8
$$ packed form
1879b36L76n8j84J86Nl78J62N38k46o90K78P84k47q13J97P50j32n86O0L87m3j37
1901b7R8j34j91L57L31n45m54O22N80o26o60N52O56m19n81K78M10j42j62L4j09
1922a32mL88L8o37r8P99K06q74k87Q21L76p01l89N13L28k89j94Q3l5R9K80k14
1944G7n13K52O92k12q29J30Q82m2q21m8O73J01m46q3J81K0N7J16k71k89M25M54
1966E06m95n85M83O76m22o89L13O10j98m47J12K22n6J3O1k51j23M48K09n84k82
1987d79O35L60o08l84N29L51m15k62K83J29j60L2Q7k42k4M01J9n31l9O04O1o09
2009b62r2N68Q8m59n9L36k2k03J42O8k62L0L77r6m64J11N33j17n26J09M68j09
2031A59l58J18K21j60q1K16m3l08J49L90k16m45K56M64k57m32K16L67j92k33J77
$$ plain form
2052 8 102 -83 -16 195 -36 -278 62 358 -43 -394 27 393 -3 -359 -31 265 17 -153 2 37 -69 69
2074 69 147 -163 -246 189 303 -231 -372 188 391 -140 -365 69 281 -24 -176 -1 30 -5 115 41 -241 -110
2096 -110 325 185 -371 -253 360 300 -305 -307 209 259 -120 -193 30 56 28 78 -69 -223 50 343 -19 -412 -41
2119 -41 451 109 -423 -147 347 188 -240 -158 109 95 11 5 -117 -133 171 241 -187 -354 149 399 -113 -419 36
2142 36 371 11 -291 -52 179 59 -43 -18 -93 -43 195 121 -257 -191 293 280 -258 -318 210 308 -161 -268 77
2165 77 171 -30 -74 -8 -65 -2 163 16 -257 -64 309 114 -326 -147 299 177 -241 -160 158 117 -99 -28 32
2188 32 -41 7 137 -37 -231 19 277 -14 -316 -18 297 41 -252 -45 181 10 -100 21 27 -69 42 147
2210 147 -80 -201 103 252 -92 -256 74 250 -57 -212 43 148 -52 -73 52 -19 -93 73 124 -143 -172 162
$$ packed form
2052HR4j85O7K11k31k42L40K96m01l51M21L66l96l56L28K96k48j70J55L5j06J38
2074F9P8l10q3M35J14n34j41N60K03n31k25M34K12l05j52J75L1l5J20p4k82J31
2096a10M35j40n56J18O13o0o05kN16N0l79p3K23K6k8N0j47j54K73K93l62l93L71
2119d1M92l42n32K76M94j59m28Q2K67j4q4oj22j6L04P0m28j67N03K50n12l06M55
2142C6L35l60l02K39K31j20j02K5p5N0K38p4l78O6M84j3n38o0N28R8m69j07L45
2165G7R4k01m4O6n7O3J65j47k73J93L73j95m40J79M46j22m18Q1L18m1k16P1O0
2188C2p3M8J30j74j94K50K58k91l02K98L15k56k93K07K26j71j10J21Or6J11J05
2210A47k27j21L04J49l44j64L30J76l07j55K55J05k00k1J25p1p4J66N1k67k9L34
$$ plain form
2232 162 208 -173 -233 137 207 -120 -174 81 92 -47 -11 42 -64 -46 150 83 -205 -103 239 146 -234 -162 212 166
2256 166 -164 -140 93 81 -30 -6 5 -87 26 168 -15 -243 -4 279 23 -300 -61 277 95 -208 -85 142
2278 142 69 -55 -8 -28 -39 94 127 -126 -207 122 266 -106 -288 65 289 -20 -248 -20 175 38 -85 -39
2300 -39 -11 20 114 49 -182 -110 223 175 -220 -210 196 243 -147 -233 83 186 -23 -108 -23 11 47 77 -37 -173 9
2325 9 232 42 -279 -94 266 127 -237 -145 181 138 -105 -88 45 47 36 57 -73 -117 76 200 -68 -249 41
2348 41 264 -9 -253 -32 210 39 -144 -50 59 28 7 14 -73 -76 118 131 -127 -174 123 213 -100 -210 76 191
2372 191 -28 -133 22 75 4 1 20 -69 -40 128 74 -169 -101 179 120 -170 -140 136 131 -84 -83 60 42 -19 28 15
2398 15 -71 -14 137 24 -166 -25 188 72 -163 -73 147 75 -111 -45 71 20 -13 32 -20 -102 31 148 -32 -182
$$ packed form
2232A62M6l81o0L70P0l27n4K55J1j39L6N3j06J8J96o7k88J02L42r3l80P2L74m6
2256A66l30K4K33j2j11K4J1r2J13J42j83k28K39K83k56l23K39L38j82l03J23K27
2278A42p3j24M7k0j1J33L3k53q1L29J44l72j82L53K24l09k28K28J95j37j23M6
2300c9K8L1R4o5k31P2L33m8l95J0M06M7l90q6L16J03k09q5Q5L4L6L0j14j36J82
2325IK23j90l21J85L60j39l64R2L26m3k43J7J33Kj1K1j30m4J93J24k68j81K90
2348D1K23k73k44K21K42j71j83R4J09l1k1Pq7lJ94J3k58m7K97R0l13j10K86J15
2372A91k19j05J55N3p1lJ9q9K9J68n4k43O8K80n9k90L0K76nk15JJ43j8o1M7j3
2398A5q6N7J51j13j90J41K13j16k35R0K20p2j86O6J16n1l3M5n2q2J33J17j80j50
$$ plain form
2422 -182 10 186 3 -187 -20 159 25 -106 -17 50 4 13 46 -48 -78 91 119 -95 -155 90 178 -67 -175 45
2446 45 153 -16 -99 -5 32 -3 22 5 -83 -40 126 68 -156 -110 158 153 -127 -138 101 149 -49 -106 29 55 16 8 -27
2473 -27 -83 34 139 16 -178 -31 197 59 -191 -95 151 95 -112 -86 58 61 0 -4 -33 -43 71 118 -77 -149 82
2498 82 191 -34 -191 9 179 25 -144 -37 87 57 -36 -32 -44 -14 80 53 -119 -110 121 146 -114 -151 89 167 -44
2523 -44 -141 14 105 13 -40 -24 -19 13 72 6 -121 -28 147 66 -161 -96 134 112 -113 -111 57 90 -32 -47 -2 -6 22 56
2551 56 -25 -106 21 144 6 -155 -22 158 39 -129 -50 91 50 -44 -25 9 -7 28 47 -44 -92 56 122 -45 -129
2576 -129 20 135 0 -124 3 92 13 -52 -11 1 -7 49 33 -63 -61 91 95 -76 -110 75 114 -44 -103 36 82 -19
2602 -19 -47 2 -14 4 46 17 -89 -32 102 59 -111 -73 109 89 -74 -75 58 56 -18 -25 -2 -10 27 57 -14 -85 13 123 10
$$ packed form
2422a82J92J76j83j90J67J79j34j31Q9O7m6RL3r4l0J69K8k14o0K45Q8k45j08K20
2446D5J08j69q3R4L7l5K5j7q8M3J66n8k24M6K68nk80j1K39M8j98n7J35K6l9ql5
2473b7n6J17J05j23j94J47K28j38k50R6K46n6k07K6J44Lo1mk9j0J14M7j95p2K31
2498H2J09k25j57K00J70j54j69J07J24l0r3Mj2L0R4k7j72RK31K5k60l7K40P8k11
2523d4r7J55R1r2n3J6NL2N9o6j27R3J75q1k27O5K30k2k25KJ68L3j22j5M5mK8L4
2551E6q1q1J27J23j38j61J33J80j19j68P9J41m1r4J9L4j6L5J9r1m8J48O6j67q4
2576a29J49J15j35j24J27Q9p9o5M1J2qN6j6r6KJ52Mj71l4J85L9j58n9J39M6j01
2602a9k8M9j6J8M2k9j06N7J34m3j70L8J82k0j63jJ33kp4pK3qL7L0p1p1R8J10j13
$$ plain form
2631 10 -121 -30 120 54 -104 -47 78 63 -33 -31 2 -1 42 47 -49 -78 56 103 -44 -119 34 134 -10 -121 -22 90
2657 90 40 -57 -18 12 20 33 1 -73 -27 94 74 -90 -105 76 117 -58 -106 26 96 -4 -66 -28 18 27 30 -14 -76 3 103
2686 103 24 -115 -61 112 76 -93 -70 77 75 -27 -61 -6 24 10 -1 -36 -56 36 89 -24 -117 8 125 29 -105 -32
2712 -32 107 48 -46 -43 26 35 15 4 -37 -24 55 61 -50 -83 39 105 -25 -100 8 93 19 -60 -11 46 27 8 -14 -35 3
2741 3 67 28 -67 -52 80 77 -66 -73 47 83 -13 -62 18 40 7 -6 -14 -30 7 65 -1 -71 -29 94 44 -74 -45 74 48
2770 48 -46 -35 22 30 8 -5 -4 -12 32 75 -18 -73 13 94 13 -81 -15 86 36 -50 -29 30 12 2 -1 -14 -18 41 36 -38 -72 46
2802 46 84 -25 -78 20 95 8 -43 -13 36 27 -2 -2 -15 5 49 20 -47 -32 71 55 -46 -63 42 73 -32 -61 -1 54 31
2831 31 -2 -16 -24 20 52 -1 -60 -7 83 38 -89 -47 72 57 -34 -36 22 39 20 -18 -17 -16 30 43 -30 -57 21 84 -7 -91 -9
$$ packed form
2631A0j31R1J50o6j58N7J25j5r6KL3lM3Nr6k9J34M7j47p5J53J00j44j11R9J12
2657I0n0r7L9L0QJ3l2p4M6J21k0j64j5J81M1j75m8J32P0j00o2L8M6RLm4o2P9J00
2686A03p9j39N4J73l6j69K3J47kj02l4N5L0j4j1l5k0R2N3j13r3J25J17r6j34P3
2712c2J39n9r4LO9Rk0j1m1J3P9Oj11l3J22O6j30p5J08Q5p4p9M9N7j9j9k2k1L8
2741CO4l9r5J5J32lj43pJ20L6r6m9Q0K2l3j3qj6L7N8o6p0M2J23n0j18K9J19k6
2770D8r4J1N7Qk2j3JqM4M3r3n5Q6Q1q1r4O6J01n0q6K1N9j8j0lj3mN9np4l4J18
2802D6L8j09n3R8P5q7n1L0M9rk9%j3K0M4k9o7J5J03j6j01j7J05L1j05k9O0N5k3
2831C1l3j4qM4L2n3n9N3R0m5j27M2J19j5r1kN8J7j9l8JJM6J3p3k7P8O3r1q4Q2
$$ plain form
2862 -9 75 28 -54 -28 47 38 6 -16 -8 13 31 35 -45 -41 51 69 -27 -63 23 82 -6 -67 0 47 21 -21 -23 -16 17 34 -8 -52 -23 64
2896 64 36 -60 -49 62 63 -36 -46 19 45 -5 -20 -14 4 36 24 -18 -50 7 66 16 -61 -14 67 35 -51 -44 37 52 -7 -22 -4
2927 -4 14 20 20 -27 -32 28 61 -12 -65 13 62 15 -52 -20 47 22 -14 -25 0 13 23 0 -38 -25 42 39 -40 -48 28 57 -18 -57 9
2960 9 36 4 -20 -13 16 21 26 -11 -27 0 47 22 -47 -33 45 41 -28 -43 8 32 -7 -22 -11 9 22 2 -18 -38 19 56 -8 -50 -5
2993 -5 63 34 -43 -22 40 40 -3 -18 10 29 23 13 -34 -20 23 30 -18 -39 1 68 0 -46 -4 45 23 -27 -10 3 30 11 -15 -25
3025 -25 -5 38 30 -40 -38 39 56 -12 -56 12 49 -2 -34 -9 17 21 8 -19 -29 4 43 5 -53 -22 49 30 -44 -36 30 44 -6 -32
3057 -32 -2 13 17 -14 -23 -12 19 36 -13 -46 4 40 10 -49 -15 39 26 -16 -38 10 25 8 -1 -23 -4 25 15 -25 -37 28 48 -19
3089 -19 -46 4 41 10 -29 -9 5 12 -1 -10 -14 2 27 6 -38 -29 35 32 -27 -34 19 35 -6 -28 -13 25 4 -3 -7 -10 11 24 -4 -26 -3
$$ packed form
2862iQ4m7q2K6P5rl2k2QK1J8Mq0MR2J8r6l6Q6N9q8o1O7M7k6m2kPL3J7m2m4K9Q7
2896F4k8r6J1J11Jr9j0O5K6n0j5OJ8L2j2m2l2N7N9n0p7M7Q1l2q6PQ1J5n9j5J8
2927dJ8O%m7nO0L3p3n3P8M9m7o7L2O7k5l6j1K5J3J0k3l8J3O7lp9qP6K9p5l9O6
2960IK7l2k4PK9NNl7j6K7M7k5o9J4P8mo9j5N1K4l9j5J1K0J3k0k0k0N7L7o4m2M5
2993eO8k9p7K1O2%m3j5K8J9oj0m7J4M3Pm8k1M0O7o8m6M2M9k2n0J7J3K7j9k6j0
3025b5K0M3qp0KP7J7o8m4O8L7n1l2K5K6Mj3k7j0L3L9l8n8L1P1j9p4QO6J4n0k6
3057c2L0J5Ml1rJ1L1J7m9l3N0L6l0n9L4N4j3m2k2M8J5j7rk2J9K9j0m0j2O5K0o7
3089a9k7N0L7l1l9K0J4Pj3rmJ6K5k1m4RO4ln9pN3J6m1k2J5L8k1pmlK1J3k8k2K3
$$ plain form
3124 -3 40 23 -33 -19 36 34 -16 -30 2 18 18 -3 -17 -8 17 16 -17 -21 10 25 6 -41 -11 31 12 -22 -9 14 19 6 -17 -11 2 34
3158 34 22 -32 -24 17 37 -7 -40 7 33 10 -25 -3 19 13 -12 -8 -8 12 26 3 -30 -23 39 25 -27 -37 37 34 -5 -28 6 31 15
3191 15 -10 -20 -2 14 20 -11 -28 11 31 19 -25 -24 22 30 -24 -30 14 22 2 -9 -2 6 33 17 -17 -25 17 39 -8 -25 7 42 6 -17
3225 -17 -14 27 31 -7 -23 -3 14 6 -2 -32 -16 28 22 -25 -21 12 25 -2 -12 -6 21 15 -5 -17 4 16 15 -2 -18 -4 21 20 -33 -23 25
3260 25 17 -14 -31 1 10 -2 -20 -26 7 7 9 -6 -19 11 19 -9 -26 -4 29 10 -23 -21 13 15 -3 -15 -8 -1 21 2 -24 -16 10 11 -20 -36
3296 -36 -3 26 1 -15 -8 13 14 -10 -15 1 11 8 -14 -19 -3 20 8 -19 -19 16 29 -8 -26 -2 20 5 -19 -18 -1 9 -2 -9 -11 -6 17
3331 17 2 -23 -9 19 27 -17 -10 16 24 -1 -12 -6 4 13 6 -19 -4 7 26 -10 -25 5 30 5 -20 -13 6 12 -12 -25 -8 6 17 -5
3365 -5 -14 9 8 14 -13 -10 14 21 8 -18 2 28 13 -12 -13 7 20 16 -9 -12 6 24 9 -17 -15 15 -1 -13 -21 6 21 8 -17 -6 10 20
$$ packed form
3124cM3j7n6J4N5kn0j4L2J6%k1j4RK5jl3mL1J5j9m7L0M2j9l4J3K3Nj3k3OJ3L2
3158C4j2n4QM1K0m4l3M7K6k3l5K2K2ok5M%K0J4k3l3PO2j4n2j0P4ll9k3L4K5j6
3191A5k5j0J8J6Ol1j7L9K0j2m4JM6Qn4oM4Qk0j1PQK7j6l4qM2K2m7j7L2L5l6k3
3225a7LM1Ml8j6K0J7qql0J6M4om7ML3J3k7j0OK7ok0j2K1J2jj7j6J4K5jn3J0M8
3260B5ql1j7L2Rj2j8oL3%Kj5j3L0Qk8j7K2L3j9l3KL4Kj8j2PPK2j9k6QK6Jl1j6
3296c6L3K9k5j6PK1Jk4nJ6J0lk2nJ6K3j2k7%L5J3l7j8K4K2j5k4JJ7J0j1pkNK3
3331A7j5k5J4K8Qm4PK6Qk5j1OJ0Rpk5J5J1J9l6j5L0K5k5k5PJ9Ok4j3J7J4J1k2
3365erK3jOk7LK4Pj3k6K0K6j5k5jK0J3mk5lJ8J8j5k6KL0j6j2qK7J5j3k5J1J6J0
$$ plain form
3401 20 -10 -14 -12 12 17 -5 -12 2 12 3 -15 -10 23 24 -4 -17 7 13 20 -15 -7 0 12 16 -7 -18 10 30 8 -13 -7 27 0 -12 -12 2 11 7
3439 7 -7 -6 -1 9 -3 -14 -12 4 15 -16 -19 9 12 2 -8 -15 10 15 -3 -9 8 16 20 2 -16 4 15 7 -11 -20 11 20 -3 -10 -8 21 -1 -1 -9
3478 -9 -12 25 6 -14 -11 -2 14 -1 -24 -11 14 15 -6 -11 2 8 10 -2 -9 8 4 7 -23 -18 8 15 -12 -12 2 16 4 -20 -12 -1 19 -6 -9 -9 18
3517 18 12 1 -24 -14 5 6 -10 -23 -7 12 1 -19 -1 3 5 -8 -8 -1 14 6 -7 -14 -4 5 -6 -17 -10 21 10 -11 -16 -4 11 -1 -5 -6 6
3554 6 13 -4 -11 -10 -6 12 -1 -25 1 5 -6 -2 -22 8 13 6 -6 -5 10 12 -1 -13 -12 15 11 -15 -19 -2 6 -3 -16 -15 9 0 5 -10 -11 4 5 0 -17
3595 -17 3 19 7 -21 -14 10 12 -9 -12 -8 12 4 -10 -12 1 3 -6 -22 -12 -9 1 5 -2 -12 11 16 -9 -16 11 3 0 -4 -13 10 11 -1 -17 -9 11 -3
3635 -3 -12 -18 -1 3 0 -13 -6 13 6 -3 -18 -12 -3 6 -10 -3 -3 3 1 -5 -2 5 4 4 -8 -4 4 5 -9 -18 4 16 4 -4 -9 -4 15 -1 -19 -3 13 11 -5 -6 3
3680 3 7 -3 -10 -8 2 14 -2 -12 -6 4 9 -2 -12 -9 1 -13 -13 -11 0 9 -1 -12 -8 4 7 -9 -4 -2 -3 5 -6 -12 7 14 -18 -12 -6 7 6 -14 -13
$$ packed form
3401B0l0mKK4Nk2pJ4J0rj8NL3Jk8j3K4OPl5QPJ2Mk3j1K8K0k2k1OL4k7j2%J4Rm
3439Gj4JNJ0j2j1KJ6J1l1lK8Lj0j0pK5Nj8oJ7QMj8j8K0J1qj8rL1Rk3pKK9k2%q
3478ilL7j9k0LRJ6j5k3J3K5Jk1nJ3OKj2pJ7mLl0NK6Pk7%J4J4j2k4QJ1K0k5l%K7
3517A8oj1k5J0J9Jj6j3J6J9j1k0J8MKj3%PJ5qj3pJ0Rj1j1PL1j1k1nJ2J5j2mjJ2
3554FPj7pJMJ8j3k4K6Mj1Mk0L0Npj2JJ5Kj3j2JK7mk6mJ7Qrj3JK4rNj5jJ5Jnj7
3595a7K0J6j2k8PK4Kk1lMK0qj4kJ3Krj6J0LJ0Mpj0K3Nk5pK7qlmrK3Jj2j6QK0j4
3635croJ7Mlj3PJ9prj5ORRj6P%OkoLPj%j2MQJj4rK2J2j2qnNJ9j6j8J6J6kj6jR
3680CMj0pKJ0J2j6j0OJ0Nj1j0LJ0j4%KJ1Rj0j1MJ2Lj6NKjQj1oJ9Pl2OOJ3jk0J
$$ plain form
3721 -13 3 9 3 -7 -7 3 14 7 -18 -2 8 6 -11 -16 9 14 -4 -5 -6 -2 4 -6 -19 -11 17 18 -7 -10 -13 15 3 -2 -10 9 6 -10 -19 -7 3 -4
3761 -4 -7 -12 -9 11 4 -15 -11 -5 6 -2 -18 -13 -5 5 -8 -4 -2 15 7 -8 1 6 3 10 -2 -4 15 15 4 -6 0 9 4 0 -10 2 2 -4 -17 -11 3 -5 -6 -8 -7
3806 -7 5 -2 -1 -22 -2 4 -8 -8 -10 5 4 0 -12 -1 2 0 -8 -14 3 8 2 -7 -13 0 8 -7 -4 2 21 5 4 -4 -2 15 -11 -6 -7 -5 6 -11 -9 -11 5 2
3850 2 3 0 -5 -4 -11 -4 -18 0 7 1 -2 -5 11 9 -10 -6 4 13 1 -7 -6 3 0 -3 -6 -1 10 8 -12 -10 6 9 -1 -18 -5 6 -1 -6 -16 -2 1 -7 -8 -10 -5 -4
3896 -4 -3 -3 -24 -15 6 0 -9 -12 4 0 -5 -12 1 4 9 -3 -11 -3 -4 -5 -8 1 5 4 1 -7 7 12 8 -7 -6 1 -7 7 -3 -5 10 0 6 -9 -7 15 1 -10 5
3941 5 6 10 3 -13 -4 -3 1 -6 0 10 -1 -1 1 -2 2 10 2 -13 -5 9 -4 -3 -6 6 2 6 -10 -13 -3 4 1 -6 -7 -1 5 2 -16 -17 4 -4 -19 -4 -5 6 -4 -7
3987 -7 -3 -5 4 2 -14 -7 5 7 -8 -1 4 1 -2 -20 -5 2 2 5 -4 1 3 0 -6 -1 -1 -4 2 -5 -11 3 -3 -7 -6 -4 4 7 -10 -6 -6 7 -6 -4 -6 6 7 4 -8 -7 8
4036 8 -14 -1 -5 4 3 -10 -3 11 11 5 -5 -5 2 3 -2 -5 -15 -4 13 -3 -2 -1 -6 1 -13 -9 -4 7 -1 0 -10 -15 4 0 -11 -12 -8 6 -8 -12 -2 16 -3
$$ packed form
3721a3J6Ooj0%J0J1pk5J6J0kj7nK5Nj8jjMOj0j3QK8Jk5llK8j2nqJ9lj6rJ2J0p
3761dlnLK0pj9MOJ1qj6NQJ0j3MKJ7qj5RNlPj2kJ9%j1j0ORnmj0J2%oj3OJ4qjkJ
3806gJ2pJk1K0Oj2%kJ5jmj2J1LkqoJ7NoroJ3Qj5LOJ9j6jqKJ7k6NjKJ1j7KkJ6l
3850BJlnJpPj4J8PollJ6kj9MJ0Rj2qJRlllNJ1kk0KJ6Lj0j7J3J1pnj0J4LqjkNJ
3896dJ%k1RK1orlJ6mnpJ3LNj2qQjjlRMjlqJ4Nmj5JPqJ4j0kJ5j0Oj5KK2j4j1J5
3941EJMpj6RJMpOJ0j1%KlMQqj5QJ4j3JlJ2mMj6lJ0PlpjOOlj8jK1qj5J5jJ1j0l
3987gMkRkj6PJ2Kj5PNllj8J5P%LrNKloN%lOpoJ4omJKQLj7M%J3j3KkJ2Jlj2JJ5
4036Hk2J3mRjj3PJ4%oj0%PJnlj0J1J7j6JJnPj4MNJ1qJj0nJ9mj1jMJ4j4mJ0J8j9
$$ plain form
4079 -3 -3 -4 -1 5 1 -4 -2 8 4 -2 -12 -3 12 -8 -10 -4 0 7 4 1 -5 -1 0 -7 -6 -10 6 3 0 -12 1 9 -6 -6 -6 7 5 3 0 -6 -3 -1 -3 -1 14 0 6 -5 -7
4128 -7 6 -5 -2 -12 3 7 -2 0 -13 -7 -2 1 -4 -11 -6 5 -12 -10 -6 -9 3 -1 -9 -2 6 -3 0 -11 1 0 11 -7 0 0 5 1 2 -1 4 2 -6 -3 6 7 -11 -7 -9 0
4176 0 -7 -5 -1 -3 -6 -8 -15 -15 -2 0 -1 -10 -13 4 -4 -9 -11 1 -4 2 -11 -12 -2 2 -1 -4 -5 0 5 -16 -7 -6 0 -5 -12 -3 6 2 3 -11 -5 -1 1 0 -5 -2 10 -4 -6 -8 -2 -4
4228 -4 -3 -16 -8 -4 -14 -1 -7 -5 6 0 -7 -3 6 3 -6 -6 -2 5 -2 0 -13 0 5 1 -4 -5 -13 -5 -5 -9 -18 -6 2 -15 -4 -3 0 -1 -2 -11 1 -8 1 -7 -8 -5 -7 -5 -16 -15
4278 -15 -10 -1 -2 -9 -1 1 -4 -2 -2 0 2 -3 -4 -4 -2 4 -4 -13 -5 -2 -4 -9 -5 -4 3 -4 -18 -11 -17 -3 -7 -12 -8 -7 -15 -7 -13 6 -1 4 -8 -8 -4 0 -6 -5 -8 11 -4 -3 3 -10 1
4331 1 -2 -13 -3 -3 0 -3 -8 -1 2 -5 -12 -2 -3 5 2 0 -6 3 0 -4 -4 2 1 3 -3 -2 -2 -3 -4 -4 -2 5 7 1 -8 0 1 -2 -2 -8 5 13 2 -6 13 7 2 -10 10 -2 9
4382 9 -3 0 5 -3 10 7 -5 -8 3 7 -10 -10 -3 -8 8 -8 -2 0 -5 -7 -7 0 1 3 4 -7 -2 6 0 -5 -2 8 1 -9 -2 -11 3 3 -3 -3 -4 3 3 0 -10 -2 -7 -2 -3
4431 -3 7 -2 -9 -13 -14 -8 9 -10 -3 -6 7 -4 -4 -3 0 3 4 -7 -11 1 10 8 -1 -3 2 4 5 4 -1 4 13 -3 0 -4 5 12 -3 -3 -1 4 -9 -4 -7 4 -7 -10 -16 -7 3
$$ packed form
4079c%jLOmnKJ0moj0RJ5k0kOMPlloMJpJmJ6llj2J3Qj5%%J3kkloLKkKJ5j4Oj1k
4128gJ3j1Lj0J5MrKj3ONLnpNJ1j7KMlJ2mqPQrLj1J2jJ1j8P%NmJlNkqLRJj8MkR
4176@pKMklkp%J3KjrlJ7qnkJ2nOj3jJ0MlljNNk1RJOnpRRmJj4OMKjnLJ2j4kkOk
4228dJj3QMj0J3oKJ1opMRlr%MPpKj3J3NmnjqQ%mrJ2Qj7J1JLjjrJ2rRqjLkKj1J
4278a5NRjpQKnK%KKnj%KOqrQLknMJPpj4PoJ4mnMJqQoJ9pNj2%MMoJlJ9j5JOj3J1
4331Alj1J0%LlnPLppJ0jQlkoRlm%OjKoJ%jj%KPKorQJl%oJ3Qj1qJ9onj2K0j2J1
4382Ij2LNqJ3lj2lJ1Mj7%PnJ6j6OKnk%PJKJj1NQonLJ0pj0PrJ4%o%jP%lj0QnNj
4431cJ0rpmjOJ7j9PlJ3j1%JLLJj1mJ2RkrkNKJjnNRj6LmRPj5%KNj3NlJ1j1loRJ0
$$ plain form
4480 3 -3 -9 -11 4 2 0 -15 -2 -8 6 -2 4 0 -7 0 -3 -1 4 4 1 -2 -5 1 12 -10 -5 -3 5 9 0 -4 -1 1 -2 -10 5 -13 -6 4 -3 -12 1 -1 -17 -8 0 -2 -5 -8 -13
4530 -13 0 -3 1 -14 -6 2 2 -8 -4 2 15 9 -14 -10 -2 -2 10 0 -11 1 -3 -10 -7 -5 -5 -8 3 -5 -6 -2 -5 -6 -1 5 -7 -10 -6 -3 -7 0 -2 9 0 10 -1 -15
4576 -15 -9 5 -7 -7 -4 10 -3 10 0 -5 4 0 -4 -9 -3 -3 -1 3 -2 1 0 8 0 -3 1 11 -5 -12 -6 -11 0 -1 2 -4 -9 -6 -7 1 -6 1 -3 -4 6 -1 6 0 4 5 7 -4
4626 -4 0 5 -4 12 8 -2 1 2 8 6 -3 -10 1 -4 1 -3 6 8 -7 3 1 -6 1 -1 -4 -9 -13 -1 -7 -1 -3 11 -4 -1 10 4 -2 -2 -4 -3 4 0 -4 -1 -7 -2 -2 -15 -8 -13 3
4677 3 -6 -15 0 -5 -4 -9 -4 -10 8 0 3 -3 4 -3 -5 -2 -6 4 2 2 -2 -4 3 3 -7 -3 11 -1 -5 -6 6 6 5 3 -11 4 3 -1 -2 3 9 -4 -6 -8 -8 -9 -11 -3 -18 -2
4727 -2 -4 -8 -11 -3 -7 -1 -11 -6 -5 2 -5 -3 -5 4 -1 -5 -3 3 0 -13 -17 3 -7 -1 4 0 -5 -7 4 -8 0 -6 6 -3 -8 -7 -10 -4 -2 -5 -6 -12 -12 -10 -17 -6 -14 -8 -5 -5 6 0
4779 0 10 0 -6 -5 -2 -6 -8 -2 7 1 5 5 -7 14 -1 -2 -5 2 8 -8 -5 -10 -4 7 -11 -7 -4 -2 6 -11 0 2 -3 -4 -13 -9 -12 -3 -2 1 4 9 7 -6 -15 7 1 -2 -6
4828 -6 -4 3 1 3 -12 -1 -5 -2 1 5 3 5 3 1 5 -11 -1 1 -1 -7 7 5 0 -1 3 8 -2 -15 2 -8 0 -3 -7 0 1 -3 1 -7 -6 -2 -8 10 -1 5 -2 4 -1 -11 2
$$ packed form
4480CookJ5kkj5J3oJ4qOmpPlKN%lllOJ1k2NKQMrmLKlqJ5j8PJ0prJ3kj6RQklln
4530a3J3lMj5QQ%j0MOJ3ok3MQ%J2j0j1J2mpLK%lJ1qjMljNOj2lMLmPkJ1rJ0j1j4
4576a5OJ4j2%LJ4j3J3j0nRmmnO%KMnLjQqlMJ0j6pOnJ1jLonLjQpPmjJ0pPoMJKj1
4626dMNrJ6mj0LJOkrpJ1nNmRKj5J0kpPklnmJ2oOkJ4j5LJ1oo%kJPmmLoN%j3PnJ6
4677CrrJ5nJnNoJ8qLoPpkLmJ0k%mkP%j0MJ4j2mjJ2%jkj4J5jmjNOj3kk%jkQj5J6
4727bkmlQmOj0NJPpKkRnmKOlj3mK0j0ONmnkJ1j2QoJ2rnJlOKljo%KpJ1qOL%J1o
4779@J0j0oJLmkORoM%j2K1j5jlPOj6LnOJ1j8MLKQj7J1KnjrMlRJLLNkj3rK2olm
4828fKPkKj5J1mLLMkKkkMj6J0KkoJ4knjMNj0j3J7j0QlmPJmMqJMoJ8j1OpOnj0J3
$$ plain form
4877 2 4 0 4 -6 1 0 -7 -5 2 0 -10 1 -9 -2 -2 4 2 -5 -4 1 -10 -6 8 2 -8 0 -5 6 11 6 -2 11 0 6 -2 0 0 -7 0 -7 -1 0 -3 -13 -3 0 1 0 -6
4926 -6 11 0 -4 -6 -14 6 -4 -7 0 -1 0 -5 -8 -17 1 -7 4 -10 -10 -4 -3 -2 3 -11 -5 6 -2 -4 -14 -8 10 -2 2 -3 1 -2 1 3 6 3 -1 -7 -1 -1 0 5 -6 -2
4974 -2 5 1 -7 1 2 3 3 -7 -5 2 2 -8 -5 5 -7 1 5 -2 -10 -2 2 -6 -8 2 2 1 4 -5 10 0 2 -4 0 0 7 -2 -6 -6 -14 -11 5 -3 -8 -2 -4 -8 -5 0 5 3 -6 -16
5026 -16 -12 -6 -5 -3 2 3 0 -12 -4 6 5 -9 -1 3 -5 1 -8 -8 -15 -2 -1 -8 -7 4 5 -7 -11 -13 2 -8 -9 0 -11 -1 -10 -11 11 0 2 -6 -7 -9 -3 -1 -15 -7 -10
5073 -10 3 -4 3 3 -7 5 -7 -1 0 -4 -4 -11 -6 -6 -2 0 -2 -5 -5 2 -8 -2 3 -3 -9 -2 -7 -3 1 -10 -10 -6 -6 -18 -5 9 -8 -1 4 -9 1 -4 -4 -6 -6 7 -3
5120 -3 10 -1 -9 -9 -7 7 -4 -7 7 1 5 -9 -4 1 3 -5 -3 -11 -15 2 0 -6 -11 -2 -11 -4 -8 -8 -4 -11 -2 -4 -8 0 -18 -13 -3 -2 -1 -2 -3 2 2 -2 -11 -9 -1 4 -1 -1 -7 -6
5172 -6 4 -1 -3 -3 -2 -6 -2 0 -4 2 -1 -5 -11 -11 8 -2 -5 -1 -4 -1 -7 -4 -5 -18 -5 -2 -10 -4 -4 -15 4 -11 -5 -3 -11 -3 15 -8 -3 1 0 7 -6 -4 -2 -13 -8 2
5220 2 -13 -1 -3 5 -3 -12 -5 -6 -5 -15 -14 2 2 -5 -13 -2 -9 2 -10 -6 9 -5 -8 -1 -13 0 -8 3 -8 0 0 0 -5 -3 -3 -8 -3 -5 -8 5 -8 -5 -10 -6 -1 -1
$$ packed form
4877BKmMj0PjpKPkj0J1j0P%OkpJNj1MJ4oj0QnJ1NnqJ3j1OqK%pPpOJlj0J0LJjo
4926fJ7j1mkqK0j0lPjJnlrJ8qJ1j4%OJJNj4OJ1qkj0OJ8j2MnMlLKLlmoO%JNj1M
4974bPmqQJJ%j0KP%j0LJ0j2QMpqQMqkJ0%jLrJ5j0KoM%Prm%qLJ6qnOkmLNNkrj0
5026a6MOJKNJlj2QJ0jj4QMqOr%pJ3JpJJ1Jj2mkJ5j0jRj1J0rjK2j1KqjkOKj4Ql
5073a0J3pP%j0J2j2OJm%pN%MKkl%Pj0ONooPnMMj1%M%j2J3J4j7PNj3J0n%k%J3j0
5120cJ3j1q%KJ4j1lJ4oMj4NNKqKqmJ7konRrPm%MpRkmQj8NJ0JJjjN%mrKQNn%oJ
5172fJ0nk%JmMKmOlmo%J9j0lMlLoLjj3J3LqO%j1J9j5OKqQJ8k3NMjPj3KKj1NJ0
5220Bj5J2kQqrPjJj0JJ6%pqJ1pJ1j2MJ5j4lPj2J3qJ1j1Q%%nK%nNklJ3j3LnMN%
$$ plain form
5266 -1 -5 -2 2 9 -5 -11 -3 -13 -8 -1 -2 -5 7 -6 -7 -3 -2 1 7 1 -9 -3 1 3 0 9 -5 3 -7 -5 0 -5 6 -6 -2 -9 7 3 -4 -4 -5 2 1 -10 2 4 -9 -11
5314 -11 -12 -5 5 7 -1 -4 6 -2 1 3 -1 5 -7 0 -6 -5 -8 4 0 10 -7 -2 0 7 -5 -5 2 -2 5 -5 8 -3 -11 0 4 -3 -18 5 7 2 -1 -9 -2 -10 2 -7
5360 -7 -6 -7 -3 2 -3 2 13 -5 3 -2 -4 -6 1 -2 -2 3 2 0 1 -6 -2 7 5 1 -11 2 -2 2 6 2 2 5 8 3 -8 0 7 9 2 -4 3 -7 -2 0 2 -5 10 0 -7 6 9 2
5412 2 -1 3 1 4 -6 5 0 -2 -2 -5 5 4 13 2 2 4 -2 -6 -9 -10 -12 -10 -8 -6 -6 -1 -9 -3 -11 -11 1 -6 -4 -5 10 5 -4 -10 -8 -3 7 5 4 -2 8 -4 -1 -9 5 -2 3
5463 3 -7 -13 -14 6 -7 -8 -6 -8 5 -6 -3 3 5 -11 4 13 4 0 -15 0 2 -5 -11 -6 -8 -14 -3 -9 -7 -12 -2 5 3 2 9 8 2 0 -5 0 6 3 4 5 -3 7 1 2 9
5512 9 -3 -1 -2 -2 1 -7 -4 -3 0 -6 -6 -7 -14 -6 1 -1 1 -2 -5 -4 -9 -10 -10 -3 -9 -6 2 -6 -4 -2 6 -4 -6 -5 5 -7 2 -9 6 9 8 3 -5 1 -9 0 3 4 -1 -5 -9 2 1
5565 1 -11 7 2 -9 3 -4 -1 -4 0 -8 7 -4 10 4 1 2 1 -3 1 8 -4 3 5 1 -4 9 2 2 -3 -4 6 1 -14 -5 -2 -4 6 -8 -2 -5 -3 -3 1 -3 -3 -3 -8 -4
5613 -4 -5 2 -10 3 3 -2 -7 10 0 8 0 12 8 6 7 2 1 12 7 -5 5 8 4 12 7 6 4 10 -2 2 1 6 0 1 -4 -7 2 -2 -3 -7 2 2 10 0 -3 -4 13 3 13
$$ packed form
5266amLMPj4oQj0NPjlJ2j3jMJLOoj0OMKlRj4Qj0KNnJ1j2MpJ6mp%jPjj1J2Kj3k
5314a1jPJ0KqlJ0qLKmOj2PoJlJ2mJ0j7NKPj2%PmPj0J3j1qJ1Mpj5K3KnlqPqJ2r
5360gJjMNnNJ1j8QnkkPl%NjkJpMRkmj2J3mMMm%LLnj1QPKpoPj0NKKpJ5j0pJ3Lp
5412BlMkLj0J1nk%lJ0jRj1%KomljkKKK%NqOq%J2pKjJ5nroKNJ0kjoJ0j2LqJ4pN
5463Cj0ojK0j3jKkJ3j1LOKj6J5Rrmj5J5KpoNkoJ1oKnJ0PkjPjoknNOlJJqJ0oJP
5512Ij2Kj%LqLJLo%jpQPkKllJnj%PoLQqKKQj0kJJ0j2Rj1J5LjnqOj0RLJnmmJ1j
5565Aj2J8nj1J2pLlMqJ5j1J4olJjmMPj2PKmnJ3p%njJ0nj5RLkJ0j4OlK%Mm%%nM
5613djPj2J3%nnJ7j0QqJ2mkJnjJ1nj2J0LmQnjkOj2MjNoJnlRmjmR%Qj0ljJ7j0J0
$$ plain form
5662 13 7 15 4 4 7 3 10 1 7 2 3 -6 7 3 5 -2 -8 -7 -1 0 -1 -1 -1 -1 1 -1 -4 0 -7 -7 -7 2 2 -4 3 -10 5 3 10 -4 -1 4 2 1 -2 10 -1 -1 -2 -5 8 -1
5714 -1 6 4 -2 0 9 6 0 -5 -1 -1 -5 1 0 3 1 -13 -5 -7 -2 -4 -3 -5 -4 -8 -9 16 1 5 -3 6 -4 4 4 6 0 3 -4 10 3 8 3 0 4 6 11 4 9 13 5 -2 5 -8 3 0
5768 0 6 -5 0 -7 0 -5 -3 -7 -7 -3 -6 -3 -7 -9 -6 -2 2 -3 8 -10 3 3 1 6 0 -6 -9 1 -1 6 5 0 -5 6 1 -5 -2 1 -1 -4 -1 -2 7 -1 -3 -4 -14 -4 -11 0 -1 -5
5820 -5 -2 0 -6 -5 2 -6 -5 8 -6 2 -2 10 -4 -4 -2 -3 4 -5 5 5 -1 -6 7 8 6 2 0 2 -6 6 -2 3 -4 -2 -10 -8 -3 7 3 0 2 11 0 -2 3 -8 -6 -2 7 -11
5870 -11 9 2 5 9 -2 7 -1 7 -11 5 0 1 4 1 -1 7 -10 -3 3 -1 -10 -7 -3 3 -8 -3 -10 -7 5 0 1 -11 7 -3 -3 -9 -6 2 -8 3 -8 10 4 -3 5 -4
5916 -4 6 -3 3 9 -5 0 -1 3 11 -8 -5 2 10 4 -12 2 0 7 -8 -1 -2 1 -1 -7 0 -7 1 -2 -4 -7 -2 -9 5 -1 -10 1 -3 4 3 1 -8 -4 3 2 -1 0 -3 8 5 0 1 3
5968 3 -1 -1 -4 -10 8 5 0 -4 4 1 0 -8 -10 -5 -5 4 -2 -1 -1 -3 2 16 -3 4 4 -2 6 -2 -2 -10 -9 2 -2 12 4 7 2 -1 3 4 12 6 1 1 -4 -6 8 2 -6 -12 -2 2 -8
6021 -8 4 -8 -13 2 6 1 -4 -5 -5 0 -13 -12 4 5 0 10 3 3 -14 -3 2 1 6 -3 2 -1 10 7 1 8 4 2 2 -2 -5 8 -3 5 7 1 -1 -3 5 -4 0 0 8 -9 1
$$ packed form
5662A3oQj1%LmPrOnJrJ3mKpoJOJj%%%KklMp%%R%oPj3J5kPj4LNkjlJ2j1%jlJ3r
5714aPkoKRlonM%mOjLkj4QkNkJkJmjK5j5MqRj0Q%KoLpJ4pNnlMKNpNMqpPj3J1l
5768@Oj1NpPnKm%MlLmkLMMnJ1j8J3%kNoolJ0kPjnnJ1noLLklLjRqkjj0J0pJ1jm
5820eLKoJPqJJ3j4QmJ2j4%KjPrJ0%onJ3JkmkKqJ2qNpKqKNJ0mlKRj1kNj1KMRj8
5870a1K0pLMj1RqQj8J6nJLlkQj7POmrLMOj1NpLJ2nJj2J8j0%oLQj0J1j1J8opQr
5916dJ0rOOj4NjMQj9LPQoj6J4kPj5PjLkoPpQlklNpJ4orJ1mPjkrMPjlJlJ1lnJK
5968Cm%loJ8lnmQljqkN%RoJ%kNJ4j9P%oQq%qJJ1mJ4qLnlMJQon%nkJ4oqoJ0Mj0
6021hJ2j2nJ5Mnnj%Nj3JJ6JnJ0p%j7J1NjNrNlJ1loPmk%mlJ3j1QKokkQrM%Qj7J0
$$ plain form
6070 1 -1 -9 -6 0 -2 -4 -4 2 -6 -1 2 0 10 -11 -3 -9 3 0 4 -4 -9 -7 3 -8 -2 5 2 4 7 -3 -3 4 -5 -3 3 -1 -4 9 5 -3 -11 -9 -5 0 -2 3 -1 -2 -10 1 -7 3
6122 3 -9 -6 -6 -7 3 1 -8 8 0 4 5 -1 -3 -7 3 -6 -3 -5 -4 -6 -4 -6 -4 -4 -1 0 -3 3 -5 -13 -1 2 -9 -8 4 0 2 -6 -1 0 5 -6 -5 1 -3 4 9 -11 1 3 3
6173 3 -7 2 -8 -8 5 -9 -4 -10 2 -4 6 -7 -13 -8 3 -8 -5 2 11 -8 -1 -2 1 1 -2 -7 -7 0 9 -4 0 -2 13 -10 3 3 -7 -9 -6 -3 -3 -4 4 -1 1 -5
6219 -5 -2 2 -7 -5 -13 -6 2 4 -3 -8 3 -1 -2 5 5 3 -8 -15 5 -1 -3 -8 -5 7 -2 -5 1 -5 -3 -2 -2 4 -1 0 -4 -7 11 0 -5 1 0 -1 -6 3 -3 -3 1 5 -3 -1 -4 -3 -1 -9 0
6274 0 -5 -1 3 -6 -11 -18 -3 -5 -6 -1 -2 -3 -8 0 -2 -14 2 0 1 -11 -9 -2 -4 5 -2 10 8 1 -1 2 -7 -4 -2 -9 -1 -9 -11 -10 -7 -9 -7 -6 -8 -17 -11 -2 -4 -13 -9 -2 3 0 -15 -5
6328 -5 -11 6 -5 -4 5 -5 -2 -4 9 -4 -5 2 -1 -7 -1 -7 -6 -8 -3 0 4 -14 -10 -8 0 -6 -7 -8 1 -6 -7 -14 -12 -13 -9 -3 -6 -1 -8 -9 2 -6 -10 -1 -2 7 -4 -6 -6 8 2 -6
6380 -6 5 -7 3 1 -7 -4 -6 0 -2 -3 -5 -8 -4 -1 -17 -5 -2 -8 -2 -19 -6 -13 -12 -17 1 3 -8 -6 1 1 -14 -11 -8 -10 -11 -5 -6 6 1 13 8 8 3 -8 -7 3 -2
6427 -2 -7 -7 0 -7 -11 -2 -4 -9 7 -8 -4 -3 3 -2 -5 6 2 -1 -6 -3 -8 11 8 2 -2 4 -2 -7 0 3 -5 -3 2 7 -1 -5 8 -9 -3 -4 9 12 5 -5 11 -7 -2 3 4 -11
$$ packed form
6070AkqLOkk%OqNLkJ0k1QoJ2lMqnKJ0j1OPlKLj0%PrKOmlJ3mqqKMNkNmjqJ1qJ0
6122Cj2L%jJ0krJ6qMJokmJ0rLkJkKkK%LJlOqqJ2Lj1JJ2mKqNJNj1JOmPNk0J2K%
6173Cj0Rj0%J3j4NoJ2oJ0j3oNJ1j1LPRj9PjL%ln%PRj3MkJ5k3J3%j0kLL%jQnKo
6219eLMrKqPQKpnJ1mjP%kj1pK0oknLJ2rlOoKJ%OnJmlJ8j1nOjjnRo%MMqKlJKqR
6274@nMMrnpJ5kjNjjnQkj2J6kJj2KPkRpJ2kpkLrLKpQqkJLkKJkrORkrMPNlj5J0
6328eoJ7j1JRj0LkJ3j3jPloOoJkNLMj8MKQojjRpjpKjMOlNpjJ1qmRjRj1k%J4oq
6380fJ1j2J0kqLkOkjklMLj6J2LoOj7J3pJnJ8Kj1KP%j5LLkjOjJ2nJ2n%nj1JJ0n
6427bn%PpmRknJ6j5MJOnlJ1mlnLnJ9lomOonPLqKNNqmJ3j7OjJ3Lpj0J6j8NNJj5
$$ plain form
6477 -11 0 -3 5 -8 -10 -7 1 -1 -9 -1 -9 -4 -17 -3 -11 -6 -3 -1 1 -10 -11 -3 5 1 -3 7 -9 -3 1 -2 0 0 15 6 -1 4 -2 -3 0 -10 3 0 -2 -1 -4 -1 -6 -1 -14
6526 -14 -6 -3 5 -5 -3 -1 3 -7 1 -10 -10 -1 -8 -4 1 6 10 3 1 -2 2 -10 0 8 5 8 -1 6 -5 -3 -3 6 -1 -7 -5 7 0 5 -14 -16 -5 -9 -12 -6 -4 -8 2 -9 -3
6575 -3 -2 -3 5 -1 -2 6 -3 2 -8 0 3 -2 -5 5 6 3 1 3 4 -4 0 -1 -5 -6 -4 -3 -10 -9 3 -11 -1 -10 -5 -6 3 5 8 6 -4 -6 -1 -9 6 2 2 -5 10 -7 9 0 8
6626 8 8 4 1 8 2 1 6 -4 6 -1 3 2 1 2 -2 -2 10 -2 6 0 -5 -8 -5 -2 -4 -1 -3 2 -10 0 -2 -5 2 -1 -9 -7 0 -5 3 2 3 -6 2 0 -4 1 -2 -5 1 2 0 -10 -1 4
6680 4 -8 -8 3 -3 3 -2 -2 -3 1 -8 -2 -3 -6 -6 -5 -4 1 -2 2 -1 -10 1 -3 1 -6 -1 0 0 2 -1 3 7 0 -4 -2 -8 0 1 -5 -4 -8 -10 0 3 0 1 1 -3 -9 -3 -6 -7 -8 -10 -8 -4 -5
6737 -5 -7 1 4 -15 2 -4 1 -8 -5 -8 -8 -7 3 3 1 9 3 5 -5 1 7 4 6 9 1 4 3 10 0 -2 8 -2 -11 -6 -5 0 8 -12 -2 -17 -5 -6 -7 3 -3 -7 1 -3 0
6786 0 -7 -6 -5 1 8 3 12 2 -2 -4 -1 4 5 4 -2 2 -1 -3 -8 3 2 -7 -2 -4 -2 -4 -1 -3 -4 -1 -6 -10 -10 -15 -6 -1 2 0 -16 -13 -8 -11 4 0 0 -15 -7 -10 -4 -2 2 2 -5 -12 7
6841 7 -5 -4 -9 -1 12 -4 1 -10 12 3 4 -7 2 -3 -1 -13 -10 -9 -15 -13 -5 3 -4 -5 -8 -9 -2 3 -2 -1 -2 -4 6 2 -1 3 -1 -8 0 -3 2 0 3 5 2 -3 -5 -2 0 -10 -2 -5
$$ packed form
6477a1J1lQj3kLQkqQqNj3J4qNLKKj1jQQmmJ0j6OMlK%J5rpNojLj0J3lkJlLnNj3
6526a4QLQj0KKMj0Qj1%RpMNNMpklMj2J0QlLrPj1K%RpoKJ2pNj9kJ1mlOKmJ0j1O
6575cJjQojQrNj0QLnlJ0JlkKJqMjmjKJpJJ2j4J0rNjRKLkj0kNqJ5m%pJ5j7J6rQ
6626H%mlPojNj0J0pMjjJm%J2j2QonlLLkLkNj2J0klPlqKPnQjJrQkmNllOJkj0RN
6680Dj2%J1oOn%jMrOjl%JJNlMlrJ1mMpNJ%KlMMpmKoQJoJmkJ0LlJ%moOljjkKMj
6737ekQLj9J7oNrLl%JJ0%kQoKj0OOlKLqLjPj0kJ0j0rNJNQk0J0j5J2jjJ0omQmL
6786@pJJOPnRj0mkLNJjoMlknJ1jrNkKkLkjLnm%nRNLkj6LNlJ5m%j5QlOKM%ppJ9
6841Gj2JnQJ3j6Nj1K2rJj1RnKj2LJoKQQpjljPNnJjkJ0mlMmpQlNkLKlnkLKj0Ql
$$ plain form
6893 -5 -8 -7 -8 -6 10 -16 -5 -2 1 -6 -5 -1 1 -4 -9 -5 -9 -3 2 0 -3 4 1 1 -6 -4 -1 -1 9 0 0 17 0 2 -3 -1 -9 -7 -1 -9 -11 -2 -3 -2 6 -7 7 -2 0 -4 -11 11
6945 11 0 -1 3 7 -5 1 0 -12 -2 3 1 6 7 2 -4 4 6 6 -1 4 2 5 5 -1 -4 4 3 1 0 8 8 -4 0 -12 -16 -6 3 0 -3 -4 -6 -9 -4 -2 -6 -2 -6 -11 -1 -8 0 -8
6997 -8 -2 -7 7 4 -2 -2 -8 -5 -2 -2 7 9 3 0 0 0 -3 1 -6 -3 -4 -11 7 -12 -7 -11 -7 4 -5 3 2 -4 0 -2 0 -7 3 -10 -11 -1 0 2 9 0 0 1 2 1 9 -1 3 12 1
7050 1 2 -5 -10 -5 -4 -8 2 -4 -7 1 -1 -2 3 9 -3 2 2 -8 -2 -3 -1 2 0 -5 3 2 -1 -8 -6 6 -2 8 0 4 -3 9 5 6 11 1 2 2 11 3 5 -12 -3 -2 2 7 -1 2 0
7103 0 -7 6 -7 4 -6 -5 -2 -1 5 -6 -3 -5 -4 -2 5 -4 1 -2 1 -7 0 -7 6 2 9 1 7 10 6 7 11 -4 -1 2 5 -2 9 -5 5 3 -9 9 -6 -5 1 0 -3 -3
7151 -3 -6 2 -1 -8 0 0 -6 1 4 -1 -5 -2 2 0 -1 0 1 -2 1 14 3 3 4 -4 4 -9 2 5 4 -5 -4 7 -11 -3 1 -1 3 -2 -5 -1 -6 -2 -7 -9 -7 -3 -2 1 -9 -10 -8 4 -3
7204 -3 -7 -2 -5 -4 1 -2 0 -5 11 0 3 8 0 -5 4 5 -2 -2 2 -7 1 -3 1 -4 -3 -1 -4 -11 2 0 3 -12 -2 3 -2 1 6 3 -5 5 -13 -6 2 -5 -2 -7 4 2 -6 2 -3 9
7256 9 6 5 -2 -6 6 13 9 -1 4 -2 -4 -16 -9 5 0 -5 -1 -8 4 -5 -8 -9 -6 -5 -4 -10 -13 -9 -3 -2 4 11 -5 2 -11 -1 2 -2 -2 2 -4 7 -7 -8 3 2 0 3 0 4
$$ packed form
6893elJjKJ6k6J1LLpJMKnnMmONklPl%pKL%J0r%J7j7KnKqKOqkRjJQj3J4rKmpK2
6945A1j1jMMj2Ojj2J0NkNJnoQK%pNkL%olQjkjQ%j2Mj2mJ0RlljklNKmMmnJ0pQq
6997hOnJ4lo%oLL%RKol%%lMpLjpJ8j9NmMJ1rQjoMkKpJ0j3jJ0JKPr%JJjQj0MRj1
7050AJpnNJmJ0olQkjNOj2N%j0OjKLknQjlpKJ2qJ0qMpJ2mJNj0J%RqKj7RJMNqLk
7103@pJ3j3J1j0JLJOj1LkJKPrNlLqPpJ3mPqOLmJMj5LLLpJ1j4J0kj2J8j5JOjl%
7151clQlpQ%oPLnmLMkjJJlLJ3j1%JqQj3J1LjrJJ1j8QMkMnlMnMnkKMJLj0jKJ2p
7204cmNlJNlKnJ6j1LNqnRJp%MrQmMnJKlpJ3kLj5J0NnLNlqJ0j8PQpLnJ1kqQnJ2
7256IljpmJ2Pmj0Nokj2PJ4nnMpJ2rljLJJolMOJOPj6Pj3J0Lm%MoJ1j4jJ1jkLlM
$$ plain form
7306 4 -8 -3 -2 -2 -4 -11 -5 -2 -6 -1 -5 -5 3 1 -1 -1 -9 4 2 -5 6 -2 3 -5 -9 -4 -3 -1 -4 12 11 6 -9 2 -3 7 8 -4 1 1 -6 4 -1 0 -6 -4 -2 -7 4 -11
7356 -11 -8 -5 -1 0 4 -6 -1 -3 -1 5 4 -7 -8 -8 -5 5 -6 0 -4 5 3 9 11 0 3 -1 4 8 14 0 10 6 11 10 11 5 1 5 11 0 3 3 5 -6 -5 -11 -4 -5 -4 5 -2
7407 -2 -2 -3 -1 6 0 -7 0 2 -2 -1 8 2 5 13 7 4 4 11 -5 -7 2 4 3 -5 2 2 -5 -4 -2 8 -4 -3 -2 -11 1 -10 -4 -8 0 -10 -5 -8 -7 -10 8 -4 -2 -4 -5 -3 -5 5
7459 5 -9 -1 -3 9 0 1 -14 -10 1 3 -2 -4 -1 10 3 5 -1 2 -5 -7 0 -5 1 -9 -8 -11 -3 0 7 2 -3 1 -3 -2 -9 -3 -6 -5 -8 0 -5 -5 -5 -9 3 -2 9 -2 3 -1 -4 -7
7511 -7 -7 4 -3 -3 4 -5 -1 6 3 -6 2 0 7 -4 -1 2 -8 -2 -11 -8 5 1 -4 -5 -6 2 6 -13 -1 6 -9 -3 -5 3 -2 10 -3 2 3 11 -3 8 7 6 2 -3 -6 2 0 2
7561 2 0 1 2 -3 1 -16 -3 -7 -1 3 4 -7 -1 -3 -5 2 -16 4 10 2 0 13 4 -3 -10 4 2 -1 13 -2 1 -4 -7 5 6 -10 4 3 -4 -8 -1 -5 -7 -14 -7 -1 2 -7 -10
7610 -10 -6 -11 -6 3 -4 -1 4 7 -3 1 0 6 -1 2 -2 -9 -2 0 -13 5 -2 -5 0 4 -2 7 1 -2 -7 3 -3 -7 -1 4 3 3 0 -2 -8 -4 -5 -2 -9 -4 -8 -1 1 -1 -3 -7 -1 -2 -3 4 5 2
7666 2 -6 -8 2 -6 -3 -1 12 2 4 6 1 6 -5 -1 -5 -5 -9 4 -2 5 -3 2 -1 -10 3 -2 -10 -4 -2 2 4 -8 -14 -11 -5 -5 -8 -2 0 -5 -2 1 0 11 7 6 3 1 0 -7 7 4
$$ packed form
7306Dj2NJ%kpOLmNm%Qkk%qJ3kpJ1qNqmNJKlJ6jnj5J1nJ0Jj2N%pJ0nJoKKnJ1j5
7356a1LLMJMj0NkKOjj1j%LJ0j1OmRkOKj1LmNMOj4J0mNjJomMOj1L%Kj1JoPjJRp
7407b%jKPopPKmJRoLQol%Pj6kRKjqP%pJKJ0j2JJrJ2j1OmQj0NlJlJ8j2KkjKkJ0
7459Ej4QkJ2rJj5MJ1KnkLJ1pKoLpkPnOj0JlQLPnnMmJpOlJlQn%%mJ2nJ1j1Nmll
7511g%J1p%PrMPlrQkPj1LLj0OrLJ3mnjjQMj9J2Pj5OkQnJ2j3NJQj4J1jjmnlQkK
7561BkJJnMj7J3mOMJj1OkkPj8K0OqkJ3rppJ4klJ4j5LnlJ2Jj6J4jpmPmkpPOLrl
7610a0MnNRpLNLj0MjOpLmpPKj3J8plNMoRolnJ0omONj%lkoMjLpNmPKkkmOjjPJl
7666BqkJ0qLKJ3j0KKnNj1Mm%mJ3oPqNlrJ3nqOKMKj2oLO%lOKnLLjJ1mjlkjpJ4l
$$ plain form
7718 4 2 1 10 -2 2 -1 1 -6 -1 -9 -6 -9 -6 -7 -8 4 -1 -1 4 -2 -8 -7 -11 1 -5 -7 3 8 0 -2 -1 -3 14 -4 4 -1 -12 -5 -7 -7 -5 -8 0 9 -8 -4 0 -2 -6 4 -4 10
7770 10 11 -1 -11 -5 -3 -8 3 1 -4 -1 2 -8 11 -1 2 -7 -9 -5 -1 -6 -5 -1 -3 1 7 -2 -1 -2 0 -2 0 -9 -7 -4 -6 -6 2 1 -7 -1 -2 -8 -6 -8 -7 -11 -2 0 -9 1 -8 -3 -3
7823 -3 -12 -6 -6 -5 -13 -6 2 3 -1 -3 1 4 -8 -3 0 6 8 8 1 6 0 -1 0 1 2 1 -5 -10 -2 1 -4 2 -9 1 -17 0 -4 0 -4 -11 1 0 -4 -3 -2 4 -2 -5 -3 -4 -3 -2 -9 -20
7877 -20 -5 -1 -7 -6 -3 2 1 -2 -6 2 2 4 2 5 -1 -2 7 5 0 -4 11 -5 -9 -7 -7 -3 -13 7 2 13 3 -8 -4 -2 -1 1 6 -2 -2 -2 -2 -9 -5 -2 3 7 6 -1 2 5 7 1
7929 1 -2 -1 5 2 -5 0 3 -2 0 -13 2 -4 -2 0 2 -12 -4 0 1 -1 -9 -7 -3 2 -2 -7 -4 -1 2 -3 -9 -4 4 7 5 0 7 3 10 -5 0 9 -1 3 -12 -7 -8 -1 5 -3 2 -11 -11 -8
7983 -8 -7 0 -5 0 8 -3 2 -5 2 -8 4 -2 -11 -1 -2 -5 3 -1 4 -7 6 8 -7 -5 -2 0 5 10 4 0 -6 -1 -3 3 8 9 -8 -3 2 0 1 4 -3 -2 -10 -2 8 -19 -10 -1 4
8034 4 2 -8 4 -6 -4 16 7 -2 0 -10 4 -3 -5 -4 5 11 -4 5 10 -2 -1 9 -2 2 -8 3 -10 4 1 -10 -8 -8 -3 -10 0 -2 3 -7 -11 8 -11 -4
8076 -4 -10 6 -1 5 -1 4 2 -2 5 -1 7 -9 -6 10 -6 5 5 0 7 2 6 1 1 2 2 -9 3 8 8 -6 1 1 5 -7 -4 -11 -4 1 -11 -8 -13 -5 -3 -1 5 -5 -1 7 8 1
$$ packed form
7718DkjRj2MlKpNqLlLjjJ2n%NooJmJ2okJ0NqkJkJ7j8Qnj1Pk%KlQRj7MMkmJ0qJ4
7770A0Jj2j0OKnJ1knLLj0J9j2LrkMMnJMkMOrJjKkKrKLk%QjqOjoKkJmRKrJ0rN%
7823crO%JqPQJmkMLj2NLOK%pNojJJJjonQLnOj1J0j8J7mMmpJ2jmJJOolKjJJpj1
7877b0J5MoJLNjlmQ%KkLojRknmJ5j6mK%Mj0K0nJ1j0j1MKJKNq%%%pMLNMjpLLKo
7929AlJOlpNLnKj3J5oKKKj4QMJkqKMNmnLLLnoNQLknPmPj5NRj0Mj5NjPOqNj3%L
7983hJPnNQj1NpPj0J2orJ0jlQmNj1J3Kj5KLKNNomoNkONJj7NNkJLpJqQJ0k7RRN
8034Dkj0J2j0KK0rrKj0J4pkJROj5RNj2JJ0j1Mj0J1j3J4lj1K%NpJ0kNj0mJ9j9P
8076doJ6pOoNkmPoQj6LJ6j6J1%nPnMn%J%j1J2N%j4P%Mj2LpPNj2LnQKKOj0MQJp
$$ plain form
8126 1 3 2 -4 7 5 4 8 1 -3 15 9 0 5 6 11 8 -2 0 -3 -6 -5 -1 -9 -10 -4 1 -3 -3 0 5 -12 -1 4 -5 1 -4 -7 -5 -3 -3 0 -11 4 5 1 1 7 3 15 8 3 -4 3
8179 3 4 8 5 -3 5 4 6 7 0 4 -3 1
$$ packed form
8126AKjoJ1kjMpmJ8orNJNlj0KllJMqjONm%LNj7J1NrOnlKK%Lj1J5Jm%OmJ2pnpP
8179CJMlqQjKJpMpM
8191A
##END NTUPLES=NMR FID
##END=
