##TITLE=1H_LY-DMAA.Per.1.7
 CDCl3
 8 sc, 
 10.02.2022
##JCAMPDX= 6.0         $$ Bruker NMR JCAMP-DX V2.0
##DATA TYPE= NMR FID
##DATA CLASS= NTUPLES
##ORIGIN= UXNMR, Bruker Analytische Messtechnik GmbH
##OWNER= root
$$ XWIN-NMR		Version 3.5
$$ Thu Feb 10 12:20:10 2022 Russian Standard Time (UT+4h)  she@DPX200
##.OBSERVE FREQUENCY= 200.131346
##.OBSERVE NUCLEUS= ^1H
##.DELAY= (6, 6)
##.ACQUISITION MODE= SIMULTANEOUS
##.ACQUISITION SCHEME= undefined
##.AVERAGES= 8
##.DIGITISER RES= 18
##SPECTROMETER/DATA SYSTEM= spect
##.PULSE SEQUENCE= zg30
##.SOLVENT NAME= CDCl3
##.SHIFT REFERENCE= (INTERNAL, CDCl3, 0, 15.7039)
##AUDIT TRAIL= $$ (NUMBER, WHEN, WHO, WHERE, WHAT)
$$ ##TITLE= Audit trail, XWIN-NMR		Version 3.5
$$ ##JCAMPDX= 5.01
$$ ##ORIGIN= Bruker BioSpin GmbH
$$ ##OWNER= she
$$ F:/spectra/data/she/nmr/H-F/1/audita.txt
$$ ##AUDIT TRAIL=  $$ (NUMBER, WHEN, WHO, WHERE, WHAT)
(   1,<2022-02-10 12:18:07.18 +0400>,<she>,<DPX200>,
      <created by zg, POWCHK disabled, PULCHK disabled
       configuration hash MD5:
       00 E9 B6 7A A2 85 ED C7 34 08 36 98 17 FE 4E 26
       data hash MD5: 16K
       B2 A4 04 87 BA C5 0D 58 8D A2 63 26 4F CE 94 CD>)
$$ ##END=
$$ 
$$ hash MD5
$$ 69 15 75 79 33 D8 05 E1 3D 23 CE D3 E0 F4 A3 4F
##$RELAX= 
##$RELAX= 
##$RELAX= 
##$RELAX= 
##$RELAX= 
##$RELAX= 
$$ Bruker specific parameters
$$ --------------------------
##$DU= <F:/spectra>
##$EXPNO= 1
##$NAME= <H-F>
##$PROCNO= 1
##$TYPE= <nmr>
##$USER= <she>
##$AMP= (0..31)
100 100 100 100 100 100 100 100 100 100 100 100 100 100 100 100 100 100 
100 100 100 100 100 100 100 100 100 100 100 100 100 100 
##$AQSEQ= 0
##$AQ_mod= 1
##$AUNM= <au_zg>
##$AUTOPOS= <>
##$BF1= 200.13
##$BF2= 200.13
##$BF3= 200.13
##$BF4= 200.13
##$BF5= 200.13
##$BF6= 200.13
##$BF7= 200.13
##$BF8= 200.13
##$BYTORDA= 1
##$CFDGTYP= 0
##$CFRGTYP= 5
##$CHEMSTR= <none>
##$CNST= (0..31)
1 1 145 1 1 1 1 1 1 1 1 1 1 1 1 1 1 1 1 1 1 1 1 1 1 1 1 1 1 1 1 1 
##$CPDPRG= <>
##$CPDPRG1= <>
##$CPDPRG2= <>
##$CPDPRG3= <>
##$CPDPRG4= <mlev>
##$CPDPRG5= <mlev>
##$CPDPRG6= <mlev>
##$CPDPRG7= <mlev>
##$CPDPRG8= <mlev>
##$CPDPRGB= <>
##$CPDPRGT= <>
##$D= (0..31)
0 1.2 0 0 0 0 0 0 0 0.06 0 0.03 0 0 0 0 0.0002 0 0 0 0 0 0 0 0 0 0 0 0 
0 0 0 
##$DATE= 1644481086
##$DBL= (0..7)
120 120 120 120 120 120 120 120 
##$DBP= (0..7)
150 150 150 150 150 150 150 150 
##$DBP07= 0
##$DBPNAM0= <>
##$DBPNAM1= <>
##$DBPNAM2= <>
##$DBPNAM3= <>
##$DBPNAM4= <>
##$DBPNAM5= <>
##$DBPNAM6= <>
##$DBPNAM7= <>
##$DBPOAL= (0..7)
0.5 0.5 0.5 0.5 0.5 0.5 0.5 0.5 
##$DBPOFFS= (0..7)
0 0 0 0 0 0 0 0 
##$DE= 6
##$DECBNUC= <off>
##$DECIM= 32
##$DECNUC= <off>
##$DECSTAT= 4
##$DIGMOD= 1
##$DIGTYP= 9
##$DL= (0..7)
0 120 120 120 120 120 120 120 
##$DP= (0..7)
150 150 150 150 150 150 150 150 
##$DP07= 0
##$DPNAME0= <>
##$DPNAME1= <>
##$DPNAME2= <>
##$DPNAME3= <>
##$DPNAME4= <>
##$DPNAME5= <>
##$DPNAME6= <>
##$DPNAME7= <>
##$DPOAL= (0..7)
0.5 0.5 0.5 0.5 0.5 0.5 0.5 0.5 
##$DPOFFS= (0..7)
0 0 0 0 0 0 0 0 
##$DQDMODE= 0
##$DR= 18
##$DS= 0
##$DSLIST= <SSSSSSSSSSSSSSS>
$$ [...]
##$SUBNAM2= <"">
##$SUBNAM3= <"">
##$SUBNAM4= <"">
##$SUBNAM5= <"">
##$SUBNAM6= <"">
##$SUBNAM7= <"">
##$SUBNAM8= <"">
##$SUBNAM9= <"">
##$SW= 18.0517287032376
##$SWIBOX= (0..15)
0 0 2 0 0 0 0 0 0 0 0 0 0 0 0 0 
##$SW_h= 3612.71676300578
##$TD= 16384
##$TD0= 1
##$TE= 0
##$TE2= 300
##$TE3= 300
##$TEG= 300
##$TL= (0..7)
0 120 120 120 120 120 120 120 
##$TP= (0..7)
150 150 150 150 150 150 150 150 
##$TP07= 0
##$TPNAME0= <>
##$TPNAME1= <>
##$TPNAME2= <>
##$TPNAME3= <>
##$TPNAME4= <>
##$TPNAME5= <>
##$TPNAME6= <>
##$TPNAME7= <>
##$TPOAL= (0..7)
0.5 0.5 0.5 0.5 0.5 0.5 0.5 0.5 
##$TPOFFS= (0..7)
0 0 0 0 0 0 0 0 
##$TUNHIN= 0
##$TUNHOUT= 0
##$TUNXOUT= 0
##$USERA1= <user>
##$USERA2= <user>
##$USERA3= <user>
##$USERA4= <user>
##$USERA5= <user>
##$V9= 5
##$VALIST= <valist>
##$VCLIST= <CCCCCCCCCCCCCCC>
##$VD= 0
##$VDLIST= <DDDDDDDDDDDDDDD>
##$VPLIST= <PPPPPPPPPPPPPPP>
##$VTLIST= <TTTTTTTTTTTTTTT>
##$WBST= 1024
##$WBSW= 4
##$XGAIN= (0..3)
0 0 0 0 
##$XL= 0
##$YL= 0
##$YMAX_a= 84763
##$YMIN_a= -81583
##$ZGOPTNS= <>
##$ZL1= 120
##$ZL2= 120
##$ZL3= 120
##$ZL4= 120
##$ABSF1= 10
##$ABSF2= 0
##$ABSG= 5
##$ABSL= 3
##$ALPHA= 0
##$AQORDER= 0
##$ASSFAC= 0
##$ASSFACI= 0
##$ASSFACX= 0
##$ASSWID= 0
##$AUNMP= <proc_1d>
##$AZFE= 0.1
##$AZFW= 0.1
##$BCFW= 1
##$BC_mod= 2
##$BYTORDP= 1
##$COROFFS= 0
##$CY= 11.3945322036743
##$DATMOD= 1
##$DC= 2
##$DFILT= <>
##$DTYPP= 0
##$F1P= 2.36226072786647
##$F2P= -0.459571619588291
##$FCOR= 0.5
##$FTSIZE= 0
##$FT_mod= 4
##$GAMMA= 1
##$GB= 0.15
##$INTBC= 1
##$INTSCL= 1
##$ISEN= 128
##$LB= 0.24
##$LEV0= 0
##$LPBIN= 0
##$MAXI= 10000
##$MC2= 0
##$MEAN= 0
##$ME_mod= 0
##$MI= 1.114404
##$NCOEF= 0
##$NC_proc= 0
##$NLEV= 6
##$NOISF1= 3.799351
##$NOISF2= 2.8
##$NSP= 1
##$NTH_PI= 0
##$NZP= 0
##$OFFSET= 15.70392
##$PC= 1
##$PHC0= -16309.54
##$PHC1= 11.80078
##$PH_mod= 1
##$PKNL= yes
##$PPARMOD= 0
##$PSCAL= 0
##$PSIGN= 0
##$REVERSE= no
##$SF= 200.130013532006
##$SI= 16384
##$SIGF1= 3
##$SIGF2= 2
##$SINO= 400
##$SIOLD= 16384
##$SREGLST= <1H.CDCl3>
##$SSB= 0
##$STSI= 0
##$STSR= 0
##$SW_p= 3612.71676300578
##$SYMM= 0
##$S_DEV= 0
##$TDeff= 0
##$TDoff= 0
##$TI= <>
##$TILT= no
##$TM1= 0
##$TM2= 0
##$TOPLEV= 0
##$USERP1= <user>
##$USERP2= <user>
##$USERP3= <user>
##$USERP4= <user>
##$USERP5= <user>
##$WDW= 1
##$XDIM= 8192
##$YMAX_p= 0
##$YMIN_p= 0
$$ End of Bruker specific parameters
$$ ---------------------------------
##NTUPLES= NMR FID
##VAR_NAME=  TIME,          FID/REAL,        FID/IMAG
##SYMBOL=    X,             R,               I
##VAR_TYPE=  INDEPENDENT,   DEPENDENT,       DEPENDENT
##VAR_FORM=  AFFN,          ASDF,            ASDF
##VAR_DIM=   8192,          8192,            8192
##UNITS=     SECONDS,       ARBITRARY UNITS, ARBITRARY UNITS
##FACTOR=    0.0002768,     1,               1
##FIRST=     0,             0,               0
##LAST=      2.2672688,     0,               0
##MIN=       0,             -81583,          0
##MAX=       2.2672688,     84763,           0
$$ Real data points
##PAGE= N=1
##DATA TABLE= (X++(R..R)), XYDATA
0@%%%%%%%%%%%%%%%%%%%%%%%%%oJ4j6J6j6J6j6J6j8K5l1L2l2L6m4M8n0N7o3O8
45C6p6Q4r2J01j13J25j35J47j64J83k03K27k55K88l28L78m39N19o32P94j044J475
67H76k341M706k2081o2743Q7750O8879p6520n9619N6288M7338k9057l5255j317
80b3096K3888L2913j5508o1239R534Q3926o788r7854N823J02315o124r6753N696
93d3267Q2601l736o1377r00L5960Q095r156j7530j5730K8242L6209l8983n0254
106d9826M8119N7146n4064n6712N5433M9871n1522l8194M2264K3872k8467r322
118a1402J1409l231O907J2068k4498j6353L9212J5883m9192j1255N3298L598n1094
131b4650N452M3189j4064l0758K0639J5680k3931k5K3407j3976j9123K4486J1626
$$ y = [0, 0, 0, 0, 0, 0, 0, 0, 0, 0, 0, 0, 0, 0, 0, 0, 0, 0, 0, 0, 0, 0, 0, 0, 0, 0, -6, 8, -8, 8, -8, 8, -8, 8, -10, 15, -16, 16, -16, 20, -24, 24, -26, 31, -32, 36, -40, 44, -48, 53, -60, 65, -70, 77, -87, 96, -107, 120, -135, 153, -175, 203, -236, 283, -349, 445, -599, 876, -1465, 3241, -18840, -81583, 6167, 75046, -1474, -61093, -4805, 42533, 13476, -21779, -23096, 792, 33705, 18197, -43042, -33508, 50418, 43630, -54224, -48401, 53914, 47790, -48963, -43267, 39334, 35598, -25779, -26679, 9281, 17376, 8220, -9310, -25040, 3202, 39411, 428, -49826, -1707, 55439, 1375, -55337, 96, 49967, -1555, -39749, 2515, 26387, -2080, -11402, 7, -3224, 3683, 15751, -8747, -25100, 14112, 29995, -19197, -30452, 22846, 26444, -24650, -19198, 23991, 9927, -20831, -192, 15488, -8443, -8468, 14939, 963, -18160, 6326, 17952]
144A7952l0072k073L0100q199k4816J7687J5095k5098k562K9493j0990l0449K3485
157d47K7997l2926k2776L7807J5730l7182q071L1000J113j9863M138N145o899
170e234J1392P019k7700m754M1731P96n1688L763N6308p765n5092R937M8268r447
184A7534l6724N717K1934J091n715j0391j0085K1059K3822l1596l4170M0405M0463
197D3344m5967m2484M7119M0721m3183l5923L4178K9202k0724k1757M112J4582
209C220J4020q606l1734M168M7049j348n8318j91O4214J002o4107j778N7964L253
223B8808m6550n926L1169J0126j3565j5661m286K2119K0521k8639l3509L4234
235a159M2135l7848m5840L8548M4755l5787l9552K9274L1383j9363k1694O866
$$ y = [17952, -12120, -14193, 15907, 7708, -17108, 579, 15674, -9424, -11986, 17507, 6517, -23932, -447, 27550, -5376, -28152, 9655, 25385, -11797, -19868, 11132, 12245, -7618, -3480, 1665, -5234, 6158, 13177, -14523, -19277, 22454, 23250, -28438, -24675, 31633, 23868, -31224, -21287, 26981, 17534, -19190, -13473, 8461, 9552, 3837, -6554, -16639, 4420, 28242, -3354, -37524, 2881, 43344, -2623, -45107, 2012, 42733, -450, -36373, -2195, 27007, 6283, -15474, -11362, 3220, 17240, 8634, -23100, -18932, 28117, 26769, -31549, -31740, 32474, 33476, -30631, -32409, 25555, 28808, -17742, -23668, 7501, 17627, 4062, -11599, -15885, 6234, 26755, -1884, -35393, -1159, 40976, 3128, -42712, -4164, 40591, 4804, -34748, -5474, 25909, 6546, -15148, -8282]
247h282J1840P072l243k0931l320L3220P327m2469q780M7666Q107m8160n973M3916
261A7990L354l5485j027K3856j76j0466k20l056K263J5204n754k4669J0218L0293
275B2325j4811l1729J8692K9020k1101k2813K1386J4205j9275m581J4849m586
287A581q518J1965J122j6532O443J7702j3131j5363J8023J0042k0430k580K0014
300A0338n767j6953J3721J1756k0098n305K3924j375k4695P128K2232j0981j6943
313a3018J2282R521j0735r57O495p625j46J5263p353k1102J4895K4558k1226k5381
327b4529K5273K3774k6177k0167K3515J5274j7388r883Q278M808K765o92j4575
340i724k113K5700L476l4786l587M0628K923m2491k103M0147J732l3780k329K4136
$$ y = [-8282, 3558, 10630, 7387, -13544, -16864, 16356, 23683, -18786, -27566, 20100, 28207, -19953, -25926, 17990, 21344, -14141, -15168, 8688, 8512, -1954, -2174, -5230, -2967, 12237, 6483, -18186, -7968, 22325, 7514, -24215, -5523, 23497, 2396, -20417, 969, 15174, -4101, -8682, 6167, 1581, -6937, 5028, 6150, -10382, -3939, 13763, 632, -14731, 3292, 13334, -7096, -9676, 10338, 4571, -12382, 1339, 13095, -7003, -12308, 11616, 10241, -14454, -7326, 14906, 3925, -13018, -736, 8785, -1950, -2907, 3588, -4037, -4183, 11080, 3727, -17375, -2480, 22078, 852, -24529, 744, 24518, -1659, -21826, 1689, 16963, -425, -10308, -2030, 2778, 5543, 4851, -9724, -11837, 13863, 17339, -17447, -21034, 19594, 22517, -19974, -22077, 18070, 19802, -13978, -16307, 7829]
354G829M308j2360p626k36J2089J2327j7077k2677K1793L0324k5424l4664K7070
367d324L5575k6133l3357K2301K8534j5614k2034O527J4756M148p637j5351J434
380a1175K5864L403l4481o579M0173Q232m2201q625M0287Q248l4531p662K5582
393F535P374j4417p793K287R020R509j1060j9699J3503K7245j5898l1484J7609
406g269L2136j8051k9429J6795K4007j3634j6753Q639Q778k148j147n178n092
419h346J2453R448j8911j1498K3690J1264k6115r119K5833N660k2881j671J7577
432G384k093j0596M905K808o294M778O001j1207m141J5735R81j7808K995J7217
446A0665p108j4105J0719R021j3175k766J4108l661j3360R321J1031j3332p463
$$ y = [7829, 12137, -223, -7849, -8085, 4004, 16331, -746, -23423, -1630, 28694, 3270, -31394, -4324, 31251, 5118, -28239, -5938, 22596, 6982, -15052, -8525, 6231, 10379, 2742, -12609, -11175, 14689, 18092, -16389, -22968, 17205, 25437, -16764, -25389, 14898, 23146, -11385, -19047, 6535, 13909, -508, -8301, -6014, 3006, 12515, 1455, -18244, -4741, 22504, 6606, -24878, -7269, 24867, 6816, -22613, -5818, 18189, 4555, -12198, -3559, 5219, 3071, 1924, -3254, -8346, 4107, 13555, -5356, -16854, 6836, 18100, -8015, -17134, 8699, 14359, -8522, -10193, 7384, 5291, -5305, -400, 2408, -3886, 892, 6893, -4314, -8455, 7280, 8261, -9547, -6552, 10665, 3557, -10548, 171, 9192, -3983, -6749, 7359, 3698, -9662, -341, 10690, -2642, -10105]
459a0105J5017L171j4111J179J0648m967n102P613j784q852R061Q629j5764p099
473a2466K0897M744k3770k048K3938k96k1321J755J6254j931r290O52J274J997
487C89O819n566j4210R607K0033j3382k3742J6121K5049j7230k4003J6252K0865
500A7002j3003j6234P638J0741n38n161p536J30J5704L961k3057o723K8600Q234
514A9758l1620q632L1620Q327k8500p760K2547P351j4356p465M787Q212N114r601
528b18j4319J1312K1906j3017k7092J4170K9491j4298k9026J3036K5979j0180
540G744k0841N779J4396p2p499o378R62J2932M619j8909q670K3494J1011k6135
554g567j1656K6394J0823k4148r018J9539O757j3065m574N337L032K654k264j0162
$$ y = [-10105, 4912, 8083, -6028, -4849, 5799, 832, -4270, 3343, 1559, -7293, 1768, 10397, -5367, -12466, 8431, 13175, -10595, -12643, 11295, 10999, -10322, -8567, 7687, 5756, -3534, -2882, -1608, 389, 7208, 1642, -12568, -2961, 17072, 3690, -20052, -3931, 21118, 3888, -20115, -3863, 17002, 3999, -12235, -4597, 6144, 5606, 445, -7091, -6961, 8743, 12704, -10353, -17076, 11524, 19758, -11862, -20494, 11126, 19453, -9047, -16807, 5740, 13091, -1265, -8730, -3943, 4269, 9383, -218, -14537, -3225, 18681, 5664, -21428, -7258, 22233, 7935, -21091, -8055, 17924, 7744, -13097, -7318, 7078, 7006, -493, -6871, -5909, 7023, 11642, -7267, -15937, 7557, 18568, -7567, -19223, 7171, 17994, -6154, -15172, 4367, 11124, -1941, -6515, -1178, 1854, 4508, 2244, -7918]
568g918K453J6314l431k0411M906K2103o481k1260P697J8146q106j3257P459P326
582E540n651j226K810m301Q11Q441m660j0849Q279J1263j1159r756J2830O689
596I061j3074k601J1814j802r230N850N688q889j657J0480k244j0385N484Q619
610G114p604n388Q259J186p396L435N097p815j782J1396k074j3729N814J4515
624A1028q802j3705J0451J1499j0408q245Q528M438m913o29Pk773N672N332j1273
639c793o920J6157P502j9557p238K0983O377k0158n307J7088M340j2059l825N630
653g80L909J458m571q510N688J4742p043j9453Q250K2217q908k2813Q694K1267
667A4147p305j7883M701J3118r02p640l753K070Q867L020j3860p150J8102R968
$$ y = [-7918, -5465, 10849, 7418, -12993, -8087, 14016, 7535, -13725, -6028, 12118, 4012, -9245, -1786, 5540, -111, -1337, 1473, -2828, -2017, 6424, 1764, -9085, -806, 10457, -702, -10458, 2372, 9061, -4013, -6614, 5200, 3398, -5832, 18, 5706, -3183, -4840, 5640, 3396, -6989, -1505, 7114, -490, -5878, 2381, 3567, -3829, -394, 4703, -3112, -4894, 6502, 4428, -9301, -3487, 11028, 2226, -11479, -1028, 10471, 63, -8182, 346, 4784, -129, -758, -751, -3524, 2148, 7480, -3793, -10713, 5444, 12946, -6611, -13849, 7134, 13511, -6647, -11954, 5134, 9474, -2585, -6410, -780, 3129, 4587, 16, -8494, -2806, 11936, 4893, -14560, -6310, 15907, 6999, -15814, -7120, 14147, 6842, -11041, -6340, 6778, 5876, -1764, -5517, -3447, 5420, 8440, -5420, -12570, 5532, 15500]
681A5500k1011j1446K2089J1659k1093j0880J7977R482j2996p852O602O389N05
694D925n318p584M775J3902m692j8759M941K1643n183k2325N166K0812m612j7402
708i711L354J2545j293o976j445J281M627L847p926p878J0939J0460j3261j1418
722a2855J4502J0856j4426r018J2922O347j0055l340O134N55j560J661l219k860
736d356P458L063j0793k272J2790O89j3191J337J1939l374r307N018N678o008
750a329j580O139k467n243N764L574p918j356Q664j105p879L429N758n308k569
765c426O488j215o775M982O235q203n000J0410L291j1255j443J0563k22q423J377
780b616N084j865q73J522l650m15P861j188j1330L037J3668m733j4568N880J3999
$$ y = [15500, -5511, -16957, 5132, 16791, -4302, -15182, 2795, 12277, -719, -8571, -1969, 4420, 4925, -393, -7977, -3202, 10700, 6008, -12751, -7810, 13833, 8650, -13675, -8509, 12303, 7691, -9711, -6357, 6188, 4895, -2081, -3526, -2245, 2382, 6229, -1697, -9575, 1364, 11824, -1437, -12855, 1647, 12503, -1923, -10941, 1981, 8328, -1727, -5067, 1067, 1622, 62, 1723, -1496, -4356, 3102, 6165, -4628, -6900, 5890, 6579, -6612, -5275, 6664, 3290, -6017, -999, 4679, -1329, -2909, 3230, 763, -4480, 1284, 4858, -3060, -4416, 4248, 3143, -4736, -1307, 4451, -857, -3426, 3062, 1847, -4928, 54, 6289, -1914, -6914, 3496, 6787, -4468, -5911, 4652, 4430, -3993, -2616, 2468, 603, -270, 1252, -2398, -2813, 5048, 3860, -7470, -4433, 9235, 4502, -10066, -4186, 9813]
795I813o144j2059N303R051l290n445K82J605L461J954p405m955J1135P079j4085
810c700q249J5774Q525j5935q086J4409P152j1273o022O877M957j607m192l904
824e274L753R130l638j3504L773J6553l911j8000L872J7698l401j5786K340J2506
838F111o47q295j689L666M496Q51p469m834J0268P909j2532r808J3859J0494j3977
853a597j0050J2757Q753j0208o903O550M876k108l063k603J621P084p25j0808
867f424L74J3424n24j4600R43J4244j409j2455J677R481j572n771R93J771O5K107
883B324j591n240L281P418m962q420O390Q188p266o849P420M698o769k111N367
898A878n72l295K876Q03m498J748N160m007m812N632L596o447j665O300o30n256
$$ y = [9813, 3669, -8390, -3087, 5964, 2674, -2771, -2489, -884, 2577, 4531, -2874, -7829, 3306, 10385, -3700, -11949, 3825, 12350, -3585, -11671, 2738, 9890, -1383, -7405, -528, 4429, 2822, -1370, -5274, -1521, 7609, 3971, -9533, -5760, 10793, 6882, -11118, -7246, 10452, 7051, -8735, -6395, 6111, 5464, -2831, -4520, -854, 3642, 4493, -2976, -7810, 2458, 10367, -2165, -11973, 1886, 12380, -1597, -11647, 1110, 9863, -345, -7248, -698, 4178, 2070, -993, -3596, -1975, 5109, 4384, -6424, -6050, 7374, 6850, -7750, -6807, 7437, 6028, -6427, -4750, 4731, 3159, -2612, -1619, 152, 217, 2324, 733, -4507, -1226, 6192, 1230, -7190, -800, 7388, 122, -6727, 693, 5391, -1378, -3489, 1878, 1306, -1989, 887, 1690, -2808, -1060, 4100, 93, -4719, 913, 4509, -1938, -3603, 2697, 2067, -3189]
914c189L017L407n038j074O427j353o990L484O718m993n636N626L919n249j846
929b770L874l44j673K372j123l944M068M875o723n208Q750M987r845m308R781
944B769L385q499k432O160J660k951j205p86J138M604j455q022K011J0724k660
959D441j2380L170J2792l303j1988K908J0019j839p240J52L931K085n10m613k644
974e019P103N257r266p075J0736Q046j1280q165J0746P580r051o509O349N173
988D625k862l889j019K759M889j849q394J302J1115j028j2789Q90J3236p81j2421
1003f216N39J0457m4p582q17M199K009o08l452k731M967N485o370p412P478Q327
1019H229q014q253P846P257o865n660N140L736k847j722Q5k2K725J307n274j969
$$ y = [-3189, -172, 3235, -1803, -2877, 3550, 2197, -4793, -1309, 5409, 416, -5220, 406, 4325, -924, -2770, 1104, 760, -913, 1459, 336, -3608, 460, 5335, -1388, -6596, 2154, 7141, -2704, -7012, 2769, 6154, -2345, -4777, 1383, 3043, 92, -1113, -1899, -761, 3843, 2388, -5634, -3623, 7101, 4441, -7939, -4769, 8023, 4720, -7268, -4360, 5659, 3820, -3420, -3268, 663, 2748, 2238, -2375, -5019, 2084, 7341, -1925, -9000, 1736, 9782, -1498, -9663, 1083, 8663, -388, -6897, -548, 4625, 1763, -2126, -3145, -386, 4503, 2654, -5740, -4438, 6677, 5649, -7140, -6250, 6986, 6205, -6216, -5677, 4780, 4736, -2846, -3663, 536, 2545, 1937, -1515, -4246, 721, 6206, -164, -7576, -98, 8229, 215, -8038, -192, 7065, 200, -5460, -320, 3416, 569, -1153, -1068, -1090, 1635, 2942, -2332, -4301]
1035d301P246K034q434j594Q726P80q028J72O510j045m348J681J796j927Q18J693
1051A779l126j019M817J4n704J162N676k263m864L165L319l709j280L789r44l372
1067b560L020K518m623j379N526J42n598R99M815j830l276K254J175k147J202
1082B38J538l506n65N444o45o754J793P331k699p101L143O108k992m555K210K592
1098A580q20m69j019j547L086L213n067m395O712N075p766n216Q030M930p424
1113a097m304N921L526l674k769Q83K097K198j644n124J379P623j299r439J312
1128d411J0328j281j0219J080R135o15p189k01M687J365j884k775r26M290L382
1143D766n688n285O806O497p434o974P411O747o661n976N213M803l124l511O19
$$ y = [-4301, 2945, 4979, -3455, -5049, 3677, 4457, -3571, -3399, 3111, 2066, -2282, -601, 1195, -732, 86, 1779, -1347, -2366, 2451, 2465, -3239, -2077, 3599, 1336, -3528, -363, 2956, -753, -2033, 1756, 812, -2560, 460, 2978, -1645, -3024, 2502, 2644, -2954, -1955, 2860, 1030, -2246, 8, 1183, -964, 238, 1776, -1730, -2295, 3149, 2504, -4250, -2457, 4874, 2175, -4926, -1783, 4325, 1333, -3222, -1012, 1580, 760, 291, -728, -2275, 811, 4024, -1043, -5438, 1274, 6349, -1417, -6633, 1397, 6327, -1097, -5401, 520, 4046, 372, -2397, -1514, 583, 2781, 1137, -3987, -2608, 5015, 3716, -5723, -4411, 5917, 4636, -5583, -4503, 4632, 4017, -3172, -3373, 1314, 2679, 795, -1980, -2906, 1384, 4766, -922, -6207, 599, 7096, -338, -7312, 99, 6846, 185, -5791, -578, 4225, 1101, -2410, -1791]
1158a791K221K082j117m638K98O780K28q330m23R048M50q898l38P839L05o105
1174b389l78L843O45j272j152j238J818L423k601n000L324N857l894n985M200
1189g99N340m075m184L564K600k577q80J250p13K92J963j840k686L181K867m159
1205h56k504M638J703m546o13L876n58k745J635J279k457K86K901j760k887K888
1221B80K475l541j721L617P42l078L00K010j268n50K057j126k511K743K649m086
1237a008k459M923K026n151j444M686Q61l594l54J953L3M0J9k114J50M036n20
1254B083n534R55O478j329o784J548O381j442n392R82L922j52k117r90K23K310
1270A142J577l678l038M837M120n675m732O004M887n766m640M898M070l433l322
$$ y = [-1791, 430, 2512, 1395, -3243, -2945, 3835, 4063, -4267, -4690, 4358, 4808, -4090, -4428, 3411, 3716, -2389, -2767, 1076, 1721, 449, -703, -1941, -123, 3300, 699, -4301, -977, 4880, 986, -4999, -799, 4541, 466, -3718, -154, 2446, -131, -1011, 239, -474, -182, 1781, -59, -2745, 436, 3303, -856, -3360, 1278, 2981, -1565, -2178, 1698, 1140, -1605, 30, 1309, -1148, -862, 2039, 279, -2608, 280, 2755, -786, -2507, 1110, 1852, -1226, -926, 1084, -184, -734, 1323, 197, -2314, 429, 3078, -1008, -3467, 1456, 3482, -1669, -3113, 1573, 2434, -1160, -1514, 439, 472, 512, 531, -1583, -1433, 2603, 2083, -3451, -2496, 3982, 2653, -4131, -2583, 3798, 2356, -3036, -2054, 1868, 1716, -401, -1391, -1168, 1142, 2719, -959, -3997, 840, 4960, -715, -5447, 557, 5444, -322, -4962, -64, 4006, 573, -2749]
1285b749J515K492O85j707k923J051M944n56o510K38P479j7p750j36P259L39o131
1302b477o22M429J064k361j671J65K410J889l190l584L871M774m355n405M544
1317e19N425m299m961L641M094k563k949J129J749N07n92k183l41L681J004m873
1333b050j314N535J356n666j142N216Q16m267m35K864J27j226M2m76j5K013j98
1350A180l209N66L926j008m095J436L738j759k892J867J719j758l54J385r61q00
1366a019K055R6k784O28L057j271k846J693K216j868j234J705P8j272J134O10
1382I78k219J95L001r63l429J602L462j979l095K000K413j685j472R94M10k0O42
1399H35j124j547K269K211l250k607L942K721m224k576L983K255l254j820K097
$$ y = [-2749, -1234, 1258, 1943, 236, -2687, -1636, 3308, 2752, -3758, -3520, 3959, 3942, -3808, -3944, 3315, 3654, -2477, -3099, 1330, 2394, 33, -1638, -1473, 937, 2826, -364, -3948, -77, 4697, 342, -5063, -519, 4906, 607, -4354, -713, 3381, 818, -2131, -1002, 747, 1254, 662, -1521, -1862, 1819, 2823, -2050, -3364, 2171, 3527, -2139, -3281, 1935, 2751, -1516, -1951, 913, 1040, -186, -144, -620, -635, 1378, 1180, -2029, -1463, 2463, 1455, -2640, -1204, 2534, 775, -2117, -250, 1469, -289, -643, 742, -219, -1019, 1036, 1132, -1652, -1024, 2033, 762, -2084, -391, 1825, -43, -1277, 428, 506, -766, 368, 978, -1241, -1046, 1955, 992, -2437, -835, 2627, 648, -2447, -447, 1966, 281, -1191, -197, 213, 193, 835, -289, -1836, 433, 2644, -606, -3213, 729, 3450, -774, -3350, 633, 2888, -366, -2186, -89]
1414h9J389o14j003j044P31K689n93m110N53N161n69n681N46N670m21n144J30
1431b399M148L22k773r65J196J731L97k530j875L278L049l849l818M095M223m015
1447B15m217L533L878k668l245J463K449j4j603j511Q05K969j55m170l55N044
1463B418O49n439p80N290Q58m688q69L609R31k235j062O82J273Q70j581k208J883
1480c99L260k176l871K347M057k358l788K125L162j667k256R81J228j24k19p85
1496d83o74J663J326k416j675K915J728l101j524K975J096k515n46J761oq36N07
1513A95j66q60J131R96j891r36K383O86k526l32K315r7j755N04R32q07K6J001
1531G99j023j032J886R03k509o66K802L77k704j07K242r2j455J78M51j34O48m2
$$ y = [-89, 1300, 686, -317, -1361, -630, 2059, 1466, -2644, -2091, 3070, 2501, -3180, -2634, 3036, 2615, -2529, -2399, 1749, 2071, -702, -1667, -471, 1260, 1657, -873, -2748, 530, 3579, -270, -4088, 7, 4230, 215, -4002, -469, 3409, 741, -2504, -1041, 1408, 1394, -209, -1720, -915, 2054, 1899, -2271, -2626, 2418, 3067, -2372, -3152, 2138, 2996, -1692, -2561, 1048, 1979, -256, -1318, -636, 637, 1507, -74, -2282, -399, 2861, 685, -3186, -839, 3218, 860, -2928, -803, 2359, 692, -1564, -583, 645, 521, 302, -483, -1157, 506, 1832, -584, -2259, 656, 2384, -717, -2241, 734, 1830, -685, -1231, 530, 524, -312, 195, 29, -831, 300, 1296, -595, -1531, 852, 1538, -988, -1320, 995, 898, -857, -353, 579, -228, -202, 799, -224, -1256, 630, 1533, -976, -1642, 1160, 1537, -1167, -1274, 968, 876, -579, -401, 50, -84, 564, 522]
1549E22j696L14K582n98l194Q31L461r51l374R08K929o52k237K17J310L93l06
1566D59j105o94J851J556k497k202K974K624l192k780L089K696k648k409J860
1581d18K008p98j555m02J087J660o91k818L64L722r4m315r9M504K68m253m74L615
1599A311P08k655r82J452J337j76j703j065K061K109k321k913K486L375k456l495
1615b927K216L273j719k806J048K141k25j376p13O14J653M5k457n77L071R30l422
1632a231j123L483J126l160j050K542R19j699p61P00O35L55n74j351N99K123o57
1649H76k620P32K795p83k654P84K212p06j545N11P43k23P7j24q08M93J375q35
1667C00j695J095J788j258j584J249J186j084o33P68Rl37N95j67j092O49J434
$$ y = [522, -1174, -860, 1722, 1124, -2070, -1239, 2222, 1271, -2103, -1195, 1734, 1082, -1155, -938, 372, 765, 459, -646, -1340, 511, 2067, -430, -2632, 342, 2966, -226, -3006, 83, 2779, 131, -2278, -418, 1590, 792, -763, -1165, -78, 1582, 891, -1927, -1563, 2159, 2065, -2250, -2349, 2155, 2423, -1830, -2304, 1311, 2019, -636, -1618, -166, 1171, 995, -708, -1773, 288, 2397, 76, -2837, -351, 3024, 568, -2927, -711, 2562, 843, -1963, -915, 1226, 1001, -375, -1088, -474, 1179, 1224, -1233, -1810, 1261, 2191, -1231, -2354, 1129, 2255, -905, -1955, 587, 1506, -193, -954, -254, 381, 736, 162, -1189, -590, 1533, 876, -1744, -1012, 1783, 1000, -1654, -870, 1342, 636, -909, -398, 345, 122, 199, 75, -733, -240, 1135, 300, -1395, -300, 1488, 230, -1354, -105, 1081, -3, -636, 132, 141, -196, 399, 232, -860, -211, 1223]
1684A223j046j592J313J538j384j298J228R16q69m51L32l8L07N01r88q51J589
1701D30J094k045j201K278J192k226j107J914R61j342p77N65N94L51m90j217L68
1718f58K017l22k626K71K974j91l048J04K784J07k301l61J609O77p57j064j24
1735i09J444R68j795j687K073K174k147k497K091K565j829k396J318K089o55j652
1751h45j39J150R89o43j807J94K474K08k960m95L168O96l067q34K681R36k053
1768c47j010J251J054l10j136n92J178J415j235k037J218K460j179k612J052K499
1784A669q23k164M90J664q7j040l72L89Q46K08j286o95J644J043j867j212J905
1801C12J239j775j104J462Q61r71n97L94K99K25m5q05j53J303K45j625k73J757
$$ y = [1223, 177, -1415, -102, 1436, 52, -1246, -18, 898, 29, -422, -90, -128, 179, 680, -308, -1159, 430, 1524, -521, -1722, 556, 1748, -478, -1585, 329, 1290, -52, -829, -264, 330, 681, 191, -1026, -658, 1359, 1037, -1589, -1318, 1656, 1465, -1583, -1479, 1305, 1412, -889, -1250, 359, 1036, 279, -785, -909, 535, 1503, -292, -1979, 94, 2268, 121, -2376, -285, 2280, 451, -1945, -627, 1462, 807, -845, -984, 166, 1155, 512, -1295, -1101, 1373, 1581, -1379, -1874, 1294, 1990, -1077, -1911, 770, 1706, -347, -1357, -106, 948, 638, -498, -1090, 88, 1503, 268, -1769, -551, 1909, 730, -1882, -830, 1669, 846, -1318, -828, 836, 749, -291, -663, -274, 572, 780, -506, -1201, 443, 1486, -381, -1593, 312, 1551, -224, -1328, 134, 995, 24, -573, -179, 120, 345, 300, -505, -658, 645, 890, -735, -1008, 749]
1819G49K10j641j43J348L5q76N9L04j08K91J23q25r5J249L8j515M3J556q5j412
1839f95J10J077q2o12J3M9J16N21k81j026M33J421n47j681O36J723n96j609M82
1858e48J302k18r10j04L99N03J13r05n83J275R67j551j259J693J399j635j434
1875a496J410J353j003j170M47R44J98p09q52M64J461k31j974M4K287J39k405
1892a093k82K280M63j983o11J476P87q59r58J57J116N34j252j143J337J632j358
1909B43j949J272K087j091k020P88J784l62j420j43R88O48n08j142O1J567L33
1926A136j866o23K004Q28j973r33J758R48j384q97Q43Q41k74p26l43O20R10n36
1944C33j354M47J650l73j768L03J711k04j481O8J132P7o67k59J69M55K85o13o87
$$ y = [749, 959, -682, -825, 523, 558, -318, -259, 45, -63, 228, 351, -474, -569, 680, 718, -797, -754, 802, 717, -695, -585, 492, 410, -202, -189, -140, -24, 497, 216, -810, -377, 1044, 497, -1184, -548, 1175, 579, -1030, -548, 754, 536, -374, -478, -79, 424, 537, -368, -951, 324, 1291, -260, -1519, 174, 1573, -62, -1496, -86, 1267, 264, -906, -459, 485, 683, -26, -878, -414, 1047, 816, -1158, -1114, 1173, 1312, -1093, -1375, 905, 1368, -615, -1226, 250, 1037, 178, -780, -623, 493, 1027, -225, -1368, -31, 1601, 243, -1706, -434, 1653, 562, -1458, -670, 1114, 752, -668, -811, 177, 825, 317, -825, -764, 803, 1136, -730, -1353, 651, 1479, -494, -1427, 331, 1279, -105, -1002, -159, 682, 408, -318, -661, -41, 869, 333, -1021, -574, 1076, 703, -1065, -762, 949, 745, -736, -668, 464, 541, -126, -385, -216, 239, 524, -89, -776]
1963g76P69R62q57j113Q63J121p96r73O15P37l76m16P1Q9K40K20n49m70P89O58
1983H08r45p26R77P18q90o09O67M38l48k44l7M5M14J53p87k93J081L91j244m60
2003h91J273M83j149m68Q75M48m93m36M9M19M09l90q38L56J220l29j448K52J566
2022I08j71j510L0J295J41r63l57N59N73q7q14l57J026P44j162j063J217J257
2040A266j148j342R72J322o98j177L10R87J22p36n80M66J036k40j379NJ615K00
2058A001j727l73J694M99j490o23J166P11p33p95K40Q43K65q62p28Q52J119q07
2076B52j379P14J499n53j493L73J319j15j065j58P37M23l49o95k4R48L38j116
2094c44n61J160P44j156q17J028Q05p87p31M64N97j08m49k51K90N93j41q83M5
$$ y = [-776, -7, 955, 98, -1015, -152, 969, 173, -800, -185, 552, 176, -240, -169, -80, 160, 380, -169, -639, 150, 808, -137, -863, 114, 832, -58, -667, 0, 438, 90, -154, -191, -146, 268, 421, -366, -659, 422, 813, -431, -891, 382, 865, -284, -752, 123, 571, 78, -358, -309, 110, 519, 129, -709, -353, 867, 538, -910, -658, 908, 737, -773, -743, 552, 693, -270, -627, -68, 505, 418, -396, -753, 273, 1017, -145, -1208, 9, 1266, 118, -1224, -252, 1070, 372, -805, -495, 492, 614, -122, -702, -236, 800, 560, -819, -814, 801, 1001, -726, -1099, 595, 1094, -396, -1019, 147, 858, 125, -670, -430, 413, 678, -184, -912, -60, 1059, 252, -1127, -413, 1086, 533, -960, -587, 732, 617, -448, -606, 131, 554, 205, -490, -514, 434, 772, -344, -905, 255, 999, -157, -974, 54, 859, 72, -659, -195, 402, 294, -155, -406, -116, 477, 336, -547, -502]
2113e02J053M5j112j25J078J59q96j94O32K26l20k47j3K54L53k70o41K75Q25k56
2133C24r17K18R06j59p65M7N69N2k81j78k9L14L17m26n57M94P51n31q51N09Q35
2154F42m00p54K31O02k1l96k29J57M85O7p01k68Q73M38r73n46R63O27q61o53O50
2175f7O52l71n96L1N23L17m18o48L06R43k07j148Q3J241M5j221j79J073L21q42
2195a62m55N26N86j77o93j91P77N22q23p89Q23R96p61j084O12J090m11j014J71
2214d57Q60J12o43m10M14O94j88r24m9J075K54j168l92J143M85r88n71P67O13
2233F27m86o12J47N83K06n35n22M77P74l91r50K82J050j76j023M5R11P8p10k16
2253d41M56L50j70m63j06N50L47o07n29O15O52n75o90M74O53l30n51J37M32M5
$$ y = [-502, 551, 596, -516, -641, 437, 596, -300, -494, 138, 364, 44, -203, -216, 38, 391, 121, -520, -245, 580, 324, -593, -375, 531, 372, -393, -346, 223, 275, -6, -184, -213, 101, 418, -8, -565, -71, 680, 149, -702, -193, 642, 242, -512, -281, 321, 300, -96, -325, -168, 317, 384, -317, -585, 288, 726, -247, -793, 170, 797, -64, -717, -67, 585, 214, -382, -351, 172, 489, 71, -577, -271, 672, 465, -683, -600, 641, 686, -535, -714, 359, 680, -162, -617, -91, 495, 318, -375, -566, 211, 733, -90, -879, -56, 940, 179, -905, -293, 797, 386, -628, -457, 403, 515, -128, -538, -124, 570, 382, -542, -591, 484, 738, -430, -822, 321, 806, -182, -753, 14, 627, 141, -471, -324, 259, 465, -70, -592, -115, 659, 268, -682, -400, 650, 474, -549, -504, 407, 485, -225, -441, 15, 365, 195, -268, -374, 176, 523, -84, -613, 2, 654, 79, -611, -137, 516, 186, -365, -228, 204, 249]
2273B49k52k67R1M47O4n87j95O85K71o80l57O30L67m84l65K87L33o0k62j73J86
2294g2L93j05n76K3P01N5p42j21P05J80n82k40M02K83j74l25q7L59L26l76n21
2315d94L49O82l09p76K45P90j48p23LO08J34m09l06K04M73ln89k12O89L79p16
2336a29n27O95O14n86o70M49O43k37n83k1N00K65l78n05K54O99j19q48lR19J16
2357E48q89k49P96L53o38m24M09N02j60n32j10N58L49n54n57N13P08m45q02L45
2377b79Q18k11p46M5O25J46m83l03K64M85r7o08o9O87K49p30l50O74M47n87m84
2398e07M24M89k49m41J9L95J95l14l93K20N47j31o36L4O78M8o40j40N53K06m12
2419e5k53K27L03k2l28j50L09L35l20m40K73N30k40n33J44M93m2m10o9K97J64
$$ y = [249, -3, -270, -179, 268, 332, -255, -450, 235, 506, -174, -531, 99, 466, -18, -383, -96, 237, 177, -85, -258, -72, 321, 216, -360, -337, 364, 419, -323, -444, 261, 441, -141, -381, 21, 304, 130, -195, -282, 77, 403, 27, -494, -145, 537, 228, -548, -303, 487, 339, -384, -381, 227, 361, -48, -354, -150, 323, 320, -269, -481, 208, 587, -129, -656, 39, 653, 67, -603, -154, 489, 252, -331, -352, 148, 413, 35, -470, -216, 483, 364, -484, -487, 432, 548, -341, -590, 206, 559, -79, -503, -94, 408, 248, -284, -394, 164, 513, -41, -598, -85, 623, 178, -624, -279, 539, 328, -418, -373, 252, 398, -85, -388, -124, 361, 264, -344, -413, 274, 523, -207, -557, 117, 564, -23, -507, -83, 406, 157, -284, -265, 130, 325, 11, -382, -162, 385, 254, -382, -348, 330, 378, -262, -402, 151, 357, -55, -308, -81, 222, 200, -128, -278, 31, 366, 46, -394, -121, 409, 169, -364, -220, 273, 231, -179, -248, 49, 213]
2440B13j38k83j6L82J44m20k74M43L50m03m16L43M24k16m01P3L34R4k67k42J62
2461a14L98n9n03l9N56J32n65k14N19K87m25l40K78L62j00l72p4L58K46l13m22
2482d04K86N39k30o18J40O29k7n99p2N06J95l83k93K09L84j3m83j31N21K77n23
2503i0m04M93M85l97n38K71N31j15m88n0M08K20l15l75K10N00q7n99oO23J23o07
2525b07k24N41K94m28l53K72L89r9m07o9L80K52l58l86L10M90k49n43J64N50n9
2546B60n09n3M14J63k89k64J64L42j2m09j21M38K19m10l24L74L77k94l88J77L79
2567B34n8l21j02K67K14j84l05Q6L80Rm38p3M38J53m00k15L38K41k20k59Q1K74
2589A40O3k75j89K36L05j83l82J22M26o3m16k6L79R8l03j70J92K45o7k99o1L31
$$ y = [213, 75, -208, -224, 158, 302, -118, -392, 51, 401, -2, -418, -75, 349, 133, -268, -195, 139, 233, -34, -276, -114, 284, 225, -278, -317, 239, 371, -194, -408, 111, 398, -27, -367, -89, 273, 173, -199, -273, 85, 331, 18, -404, -118, 421, 191, -427, -287, 342, 315, -284, -356, 150, 345, -38, -331, -122, 262, 249, -234, -365, 156, 433, -90, -494, -1, 484, 87, -451, -180, 351, 236, -252, -302, 106, 326, 11, -364, -154, 346, 259, -340, -346, 277, 400, -207, -431, 110, 404, -24, -377, -105, 284, 185, -222, -291, 89, 341, -17, -403, -93, 397, 148, -395, -231, 319, 260, -249, -302, 112, 275, -14, -278, -114, 228, 216, -193, -314, 124, 343, -67, -391, -17, 360, 66, -322, -145, 234, 176, -145, -247, 20, 234, 50, -255, -169, 211, 220, -218, -291, 147, 300, -100, -315, 23, 264, 44, -215, -134, 140, 203, -72, -261, -25, 280, 97, -285, -163, 263, 200, -216, -242, 137, 235, -68, -238, -46, 199, 132, -167, -228, 103]
2611A03J78l27k85L10L39k46l78J53M02p2l62m5L06J63k25k54J16L58k0m27o9
2632b82M52J50m34k30L81L03k95l39J86L53p0l30q8L12K21k74l33J97M31j33m75
2653b97N8M76N1m68j20L81K02k86k69J47L50l0l64j12L71K34l57l16L11L83k40
2674A05m12J38M10l3l67r5L11J94k20k87J22L78l2m06o8M21J47m19j99L30K63
2695B81k35l00J37L04k4k94j07K71K18k26l05J80L50r6l86K3L82N8l41j24K56
2716B2J90j64k28N0K70O3k98j44K80K37k53k95J91L25j27l17L6K80N1k32j41J67
2738c7K19r8k69J3L09P0l25j31K94J97k51k32J84K51r2k47j3K34J25k12k08J58
2760f1K75q7l35K5L53L8l33j05K97J60k12k16J06K66j7k82q1K60J95k63k66K23
$$ y = [103, 281, -46, -331, -21, 318, 72, -306, -153, 249, 177, -185, -230, 76, 239, 14, -240, -124, 234, 214, -213, -282, 170, 320, -114, -344, 37, 340, 45, -294, -108, 245, 175, -155, -243, 69, 290, 16, -317, -120, 311, 178, -297, -239, 237, 288, -180, -300, 81, 283, -3, -272, -125, 225, 195, -169, -281, 90, 324, -33, -349, -38, 345, 105, -307, -169, 241, 208, -159, -254, 57, 251, 31, -256, -134, 244, 212, -194, -262, 159, 306, -113, -312, 18, 281, 46, -254, -117, 187, 163, -131, -238, 33, 251, 25, -280, -100, 250, 154, -232, -209, 173, 231, -110, -234, 22, 212, 48, -180, -130, 140, 203, -95, -239, 41, 278, 25, -270, -79, 246, 119, -198, -162, 118, 169, -63, -204, -37, 182, 84, -185, -172, 137, 207, -118, -249, 45, 242, -9, -241, -57, 194, 102, -145, -158, 76, 201, -11, -219, -61, 214, 127, -208, -183, 170, 208, -125, -230, 67, 227, 15, -201, -95, 171, 154, -128, -209, 51, 246, -17, -283, -60]
2782f0L12j49l48R4L25J2l17r1K55J85j99k46J20K93j4l33o1L35J47l14k13K65
2804bK57k04k76R9K99Kk82j00K50J87j99k70J40L23o4l64%L54P1l14j42K53J89
2827B07j66k47Q3K67L2k87j12K68J87k35k51J92K91j18k93M5K82L0k56j10K04
2848A3J68j34k22N5K78J0k87q6K77J48k43j98J90K24j20k42M5K29M3j95j35J65
2870a7J98j16k52O9K68J2k99n7K58J10j95j63J48J98o1k17k5K12J07j98j81J78
2892b3K31j38k63Q5K58rk50m5K15J04j54j76J02K06m6k19n1K63J08k48j44J85
2914iJ96j39k27Q3K27nk10p8J89J56j55k04R2K49k7k85j3K73Q6k58j32J93J94
2937A96j37k17N5K18L2k42r1K24J61j84k21J27K60p9k70K1K62M6k29j08J79J69
$$ y = [-60, 252, 103, -245, -151, 174, 186, -131, -222, 33, 218, 19, -227, -107, 186, 172, -161, -222, 113, 260, -54, -267, -2, 255, 51, -225, -126, 173, 175, -107, -207, 43, 230, 31, -239, -99, 224, 160, -204, -204, 150, 221, -93, -235, 18, 207, 41, -206, -123, 144, 176, -111, -223, 45, 232, -3, -254, -62, 229, 111, -182, -137, 145, 175, -81, -191, 13, 181, 47, -175, -120, 158, 168, -119, -205, 72, 220, -23, -221, -31, 193, 73, -169, -124, 105, 148, -47, -182, -17, 181, 65, -187, -118, 150, 162, -137, -194, 64, 174, -21, -184, -36, 162, 101, -116, -141, 71, 178, -20, -201, -23, 208, 70, -193, -108, 150, 141, -109, -154, 61, 165, 11, -165, -63, 143, 97, -122, -173, 90, 198, -50, -194, -9, 187, 48, -179, -96, 131, 126, -84, -162, 27, 183, 28, -176, -84, 165, 138, -147, -160, 113, 199, -59, -191, 2, 196, 59, -158, -103, 115, 147, -95, -186, 38, 199, 15, -206, -79, 181, 102, -168, -147, 115, 161, -68, -176, 3, 172]
2959A72j33k09O6K30K2k45r2K49J39k09j80J58K14j14k14K7K30L8j96j18J68J58
2981A61j09k19P1K32Mk55n4K32R1j80j44J42J74q4j92J6J90M9j78j11J60J71j33
3004C4k03Q5K17l1k17k0J92P8j56j21J14J53m0j92j5K02O5j91j24J72J53j34j71
3027a50Q5J95l2j86l8J63Q9j25j47P4J90l8j93k0K13N3k02r3J78J25j13j62N9
3050g5J88Lj81o7J65J18j29j84J12K01o8k10QK16L3j87q4J54J15j05j54M6J86
3073A01Nj86q0K00J18j79j46J24J78q6j74K6J82M3j79r3J42J37q9j86N7K09Ok29
3097i9l1J98Q6j74j24J31J50p5j85J8J92K5j67r2J62J32j32j66R3J82m0j95jJ83
3121G1N3j62r6J06J43o4j70K8J67L0j72p5J63J24j42j39Q8J54l8j64NJ39N7j15
$$ y = [172, 39, -170, -104, 126, 148, -97, -189, 60, 199, -10, -190, -32, 182, 68, -146, -119, 111, 149, -47, -165, 3, 161, 52, -167, -96, 136, 140, -115, -169, 63, 154, -26, -170, -28, 146, 62, -130, -114, 76, 125, -53, -164, -4, 167, 34, -169, -84, 133, 102, -115, -135, 57, 135, -21, -142, -28, 125, 85, -107, -122, 80, 145, -46, -170, 2, 155, 21, -150, -65, 130, 98, -88, -126, 37, 126, 1, -146, -72, 118, 80, -113, -133, 80, 133, -69, -162, 16, 141, 28, -134, -75, 113, 116, -65, -132, 33, 151, 22, -162, -50, 151, 83, -127, -119, 97, 130, -57, -141, 13, 128, 23, -131, -85, 101, 106, -80, -160, 40, 158, -21, -167, -43, 135, 49, -125, -99, 83, 126, -53, -146, -4, 133, 44, -142, -85, 124, 130, -99, -130, 68, 154, -20, -144, -13, 137, 62, -123, -105, 87, 112, -55, -147, 15, 147, 15, -151, -58, 124, 84, -111, -112, 71, 124, -38, -134, -28, 115, 51, -119, -91, 76, 106, -66, -141, 22, 146, 4, -135, -47, 107, 69, -95, -90, 49, 106, -9]
3145ij12R0J42o0j55J3J73K7j72n1J39J01j35j05P5J31j5j58k6J39O8j14j19J05
3169b8J40o6j54L5J56Pj48m8J33P4q6j23O1J39j3j43m4J53P4j38j07J01J34o8
3193D1j56M5J31J6j34n5J01J12q0j46M4J68Jj74k7J53P3j45r8J14J14n8j44K7
3217g7J36L2j35p2J14J16r2j42O4J60l6j53rJ59L7j39q0J09J10o6j29J1J40K9
3241H7j36p8J46J10j33j20Q4J40m6j37oJ47L7j27q6R7J30o9j37K9J58lj49n1J40
3266B7Q3j27r4Q9J11m0j26qJ45M2j32p4R7J14q1j35N3J34j3j44k0J39L9q9q2N6
3292c6R9j4j30lJ23N3j18p9J00R9p0j18N8J10j0j22k4J06N9p9q5N1J11l0j23l
3318g5J28L3j30n5J00Q9p9r9L1J05J1j09m3R9P0p4j07O4J35n2j16JJ20K0j10l8
$$ y = [-9, -121, -31, 111, 51, -104, -91, 82, 109, -63, -114, 25, 126, -9, -114, -39, 92, 77, -81, -107, 32, 100, -14, -133, -28, 112, 46, -108, -73, 83, 90, -58, -106, 27, 101, 15, -108, -47, 92, 79, -64, -108, 45, 119, -19, -126, -25, 109, 41, -115, -70, 61, 77, -57, -112, -11, 101, 21, -125, -81, 87, 88, -86, -113, 40, 113, -32, -130, -16, 98, 40, -104, -77, 59, 91, -44, -116, -2, 114, 22, -120, -56, 104, 68, -85, -94, 65, 102, -37, -117, -8, 102, 36, -93, -82, 58, 87, -49, -127, 19, 129, -4, -124, -40, 100, 54, -83, -89, 58, 95, -32, -118, -21, 109, 40, -97, -68, 90, 87, -62, -113, 27, 110, -17, -111, -22, 89, 49, -77, -85, 60, 102, -30, -104, -7, 107, 26, -109, -56, 78, 65, -79, -99, 40, 79, -10, -92, -36, 63, 49, -81, -84, 39, 92, -26, -105, -5, 94, 24, -94, -36, 74, 64, -58, -82, 24, 83, 4, -81, -30, 81, 51, -72, -75, 53, 86, -44, -99, 1, 90, 11, -88, -57, 48, 59, -50, -93, 6, 76, 2, -105, -41, 94, 42, -74, -73, 47, 67, -43, -81]
3344h1P8P8m1j11K5J13J2j14n1J11P4j01q5O1J07l6j13NJ16K6r7o3O8R4n6j12
3370i3K7J34Qj46k1J22N9j09p8P5J05n7j08K0J05K5r6n9R0R6p8j12M2J31j3j26
3396e7k3J18M6r9o3O8R5n2j13J6J16K0j07n6J00Q1r5r2N5J12k1j15j0J12L7q9
3422a6p1P0R1m2r6QJ04L2j25l2J04M9q3p5O3Q9l9q6mR1M1q7o5O2Q5m1r8J8J16
3451F3j2r8k5Q4N0p1n6L3Q6j6q6j3R0M1p9o9O6R8o9r9L7R5Jp8l3P7M6o2o7M2Q5
3482F1j8r0k5R8M6r3n8Q1O3n3o1NQ8Mq5l0O8N5n3p8L3J07k3r3j8J12K6j00l2N2
3512a1P1l7p5kR2K7j00m0Q6P5p6q1N8R6l8j03JR1L4q3n5O9P6o1p4J8J02Mj09l9
3542h4R6N7q3o3O0Q0l1j00K4P9K6p6n6O5Q4o8r5M9J08j8j08lR6L2r8m6O3P2m1
$$ y = [-81, -3, 75, 34, -77, -52, 61, 73, -41, -92, 19, 93, -8, -93, -32, 75, 39, -74, -69, 47, 73, -24, -87, -19, 75, 19, -93, -66, 68, 76, -70, -91, 31, 90, -19, -97, -22, 83, 26, -82, -62, 43, 68, -28, -87, 3, 99, 21, -91, -49, 82, 69, -57, -80, 38, 84, -15, -78, -10, 85, 33, -80, -64, 52, 72, -35, -91, 9, 90, -5, -97, -42, 70, 49, -66, -76, 36, 73, -16, -87, -17, 74, 32, -64, -56, 48, 80, -45, -77, 27, 76, -7, -82, -19, 70, 31, -55, -59, 32, 73, -14, -79, -17, 68, 27, -71, -53, 63, 51, -47, -72, 12, 62, -9, -65, -32, 54, 38, -48, -61, 29, 70, -9, -78, -12, 86, 17, -82, -45, 50, 51, -27, -60, 17, 63, 1, -66, -24, 61, 43, -47, -72, 26, 72, -21, -79, 2, 65, 12, -49, -44, 44, 48, -37, -67, 1, 56, 3, -75, -42, 65, 42, -51, -69, 43, 69, -31, -63, -11, 60, 23, -52, -54, 38, 65, -35, -75, 11, 86, 10, -71, -13, 83, 45, -58, -57, 34, 68, -15, -70, -1, 75, 14, -60, -42, 60, 64, -45, -84, 12, 69, -14, -77, -17, 63, 32, -68, -44, 35, 61, -15, -71, -6, 78, 10, -85, -36, 72, 54, -54, -57, 39, 71, -27, -73, -10, 62, 21]
3571B1p6pR5K9q5n8P7O9p3o9N4Q2k3r4OO8M2p5m7N1P0k9p7RQ3J0r0k6P4O4o5p8
3603f8M9P6j2q4KN6L2o1n1N1O8m1o7kR1J5j00k0N9N9o4o4L9P0lo8l0P2N5o9o9
3634g9N7Q2m1p4K1O0J5o2l3P0L0l7o3K1Q3pq5j2Q0L4p2n9N8P1l9o9J2O8No5l9
3665f9O0O0m5o9K8Q5j0r9jQ9K7p5l9N9N0l8o1J5O8K5q8l2P1O1o6p4M3Q1j7r4J7
3696c8P6J3q3m0O5O2l8q3J4R3J0j00l0Q6O4p6o1N5N8l1p3MP6K4p0m0O0P0n2p6
3726f1J9Q9nq1j3P6K9o3n1M6O5j7q7NO8L3p4m6N8O8o3o1K7Q5rq4j6P4L7n1n9M0
3758b2P0k0p0NP1J5p0l4O3M3m3n7K6O5j3o8j0O1L4m6n0K5N8j2o5%P5J1o7l6N4
3789gN0n1m8K6N6Ko0l1P3L3m9o3M9O5k1o6NP1Lm5m4N8N0n1m3QP0mo0l8Q1M6p0
$$ y = [21, -55, -62, 33, 62, -23, -81, -4, 65, -8, -77, -23, 59, 36, -58, -52, 16, 58, -17, -64, -13, 57, 28, -49, -40, 43, 53, -37, -63, 11, 75, 10, -68, -19, 57, 45, -39, -37, 19, 51, -10, -61, -10, 58, 17, -50, -52, 39, 54, -46, -66, -7, 52, -12, -76, -37, 33, 30, -38, -68, 4, 59, -10, -79, -22, 60, 19, -55, -34, 26, 41, -21, -54, 16, 46, 9, -54, -33, 50, 43, -42, -54, 26, 60, -12, -71, -13, 58, 19, -50, -38, 30, 35, -30, -69, -9, 51, 6, -63, -35, 50, 40, -59, -60, 29, 56, -19, -58, 1, 51, 13, -48, -33, 35, 60, -28, -60, 11, 72, 6, -68, -25, 56, 39, -55, -38, 38, 51, -32, -72, -7, 55, 17, -66, -52, 41, 51, -49, -79, 7, 71, -5, -66, -11, 47, 16, -57, -53, 23, 47, -23, -63, -3, 67, 15, -61, -42, 47, 42, -39, -52, 24, 53, -10, -61, -15, 50, 33, -54, -49, 19, 52, -22, -68, -10, 58, -5, -66, -39, 46, 37, -47, -63, 11, 48, -3, -62, -22, 48, 28, -42, -37, 34, 49, -21, -55, 8, 51, 8, -49, -23, 42, 29, -39, -49, 12, 46, 0, -50, -25, 33, 21, -44, -44, 31, 42, -25, -61, -7, 43, -8, -56, -30, 26, 28, -32, -63, 10, 43, -6, -69, -20, 45, 24, -42, -37, 34, 37, -8, -52, 6, 56, 5, -38, -30, 40, 36, -24, -62, 19, 65, -5]
3822eo0M8P2k8p3PO6J4p5k9N9N7m0p7K6Q0Nq2k0P6L8o7m2M8M9k5o8J5O2K7o0n7
3854e9P5M7o0o2L5O9j3p4j0Q8J2o4m0M5O9l8p4NQ7kp6k0P9M7p2m8L6O3j9o6oP3
3886B7K0n7m2L8P1l8o4J7O9Pp0k0O0L5n4n2N0M0j0o4kO1K6o2m1M6N9l4o4J4O1
3917B7Pp6nN5L3m9m4K2O6j6n5jM9L8o0l7M7N6k8p5K0O6J0o2k3L6M9l5n4K3N7j0
3949C1o9j4P1K6o1l5M7N1l0o3LO5J2o7k9N0O1n2o3M7O9k1o8nO8J4n0l6M0O2k7
3980B7o5J1O2Ro7l2O1N1n2o1M0O3m1m9nO1L2n5m5N0M4l5o2K1O4J2p4j9N4N0n9
4011in2M6N0j8o0MO8J9o5l3M5N8l4p1K3P6j2n3m0O8L5n8m6M0N1j3o6RN1L0n8m5
4043f0M9N3l0o6K1O7j0n6j2O7K5o1l2K2O6j2o3oO4K1n6m2N1M7l8m3J4N3Mn6k6
$$ y = [-5, -65, -17, 55, 27, -46, -39, 27, 41, -34, -63, -4, 53, 13, -64, -38, 42, 47, -35, -55, 21, 59, -8, -50, -2, 47, 22, -46, -31, 31, 58, -2, -59, 16, 63, 3, -59, -24, 45, 32, -42, -52, 36, 48, -16, -56, -11, 58, 20, -54, -49, 38, 36, -40, -60, 19, 66, -6, -54, -18, 45, 26, -40, -46, 27, 47, -10, -52, -14, 57, 19, -45, -28, 41, 48, -22, -42, 18, 53, -1, -53, -3, 37, 27, -37, -39, 22, 48, -14, -55, -9, 50, 16, -48, -34, 27, 34, -42, -47, 8, 41, -8, -52, -30, 36, 20, -35, -36, 13, 51, -9, -46, 1, 57, 29, -46, -26, 40, 50, -12, -35, 1, 50, 15, -39, -16, 41, 31, -38, -52, 19, 45, -16, -51, -4, 47, 17, -46, -43, 22, 34, -33, -62, -12, 49, -3, -66, -19, 50, 29, -39, -44, 24, 38, -12, -48, -8, 54, 27, -38, -27, 35, 44, -23, -55, 6, 57, 5, -56, -16, 47, 6, -43, -48, 13, 45, -10, -55, -5, 39, 4, -58, -37, 27, 39, -35, -54, 0, 50, -9, -61, -15, 35, 17, -43, -39, 29, 48, -17, -50, -5, 53, 19, -52, -29, 47, 35, -18, -58, 10, 45, -13, -59, -19, 32, 19, -47, -38, 13, 43, -15, -60, -11, 42, 12, -54, -33, 34, 24, -32, -44, 23, 48, -13, -45, -23, 43, 31, -32, -38, 26, 47, -9, -51, 0, 47, 9, -34, -20, 33, 37, -19, -45]
4074d5N9K4m1m7L6M1qo5JO6J6n9l0M8N2m1m1JP1om3l9O0K9m2m3L9N6l2n5MO4J4
4107D4o4k6N6L6l4n3RO4%n5k7O6L4n7n4M9N0j6o4JO2Pm9l5M9N5m2o3L2O4qo7o
4140d2O0L3n0l9K8M6po7jO4J4n5l0M5M3k8o9L1O2j3n6j5N6K8n2m6M2M9j4o1KO2
4172B0J9o0k8N5L1l8n2K7N7on9nN3M4o2m4M4M6j7o7OO7J4o3l6O2L4l5n4J1O5N
4204C4o0k1M8K6m7k9K9O2k9n9RO6Jn6j8N1L2k8o0K6N5nm9j6N6K7n5k7L4M4j7o2
4236c8OO1On7k1M8L7l8m1JO4qn7qN4K2l9k3J9M2j9m4kN2J7n1j4L1K8k7m6K7N1
4269C3No7j3N6J5l1l6L3M9l1m2JN7J4o0l0M5M0l8l1J5M2j3m4j6N1L3m8l9K6N5
4300C1k0n4J2N2Mm8j8M4M6m3m1K1M5Po2%M2K1m5l2L4M2j8m6%N1Rn2j8M0M0m0m2
$$ y = [-45, 14, 38, -3, -50, -14, 27, 19, -46, -45, 21, 37, -22, -52, -4, 48, 7, -34, -33, 38, 32, -11, -50, 10, 39, -3, -46, -7, 49, 17, -38, -34, 30, 44, -20, -46, 10, 46, 12, -41, -32, 32, 32, -23, -50, 16, 50, -7, -61, -12, 38, 22, -42, -41, 21, 28, -21, -56, -7, 48, 6, -57, -25, 39, 31, -36, -42, 18, 51, 1, -38, -10, 36, 29, -38, -39, 25, 39, -16, -46, -1, 42, 14, -55, -24, 38, 25, -31, -46, 10, 38, -14, -60, -18, 31, 17, -44, -42, 20, 39, -21, -49, 6, 37, -1, -53, -26, 31, 25, -34, -39, 14, 58, -4, -48, -4, 42, 25, -42, -36, 31, 45, -18, -54, 8, 42, 7, -47, -36, 29, 34, -26, -47, 1, 27, -20, -49, -20, 42, 13, -46, -37, 29, 30, -26, -44, 7, 39, 11, -49, -23, 32, 27, -22, -38, 18, 45, -10, -37, -3, 41, 24, -38, -32, 29, 35, -22, -43, 5, 42, 4, -37, -36, 28, 20, -37, -45, 9, 31, -8, -31, -12, 30, 11, -33, -35, 17, 34, -17, -31, 0, 28, 1, -45, -18, 33, 38, -29, -42, 14, 29, -2, -38, -5, 44, 13, -29, -28, 29, 43, -17, -47, -2, 38, 0, -31, -16, 26, 13, -31, -47, 4, 37, -11, -50, -24, 31, 11, -43, -31, 21, 25, -23, -41, 3, 49, 6, -35, -14, 31, 38, -24, -24, 18, 39, -6, -38, -4, 38, 20, -26, -26, 25, 34, -18, -36, 4, 44, 4, -38]
4333c8J6M7j0m7rM6L3o4j2L2L9k5m4LM9J1l8j4K6L2l0l4J1M6om9%N2Rm6k1K5M1
4366C1k0n6J5M3J4m4k0M7K4k5n6K8M7j6m7NM6J8m3k1K0M2mn8LN3J2n1k3M4K8l5
4398Ak9J7M2kn0j8O2J7m5k7L5L1k1m8J3M7Rn8k0N1K8m4l4J8M5Ln0mM7J7m5l5L5
4431a2N4k9m7K4L2Nl5k4M3L0l8l3K3N1k0l7mL2K7n3k8L5L6k0m9RM8km0k1M0M2
4463C9m1m6K4M9j0m6NM0J1l2k3M3K0k1m0RM4J8n2k7M3L9l8m9L1M2pm8NL6J2m2
4495a2k3L4K1om7J2L7kl6qL4K2l2l3L2L8j5m5mM4K3m5k2K8L9k1l7PM0Kl3j5M6
4528B3J1l1k3J4L4j1l2j1L9J7l7l2K6M4k8m0J7M1Pm9j6L8K6l2l0J4M0ll5j6M9
4559A4J9m5k5M6K6j9m0J1L8%l9j8L7K5l3k4J7N1k3m6ML3K0m0k0K0L4j1m1QM8p
$$ y = [-38, -22, 25, 15, -32, -41, 5, 38, -26, -38, -6, 33, 8, -36, -33, 16, 27, -11, -25, 1, 33, 3, -31, -20, 26, 20, -29, -29, 23, 32, -14, -35, -10, 31, 11, -45, -30, 13, 27, -17, -37, 10, 34, 9, -47, -19, 28, 12, -35, -30, 16, 34, -9, -30, -10, 32, 28, -30, -27, 26, 38, -13, -36, 8, 36, 1, -28, -11, 31, 29, -21, -39, 23, 40, -5, -32, 3, 34, 13, -35, -22, 25, 34, -24, -44, 7, 35, -9, -43, -25, 20, 23, -27, -31, 16, 33, -12, -47, -12, 42, 13, -34, -10, 22, 27, -8, -32, 11, 41, 3, -30, -7, 44, 24, -13, -17, 15, 42, -11, -39, -4, 32, 12, -37, -28, 20, 18, -22, -43, -3, 39, -2, -48, -24, 25, 15, -31, -26, 14, 25, -7, -30, 13, 33, 12, -28, -19, 25, 43, -9, -36, 7, 46, 8, -41, -10, 32, 25, -23, -18, 18, 30, -12, -35, -1, 20, 14, -33, -21, 16, 14, -22, -30, 4, 26, -6, -39, -7, 31, 16, -29, -33, 11, 34, -11, -33, -5, 34, 13, -24, -17, 23, 25, -8, -23, 23, 34, 3, -20, -6, 28, 17, -15, -26, 13, 30, -7, -39, -13, 31, 3, -37, -20, 21, 28, -21, -37, 1, 27, -5, -35, -21, 19, 16, -19, -35, 14, 33, -12, -37, 9, 35, 16, -24, -13, 25, 25, -14, -32, 5, 30, -3, -27, -10, 41, 18, -28, -24, 9, 29, -11, -31, -11, 23, 12, -29, -21, 27, 20]
4591B0l9j8L7L6m0k5J2M4pl6j5N7Ok9k7K6L1k2m3K2L4Nl6j7L3K7l3l2J7M4j5m1
4623b4J3J8J7m3k2M4L8m6l6J3M4Kl7lL1K0l5l3K5M5j2l7mM6Pk5k9L0K3j7l3J0
4655a0L9qm5lL3J6j7k6J5L0ml6qK6Ql0j1K0K8j8l1J5M3j1l0j3K6K0k4k0J6K9L
4688B2m0oL9J5k9j9K4K7j6l9J1L7jl3j7L1J9j7m3K3L8j7m2mM3Ol1k1K8L2j1k6
4720a7mM1jl8j9L6L1l0l4K5L9j5l8J2K5J7k4l5K8L9k8l2LL3J3l8j2K8J7l2j4J2
4752a2M0k1l1mK7J6k3k0K3K8j5k6%L7Jl4oK7J6k9j6K8K1k1j7MJ6J3l7kK9J2k2
4785Bk7J6K5Kk8%K3Nj3k6K0J6pl8J1L2Jl1j2K4K1pk6LL0mk3qK5J7l0j7K2K5rl0
4821a6RK6J1l1k3K4J9j5k2J4J6nj3rJ8K8k6l7K6J9j0l7K0L4j0qk4K1J4Jl0LM4
$$ y = [20, -19, -37, 0, 36, -4, -29, -17, 27, 20, -16, -31, 26, 32, 3, -24, 2, 33, 11, -32, -10, 24, 29, -7, -24, 9, 36, 3, -29, -12, 32, 17, -24, -11, 7, 24, -19, -41, 3, 41, -5, -41, -28, 16, 18, -19, -22, 9, 29, -6, -39, -14, 31, 19, -18, -22, 24, 31, 6, -23, 7, 30, 13, -20, -10, 29, 21, -24, -27, 6, 22, 5, -21, -6, 24, 20, -16, -24, 2, 10, -20, -31, -11, 17, -1, -32, -17, 26, 15, -15, -28, -2, 18, -6, -26, -10, 19, 22, -18, -24, 15, 30, 1, -18, 6, 33, 17, -22, -11, 26, 25, -8, -25, 6, 25, 8, -35, -12, 26, 9, -33, -37, 6, 12, -19, -40, -12, 20, 9, -17, -21, 20, 19, -19, -38, -2, 29, -1, -35, -10, 29, 14, -24, -12, 13, 30, 6, -29, -1, 38, 10, -22, -19, 14, 27, -11, -23, 5, 22, -10, -24, -12, 28, 7, -24, -28, -1, 15, -8, -28, -5, 23, 8, -18, -18, 19, 20, -14, -20, 7, 23, -6, -22, 6, 27, 6, -11, -7, 9, 22, -15, -17, 12, 24, 2, -25, -9, 16, 18, -10, -10, 13, 18, 5, -21, -1, 15, 8, -30, -19, 13, 14, -17, -29, -5, 16, 9, -17, -14, 16, 12, -11, -19, 6, 23, -7, -24, -2, 23, 14, -16, -7, 19, 30, -1, -24, 0, 19, 4, -18, -4, 12, 7, -6, -15, 3, 31, 5, -32, -6, 13, 3, -34, -14, 20, 10, 2, -22, -1, 13, 14, -16, -13, 31]
4854C1ml7j4L3J5k3k0J5L0j2l4PK8Ql2j6K6K2j4l4kM4qk4rK5J3k3k4J4L6j7j9
4887a9MK1K3m4j5K2K7rk6OL2ml2%J7J4j0l1K5K2ok6kK6J1l6j0J1L0j1k2jK7j0
4921Dk6NK3Mk2j0J0K6j5k5KL2Pk2j5PL2j7j9QK0Ml1j0M0J4l4nJ2K1nk5j5L9oj2
4957dk0K6J1k2k1K2J4j1j4k0L3J1j0l1K2K4j2k5PJ6J5k4pK4J1j4j4pK3%j3oJ8
4990BJ5j2k0J6K0k7oKK2j0rj4LK4kl1J3K9mk8lK1Pok3J0J8%j9pK4Kj9j0K6J4j0
5027Hk2NL0j2rrJ0K0nk8QK3om3J2K4%k4qJ7K7j5l7K6K0j2j9pK6J6k3j5J4L0nl6
5063a9LK4J4k6kJ5J0j1rnK3Jl0lK7Kj6j7J5K9ql7LK0%k8NJ3J5k0j3J4K7lk9jJ7
5100@Rk1oK2J1rj1pK4moj6J6J7k1j5NL3j3j9jRJ0j1j1QK2j2j5j0K0%Kk0J8Rj1
$$ y = [31, 27, -10, -24, 9, 24, 1, -19, -4, 26, 14, -20, -13, 15, 23, -9, -25, 1, 23, 9, -25, -27, 17, 9, -15, -24, 1, 14, -9, -33, -19, 17, 0, -19, -15, 6, 29, -15, -30, -8, 19, 10, -16, -10, 22, 18, -14, -14, 3, 17, 7, -24, 1, 23, 17, -9, -11, 15, 26, -10, -20, -9, 21, 10, -12, -13, 14, 4, -22, -17, 6, 10, -12, -22, -12, 14, -1, -26, -24, 8, 15, -7, -22, -15, 17, 0, -19, -11, 9, 13, -18, -28, 12, 26, -8, -13, -1, 20, 15, -10, -25, 14, 8, -4, -24, 2, 13, -9, -30, -8, 6, -5, -19, -39, -6, 5, -5, -36, -14, 10, -2, -27, -20, -4, 11, -13, -20, 4, 15, 1, -13, -20, 3, 3, -10, -16, 2, 17, 5, -15, 1, 21, -6, -12, -10, 12, 2, -7, -21, -18, 6, 4, -27, -14, 15, 11, -17, -20, 1, 8, 2, -21, -11, 7, 7, -12, -19, 5, 7, -12, -22, 4, 18, 8, -14, -9, 21, 9, 0, -9, 1, 21, 16, -12, -4, 19, 13, -30, -18, 6, 6, -18, -26, -9, 18, 3, -34, -8, 12, 0, -19, -26, 0, 16, -7, -22, -8, 22, 17, -19, -16, 8, 22, -4, -6, 9, 19, 8, -1, -6, 17, 18, -12, -15, 12, 14, -2, -19, -4, 25, 17, -20, -17, 3, 3, -25, -20, -7, 8, -12, -25, -11, 16, 13, -16, -17, 0, 9, -12, -18, 4, 15, 6, -5, -12, 12, 8, 2, -14, 2, 19, -2, -17, -12, 21, 8, -11, -12, -3, 7, -4, -15, -7, 15, 3, -12, -22, -2, -2, 0, -20, -2, 7, -4]
5137dj6jJ6Oj4nJ9jnj0JK2jj2KJ2J8k1k7L0J2j6j5RJ0qrkJ6Rj3k1QJ6jj7qK9K
5176A0j5j2KJ9j3qJK0Mj2k0K0J9k0k3K3L1k4j9NK4Rk8mJ0J1k2qQK6pj3j7K4Rk0
5212a0k2K1K7j3k9QK7oj7j0K7Rj4j4PJ9jk6LK2Qk1mJ6Kkj4LJ8Nm0PK4Nj1j3J0
5249AJ5lk5J0Rkj4mKKKj3jK5mqj2K1mNj9PK0mj7QLQnj5QJ3Ok9J0J2Lj3%OMop%
5293eJ2j1Kj3RRkj0pJ3Ql1J2J7lj0j4J1K0lj0LQRk4%RK1j4k6J5J6Jk2RJ0lj4j
5332iPJ9j2j8oK7lj2j0QK5k2j2QJ8jk5jK0Nnp%K0jj7lJ4jj0kJ8%j1j0K0jnoJQ
5373HOj7j8K5Rj4j6J0J4nj5NQj4QrJ0mQj3nL2j0j7nJ4J8j3j1J2KMrj0K0oKpMQ
5413IMj7kJ1J3k6%ONj2LOnMj5%PJ2pqKQPj6NMMj0MKOlj4lJ0J7rk2J4Qoj4J6J8
$$ y = [-4, -20, -21, -5, 1, -13, -18, 1, 0, -5, -15, -14, 8, 7, -5, -3, 9, 27, 6, -21, 9, 21, 5, -10, -1, 9, 1, -8, -10, 6, 15, 2, -19, -11, 5, 4, -13, -21, 8, 10, -5, -17, -15, 4, -9, -17, -16, 4, 8, -4, -24, -4, 15, -5, -28, -5, 26, 2, -17, -12, 12, 21, -7, -11, -1, 10, -12, -20, -12, 14, 7, -6, -23, 1, 10, -10, -32, -11, 16, 3, -26, -18, 9, 3, -14, -24, 3, 12, -2, -16, -9, 10, 9, -17, -14, 8, 16, -5, -9, 7, 9, 7, -7, -4, 14, 19, -21, -14, 10, 15, 4, -9, 1, 16, 13, -12, -2, 7, 5, -9, -13, -11, -9, -7, -20, -21, 4, 0, -8, -20, 1, -3, 2, -17, -10, 10, 6, -11, -3, 0, 8, 3, -12, -4, 9, 15, -14, -4, 8, 11, -2, -2, 4, 8, 2, -5, -5, 7, -4, -2, -15, -6, 3, 1, -9, -16, -3, 5, -26, -14, 3, 0, -10, -24, -13, 7, 4, -6, -3, 5, 14, -10, -10, -1, 20, 6, -20, -5, 11, 12, -10, -1, 9, 6, -8, -9, -2, 17, 5, -13, -19, 8, 5, -7, -17, -9, 16, -6, -18, -10, 8, 7, -18, -19, 1, 6, 1, -6, -6, 14, 13, -4, -7, 7, 6, -4, -6, 12, 12, 1, -9, 11, 10, 5, -1, 0, 8, 14, -3, -21, 4, 13, -1, -17, -7, 7, 2, -13, -8, 0, -14, -6, -15, -5, -9, -1, -14, -19, 13, 3, -14, -19, -5, 13, 0, -11, 1, 3, 7, -2, -12, 8, 2, 4, -3, 1, 9, 13, -4, -6, 5, 18, -8, -8, -2, 3, -9, -6, 0, -5, -1, -16, -16, -9, 3, -4, -12, -10, -2, 5, -11, -6, -2, 2, -8, -4, -2, 4, 1, -13, -16, -6, 11, 2, -20, -6, 2, -4, -18, -2, 16]
5457A6j0j6JRLmooPMpj1J8Lj2j0J9J1kk2OJ2pkO%M%j5NK1prrJ5nj0OONrj3%J9
5501DJj8jJ5Pj0k4RK1j2j5J8QMk0JkJ8qj0JJ1NpoPJ2j6lK1Qpj8POKj0nJ6jjj3
5543eQJommJ8pk0J1OonjoJ7Kkj0RjjpMJ6j4j1OJ6kj7J2mJ7Jj0lLMmj4lJ9%k0J2
5588eJ1qJ0j0%o%oJ5qNLrQJmj0MJ1npL%J4lojJ1oj1%K1kj7Q%JqLj5J5Nkj6K1O
5634A1j6j2QkQj4LJ6jj1JkJ7lj4PNJ0k4NOJ9k0KlJ2qrOJ4nnjNNplj0K7j1j4%K0
5677A2k1nMLOj5J1M%Kj3QkRj1lJ7Mj5ONKpj1J5%Qj0oMRjj6QmjQj6J5k%kLlj0M
5723gjmJ2kloJ2%j0J3JmqJ3lPj6NJKKRlonQnpJ1Lk0PKjmRj1QJojJJ3j8jMN%j1
5772a4J1NPrLnJ4ok1QJ7OqnKJ1rj1MJ7nj8J2%mopLNkj2RLRj2LK%j3J6j0J1jj6
$$ y = [16, 6, -10, -9, 0, 3, -1, -7, -13, -6, -2, -9, -20, -2, 1, -11, -21, -2, 9, 7, -15, -9, 3, -4, -6, 0, 0, 4, 4, -11, -6, 15, 8, -1, -10, 5, 0, -10, -4, 2, 7, -2, -15, -15, 4, 5, -13, -14, 1, 8, -2, -26, -17, 4, -8, -23, -5, 3, 7, -13, -12, -14, 4, -4, -14, -13, -2, 3, -4, -10, -3, 9, -7, -10, 11, 19, 12, -6, 1, 7, 9, -1, -6, 10, 9, 8, -5, 3, 4, -2, -6, -10, 8, 1, -19, -8, -2, -8, -13, -14, -20, -3, -1, -3, -13, -4, -5, -6, -13, -9, 7, -7, -18, -12, 4, 2, -15, -3, -7, 10, 11, 1, -2, 1, 5, 1, -13, -16, 3, 3, -17, -5, 6, -2, 8, -2, -2, -8, -8, -14, 1, -7, -2, 1, -8, 0, 1, -3, -13, -9, 2, -3, -10, -7, -7, 7, 4, -2, -3, 8, 2, -9, -9, 12, 10, -7, 1, 1, 2, -6, -3, -18, -3, 2, 0, -16, 5, 11, -5, -17, -9, -11, -3, -17, -14, 2, 1, -10, -9, -11, 6, 3, -11, -4, 1, 11, -13, -8, -2, 17, -3, -1, -4, 8, 0, -9, -3, 11, 6, 1, 0, 5, 10, 3, 0, -10, 17, 6, -8, -8, 12, -9, -14, -10, -7, -1, -16, -5, -1, -1, 1, -12, -4, -6, 3, -8, -11, 6, 10, -5, 1, 6, 8, 1, -10, 5, 5, 13, 3, -3, 1, 10, 9, -7, 1, -3, -4, 4, -12, 3, 1, 1, -1, 2, -1, -11, -7, -8, -12, 0, -2, -5, -11, 1, 1, -9, 4, 5, 1, -7, 6, 3, 10, -6, -1, 0, 2, 4, 13, 10, 4, -1, 7, 2, -5, 6, 9, -11, -4, -2, -3, -7, 2, -9, -1, 0, -6, -7, -6, 7, -11, -12, -8, -3, -3, -14, -3, 2, 9, 0, 3, -2, 12, 6, -15, -7, 10, 16, 8, 3, 5, 16, 7, -4, 0, 17, 12, -6, 6, 6, 2, -4, -11, -8, -3, -5, -17, -8, -5, 4, -8, -5, -3, -3, -16, 0, -10, 1, 0, -16]
5816a6J5oJ5pj5J6oJ0nmK0j1mNPqnnJ4loj2ONkj4OJ5Jj0pQRj6PJ4j4kkJJJ4kj1
5860dJ0Kj1RrJ1Lj2lNoPjKMJmnKmMm%mojJ1j7K0j0RqJ0j3m%LPJ5j2JNnM%NpPj2
5909e%J0omoJ2Lj0PKkmoJlLNorJ8Nj9LONk0J7KNj5Qj%Qj0PPJlqOJ1pj4OJ8j7M
5957EL%%oKj0NJj7J0QKj0%RpprK6J1k1mJ3jj0KOKpJ2j6J3Rj4%JjkRkmMj0J1kK
6003FRj5jR%rKqmJ0j6PKMkkOJ2j0Jj1J2mj0jPJ1nlPNJkj1J2kjm%QPj3NoKj2Rn
6051c%jJLkkMj1MMKjoRLqJ0loMJj2NJ3r%LKmlJ2oPj7JJ4Mj3oJ0Loj6QJ3lj5mJ9
6100BJj4KjJ9oolLKMj7J9Mlj3LJ2mjrJ6%oMj0J7j2mjOjrLJ0%j2oJ2pnpJ6kknL
6147hlQj2MRJ0pkj4J6MrmJ4rj1K3jqJmOpkJ6j9NJ0lj2RNj2mjRnkOlj1J2qMOKO
$$ y = [-16, -1, -7, 8, 1, -14, 2, -4, 6, 1, -3, 17, 6, 2, 7, 14, 6, 1, -4, 10, 7, 1, -11, -5, 0, -2, -16, -10, 5, 6, -4, -11, -3, 6, -10, -3, 11, -3, -5, -7, -6, -5, 9, 7, -4, 6, 8, -3, 6, -3, 8, 11, -1, -4, 1, -5, 2, 1, 3, 7, 8, 4, -1, 1, -3, 1, -3, -3, -7, -13, -14, -3, -20, 0, -10, -1, -9, 1, -12, -16, -16, -13, -6, 9, -3, -2, 3, -2, 2, 2, 7, 0, 7, -5, -5, 5, -1, -5, -11, 1, 4, -6, 1, 3, 1, -3, -9, -8, -11, -8, -3, -9, -18, 0, 5, -14, -11, -5, 0, -20, -3, -1, 4, -11, -3, -4, -4, 4, -6, 1, 8, 9, 6, -2, 4, 15, 8, -6, 0, 18, 1, 5, 8, 8, 8, 2, 4, -6, -1, 0, -17, -7, 1, 3, -7, -7, 2, -5, -12, -21, 5, 16, -5, -9, 4, 3, -7, -5, 1, 3, -4, 8, -8, 5, 14, 0, 0, 1, 0, -2, 7, 5, 1, 5, -5, 6, 4, 6, 15, 0, -1, 8, 8, -1, 1, -7, -11, -1, -17, -10, -8, -4, -6, -8, -2, 10, 0, 1, -10, 2, -2, -12, -13, -6, 5, 0, -3, 4, 9, 10, 8, -3, 9, 7, 6, 2, 2, 10, 17, 4, 9, 3, 5, -7, 2, -3, -3, -4, -3, 0, -2, -4, 0, -11, -7, -3, -1, -2, -8, 1, 4, -4, 6, 3, -3, 1, 2, -10, -5, 8, -1, -1, 2, 4, 0, -3, 9, 3, 10, -7, -6, 8, 12, -1, -7, 3, 6, 0, -16, -8, 5, 2, -13, -17, 2, 3, -11, -9, -10, 9, 3, -3, -6, -3, -1, 3, -14, 5, 9, 6, -7, -4, 8, 4, 3, -6, 10, 10, 4, 8, -2, 15, 3, -1, -2, 4, 3, -6, -3, 7, 7, -5, -11, 1, -6, -11, -18, -2, -4, -6, -11, -8, -11, -3, -15, -11, -2, 8, 1, -1, -15, 1, 5, -4, -8, 6, -3, -14, 9, 8, 0, 1, -3, 3, -4, -6, 10, -9, -4, 6, 3, -9, 0, 5, -7, -11, -12, -3, -8, -10, -4, -7, -18, -6, -14, -10, -4, -2, 4]
6194Dj2J0K%j4NPpNmOKmOj3lJ1P%j1K%o%KLj2jJ0J1rOrnJ1j6LJ1jmlRJ3kj6j%
6241gJ0MrPOj1NnJ1%rjJ4j2LjjJqrMRnKmKJj5kJ5J1pj5J6KqmJ4nPLj4nJ7qlLJ3
6289A2JrkJ6qj1lLPmjoL%qmJ5nLrPQrnO%LMj6kKOrQMLKnNLkJQnoloRqjJ1j7J5
6342Al%pJ%KrJ4j0jRNJj1J5j3oLKJnlK4j1kjpQMkmjJ4j5MJ0plK%J2rnlNj8KNQ
6391dj2Mj0J7njlPkKrJ1LjKnNNLj6J0J1rplJ5j4pkJ7jj4J7%%oq%KJkqJ1%Rk4J1
6438a0OorJ4KQlkj5LPJLlKOrOQpnJ5k1NJKjkMPljnk4J1J3lj3%K0k0ORnLKqkJ1
6487bjnqJ3%MokQnJ%J1j3OlJjKRj4Qn%lJKQj0jjpLloJ5oPj0OMkkLMoNj1J0kL%
6539aQNj2q%QkmnJ1Jj7J6pJnoJQJj3JJ4jpmRkPml%J5j4mK4j6jj2J7JLj4nK2Kn
$$ y = [4, -8, 2, 4, 4, -10, -5, 2, -5, 0, -4, 2, 4, 0, 6, -7, -10, 1, 8, 8, -3, -1, -1, -7, -7, -5, -2, -14, -15, -5, 6, -3, 3, -6, -11, 0, -16, -13, -2, -3, -7, -10, -1, 12, 10, -6, -7, -7, 3, 7, -2, 5, 11, 0, 5, 0, 11, 11, 2, 1, 15, 3, 6, 5, 4, 5, -3, -12, -8, 1, -4, -2, -6, -4, -3, -18, -20, -5, 6, -1, -16, 0, 2, -6, -10, 4, -1, 6, 9, -5, -10, 7, -1, -4, -1, 12, 13, 4, 2, 18, 10, -1, -4, -1, 6, 2, 1, -5, -2, -2, -10, -14, 1, -4, -1, -10, -3, 5, -4, -9, -3, -3, 0, 4, -12, -14, -12, -6, -15, -7, -3, 0, 2, -3, 2, 5, 3, 4, 12, 7, 1, -2, -8, 1, -7, -8, 3, -14, 1, -2, -2, -9, -8, -8, -6, -15, -1, -11, -12, -3, 2, 3, -8, 7, -6, -12, -9, -7, -6, -11, -14, 10, -1, -3, -4, -11, -3, 1, -1, -5, -6, 8, -7, -3, 7, 0, -3, -1, -1, 11, 2, -3, -6, -1, -19, -17, -12, -4, -16, -12, -22, -5, -10, -11, -14, -7, -9, -7, -16, -5, -2, -3, -1, -6, -1, 4, 7, -9, 1, 12, 3, -4, -7, 8, -6, -13, -15, 2, 1, -13, 4, 4, 4, -2, -10, -10, -8, -7, -9, -17, -6, -6, 3, -21, -10, -4, -10, -19, -5, -3, 5, 2, 0, -15, -12, -5, -4, -1, -4, -2, 4, -5, 1, 9, 2, -3, 12, -9, -4, -3, -1, -2, -4, 0, 7, 4, 3, -2, -26, -15, -2, -5, -18, -18, 2, -18, -12, -3, -8, -5, -3, -11, -13, -2, -3, -8, -16, -3, -3, 1, -5, -7, 1, -4, -3, -3, 8, -5, 1, -2, -1, -2, 0, 9, -5, 3, -2, -2, -5, -4, -2, 6, -4, -5, -6, -13, -10, -13, -19, -4, -10, -3, -13, -7, -3, -5, -7, -4, 0, -6, -1, -12, -2, -4, -1, -1, 7, 12, 0, -8, -8, 0, -2, -6, -11, 0, 1, -16, 0, -7, -6, -11, -17, -16, -8, -7, -20, -19, -5, -6, -13, -17, -8, -10, -3, -7, -10, -10, 5, -9, -13, 11, -5, -6, -18, -1, 0, 3, -11, -16, 6, 8, 3]
6586CLLrrj0J3J0j1L%Pj0mpOOj2PP%rlPRj4jJ7jnJoP%jRkK%oQmPj1mJ7j9NpJ5
6635GmlJnJplJ5mnll%jRqQJ1j7jMJ1mqJ1%qMoJJ2j4MKNk%joJoK0j0kJpMlMQj3
6686a0Mr%RmnkRLmjNJ5qnJ2Jj1mjJP%ooJ8j1OmKlnnQOj1KKkLj1OkJJmKOkkj2K0
6738apJQMJj1NQkLj0mJ0Nj6LLJ2j6pQPkqJ0oqK2nj5KLj2PMKj1J3oQj3J0kk%JQ
6785DpNPonOmJNLrNNmoJ%Qj0pQlnmJ6j9R%%lLNoLRj6NkMjJLMlpJ5Prj5NQPoLr
6840aRlkj2J4Kj6J2jnnjPoJoJ3Oj1j6J7Kkj7J2J7j1j7J5J5plrJ7rJ0pK%knnK0
6883A2nj7KJ6lj0o%PKoMlk%mLOJ0k4J1J1moJjKjPjLo%kK2oopjQrJPKj6JLJ2j6
6932iKM%ompNRqjNJPj9PJ8qqK0lq%PmKLlkMoLokRj0LQj0OJjMj3J0j0pOM%rJ3j0
$$ y = [3, 6, 9, 0, -9, -19, -6, 4, -7, -4, -4, 3, -7, -11, -18, -12, -6, -18, -11, -4, -4, -13, -16, -9, 0, -14, -15, 2, 1, -4, -3, -9, -2, -2, -3, 6, 4, 6, 6, 0, 8, 4, 11, 0, -4, 13, -6, -1, -8, 7, 3, 0, 1, -4, -3, -10, -13, 2, -2, -7, -10, -13, -13, -14, -5, -13, -5, 6, -11, -12, -8, 3, -1, -9, 2, 2, -6, -2, -8, -7, 5, -9, -5, -3, 2, 0, 0, -1, -7, -6, -12, 8, -2, -4, -3, -10, -6, -9, -5, 3, -10, -6, -15, -15, -6, -10, -15, -17, -8, -5, -9, -10, -5, 10, 2, -3, 9, 10, -1, -5, -6, -5, 2, 2, -4, -10, 8, -3, 3, -1, 1, -2, -7, -12, -4, 2, -9, -7, -5, -7, -4, -15, -9, -11, -10, -9, -13, -11, -5, -7, -9, -21, -1, -8, -7, 1, 5, 6, -5, 0, 8, 6, 9, -1, -5, 5, 10, -6, -3, 0, 12, -4, -11, -3, 4, 2, -6, 4, -2, -10, 12, 7, -8, -6, -3, -15, -8, -4, -2, -13, 0, -6, 2, -11, -1, -3, -5, -5, -4, 4, -3, 2, 9, 3, -2, 4, 0, 1, 6, 9, 0, 5, 10, 6, 0, 1, 1, 9, -1, -8, 0, -3, -8, -12, 4, -15, -6, -6, -6, -9, -6, -1, -7, -4, 5, -11, -6, -8, -4, -5, -4, -1, 3, 0, -7, 8, 15, 6, -9, -4, 4, 11, 5, 8, -1, 8, 5, 3, -9, 5, 7, -9, 3, 2, -3, -8, -9, -2, -8, -7, -13, 0, 6, -5, -21, -4, -2, -4, -21, -9, 8, -3, -20, -5, 10, 3, 0, -9, 8, -1, 9, 2, 4, 4, 2, -3, -8, 12, 7, -10, -8, 8, 5, -5, -11, -11, -4, -2, -8, -4, -7, -9, -9, -13, -10, -4, 6, -18, -7, 4, 0, -6, -5, -6, -4, -5, 2, 1, 4, -2, -2, -4, 18, 12, 6, -1, -2, 6, -3, -2, 5, 7, -9, -8, -5, 7, -9, -7, -3, -3, -9, -13, -20, -15, -6, -14, -15, -10, -9, -2, -21, -14, 4, -4, -12, 8, 5, -3, -3, 4, 0, 2, 5, 2, 0, 4, -2, 1, -5, -7, 2, -8, -5, 3, -7, -1, 0, -1, 3, -10, 0, -10, -17, -11, -7, -7, -16, -3, -13]
6984a3LjJ2mpJ1%j4%J4Mj9LJ5jlpJ2j1MmnK3j3KjRmqnOPlqj%J0pj5J2Rj3pRNO
7030BqjPNj8lK8j6mP%jjRj0J2kj1nJ1rRj2LJ7j5KmJ2qpMpJ5j1lLRkj9J0J3mj0
7074a3KJ0Mj2J2lKj1Nj0J1MjlN%Kj3RRpl%jj5MJ3%rlJJKpJ2nKnmJ3Pj2kPQj6J0
7121@JMmKMnjnNJ3pp%kQJj8mJ3j1JPKNj0mMjMrjJ1j2loK3jj0JOJ0j3%K0kk0J5
7168DPmjlLkkkj0PPpj2J5Oj1j5J3nklJ6j8J8j7kPJ0o%MQKk2J1PJ1k8J6J0ommO
7212BkPj0QqJ4j0oJRnpJ1Jk1ROLKj1rJJ9j0pNJ2mrjPOom%%lRNkMJj5OJ8k6jJ0
7260aNnMPj0j1jJ2KrkMpKMpOlLnjJ1j2kJ8Lj5LQQj7LMjnPJ0j2J6j2qJ5j0J2j2
7305apKNnLKo%JKpkJ0mKlrNPkkmJ8ornJ6JloJ5no%%M%qpJ6npj0J2Plj0jJ0mqR
$$ y = [-13, -10, -11, 1, -3, -10, 1, 1, -13, -13, 1, 5, -14, -11, 4, 3, 0, -7, 5, -6, -2, -6, -11, 12, -1, 1, 0, 9, 5, -3, -8, -2, 5, 2, -6, -7, -7, 3, -4, -19, -7, 2, -11, -18, -9, -4, 2, -6, -7, 0, 5, -13, -16, 12, -4, -8, -1, -1, -2, -3, 6, -4, 8, 6, -5, -10, 1, -8, 1, -11, -8, 9, -6, -4, -8, 4, -4, -11, -7, -14, 1, -10, -13, -10, -1, -3, -22, -12, 1, -3, -13, -11, -1, 3, -9, 3, 0, 2, -9, -4, -14, -3, 1, 0, -3, 2, 2, 4, -9, 0, 9, 2, -1, -1, -2, -17, -13, 0, 0, -9, -12, -11, -10, -8, -15, -3, -8, -6, -11, -15, -2, 5, -7, -9, -2, 6, -10, 0, 1, 5, 1, 3, 7, 2, 1, -4, 1, 14, 7, 0, 0, -2, 6, 7, -11, -15, -2, -13, -12, -5, -3, 2, -8, -12, -8, -9, -5, -14, -15, -4, -16, -19, -25, -2, -3, -13, -12, -6, 4, -9, -9, 11, 9, -11, 4, 11, 7, 6, 3, 6, 4, 2, 0, -10, -3, 4, -3, -15, 0, 6, -5, -20, -7, -12, -14, -17, -1, -19, -1, -18, -20, -13, -3, -9, -9, -5, 3, 5, -17, -6, 1, 12, -16, 0, 10, 4, 0, -4, 2, 0, 7, -3, 5, -3, 11, 1, -5, -4, 5, 0, -7, 4, 5, -16, -7, -1, 2, 4, -7, -16, -15, 4, -6, -13, -8, 4, 0, -9, -10, -3, 3, -3, -7, -7, -7, -10, -1, 4, 2, 6, 7, -8, -2, 16, -10, -11, -1, 4, -1, 3, 10, 0, -11, -12, 0, 2, -7, -9, -5, -12, -10, -6, -13, -7, -10, -7, -12, -13, -2, -14, -16, 2, 5, -10, -7, 1, 9, -8, -5, -1, -2, -7, 0, 10, -2, 14, 2, -6, 9, -1, 11, -1, -8, -6, -1, -6, -3, -1, -7, -7, -6, -4, -11, -13, -3, -7, -5, -8, -17, -12, -5, -7, -9, -13, 5, -1, -10, -15, 1, 2, -1, -7, 8, 3, -3, -3, -3, 1, 1, -7, -14, 2, -3, -10, -20, -8, -1, -4, -14, -15, -5, -9, -17, -8]
7357hKNj6jQkKnjJ1J1l4jL9j0prK0jqj0OQPqkJ3Oj0j8J2Mj1oJ4MqnqJ0LmnNl%
7403a1pLJ7qj4QPn%%MJ1qMOj1LJ2%j0KjJj2N%pJ1Nj1jKLj0pJ1%mRj0J7j0JlOm
7449fJkOMpkQKorRQj3lMJ0lQrOj0NJNokqpJ2Qj7NJ8j2j0RKKr%oJ1jpPNOk1OJ6
7499HLj7mJ9kj3Qm%N%oJ3Jpj7J4Nj4klJ2j6J2j0OKLmJPj0j1J0PoM%RrlnROrOn
7546g%OlJ1rJ6j2kLnNj3LJ1j7NKQonJ1j1jnPPnqnJ3Nj0nNJ1pMOPpj2J5Kj2KlO
7593Aj%pJ1rQjj9J7j4%jkJ0%jQlj0%%J7j8Rj3RJ1j0j0K1%pjMJ8j9oJ7oKk2PJ7
7636GmqLJOpj3RJ1j9mKJ7kj8LPr%J1j2QMj4RJJ1mj1J7Nk0%OJ6pj7J6RrjjJPqp
7682hJ0Nlk0J3jj0mJJ4pjj3K0lj4J5oJNj1J7q%klRMpOLonlRMmk%KQj2KlJ2plK
$$ y = [-8, -6, -1, -17, -18, -10, -12, -10, -15, -16, -5, 6, -28, -29, 10, 0, -7, -16, 4, 3, -5, -15, -9, -1, 6, -2, -4, 9, 15, 5, -13, -1, 3, -8, -14, 0, 4, -4, -9, -17, -7, -4, -8, -13, -8, -11, -11, -18, -15, 2, -6, -20, -12, -5, -10, -10, -10, -6, 5, -3, 1, 7, -4, -1, 11, 11, 1, 3, 2, 3, -9, -4, -4, -11, 0, 5, -6, -7, -5, -2, -12, -19, -8, -8, -12, -3, -13, 4, -6, -5, -8, -2, -6, -5, -7, -1, 3, -4, -6, 2, 4, -2, -11, -2, 6, -7, -10, -6, 4, 1, 9, 0, 6, -4, 1, 2, 7, 1, -1, -9, -16, -4, 4, -13, -8, 10, -2, -12, -3, -1, 1, -8, -8, -14, -3, -4, -11, -4, 1, 7, -14, -8, 8, 11, -6, -10, 9, 7, -6, 2, -2, -2, 3, 3, -3, 10, 11, 4, -13, 1, 6, -8, -10, -13, -1, -17, -5, -15, -9, -7, -4, -8, -7, 0, -10, -21, -11, -4, -10, -6, -6, 3, -6, -9, -14, -5, 1, -8, -2, -7, -7, -1, -4, 7, -2, 14, 2, 0, 3, -2, 3, -10, -7, 4, -13, -8, -6, 2, -4, -9, 2, -9, -10, -15, -8, -1, -6, -14, -19, -6, -1, -11, -16, -11, 0, -7, -3, 3, 10, 3, -9, 6, 8, -4, -2, -5, 1, 0, 0, -7, 4, -5, 3, 2, -17, 0, -14, -14, -15, -17, -7, -7, -8, 0, -3, -13, -13, -13, 4, -14, -5, -18, -9, 2, -8, -18, 3, 3, -4, -5, -1, 17, -2, -8, 9, 3, 5, -17, -10, 7, 3, -5, -2, -1, 5, -2, -15, -6, 5, -14, -18, -16, 1, -1, -19, -16, -9, -18, -18, -7, -19, -11, -7, -21, -12, -11, 0, -4, -15, 2, 7, -13, -13, -7, 9, 2, -15, 1, 10, 1, 0, -1, 0, 7, -1, -8, 2, 7, 4, -16, -3, -4, -14, -18, -17, -3, -10, -11, -24, -4, -7, -21, -6, -12, -11, -6, -17, 0, -8, -8, -10, -13, -4, 0, -7, -1, 2, -4, -9, -12, -3, 1, -3, -5, -5, -3, 5, -7, -5, -8, 4, -3, -6, -4]
7730dnj0ONQmrlPmkNMOj0Lj0J3qOLJ1j0nQNnj2J0KPj5J3j3NKlJJ2k4PnK1j5j1
7775a7nJ8jj2J3%jj4OJ1j5J9KnLj6JQmJ5mj0QOj3jJ8opoPPpolnK3oj1JOlqOJ4
7820Fk3nQJJ4olj5J9oJmJ1pJ0k2J5Rj7PJ7kkj2lJ6j6%KjPj5J1qK0j7mLKnj1J6
7862iJJrJ7nJ1qlPnNmpKMj6J3RnrJ2Lj4NPKlkpkOKjj0MNLrJ0Jj7jJ6nnMmKj0J4
7912dlNoNrOJ3Lk5J2Rk1MJ1LKj3JPJ%j4J2Kj4kJ7j1jj4J8Llj5PJ0rMpK0j3Jj1
7955a9J6J6j3rNJ5jk1KKJ5oj2J5jmJ0rj3NJ0j1OOj0MkJlj0JOJj4jJ9j3nPJNJ1
7997Bj4RJMmqRlnj0K6j2qLJ4Lj1kPkJ1j8Qlnm%J9kj3oJ4j0j%MOooOJKLmqJ7lj3
8045a2QJ6j1qRmomLN%kNmqJ5qKMkkMMrnkJ0nl%J1olqQmMqJ2JJ2npJ0Jj2PmQpJ0
$$ y = [-4, -9, -19, -13, -8, 0, -4, -13, -16, -9, -13, -15, -10, -6, 0, -10, -7, -17, -4, -12, -6, -3, 8, -2, -7, 1, 6, 1, -11, -1, 1, 8, -7, 6, -7, -2, 0, -3, -2, 10, -14, -7, -12, 9, -6, -17, -22, -4, -5, -17, -4, -4, -5, -19, -13, -2, -17, 2, 4, -1, 2, -14, -13, -5, -9, 6, 2, -8, 0, 6, -7, -8, 10, 4, -3, -9, -2, 5, -2, -8, -11, -16, 7, 1, -10, -9, -3, -6, -14, -8, 6, -17, -22, -14, -13, 1, -5, -8, -23, -4, -10, -9, -13, -2, -9, 1, -21, -6, 3, -14, -7, 10, 8, 6, -6, -9, 7, -9, -9, -7, -8, -1, -16, -5, -13, 7, -10, -14, -11, -9, -14, -25, -9, -8, -7, -16, 1, -4, 7, -1, -4, 3, -2, 3, -1, -8, -6, -2, -18, -5, 4, -1, -10, 2, 5, -9, -4, 3, 5, 2, 0, -7, -9, -3, -1, -2, -12, -8, -3, 0, -9, 1, 2, -15, -16, 0, -5, -10, -6, -10, -8, -18, -4, -7, -2, -8, -3, -12, -6, 7, 10, -15, -3, 6, -15, -11, 0, 3, 5, -8, -7, 0, 1, 1, -13, -1, 1, -13, -15, 2, -9, -10, -24, -6, -3, -6, -21, -14, -4, -13, -9, -16, 4, -9, -8, -19, -3, 13, 0, -9, -4, 11, 10, -11, -9, -7, 8, 2, -10, 5, 4, 0, 10, 1, -12, -7, 3, -8, -2, 4, -6, -2, -4, -3, -6, -16, -15, -9, -8, -22, -23, -4, -17, -22, -15, -14, -9, 2, -12, -3, -2, 2, -2, -10, -1, -4, -9, -19, 7, -5, -13, -10, 4, 7, -4, -6, 1, -1, 10, -8, 0, -3, -8, -12, -12, 7, 5, -8, -14, 0, -10, -11, -11, -7, -1, -7, -13, -7, -6, -4, -1, -5, -13, 4, 1, -12, -4, 12, 1, -7, 2, -2, -8, -12, -9, -4, -4, -6, -1, -5, -13, 2, -6, -4, 0, -2, -4, 0, 4, -5, -10, -12, -2, -7, -10, -10, 1, -5, -8, -16, -8, -12, -8, -16, -4, -3, 9, 4, -3, 7, 8, -4, 3, -1, 7, 0, 10]
8096A0Jj2NqQJlRk1LJ2jj2rK0j3%kQJj5jJ4JpnRLKNmPOj5mJ0Lkj2J3Nj0j0OLN
8142Dj0LOnj2OJ0Rj7j1QJ0opJ0J1j2j4OJ7qk%k0J7Pj3PLOo%PnqjJ3oLkmKRkKj1
8188fMk0Q
$$ y = [10, 11, -1, 4, -4, 4, 5, 2, 11, -10, -7, 5, 4, -8, -17, 3, -10, -10, -12, -4, -3, -18, -19, -5, -4, -11, -16, -7, -4, -2, 3, -1, 6, 12, -3, -7, 3, 6, 4, -8, 5, 10, 0, -10, -4, -1, 4, -6, -3, 3, -2, -14, -8, 2, 11, -6, -17, -9, 1, -5, -12, -2, 9, -3, -17, -11, 6, -2, -4, -4, -24, -7, 0, -13, -6, -3, 3, -3, -3, 4, -1, -9, -10, 3, -3, 0, -2, -6, -4, 5, 3, 5, -6, -2, -22, -14]
8191a4
$$ Imaginary data points
##PAGE= N=2
##DATA TABLE= (X++(I..I)), XYDATA
0@%%%%%%%%%%%%%%%%Qj6J6j6J6j6K4l2L2m0M8n6O4p2Q1q9J04j20J36j53J70j93
38a04K17k42K72l02L34l68M08m50M94n47O04o64P32q08Q89r79J084j199J329j480
58g80J650j849K088k377K738l203L822m694O022q319J3364m3307L4150Q5458r2486
73g723n8392O2496N7581m6563l8443J1774L1438J5415j7692m9111J3477P2313
85D6570o731r3052O996J00520n227j01380O648R0130m518p3186K154M8672M487
98B2083k2832j2317l931K3016K6447l3518m4258M3983N4523n1471n7886N5495
110f66N3945n4099m4554M7583L1192l5831j6491K0233K649k249Q136j5914j4839
123b0905L2348J6668m4883j4047N2025P704n2969Q50M7790r921l7443J7719K3438
$$ y = [0, 0, 0, 0, 0, 0, 0, 0, 0, 0, 0, 0, 0, 0, 0, 0, 0, 8, -8, 8, -8, 8, -8, 16, -16, 16, -24, 24, -32, 32, -40, 41, -48, 56, -64, 72, -81, 89, -104, 113, -129, 143, -159, 175, -193, 215, -235, 259, -288, 316, -348, 384, -424, 465, -514, 570, -629, 700, -780, 870, -979, 1109, -1268, 1470, -1733, 2089, -2605, 3417, -4902, 8462, -34845, -695, 84763, -7723, -66115, -3619, 53962, 7399, -31044, -19270, 12168, 27583, 9891, -39220, -25743, 46570, 39839, -53213, -46217, 54303, 49076, -52304, -45656, 44474, 39956, -33230, -31076, 17596, 22083, -749, -13066, -16997, 6019, 32466, -1052, -45310, -1327, 53196, 1725, -56161, -666, 53279, -820, -45374, 2209, 33401, -2430, -18921, 1312, 3961, 1712, 9848, -6066, -20905, 11443, 28111, -16772, -30819, 21206, 28910, -24059, -23209, 24581, 14660, -22783, -5064, 18374]
136A8374k2739p781K4165p298k1705J9783J5729k7936p028L0782l055k8085J3126
149c668K0404k1708r080K7712m254l0397J7484K9605k8694k5676L6008J9382l8210
162a1092j1880L4764M412k5960J793J2835n845L035P296j9690o150L5138K925
175B1581m7307J499N4719n924n6435R137N2345j0091m2978P972K9634k697j3895
188b440n509k357J5642J7286k6450k9474L6321L7846m3676m1994M7159M2042m5794
201a398l8613L9301L2723k7929k5478J2713J8078M893j1431k3030O186L9788k567
214B3236n3284M28O1996O29o4932j353O1748K384n2854m421L9259P816k2515j2744
228a4607M561J8833J2709k5425k7507L1622L8433l6343m4610L8620M5882l7648
$$ y = [18374, -4365, -12146, 12019, 4721, -16984, 2799, 18528, -9408, -16436, 14346, 11291, -16794, -3668, 16736, -4972, -14052, 13660, 9406, -20991, -3507, 26098, -2596, -28272, 7736, 27118, -11092, -22972, 11792, 16204, -9756, -7963, 4872, -973, 2062, 9358, -10332, -16482, 18656, 21581, -25726, -24227, 30492, 24568, -31867, -22730, 29615, 19524, -23454, -15482, 14152, 11455, -2440, -7949, -10306, 5336, 22622, -3828, -33302, 3019, 40865, -2811, -44805, 2354, 44396, -1398, -40011, -710, 32013, 4084, -21394, -8681, 9397, 14290, 2859, -20171, -13985, 25803, 23236, -30048, -29620, 32376, 33005, -31927, -33280, 28468, 30852, -22002, -26423, 12836, 20652, -1863, -14607, -10046, 8787, 21496, -3929, -31436, 186, 38619, 2276, -42334, -3714, 42168, 4520]
240D520m2585L2983L5755k4708k6642J3353J6708J9p340j4109l53K7354N659l8306
254a7692q365M5634Q670m8513p187M6627M672m0164k078K9981K55j7261K04L584
268a633J046R425l850k0351P916K7989j2556l1543J6887L0875k0146k6300K1526
281g15J8744k0664r421J7321j57j1871Q558M901j4635K712J7558r963j6966J5879
295A281J3032j9563o499K0589j548j8785R868J4578j7180q612K2368J917k4702
308a3256M410K3851r349j9919J1987J3431j1880n317Q936l398l546J1622l527
321D045j8458J1198K3158j8302k5281K3605K4863k6133k2180K5304J7841k0862
333a202j2569J3139P260k921k591q693q81K0318K961l0595l654L8147L317m2096
$$ y = [4520, -38065, -5082, 30673, 5965, -20677, -7324, 9384, 9403, 2063, -12046, -12399, 14955, 20614, -17692, -26057, 19577, 28247, -20266, -27453, 19174, 23846, -16318, -18396, 11585, 11840, -5421, -5217, -1633, -587, 8838, 4988, -15363, -7447, 20542, 7986, -23557, -6670, 24205, 4059, -22241, -715, 18029, -2635, -12056, 5265, 5108, -6763, 1795, 6696, -7939, -5227, 12331, 2368, -14598, 1281, 14313, -5250, -11749, 8840, 7292, -11493, -1625, 12953, -4227, -12839, 9529, 11446, -13256, -8846, 15005, 5656, -14263, -2276, 11155, -725, -6042, 2894, -504, -4050, 7572, 4045, -14413, -3215, 19943, 1641, -23640, -35, 24828, -1305, -23485, 1819, 19660, -1202, -13771, -632, 6628, 3707, 1116, -7577, -8458, 11860, 14821, -15774, -19428, 18719, 22036, -20060]
347b0060k504M1851J822l7428j885K9306L147j8449n806O087R753O433j4547j7783
361b0063J9520K6898k3812l2922K6539L5543k6954l4833K4599L1212j9302k5448
373a9023J1334J8434j328j1149r753M367K0785J187l0491n211L7766P586m1687
386a7183q558M1750Q507l7863p938L0412P469k0220p471Q386Q311L735r958j4877
400a5498J2252K3856j4761k9795J6874L2239j8019l1195J7670K6991j5461k0546
412a5393J1362J2765n525m894j431k145Q858P547j5850j0756K1576J1651k5231
425g466j0395K6334P515k4690l676K0492l01j4239L641O740n813J066O363q210
439b639n255J3757K670j7109R64J7839n078j5942R016J1756j2103n986J3856m70
$$ y = [-20060, -22564, 19287, 21109, -16319, -18204, 11102, 14249, -4200, -10006, -3919, 5834, 12267, -2280, -20063, -543, 26355, 2543, -30379, -3840, 31703, 4749, -30084, -5485, 25727, 6425, -19023, -7689, 10745, 9417, -1732, -11485, -7118, 13667, 14854, -15637, -20848, 16918, 24504, -17183, -25741, 16009, 24516, -13347, -21285, 9127, 16596, -3624, -11095, -2709, 5602, 9337, -621, -15498, -3246, 20610, 5849, -23946, -7072, 25167, 7148, -24047, -6377, 20614, 5153, -15393, -4031, 8734, 3209, -1685, -3116, -5261, 3597, 11144, -4706, -15462, 6114, 17765, -7466, -17861, 8473, 15988, -8702, -12378, 8114, 7813, -6426, -2785, 3955, -1858, -792, 5571, -2639, -7894, 5863, 8533, -8576, -7612, 10227, 5149, -10793, -1777, 9979, -2124, -8110, 5746, 5276]
453E276j3949O646J2398j1582r357J4480N375j4900r54J2680l186q090O434J761
467C032q419N437Q927j2553q023J8583N986k2675l376K4209P88k2965J171J9068
481I190k032j2947J487N362N34K798l694j0669P598J7354j1568k2186J4922K4712
495B0861j6929k4803J7023K2658j4918j8704J0563J3545m265p933l411K531J1652
508G870K068j9540n515K6118P635l0458q556L2013Q559l0446q040K5860P502j8679
522c609p317R672P740J86q832r869J0432J8366j2216k4823J3684K8641j4384k9613
536b1942J3851K7809j1831k3609Q151J7753l066j0957l060M122R708J998j6065
549g138o838K1424J0056k5088j1529K6574J1387k5573j0021K2115P892j6485n637
$$ y = [5276, -8673, -2027, 10371, -1211, -10568, 3912, 9287, -5613, -6567, 6113, 2927, -5163, 1271, 3032, -5387, 50, 8977, -3576, -11599, 6984, 12970, -9705, -13081, 11128, 11916, -11049, -9878, 9190, 7158, -5789, -4302, 1060, 1594, 4392, 698, -9971, -2373, 14981, 3413, -18773, -3851, 20861, 3932, -20871, -3848, 18810, 3892, -14812, -4249, 9296, 5031, -2902, -6313, -3782, 7870, 9938, -9602, -15117, 11001, 18636, -11822, -20378, 11635, 20194, -10252, -18292, 7568, 15070, -3609, -10926, -1254, 6486, 6672, -2160, -12029, -1597, 16769, 4553, -20270, -6586, 22055, 7671, -21942, -8091, 19718, 7887, -15722, -7571, 10182, 7116, -3841, -6901, -2779, 6929, 8927, -7138, -13976, 7448, 17504, -7584, -19113, 7461, 18848, -6725, -16746, 5369, 13261, -3224, -8861]
562h861R307L683j305k524o564K252J3444k859j8644M145K1579n732k1989P167
576f901J9964q004j5888P936J0358o686m261M369j674j060O571k731r884O539
590a352J1316r849j0747J2169Q388j3154m731J2626L84j0670L899P563p521l708
604e387R890l33j0644L968R704o696p157Q119L382q020J125O407n696l518R718
619D862j23j2728L999J4307p445j4303R819J2770j0679r976R694O369o918k515
633b867K609j167K794M180q514o267J3868P338j8081p449K0548O861k0859n850
647a2856J8890M795j4777m035Q978L769k090m192n047N085J1764o374j7316P698
661e708K1085q667k2791Q936K2299q152j9781O160J5642k957j0409j328M823O286
$$ y = [-8861, 446, 4129, 2824, 300, -6264, -4012, 9432, 6573, -12071, -7926, 13653, 7921, -14068, -6901, 13063, 5059, -10829, -2893, 7465, 779, -3482, 887, -787, -1847, 4724, 1993, -7891, -1352, 9964, 115, -10632, 1537, 9925, -3229, -7960, 4666, 5050, -5620, -1721, 5842, -1679, -5387, 4503, 4170, -6474, -2506, 7198, 502, -6655, 1464, 4846, -3174, -2049, 4358, -1338, -4856, 4862, 4739, -7989, -3990, 10317, 2872, -11431, -1612, 11158, 479, -9497, 197, 6566, -352, -2867, -258, -1425, 1369, 5549, -2965, -9232, 4636, 11974, -6107, -13556, 6992, 13853, -7006, -12856, 6034, 10829, -3948, -7983, 995, 4764, 2674, -1518, -6565, -1480, 10284, 3910, -13406, -5708, 15377, 6710, -16081, -7145, 15154, 7002, -12779, -6619, 9023, 6066, -4343, -5671, -848, 5438]
675E438N65j1412n215J6124Q724j9765j0878K1800J1700k1872j1375J9806J0220
688A3860j5692q690R955P064l091n805m088M980J0887m693j6541M792K0465n062
702H341k2264N226K1846m976j9310M074J5128k423r810RM081L003J372o266o038
717h007R498R358j2200j1164J4042J1310j4641j0076J3850P747j1646m835Q208
730A444J895l904O57q48k398N444L089r264k776J1984J546j3192K97J2759k370
745D363j0782M269P576n609l668O201n01n806M231M487p003k533Q497J24q456
760d610K317O973m444m254O004O98o736L146O594o692n675R460M174j1002k379
775f426J1099N81r678Q84O879j712l079J793j378j051N803l38r714K106J2676
$$ y = [5438, 6003, -5409, -10624, 5500, 14224, -5541, -16419, 5381, 17081, -4791, -16166, 3640, 13860, -1832, -10522, -567, 6497, 3406, -2399, -6487, -1507, 9380, 4687, -11854, -7062, 13403, 8341, -13923, -8697, 13149, 8173, -11137, -7063, 8065, 5642, -4168, -4159, -78, 2925, 4297, -1969, -8007, 1491, 10849, -1351, -12515, 1527, 12837, -1804, -11880, 1970, 9717, -1929, -6764, 1444, 3339, -565, 92, -756, -3154, 2290, 5379, -3885, -6661, 5323, 6869, -6323, -6026, 6733, 4363, -6419, -2150, 5426, -183, -3851, 2350, 1849, -3957, 274, 4761, -2242, -4775, 3722, 3846, -4610, -2293, 4680, 236, -4018, 1986, 2684, -4052, -906, 5688, -1004, -6679, 2781, 6955, -4047, -6426, 4673, 5254, -4424, -3540, 3339, 1627, -1452, 341, -1037, -2088, 3715, 3377, -6337, -4231, 8445]
790H445l952j4295N416J4464o145j3193N870J0675m426p284J885L537J522K41
804B760n454l550R348O135j2748p786J5115Q492j6061q378J5354P650j3012o617
818h752R222N471m316m560j117L920O583l658j1439L664J5236l847j7490L944
832g139J8057l699j6927K952J4296j578j0478m75O024L038j372n966k952Q907
846B688O496j1487r019J3331J0305j4090j0394J3522R493j1621p881Q511N891
859E745m404l936k37K288M903j097r070M83J2298m06j4205P09J4615j185j3518
874g017J581J1091j702p673J346L758n06K27q00l795K429O478m135q073N723Q455
890G387o900p646P439N860p198l419O149P60m412J813K079l812M89M966k936n113
$$ y = [8445, 4493, -9802, -4386, 10078, 3933, -9260, -3390, 7285, 2859, -4425, -2540, 997, 2519, 2760, -2694, -6244, 3104, 9239, -3509, -11295, 3820, 12312, -3749, -12127, 3227, 10877, -2135, -8752, 470, 5941, 1625, -2935, -4052, -132, 6451, 2793, -8646, -4982, 10254, 6407, -11083, -7139, 10918, 7219, -9708, -6756, 7540, 5962, -4516, -4991, 1033, 4071, 2699, -3267, -6219, 2688, 9184, -2303, -11322, 2009, 12314, -1776, -12170, 1352, 10845, -776, -8657, -146, 5745, 1341, -2595, -2832, -544, 4359, 3262, -5808, -5325, 6973, 6567, -7638, -6929, 7686, 6501, -7017, -5436, 5655, 3953, -3720, -2374, 1384, 878, 1105, 305, -3490, -1061, 5417, 1282, -6791, -1068, 7387, 487, -7159, 280, 6140, -1058, -4477, 1672, 2432, -1980, -167, 1912, -1900, -1411, 3555, 619, -4494]
906d494M900M296o145k705O485N43n887J838M407m080k273N826j54o831K495O969
922E190m343o264N434M848n542k939M686P49k853J393L11l222K622M445n425n124
938f034P819N163r414m702R947L864r290k901P452K018m640j387J124J124K727
953B870j255o382J699R502k348j1691K945J2760l304j2538L191J1114k458q707
967d602J060N631R28k221l353j116N884M019q242o264J0114P662j1153q203J1163
982A307P945j0019p092P805N859m681m542R65L300K983k271o706J542R855j119
997E131j2109R48J3176q52j2988P12J1558l43r115l37N930J390k418k702j132
1012c151M230M199n699o569O994P996p827q398Q016P857p436o544O107M694m041
$$ y = [-4494, 406, 4702, -1443, -4148, 2337, 2880, -3007, -1169, 3238, -842, -3115, 2711, 2557, -4274, -1779, 5190, 847, -5417, 17, 4865, -677, -3616, 1070, 1819, -1034, 359, 670, -2552, 70, 4515, -910, -6034, 1785, 6948, -2466, -7168, 2779, 6643, -2647, -5548, 1904, 3922, -718, -2105, -981, 143, 2870, 1615, -4767, -3068, 6434, 4086, -7605, -4660, 8100, 4796, -7742, -4551, 6563, 4105, -4602, -3542, 2089, 3017, 796, -2557, -3673, 2211, 6230, -2012, -8276, 1838, 9500, -1653, -9856, 1307, 9252, -767, -7859, -54, 5805, 1124, -3418, -2453, 847, 3830, 1559, -5147, -3605, 6250, 5131, -6978, -6030, 7146, 6294, -6694, -5982, 5576, 5233, -3882, -4219, 1711, 3101, 683, -2019, -3151, 1079, 5278, -421, -6990, 4, 8000, 173, -8225, -209, 7648, 212, -6332, -225, 4469, 428]
1027D28k726J510P97J329P42m061j707O329K078p956j882Q708J215q502k94P351
1043C359o24n500J423L107j861m72J866k020j397M058N49n376N71N816j732n392
1059c625K756M177l498k356L817J69l644K027K975l877j989N173P62n667M65N277
1075B942j454m121K105K268k241mJ904k388j084M555k6o198J225P156k300p323
1091d984L004O686l146n403K690L608j589j540m3n90K045K456m121l866N942M808
1107E957p314n226Q013N128p840m647O779L916m871l150K337K418O43j844l702
1122c403J495O450j326q639J306J0003j312j0403J206R788q86q246K39O008P55
1137C035l319k037M47L548K201n012m399O275O000p193o832P518O935p129o417
$$ y = [428, -2298, -788, 9, 1338, 2080, -1981, -3688, 2641, 4719, -3237, -5119, 3589, 4804, -3698, -3992, 3359, 2735, -2765, -1342, 1765, -96, -568, 1298, -722, -2119, 1939, 2488, -2888, -2317, 3499, 1767, -3625, -869, 3308, -190, -2546, 1271, 1440, -2204, -177, 2798, -1079, -3068, 2105, 2867, -2800, -2335, 2942, 1488, -2633, -528, 1740, -501, -505, 1399, -989, -2073, 2482, 2456, -3742, -2517, 4639, 2339, -4984, -1980, 4706, 1560, -3843, -1153, 2455, 866, -674, -717, -1307, 738, 3194, -927, -4793, 1149, 5957, -1357, -6583, 1430, 6558, -1282, -5929, 850, 4766, -105, -3255, -918, 1500, 2143, 299, -3403, -1908, 4542, 3216, -5423, -4117, 5886, 4574, -5829, -4623, 5165, 4279, -3967, -3728, 2280, 3035, -284, -2321, -1874, 1674, 3875, -1137, -5536, 739, 6739, -454, -7286, 232, 7167, 38, -6379]
1152f379O026N408m222m188J917K854P13j624l404O47N798lp643l56Q787M54r065
1169d280l98Q468L02p043l00N013M84k584q54MJ438K406k204m292K967N524l625
1186A026o022M096N728m187m812L880L397l118j730J944N0m95J383j060k400K540
1202B20K863l736k759M470K167m664j188M278L8l361J112K054k088n04K720j037
1218E85k950K380K722l284k139L655J251l417k20K596q12j318J707k93k319J962
1234A06K622l460k594M571K281n120j742N003J145m216n79K825J57r75K5j095
1250a046M0L108l13m872P36O090j153o715J466O676j545n956J267M708o24l040
1266a173l69J166J625P15l000k375M309L629n298m493N916M866n973m805N411
$$ y = [-6379, -353, 5055, 833, -3355, -1438, 1416, 2129, 505, -2899, -2252, 3546, 3543, -4100, -4456, 4331, 4785, -4280, -4678, 3790, 4092, -2951, -3251, 1762, 2246, -338, -1192, -1188, 250, 2656, 452, -3840, -873, 4651, 1026, -4996, -900, 4828, 641, -4171, -291, 3106, -12, -1742, 202, 252, -243, 1140, 80, -2320, 220, 3083, -653, -3412, 1058, 3225, -1439, -2627, 1651, 1689, -1672, -560, 1494, -594, -1098, 1622, 585, -2365, 15, 2737, -547, -2686, 969, 2220, -1197, -1417, 1179, 367, -951, 756, 463, -1856, 106, 2728, -732, -3326, 1245, 3526, -1594, -3336, 1667, 2812, -1404, -1983, 842, 999, 24, 49, -1046, -1006, 2102, 1789, -3083, -2347, 3743, 2590, -4125, -2659, 4017, 2472, -3484, -2217, 2491, 1867, -1173, -1542, -376, 1249, 1964, -1036, -3411, 898, 4527, -771, -5264, 652, 5518, -455, -5260, 151]
1281A51M376m227l728K538K914m52k089j805J344L994p80n807L72P087j03p728
1297c943m8P613K05o770m34N319Q23l425j341J253K038Q76k787k806L557M249
1313D379m148n164M489N488m470n267M026M577l158l547J880K349l33j141j361
1328a401R3K969P21m332j206N266J375n657j281N522J003m819o21L606K71k079
1344e70kL56m9J280p1k677L70L636p76m088J218L993j614l358J831K336j858j032
1362a075J603l12j117J544M62k466K64K979r61l011J509K568j824j755J834O61
1378I03j536N49R70j706k19K644n73l275J298L514j821l334K044K790j898j952
1394a602J378R51n32J23n54j110J714J905k786k459L645K703m141k678M162K440
$$ y = [151, 4527, 300, -3428, -890, 2024, 1572, -517, -2322, -978, 3016, 2236, -3571, -3199, 3888, 3785, -3943, -3991, 3622, 3827, -2943, -3377, 1942, 2765, -660, -2001, -748, 1290, 2166, -621, -3427, 130, 4379, 231, -4933, -444, 5044, 574, -4693, -667, 3910, 752, -2795, -915, 1434, 1101, -40, -1401, -1308, 1661, 2382, -1950, -3156, 2110, 3485, -2172, -3453, 2069, 3072, -1747, -2368, 1238, 1509, -570, -572, -216, -265, 1015, 944, -1733, -1363, 2273, 1497, -2591, -1373, 2620, 1006, -2352, -521, 1815, -43, -1075, 528, 216, -901, 643, 1105, -1361, -1097, 1882, 921, -2090, -581, 1987, 163, -1592, 242, 903, -633, -84, 886, -820, -1039, 1605, 1032, -2243, -945, 2569, 748, -2586, -542, 2248, 350, -1602, -224, 727, 195, 318, -236, -1346, 368, 2273, -513, -2972, 673, 3376, -765, -3443, 719, 3159]
1410C159l705k030K722J606j390j183k21Q58J898o45l454N62M692n56n481N58
1426b610N748m90n477L02M702P0l484o17J994J337l93k123j170K925K494l597
1442c89l482M006M068m100m277L825M100l159l599K108K864p71k033p26J199K256
1458A890m63l608j16M662N22n299p21N410Q42n071q53M201Q88k945j005J466J177
1475I77Q9j411j568J729K789k052l626K286M017k373l966K267L508j910k735J340
1491f39J763n86p08l12k55J217J041k070j532K704J740l059j658L086J330k778
1507g16q40K162K79j322K71L25o82O63R37j533r80K170Q46k507n30K469J23k073
1525i38K94J383o77m58R22n28j033J471R75k235p88K699N18k804k31K525j8j890
$$ y = [3159, -546, -2576, 146, 1752, 362, -821, -1042, -184, 1714, 1069, -2385, -1823, 2869, 2313, -3168, -2610, 3138, 2648, -2829, -2527, 2175, 2245, -1239, -1856, 138, 1475, 1082, -1041, -2211, 714, 3208, -389, -3871, 135, 4203, 103, -4174, -349, 3751, 592, -3007, -899, 1965, 1194, -839, -1565, -366, 1890, 1427, -2181, -2297, 2365, 2887, -2412, -3133, 2277, 3119, -1952, -2805, 1396, 2284, -661, -1666, -200, 977, 1066, -345, -1913, -184, 2605, 553, -3073, -787, 3230, 857, -3109, -842, 2666, 756, -1979, -639, 1124, 538, -170, -482, -737, 480, 1521, -549, -2081, 623, 2363, -696, -2354, 732, 2062, -716, -1556, 606, 885, -437, -166, 159, -523, 140, 1077, -456, -1436, 734, 1580, -927, -1457, 1012, 1135, -938, -644, 739, 62, -396, 526, -2, -1035, 436, 1411, -824, -1612, 1087, 1605, -1199, -1430, 1095, 1077, -813]
1543h13J57R76j78R8M9j183J75K173m46k937P26L377q99l471R59L207q10k630
1561a470M70J785P3q18p48j99J470J151k190j912K761K451l118k745L186K763
1577B910k901k580K289K233j366j781K20J318J035q77k260N13L306k21m077lM467
1594B225J89m427l81L996N60l151q50K079J163q16j531m58J892J616k205k558
1610b657K444L181k498l480K360L421j999l066J418K485o41j784k35R93J197k83
1626H56k066l37K805P69l289j041L485J144l367j107K901R82k154q23J204O85
1642F47j52o01q66N78J762o15k402O91K748p57k767P94K470p51j912O17J156l77
1660B63l36N6m66L07J115o74j574R85J781j198j719J267J429j187r37R57L34n65
$$ y = [-813, -656, 320, 142, 240, 289, -894, -719, 1454, 1008, -1929, -1203, 2174, 1275, -2196, -1237, 1970, 1160, -1470, -1000, 785, 858, 40, -708, -907, 563, 1714, -476, -2388, 373, 2824, -294, -3039, 147, 2910, 9, -2571, -282, 1951, 585, -1196, -976, 342, 1377, 500, -1760, -1247, 2059, 1838, -2239, -2242, 2225, 2414, -2013, -2394, 1602, 2162, -989, -1839, 240, 1403, 587, -944, -1402, 490, 2106, -99, -2657, -213, 2968, 470, -3010, -650, 2771, 772, -2294, -876, 1609, 968, -816, -1051, -58, 1139, 856, -1210, -1547, 1258, 2027, -1262, -2303, 1182, 2326, -1041, -2148, 753, 1735, -419, -1242, -38, 647, 495, -106, -972, -394, 1368, 753, -1649, -958, 1790, 1033, -1734, -940, 1530, 779, -1133, -516, 640, 263, -73, -17, -483, -176, 939, 265, -1309, -324, 1457, 259, -1460, -193, 1236, 49, -888, 69, 403, -162]
1678a62K87J09q62M11J279q70j533J203J598j381j440J343J109j078o87O14K01
1695A41k4K82o61o89J314R92j846j162K197J212k287j169K114J017j652q57R68
1712a10O86j13n42p67M20J639l50k353K99K822k28l043J48K958qk582k06J965
1730F35N18j197q74L25J249N62j636j334J938J960k133k362K149K547j967k514
1746b134J589K265r98j883K62J412N69r04j406L91K168K1k753l53L088O15l160
1763a211p69K917Q90k410r74J681J034p84j103j26J149J019j207j750J230K283
1779A869j220k554J109K578r37k354O60J923l02j354j38P21O13r4j074m68J477
1796D55Q96j772j161J930J236j865j175J632J000j237p29O94M37q8j39n32q0J078
$$ y = [-162, 125, 234, -628, -217, 1062, 192, -1341, -138, 1460, 79, -1361, -18, 1091, 13, -674, -60, 141, 117, 399, -262, -951, 363, 1355, -491, -1653, 544, 1756, -531, -1700, 414, 1431, -221, -1078, -110, 576, 463, -79, -846, -426, 1213, 863, -1490, -1191, 1631, 1403, -1640, -1492, 1466, 1458, -1124, -1330, 635, 1153, -44, -918, -593, 656, 1218, -418, -1752, 186, 2146, 13, -2349, -200, 2347, 380, -2134, -545, 1720, 722, -1161, -899, 513, 1082, 178, -1228, -837, 1331, 1352, -1401, -1754, 1334, 1949, -1211, -1980, 937, 1827, -583, -1557, 124, 1158, 374, -729, -855, 294, 1313, 106, -1644, -414, 1869, 649, -1905, -796, 1782, 845, -1509, -849, 1074, 772, -582, -720, 1, 614, 520, -554, -1022, 455, 1351, -421, -1582, 348, 1584, -281, -1456, 176, 1176, -61, -790, -96, 341, 253, 114, -418, -498, 580]
1814E80K07j473k76J714K62j730j94J521P1j117QO05q5j2J26n69j18J064N5j402
1834g63J8J546o1j510R9J266j00q51O0L22N5K39j92p72L40J251n00j575N98J727
1854A197o31j695N49J481l62j119Q2O43L16j49p19l46J109P90j433j135J641J350
1872A569j689j430J554J401j233j268P36J076j49q32n21N72J184l63j722J27K165
1889A177N3k374k15K382L51k151n29J748O92j167q69N13J033J90j197q29J290
1906I8J397j354j803J327K023j192k076R56J914n77j630J47J205L72p54q94K84
1923e57J369J46j728m98J955P57k020r04J896R55j576r38J118Q77n47p90n6O69
1941A28O53n78j148N00J510m15j736L47J760k63j611J32J319Pr03j68M13L51O7
$$ y = [580, 787, -686, -962, 752, 1014, -716, -910, 611, 682, -435, -427, 178, 93, 81, 207, -362, -480, 584, 639, -763, -745, 801, 740, -770, -671, 595, 495, -356, -296, 26, 81, 320, 128, -644, -304, 947, 447, -1128, -530, 1197, 566, -1129, -580, 901, 539, -580, -498, 145, 461, 312, -407, -753, 356, 1146, -287, -1422, 219, 1569, -120, -1550, 4, 1405, 172, -1096, -360, 716, 567, -265, -786, -214, 970, 607, -1115, -988, 1177, 1230, -1144, -1359, 1023, 1374, -777, -1306, 442, 1134, -33, -902, -389, 644, 834, -363, -1192, 98, 1495, 141, -1662, -335, 1688, 496, -1580, -624, 1290, 713, -917, -770, 435, 807, 53, -841, -557, 812, 958, -770, -1268, 687, 1444, -576, -1480, 416, 1371, -205, -1143, -25, 852, 305, -485, -541, 128, 781, 203, -945, -445, 1065, 650, -1086, -739, 1021, 758, -853, -721, 598, 605, -298, -466, -53, 298, 365]
1960C65n31m93O96Q41q17j055Q67J127q29j054P05Q75n17n76K16K59R3P0l92l83
1980e33O89N71q78o97R81P27r44o62P85N30n22l39J61J35K27O0o05k18R25L51
2000G44j176m22J275M62j225m85J032M61o98m37K86M09J82l93o42L68J059l40
2018D60j364L07J530k23j555J08J421N8j160k46P72M71l31p03j25R20N56j091
2036a95r25J186J182j186j322J072J346q45j267N23J084j03q66l58O17Q05l49
2053C99j206J12J516J18j713k79J731M43j606n79J351O65r50p52M90Q02J8q57
2071b97n09Q55R36q18j276P67J456o42j515M75J421k54j200l3R30K81n37n75J81
2090c54Q28J73j028m74J162O69j182p84J095Q08r10p66O32O70k93n30n9L61M35
$$ y = [365, -166, -659, 37, 878, 61, -994, -127, 1000, 171, -883, -178, 697, 180, -396, -180, 79, 172, 242, -150, -533, 156, 727, -151, -848, 133, 860, -84, -746, 39, 569, 47, -292, -131, 4, 231, 291, -314, -532, 393, 744, -432, -854, 421, 883, -342, -827, 205, 666, -32, -469, -183, 226, 408, 15, -627, -259, 800, 460, -904, -597, 933, 710, -845, -737, 684, 742, -418, -664, 108, 579, 248, -455, -580, 340, 896, -195, -1120, 66, 1248, 62, -1260, -188, 1158, 313, -954, -431, 653, 550, -316, -674, -57, 748, 399, -807, -695, 821, 939, -774, -1053, 678, 1121, -485, -1064, 287, 952, 2, -750, -260, 542, 560, -297, -806, 49, 985, 167, -1109, -342, 1114, 472, -1043, -568, 853, 599, -601, -634, 296, 577, 40, -535, -354, 474, 647, -381, -855, 307, 976, -206, -990, 105, 913, 3, -763, -131, 539, 246, -284, -343, 18, 453]
2109D53k18p49R0R76J7j109q2J112J35r96j81P84K14m94k35J42K61J93k70n06
2129d63K77P45k80q87K56R25j90q54J09O71jm26j17J19K50J85l78m36M59O71n38
2150I7p88N25Q50m53q02L21O80j30n08j06K82L68n3n96j80P99L64r44n16R86O06
2171H02r18o63P66O70n27o31K10N71J53m77m99L75Q12k65j060J44J211j5j253
2190e94j05J172K28r63l89O96N12l46o35j8P37L64q08o73Q24R10p88j057O93J103
2210H63n27j060L10R21l0p35k69N21N56k96q18O6J022J57j138l34J157M71j079
2229b42n53Q95N95o26o16L01O12L2n63l58M97O52m21q87L45J010k28j052J04R82
2249D79J5q12j48N75K96l18m06K8N00K37n78m45O06N97o00o73N36O82m09o17K42
$$ y = [453, 235, -514, -424, 552, 569, -540, -622, 490, 625, -371, -552, 232, 446, -48, -283, -141, 120, 313, 43, -463, -186, 559, 279, -608, -352, 573, 383, -471, -362, 309, 308, -118, -235, -116, 134, 319, -59, -495, -36, 635, 97, -691, -166, 684, 231, -571, -250, 430, 300, -208, -314, -32, 336, 283, -313, -493, 306, 670, -274, -790, 196, 802, -116, -779, -13, 657, 130, -501, -291, 280, 433, -44, -543, -168, 644, 379, -681, -537, 674, 659, -594, -699, 473, 701, -262, -651, 45, 557, 211, -424, -442, 295, 659, -149, -822, 2, 912, 124, -933, -240, 863, 336, -724, -414, 507, 477, -258, -527, -6, 550, 254, -564, -498, 524, 681, -457, -791, 366, 837, -242, -795, 100, 695, 69, -547, -246, 366, 398, -165, -523, -26, 626, 205, -682, -337, 673, 445, -607, -503, 479, 494, -318, -466, 109, 405, 87, -319, -291, 209, 446, -132, -577, 29, 626, 26, -647, -111, 571, 162, -455, -213]
2270b13N00n4l36j62J79L61j5n26j26O38K51o90l36O75L56n53l75L97L36j83k97
2291a73m2K14K94j52m99O9O42J6p34p6P37J58o66k13N06K69k87l04M1L41J96l56
2313a9m32L60O17l36p41K89P75j83p77P7O63Q1n12k26L12L93j12n25j12O48K97
2334E37p17m48P05N73o46o38N19O59l49o04J04N42J54m44m01L34O15k00p99O8
2354d36Q98O4r07j99Q63K97p31l85N11M85k84n25K9N45K37n64m60N36O51m97p60
2375f32M00Q15k77p97J31P05M2n63k21L81L87j92n45MO62J64p17k92P04L91o34
2396h4m49N12M88l45m67J26M28R1l54l01K79M62j72n98Q2O64Oo75r0O05J61m81
2418a12k32L19K87j30l15p1L33K48l31l83L00N00k69n35J93N28j02m54j1L50J23
$$ y = [-213, 287, 233, -103, -265, -86, 275, 260, -266, -392, 246, 497, -193, -529, 146, 502, -51, -426, -29, 307, 124, -173, -215, -1, 293, 141, -358, -289, 353, 369, -365, -441, 296, 454, -212, -425, 81, 350, 63, -241, -200, 141, 337, -19, -451, -91, 526, 190, -551, -262, 513, 330, -447, -370, 293, 374, -138, -364, -52, 341, 229, -296, -408, 240, 537, -180, -628, 77, 650, 4, -634, -115, 544, 195, -409, -305, 237, 391, -53, -454, -120, 495, 295, -504, -436, 462, 526, -381, -580, 283, 580, -151, -536, -25, 460, 176, -349, -320, 225, 462, -102, -562, -26, 625, 128, -632, -232, 583, 306, -491, -360, 345, 387, -176, -397, -16, 371, 179, -366, -362, 300, 464, -253, -545, 159, 550, -84, -533, -21, 467, 122, -345, -219, 209, 300, -54, -355, -76, 386, 214, -384, -302, 362, 368, -307, -397, 208, 369, -112, -344, -25, 262, 132, -183, -254, 79, 327, -4, -387, -87, 413, 144, -391, -198, 330, 228, -226, -237, 113, 236]
2439B36k25k31P8L27P1l87k13M39L13m46l78L83M25l05l92J43L67J2l08j65K03
2460e3L22j09m52J6N35Q7n71j82N62K59m77l26L72L42j98l65J5L63J70l48l39
2481c77L00M76k33n84J64O45j00o05k9N66J23m32k58K85L66j17m45n4N08K10n42
2502a33l36N04M51m47n13L25N50j99n19M0M53J43l75l00K59M48j47n51M1O16P4
2523C84o27j68N67K64m84l23L52L74j97l94J2L99J68l81l27L44M42k79n24J96
2543b02N57j11n29OM64J03l61k13K36L05r9l75m8M17J74m27k85M15L49l39l87
2564c50K42L98j35l49pK94J47k21k63J25L64l8m21n1M40J30m36j84L73K06k52
2585A2k60J54K63nk55j34K38K53j99l46J51M00q3m36K6M12N1l47j29K48K08j39
$$ y = [236, 11, -220, -142, 185, 256, -131, -344, 95, 408, -38, -416, -33, 392, 87, -305, -162, 205, 217, -91, -256, -53, 269, 160, -292, -276, 259, 346, -225, -407, 155, 414, -63, -389, -17, 325, 127, -238, -223, 140, 310, -38, -377, -77, 399, 166, -418, -254, 391, 291, -314, -343, 223, 346, -86, -344, -59, 307, 190, -255, -309, 199, 409, -133, -469, 35, 486, 39, -474, -149, 401, 202, -317, -277, 176, 319, -56, -356, -97, 351, 204, -347, -306, 310, 384, -243, -411, 156, 420, -64, -387, -35, 339, 142, -252, -240, 159, 327, -54, -381, -37, 405, 126, -398, -202, 355, 244, -285, -279, 185, 288, -73, -286, -50, 255, 156, -219, -267, 150, 324, -103, -388, 27, 376, 37, -350, -108, 290, 155, -194, -201, 93, 240, 19, -244, -119, 245, 207, -214, -265, 175, 305, -131, -315, 58, 264, 12, -248, -94, 169, 164, -91, -225, 13, 266, 67, -279, -128, 272, 189, -247, -221, 191, 242, -105, -234, 14, 222, 83]
2607H3k65NL10J25l32k27L20L19k95l73K18M00j19l81J7L35J05k76k06J78L07
2628B48r2l93qM27J19m50j91M09K76l60l06K45L46j22l56JL24J52k91k75K33L69
2650C05j63m38P5M94km83p4M23J57l32k38K06L11p2l62m8L60J83l61k90L31L62
2672C44k77m05J84M18p7m04j8L44J28k61k38J79L37r2l84k1M16J16m20j68L77
2693G8K37l13k70J95K97q4l05l3K84J53k34k74K00L28j34l74O2L95J6l73r4L07
2715F4J53k09k09J00K58Lk84j01K82K02k69k58K11L16j48l31P0L13J6k66r3J94
2737A4J84j33k41M3K95L4l14j17L17J71k90k09K22K35j34k46L3K53O2k39j48J87
2759b1K51j42l06O3L55j1l47o1L09J35k57j84J58K48o8k71l1K63J41k65k26K42
$$ y = [83, -182, -177, 133, 258, -74, -301, 19, 338, 43, -330, -112, 288, 169, -212, -195, 140, 245, -31, -237, -59, 248, 156, -237, -245, 182, 301, -149, -340, 69, 345, -15, -321, -76, 270, 148, -208, -207, 117, 269, -22, -297, -64, 305, 142, -296, -221, 273, 271, -212, -286, 137, 294, -38, -276, -70, 241, 169, -193, -241, 119, 302, -59, -349, -18, 344, 67, -338, -154, 264, 187, -217, -235, 109, 237, -24, -262, -83, 254, 162, -222, -243, 173, 289, -131, -299, 78, 315, 2, -268, -73, 224, 140, -165, -198, 86, 239, 5, -269, -69, 259, 125, -249, -187, 208, 224, -149, -243, 64, 217, 8, -201, -101, 157, 160, -124, -225, 57, 259, -10, -268, -57, 259, 111, -220, -150, 163, 179, -87, -180, 14, 198, 65, -176, -133, 162, 196, -118, -235, 82, 253, -37, -246, -24, 211, 77, -169, -136, 117, 179, -60, -208, -21, 230, 88, -218, -155, 200, 189, -158, -219, 90, 225, -32, -216, -58, 190, 122, -149, -180, 83, 224, -41, -267, -25]
2781b5K93j80l33J17L49l7l32l8K67J39k28k07J36K71n1l32j6L33J05l39j62K92
2803B2K31k34k63J48L07p4k82m3K58J40k11k33J66K96r5l59M3L47M6l32j13K82
2825D7J76k13k27J37K60k3k98o2K75J53k37k43K22K69j43l22R8K89mk74o7K26
2847C9J50j83j91R0K48j9k86m0K84J15k63j58K18K13j75k18P7K34Lk10r4J88J53
2870A75j34k27J01K54l3k80k5K67Q5k32j37J68J90j07j99J9K11O2k08j45J86J96
2892A87j48k44J13K65m7k71j1K36P9j86j36J33J95o4k32rK41Q0k41j39K11J97
2914B09j75k29J31K19m7k19l9K13J06j82j62J11K34o1k79K1K72N0k49j17K27J57
2936A91j74k03J01K23j5k26p4K34J37k08j88J67K38j14k57L9K72J6k52o8K07J40
$$ y = [-25, 268, 88, -245, -128, 221, 184, -148, -186, 81, 220, -8, -215, -79, 192, 141, -191, -207, 126, 231, -108, -270, 22, 253, 19, -244, -96, 211, 137, -145, -188, 70, 210, -1, -234, -68, 228, 133, -226, -183, 164, 210, -122, -235, 47, 223, 10, -217, -80, 180, 157, -141, -203, 72, 225, -12, -255, -33, 236, 93, -229, -131, 158, 154, -120, -187, 39, 189, 6, -185, -95, 153, 134, -152, -192, 92, 207, -56, -214, 4, 217, 42, -176, -99, 135, 138, -72, -166, 22, 175, 41, -186, -85, 169, 136, -144, -169, 98, 183, -49, -186, -18, 172, 65, -134, -115, 96, 158, -50, -195, -9, 187, 39, -205, -92, 173, 126, -145, -156, 80, 159, -27, -163, -30, 165, 101, -131, -140, 101, 181, -60, -199, 12, 209, 34, -195, -64, 155, 108, -111, -150, 63, 169, -13, -175, -64, 170, 109, -170, -149, 123, 173, -76, -193, 34, 191, 17, -186, -85, 138, 123, -103, -177, 57, 194, -14, -202, -35, 203, 89, -168, -129, 143, 159, -93, -161, 46, 186]
2958A86j67j75Q5K29l2k40n8K48J03k19j60J86J95j25k21P1K28mk12p9J90J34
2980A63j32k08J05K29l9k45k5K51O9k14j25J58J68j15j74M6J94K0j89q9J74J53
3002A75j48j86R8K16o0k22NK10M4j70j00J31J41q5j72J4K00M0j99q7J88J33j62
3025Dj51J06J77m9j87MJ66O7j44j28J11J60o0j90J8J96L8k14p6J85J11j35j53
3048a44R6J59k3j68n5J78R4j46j36J16J71q0k09M9K03J6j93n5J52J06j19j49Q0
3071e7J75j0j99l6J95J02j91j36J54J60j11j92O8J83Pj80q1J60J21j22j60P6K03
3094A29l0k18j1K11O6j94j04J50J41j12j57M3J93lj85n8J61J16j34j56J08J72
3116A28n9j99K4J98K8j70q4J31J26q9j57N0J67J1j75o0J72Q4j45j24J23J47q1
$$ y = [186, 19, -156, -71, 158, 126, -114, -172, 76, 179, -40, -200, -14, 181, 56, -165, -94, 134, 130, -82, -161, 29, 163, 31, -177, -72, 157, 118, -127, -152, 99, 168, -46, -171, -13, 155, 40, -134, -88, 106, 126, -63, -152, 22, 175, 27, -159, -61, 155, 95, -127, -122, 88, 132, -38, -138, -7, 134, 49, -123, -109, 91, 131, -68, -155, 33, 166, 4, -147, -41, 136, 87, -100, -96, 70, 137, -7, -135, -24, 136, 76, -114, -96, 100, 138, -76, -152, 33, 144, 9, -144, -48, 111, 88, -80, -135, 43, 137, -9, -145, -29, 142, 62, -147, -98, 105, 121, -72, -127, 25, 131, 12, -137, -57, 118, 108, -91, -127, 68, 170, -21, -157, -3, 157, 46, -146, -78, 105, 112, -68, -149, 11, 132, 10, -150, -74, 129, 99, -119, -130, 81, 147, -47, -151, -1, 140, 28, -129, -86, 107, 104, -81, -139, 22, 138, 4, -152, -44, 128, 69, -130, -106, 92, 120, -50, -134, -3, 123, 34, -123, -73, 94, 105, -70, -130, 42, 126, -19, -143, -20, 127, 46]
3139D6j60RJ56M3j54n2J09J23q2j61M7J74rj68l9J61Q1j38j04J06J08m4j37KJ44
3164F1K7j18r5J24J24q6j54O5J49k6j48j9J38O8j16j12P4J27l2j40k2J60O6j52
3188c7r2J18J32r0j40N4J44Jj44l9J09Q5q6j24O6J38k2j62j4J65N0j48r1J22J16
3213A11r3j22M5J40Mj35o3J27J01j18j27Q6J65p9j49J1J64K7j51o1J25R4q6j14
3237i8L7J46Jj38n6J49R2j47j22J22J33p2j47J9J47K0j35o6J13J13r8j23M7J54
3261I1j3j56k4J52M9j39p4J05J14p8j27M1J15K6j18p2J14Q5q5j18O6J39k7j49
3285h3MJ42K3j01p1Q2Q8l5j09nJ35J8j28o8J29P8j03j05O6J23m5j18J8R0N2r4
3311a7o7O2J02m3j17K3J18J3j23l9J17N7q7q9N6R9j4j14j0R4O1q7r0P9J13n9j28
$$ y = [46, -114, -105, 51, 94, -60, -112, -3, 120, 38, -123, -76, 98, 89, -79, -118, 43, 124, -14, -118, -12, 96, 52, -85, -83, 61, 88, -30, -125, -1, 123, 37, -117, -52, 97, 71, -77, -96, 42, 110, -6, -118, -44, 83, 51, -89, -111, 49, 115, -37, -129, -11, 121, 31, -109, -55, 89, 90, -54, -93, 16, 101, 15, -109, -43, 95, 73, -89, -103, 62, 112, -36, -127, -5, 111, 18, -104, -59, 81, 85, -50, -113, 14, 115, -3, -130, -44, 121, 42, -107, -96, 68, 95, -56, -117, 8, 102, 16, -98, -61, 85, 86, -52, -108, 41, 133, -14, -136, -14, 119, 47, -100, -81, 66, 86, -49, -115, -2, 111, 13, -110, -63, 91, 78, -78, -102, 50, 99, -40, -114, -9, 105, 27, -100, -59, 56, 82, -36, -108, 6, 91, 6, -112, -46, 93, 66, -83, -79, 63, 86, -15, -86, -4, 84, 49, -60, -65, 70, 88, -40, -108, 21, 99, -4, -109, -43, 80, 35, -83, -65, 25, 77, -17, -84, -22, 80, 37, -80, -57, 61, 74, -49, -88, 29, 86, -1, -90, -34, 65, 51, -63, -73, 21, 82, -5, -95, -16, 97, 38, -90]
3338i0L1J31Kj24k7Q9O6p6p3K7J03Lj15k6J09N5j04p9Q0J00o2j09K6J19Pj02m6
3365h5R2Q4o0j10L9J16qj34l0J38M6j21p1J00R5o4j00K0J18jj01n1R6P3q4r1N6
3392c8J24l4j35MJ29K6j10n9R9P5o2j05L0J12J5j13m2J24O1r4r6P4J07l8j14J7
3418d3J02J8j08m4P4Q3o0j04L4J04Kj11j9J04M8j06o1P6Q7n8p8J4Q8J5q3l9O9
3445DP4o1r3L9J06j8j12kR4L1p9m6N5P6l1q3qR3L4r5n4Q7O7n6r7M7Q5j1r5j0Q1
3476B2L3n2o9N0Q5l0r0oR8K5q6m4P8N4n6p7L6Q2j6p8l1R4O0q1p9N6R0k0j08NJ06
3507E1K0j05l6Q4M7m1r4L3R3mr9j7Q2O5r3p9P7Q7m4r8K3R9J2r3l0P1O5n6q6L2
3537c4R7rj01k9J07M6r9o4R7N8m9r2L1Q9Pq4k6N7O9o1q1M5R6k8j08RR6J9r1n1
$$ y = [-90, -59, 72, 74, -50, -77, 12, 78, 2, -71, -44, 59, 62, -53, -79, 30, 85, -19, -98, -18, 82, 20, -89, -63, 56, 63, -39, -85, 7, 91, 31, -79, -40, 76, 68, -66, -96, 42, 88, -33, -104, -4, 91, 27, -73, -53, 65, 64, -37, -88, 8, 81, -3, -94, -38, 86, 52, -83, -79, 50, 76, -34, -93, 6, 81, 19, -86, -56, 56, 71, -42, -84, 40, 101, 7, -89, -15, 92, 54, -60, -43, 59, 77, -31, -75, -1, 82, 22, -82, -48, 56, 58, -53, -72, 32, 80, -26, -87, -11, 76, 18, -60, -46, 42, 57, -26, -65, 4, 78, 17, -76, -37, 69, 51, -61, -63, 31, 62, -17, -63, -8, 68, 37, -46, -54, 39, 73, -22, -76, 11, 78, 22, -75, -28, 57, 46, -49, -59, 22, 55, 3, -66, -16, 69, 39, -51, -57, 41, 66, -20, -64, 14, 68, 12, -65, -29, 53, 37, -41, -72, 22, 82, 1, -78, -22, 68, 48, -60, -55, 51, 71, -34, -70, 14, 61, 20, -74, -41, 52, 48, -51, -68, 14, 79, -14, -93, -16, 71, 27, -71, -48, 51, 63, -30, -60, 11, 76, 20, -66, -34, 63, 54, -47, -76, 31, 77, -22, -86, 11, 69, 20, -72, -41, 48, 55, -29, -55, 2, 71, 10, -71, -26, 70, 42, -66, -57, 39, 58, -33, -84]
3567h4Q4N9k8r0K0Q7Jq0m9J03N0o3p9O3Q5n0q7J9Q8J6q5m0O4N6m0p1QR4lq8k8
3598f8R6L9p9o1O6O8k9p9J1O7K2o2n1M9P1m8p9K4R4j7r1pQ3K8n5m5L5P2k7n8k4
3629e5R9No4m7O0P1n1p8K5P5qp4j6P1L6n3o3M7O2j2q7LQ4K5p7l8O5N2m8o9L0O8
3661C8Qp2l2O8N3o3o5L6R3k2r1MQ6J9q5l2P0M9m3o9J8Q7j7p5k5P3N0p6o4N1P7
3692D9j8r1RR4Rp5k1N7M1n2o0K6Q6j3q0k6R5M1q3n3O4P0o1o6J7P7J5q1k8O4N2
3723E8n3p2M1Q8k4q0j2P3K6o5l5M3O2l0o5NP1J7p7k4O5M9n2p1M6P3k4p6QO8J3
3754D6n7l2N0N4l3p4K1N6Po7l6P4N2o6n4M8N9l5n2jO5K0m6n7N2N5k6p5QQ5Np1
3786b5k4O9L7n5n4L4O5kp5pO8K1n8m9N0O9n4o9L0O1Np5j4N5M0n2m5K2P5j5p2r
$$ y = [-84, 0, 59, 31, -59, -39, 48, 49, -31, -80, 23, 73, 10, -69, -6, 79, 29, -58, -39, 49, 65, -20, -60, 4, 60, 20, -51, -43, 51, 48, -40, -68, 28, 67, -12, -73, -7, 61, 32, -47, -36, 31, 53, -9, -60, -11, 60, 12, -67, -43, 51, 34, -57, -64, 19, 47, -8, -53, -18, 54, 27, -31, -55, 44, 49, -15, -62, -2, 69, 18, -60, -35, 40, 32, -42, -58, 13, 49, -4, -67, -20, 42, 30, -57, -54, 30, 55, -22, -60, 5, 57, 9, -60, -30, 38, 46, -26, -58, 10, 63, 0, -65, -29, 64, 42, -49, -45, 41, 60, -25, -57, 13, 62, 19, -50, -32, 55, 38, -37, -62, 11, 61, -15, -79, -28, 49, 31, -60, -51, 43, 52, -23, -44, 13, 54, 2, -58, -32, 54, 41, -39, -65, 30, 71, -12, -65, -1, 69, 8, -58, -41, 36, 51, -30, -58, 6, 58, 5, -67, -26, 62, 38, -42, -54, 19, 45, -20, -55, -12, 50, 20, -45, -40, 31, 48, -29, -53, 12, 61, 9, -62, -16, 57, 33, -43, -35, 33, 46, -11, -43, 7, 61, 28, -46, -25, 31, 38, -29, -65, 9, 61, -5, -59, -11, 48, 13, -39, -40, 25, 45, -1, -58, -6, 49, 23, -52, -44, 41, 46, -25, -49, 20, 57, 2, -52, -18, 47, 45, -30, -37, 31, 52, -6, -55, -5, 64, 10, -59, -29, 32, 37, -38, -52, 3, 43, -9, -54, -32, 43, 28, -44, -53]
3818e3P2L3p6l2M1P7m3o8K3O3Lo0l9P0M0m3o5K7Q4k4q2PP6K1o8m0O1N3m2o9J3
3849d0P8lp4j9P6L3n6n8L6Q5m1p6J0P3J1n4l1O3M7l4q0K9O9Rq2j2O3L3p0n0O0
3880eO2k6q4J7O9Pn2o0O4O2m7o4K4P6qp2rO6K1m0m9M4M6k9o2%N9K5o3k7N5M7m3
3913Do0L7N6op0j3P6K8n7m2M5M3j7o4jO7K2o4n3O0M9m1o2K4Q1j6o0j5N3L9n3m4
3945e4M1O1j3q2lQ4%n8l0N1M1l2m9J1P2Op3k7P7K3m4o0M5O2k0p8OO6J8o5l9M6
3977a7M9l3n2J2P2Lo7l0P5L9n6o5N1O9k7p3PP2K2o3n4P3N4m2p0K4P4j2p6oO7L6
4009E6o8m0N0M9l2n2RN4Kn2l3N1N5n0n9K6O9po6nN8K8n5l5L7N5k9o4J6O6Oo1k6
4042d7N7M1m1o3L5O6k3n9mN2J8n1m2M7N1rp0NP2jo0k0M7K8l1m4J9O3j5o0mN1L0
$$ y = [-53, 19, 52, -24, -56, -15, 62, 19, -49, -26, 37, 40, -20, -59, 11, 51, 8, -57, -30, 54, 30, -52, -45, 31, 52, -16, -56, 5, 58, 16, -53, -40, 38, 35, -39, -58, 18, 51, -5, -63, -27, 58, 17, -59, -49, 24, 35, -19, -50, 13, 60, 26, -54, -25, 44, 53, -29, -41, 22, 55, -15, -65, -5, 57, 31, -53, -36, 33, 40, -12, -72, -8, 54, 7, -57, -33, 43, 35, -37, -46, 20, 41, 1, -48, -4, 42, 13, -49, -49, 10, 35, -28, -55, 0, 47, 4, -56, -19, 37, 31, -39, -52, 24, 52, -5, -47, -2, 41, 24, -40, -41, 26, 48, -16, -69, -9, 40, -1, -63, -39, 42, 26, -34, -49, 4, 43, -10, -54, -13, 48, 35, -47, -50, 34, 34, -24, -54, -3, 38, 6, -43, -32, 40, 46, -27, -54, 23, 46, 2, -58, -13, 49, 29, -49, -43, 23, 41, -24, -63, -17, 32, -1, -53, -41, 31, 34, -33, -63, 12, 51, -5, -70, -19, 50, 23, -50, -43, 29, 51, -12, -66, 7, 61, 19, -51, -27, 47, 35, -41, -47, 20, 56, -12, -52, -2, 47, 15, -37, -28, 26, 28, -24, -57, -6, 49, -1, -60, -34, 35, 28, -38, -43, 15, 43, -12, -47, -10, 45, 16, -48, -32, 34, 40, -21, -47, 10, 51, 10, -53, -18, 48, 25, -34, -38, 14, 32, -19, -61, -14, 37, 28, -42, -37, 35, 34, -26, -46, 1, 29, -2, -46, -27, 36, 21, -39, -43, 8, 38]
4075C8n1m4M4N6k9n9J1P0Op5j4N4L3l1o6K4O6jp5JO0J9n2m1M0O1m1m5RO1mn2j5
4108d2N1L1m2m4K3P1k6o1j6P3K8o4l1M0N1l0n9J2N9Rn0l2N8L3l6n8L6N8j1o9q
4139d6O5K0m9l8K9M9j9n6J5N8lo4rN1M0m7n0M1O3j7o4LN8Ml5m7N1M8l3n9RN7Q
4172C3n2k0M5M4n4l7L9M7k5m6rO5J0m5m1L8M1l1n4J3O7rn1j7N2L6l3n4K2O8k7
4203A5m4nN1K0m3l9M1N5l6m6J8L8nm5j3L9M1l8m9L4M1j3o1MO2J1m5k6L9M3l8m2
4235c6LN7Mo6j1M1M4l5n2K0O2j2m6qN0K6o1l0L9M8k8m6OO7jm8k5M4L2m1m8L1M4
4268B4j5n0JM9K7m8l4L9M9k9n6J4O1Lp2oN5K9m5m7L6N3po9RN3J6n0k9M5L6k3n4
4301c5J2O6rn9qO1J5l9m6K3M0%n9jM9K5n4k4L5M1k9m4J5N6pn8mN0L2m2l4K5M1
$$ y = [38, -13, -57, -13, 43, 14, -45, -34, 36, 42, -33, -47, 7, 40, 9, -57, -33, 33, 32, -43, -42, 18, 37, -15, -56, -16, 45, 4, -41, -32, 29, 25, -27, -42, 9, 40, -2, -46, -23, 48, 22, -39, -55, 18, 46, -18, -49, -9, 42, 12, -47, -35, 24, 33, -17, -49, 9, 42, 6, -52, -16, 42, 31, -38, -46, 19, 39, -10, -48, -19, 30, 11, -45, -30, 28, 25, -39, -48, 3, 43, -4, -54, -13, 50, 33, -31, -28, 30, 34, -1, -48, 3, 51, 18, -41, -32, 25, 33, -19, -39, 6, 50, -4, -41, -2, 45, 20, -26, -35, 30, 40, -5, -46, -8, 33, 2, -52, -39, 28, 19, -32, -49, 3, 39, 6, -48, -26, 42, 15, -29, -34, 17, 37, -6, -45, -4, 51, 15, -31, -13, 25, 20, -25, -38, 1, 42, 4, -45, -11, 30, 17, -44, -40, 22, 33, -12, -38, 1, 44, 6, -36, -33, 24, 28, -38, -49, -8, 36, 1, -51, -31, 31, 19, -27, -35, 15, 41, -20, -50, -11, 37, 9, -37, -31, 36, 35, -13, -38, 6, 38, -3, -51, -20, 24, 9, -41, -40, 9, 36, -12, -46, -7, 42, 13, -43, -29, 32, 35, -37, -43, 12, 41, -4, -51, -15, 38, 31, -38, -29, 24, 40, -10, -39, 6, 42, 19, -35, -23, 43, 34, -25, -33, 28, 43, 4, -42, -19, 21, 21, -38, -39, 10, 35, -19, -43, -8, 33, 4, -40, -25, 31, 24, -34, -38, 12, 44, 2, -32, -7, 34]
4334C4rm7%M4J7n1j4K6L1k4l6J6N7Jo2j2M1K1m4k3K1O2k7n1J0L9J1n6j2M4K3k5
4366Em0J6L2J5m6k1M8K9l5l6K5M6j6l7nM2K7n8k3L8L4k8l5%M6Rm7j2L6K2k3m2
4398c4K5L9j2l7rM4J1m6k1L4L4k0m1ON4Kn6j1N3L0m1m7M2L5j4m3%M4K7o1qK5L7
4431D1l7n5K8M4rm4kL4K9l9l3K9N0k1n2QN3Pl8l2M3M2l8n4K8L7J7o9j1O0J5k2
4463Im0J3N1j3m9OM9K4o3k0L6N0n2l8J4M1mm5pM7J3m6j5J6O2l2m2J2M6Pm5j8L6
4496CL1l1l0NM5ml4j4M0K6m4l1M3K4j7n3K0L3K1m7k0L7J9j2l5J0L5%m5qL0K9m1
4529a5k5K5L8j5l4LM0J0m0k4L3M2k6m6J8M0km1j0L6J9k4l5J3M3j9l4%M3Kl7k7
4561d9N1L0k9l6ON4j4m2kL7L3m2k5OM3j3m1J1K9K4n3j4L1L4k4l2J5M2j0l1j5N1
$$ y = [34, 25, -22, -22, 22, 39, -12, -26, 0, 31, 7, -29, -13, 44, 45, -17, -29, 12, 33, -11, -34, -13, 49, 22, -29, -19, 20, 31, -25, -37, 7, 30, 5, -35, -19, 13, 28, -18, -39, 9, 38, 3, -33, -8, 38, 22, -15, -20, 22, 49, -9, -32, 6, 40, 12, -23, -23, 23, 32, -15, -27, 9, 31, 8, -34, -9, 30, 18, -19, -28, 16, 27, -19, -40, -6, 28, 8, -33, -27, 27, 29, -27, -38, 15, 45, 4, -43, -1, 34, 20, -23, -23, 21, 48, -13, -21, 4, 41, 4, -51, -23, 21, 12, -32, -34, 0, 29, -10, -43, -14, 36, 15, -37, -29, 24, 31, -7, -39, 4, 46, 8, -46, -18, 19, 36, -33, -44, 16, 31, 9, -31, -18, 33, 20, -29, -23, 26, 50, -13, -33, 3, 53, 1, -37, -23, 18, 14, -31, -38, 9, 22, -24, -39, -23, 39, 7, -35, -23, 23, 30, -15, -33, 3, 34, 3, -27, -22, 23, 19, -15, -29, 11, 37, -7, -38, 5, 29, 12, -41, -21, 12, 33, -14, -34, 3, 22, 10, -25, -15, 20, 20, -25, -33, -3, 26, -15, -40, -15, 23, 8, -26, -23, 17, 27, -13, -37, -4, 38, 12, -34, -16, 24, 22, -19, -29, 7, 26, 2, -33, -20, 23, 4, -30, -30, 13, 15, -22, -49, 2, 32, 3, -33, -27, 27, 13, -29, -31, 6, 39, -3, -28, -22, 21, 8, -33, -22, 7, 31, -22, -36, -5, 29, 5, -27, -12, 30, 20, -11, -26, 25]
4593B5Lk7l0K0M4j9m6J4L7Nl4k2L5K4l6l2J6M6jm9mL6K7m5k8L0L4j9k9J2L6j1
4625A2k9rK4L3k5m2K7L5ml9lL9J3k6k3J7L1k8k4KL7Om7j0L4K0j8l7K1K5Km8NM4
$$ y = [25, 28, 1, -29, -9, 35, 16, -30, -16, 21, 26, -8, -30, 5, 29, -7, -39, -23, 23, 22, -27, -31, 5, 32, -13, -41, -11, 23, 4, -25, -13, 23, 12, -17, -26, -2, 31, 6, -36, -9, 26, 22, -17, -20, 19, 32, 6, -17, 0, 31, 3, -21, -19, 18, 24, -23, -33, 1, 21, 3, -34, -13, 12, 14, -34, -29, 15]
$$ [...]
8191E
##END NTUPLES=NMR FID
##END=
