##TITLE=1H_LY-DMAA.Per.1.6
 CDCl3
 8 sc, 
 9.02.2022
##JCAMPDX= 6.0         $$ Bruker NMR JCAMP-DX V2.0
##DATA TYPE= NMR FID
##DATA CLASS= NTUPLES
##ORIGIN= UXNMR, Bruker Analytische Messtechnik GmbH
##OWNER= root
$$ XWIN-NMR		Version 3.5
$$ Wed Feb  9 13:42:48 2022 Russian Standard Time (UT+4h)  she@DPX200
##.OBSERVE FREQUENCY= 200.131346
##.OBSERVE NUCLEUS= ^1H
##.DELAY= (6, 6)
##.ACQUISITION MODE= SIMULTANEOUS
##.ACQUISITION SCHEME= undefined
##.AVERAGES= 8
##.DIGITISER RES= 18
##SPECTROMETER/DATA SYSTEM= spect
##.PULSE SEQUENCE= zg30
##.SOLVENT NAME= D2O
##.SHIFT REFERENCE= (INTERNAL, D2O, 0, 15.7039)
##AUDIT TRAIL= $$ (NUMBER, WHEN, WHO, WHERE, WHAT)
$$ ##TITLE= Audit trail, XWIN-NMR		Version 3.5
$$ ##JCAMPDX= 5.01
$$ ##ORIGIN= Bruker BioSpin GmbH
$$ ##OWNER= she
$$ F:/spectra/data/she/nmr/H-F/1/audita.txt
$$ ##AUDIT TRAIL=  $$ (NUMBER, WHEN, WHO, WHERE, WHAT)
(   1,<2022-02-09 13:40:51.07 +0400>,<she>,<DPX200>,
      <created by zg, POWCHK disabled, PULCHK disabled
       configuration hash MD5:
       00 E9 B6 7A A2 85 ED C7 34 08 36 98 17 FE 4E 26
       data hash MD5: 16K
       9B BA 75 93 72 AE EE 7B 55 70 FD 7F FA 00 D4 62>)
$$ ##END=
$$ 
$$ hash MD5
$$ D9 FD CC 31 F0 3F D7 69 FC 3D EB 9B B3 2F 9A 5F
##$RELAX= 
##$RELAX= 
##$RELAX= 
##$RELAX= 
##$RELAX= 
##$RELAX= 
$$ Bruker specific parameters
$$ --------------------------
##$DU= <F:/spectra>
##$EXPNO= 1
##$NAME= <H-F>
##$PROCNO= 1
##$TYPE= <nmr>
##$USER= <she>
##$AMP= (0..31)
100 100 100 100 100 100 100 100 100 100 100 100 100 100 100 100 100 100 
100 100 100 100 100 100 100 100 100 100 100 100 100 100 
##$AQSEQ= 0
##$AQ_mod= 1
##$AUNM= <au_zg>
##$AUTOPOS= <>
##$BF1= 200.13
##$BF2= 200.13
##$BF3= 200.13
##$BF4= 200.13
##$BF5= 200.13
##$BF6= 200.13
##$BF7= 200.13
##$BF8= 200.13
##$BYTORDA= 1
##$CFDGTYP= 0
##$CFRGTYP= 5
##$CHEMSTR= <none>
##$CNST= (0..31)
1 1 145 1 1 1 1 1 1 1 1 1 1 1 1 1 1 1 1 1 1 1 1 1 1 1 1 1 1 1 1 1 
##$CPDPRG= <>
##$CPDPRG1= <>
##$CPDPRG2= <>
##$CPDPRG3= <>
##$CPDPRG4= <mlev>
##$CPDPRG5= <mlev>
##$CPDPRG6= <mlev>
##$CPDPRG7= <mlev>
##$CPDPRG8= <mlev>
##$CPDPRGB= <>
##$CPDPRGT= <>
##$D= (0..31)
0 1.2 0 0 0 0 0 0 0 0.06 0 0.03 0 0 0 0 0.0002 0 0 0 0 0 0 0 0 0 0 0 0 
0 0 0 
##$DATE= 1644399650
##$DBL= (0..7)
120 120 120 120 120 120 120 120 
##$DBP= (0..7)
150 150 150 150 150 150 150 150 
##$DBP07= 0
##$DBPNAM0= <>
##$DBPNAM1= <>
##$DBPNAM2= <>
##$DBPNAM3= <>
##$DBPNAM4= <>
##$DBPNAM5= <>
##$DBPNAM6= <>
##$DBPNAM7= <>
##$DBPOAL= (0..7)
0.5 0.5 0.5 0.5 0.5 0.5 0.5 0.5 
##$DBPOFFS= (0..7)
0 0 0 0 0 0 0 0 
##$DE= 6
##$DECBNUC= <off>
##$DECIM= 32
##$DECNUC= <off>
##$DECSTAT= 4
##$DIGMOD= 1
##$DIGTYP= 9
##$DL= (0..7)
0 120 120 120 120 120 120 120 
##$DP= (0..7)
150 150 150 150 150 150 150 150 
##$DP07= 0
##$DPNAME0= <>
##$DPNAME1= <>
##$DPNAME2= <>
##$DPNAME3= <>
##$DPNAME4= <>
##$DPNAME5= <>
##$DPNAME6= <>
##$DPNAME7= <>
##$DPOAL= (0..7)
0.5 0.5 0.5 0.5 0.5 0.5 0.5 0.5 
##$DPOFFS= (0..7)
0 0 0 0 0 0 0 0 
##$DQDMODE= 0
##$DR= 18
##$DS= 0
##$DSLIST= <SSSSSSSSSSSSSSS>
$$ [...]
##$SUBNAM2= <"">
##$SUBNAM3= <"">
##$SUBNAM4= <"">
##$SUBNAM5= <"">
##$SUBNAM6= <"">
##$SUBNAM7= <"">
##$SUBNAM8= <"">
##$SUBNAM9= <"">
##$SW= 18.0517287032376
##$SWIBOX= (0..15)
0 0 2 0 0 0 0 0 0 0 0 0 0 0 0 0 
##$SW_h= 3612.71676300578
##$TD= 16384
##$TD0= 1
##$TE= 0
##$TE2= 300
##$TE3= 300
##$TEG= 300
##$TL= (0..7)
0 120 120 120 120 120 120 120 
##$TP= (0..7)
150 150 150 150 150 150 150 150 
##$TP07= 0
##$TPNAME0= <>
##$TPNAME1= <>
##$TPNAME2= <>
##$TPNAME3= <>
##$TPNAME4= <>
##$TPNAME5= <>
##$TPNAME6= <>
##$TPNAME7= <>
##$TPOAL= (0..7)
0.5 0.5 0.5 0.5 0.5 0.5 0.5 0.5 
##$TPOFFS= (0..7)
0 0 0 0 0 0 0 0 
##$TUNHIN= 0
##$TUNHOUT= 0
##$TUNXOUT= 0
##$USERA1= <user>
##$USERA2= <user>
##$USERA3= <user>
##$USERA4= <user>
##$USERA5= <user>
##$V9= 5
##$VALIST= <valist>
##$VCLIST= <CCCCCCCCCCCCCCC>
##$VD= 0
##$VDLIST= <DDDDDDDDDDDDDDD>
##$VPLIST= <PPPPPPPPPPPPPPP>
##$VTLIST= <TTTTTTTTTTTTTTT>
##$WBST= 1024
##$WBSW= 4
##$XGAIN= (0..3)
0 0 0 0 
##$XL= 0
##$YL= 0
##$YMAX_a= 48140
##$YMIN_a= -46755
##$ZGOPTNS= <>
##$ZL1= 120
##$ZL2= 120
##$ZL3= 120
##$ZL4= 120
##$ABSF1= 10
##$ABSF2= 0
##$ABSG= 5
##$ABSL= 3
##$ALPHA= 0
##$AQORDER= 0
##$ASSFAC= 0
##$ASSFACI= 0
##$ASSFACX= 0
##$ASSWID= 0
##$AUNMP= <proc_1d>
##$AZFE= 0.1
##$AZFW= 0.1
##$BCFW= 1
##$BC_mod= 2
##$BYTORDP= 1
##$COROFFS= 0
##$CY= 11.3945322036743
##$DATMOD= 1
##$DC= 2
##$DFILT= <>
##$DTYPP= 0
##$F1P= 2.36226072786647
##$F2P= -0.459571619588291
##$FCOR= 0.5
##$FTSIZE= 0
##$FT_mod= 4
##$GAMMA= 1
##$GB= 0.15
##$INTBC= 1
##$INTSCL= 1
##$ISEN= 128
##$LB= 0.24
##$LEV0= 0
##$LPBIN= 0
##$MAXI= 10000
##$MC2= 0
##$MEAN= 0
##$ME_mod= 0
##$MI= 1.114404
##$NCOEF= 0
##$NC_proc= 0
##$NLEV= 6
##$NOISF1= 3.799351
##$NOISF2= 2.8
##$NSP= 1
##$NTH_PI= 0
##$NZP= 0
##$OFFSET= 15.70392
##$PC= 1
##$PHC0= -15949.29
##$PHC1= 10.80078
##$PH_mod= 1
##$PKNL= yes
##$PPARMOD= 0
##$PSCAL= 0
##$PSIGN= 0
##$REVERSE= no
##$SF= 200.130013532006
##$SI= 16384
##$SIGF1= 3
##$SIGF2= 2
##$SINO= 400
##$SIOLD= 16384
##$SREGLST= <1H.CDCl3>
##$SSB= 0
##$STSI= 0
##$STSR= 0
##$SW_p= 3612.71676300578
##$SYMM= 0
##$S_DEV= 0
##$TDeff= 0
##$TDoff= 0
##$TI= <>
##$TILT= no
##$TM1= 0
##$TM2= 0
##$TOPLEV= 0
##$USERP1= <user>
##$USERP2= <user>
##$USERP3= <user>
##$USERP4= <user>
##$USERP5= <user>
##$WDW= 1
##$XDIM= 8192
##$YMAX_p= 0
##$YMIN_p= 0
$$ End of Bruker specific parameters
$$ ---------------------------------
##NTUPLES= NMR FID
##VAR_NAME=  TIME,          FID/REAL,        FID/IMAG
##SYMBOL=    X,             R,               I
##VAR_TYPE=  INDEPENDENT,   DEPENDENT,       DEPENDENT
##VAR_FORM=  AFFN,          ASDF,            ASDF
##VAR_DIM=   8192,          8192,            8192
##UNITS=     SECONDS,       ARBITRARY UNITS, ARBITRARY UNITS
##FACTOR=    0.0002768,     1,               1
##FIRST=     0,             0,               0
##LAST=      2.2672688,     0,               0
##MIN=       0,             -46755,          0
##MAX=       2.2672688,     48140,           0
$$ Real data points
##PAGE= N=1
##DATA TABLE= (X++(R..R)), XYDATA
0 0 0 0 0 0 0 0 0 0 0 0 0 0 0 0 0 0 0 0 0 0 0 0 0 0 0 0 0 0 0 -1 8 -8 8 -8 8 -8 8 -8 8 -12 16 -16 16 -16 20 -24 24 -26
48 -26 31 -32 36 -40 44 -49 54 -60 67 -75 84 -97 112 -131 156 -192 244 -327 473 -794 1753 -10265
70 -10265 -46755 -3547 42038 11519 -31668 -16180 17802 17284 -2603 -13722 -11648 7009 23244
83 23244 2406 -30851 -12295 33838 21347 -32411 -27907 26866 30768 -18837 -29558 9284 23992
96 23992 -399 -15129 -6848 3864 11081 8011 -12134 -18892 10168 27365 -5934 -32124 803
109 803 33017 4260 -29801 -7731 23667 9286 -15378 -8339 6495 5214 1848 -489 -8737
122 -8737 -5229 13409 10674 -15976 -15274 16173 17953 -14806 -18577 12178 16797 -9175 -13027 6356
136 6356 7867 -4153 -1960 2996 -3650 -2575 8616 2919 -12077 -3275 14070 3389 -14502 -2809
150 -2809 13690 1385 -12109 703 10062 -3325 -8147 5777 6237 -7949 -4657 9263 3070
163 3070 -9719 -1466 9191 -357 -7794 2597 5877 -5033 -3552 7817 1425 -10448 426
176 426 12817 -1503 -14357 1870 14769 -1604 -13822 881 11249 -338 -7431 149 2562
189 2562 -884 2589 2377 -7462 -4760 11294 7559 -13583 -10250 14095 12358 -12715 -13175 9994
203 9994 12609 -6126 -10146 2089 6197 1739 -940 -4507 -4976 5939 10874 -5849 -15948 4152
217 4152 19299 -1455 -20570 -1901 19256 4900 -15732 -7055 10245 7603 -3699 -6348 -2985
230 -2985 3420 8959 970 -13293 -5926 15605 10849 -15497 -14636 13406 16801 -9660 -16748 5084
244 5084 14459 -473 -10143 -3452 4273 5953 2237 -6923 -8741 6042 14144 -3759 -17893 466
258 466 19347 3079 -18430 -6141 15359 8121 -10554 -8448 4903 7099 898 -4090 -5882 -1
272 -1 9618 4649 -11571 -9050 11736 12510 -10305 -14492 7662 14595 -4513 -12879 1335 9461 1183
287 1183 -4896 -2770 -172 3166 5108 -2414 -9231 914 12151 1122 -13396 -2993 13147 4430
301 4430 -11449 -4952 8787 4504 -5574 -3090 2371 891 454 1695 -2693 -4327 4031 6545 -4698
316 -4698 -8129 4651 8747 -4239 -8421 3677 7230 -3131 -5300 2875 3060 -2822 -638 3088
330 3088 -1521 -3328 3317 3556 -4524 -3489 5237 3054 -5491 -2173 5407 838 -5264 616 4972
345 4972 -2217 -4807 3519 4532 -4500 -4229 4876 3667 -4738 -2758 4162 1495 -3239 226 2239
360 2239 -2172 -1232 4261 606 -6141 -263 7695 375 -8563 -738 8603 1221 -7738 -1640 5956
375 5956 1677 -3604 -1262 749 170 2072 1428 -4500 -3427 6197 5526 -6958 -7339 6754 8554 -5576
391 -5576 -8812 3846 8014 -1714 -6064 -237 3281 1832 183 -2636 -3790 2591 7064 -1785 -9625
406 -9625 310 11030 1462 -11170 -3219 9940 4498 -7585 -5003 4426 4585 -926 -3153 -2446 871
421 871 5216 2002 -6965 -4944 7623 7606 -7062 -9449 5540 10191 -3379 -9656 989 7817 1103
436 1103 -4982 -2660 1431 3319 2282 -3052 -5733 1909 8368 -201 -9930 -1742 10241 3564 -9260
451 -9260 -4786 7330 5236 -4640 -4665 1815 3289 961 -1088 -3146 -1492 4556 4022 -5118 -6247 4827
467 4827 7703 -3959 -8325 2598 7862 -1234 -6538 -8 4433 763 -1940 -1028 -714 712 3151
482 3151 77 -4986 -1037 6197 2082 -6545 -2821 6239 3227 -5290 -3060 4029 2396 -2626 -1275
497 -1275 1324 -186 -250 1703 -544 -3119 997 4101 -1225 -4672 1284 4708 -1355 -4292 1469 3554
513 3554 -1674 -2531 2021 1466 -2390 -428 2759 -439 -2966 1157 2979 -1662 -2689 2015 2098 -2287
529 -2287 -1256 2508 249 -2761 743 3013 -1645 -3301 2273 3465 -2599 -3470 2591 3211 -2269 -2571
545 -2571 1788 1574 -1181 -220 703 -1248 -373 2754 309 -4056 -514 4980 916 -5452 -1412 5271
561 5271 1789 -4573 -1981 3334 1761 -1757 -1150 4 83 1565 1296 -2794 -2776 3501 4190 -3595 -5259
578 -5259 3206 5877 -2317 -5787 1246 5035 -79 -3619 -867 1647 1451 592 -1531 -2835 1059 4644
594 4644 -212 -5974 -986 6486 2136 -6268 -3136 5264 3632 -3707 -3569 1845 2889 103 -1567
609 -1567 -1788 -128 3070 2046 -3646 -3786 3648 5235 -3048 -6051 2059 6142 -867 -5499 -265 4155
625 4155 1096 -2336 -1568 181 1475 1880 -973 -3699 60 4913 1024 -5515 -2106 5420 2928 -4714
641 -4714 -3369 3536 3292 -2086 -2658 607 1529 708 -68 -1659 -1518 2142 2942 -2182 -4036 1839 4642
658 4642 -1285 -4729 644 4256 -97 -3370 -245 2128 328 -738 -98 -619 -308 1786 884 -2598
674 -2598 -1440 3059 1895 -3158 -2108 2945 2041 -2528 -1685 1999 1063 -1480 -296 1007 -571 -659
690 -659 1346 365 -2002 -187 2400 37 -2539 134 2465 -336 -2142 684 1763 -1012 -1255 1455
706 1455 852 -1797 -417 2085 137 -2159 128 2058 -321 -1733 547 1215 -829 -620 1143 -62
722 -62 -1560 625 1934 -1095 -2333 1337 2544 -1404 -2602 1261 2383 -967 -1872 646 1136 -335
738 -335 -168 168 -872 -119 1884 315 -2702 -631 3240 1029 -3429 -1406 3201 1651 -2635 -1693
754 -1693 1753 1410 -766 -877 -266 43 1118 943 -1706 -1965 1945 2866 -1833 -3504 1445 3755 -833
771 -833 -3567 185 2947 405 -1940 -795 701 901 637 -709 -1887 241 2861 419 -3487 -1149
787 -1149 3652 1797 -3375 -2255 2733 2392 -1784 -2164 736 1574 298 -643 -1130 -462 1672 1596 -1857
804 -1857 -2616 1712 3344 -1285 -3684 672 3566 -68 -3051 -485 2143 774 -1045 -849 -154 605
820 605 1260 -131 -2115 -456 2683 1103 -2851 -1609 2719 1967 -2247 -2008 1630 1793 -895 -1258 233
837 233 528 318 315 -694 -1153 834 1865 -819 -2397 611 2594 -408 -2570 135 2206 6 -1670
854 -1670 -56 987 -35 -270 263 -385 -549 935 867 -1285 -1098 1489 1260 -1485 -1229 1406 1077 -1229
872 -1229 -757 1047 349 -869 109 729 -555 -628 913 525 -1159 -444 1282 308 -1284 -122 1157
889 1157 -144 -980 452 767 -768 -580 1088 426 -1340 -296 1470 225 -1462 -149 1310 50
905 50 -1023 103 626 -305 -182 582 -261 -907 622 1235 -863 -1528 964 1713 -891 -1724 730 1574
923 1574 -487 -1207 233 691 -36 -66 -55 -615 16 1242 117 -1744 -380 2033 657 -2101 -922
940 -922 1905 1066 -1531 -1072 952 888 -334 -527 -274 -5 783 620 -1100 -1229 1238 1789 -1124 -2135
958 -2135 879 2293 -498 -2120 101 1739 255 -1107 -485 331 527 466 -422 -1222 100 1764 266
975 266 -2129 -718 2172 1075 -1980 -1314 1549 1338 -995 -1167 390 786 204 -231 -655 -378 961
992 961 1026 -1016 -1552 940 1943 -689 -2076 373 1987 -52 -1652 -229 1129 370 -501 -394 -181
1009 -181 233 775 6 -1265 -356 1544 678 -1649 -938 1544 1079 -1288 -1059 931 872 -530 -547 167
1027 167 112 114 361 -314 -802 390 1153 -377 -1369 283 1443 -191 -1352 116 1144 -91 -809 130
1045 130 438 -213 -65 356 -248 -505 512 636 -674 -724 734 713 -763 -661 701 459 -670 -258 579
1064 579 -34 -579 279 524 -518 -502 659 450 -742 -392 744 272 -672 -105 559 -110 -425 371 315
1083 315 -625 -207 848 153 -1014 -142 1072 118 -1033 -136 868 94 -621 -31 298 -116 18 317
1101 317 -342 -545 556 763 -721 -989 742 1101 -681 -1140 523 1031 -309 -792 113 454 76 -3
1119 -3 -150 -430 160 876 -64 -1210 -96 1408 302 -1447 -481 1306 589 -1041 -643 636 521 -208
1137 -208 -335 -240 -24 565 375 -823 -786 898 1091 -855 -1339 677 1408 -439 -1319 155 1048 93 -653
1156 -653 -270 166 339 340 -299 -798 143 1171 75 -1391 -338 1429 554 -1322 -710 1048 753 -679
1174 -679 -654 251 430 130 -120 -450 -273 645 644 -748 -989 678 1180 -572 -1282 350 1177 -177 -997
1193 -997 -19 625 124 -230 -153 -188 76 551 42 -838 -199 1024 371 -1062 -472 1004 528 -838 -489
1212 -489 613 389 -362 -188 114 -68 49 322 -201 -573 254 729 -286 -851 235 842 -214 -789 167
1231 167 590 -190 -403 202 157 -273 51 349 -243 -414 394 472 -459 -471 500 420 -467 -308 450 160 -402
1252 -402 44 388 -232 -369 407 349 -525 -347 567 310 -588 -288 504 164 -413 -62 261 -128 -141 324 24
1273 24 -533 26 693 -63 -807 36 845 1 -783 -55 650 74 -431 -43 154 -17 110 151 -382 -302 569
1294 569 483 -693 -633 699 745 -633 -784 466 709 -286 -552 84 291 74 4 -192 -366 218 655 -192
1314 -192 -936 71 1057 57 -1108 -224 985 339 -774 -395 480 372 -128 -237 -198 44 493 224 -673
1333 -673 -470 777 719 -742 -888 621 963 -430 -896 193 706 4 -445 -183 80 245 268 -271 -639
1352 -639 166 858 -46 -1034 -134 1044 273 -959 -405 760 418 -487 -372 176 239 118 -27 -345 -204
1371 -204 514 468 -577 -652 572 797 -483 -840 359 786 -200 -630 45 372 21 -124 -71 -195 19 419
1391 419 13 -633 -138 738 211 -764 -289 681 302 -566 -270 396 171 -227 -27 63 -153 49 317 -137
1411 -137 -450 179 558 -191 -583 188 562 -170 -453 166 324 -185 -168 224 -3 -290 136 327 -262 -382
1431 -382 304 386 -341 -370 318 277 -309 -186 249 9 -230 137 218 -301 -225 403 248 -485 -261 505 266 -457
1453 -457 -234 365 179 -246 -40 120 -92 20 278 -85 -438 157 591 -148 -676 113 704 -57 -650 -26
1473 -26 501 58 -333 -89 80 31 139 44 -396 -187 546 312 -636 -456 633 551 -548 -593 420 560 -229
1494 -229 -425 66 249 120 14 -212 -268 267 536 -227 -719 137 845 -13 -865 -115 760 219 -606 -289
1514 -289 341 267 -86 -189 -201 33 414 150 -578 -349 642 516 -640 -644 523 689 -365 -652 183 517
1534 517 -1 -303 -124 40 210 237 -220 -479 170 687 -79 -791 -47 802 166 -733 -241 561 280 -347
1554 -347 -247 104 140 114 12 -297 -193 404 349 -470 -496 439 562 -378 -593 266 525 -158 -398 54 216
1575 216 -2 -15 -19 -200 1 379 54 -496 -83 566 146 -541 -165 487 180 -384 -126 244 39 -128 66
1596 66 28 -202 46 305 -114 -396 120 428 -142 -451 100 370 -119 -289 104 129 -158 -25 193 -107 -254
1617 -254 186 310 -233 -326 267 334 -235 -295 214 219 -157 -96 132 -45 -98 197 109 -328 -135 414 150 -478 -213
1640 -213 451 213 -409 -216 286 151 -165 -69 9 -74 96 204 -184 -357 215 486 -204 -572 159 597 -88
1661 -88 -535 8 428 70 -244 -97 46 75 159 -10 -353 -76 492 207 -562 -327 578 413 -498 -466 357
1682 357 422 -194 -355 11 186 132 7 -244 -232 267 434 -271 -603 183 690 -93 -707 -31 645 125 -492
1703 -492 -209 282 229 -33 -150 -184 61 392 95 -508 -250 573 389 -534 -482 448 529 -303 -485 144 376
1724 376 3 -216 -139 -15 175 216 -206 -426 152 542 -96 -629 -16 630 101 -556 -147 428 193 -247 -151
1745 -151 62 86 142 51 -256 -154 372 298 -375 -369 374 432 -294 -427 207 367 -128 -256 42 91 -11 66 -20
1768 -20 -231 -16 338 50 -430 -91 433 122 -404 -142 339 117 -242 -62 144 -15 -47 130 -16 -235 69
1789 69 310 -83 -364 77 377 -61 -332 58 266 -51 -152 85 44 -113 72 173 -163 -247 211 272 -258
1810 -258 -315 220 306 -190 -274 129 173 -87 -61 34 -84 -42 206 36 -341 -75 417 129 -442 -178 417 217
1832 217 -330 -200 238 175 -71 -76 -40 -34 148 188 -220 -309 236 435 -218 -513 154 530 -68 -486 -29 349 82
1855 82 -215 -142 -10 101 170 -64 -350 -54 455 160 -525 -266 510 358 -418 -383 300 372 -140 -284 -7 151
1877 151 157 37 -210 -215 266 402 -230 -522 162 588 -62 -589 -48 505 129 -379 -194 171 164 9 -123 -211
1899 -211 23 339 91 -445 -222 467 341 -430 -409 337 444 -215 -384 88 283 38 -126 -117 -52 165 235 -151
1921 -151 -368 103 487 -26 -506 -42 488 120 -411 -157 284 140 -136 -94 -28 15 136 82 -235 -205 261 280
1943 280 -282 -360 226 364 -183 -348 99 251 -56 -138 21 16 -3 115 35 -218 -50 301 99 -326 -124 331
1965 331 160 -275 -143 221 102 -128 -43 45 -59 -12 156 -45 -255 36 305 -39 -348 9 305 -2 -272
1986 -272 -29 166 4 -80 38 -42 -97 135 169 -189 -236 224 305 -197 -304 175 308 -105 -241 56 160 4
2008 4 -29 -18 -94 19 226 14 -321 -69 372 114 -412 -181 352 204 -272 -219 141 168 -33 -93 -86 -35 176 159
2032 159 -216 -294 213 392 -162 -442 118 448 -22 -391 -50 292 116 -127 -133 -20 114 195 -45 -312 -41
2053 -41 408 157 -425 -253 396 319 -330 -348 195 310 -69 -231 -49 110 146 32 -208 -205 201 336 -163 -460
2075 -460 84 475 -2 -461 -90 387 146 -256 -163 105 148 70 -80 -189 -9 295 137 -333 -230 346 315
2096 315 -293 -353 208 335 -113 -286 11 170 45 -58 -123 -104 95 223 -94 -330 20 377 32 -399 -99
2117 -99 347 140 -267 -135 161 126 -42 -44 -38 -13 153 130 -162 -199 197 286 -152 -306 108 298 -69 -246 19
2140 19 166 -6 -62 -8 -65 -22 134 60 -220 -103 238 141 -250 -174 210 164 -158 -143 104 80 -37 -5 1 -96 35
2165 35 185 -33 -237 32 292 19 -276 -35 261 70 -179 -54 102 41 0 12 -80 -69 124 154 -174 -229 162
2188 162 268 -153 -286 87 251 -43 -214 -25 105 43 -4 -60 -120 25 213 13 -294 -73 334 139 -310
2209 -310 -171 261 214 -164 -187 90 162 31 -52 -106 -33 162 160 -182 -249 165 331 -116 -377 29 349 17 -304
2232 -304 -104 199 109 -87 -134 -61 83 177 -10 -278 -69 326 168 -312 -219 283 285 -192 -281 106 253 18 -130
2255 -130 -72 60 153 86 -152 -195 146 300 -84 -350 31 378 46 -340 -112 233 126 -157 -154 25 94 81 -41
2278 -41 -171 -51 226 146 -241 -213 222 278 -170 -276 103 262 -17 -185 -28 110 86 16 -79 -105 68 208 -18
2301 -18 -261 -30 288 87 -270 -133 217 142 -146 -122 53 86 6 -18 -80 -78 101 125 -127 -200 95 212 -81 -238
2325 -238 28 209 -2 -160 -31 80 29 6 -4 -79 -25 149 66 -175 -90 189 155 -156 -153 122 152 -67 -106 25
2349 25 52 14 20 -51 -118 22 161 -28 -222 -18 217 38 -230 -93 169 83 -124 -94 27 50 38 8 -87 -54 135
2374 135 141 -124 -181 142 239 -81 -216 51 220 15 -143 -43 78 73 25 -63 -115 47 177 10 -233 -69 245
2397 245 114 -239 -180 162 177 -106 -166 24 109 62 -39 -106 -53 142 143 -122 -208 108 264 -47 -265 -1 263
2420 263 68 -199 -92 119 113 -20 -94 -66 66 150 0 -201 -81 226 139 -214 -199 161 213 -108 -218 19 153
2443 153 28 -101 -98 -13 95 84 -107 -176 73 221 -31 -265 -22 247 80 -204 -103 138 128 -47 -89 -16 73
2466 73 100 7 -139 -69 167 129 -145 -177 106 209 -74 -212 17 153 19 -124 -66 23 50 22 -69 -121 6 150
2490 150 4 -197 -62 179 94 -157 -114 119 117 -53 -77 5 56 62 29 -62 -62 83 138 -67 -161 44 183 -5 -165
2515 -165 -25 122 41 -86 -44 11 26 31 -10 -105 -61 105 74 -137 -127 110 125 -100 -145 41 114 -7 -86 -19 13 55
2541 55 36 -49 -98 32 143 -7 -167 -27 164 76 -144 -88 98 91 -51 -77 -9 47 43 1 -104 -61 102 114 -108
2566 -108 -161 64 165 -48 -184 -15 135 33 -109 -80 24 57 31 -61 -89 29 153 27 -158 -71 161 111 -132
2589 -132 -126 100 142 -27 -120 -4 88 58 -9 -85 -34 93 99 -92 -166 59 173 -23 -194 -40 145 50 -120 -89 46
2614 46 75 7 -67 -80 15 115 16 -145 -81 142 127 -110 -134 83 156 -30 -120 -8 104 58 -31 -72 -24 84 80 -63
2640 -63 -130 18 165 -4 -165 -49 138 63 -113 -108 51 80 -23 -73 -52 11 69 15 -117 -74 100 109 -67 -139 44
2665 44 136 -10 -122 -8 105 46 -42 -38 -5 48 72 -23 -91 2 115 26 -115 -58 102 77 -80 -85 41 68 -14 -64 -45
2692 -45 1 45 9 -80 -76 34 93 -44 -133 -3 114 6 -105 -34 77 45 -28 -34 -13 33 61 0 -71 -26 100 68 -77
2719 -77 -85 79 106 -33 -108 12 75 15 -46 -38 7 44 32 -47 -86 11 97 -5 -127 -38 99 46 -93 -86 43 59 -24 -58
2747 -58 -25 26 56 1 -60 -33 87 86 -60 -92 57 131 -4 -103 -11 95 39 -53 -60 3 50 18 -55 -82 7 96 8 -122
2775 -122 -57 102 72 -104 -97 35 85 -14 -89 -28 44 44 -8 -62 -45 72 79 -55 -113 34 125 5 -106 -25 109 54 -52
2802 -52 -57 20 60 18 -47 -62 15 80 11 -113 -66 87 76 -82 -92 36 84 -19 -98 -33 47 33 -21 -71 -34 50 54 -46
2830 -46 -92 12 103 23 -98 -38 93 55 -53 -56 27 63 17 -26 -30 11 72 29 -61 -41 64 64 -47 -88 18 84 -12 -84
2858 -84 -42 40 23 -24 -52 -27 25 40 -23 -83 -10 68 28 -90 -55 64 67 -43 -65 22 47 14 -24 -29 6 52 43 -45 -47 41 80
2889 80 -28 -75 -2 70 20 -71 -42 28 27 -24 -41 -32 18 39 -12 -64 -29 64 35 -76 -67 28 69 -27 -79 -14 46 23 -29 -31 2
2920 2 41 36 -41 -53 25 78 10 -78 -13 77 47 -54 -42 31 51 -7 -45 -34 16 37 3 -70 -30 51 41 -65 -81 15 75 -21
2950 -21 -91 -30 40 30 -39 -52 -12 42 39 -36 -64 11 73 6 -75 -29 75 57 -39 -48 40 55 5 -52 -30 31 34 -3 -60 -31 46
2981 46 46 -45 -86 10 78 -5 -90 -38 38 18 -64 -60 -7 23 13 -35 -51 5 58 9 -62 -35 65 55 -41 -56 26 64 18 -41 -26
3012 -26 35 41 -1 -41 -28 42 47 -30 -79 6 64 0 -67 -43 42 29 -40 -63 -11 30 8 -30 -50 -2 38 15 -56 -38 46 63 -24
3043 -24 -59 13 69 10 -51 -18 28 46 2 -25 -23 38 42 -3 -50 -12 55 37 -49 -43 38 45 -24 -47 -8 19 6 -36 -39 -13 32 9 -51
3076 -51 -53 23 50 -22 -65 -10 56 22 -24 -36 21 40 8 -29 -28 17 42 -5 -56 -9 53 37 -35 -44 25 64 -19 -53 -17 37 12 -37
3108 -37 -38 -13 21 4 -48 -53 10 48 -21 -75 -29 40 21 -47 -47 3 40 10 -35 -31 20 50 5 -45 -15 53 46 -25 -46 27 57 1 -44
3141 -44 -11 34 21 -27 -38 -2 29 12 -37 -46 10 49 -4 -68 -31 44 39 -39 -48 10 38 0 -43 -33 26 34 -4 -43 -29 38 39 -31 -41
3174 -41 17 52 14 -33 -10 35 32 -24 -36 9 42 22 -28 -50 4 46 2 -50 -37 31 27 -34 -61 -5 35 -10 -43 -32 0 22 -6
3205 -6 -44 -27 27 33 -21 -41 0 43 12 -30 -21 38 46 -9 -39 3 41 28 -11 -31 3 47 22 -37 -25 27 31 -19 -50 -2 30 -1 -38
3238 -38 -37 -11 28 -10 -43 -34 13 31 -17 -53 -7 48 20 -39 -26 24 37 -1 -22 -5 46 29 -1 -26 -2 50 30 -35 -26 23 47 -17
3270 -17 -46 -7 27 15 -39 -39 17 24 -8 -42 -39 5 22 -14 -61 -19 31 24 -47 -51 -3 39 -13 -50 -8 24 28 -17 -33 -4 35 27 -24 -42
3304 -42 13 47 1 -41 -15 24 26 -32 -34 -5 31 10 -43 -32 8 28 -2 -50 -27 16 20 -35 -57 7 36 -1 -47 -27 17 33 -4 -37
3336 -37 -4 29 24 -17 -35 10 53 8 -40 -15 39 30 -16 -28 12 38 19 -12 -28 21 26 8 -34 -31 20 23 -26 -49 0 35 0 -48 -25
3369 -25 11 20 -8 -42 -26 20 19 -18 -35 5 35 6 -34 -22 35 47 -12 -28 6 46 23 -13 -25 -1 27 10 -26 -19 24 21 -16 -47
3401 -47 -12 31 2 -37 -28 16 20 -4 -48 -19 8 23 -17 -40 -7 26 11 -29 -31 30 38 -11 -36 -2 29 33 -18 -17 8 34 6 -28 -15
3434 -15 18 42 -3 -37 -7 36 13 -38 -41 14 21 -24 -43 -23 8 19 -23 -47 -8 19 15 -35 -41 11 40 -7 -45 -16 35 35 -9 -27 11
3467 11 39 28 -19 -22 22 42 -2 -46 -7 35 25 -19 -24 7 38 1 -34 -27 -6 13 -9 -45 -19 23 13 -30 -55 -3 33 -9 -41 -28
3499 -28 11 25 -15 -40 6 28 18 -22 -22 12 36 10 -40 -22 21 35 -16 -38 3 27 17 -24 -24 6 18 2 -37 -29 11 10 -31 -48
3531 -48 -10 22 -16 -40 -38 15 13 -25 -39 -4 19 15 -24 -28 1 33 13 -33 -19 19 35 -2 -28 8 40 12 -19 -21 19 32 -7 -31 -19
3564 -19 22 22 -22 -43 -8 28 11 -32 -35 6 11 -17 -42 -31 10 4 -28 -51 -11 27 1 -32 -21 18 29 -7 -32 -7 34 24 -18 -23 13
3597 13 30 6 -23 -22 20 18 -5 -34 -9 22 7 -25 -40 4 30 -9 -38 -23 7 11 -24 -36 -4 29 0 -30 -32 3 30 -2 -31 -6
3629 -6 22 16 -23 -27 5 32 8 -16 -16 15 33 7 -32 -13 34 19 -14 -27 11 33 1 -31 -24 15 17 -12 -27 -10 8 2 -27 -31 -6 24
3663 24 -6 -46 -25 17 21 -15 -30 1 28 17 -18 -22 21 32 3 -24 -9 27 34 -7 -29 13 33 12 -17 -23 26 23 -6 -27 -10 19 11
3696 11 -27 -33 6 25 -11 -39 -29 8 25 -21 -39 -16 23 6 -23 -29 1 25 2 -21 -13 28 30 -5 -22 9 45 23 -20 -14 17 38 14
3729 14 -17 -3 23 33 -17 -29 7 28 6 -33 -31 -1 24 -15 -40 -17 2 0 -33 -29 3 14 -5 -34 -16 28 19 1 -25 2 21 19 -6
3762 -6 -19 25 39 7 -17 -11 23 29 -5 -21 -5 26 12 -19 -24 7 19 -12 -45 -11 16 3 -22 -32 0 18 11 -24 -19 4 24 -3 -28
3795 -28 -2 26 23 -23 -24 0 28 7 -19 -9 29 21 1 -28 -8 22 18 -11 -28 16 26 -7 -29 -21 13 14 -18 -28 -3 21 -1 -36 -25
3828 -25 7 24 -11 -39 -17 20 15 -23 -31 10 22 9 -21 -16 17 28 -5 -18 -5 26 28 -7 -12 6 32 6 -24 -4 21 29 -4 -33 -1
3861 -1 14 6 -26 -27 8 20 -1 -37 -28 0 6 -27 -35 -4 15 9 -28 -32 11 26 2 -28 -2 6 20 -15 -16 2 40 23 -10 -7 12 32 -7 -13
3897 -13 5 19 17 -16 -19 5 15 -7 -30 -26 5 14 -13 -38 -20 14 2 -27 -27 -8 11 1 -21 -21 15 16 -6 -18 -4 13 18 -10 -19 13 33
3932 33 1 -17 -8 29 29 -8 -19 9 32 21 -20 -25 9 17 -13 -31 -21 2 1 -17 -36 -13 28 -2 -25 -23 5 16 -10 -32 -1 24 9
3965 9 -24 -20 10 17 12 -11 -5 31 23 -1 -13 11 28 22 -15 -18 7 25 0 -32 -8 17 5 -25 -29 -19 13 -3 -31 -27 3 13 -16 -33 -23
4000 -23 5 5 -22 -26 1 22 4 -31 -14 11 24 -1 -20 8 22 18 -13 -13 17 28 9 -18 -8 17 19 -13 -28 -11 15 -1 -17 -19 -12 0
4034 0 -16 -35 -20 8 12 -23 -32 -19 11 8 -21 -24 6 18 -4 -18 3 19 24 -6 -19 8 28 18 -10 -16 8 23 4 -23 -6 13 5 -20
4068 -20 -30 5 21 2 -21 -26 -7 11 -17 -39 -10 1 -2 -24 -32 -2 10 0 -34 -24 17 21 -13 -17 -6 21 12 -15 -18 12 30 14 -14 2
4102 2 21 18 1 -15 3 26 11 -19 -13 8 16 -8 -34 -5 11 -4 -21 -36 3 12 -3 -20 -29 -7 15 -13 -24 -12 14 15 -8 -16 8 31
4136 31 -1 -20 -8 23 25 -2 -19 4 22 22 -11 -16 13 20 -9 -24 -18 14 8 -20 -31 -12 6 -6 -25 -35 5 8 -10 -29 -22 3 7 -19 -27
4171 -27 -2 14 -5 -24 -16 9 18 4 -7 -3 28 34 -5 -10 12 21 1 -11 -15 11 18 -14 -17 -9 12 7 -28 -19 5 13 -14 -27 -24 -1 -3 -25 -38 -11
4209 -11 7 3 -28 -22 0 17 -8 -36 -8 14 15 -9 -14 4 23 5 -18 -4 16 23 0 -15 1 23 11 -16 -12 -8 14 -4 -21 -24 -2 0 -22
4244 -22 -41 -9 9 -1 -22 -26 -7 4 2 -32 -17 10 13 -12 -15 -4 10 7 -10 -4 12 16 2 -6 2 13 12 -4 -8 9 21 14 -12 -27 4 14
4280 14 -9 -30 -16 10 -4 -21 -25 -16 6 -8 -26 -17 -9 6 -13 -24 -21 16 17 -3 -9 5 28 6 -17 -18 14 22 -1 -9 3 25 26 -13 -17 5
4316 5 25 -3 -25 -16 13 7 -11 -25 -9 9 -4 -20 -28 -2 1 -9 -22 -14 11 -7 -25 -32 -10 4 -1 -21 2 12 19 -13 -16 2 19 17 -10 1
4352 1 6 33 12 -15 -1 10 21 -17 -15 -2 10 5 -28 -25 -10 -7 -13 -30 -9 -2 10 -18 -31 -13 6 -5 -9 -22 -8 10 -7 -14 -13 20 0 -7
4388 -7 -2 -1 21 12 -4 -4 25 22 4 -15 -9 16 12 -10 -16 2 20 -7 -21 -15 -6 1 -20 -30 -23 5 1 -16 -18 1 5 -4 -23 -18 0 1 -17 -13 -4 16 19
4429 19 -10 -2 4 4 -1 -8 -9 11 19 -9 -9 8 13 1 -8 -8 10 7 -14 -15 -19 -7 -3 -22 -32 -3 3 -25 -31 -16 -7 -2 -19 -20 -12 10 -7 -17 -14 0 15
4470 15 -8 -16 2 15 15 -3 -1 3 20 20 -7 -2 8 6 0 -20 -7 8 3 -11 -14 -4 4 -5 -19 -24 -5 1 -19 -24 -21 -4 -7 -22 -22 -10 11 -7 -11 -15
4510 -15 15 20 -10 -12 4 20 11 -4 -9 15 23 -1 -12 -4 4 2 -7 -22 -11 2 -5 -16 -16 1 2 -16 -21 -22 -7 -10 -28 -30 -13 3 2 -36 -32 1 11
4549 11 -6 -6 8 5 9 -7 -9 -4 16 16 -6 6 17 20 3 -8 -6 21 4 -10 -10 0 4 -6 -7 -11 4 3 -4 -27 -2 -4 -8 -20 -25 -6 8 -12 -22
4588 -22 -15 3 6 -15 -10 -2 8 0 -3 -5 17 7 2 0 7 20 16 3 -13 12 6 9 -14 -7 8 -6 -8 -5 -5 3 3 -19 -24 -10 -9 -13 -20 -15 -15 0 -14 -17 -9 -3
4632 -3 11 -20 -20 6 24 7 -2 -4 19 10 -2 -8 5 19 8 -6 -11 8 10 7 -6 -2 11 6 -8 -13 -13 -5 -14 -27 -26 -8 -10 -16 -22 -10 -2 -6 -25 -23 -2
4673 -2 -5 -12 -10 -15 9 14 -11 -13 -18 11 7 2 2 8 20 -3 1 1 11 11 5 -13 3 10 -4 -20 -29 3 -8 -17 -29 -25 -7 3 -22 -20 -8 -3 -10 -21 -20 -6
4715 -6 5 -5 -14 -5 17 4 -7 -2 4 13 -3 -5 8 12 9 1 -8 3 15 12 -7 -2 6 9 -9 -13 -5 0 -9 -20 -22 -10 -3 -15 -20 -15 -8 -6 -19 -21 -15 -5 5 -17
4759 -17 -21 -3 1 0 -7 -12 7 12 -2 0 5 11 9 -7 -7 9 12 0 -19 3 -7 -6 -11 -9 -10 2 -2 -18 -20 -7 0 -15 -18 -16 -15 0 -20 -12 -9 -8 -3 -1 -8 -1 7
4804 7 -1 -6 2 13 14 6 -7 16 13 12 -6 -6 6 14 7 -16 0 1 3 -11 -15 -7 1 -1 -23 -24 -10 -8 -11 -19 -18 3 -16 -13 -18 -10 -2 4 -14 -11 -3 -1 -4 -3 -1 11 5
4851 5 -13 -7 10 22 2 2 10 22 9 -2 -12 3 10 2 -10 -10 -12 -5 -17 -25 -14 -20 -5 -27 -29 -21 -13 -18 -21 -21 -5 -6 -10 -8 -18 1 -2 -12 -7 10 7 -3
4893 -3 1 3 12 9 -2 -3 -6 13 6 -4 1 -3 8 -7 -19 -7 0 -5 -13 -22 -11 -3 -10 -25 -15 -4 -7 -24 -19 -12 -8 -8 -18 -15 1 5 0 3 2 15 18 0 6 4 18
4938 18 2 7 -2 12 8 10 -8 2 10 1 1 -15 2 -5 3 -4 -15 -2 -1 -8 -26 -11 -10 -17 -20 -21 -3 -2 -10 -13 -8 2 3 4 -5 -1 4 11 10 6 7 13 18 1 17 14
4984 14 21 -3 -6 -5 9 -4 -5 -7 6 -8 -3 -13 -10 -11 -8 -3 -20 -12 -2 -10 -22 -11 -11 -5 -11 -16 -10 0 3 -9 3 -2 14 15 -1 -4 8 19 7 0 3 20
5026 20 7 -8 4 1 7 -5 -13 -13 3 -4 -10 -24 -11 -3 -5 -21 -24 -10 -13 -6 -23 -18 -5 -9 -4 -26 -8 -3 10 -9 -16 1 5 0 -5 1 15 18 0 0 6 27
5068 27 9 2 -8 3 -1 0 -14 -6 0 -2 -15 -25 -5 -7 -9 -21 -21 -10 -10 -15 -11 -14 -9 -19 -13 -17 -10 7 -11 -8 -9 6 3 -1 4 9 11 0 9 3 9 11 14 -10 -4
5113 -4 8 1 0 -7 8 -4 -6 -18 -12 -2 -16 -13 -21 -14 -10 -9 -19 -16 1 -1 -3 -13 -2 3 7 -1 -11 0 3 6 1 17 3 10 5 0 12 6 16 -3 1 8 6 -3
5157 -3 -13 -16 11 -5 -10 -14 -17 -3 -10 -5 -14 -6 -7 -17 -17 -18 -14 -12 -16 -21 -14 -6 -8 -5 -3 -13 3 13 -3 -1 8 16 16 9 2 20 15 3 -2 -4 7 -6 -17 -12 -1 -10
5203 -10 -10 -14 -1 0 -9 -22 -21 -15 -6 -21 -18 -11 -21 -9 -14 -1 -12 0 -4 -5 -1 -5 10 4 -5 3 16 3 3 -2 11 9 4 10 3 -2 9 -8 8 -8 -4 -7 -16 -23
5247 -23 -12 0 1 -12 -18 -9 -15 -17 -18 -1 -9 2 -14 -16 0 -8 -8 -1 -7 16 5 -3 -4 9 10 6 1 3 -3 3 5 -1 7 13 13 -10 -1 -2 6 5 -16 -13 -11 -21 -20 -12 -19
5294 -19 -19 -13 -24 -17 -9 1 -21 -20 -24 -18 -6 -10 -6 7 1 2 -1 2 3 1 -2 7 6 13 -2 11 -5 1 4 -4 1 -13 -2 -2 -20 -8 -4 -23 -13 -20 -24 -12 -13 -5 -23
5339 -23 -23 -6 -4 -15 -16 -8 -5 -9 -6 -13 -5 -3 -1 -3 3 5 1 -2 -5 -1 7 12 -3 -2 3 -3 -1 -10 -13 -4 -5 -8 -15 -18 -7 -16 -21 -19 -22 -7 -14 -30 -35 -15 -13 -9 -14 -6 -3 11 -7
5390 -7 -3 -1 1 6 -6 2 14 14 6 0 -4 19 21 3 4 1 9 7 0 -5 -1 -12 -7 -13 -25 -5 -6 -20 -14 -19 -5 -13 -9 -23 -12 -10 -18 -16 -1 -2 -9 -4 -9 -5 6 5 1 17
5438 17 16 10 0 -9 16 19 2 -2 -3 0 -7 0 -8 -4 -8 6 -23 -9 1 -1 -21 -25 -7 -15 -22 -21 -25 -15 -6 -16 -13 -17 7 5 -13 -4 -6 -4 -5 -5 -4 10 20 10
5482 10 5 12 2 7 0 -4 0 2 16 -5 2 -8 -11 -1 -16 -6 2 -11 -21 -20 -14 -10 -15 -13 -13 -12 -11 -10 -15 -12 -2 -4 -14 -11 6 11 -2 13 7 3 5 4 7 -1 2 8
5528 8 2 1 4 -5 -4 -1 1 0 -10 -11 -3 -1 -5 -7 -10 -6 -15 -6 -3 -19 -14 -6 -8 -16 -18 -6 0 -8 -8 0 5 -4 12 4 5 12 13 5 1 18 16 2 3 7 10 8 -4 -5 5 2 2 -2 -4
5581 -4 -14 -6 -9 -10 -12 -14 -16 -17 -20 -15 -9 -29 -12 -11 -9 -3 -4 -5 -2 -7 6 0 2 1 13 6 4 9 7 16 2 -2 9 10 11 3 -13 -6 2 -2 -3 -23 -22 2 -13 -18 -12 -2 -7
5630 -7 -22 -22 -18 -16 -26 -29 -19 -13 -22 -3 -12 -8 7 6 -4 3 11 7 -1 4 12 5 16 2 -4 4 -3 -1 -4 2 -4 -7 -11 -12 -14 -13 -20 -18 -24 -14 -12 -12 -14 -8 -5 -20 -13 -15 -7 -1 -7
5681 -7 -14 -10 1 -8 -5 4 19 2 10 -4 6 9 9 5 8 -1 3 0 7 -10 2 1 3 -11 -18 -6 -7 -17 -18 -15 -12 -14 -5 -14 -19 -7 -8 -14 -22 -12 -9 -3 -14 -15 0 2 -6
5728 -6 2 5 4 11 11 5 7 13 10 8 3 14 2 6 -6 8 -1 6 5 -3 -11 -12 -7 -14 -11 -10 -5 -24 -24 -10 -8 -14 -10 -24 -7 -7 -6 -13 -5 -1 3 -5 -5 12 4 5 6 13 12 9 2 9
5780 9 12 13 6 1 5 2 2 -12 -7 -18 -13 8 -8 -25 -9 -6 -18 -24 -14 -8 -7 -22 -14 -9 -10 -6 -9 -6 -8 -3 -6 -3 0 10 3 5 0 13 10 3 9 1 11 8 8 12 4 6 17
5829 17 -4 -9 -10 -9 -3 -14 -15 -4 -7 -16 -24 -9 -11 -20 -25 -18 -14 -2 -10 -10 -3 -5 -4 9 -2 -6 17 4 7 2 5 9 6 16 10 7 4 7 -5 2 5 6 0 -2 -5 -1 -6 -22
5877 -22 -14 -3 -15 -16 -23 -26 -12 -16 -6 -9 -16 -6 1 -10 -5 3 0 -2 1 0 11 13 4 11 4 0 9 8 6 -2 7 12 3 5 5 7 -5 -5 -13 -13 -2 -7 -15 -11 -11 -11 -16 -11 -8 -4 -14
5928 -14 -18 -12 -1 -1 -9 -1 7 3 -10 1 4 5 8 1 1 7 5 12 -3 5 19 14 7 7 7 8 2 -8 -16 -4 -13 -10 -11 -15 -3 -15 -17 -11 4 -6 -17 -9 -2 2 -7 -17 -12
5975 -12 -8 4 5 -1 3 -3 11 6 -1 3 8 15 5 1 11 16 1 5 6 13 5 -6 -2 8 -6 -2 -8 -8 -7 3 -2 -19 -7 -6 -15 -22 -11 -11 -4 -10 0 -9 -10 -9 0 1 1
6022 1 11 14 7 4 8 4 -6 8 13 7 -1 -6 -5 -5 4 -15 -1 -10 -4 4 -4 -12 -13 -16 -15 -16 -11 -21 -14 -21 -14 -5 -14 -10 -13 -9 -6 -15 0 -5 -5 7 5 -4 -6 1 2 -1 4 10 17 2
6074 2 2 14 -5 -1 1 -3 -2 -10 -1 -16 -7 -5 -8 -21 -18 -12 -12 -23 -19 -10 -13 -19 -18 -12 -13 -6 -6 7 1 -2 6 8 -1 8 6 3 13 11 27 11 5 2 10 8 -5 15 6 -7 -4
6123 -4 -1 -5 1 -2 -6 -12 1 -6 -10 -18 -7 -15 -1 -21 -10 -13 -10 -14 -13 2 -7 -1 5 3 7 2 1 -1 -3 12 6 11 -6 6 23 18 -6 10 2 12 -5 -5 2 -2 2 1 -21
6170 -21 -6 -4 -8 -28 -7 -2 -8 -16 -15 2 -4 -11 -5 -1 -3 -11 -1 -12 -3 3 -5 3 -7 0 9 4 -4 7 9 -3 -6 -2 1 3 8 3 -9 -4 -4 -6 -11 -6 2 -7 -21 -17 -20 -4
6218 -4 -21 -19 -15 -15 -16 -17 -8 -2 -8 -2 -3 -10 2 16 -2 0 0 6 5 0 5 5 12 9 10 21 3 12 -4 -8 -4 0 -4 -8 0 -6 -10 -21 -7 -9 -3 -8 -15 -21 -11 -19 -6 -10 -8 -7
6268 -7 -12 5 2 -6 0 4 9 0 12 4 10 16 7 6 1 9 14 10 2 -3 6 -5 -3 -11 2 -10 -10 -7 -14 -12 -17 -8 -19 -14 -10 -21 -18 -13 -10 -13 -16 -4 0 -12 -9 0 10 -4 8
6317 8 10 2 13 7 7 7 9 5 16 -3 -3 9 2 -5 -4 2 -2 -8 -12 -7 -19 -4 -4 -16 -21 -20 -5 -17 -28 -6 -5 -15 -22 -13 -6 1 -7 -11 9 5 5 -7 -4 7 9 5
6363 5 4 -5 20 16 11 6 7 11 0 2 4 4 2 -5 -15 -11 -9 -11 -6 -9 -13 -11 -8 -19 -7 -4 -5 -2 -6 -18 -6 -9 -1 -8 -4 3 2 -4 4 15 9 3 -3 18 5 11 8 21 10
6412 10 6 13 -4 -2 -4 1 -10 -10 -16 -7 2 -8 -14 -9 -16 -14 -1 -18 -15 -7 1 -9 -12 -8 -13 -1 -8 6 5 -2 3 2 11 7 12 9 11 -3 14 11 9 1 3 12 1 0 10 -9
6460 -9 3 -4 -15 -6 -3 -4 -5 -11 -16 -13 -9 -11 -6 6 -7 -9 -13 -5 5 -15 -11 -2 -4 -7 -14 11 0 12 10 12 -4 9 9 4 2 1 12 2 3 -3 -2 -2 -6 -7 -4 -15 -10
6507 -10 -11 -16 -11 -10 -17 -12 -13 0 -13 -12 -10 -7 -3 -18 -12 0 3 9 -2 0 0 -2 6 8 9 5 5 11 3 12 9 7 7 -3 -3 2 -1 -2 3 -3 -9 -12 -15 -11 -15 -16 -8 -11 -7 -12 -17 -10 1
6560 1 -1 -15 -2 -7 1 0 -4 8 5 8 11 1 12 12 15 10 8 9 13 -3 -1 6 11 -8 -2 -8 -9 -7 -6 -9 -12 -13 -13 -12 -13 -10 -6 -14 -9 -15 -1 -7 -11 -2 -8 -3 4 -9 -2 -1 7 10
6612 10 4 8 6 15 6 -4 5 14 -2 6 6 14 -5 -7 -4 -4 -13 -2 -1 -15 -4 -2 -4 -17 -22 -7 -9 -15 -11 -12 -10 -2 7 -2 -2 0 -6 5 6 5 16 8 9 12 15 15 12 14 15 9
6662 9 11 11 11 -3 3 9 -3 -4 -6 -8 -5 3 -8 -13 -13 -7 -12 -5 -12 -19 1 -3 -7 -11 -9 0 -4 0 0 10 3 12 0 5 7 14 12 11 17 8 9 4 5 9 -2 -5 2 -1 0 -12 -11 -6 -1
6715 -1 -12 -9 -5 -6 -16 -14 -18 -12 -8 -15 -22 -7 5 -11 -14 -12 4 -1 -1 6 1 1 7 9 2 8 7 9 6 4 1 14 -5 -1 1 4 -6 -13 5 -3 -12 -5 -21 -16 -11 -12 -16 -23 -3
6764 -3 -12 -14 -5 -12 -17 -14 -13 -5 9 -3 -12 -5 7 -2 -7 5 7 4 7 9 2 3 -2 6 1 11 2 6 4 -4 1 -11 -7 0 -5 -3 -9 -6 -11 -14 -11 -8 -19 -16 -15 -4 -6 -13 -2 -2 7 4
6816 4 1 17 -1 2 6 5 14 7 9 -1 6 16 16 6 9 2 3 5 10 0 -1 -7 -3 -1 -2 -2 -13 0 -13 -15 -17 -5 -7 -3 -6 -14 -19 -3 -5 -6 -5 1 4 2 3 1 10 7 18
6865 18 7 9 13 9 7 2 8 19 5 0 7 8 1 3 -2 -2 -15 -12 -11 1 -2 -10 -5 -12 -12 -6 -14 -12 -13 -9 -3 -15 -19 -2 1 -9 -2 -5 12 7 9 4 6 5 2 9 -1 12 10
6914 10 5 0 8 13 4 3 0 0 -1 -7 -10 -6 -7 -8 -5 -15 -6 2 -8 -3 -7 -10 -19 -14 -1 -4 3 -8 -4 -1 -2 6 13 11 12 10 6 12 1 0 16 9 -1 0 -1 4 -2 -8 -1 -3 -6 -13 -15
6967 -15 -4 -6 -6 -21 -10 -15 -14 -15 -20 -13 -15 -5 -13 -13 -8 -5 2 -7 -11 -9 3 0 -1 5 3 8 -3 3 2 7 7 7 8 -3 -4 -1 -2 -3 -1 -1 -3 -16 -15 -6 -14 -19 -6 -10 -18 -13 -5
7018 -5 -14 -12 -16 -9 -1 0 1 2 3 -9 2 4 2 5 -3 9 9 13 10 8 13 2 9 -2 5 10 5 -13 -1 2 -6 -20 -2 -10 -3 -9 -8 -20 3 -9 -14 -12 -11 3 -13 4
7064 4 -11 0 -5 -4 5 1 3 7 4 6 -2 7 3 9 0 10 8 14 5 2 1 14 -7 0 -4 2 -18 -10 -9 -7 -5 -9 -9 -6 -19 1 -17 -14 -21 0 1 -11 0 -2 -9 -11 -7 -3 10
7113 10 -1 -5 2 7 8 12 6 7 17 5 2 -2 7 5 7 -10 1 -5 -7 -10 -12 -13 -9 -14 -13 -21 -18 -7 -5 -10 -10 -3 -1 -1 -9 -3 -6 -4 -5 -3 5 9 10 5 8 11 2 -2 3 10 9 4 0 16
7167 16 14 8 -9 6 1 -4 4 0 -7 -14 -10 -10 -14 -14 -9 -16 -16 -15 -13 -19 -16 -9 -4 -13 -6 2 -1 -5 9 -5 12 3 8 9 9 13 6 11 9 2 14 7 14 8 -2 6 -10 2 -5 0 -22
7218 -22 -11 -7 -11 -10 -12 -11 -12 -11 -6 -7 -6 -2 -10 -7 -9 0 0 -5 -12 11 3 -6 15 0 13 12 10 11 -4 11 7 6 7 -5 1 1 1 7 6 -9 -3 -12 -10 -8 -21 -12 -18 -7 -6
7267 -6 -8 -7 -18 -7 1 -7 -10 3 -6 -3 -3 3 1 5 12 5 -5 9 7 -8 9 -5 17 9 6 4 6 -1 -14 -7 -6 -3 -2 -6 -4 -20 -10 -3 -16 -5 -9 -16 -9 -11 -11 -9 -10
7314 -10 -11 4 -7 -8 3 3 1 8 8 4 1 3 8 7 10 7 4 6 5 4 8 5 -1 5 -3 -7 -4 -3 -3 -11 -11 -15 -8 -3 -19 -18 -11 -12 -6 -12 -13 -9 -10 -3 -8 -7 4 -7 -4 2 13 11 2
7367 2 14 12 8 17 11 19 13 7 13 -3 0 7 7 5 -10 7 8 -4 -13 -11 -12 -14 -10 -3 -23 -14 -3 -10 -7 -15 -5 -4 -10 -2 -5 -6 -7 7 7 -1 0 5 5 0 6 -5 12 10 3 10
7417 10 4 -1 7 1 -3 8 3 -13 -9 -9 -1 -6 -6 -14 -17 -19 -10 -11 -12 -8 -6 -8 -19 -18 -10 -7 -4 4 -4 9 5 8 5 12 13 13 17 18 7 12 11 0 11 9 4 4 3 0 -5 -15 -2
7468 -2 -11 -10 -2 -3 1 -9 -17 -6 -16 -7 -15 -3 -8 -17 -13 -9 -8 1 0 6 11 -9 9 13 17 16 10 1 4 7 2 9 11 14 5 7 0 7 5 0 -1 -2 4 -1 -13 -10 -6 -6 7 -5 -14 -18
7520 -18 -8 -18 -17 -11 -5 -5 -10 -4 7 3 -1 0 12 2 9 9 15 10 7 15 13 -2 12 2 9 5 10 4 0 -9 -4 -3 5 -11 -11 -12 -7 -18 -9 -8 -11 -15 -17 -12 -16 -1 -6 -5 -4
7569 -4 1 5 1 4 4 -7 10 16 9 19 1 14 11 8 8 2 4 1 7 -2 5 6 -4 -6 -10 -8 -8 -16 -21 -15 -4 -2 -16 -8 -8 -14 -2 -5 -11 -9 -2 -9 1 -8 12 3 0 -1 7 13
7619 13 8 4 4 13 8 8 13 2 11 15 2 -4 -3 12 -3 -16 -10 1 -5 -4 -4 -5 -9 -4 -6 -14 -5 -8 1 -15 -10 -5 5 3 -11 8 6 4 5 15 17 8 13 21 23 18 20 9
7667 9 8 15 12 11 13 12 17 -1 0 -1 2 -14 -3 -7 -10 -16 -23 -16 -14 -13 -9 -15 -18 -9 -15 -18 -11 -2 3 2 -7 5 9 3 3 8 11 8 14 6 9 14 5 10 14 11 -1 -6 -14 2 -10 1 -11
7720 -11 -2 -12 -9 -3 -13 -7 -2 -12 -10 -3 -2 2 4 5 -11 -9 -2 3 -12 2 -1 -8 2 -5 8 4 1 16 9 11 9 9 5 -1 3 9 -4 11 2 -8 6 -5 -5 -5 -5 -11
7766 -11 -12 -10 -20 -20 -8 -17 -1 -16 -10 -12 -4 0 -5 -1 -4 -4 -6 5 2 7 6 11 7 6 6 13 6 1 8 4 7 -1 6 2 3 -16 -1 -11 -8 -26 -19 -14 -13 -20 -13 -25 -18 -16 -9 -23
7816 -23 -17 -14 -8 -7 -8 -4 -9 -2 -8 13 4 2 4 8 1 7 17 6 -5 9 3 3 6 -1 3 -6 -10 -4 -12 4 -10 -17 -9 -12 -17 -12 -8 -5 -18 -17 -13 -10 -1 -11 -7 -9 -8 -2 -5 0 2
7867 2 1 -1 9 3 6 -2 4 10 7 2 11 21 -1 5 14 10 1 7 -3 7 -3 -6 -8 -4 -8 -5 -14 1 -17 -9 -21 -5 -9 -9 -2 4 16 -6 -1 2 4 2 -2 -2 16 4 1
7914 1 12 12 10 8 8 12 14 4 7 16 7 8 6 4 -2 -1 -6 -7 -7 -5 -3 -21 -5 -9 -17 -13 -17 -2 -12 0 -1 -4 1 -14 -2 -13 4 -2 13 13 6 4 17 18 20 21 6
7961 6 14 10 9 0 -1 2 -2 -6 -6 -5 2 -1 -1 -15 -9 -16 -9 -10 -9 -8 -9 -17 -10 -14 -1 -8 0 -9 -6 -3 1 7 6 0 1 11 11 12 10 18 16 8 3 10 15 -1 -1 10 0 -4 1 4 -15 -2
8015 -2 -5 -6 -8 -22 -11 -16 -3 -20 -13 -13 -3 -3 -6 -7 -3 3 13 4 10 11 14 2 13 8 12 11 11 14 6 11 22 15 10 9 4 8 8 5 -2 5 0 -11 -9 -15 -10 -6 -15 -8 -18 -10
8065 -10 -13 -8 -11 2 -15 -6 -7 -9 -6 13 -8 7 10 1 9 10 9 12 18 14 6 10 8 8 8 3 4 -1 1 -4 -8 -8 -10 -8 -9 -18 -15 -9 -22 -9 -5 -19 -21 -11 -6 -6 -13 -4 2 -4 0
8116 0 3 -2 -4 5 3 4 10 16 11 6 15 0 11 16 7 3 0 0 -1 -7 -9 -2 0 -10 1 2 -11 -12 -5 -12 -10 -9 -9 -5 -15 -18 -17 -22 -18 -6 -6 -6 -5 -9 4 9 6 5 5 9 6 10 17
8169 17 26 7 -3 0 6 6 15 -5 4 8 -1 -8 -7 -16 -5 -7 -8 -6 -11 -4 -10 -17
8191a7
$$ Imaginary data points
##PAGE= N=2
##DATA TABLE= (X++(I..I)), XYDATA
0 0 0 0 0 0 0 0 0 0 0 0 0 0 0 0 0 0 0 0 0 -8 8 -8 8 -8 8 -9 16 -16 16 -24 24 -25 32 -33 40 -47 49 -56 64 -72 80
41 80 -88 97 -105 119 -129 145 -160 176 -193 213 -234 258 -285 314 -349 386 -431 480 -542 615
61 615 -702 814 -959 1157 -1445 1895 -2730 4744 -19958 -3916 48140 5743 -35976 -15532
75 -15532 25966 16412 -9525 -16624 -4190 10294 18360 -2833 -27205 -7611 33300 16847 -33364
88 -33364 -25163 30306 29712 -22912 -30823 14248 27147 -4609 -20063 -3481 9559 9384 1961 -12025
102 -12025 -13787 11472 23438 -8274 -30301 3433 33052 1847 -31874 -6169 27091 8861
114 8861 -19640 -9056 10992 7095 -2158 -2987 -5467 -2278 11370 8030 -14978 -13166 16308 16838
128 16838 -15728 -18590 13540 17904 -10748 -15195 7665 10524 -5184 -4985 3445 -926 -2692 6295
142 6295 2718 -10499 -3057 13319 3459 -14409 -3141 14274 2244 -12930 -376 11143 -1983
155 -1983 -9087 4572 7152 -6962 -5451 8678 3805 -9669 -2339 9515 536 -8628 1400 6854
169 6854 -3817 -4747 6405 2464 -9131 -414 11734 -1010 -13663 1821 14786 -1752 -14422
182 -14422 1296 12766 -539 -9478 161 5083 -393 10 1496 -5139 -3510 9519 6096 -12703
196 -12703 -8995 14042 11384 -13643 -12967 11499 13088 -8156 -11591 4113 8390 -79 -3686 -3251
210 -3251 -1963 5462 8022 -6061 -13546 5195 17885 -2904 -20218 -206 20214 3463 -17788
223 -17788 -6160 13154 7512 -7068 -7258 287 5078 6102 -1370 -11380 -3414 14723 8468 -15814
237 -15814 -12887 14725 15994 -11661 -17024 7465 15917 -2704 -12507 -1595 7353 4918 -1049 -6660
251 -6660 -5565 6665 11589 -5093 -16304 2151 18882 1279 -19213 -4744 17107 7275 -13134
264 -13134 -8511 7788 7991 -1955 -5736 -3497 2178 7977 2338 -10786 -6890 11905 10967 -11168
278 -11168 -13695 9118 14798 -6117 -13975 2866 11332 14 -7303 -2152 2365 3092 2692 -2954
292 -2954 -7330 1718 10863 64 -12988 -2099 13468 3816 -12422 -4780 10243 4899 -7185
305 -7185 -3867 3977 2099 -850 411 -1659 -3038 3477 5513 -4451 -7438 4728 8549 -4487 -8733
320 -8733 3933 7890 -3404 -6356 2955 4192 -2832 -1851 2937 -478 -3191 2501 3474 -3964 -3536
335 -3536 4962 3350 -5378 -2636 5503 1569 -5325 -130 5125 -1427 -4879 2903 4654 -4073 -4433
350 -4433 4737 3968 -4896 -3283 4497 2161 -3739 -683 2741 -1157 -1715 3240 895 -5216 -362 7011
366 7011 304 -8199 -502 8714 1008 -8261 -1444 6948 1707 -4834 -1536 2191 771 684 538 -3387
382 -3387 -2417 5438 4458 -6736 -6500 6972 8035 -6289 -8812 4771 8573 -2779 -7140 728 4783
397 4783 1127 -1570 -2309 -1986 2751 5511 -2270 -8451 1115 10486 554 -11275 -2389 10698 3905
412 3905 -8912 -4900 6051 4901 -2724 -3995 -843 2094 3934 513 -6232 -3488 7461 6364
426 6364 -7471 -8640 6424 10002 -4498 -10064 2209 8896 117 -6484 -1961 3290 3131 430
440 430 -3305 -4076 2553 7142 -1129 -9340 -787 10219 2675 -9923 -4280 8383 5118 -6042 -5063
455 -5063 3229 4079 -365 -2252 -2123 -156 3958 2794 -4926 -5203 5089 7090 -4457 -8139 3309
470 3309 8215 -1908 -7315 576 5549 438 -3255 -987 596 936 1977 -386 -4157 -534 5688
485 5688 1568 -6461 -2483 6498 3104 -5800 -3206 4703 2803 -3333 -1880 1961 569 -744 971
500 971 -191 -2443 801 3661 -1143 -4463 1248 4725 -1349 -4575 1377 3937 -1570 -3068 1833
515 1833 1998 -2207 -936 2589 -11 -2888 834 3044 -1402 -2849 1881 2431 -2152 -1686 2402 773
531 773 -2622 250 2885 -1229 -3183 1991 3383 -2496 -3512 2598 3357 -2477 -2961 2026 2112 -1490
547 -1490 -939 927 -501 -494 2026 317 -3435 -366 4593 721 -5260 -1139 5454 1654 -4990 -1925
563 -1925 4004 1920 -2578 -1518 893 652 801 571 -2255 -2052 3211 3486 -3639 -4784 3465 5639
579 5639 -2816 -5920 1798 5503 -638 -4400 -413 2693 1228 -541 -1538 -1726 1362 3827 -666 -5388
595 -5388 -355 6336 1573 -6482 -2689 5840 3447 -4554 -3698 2793 3293 -869 -2297 -999 761 2506
611 2506 1089 -3420 -2925 3744 4594 -3401 -5706 2599 6203 -1450 -5904 294 4903 733 -3297 -1409
627 -1409 1280 1589 852 -1298 -2854 526 4350 457 -5301 -1588 5530 2559 -5132 -3216 4163 3400
643 3400 -2814 -3029 1349 2167 112 -805 -1216 -717 1971 2280 -2209 -3533 2054 4408 -1587 -4745 960
660 960 4551 -368 -3872 -122 2768 302 -1470 -268 29 -103 1217 580 -2241 -1181 2876 1683
676 1683 -3162 -2031 3084 2114 -2742 -1886 2274 1414 -1725 -691 1237 -122 -807 981 493 -1684
692 -1684 -282 2230 108 -2522 42 2525 -244 -2334 492 1965 -841 -1503 1241 1050 -1624 -623
708 -623 1958 284 -2148 -3 2150 -211 -1908 438 1499 -671 -918 981 284 -1343 363 1744
724 1744 -891 -2146 1241 2448 -1415 -2609 1349 2526 -1133 -2165 817 1526 -477 -670 234 -350
740 -350 -104 1416 208 -2321 -440 3030 825 -3386 -1216 3371 1546 -2961 -1707 2215 1583 -1281
756 -1281 -1190 226 473 718 433 -1460 -1471 1861 2437 -1941 -3214 1683 3663 -1152 -3697 522 3318
773 3318 138 -2469 -616 1367 899 -28 -843 -1270 505 2414 77 -3225 -789 3618 1478 -3576
789 -3576 -2084 3091 2374 -2301 -2347 1253 1900 -219 -1144 -748 100 1447 1032 -1811 -2125 1831 3024
806 3024 -1517 -3556 996 3687 -355 -3354 -209 2647 670 -1610 -846 452 758 722 -407 -1727
822 -1727 -168 2447 769 -2819 -1391 2818 1829 -2512 -2031 1957 1939 -1266 -1546 554 929 81 -116
839 -116 -525 -743 796 1531 -855 -2158 724 2530 -503 -2619 260 2419 -66 -1968 -48 1336
855 1336 21 -634 134 -57 -403 682 711 -1125 -984 1418 1208 -1502 -1268 1467 1175 -1323 -929 1143
873 1143 568 -953 -122 792 -337 -677 747 571 -1065 -503 1230 375 -1305 -227 1221 -1 -1069
890 -1069 284 868 -606 -671 943 514 -1213 -354 1421 276 -1483 -162 1426 113 -1170 22
906 22 840 -181 -405 439 -50 -743 455 1076 -768 -1404 915 1625 -951 -1746 812 1666 -609 -1427
924 -1427 355 971 -137 -390 -21 -279 60 954 56 -1503 -238 1931 525 -2072 -788 2038 1010
941 1010 -1732 -1089 1259 1003 -650 -737 14 273 536 299 -969 -928 1183 1520 -1207 -1992 1022 2247
959 2247 -698 -2233 299 1967 90 -1441 -395 729 530 73 -492 -855 273 1523 71 -1983
975 -1983 -496 2177 905 -2108 -1212 1789 1351 -1286 -1284 693 1000 -69 -519 -443 -65 846 720 -1002
993 -1002 -1288 1026 1777 -821 -2032 541 2066 -202 -1842 -99 1413 318 -830 -399 154 320
1009 320 494 -128 -1044 -188 1425 514 -1605 -810 1615 1035 -1416 -1087 1126 1001 -714 -720 355 348 5
1028 5 141 -219 -580 371 1005 -378 -1287 335 1436 -239 -1425 144 1257 -94 -978 96 624 -172
1046 -172 -252 283 -105 -424 397 582 -596 -680 714 748 -747 -692 748 590 -679 -357 648 133 -569
1065 -569 162 556 -393 -495 597 476 -709 -418 757 327 -707 -194 623 8 -505 242 371 -491 -253
1084 -253 753 183 -940 -136 1065 126 -1060 -126 970 133 -748 -62 469 -27 -131 199 -173 -426
1102 -426 462 662 -661 -886 748 1063 -731 -1126 600 1101 -409 -933 210 646 0 -238 -119 -209
1120 -209 169 673 -116 -1060 -11 1336 203 -1456 -393 1395 542 -1185 -627 846 593 -425 -454
1137 -454 -26 168 397 182 -713 -586 882 959 -883 -1227 797 1408 -558 -1373 309 1222 -7 -855
1155 -855 -194 432 337 99 -324 -574 229 1000 -44 -1307 -208 1442 451 -1416 -652 1184 747 -883
1173 -883 -730 460 573 -49 -289 -299 -71 568 463 -707 -822 733 1106 -624 -1247 484 1262 -257
1191 -257 -1084 86 824 81 -419 -137 16 130 372 -30 -718 -123 949 273 -1051 -438 1053 519 -930
1210 -930 -524 733 458 -480 -292 233 86 -17 199 -133 -445 230 667 -267 -802 266 866 -227 -825
1229 -825 190 697 -170 -499 196 282 -231 -33 311 -153 -380 336 451 -426 -464 480 459 -482 -364 470 237
1250 237 -422 -59 400 -129 -374 310 347 -458 -353 550 337 -597 -311 550 237 -449 -118 339 -35 -203
1270 -203 224 91 -423 17 621 -45 -749 73 848 -7 -816 -13 744 72 -546 -62 300 27 -28 69 -239
1291 -239 -219 478 387 -639 -561 706 683 -673 -780 547 760 -382 -651 189 436 7 -138 -143 -187 212 527
1312 527 -209 -795 151 1017 -4 -1088 -130 1080 290 -893 -368 643 402 -306 -318 -40 149 350 76
1331 76 -598 -347 734 607 -767 -804 688 945 -525 -948 307 814 -90 -588 -99 274 236 93 -263
1350 -263 -449 226 752 -122 -967 -44 1058 208 -1017 -341 868 423 -622 -398 345 319 -25 -125 -225
1369 -225 -69 453 346 -560 -567 586 760 -523 -832 419 825 -264 -707 118 501 -6 -257 -67 -37 51
1389 51 313 -12 -538 -71 694 179 -743 -252 739 305 -632 -283 489 238 -296 -97 154 -54 11 245 -88
1410 -88 -394 163 529 -181 -578 180 576 -178 -517 159 389 -176 -250 206 79 -251 70 301 -205 -371 281
1431 281 380 -325 -384 339 331 -315 -229 282 106 -224 65 248 -217 -219 366 242 -450 -251 515 278 -489 -258
1453 -258 425 219 -320 -120 176 -13 -57 184 -54 -350 133 517 -151 -635 136 696 -75 -683 19 585
1473 585 53 -425 -73 206 55 33 8 -265 -110 471 246 -596 -380 647 512 -608 -573 503 583 -322
1493 -322 -512 143 346 34 -111 -164 -136 248 411 -251 -636 183 795 -94 -869 -56 816 170 -684 -258 481
1514 481 285 -230 -246 -65 116 313 46 -517 -235 633 435 -652 -584 594 694 -439 -671 277 608 -85
1534 -85 -411 -69 179 193 98 -224 -366 199 595 -137 -755 10 804 103 -788 -213 643 259 -460 -273 221
1555 221 190 11 -78 -211 -103 366 278 -438 -420 463 540 -402 -571 322 566 -214 -460 111 316 -20 -105 -24
1577 -24 -89 22 290 11 -434 -72 525 122 -569 -163 526 182 -440 -167 312 88 -192 7 72 -125 19
1598 19 254 -77 -354 129 428 -124 -438 131 418 -103 -312 110 211 -124 -86 168 -33 -214 150 280 -213
1619 -213 -318 264 335 -245 -322 239 267 -178 -153 139 22 -111 121 96 -274 -126 372 138 -459 -194 484 204
1641 204 -433 -229 357 185 -225 -106 88 5 54 145 -141 -290 221 432 -211 -520 204 604 -116 -570 39
1662 39 503 45 -347 -96 148 88 63 -54 -279 -39 431 128 -553 -271 575 375 -543 -460 430 457 -280 -403
1684 -403 117 276 58 -88 -179 -108 277 343 -266 -521 236 676 -132 -708 34 686 92 -567 -178 392 213
1705 213 -148 -182 -84 108 296 8 -462 -165 542 321 -565 -442 506 514 -376 -511 222 435 -72 -302 -69
1726 -69 103 161 122 -190 -314 201 485 -119 -595 54 652 64 -598 -131 499 190 -323 -170 158 134 43 -26
1748 -26 -196 -88 311 239 -372 -351 382 420 -335 -448 258 404 -171 -312 74 179 -24 -24 -5 -154 0 290
1770 290 40 -372 -73 446 126 -422 -131 390 133 -282 -87 199 41 -72 85 25 -168 64 281 -72
1790 -72 -332 89 371 -84 -353 68 310 -43 -226 56 92 -94 23 143 -125 -210 193 253 -231 -307 246 320
1812 320 -207 -286 167 234 -100 -107 59 -14 -10 170 44 -270 -39 395 116 -431 -145 453 205 -373 -212 286
1834 286 199 -154 -136 14 16 100 107 -185 -247 230 377 -228 -480 195 530 -101 -497 27 437 57 -277 -106 108
1857 108 121 93 -83 -247 15 413 99 -489 -206 524 316 -461 -376 369 396 -215 -341 66 227 99 -57
1878 -57 -197 -136 249 315 -246 -469 199 558 -115 -602 3 562 89 -452 -165 291 188 -83 -166 -104 89 284
1900 284 38 -397 -162 470 296 -446 -381 404 438 -272 -412 164 357 -20 -207 -80 38 159 144 -164 -305
1921 -305 131 424 -87 -511 4 518 84 -468 -148 354 144 -207 -139 56 64 83 37 -200 -136 265 259 -270 -312
1944 -312 253 371 -199 -346 154 315 -76 -199 28 87 -6 55 11 -169 -38 258 74 -319 -120 354 152
1965 152 -310 -157 248 124 -165 -68 93 -11 -12 113 -20 -202 43 280 -42 -321 30 336 -7 -299 2
1986 2 231 19 -130 23 18 -59 94 135 -156 -189 206 271 -212 -305 199 315 -144 -271 91 209 -14 -94 -11 -42
2010 -42 27 153 -7 -282 -34 355 96 -395 -146 382 197 -310 -216 213 206 -82 -132 -23 38 137 101 -183 -214
2033 -214 233 355 -185 -409 147 472 -57 -420 -9 341 95 -210 -127 58 126 113 -78 -251 -3 360 94
2054 94 -428 -207 417 291 -371 -336 266 333 -137 -272 11 183 116 -17 -164 -114 220 277 -186 -386 139 481
2076 481 -33 -467 -33 443 132 -330 -171 181 176 -17 -121 -131 45 246 64 -321 -175 354 279 -317 -338 265
2098 265 357 -162 -311 57 249 40 -109 -85 -26 110 174 -87 -274 72 370 13 -384 -67 373 129 -302
2119 -302 -130 227 146 -112 -82 3 32 103 75 -162 -164 195 247 -176 -290 132 303 -81 -284 38 204 2 -107
2142 -107 -2 9 -13 114 42 -187 -69 235 126 -243 -149 240 182 -181 -152 147 126 -62 -29 25 -36 35 155 -26
2166 -26 -213 26 275 -4 -286 -34 275 56 -224 -69 135 51 -64 -17 -44 -48 92 112 -162 -183 176 250 -159
2189 -159 -271 129 288 -63 -238 12 174 62 -64 -48 -45 59 170 2 -244 -30 326 112 -320 -156 302
2210 302 197 -231 -215 133 173 -33 -114 -66 18 131 83 -177 -204 171 285 -138 -356 81 378 2 -324 -50
2232 -50 270 118 -129 -129 17 120 140 -40 -224 -19 310 122 -318 -195 300 271 -230 -276 153 280 -52 -201
2254 -201 -32 110 118 9 -147 -139 154 249 -117 -338 46 367 17 -355 -85 301 127 -205 -148 82 134 43 -65
2277 -65 -125 10 202 102 -234 -168 247 260 -191 -264 150 281 -57 -219 4 153 66 -49 -84 -52 79 158 -49
2300 -49 -245 -11 271 59 -268 -128 245 123 -179 -136 104 99 -27 -51 -45 -10 88 114 -104 -160 114 231 -77 -229
2324 -229 60 239 -10 -187 -5 126 26 -35 -20 -35 -8 119 47 -164 -96 172 128 -181 -154 138 143 -104 -146 53
2348 53 90 -5 -18 -28 -58 40 137 -25 -199 9 239 40 -228 -61 199 95 -143 -89 79 83 8 -8 -69 -25 126
2373 126 112 -139 -162 133 210 -103 -231 61 231 -15 -189 -18 111 58 -30 -70 -78 50 144 -12 -210 -39 242
2396 242 107 -232 -140 208 174 -140 -176 65 147 30 -80 -86 8 132 103 -123 -160 135 252 -63 -270 33 290
2419 290 42 -232 -81 160 120 -67 -113 -27 80 109 -25 -192 -43 212 109 -232 -172 192 211 -130 -220 71
2441 71 185 13 -129 -60 66 119 53 -104 -125 98 213 -45 -229 -2 258 61 -213 -94 178 115 -95 -122
2463 -122 21 91 61 -27 -116 -32 149 107 -139 -157 132 198 -94 -192 52 181 8 -131 -31 80 70 16 -51 -71
2487 -71 47 140 0 -172 -33 205 90 -166 -91 145 121 -87 -88 23 73 28 -14 -62 -46 79 106 -58 -155 51
2511 51 182 -29 -181 -3 149 34 -110 -40 47 39 12 -21 -68 -14 104 62 -122 -95 123 130 -95 -129 82 134 -19
2536 -19 -89 9 57 47 17 -35 -66 49 123 -24 -159 -17 162 48 -161 -71 119 79 -80 -91 16 55 33 -28 -85
2561 -85 -39 91 76 -100 -136 94 171 -48 -174 18 162 27 -113 -53 73 83 11 -45 -59 42 133 11 -157 -39
2585 -39 178 89 -146 -127 114 132 -70 -127 16 99 37 -63 -77 -9 97 75 -84 -134 74 177 -44 -187 -10 182
2609 182 49 -141 -83 86 95 -15 -73 -46 57 111 -2 -127 -36 150 100 -122 -124 118 158 -47 -149 13 119 34
2633 34 -74 -52 11 77 50 -84 -106 44 143 -14 -161 -26 149 57 -130 -82 86 77 -32 -73 -22 52 64 -2 -85 -36
2659 -36 104 87 -82 -117 73 156 -20 -109 3 115 45 -62 -38 17 58 37 -37 -70 20 108 20 -117 -54 115 74 -106
2685 -106 -95 48 78 -24 -50 -12 31 44 10 -40 -41 65 94 -34 -112 33 129 22 -103 -19 87 45 -41 -40 25 46 26
2712 26 -17 -72 -7 86 48 -95 -86 81 88 -57 -103 26 87 8 -69 -32 30 44 23 -54 -59 40 96 -9 -100 -16 130 55 -98
2741 -98 -58 90 90 -29 -66 -4 52 39 -13 -64 -12 84 65 -67 -94 65 116 -27 -112 3 104 21 -77 -50 20 47 9
2768 9 -60 -56 28 91 0 -115 -36 112 71 -96 -84 71 104 -29 -79 2 71 51 -24 -50 -18 76 67 -52 -90 47 115 -14
2796 -14 -118 -13 110 38 -75 -65 36 58 -8 -64 -51 27 56 0 -92 -44 86 59 -79 -89 51 95 -26 -79 -1 72
2822 72 28 -33 -51 1 64 47 -47 -81 26 109 6 -97 -17 100 47 -78 -57 35 67 -8 -52 -31 24 54 4 -72 -34 62
2850 62 64 -59 -90 41 97 -13 -85 1 77 38 -30 -26 8 42 47 -25 -66 8 77 32 -76 -43 82 57 -45 -44 21 60 7
2879 7 -35 -24 15 48 12 -44 -48 50 68 -25 -96 -2 76 5 -82 -38 41 28 -17 -41 4 38 30 -12 -54 -12 71 34 -56 -58 57 69
2911 69 -25 -55 14 69 17 -35 -20 21 48 26 -41 -53 23 67 -14 -83 -8 83 28 -73 -56 28 54 -16 -54 -13 27 42 -11 -58
2941 -58 -14 52 44 -55 -53 42 82 -9 -78 1 79 35 -40 -35 24 58 19 -26 -44 30 66 -2 -73 -18 71 33 -67 -61 37 56 -11 -57
2973 -57 -18 30 21 -11 -53 -17 60 37 -62 -71 33 70 -14 -71 -18 70 41 -44 -40 31 57 25 -35 -37 22 61 9 -68 -12 69 59 -40
3005 -40 -55 32 66 -17 -55 -14 41 22 -26 -44 -5 36 33 -36 -56 9 60 -5 -78 -17 65 36 -41 -43 20 39 13 -25 -29 8 56 20
3037 20 -42 -17 62 63 -29 -52 25 56 10 -42 -14 46 32 -13 -37 3 22 43 -21 -58 -8 57 15 -64 -37 42 34 -36 -50 10 38
3068 38 8 -22 -26 18 51 18 -24 -32 34 58 -9 -45 5 67 20 -54 -17 42 46 -5 -34 -19 25 33 -6 -41 -8 51 30 -46 -40 28 46
3101 46 -12 -53 -3 48 17 -30 -31 6 44 23 -36 -30 33 60 -4 -53 0 59 27 -41 -32 36 50 -6 -32 -25 26 32 -4 -40 -5 44 32
3134 32 -46 -38 29 61 -12 -61 -14 36 30 -33 -44 4 38 18 -32 -40 14 56 1 -54 -17 52 40 -33 -31 31 51 -10 -33 -12 39 33 -14
3167 -14 -32 -8 49 33 -39 -42 26 64 6 -56 -13 34 17 -30 -35 5 29 7 -39 -50 15 45 -6 -43 -20 45 40 -35 -50 14 38 4
3199 4 -45 -30 33 28 -4 -25 -3 47 29 -16 -33 18 48 11 -44 -10 35 44 -15 -45 4 23 5 -30 -35 -5 30 -3 -40 -30 34 38 -27
3232 -27 -55 1 50 -2 -41 -19 20 39 1 -33 -7 18 29 -19 -55 9 50 17 -47 -25 32 49 -20 -35 -10 29 21 -32 -24 8 33
3263 33 7 -36 -33 27 40 -11 -52 -5 40 9 -42 -33 10 25 -5 -29 -15 16 28 -9 -41 -12 50 22 -29 -25 21 44 -2 -32 3 30
3295 30 17 -22 -16 -8 36 17 -27 -37 14 45 -2 -56 -17 35 15 -35 -42 14 30 -5 -33 -21 11 22 -7 -39 -10 44 29 -32 -24 35
3327 35 49 3 -34 -6 41 28 -14 -24 2 35 13 -25 -34 13 45 6 -35 -13 38 22 -29 -40 6 36 1 -30 -17 13 19 -9 -37
3358 -37 -11 33 30 -28 -39 8 43 1 -36 -11 33 32 -11 -26 5 27 22 -23 -31 22 47 6 -36 -9 32 31 -34 -36 11 36 13 -31 -27 19
3392 19 32 -1 -42 -24 22 20 -24 -38 6 30 5 -37 -26 22 22 -4 -43 -14 31 31 -12 -35 0 47 8 -31 -19 31 45 -14 -35 10
3424 10 38 11 -24 -20 16 28 -6 -37 -16 15 25 -8 -35 -1 33 6 -39 -38 22 26 -8 -33 -12 30 22 -7 -19 5 35 22 -36 -26
3456 -26 32 45 2 -35 7 45 18 -24 -20 16 29 9 -25 -16 16 35 -14 -33 -9 33 1 -38 -35 15 24 -11 -36 -16 22 27 -23 -37 9
3489 9 24 21 -28 -31 19 30 -3 -43 -10 27 11 -14 -30 16 35 10 -22 -22 24 38 -4 -31 -13 19 23 -20 -32 14 28 1 -30 -18 19
3522 19 25 -11 -34 -11 20 10 -35 -23 17 34 0 -39 -14 17 21 -1 -28 3 29 24 -16 -8 25 31 6 -29 -17 21 34 -11 -35 -10 32
3555 32 -2 -38 -34 13 9 -15 -33 -11 16 10 -24 -42 0 30 1 -35 -16 22 24 -17 -25 -1 20 16 -20 -25 13 31 10 -22 -10 21 25 -10
3589 -10 -24 6 42 9 -30 -21 20 29 -5 -36 -17 22 10 -20 -34 0 16 6 -38 -30 13 31 1 -41 -11 24 11 -29 -17 10 30 7
3621 7 -29 -22 26 37 -14 -31 -2 37 10 -15 -28 6 38 -1 -20 -13 19 22 -12 -34 3 26 9 -31 -34 20 29 -11 -38 -8 18 16 -23 -34
3655 -34 -4 20 4 -35 -26 4 26 3 -21 -8 30 25 -18 -20 12 36 11 -21 -1 20 32 -11 -37 0 23 24 -19 -29 8 19 -8 -35
3687 -35 -29 15 16 -20 -31 -5 20 15 -24 -29 9 29 0 -29 -13 32 30 -19 -14 13 37 23 -17 -14 10 40 5 -15 -10 25 16 -19 -26 11 38
3722 38 7 -22 -20 10 13 -6 -30 -1 17 -3 -23 -31 8 23 -1 -28 -15 15 33 -16 -30 1 20 16 -19 -14 18 34 5 -28 1 24 31
3755 31 -6 -29 -7 30 20 -31 -20 16 32 0 -42 -7 18 14 -9 -25 7 17 1 -24 -24 10 20 -5 -28 -13 29 8 -29 -25 9 22
3787 22 -5 -28 -16 21 19 1 -16 10 28 23 -14 -18 17 29 2 -30 -3 14 19 -6 -26 -6 13 3 -36 -22 10 23 -8 -26 -18 24 22
3820 22 -16 -21 -1 21 -6 -23 -16 21 17 1 -28 1 27 22 -11 -19 14 29 14 -16 -20 17 33 -18 -31 -9 30 3 -26 -28 6 24 -4 -20
3854 -20 -19 9 25 -13 -32 -2 17 2 -35 -34 21 23 -4 -24 -10 23 19 -18 -24 8 18 4 -21 -9 18 30 -14 -17 3 26 -1 -13 -25
3887 -25 4 22 -3 -23 -21 15 19 -21 -28 -5 18 15 -14 -19 2 26 0 -17 -7 11 22 -8 -27 0 24 15 -23 -8 19 30 3 -19 7
3920 7 24 20 -15 -16 7 35 11 -26 -21 16 18 0 -27 -12 19 11 -16 -16 2 20 -2 -31 -17 10 21 -19 -34 -11 15 18 -19 -20 8 27 2
3955 2 -26 -6 21 17 1 -16 5 34 15 -15 -13 17 23 6 -15 -10 28 19 -14 -19 -4 24 6 -21 -20 8 19 -11 -27 -1 20 16 -16 -20 -2
3990 -2 33 0 -8 -4 17 26 2 -4 -4 31 26 -13 -16 11 35 -5 -25 -10 23 28 -11 -16 -4 35 22 -13 -15 11 27 -6 -20 -18 24 12 -1 -18
4026 -18 12 22 1 -16 -19 21 26 5 -18 -4 28 25 0 -12 9 30 20 -20 -9 22 19 4 -23 -5 27 26 -4 -9 7 29 14 -20 -19 16
4060 16 9 -7 -16 -4 17 1 -21 -23 -3 16 -1 -23 -13 5 15 -5 -18 2 22 15 -6 -11 14 15 5 -18 3 24 22 -7 -20 4 27 6
4094 6 -21 -14 17 22 -9 -30 -9 19 14 -11 -32 0 13 7 -25 -8 9 11 -10 -27 -3 18 21 -21 -27 5 16 8 -19 -13 24 12 -6 -22 -2
4129 -2 13 16 -16 -28 5 22 -7 -24 -13 20 10 -12 -20 11 23 -7 -23 -24 9 18 -5 -33 -8 7 4 -13 -21 11 27 0 -22 -16 18 13 -4
4164 -4 -23 -6 16 14 -8 -15 9 20 -9 -20 -18 18 16 -14 -17 2 26 8 -24 -12 -4 14 -3 -20 -8 13 7 -18 -25 1 12 11 -27 -23 5 17
4200 17 -2 -23 -3 18 9 -11 -8 19 23 17 -22 -8 19 19 7 -27 1 15 7 -10 -16 1 12 -1 -24 -10 15 12 -15 -25 -2 14 1 -13
4234 -13 -28 -19 9 -11 -22 -6 16 10 -5 -22 -3 18 4 -21 -10 9 14 -11 -5 -12 20 19 -1 -11 3 22 12 -22 -11 4 11 -7 -24 -13
4268 -13 8 12 -25 -14 9 15 -1 -21 -13 5 13 -4 -25 0 17 1 -9 -17 11 15 -5 -21 -4 14 25 -12 -16 -4 19 9 -12 -11 5 27
4302 27 12 -14 -4 20 10 0 -7 10 20 9 -14 -15 7 15 -6 -26 -8 26 8 -12 -19 2 12 0 -19 -11 14 20 2 -11 11 18 13 -8
4336 -8 -10 17 14 10 -8 -6 15 12 -6 -13 14 20 3 -10 -18 5 20 3 -23 -10 11 13 -4 -16 -7 11 4 -8 -6 15 11 -5 -12 -8 23 10 -9 -3 2
4375 2 11 3 -15 -5 23 18 -1 -13 5 20 17 -4 -13 7 17 3 -14 2 10 13 -6 -18 -5 19 11 -15 -17 13 13 -9 -15 -13 5 8 -12 -5 11 19
4413 19 4 -9 -6 14 16 8 -12 8 14 11 -4 -17 13 15 9 -7 1 26 13 -10 -11 0 11 8 -14 -16 5 6 -7 -21 -12 9 20 -4 -12 0 18
4450 18 11 -17 -14 14 6 0 -13 -9 18 5 1 -5 8 11 12 -8 -16 7 23 2 0 -1 11 6 -4 -13 22 6 -3 -13 -20 9 1 3 -10 -9 0 8 -16 -16 8
4491 8 10 0 -19 -11 10 9 3 -7 8 12 10 1 -6 8 12 2 -3 7 16 15 -7 -25 11 15 5 -7 -4 9 1 -6 -8 0 6 4 -11 -19 -8 20 2 -18 -15 12
4533 12 7 -10 -16 -3 9 8 -12 -7 3 7 3 -10 -8 19 25 0 -7 -1 19 4 4 -8 15 10 -2 -21 -1 15 20 -12 -21 -1 10 0 -12 -12 12 21
4571 21 -9 -16 -5 13 7 -6 -15 1 10 -4 -8 0 15 12 -4 -11 5 13 13 -8 -6 9 9 8 -1 2 6 14 -6 -11 -5 13 5 -11 -6 1 13 4 -16 -9 6 5 -7
4614 -7 -19 -1 1 -3 -15 9 10 14 -5 -13 -5 16 13 -12 -9 8 9 9 -9 -5 10 21 -3 -6 5 6 12 -8 -14 5 10 -6 -12 -4 11 12 -6 -10 -4 -4 2 -4 -7
4657 -7 -2 -3 5 -14 4 1 11 4 -7 7 12 5 -5 -2 3 14 1 -1 1 18 15 -5 -9 15 16 7 -6 -5 15 17 -2 -4 -10 9 -5 -8 -11 6 10 3 -7 -11 -2
4700 -2 3 -9 -3 3 18 8 -9 4 10 12 4 -1 -8 14 15 -3 -9 8 18 12 -1 -8 13 15 -7 -5 2 16 7 -4 -11 -1 14 7 -17 -5 4 4 2 -12 -4 3
4742 3 -1 -2 8 1 15 7 2 -7 16 16 -3 -11 6 14 10 2 5 14 9 0 -3 -3 12 14 -1 -3 -2 9 10 -14 -8 5 4 2 -4 -10 13 16 -6 -5 11 14 4 2 -2 8
4788 8 12 8 1 1 8 8 2 -9 6 14 14 -1 9 12 9 -5 -1 1 10 11 -2 0 15 19 11 -20 -4 14 0 0 -7 -7 0 -6 -10 -6 2 3 -4 -8 -10 12 10 3 -4 7 14 1
4836 1 -12 0 16 13 3 2 5 7 8 -1 -14 9 7 11 4 -8 8 14 3 -7 -11 12 7 1 -9 6 5 6 3 0 -1 11 -4 -12 -1 2 4 -17 -1 15 17 3
4878 3 9 0 12 8 11 3 3 24 10 5 5 12 9 2 -5 -1 9 11 -1 -4 5 3 -5 -5 -2 10 -1 -7 -10 -7 11 6 -9 -5 0 -3 -8 -4 -6 3 4 -6 -4 -2 6 12 -9 -7 14
4927 14 5 5 2 1 13 2 -1 -5 11 9 7 -7 -7 -1 13 -5 -6 0 11 -2 -12 2 10 4 0 -1 4 5 8 8 1 3 8 5 3 2 7 18 -3 0 5 16 7 7 0 4 -3
4974 -3 12 9 3 3 6 -1 -11 -1 12 8 -10 -13 4 3 -2 -2 3 1 2 2 -3 9 7 11 1 -8 0 15 8 -6 -1 8 4 -2 -8 1 12 6 -2 -4 5 8 3 4 -13 -3 5 4
5022 4 -6 9 10 9 -10 -6 13 6 -8 -19 0 3 10 -3 -3 -4 -2 -10 -3 4 6 8 -7 0 11 14 5 -9 -8 8 7 -2 4 4 10 13 6 6 2 14 12 13 -9 -2 4 5 3
5069 3 -10 5 7 4 -4 -6 10 4 1 1 3 0 6 3 7 5 8 0 5 12 8 9 -5 -4 12 14 -9 -17 6 9 0 -4 3 1 3 0 -4 0 14 1 -1 -2 -10 10 -3 -17 -11 -3 6
5118 6 0 1 -4 2 9 0 -6 -1 12 2 3 6 2 2 5 -1 6 10 5 -1 4 9 16 -4 14 5 7 12 2 3 5 10 8 0 -6 8 -3 -8 -11 -8 13 10 3 3 6 -2 10 6 12 4 13 13
5170 13 2 4 3 13 -6 2 20 6 3 3 2 10 8 14 6 9 8 13 -2 2 4 8 -1 -1 2 -1 2 -2 -4 -1 3 -4 -7 -13 0 0 -6 -5 -5 10 11 4 -7 9 10 6 6 -1 14
5219 14 5 16 4 0 2 17 16 -5 2 1 6 4 2 -7 2 -6 -17 -13 3 11 -1 -5 -5 1 -4 -12 -6 0 3 0 -1 2 4 9 -3 5 10 3 1 10 5 10 25 0 6 7 -5 -1 -4
5268 -4 -5 10 7 3 -3 -4 -5 0 -2 -5 -10 1 7 -12 -18 -4 10 -2 -3 -6 7 -3 -11 -3 0 6 7 -10 4 3 12 7 -3 2 -4 8 3 -4 9 6 -13 -4 -2 11 10 5
5314 5 4 -4 14 -6 -3 -13 -6 -1 -7 -1 -5 3 10 -6 -14 7 -4 -3 -8 -8 -4 7 1 -7 5 1 5 -13 7 11 17 10 0 1 11 14 6 -5 1 3 11 -4 -6 2 9 1 -13
5361 -13 -14 0 5 -13 -3 -3 -2 -7 -6 -8 1 -1 0 -6 -4 8 9 -2 -9 -1 -6 10 -1 11 5 -1 4 0 12 8 5 12 -2 4 4 10 -7 0 -3 3 -3 -14 -5 1 -2 -1 -8 -8
5409 -8 10 -5 -7 -4 1 6 8 -1 8 -1 4 1 -10 12 13 8 -4 5 2 -3 3 3 9 7 14 -3 -6 -5 1 2 -7 -4 5 -2 2 -2 0 0 -3 1 -7 -8 1 -7 -6 -9 11 7 -8 -6 6 2
5461 2 2 -7 6 2 3 5 8 -1 11 9 -3 -3 -1 16 3 -5 1 0 4 3 -1 5 7 6 -9 4 2 8 4 -5 -11 -2 -7 -9 -6 10 -1 5 -6 -1 13 13 4 5 8 8 8 -2 -2
5510 -2 1 11 3 -13 4 25 2 8 4 6 5 6 10 -5 -7 -2 8 7 -2 7 8 -1 -5 5 6 11 -5 -4 1 -6 -1 -4 9 6 7 11 -9 7 -1 3 2 -3 6 9 9 5 7 10 9
5559 9 5 4 3 4 13 0 -5 2 -2 3 -2 -9 -2 -2 -5 -14 -1 5 -2 2 -4 0 -1 13 -7 1 -5 10 -7 -3 1 6 6 0 8 7 0 4 7 1 2 14 7 8 -1 17 15 -3 1 -4 10
5610 10 -2 -11 -1 -1 -17 -3 5 -8 1 -8 -5 -1 -2 -8 -4 -4 3 3 0 -13 -4 3 2 8 5 -2 5 6 6 3 -2 9 2 -1 5 5 12 -2 -3 8 1 -13 -12 -1 5 -3 -1 -3 -2
5659 -2 -1 2 5 1 -6 8 -9 -11 -3 2 -7 0 2 10 4 3 -8 2 -1 10 5 -2 9 4 12 -1 -2 9 9 0 -4 -2 3 1 10 -5 -16 -4 3 -1 -11 2 -5 -2 -6 -1 8 -3
5707 -3 -2 4 -1 2 -10 -2 2 -3 2 1 2 -14 7 11 -1 -4 2 15 14 10 3 6 9 4 14 -6 -4 2 8 -3 -4 10 9 0 -3 8 12 2 -2 2 -9 -4 12 -1 -2 6 14
5754 14 2 1 4 7 4 -3 -2 10 9 -1 10 -5 4 -1 -4 10 6 9 3 4 -1 0 2 -11 4 0 10 4 3 1 -4 -1 -2 1 -5 0 1 6 0 -2 8 7 -2 8 0 7 -13 5
5802 5 -2 10 6 -1 -15 -4 9 -4 -4 -4 5 2 -4 -2 9 5 9 -3 -10 16 3 -4 0 7 1 -6 9 1 4 1 9 -7 2 -7 10 8 1 3 10 -6 10 3 9 15 13 0
5848 0 4 12 18 0 6 6 16 16 5 4 3 7 10 3 7 1 3 7 13 1 5 2 4 9 4 6 5 2 1 -3 5 18 1 17 8 11 11 11 -1 10 3 9 9 7 8 -4 8 4 9 11
5898 11 7 12 -2 4 2 12 3 6 10 -3 -5 -8 13 -2 -5 6 9 6 -5 11 4 0 5 8 5 5 8 2 -6 -5 7 12 -4 -13 3 -4 -2 3 9 -1 8 7 8 1 0 8 -3
5945 -3 -6 13 3 6 5 -6 4 11 -3 2 -5 2 -2 4 5 12 13 8 3 2 2 -4 -5 7 1 12 4 9 -1 11 12 15 8 6 15 15 -2 -6 0 16 7 -8 -6 15 15 -7 -8
5992 -8 9 9 13 -1 5 2 6 -1 -3 0 4 15 3 4 5 10 5 -2 -2 18 8 7 2 8 11 3 3 12 4 13 14 -1 -6 8 12 4 4 9 3 3 0 8 2 9 5 -2 -19 9 3 -3 -1
6043 -1 10 6 -1 6 -1 15 -1 4 -7 13 9 1 14 1 0 5 12 1 10 12 6 5 8 10 10 9 6 13 0 13 11 7 -5 4 8 4 4 0 9 -1 -8 3 7 1 3 -3 3 9
6091 9 0 3 12 3 -2 9 9 1 -1 4 12 -1 7 -1 13 7 6 7 2 1 11 -6 6 6 10 4 6 3 2 -3 -5 6 3 -3 -2 4 3 -8 11 6 -1 8 7 10 5 0 9 14 7 1 15
6142 15 11 10 3 8 9 2 -5 5 0 12 10 -1 -4 1 10 -7 -13 4 9 13 2 2 6 0 -5 -1 3 1 4 -2 1 -2 1 -3 2 7 5 13 11 3 5 2 6 4 -1 6 8 7 6 -3 9 -3
6194 -3 -7 1 5 13 4 8 0 4 7 -4 0 -1 0 7 0 4 1 8 10 -1 -14 6 -7 2 -9 -4 9 5 2 -1 4 2 -1 4 1 -6 2 0 5 -4 11 1 -5 7 1 -9 -3 -5 -7 2
6244 2 -1 4 -14 0 -8 15 1 0 5 9 5 2 11 -4 -4 2 -8 -5 -7 -1 4 2 0 10 6 -9 7 9 18 6 13 17 6 1 -1 4 1 4 8 14 8 -6 2 14 -1 4 3
6291 3 0 -2 -2 5 1 2 0 -4 -11 0 4 5 -7 9 2 5 -11 -3 4 -7 4 1 -3 -3 -6 7 17 3 3 -4 7 -1 13 7 -5 -9 10 2 1 -1 -2 4 -12 -3 -4 -8 -4
6338 -4 -6 -5 -3 0 5 0 -3 5 7 12 13 6 7 0 1 -1 16 7 8 12 9 -3 5 1 0 -5 8 5 -1 -6 -1 8 0 -10 -2 -4 4 -6 0 0 3 4 -1 -2 6 8 5 -1 -3 4 16 -8 6
6391 6 10 -3 -5 3 4 4 -11 6 1 9 7 3 -2 -3 2 16 2 -3 2 -10 -3 -1 -1 -12 0 -6 -4 -7 7 5 -5 -2 -5 10 0 3 13 -2 -3 1 2 10 8 0 4 -6
6437 -6 13 6 5 7 4 -3 2 7 6 13 4 1 -1 -3 1 2 -3 8 -6 -2 -2 6 -3 -2 8 10 -10 8 -2 8 -1 12 7 3 1 6 -3 -3 7 6 5 13 6 11 12 10 -2 2 -10
6486 -10 8 -3 -6 -5 -8 -5 -10 -5 6 3 -1 -20 -1 2 3 -11 -16 6 -4 4 -3 -10 5 11 -6 -15 -3 -9 4 -1 1 9 7 -3 -13 9 7 0 12 1 7 1 -3
6529 -3 -10 -9 0 8 2 -7 0 -4 -6 -2 10 6 2 7 -2 3 9 3 1 -1 1 7 -5 -8 -7 1 9 -4 2 5 0 -4 -1 6 9 6 3 4 7 3 -3 -3 1 12 -1 -3 -3 5 13 5 -4 -9 5 -1 -10
6584 -10 -11 -5 3 3 -3 4 -13 -7 3 -10 1 7 0 0 12 9 -7 0 0 4 -1 7 11 -4 -9 4 -9 12 4 0 7 3 1 2 -1 1 -9 -6 4 -1 -4 2 4 -10 -3 4 -1
6631 -1 -4 5 6 -2 -4 -2 0 4 8 2 -6 -11 4 1 1 -3 13 -1 10 -5 -2 12 -8 3 14 6 2 2 6 6 3 -7 1 -6 -2 5 -3 -10 -8 -3 5 0 -5 -3 -9 4 5 2 -5 -6
6681 -6 -8 -5 -11 3 -2 0 2 -5 11 0 -3 -1 -1 -2 -1 -9 -2 1 -2 3 -20 -7 7 5 -12 -10 -3 8 0 -3 -4 2 -1 -10 1 1 -1 -7 7 -5 -4 6 -10 -8 0 10 0
6728 0 -7 -3 8 -4 -5 3 -7 -6 16 -6 -5 5 5 -5 -6 -13 -6 -4 -12 -12 0 1 -9 -7 -9 -12 -5 -7 -1 -14 -7 -4 -5 0 4 1 4 3 8 2 -1 -2 -2 16 -4 -6 -4 2 -2
6777 -2 1 -6 -3 1 -2 -5 -11 3 10 0 0 4 0 -1 -1 -7 -3 -1 -5 -6 1 0 4 3 0 -4 -10 -2 -6 5 -1 -4 1 0 -8 -6 -7 11 3 -4 0 6 4 -1 4 12 0 -10 -2 -10 -6 7 3 -2
6831 -2 -1 -2 3 -4 -4 -2 3 -7 2 -5 6 14 -5 -1 9 -1 2 1 11 -5 -5 1 -3 4 10 4 3 9 -11 11 3 1 9 -1 3 8 0 -4 -5 2 4 -2 -8 2 14 6 -7 4
6879 4 4 6 0 -3 -9 -1 3 5 0 6 13 3 7 3 15 2 0 -3 -7 0 -4 7 1 -2 -3 5 7 2 4 -5 -2 1 5 12 2 -6 11 2 -2 2 6 11 7 -6 -1 -11 1 17 4 -4
6929 -4 3 5 -7 5 5 3 2 -12 1 9 7 -4 12 -4 2 -2 1 3 -7 13 12 3 3 -6 20 9 0 2 4 -6 -12 0 9 4 5 1 -9 -2 3 -12 4 5 3 3 1
6974 1 8 12 6 -3 8 0 -2 3 1 4 10 1 10 6 8 10 1 7 -9 3 7 4 -7 -1 -3 3 3 4 4 6 4 8 -5 -2 0 -6 7 -3 4 8 3 5 2 3 -1 -4 3 -4 1 3 7 -5 -1
7027 -1 14 4 -2 4 2 6 3 17 10 -1 7 -6 5 -1 0 16 19 -3 18 6 7 -2 -4 3 4 1 10 8 -6 7 7 9 7 -1 12 8 1 5 16 20 -4 -3 6 13 -1
7072 -1 4 12 8 5 2 14 5 12 -1 4 -6 12 8 6 6 -4 11 3 -4 -1 -1 10 3 3 9 4 3 3 -2 7 1 4 -5 15 6 -2 -4 2 5 2 6 0 1 -4 7 10 1 5 1 -5 3 3
7124 3 8 6 3 1 7 1 5 2 7 -9 -4 -3 -11 -2 2 2 4 2 7 4 5 4 9 9 8 2 10 8 4 1 14 1 10 4 8 6 4 5 -4 6 7 6 11 -3 0 2 -2 6 1 0 -9 3 2 2 -4
7179 -4 -12 5 3 0 -3 8 11 -8 2 0 9 3 -1 20 -5 3 3 5 3 -10 0 -9 -4 -4 2 0 13 1 -5 2 8 -1 -2 -2 12 6 -3 2 3 2 -5 6 3 6 10 8 6 11 -1
7228 -1 -2 4 -1 0 3 -10 -1 2 -4 3 6 5 -1 10 5 5 7 1 4 -1 7 3 8 0 7 1 10 14 10 3 1 5 3 0 -1 -4 1 12 -6 5 -7 2 11 5 1 1 1 -5 -5 12 9 -3 -5
7281 -5 -1 3 -6 1 10 0 2 -2 -8 3 0 -2 -8 5 4 8 -2 2 -2 -1 0 -10 -4 -3 -7 3 3 1 0 18 5 1 -8 11 11 -1 -4 5 4 1 8 9 1 -4 3 1 -1 5 4 -1 -4
7332 -4 -9 9 3 -1 0 12 -4 3 12 -4 -9 2 -3 3 2 4 -1 -2 -4 -3 4 -4 -2 9 -8 -2 -2 9 2 3 -5 -9 -1 -1 3 12 4 8 1 2 0 -10 14 -4 -6 -8 14 3
7380 3 4 -2 3 2 5 -2 -1 0 -3 6 -1 8 4 -3 0 5 15 8 2 -1 1 0 -5 5 8 0 -4 4 -2 13 -1 8 8 -2 9 -3 -3 -3 3 10 4 -9 3 8 3 -1 11 7 -9 -4
7430 -4 4 11 3 2 4 14 -2 16 3 1 9 10 12 11 14 8 3 -11 5 7 9 12 1 4 9 6 6 3 2 1 11 -2 0 3 6 -3 2 4 9 -2 1 -6 0 6 -2 3 2 3 8 13 6
7481 6 14 9 6 6 -5 -1 2 5 -1 -3 -1 0 3 -5 0 5 6 3 -9 0 4 -16 -9 9 2 6 2 2 -7 7 4 13 -3 0 2 -7 7 -1 -1 -4 8 7 16 17 -1 6 -2 -1 -2 3 7 7
7533 7 3 1 4 7 -4 9 10 -4 1 -1 -3 6 13 -10 -2 2 -3 7 2 12 2 1 -5 -3 0 -4 -4 1 5 0 -1 -8 -3 -1 -3 9 -7 5 2 -3 0 -4 -1 0 4 10 5 -1 -2 -9 1
7584 1 -7 -2 -1 1 3 -5 2 -12 -8 0 -4 -2 -15 -14 5 -3 -9 -4 -6 6 -4 0 -2 1 6 7 9 12 8 1 -13 -1 -2 8 -1 -4 -11 1 1 2 1 8 2 0 7 -3 1 11 0
7633 0 -12 -13 -2 -10 1 -2 -3 2 1 4 -9 5 -7 -1 -4 0 2 -1 6 -7 -2 -7 -2 -7 -2 2 -4 -2 -2 -3 -4 5 -3 6 0 -10 8 -3 -6 8 -5 -2 -4 4 -6 -9 -4 7
7681 7 -3 13 2 -3 2 7 9 -2 1 5 3 -12 -2 -4 0 3 1 -1 -5 5 0 6 -1 -3 -5 -6 -2 -7 2 -6 -10 7 -7 0 -5 6 1 1 -8 -4 -9 -12 -8 -6 3 -5 -7 -3 1 -6 7
7732 7 0 -2 0 3 -5 0 1 0 1 -2 -2 7 6 -2 -10 -9 3 -11 -7 -5 1 -9 -1 2 10 3 -10 -5 -15 -6 -2 -3 -12 -4 -2 -1 7 1 -2 -14 2 -12 -7 0 4 0 -6 -13 0 -10 -3
7783 -3 8 5 -2 -8 -7 -7 5 -3 1 -7 -11 -2 -3 -4 -8 -1 -8 -6 -11 5 -5 -13 -7 -7 -2 2 -1 -9 -2 0 -7 0 -1 -12 -2 2 -7 -8 -1 3 -7 2 4 5 5 5 0 8 -5 -6 3 4 4
7836 4 2 0 -5 -7 1 -13 1 -4 -1 -5 -7 -3 7 -5 -11 -3 3 -3 -7 0 3 -3 5 -2 2 1 4 2 -3 3 0 0 2 -1 8 -6 4 0 -10 10 -21 -15 -4 -1 -1 1 -3 -3 -4 -16
7886 -16 2 -9 -3 -6 -3 3 -7 8 -1 -12 -6 -5 2 8 6 2 -8 -6 -8 -7 4 -1 -4 -3 -5 2 -2 8 11 1 2 7 0 9 1 10 -1 -6 8 3 3 2 3 -3 1 0 -3 -6 0
7935 0 -5 -11 5 -1 5 -2 -14 5 -1 10 2 3 -3 -3 -12 4 -7 0 -1 -7 -1 0 -8 -5 1 -10 -5 3 -10 -12 -3 -4 -7 -1 4 -3 -2 -5 -2 -2 1 -9 -10 1 -9 0 -14 -9 -1
7984 -1 -5 -8 -2 1 4 0 5 -6 -1 -1 2 5 2 5 -4 -2 -10 4 -2 -1 3 2 -1 -7 -3 -10 4 -2 -4 -5 3 3 -3 -5 -7 -4 2 11 -5 4 -9 5 2 -2 0 -13 -1 0 8 -1 1 -13
8036 -13 -8 -7 -8 1 0 2 16 5 13 8 1 -3 2 -6 -9 5 -7 4 -10 -2 1 0 3 1 1 -7 -8 8 6 5 3 4 2 6 3 -5 5 5 8 0 2 -4 -2 0 14 5 3 -2 -8 -1 0
8087 0 -11 11 2 3 5 -1 -6 -2 -3 6 11 -4 -6 -3 4 -3 -9 -4 -10 3 -6 -6 -3 -3 15 7 4 10 -3 5 -4 -8 -1 -5 -3 -1 8 5 0 -12 8 -2 -4 2 6 2 6 -2 -6 -8 -4 -4
8139 -4 7 -4 0 -3 -6 -5 11 2 4 1 -1 -6 -6 -4 -8 2 -2 3 -4 -11 -5 8 16 3 10 3 8 -8 7 9 -9 6 -3 -9 -3 -5 6 3 4 4 -1 1 -5 7 1 -8 -6 -6 1
8188 1 3 1 1
8191A
##END NTUPLES=NMR FID
##END=
