##TITLE=1H_LY-DMAA.Per.1.5
 CDCl3
 8 sc, 
 8.02.2022
##JCAMPDX= 6.0         $$ Bruker NMR JCAMP-DX V2.0
##DATA TYPE= NMR FID
##DATA CLASS= NTUPLES
##ORIGIN= UXNMR, Bruker Analytische Messtechnik GmbH
##OWNER= root
$$ XWIN-NMR		Version 3.5
$$ Tue Feb  8 13:37:14 2022 Russian Standard Time (UT+4h)  she@DPX200
##.OBSERVE FREQUENCY= 200.131346
##.OBSERVE NUCLEUS= ^1H
##.DELAY= (6, 6)
##.ACQUISITION MODE= SIMULTANEOUS
##.ACQUISITION SCHEME= undefined
##.AVERAGES= 8
##.DIGITISER RES= 18
##SPECTROMETER/DATA SYSTEM= spect
##.PULSE SEQUENCE= zg30
##.SOLVENT NAME= CDCl3
##.SHIFT REFERENCE= (INTERNAL, CDCl3, 0, 15.7039)
##AUDIT TRAIL= $$ (NUMBER, WHEN, WHO, WHERE, WHAT)
$$ ##TITLE= Audit trail, XWIN-NMR		Version 3.5
$$ ##JCAMPDX= 5.01
$$ ##ORIGIN= Bruker BioSpin GmbH
$$ ##OWNER= she
$$ F:/spectra/data/she/nmr/H-F/1/audita.txt
$$ ##AUDIT TRAIL=  $$ (NUMBER, WHEN, WHO, WHERE, WHAT)
(   1,<2022-02-08 13:35:17.45 +0400>,<she>,<DPX200>,
      <created by zg, POWCHK disabled, PULCHK disabled
       configuration hash MD5:
       00 E9 B6 7A A2 85 ED C7 34 08 36 98 17 FE 4E 26
       data hash MD5: 16K
       D3 C7 9F ED BE A3 24 E9 CB 99 26 6B 8F AA CE 97>)
$$ ##END=
$$ 
$$ hash MD5
$$ 8B FE 18 A5 5A C7 A0 AE 9A 1A 81 F6 61 B8 A3 A7
##$RELAX= 
##$RELAX= 
##$RELAX= 
##$RELAX= 
##$RELAX= 
##$RELAX= 
$$ Bruker specific parameters
$$ --------------------------
##$DU= <F:/spectra>
##$EXPNO= 1
##$NAME= <H-F>
##$PROCNO= 1
##$TYPE= <nmr>
##$USER= <she>
##$AMP= (0..31)
100 100 100 100 100 100 100 100 100 100 100 100 100 100 100 100 100 100 
100 100 100 100 100 100 100 100 100 100 100 100 100 100 
##$AQSEQ= 0
##$AQ_mod= 1
##$AUNM= <au_zg>
##$AUTOPOS= <>
##$BF1= 200.13
##$BF2= 200.13
##$BF3= 200.13
##$BF4= 200.13
##$BF5= 200.13
##$BF6= 200.13
##$BF7= 200.13
##$BF8= 200.13
##$BYTORDA= 1
##$CFDGTYP= 0
##$CFRGTYP= 5
##$CHEMSTR= <none>
##$CNST= (0..31)
1 1 145 1 1 1 1 1 1 1 1 1 1 1 1 1 1 1 1 1 1 1 1 1 1 1 1 1 1 1 1 1 
##$CPDPRG= <>
##$CPDPRG1= <>
##$CPDPRG2= <>
##$CPDPRG3= <>
##$CPDPRG4= <mlev>
##$CPDPRG5= <mlev>
##$CPDPRG6= <mlev>
##$CPDPRG7= <mlev>
##$CPDPRG8= <mlev>
##$CPDPRGB= <>
##$CPDPRGT= <>
##$D= (0..31)
0 1.2 0 0 0 0 0 0 0 0.06 0 0.03 0 0 0 0 0.0002 0 0 0 0 0 0 0 0 0 0 0 0 
0 0 0 
##$DATE= 1644312916
##$DBL= (0..7)
120 120 120 120 120 120 120 120 
##$DBP= (0..7)
150 150 150 150 150 150 150 150 
##$DBP07= 0
##$DBPNAM0= <>
##$DBPNAM1= <>
##$DBPNAM2= <>
##$DBPNAM3= <>
##$DBPNAM4= <>
##$DBPNAM5= <>
##$DBPNAM6= <>
##$DBPNAM7= <>
##$DBPOAL= (0..7)
0.5 0.5 0.5 0.5 0.5 0.5 0.5 0.5 
##$DBPOFFS= (0..7)
0 0 0 0 0 0 0 0 
##$DE= 6
##$DECBNUC= <off>
##$DECIM= 32
##$DECNUC= <off>
##$DECSTAT= 4
##$DIGMOD= 1
##$DIGTYP= 9
##$DL= (0..7)
0 120 120 120 120 120 120 120 
##$DP= (0..7)
150 150 150 150 150 150 150 150 
##$DP07= 0
##$DPNAME0= <>
##$DPNAME1= <>
##$DPNAME2= <>
##$DPNAME3= <>
##$DPNAME4= <>
##$DPNAME5= <>
##$DPNAME6= <>
##$DPNAME7= <>
##$DPOAL= (0..7)
0.5 0.5 0.5 0.5 0.5 0.5 0.5 0.5 
##$DPOFFS= (0..7)
0 0 0 0 0 0 0 0 
##$DQDMODE= 0
##$DR= 18
##$DS= 0
##$DSLIST= <SSSSSSSSSSSSSSS>
$$ [...]
##$SUBNAM2= <"">
##$SUBNAM3= <"">
##$SUBNAM4= <"">
##$SUBNAM5= <"">
##$SUBNAM6= <"">
##$SUBNAM7= <"">
##$SUBNAM8= <"">
##$SUBNAM9= <"">
##$SW= 18.0517287032376
##$SWIBOX= (0..15)
0 0 2 0 0 0 0 0 0 0 0 0 0 0 0 0 
##$SW_h= 3612.71676300578
##$TD= 16384
##$TD0= 1
##$TE= 0
##$TE2= 300
##$TE3= 300
##$TEG= 300
##$TL= (0..7)
0 120 120 120 120 120 120 120 
##$TP= (0..7)
150 150 150 150 150 150 150 150 
##$TP07= 0
##$TPNAME0= <>
##$TPNAME1= <>
##$TPNAME2= <>
##$TPNAME3= <>
##$TPNAME4= <>
##$TPNAME5= <>
##$TPNAME6= <>
##$TPNAME7= <>
##$TPOAL= (0..7)
0.5 0.5 0.5 0.5 0.5 0.5 0.5 0.5 
##$TPOFFS= (0..7)
0 0 0 0 0 0 0 0 
##$TUNHIN= 0
##$TUNHOUT= 0
##$TUNXOUT= 0
##$USERA1= <user>
##$USERA2= <user>
##$USERA3= <user>
##$USERA4= <user>
##$USERA5= <user>
##$V9= 5
##$VALIST= <valist>
##$VCLIST= <CCCCCCCCCCCCCCC>
##$VD= 0
##$VDLIST= <DDDDDDDDDDDDDDD>
##$VPLIST= <PPPPPPPPPPPPPPP>
##$VTLIST= <TTTTTTTTTTTTTTT>
##$WBST= 1024
##$WBSW= 4
##$XGAIN= (0..3)
0 0 0 0 
##$XL= 0
##$YL= 0
##$YMAX_a= 91516
##$YMIN_a= -88048
##$ZGOPTNS= <>
##$ZL1= 120
##$ZL2= 120
##$ZL3= 120
##$ZL4= 120
##$ABSF1= 10
##$ABSF2= 0
##$ABSG= 5
##$ABSL= 3
##$ALPHA= 0
##$AQORDER= 0
##$ASSFAC= 0
##$ASSFACI= 0
##$ASSFACX= 0
##$ASSWID= 0
##$AUNMP= <proc_1d>
##$AZFE= 0.1
##$AZFW= 0.1
##$BCFW= 1
##$BC_mod= 2
##$BYTORDP= 1
##$COROFFS= 0
##$CY= 11.3945322036743
##$DATMOD= 1
##$DC= 2
##$DFILT= <>
##$DTYPP= 0
##$F1P= 2.36226072786647
##$F2P= -0.459571619588291
##$FCOR= 0.5
##$FTSIZE= 0
##$FT_mod= 4
##$GAMMA= 1
##$GB= 0.15
##$INTBC= 1
##$INTSCL= 1
##$ISEN= 128
##$LB= 0.24
##$LEV0= 0
##$LPBIN= 0
##$MAXI= 10000
##$MC2= 0
##$MEAN= 0
##$ME_mod= 0
##$MI= 1.114404
##$NCOEF= 0
##$NC_proc= 0
##$NLEV= 6
##$NOISF1= 3.799351
##$NOISF2= 2.8
##$NSP= 1
##$NTH_PI= 0
##$NZP= 0
##$OFFSET= 15.70392
##$PC= 1
##$PHC0= -15952.09
##$PHC1= 13.80078
##$PH_mod= 1
##$PKNL= yes
##$PPARMOD= 0
##$PSCAL= 0
##$PSIGN= 0
##$REVERSE= no
##$SF= 200.130013532006
##$SI= 16384
##$SIGF1= 3
##$SIGF2= 2
##$SINO= 400
##$SIOLD= 16384
##$SREGLST= <1H.CDCl3>
##$SSB= 0
##$STSI= 0
##$STSR= 0
##$SW_p= 3612.71676300578
##$SYMM= 0
##$S_DEV= 0
##$TDeff= 0
##$TDoff= 0
##$TI= <>
##$TILT= no
##$TM1= 0
##$TM2= 0
##$TOPLEV= 0
##$USERP1= <user>
##$USERP2= <user>
##$USERP3= <user>
##$USERP4= <user>
##$USERP5= <user>
##$WDW= 1
##$XDIM= 8192
##$YMAX_p= 0
##$YMIN_p= 0
$$ End of Bruker specific parameters
$$ ---------------------------------
##NTUPLES= NMR FID
##VAR_NAME=  TIME,          FID/REAL,        FID/IMAG
##SYMBOL=    X,             R,               I
##VAR_TYPE=  INDEPENDENT,   DEPENDENT,       DEPENDENT
##VAR_FORM=  AFFN,          ASDF,            ASDF
##VAR_DIM=   8192,          8192,            8192
##UNITS=     SECONDS,       ARBITRARY UNITS, ARBITRARY UNITS
##FACTOR=    0.0002768,     1,               1
##FIRST=     0,             0,               0
##LAST=      2.2672688,     0,               0
##MIN=       0,             -88048,          0
##MAX=       2.2672688,     91516,           0
$$ Real data points
##PAGE= N=1
##DATA TABLE= (X++(R..R)), XYDATA
0 0 0 0 0 0 0 0 0 0 0 0 0 0 0 0 0 0 0 0 0 0 0 0 0 0 4 -8 8 -8 8 -8 8 -8 8 -13 16 -16 16 -16 23 -24 24 -29 32 -36 39
45 39 -43 47 -52 56 -61 68 -76 84 -92 102 -115 129 -145 162 -187 216 -254 304 -373 477 -643 936
67 936 -1577 3485 -20263 -88048 6799 81042 -1991 -65895 -4633 45919 14011 -23696 -24604
80 -24604 1439 36477 18551 -47115 -34556 55610 45039 -60086 -49856 59903 49029 -54543
92 -54543 -44184 44031 36291 -29239 -27445 11182 18475 8049 -10947 -26518 5419 42195 -2368
105 -2368 -53362 1718 59217 -2530 -58924 4224 53046 -5386 -42026 5562 27738 -3892
117 -3892 -11790 452 -3555 4653 16442 -11032 -25678 17538 30150 -23389 -30003 27221 25309
130 25309 -28629 -17402 27007 7569 -22554 2423 15820 -10896 -7467 16769 -1118 -19006
142 -19006 9124 17706 -15031 -12865 18290 5486 -18310 3445 15316 -12552 -9903 20415 2838
155 2838 -26146 4487 28793 -11023 -28347 15370 24727 -16835 -18691 14775 11009 -9290 -2697
168 -2697 1115 -4999 8917 11526 -19249 -15973 28676 18388 -35540 -18652 38922 17378 -38007
181 -38007 -15153 32705 12636 -23540 -10646 11372 9475 2281 -9613 -16137 10686 28509 -12393
194 -12393 -38181 14014 44161 -14819 -45904 14188 43581 -11428 -37454 6577 28699 558
206 558 -18154 -9190 7248 18770 3043 -28056 -11778 35921 18267 -41335 -22412 43290 24051
219 24051 -41478 -23850 35542 22082 -26170 -19672 13985 17084 -331 -14887 -13391 13406 25882
232 25882 -12491 -35625 12119 41928 -11610 -43949 10735 41916 -8782 -36117 5617 27514
244 27514 -1000 -17251 -4818 6542 11324 3235 -18033 -11352 23912 16866 -28366 -19723 30499
257 30499 19852 -30014 -17761 26728 14181 -20798 -9807 12927 5672 -3750 -2270 -5514 282
270 282 14050 299 -20688 596 24787 -2539 -25887 4951 23943 -7332 -19403 8930
282 8930 12850 -9451 -5398 8501 -1974 -6194 8226 2775 -12474 1368 14260 -5541 -13302
295 -13302 9259 9968 -11758 -4677 12896 -1548 -12353 7878 10406 -13254 -7320 16914 3684
308 3684 -18286 -215 17061 -2611 -13513 4122 7917 -4164 -1145 2600 -6054 260 12800
321 12800 -3928 -18301 7785 21990 -10982 -23380 13006 22623 -13063 -19729 11095 15363 -6874
334 -6874 -10013 899 4450 6285 648 -13964 -4928 20991 7892 -26624 -9662 29842 10215
347 10215 -30314 -10043 27682 9475 -22229 -8992 14464 8932 -5133 -9392 -4585 10520 13949
360 13949 -11849 -21740 13221 27466 -13921 -30398 13712 30586 -12083 -28134 8856 23470
372 23470 -4149 -17370 -1896 10440 8594 -3663 -15489 -2489 21669 7372 -26447 -10758
384 -10758 29159 12577 -29332 -12981 26897 12386 -21866 -11076 14860 9718 -6416 -8494
396 -8494 -2413 7832 10842 -7686 -17893 7991 22888 -8511 -25412 8810 25198 -8622 -22594
409 -22594 7542 17945 -5476 -12066 2388 5693 1546 321 -5842 -5259 10150 8763 -13794 -10402
423 -10402 16382 10333 -17379 -8673 16727 5987 -14353 -2768 10525 -359 -5745 2845 526
436 526 -4332 4387 4521 -8495 -3541 11183 1442 -12173 1267 11357 -4208 -8882 6896 5188
450 5188 -8801 -780 9761 -3513 -9429 7190 8086 -9513 -5793 10199 2994 -9030 -92 6104
464 6104 -2500 -1862 4329 -3224 -5375 8347 5395 -12930 -4711 16200 3453 -17779 -2104 17377
478 17377 1026 -14952 -492 10871 850 -5454 -2008 -457 4013 6445 -6388 -11714 8906
491 8906 15819 -10950 -18300 12142 19008 -12065 -18062 10439 15600 -7349 -12187 2806 8152 2636
505 2636 -4144 -8587 470 14280 2490 -19082 -4580 22415 5885 -23696 -6422 22880 6623
518 6623 -19778 -6610 14846 6794 -8497 -7256 1448 8107 5593 -9275 -11919 10435 16860 -11389
532 -11389 -20068 11686 21229 -11133 -20444 9418 17957 -6546 -14204 2638 9766 2051 -5155 -6992
546 -6992 984 11835 2481 -15837 -4873 18670 6217 -19821 -6546 19193 6080 -16777 -5204
559 -5204 12781 4155 -7693 -3384 2008 3036 3572 -3209 -8487 3869 12196 -4855 -14318 5921
573 5921 14732 -6677 -13410 6956 10779 -6433 -7093 5124 3110 -3027 723 376 -3861 2526 5849
588 5849 -5274 -6622 7471 6042 -8898 -4403 9178 1888 -8454 894 6665 -3638 -4207 5800
602 5800 1365 -7077 1445 7334 -3715 -6425 5221 4625 -5568 -2026 4861 -834 -3058 3716 473
617 473 -6134 2542 7851 -5504 -8711 7893 8580 -9367 -7687 9502 6129 -8300 -4311 5679
631 5679 2458 -2059 -916 -2307 -229 6782 819 -10863 -907 14076 725 -15914 -381 16244
645 16244 243 -14906 -448 12141 1216 -8220 -2522 3617 4328 1158 -6484 -5647 8597 9355
659 9355 -10432 -12042 11557 13438 -11733 -13590 10735 12629 -8495 -10740 5184 8383 -977 -5777
673 -5777 -3677 3361 8378 -1258 -12565 -328 15756 1391 -17624 -2060 17857 2431 -16488
686 -16488 -2774 13569 3191 -9508 -3915 4685 4908 320 -6152 -4990 7488 8912 -8642 -11626
700 -11626 9445 13062 -9528 -13037 8871 11865 -7280 -9661 4907 6941 -1845 -4017 -1593 1335
714 1335 5030 825 -8180 -2330 10580 2963 -12055 -2967 12274 2359 -11332 -1484 9235 535
728 535 -6303 191 2909 -506 662 344 -3819 370 6275 -1368 -7700 2617 8043 -3767 -7205
743 -7205 4656 5427 -5063 -3012 4859 291 -4115 2230 2791 -4288 -1204 5455 -516 -5706 1997
758 1997 4905 -3118 -3267 3658 987 -3560 1630 2833 -4120 -1572 6243 144 -7643 1323 8188
773 8188 -2486 -7783 3104 6506 -3044 -4545 2206 2169 -656 355 -1479 -2740 3806 4629 -6118
788 -6118 -5966 8002 6651 -9136 -6665 9304 6175 -8345 -5297 6343 4278 -3416 -3296 -105
802 -105 2514 3845 -1961 -7378 1652 10319 -1547 -12350 1440 13148 -1260 -12787 788 11177
816 11177 18 -8637 -1221 5410 2805 -1911 -4602 -1499 6474 4554 -8093 -6877 9302 8402
830 8402 -9790 -9005 9473 8822 -8201 -7950 6057 6630 -3190 -5118 -171 3603 3656 -2318 -6981 1297
846 1297 9692 -626 -11572 217 12335 22 -11939 -201 10442 518 -8006 -996 4987
859 4987 1811 -1669 -2816 -1486 3970 4208 -5092 -6190 6058 7288 -6619 -7448 6656 6750 -6095
874 -6095 -5443 4848 3707 -3144 -1924 1019 236 1267 1037 -3419 -1782 5182 1992 -6367 -1626 6856
890 6856 908 -6522 93 5489 -1041 -3828 1888 1845 -2344 300 2392 -2246 -1985 3685 1194 -4472
906 -4472 -169 4477 -948 -3737 1954 2334 -2715 -476 3099 -1557 -3055 3432 2613 -4861 -1904 5676
922 5676 1090 -5705 -276 4945 -324 -3499 605 1501 -559 777 92 -3065 608 5014 -1474 -6501
938 -6501 2263 7308 -2840 -7397 3014 6768 -2664 -5535 1779 3901 -341 -2026 -1454 156 3528
953 3528 1551 -5446 -2843 7126 3774 -8206 -4212 8574 4289 -8050 -4081 6666 3708 -4568
967 -4568 -3340 1891 3041 1009 -2863 -3884 2785 6385 -2828 -8270 2859 9358 -2716 -9508 2378
982 2378 8849 -1653 -7380 633 5421 763 -3150 -2350 865 4050 1254 -5600 -2953 6877 4129
997 4129 -7676 -4780 7812 4881 -7268 -4589 6004 3976 -4164 -3263 1868 2577 636 -1979 -3090
1012 -3090 1573 5191 -1343 -6726 1322 7582 -1350 -7625 1374 6903 -1237 -5534 941 3723 -375
1027 -375 -1686 -421 -334 1371 2049 -2372 -3267 3243 3888 -3923 -3918 4255 3401 -4162 -2464 3651 1307
1044 1307 -2724 -85 1509 -988 -107 1765 -1222 -2109 2377 2039 -3156 -1554 3458 770 -3278 165
1060 165 2568 -1171 -1528 1987 195 -2593 1122 2845 -2299 -2731 3119 2327 -3431 -1665 3225 908
1076 908 -2410 -90 1192 -560 418 1057 -2070 -1274 3603 1274 -4766 -1080 5462 808 -5570 -562
1092 -562 4994 385 -3946 -445 2367 678 -552 -1186 -1358 1796 3090 -2467 -4457 3056 5420 -3427
1108 -3427 -5823 3488 5744 -3096 -5118 2305 4201 -1057 -3022 -484 1735 2217 -527 -3914 -543
1123 -543 5343 1325 -6449 -1885 6948 2170 -6846 -2287 6032 2268 -4672 -2256 2865 2301 -761
1138 -761 -2383 -1380 2574 3322 -2762 -4843 2935 5887 -2981 -6296 2838 6125 -2428 -5400 1702
1153 1702 4284 -706 -2960 -547 1513 1880 -162 -3218 -951 4310 1742 -5124 -2201 5498 2333
1168 2333 -5371 -2189 4732 1885 -3657 -1498 2230 1146 -584 -884 -1068 757 2525 -806 -3638
1183 -3638 949 4244 -1177 -4390 1328 3985 -1459 -3194 1390 2058 -1118 -783 667 -450 -40 1508
1199 1508 -625 -2173 1315 2494 -1830 -2340 2188 1845 -2236 -1032 2011 111 -1515 829 811 -1657
1215 -1657 -29 2192 -758 -2474 1366 2360 -1760 -1989 1808 1328 -1517 -534 938 -307 -78 1110
1231 1110 -875 -1716 1837 2155 -2600 -2294 3141 2251 -3218 -1976 2936 1597 -2211 -1156 1132 747
1247 747 174 -447 -1586 206 2879 -148 -3955 134 4622 -177 -4865 153 4621 -38 -3969 -232
1263 -232 2931 678 -1617 -1251 227 1946 1148 -2608 -2303 3193 3183 -3567 -3727 3666 3921 -3418 -3782
1280 -3782 2797 3371 -1851 -2809 607 2093 786 -1392 -2198 753 3458 -213 -4418 -166 5034 447
1296 447 -5163 -628 4826 785 -4041 -955 2915 1169 -1527 -1457 68 1783 1294 -2154 -2478 2434
1312 2434 3286 -2638 -3720 2649 3753 -2464 -3434 2036 2868 -1328 -2072 483 1231 524 -394 -1493 -262
1329 -262 2387 776 -3045 -1031 3428 1088 -3458 -962 3141 719 -2528 -461 1625 172 -628
1344 -628 -13 -433 -77 1335 -7 -2065 157 2436 -397 -2496 643 2202 -829 -1624 942 850 -895
1361 -895 42 749 -854 -444 1549 98 -1954 268 2093 -584 -1921 767 1443 -808 -789 648 -32
1378 -32 -357 831 -93 -1563 537 2100 -969 -2402 1270 2443 -1386 -2229 1279 1808 -917 -1219 353
1395 353 568 397 94 -1190 -675 1969 1136 -2592 -1445 2998 1580 -3098 -1597 2855 1504 -2315
1411 -2315 -1372 1451 1224 -431 -1113 -708 1052 1795 -1028 -2731 1038 3413 -1005 -3768 926 3779
1427 3779 -734 -3477 376 2856 91 -2050 -717 1092 1377 -152 -2047 -747 2606 1448 -3044
1442 -3044 -1976 3220 2261 -3117 -2325 2733 2238 -2060 -1983 1196 1676 -168 -1332 -887 1019 1883 -739
1459 -739 -2693 540 3254 -382 -3495 238 3393 -115 -3030 -71 2318 284 -1506 -605 573
1474 573 932 318 -1307 -1097 1635 1655 -1890 -1998 2011 2073 -1939 -1895 1704 1572 -1281 -1095 717 613
1492 613 -45 -128 -611 -261 1222 510 -1693 -638 1942 597 -1999 -483 1782 245 -1395 -25 822
1509 822 -225 -198 360 -462 -444 1027 418 -1420 -311 1615 179 -1553 13 1285 -167 -801 275
1526 275 192 -302 464 250 -1095 -142 1586 0 -1895 129 1985 -233 -1843 240 1472 -146 -933
1543 -933 -59 294 347 380 -691 -1008 1017 1514 -1289 -1861 1444 2002 -1455 -1998 1250 1791 -894 -1482
1561 -1482 358 1059 271 -630 -982 186 1621 190 -2177 -502 2568 717 -2707 -863 2618 963
1577 963 -2249 -1008 1691 1068 -922 -1133 87 1200 767 -1260 -1528 1306 2127 -1326 -2544 1226
1593 1226 2678 -1053 -2611 741 2288 -351 -1841 -155 1244 714 -619 -1269 36 1769 508
1608 508 -2128 -908 2351 1181 -2344 -1298 2161 1322 -1740 -1226 1194 1091 -505 -933 -220 765 902
1625 902 -631 -1507 504 1909 -443 -2158 359 2150 -286 -1941 181 1564 -28 -1038 -153 459
1641 459 391 123 -614 -613 845 999 -1005 -1212 1114 1250 -1088 -1119 975 889 -739 -541 410 177 -33 165
1661 165 -349 -456 688 642 -942 -712 1066 675 -1041 -557 889 348 -602 -121 217 -106 199 320 -624
1680 -624 -461 969 540 -1220 -558 1281 516 -1211 -456 946 370 -562 -292 75 241 445 -209 -945
1698 -945 223 1373 -175 -1637 190 1763 -128 -1684 42 1461 114 -1071 -317 598 554 -67
1714 -67 -821 -467 1044 907 -1246 -1266 1314 1477 -1309 -1585 1142 1528 -850 -1390 443 1153 48 -865
1732 -865 -567 577 1107 -274 -1527 27 1890 215 -2053 -368 2051 517 -1861 -626 1516 740
1748 740 -1029 -860 442 946 166 -1023 -743 1067 1196 -1100 -1550 1036 1724 -920 -1744 721 1608
1765 1608 -442 -1338 90 1000 299 -597 -678 209 1039 156 -1318 -420 1500 618 -1535 -717 1436 741
1783 741 -1214 -711 877 630 -460 -527 -2 435 438 -344 -817 276 1111 -221 -1262 192 1273 -157
1801 -157 -1157 104 905 -32 -574 -60 190 165 178 -288 -507 397 736 -473 -873 503 880 -482 -769
1820 -769 401 559 -242 -287 67 16 160 286 -346 -506 528 677 -640 -756 667 745 -613 -657 449
1839 449 515 -221 -333 -92 117 377 51 -694 -237 922 365 -1083 -443 1123 497 -1054 -528 854 541
1858 541 -542 -520 169 504 247 -476 -634 468 982 -410 -1231 347 1378 -254 -1391 120 1252
1875 1252 38 -1040 -255 700 470 -359 -705 -34 895 369 -1053 -683 1134 893 -1132 -1020 1018 1065
1893 1065 -813 -1046 533 946 -176 -798 -220 635 600 -451 -954 280 1207 -92 -1387 -41 1421
1910 1421 172 -1352 -298 1138 412 -852 -512 484 611 -76 -676 -294 744 628 -765 -884 721
1927 721 1035 -666 -1075 529 990 -365 -865 136 652 99 -425 -365 163 573 47 -765 -223 883 358
1946 358 -906 -421 852 451 -718 -416 515 363 -247 -287 -23 210 292 -149 -522 73 694 -28 -779 -12
1966 -12 761 31 -681 -84 484 91 -281 -150 -12 157 251 -195 -475 209 624 -208 -703 197 716 -131 -597
1987 -597 64 467 68 -238 -179 28 323 222 -422 -401 509 555 -551 -655 530 684 -456 -659 299 564
2007 564 -105 -467 -134 311 344 -157 -585 11 776 126 -888 -243 930 341 -874 -416 743 484 -523
2026 -523 -509 258 513 33 -517 -348 494 614 -469 -820 403 961 -311 -1006 203 965 -47 -840 -124
2045 -124 652 297 -431 -476 181 639 60 -770 -270 838 443 -854 -575 797 647 -675 -666 476 632
2064 632 -238 -584 -5 515 287 -399 -519 296 726 -161 -837 79 905 51 -858 -125 751 235 -561 -294
2084 -294 359 377 -106 -424 -135 457 339 -457 -505 434 603 -396 -650 300 594 -196 -522 48 376 79 -226
2105 -226 -225 68 360 93 -443 -184 514 291 -500 -309 479 337 -357 -303 240 273 -51 -202 -107 123 257 -54
2127 -54 -402 -21 492 76 -534 -128 497 157 -417 -183 290 219 -111 -209 -80 213 249 -203 -402 197 522
2148 522 -154 -578 100 581 -28 -514 -53 414 160 -263 -241 106 339 75 -421 -218 466 351 -478 -451 453
2169 453 522 -387 -513 262 501 -103 -447 -68 360 252 -254 -415 141 552 -40 -641 -70 680 166 -669
2189 -669 -251 576 313 -444 -374 273 422 -60 -423 -124 426 321 -397 -460 378 584 -301 -628 229 637 -110
2210 -110 -574 5 491 152 -361 -267 216 392 -67 -481 -73 546 181 -558 -285 526 356 -453 -383 338 393
2231 393 -183 -367 37 335 147 -263 -274 219 433 -128 -477 79 523 9 -497 -64 442 131 -345 -185
2251 -185 205 241 -56 -255 -91 270 210 -263 -308 242 366 -216 -384 160 365 -81 -309 -10 226 103 -127
2272 -127 -181 29 262 60 -296 -138 348 220 -320 -245 281 274 -187 -256 107 223 21 -169 -135 130 248 -63
2294 -63 -330 7 382 62 -388 -105 377 160 -302 -208 196 220 -83 -244 -48 243 174 -235 -280 204 366 -166
2316 -166 -406 112 442 -46 -398 -24 355 135 -243 -191 159 287 -34 -323 -71 387 175 -381 -253 372
2336 372 322 -314 -343 235 351 -120 -347 -16 302 127 -250 -250 175 342 -112 -425 19 439 50 -443 -104
2357 -104 402 197 -312 -223 234 282 -86 -284 -14 308 155 -289 -232 265 324 -226 -357 179 368 -89 -362
2378 -362 11 308 74 -236 -151 156 230 -73 -282 -13 328 90 -335 -144 312 204 -261 -220 188 233 -91
2399 -91 -223 1 215 103 -159 -184 127 249 -67 -277 27 303 33 -282 -62 240 107 -178 -148 102 168
2420 168 -10 -173 -72 188 159 -164 -212 147 253 -115 -255 72 243 -1 -205 -72 160 114 -90 -173 29
2441 29 213 44 -230 -108 245 154 -206 -178 183 204 -111 -208 36 201 42 -175 -118 134 191 -94 -242 46
2463 46 265 4 -292 -71 271 107 -232 -156 160 171 -94 -205 6 214 78 -212 -152 201 216 -156 -249 132
2485 132 281 -61 -264 11 259 66 -197 -112 175 186 -81 -220 12 259 46 -271 -107 249 151 -228 -189
2506 -189 161 210 -100 -218 15 208 61 -185 -132 159 184 -120 -241 76 257 -12 -250 -25 246 91 -186
2527 -186 -122 150 159 -71 -174 25 201 60 -183 -107 167 154 -139 -174 122 203 -68 -205 14 171 45 -137
2549 -137 -99 104 149 -60 -180 0 196 41 -196 -73 174 96 -146 -129 92 150 -40 -149 -19 135 75 -113
2571 -113 -123 104 164 -49 -178 34 192 22 -165 -52 156 94 -111 -118 57 137 -6 -148 -41 143 95 -142
2593 -142 -142 115 159 -95 -169 36 159 1 -162 -48 123 103 -80 -122 56 170 7 -184 -30 185 83 -162
2615 -162 -98 140 148 -82 -149 47 158 12 -146 -75 135 120 -111 -151 90 177 -35 -188 17 179 28 -163 -67
2638 -67 135 107 -84 -147 48 149 18 -163 -44 164 106 -143 -117 121 146 -72 -154 41 164 12 -145 -56 131
2661 131 110 -81 -139 44 158 -13 -163 -16 174 60 -144 -86 119 103 -69 -131 22 129 12 -135 -83 113
2683 113 95 -89 -132 63 126 -41 -142 -2 139 33 -114 -58 86 99 -36 -98 34 134 28 -118 -41 125
2705 125 83 -91 -100 76 119 -34 -116 -1 107 37 -94 -76 68 100 -58 -132 8 128 17 -127 -52 112 62 -93
2729 -93 -86 56 104 -11 -101 -15 116 73 -89 -76 87 114 -55 -106 30 136 8 -117 -26 110 58 -75 -84 48 108
2754 108 -24 -124 -32 119 36 -125 -78 100 97 -73 -105 36 115 -6 -110 -25 101 72 -80 -76 64 113 -41 -117
2778 -117 15 131 22 -114 -37 102 77 -72 -69 48 103 0 -100 -19 107 56 -92 -69 83 92 -69 -107 35 105
2802 105 -4 -104 -25 81 47 -69 -78 39 92 -14 -102 -5 103 23 -93 -51 93 65 -54 -72 37 82 15 -86
2826 -86 -24 70 58 -63 -62 47 91 -27 -90 13 99 13 -84 -35 54 49 -50 -71 -1 75 1 -86 -28 66 45 -66 -66 40 69
2855 69 -19 -69 16 67 11 -57 -23 63 60 -21 -64 20 92 18 -76 -22 80 40 -56 -59 45 66 -24 -63 0 56 19 -61 -45 48
2885 48 73 -43 -83 32 88 -5 -83 -10 95 29 -61 -60 38 62 -22 -82 -8 83 29 -85 -45 76 55 -54 -60 48 73 -28
2913 -28 -78 0 67 16 -55 -43 38 66 -30 -80 8 83 -10 -87 -23 65 28 -62 -45 47 48 -19 -67 -6 62 30 -64 -40 48 71 -50
2944 -50 -62 34 69 -14 -58 22 64 16 -41 -28 39 48 -8 -55 18 71 5 -58 -17 54 23 -52 -41 37 33 -30 -52 -7 32 11 -43
2975 -43 -35 17 36 -23 -50 9 57 -3 -45 -10 59 16 -24 -13 30 32 0 -19 -3 40 27 -40 -30 33 35 -32 -57 14 28 -16 -46 -13
3007 -13 18 11 -28 -29 0 30 6 -55 -22 31 14 -48 -19 40 29 -28 -34 15 36 -7 -26 -9 38 41 -13 -37 20 59 -13 -57 1 51
3039 51 6 -40 -24 33 26 -22 -36 9 40 7 -42 -28 36 35 -46 -46 27 36 -44 -53 16 41 -12 -33 -3 27 18 -21 -28 16 49 4 -48 -5
3073 -5 59 16 -58 -16 59 28 -33 -22 19 40 -4 -30 -2 31 23 -38 -40 14 40 -25 -61 12 41 -16 -52 -13 18 -3 -39 -22 14 22
3105 22 -8 -25 0 43 21 -37 -7 47 26 -35 -15 31 38 -10 -18 7 22 8 -16 -14 9 25 -6 -36 -7 23 -5 -41 -1 25 -3 -32
3137 -32 -15 20 -8 -5 -10 -14 17 14 -25 -20 8 30 -6 -27 17 23 -10 -17 15 19 0 0 -15 -3 23 15 -20 -11 20 17 -15 -25 20 8 -17 -9 6
3174 6 10 -6 -12 1 2 17 4 -19 -9 26 -2 -32 -12 19 -1 -34 -6 25 5 -14 0 0 20 23 -14 -11 10 31 0 -18 15 28 -20 -28
3208 -28 14 20 -13 -21 -12 10 4 -9 -24 -4 15 -10 -36 -20 17 14 -41 -22 15 12 -31 -20 18 13 -10 -23 -2 21 13 -15 -11 15 38 -3 -37
3243 -37 12 38 -6 -32 4 43 1 -21 -4 12 13 -13 -26 -6 23 -1 -36 -30 22 3 -42 -26 20 28 -36 -22 13 25 -10 -14 -4 20
3275 20 21 -7 -20 5 34 5 -29 -2 42 2 -39 -15 23 -8 -19 -14 0 24 -3 -17 0 17 17 -12 -28 8 16 -21 -23 12 23 -19 -22
3308 -22 8 15 1 -9 -6 -1 16 5 -19 4 25 10 -18 -12 30 22 -20 -8 19 9 3 0 2 15 18 -9 -26 3 30 7 -22 -6 25 13 -29
3343 -29 -2 9 9 -15 -15 -9 0 -3 -22 -20 10 34 -16 -30 8 37 -5 -11 12 30 12 -17 0 23 23 14 -21 -5 29 5 -31 -15 36 24 -35
3378 -35 -26 9 22 -14 -30 0 25 -3 -29 -29 12 31 -17 -32 0 41 -5 -46 -6 37 14 -28 -14 19 16 -17 -32 5 35 11 -23 -16
3410 -16 44 34 -28 -28 30 47 -25 -42 17 35 4 -32 -26 17 16 -21 -35 8 42 -1 -44 -22 36 12 -41 -23 21 29 -14 -37 10 37
3442 37 -5 -28 -27 24 33 -19 -17 22 48 -6 -28 9 42 9 -30 -7 21 16 -7 -29 0 33 6 -32 -27 34 24 -29 -27 14 26 -28 -38
3475 -38 -4 20 1 -15 -17 18 36 2 -31 8 44 19 -32 -8 42 27 -28 -13 29 22 -7 -21 -6 33 20 -22 -35 21 35 -14 -37
3506 -37 2 41 0 -44 -15 26 11 -23 -30 10 18 -6 -29 -11 27 17 -40 -22 25 38 -20 -38 28 52 4 -27 -8 31 29 -18 -19 23
3538 23 47 -2 -46 -15 55 16 -43 -30 34 24 -32 -38 3 35 3 -38 -17 25 26 -39 -48 28 42 -21 -49 14 56 2 -45 -8 37 27
3570 27 -16 -25 9 45 4 -37 -14 56 18 -39 -33 31 51 -24 -47 14 48 -5 -36 -15 26 16 -30 -40 2 44 -10 -55 -9 51 18
3601 18 -49 -30 44 37 -16 -35 14 46 3 -36 -13 42 37 -27 -39 29 55 -3 -42 12 42 5 -36 -10 26 28 -24 -39 4 44 2 -32
3633 -32 -32 38 22 -47 -46 21 34 -14 -37 -3 31 13 -42 -11 20 28 -21 -36 11 53 6 -42 -7 48 37 -33 -27 34 46 -6 -37 3
3665 3 44 20 -32 -24 23 31 -29 -46 5 40 5 -52 -12 38 27 -41 -38 20 35 -12 -42 -5 45 6 -41 -30 31 32 -35 -33 13 56 2
3698 2 -49 -4 44 22 -25 -23 35 53 -9 -49 -3 58 12 -43 -21 46 28 -34 -47 13 42 -1 -43 -13 37 16 -40 -40 26 44 -18 -49
3730 -49 11 59 7 -47 -7 41 28 -28 -35 28 49 -6 -45 -1 46 25 -32 -32 40 40 -36 -53 20 47 3 -29 -14 34 28 -35 -46 18
3762 18 39 -5 -49 -10 38 18 -44 -23 41 41 -28 -43 16 56 16 -42 -19 49 37 -23 -32 27 57 -7 -41 2 48 23 -41 -23 43
3793 43 36 -16 -31 12 53 2 -48 -23 39 33 -36 -38 31 51 -19 -48 -4 43 15 -45 -33 35 44 -21 -36 17 59 0 -39 -18 51 52 -24
3826 -24 -24 32 54 -5 -35 13 54 19 -44 -32 23 32 -35 -45 12 46 -9 -51 -16 45 27 -41 -32 24 41 -17 -49 -5 56 5 -40 -23
3858 -23 32 46 -31 -39 28 53 9 -38 -9 49 25 -30 -33 36 53 -2 -37 3 49 16 -46 -41 47 26 -42 -42 24 40 -13 -37 -2 42
3890 42 21 -48 -32 38 37 -21 -58 3 52 19 -45 -16 46 42 -23 -36 8 40 -11 -52 -10 38 24 -39 -28 43 42 -18 -50 6 50 6
3922 6 -58 -29 44 29 -41 -46 13 41 -12 -62 -19 39 20 -46 -36 28 39 -21 -48 -2 47 11 -44 -14 54 44 -30 -37 29 53 8 -40
3954 -40 -4 43 13 -42 -19 33 38 -29 -41 19 39 1 -53 -12 40 27 -29 -32 16 32 -10 -46 -2 39 16 -47 -24 29 48 -18 -39
3985 -39 19 56 -1 -51 -9 53 28 -33 -17 34 52 0 -39 3 49 20 -37 -25 37 38 -28 -40 14 36 -3 -54 -15 37 19 -51 -33
4016 -33 25 39 -11 -53 1 43 19 -49 -24 36 34 -32 -35 21 54 12 -47 -10 52 17 -39 -30 32 44 -16 -42 3 58 4 -45 -25 40
4048 40 21 -29 -44 10 44 -9 -50 -12 33 16 -41 -33 26 35 -20 -44 8 42 6 -47 -21 37 22 -31 -30 27 41 -3 -43 3 50 23
4080 23 -32 -29 22 35 -21 -49 7 31 7 -43 -13 37 24 -41 -43 22 36 -21 -62 -17 36 9 -48 -38 28 35 -25 -44 15 46 6 -46
4112 -46 -18 39 29 -31 -36 21 40 0 -49 -1 46 12 -35 -34 20 34 -24 -46 15 38 -2 -58 -27 41 24 -36 -40 13 30 -22 -47 -10
4144 -10 35 0 -32 -19 26 26 -29 -39 20 40 -1 -33 -1 48 35 -24 -23 33 40 3 -34 0 45 15 -42 -15 34 33 -23 -44 7 34
4176 34 -10 -46 -13 26 12 -33 -44 25 33 -17 -38 12 35 11 -26 -20 28 31 -18 -24 5 41 1 -37 -7 43 26 -30 -25 30 39 -14 -31
4209 -31 8 47 -1 -33 -22 29 26 -24 -26 13 34 -5 -46 -9 29 18 -45 -27 19 31 -26 -44 -5 39 6 -31 -12 36 31 -29 -36 21
4241 21 40 -8 -27 -5 48 15 -35 -30 29 39 -20 -52 3 42 3 -46 -19 33 30 -30 -39 10 33 -13 -50 -7 36 11 -35 -35 12 31
4273 31 -22 -36 21 44 4 -34 -17 42 36 -16 -18 27 39 1 -31 4 43 11 -32 -17 26 36 -20 -39 9 35 -6 -38 -25 36 23
4304 23 -37 -30 17 35 -16 -34 0 39 16 -33 -22 29 30 -19 -38 7 40 1 -16 0 41 23 -21 -20 27 35 -11 -43 4 39 12 -34
4336 -34 -16 34 22 -16 -36 2 31 0 -39 -11 31 16 -29 -28 15 36 -18 -40 5 40 3 -31 -14 33 32 -21 -24 32 41 0 -33 -2
4368 -2 37 21 -20 -32 22 37 -20 -33 3 24 8 -26 -15 21 17 -23 -36 -2 28 -16 -39 -18 20 2 -39 -39 5 24 -21 -50 3 26
4400 26 8 -31 -4 38 33 -20 -25 26 31 -8 -28 2 43 25 -35 -17 22 14 -19 -20 4 33 -2 -33 -12 34 21 -25 -38 16 32 -17 -33
4433 -33 -7 20 2 -37 -24 20 22 -12 -37 10 36 7 -36 -8 28 27 -12 -17 19 29 -12 -30 10 34 3 -22 -10 38 26 -20 -33 13
4465 13 30 -5 -30 -9 29 12 -34 -25 9 24 -17 -32 9 22 0 -30 -13 24 31 -11 -34 12 32 5 -29 -8 21 27 -9 -21 23 32
4497 32 -5 -17 5 39 -2 -38 -20 17 19 -38 -31 2 16 -5 -36 -12 24 7 -27 -35 14 21 -19 -32 3 28 11 -35 -18 18 16 -19 -15
4530 -15 13 20 -5 -23 0 30 23 -19 -18 20 30 -2 -20 11 21 -2 -26 -21 22 7 -22 -31 5 18 -14 -39 -16 9 3 -32 -24 12 21 -18
4564 -18 -31 2 19 0 -27 -1 26 21 -17 -24 15 33 -5 -24 0 36 17 -21 -13 22 16 -17 -33 11 24 -6 -30 -17 18 11 -25 -26 10
4597 10 19 -12 -31 -12 26 -1 -30 -16 12 18 -11 -30 0 32 -3 -19 -4 29 25 -26 -10 19 25 4 -22 0 6 4 -30 -14 11 14 -13 -33
4631 -33 -3 15 -10 -35 -12 19 -1 -31 -15 11 18 -9 -28 0 19 4 -22 -12 16 12 -11 -31 6 27 -1 -27 4 23 10 -6 -17
4662 -17 13 22 -12 -26 6 29 12 -23 -13 8 13 -16 -30 -1 17 -13 -31 -11 21 12 -26 -18 17 12 -10 -24 -4 32 0 -26 -17 20 14 -13
4696 -13 -15 1 23 2 -18 2 24 10 -17 -16 18 25 -12 -30 -3 19 0 -25 -17 18 7 -14 -30 -6 14 -14 -35 -18 23 2 -29 -17
4728 -17 23 19 -27 -29 3 14 1 -26 5 25 23 -14 -3 19 34 0 -19 12 16 6 -23 -8 10 18 -6 -19 6 15 6 -25 -10 20 5 -23
4762 -23 -34 -2 14 -14 -25 -7 12 0 -25 -4 14 14 -4 -12 8 17 -4 -20 -10 28 2 -12 -9 22 22 -3 -16 -8 8 8 -15 -1 18 12
4796 12 -13 -22 3 6 -6 -27 -16 7 11 -13 -24 16 8 -14 -27 1 27 4 -25 -16 15 14 -5 -15 14 22 1 -16 -4 22 3 -10 -4 12
4830 12 17 -5 -1 13 15 3 -24 -4 19 11 -9 -20 2 19 -5 -16 -15 14 6 -17 -16 10 5 -14 -28 -4 18 3 -9 -7 17 19 1 -14 10
4865 10 29 -4 -6 2 24 22 -6 -8 18 22 -2 -12 13 20 5 -20 -9 8 14 -16 -10 14 12 -10 -20 -2 17 -7 -16 -18 11 10 -12 -12 4 19 -3
4902 -3 -17 -6 14 23 -5 -12 16 17 -6 -9 4 11 1 -8 1 12 11 -15 -5 2 6 -1 -18 -15 4 1 -13 -19 2 0 -15 -27 -13 -8 6 -18 -14 -1 5 1
4942 1 -19 1 17 -8 -9 -2 7 10 -10 -6 9 12 0 -8 2 20 6 -2 -10 10 15 -13 -3 -2 4 -16 -22 -7 -2 -8 -19 -21 11 -1 -13 -15 -8 4 14 -19
4982 -19 -12 15 -2 -11 -7 7 14 0 -4 12 15 1 -4 -13 14 24 -1 -26 6 24 -4 -17 -10 15 7 -21 -11 -3 14 -1 -17 0 12 -1 -13 -18
5018 -18 5 18 -7 -14 4 21 7 -21 5 20 12 1 5 -1 20 7 0 1 16 8 -13 3 22 10 4 -9 6 12 -4 -9 -2 -4 3 -11 -13 9 -3
5055 -3 -19 -15 -2 1 3 -23 -7 18 -8 -11 -13 -1 14 -9 -6 -4 16 2 -9 -9 13 13 1 -15 2 17 12 -5 1 17 11 -10 -3 -2 8 -3 -9 -2 11
5094 11 -5 -9 -21 2 7 -5 -13 -13 6 1 -16 -2 10 1 1 -6 2 7 12 -17 8 9 5 4 2 18 15 7 1 0 25 10 4 -13 11 15 -5 -5 -4 17 -2 -8
5136 -8 -2 7 -2 -15 -11 7 -1 -8 -15 -6 18 4 -4 -5 10 10 -7 -5 9 15 10 3 3 19 22 8 0 6 11 2 3 7 17 7 -7 -6 23 15 -8 -1 -1 -1 -10 -4 -1 8 0
5183 0 -10 -4 2 8 1 -5 11 15 4 -2 4 20 15 -6 5 16 16 19 0 -1 16 17 -4 2 20 19 -11 8 11 9 2 -17 3 -1 -1 -3 -8 4 -1 -3 -10 0 5 2
5227 2 -13 -3 20 4 -8 1 15 7 0 10 2 16 11 -4 -1 2 17 1 8 9 16 8 1 -5 18 15 4 -4 0 5 -4 -3 -5 3 -5 -11 -9 -3 -1 -1 -9 11 8 -1 -7 3
5273 3 16 9 7 -8 3 21 1 -4 1 20 12 -4 13 8 15 3 4 2 7 16 3 4 9 7 2 2 7 12 7 3 -4 5 2 -2 -10 -5 6 -3 0 3 9 5 1 -3 14 22 1 0
5321 0 2 20 10 6 10 9 4 -2 3 18 12 1 10 12 11 9 -4 -3 8 5 -7 3 4 6 -4 -13 2 3 2 -15 -11 6 -1 -1 -6 11 5 4 -7 -5 10 19 2 3 16
5366 16 13 8 10 17 17 9 -2 6 14 12 -8 15 11 4 18 -6 5 9 3 3 1 8 3 1 -1 8 15 2 -9 -3 2 2 -6 12 -1 2 -1 -1 7 12 10 5 2 20 6 -2 14
5413 14 20 16 12 11 -3 11 8 -3 10 10 4 2 -12 -13 -6 -8 -8 1 -3 3 -3 -1 5 14 8 2 -10 -3 15 1 -7 13 13 1 -4 8 9 6 -3 8 4 6 2 6 4 -5 5
5460 5 2 -5 3 4 -1 -3 -17 2 7 -3 0 13 -5 -11 -6 5 -3 4 1 -5 3 -1 0 -7 16 1 -6 -1 21 16 0 5 8 11 16 10 7 19 11 -8 1 2 4 8 -1 -7 0 -13
5508 -13 -4 0 5 -6 0 -8 -3 -8 1 2 -5 6 -5 -2 -9 -8 4 5 -10 6 8 5 -4 6 12 3 10 6 10 6 8 0 0 11 2 7 4 1 3 -6 14 9 4 2 -3 -10 -1 1 -3 -14
5558 -14 0 -3 0 -3 -3 12 4 10 12 -9 14 -2 -3 2 -4 9 11 4 6 8 8 5 10 13 12 -7 -1 -3 4 -2 2 -3 6 13 -13 -9 0 -1 -6 1 -2 9 0 -12 -1 5 -6 2
5606 2 4 0 2 10 -6 2 12 7 5 -4 10 13 6 -2 2 13 3 -2 5 13 6 4 6 14 5 -4 2 11 5 -11 5 -4 2 -4 4 -6 -5 -9 -8 -5 -2 7 -3 5 10 4 1 8 12 7 15 -2
5658 -2 -1 1 8 10 10 13 19 12 2 3 9 6 6 0 3 9 3 2 -1 14 11 0 -7 4 -5 0 -2 0 8 3 -12 -11 6 3 3 7 3 3 -5 2 -8 4 10 9 14 2 8 10 8 8 8 10
5710 10 4 6 9 7 5 -3 4 2 6 -2 3 -4 2 7 -8 2 12 2 -5 9 -3 2 12 6 5 13 9 2 10 6 9 11 5 14 6 7 4 3 14 4 14 7 8 11 8 3 5 15 7
5759 7 -1 -6 5 -5 -3 -14 1 6 2 -11 -3 10 8 -3 1 8 13 7 9 3 13 -2 15 8 14 14 -2 5 14 3 5 2 0 12 5 -4 7 4 4 4 5 -1 2 3 5 6 -5
5806 -5 10 -4 -4 -8 11 0 1 4 0 -4 9 8 8 2 -7 5 5 21 14 7 10 6 -1 14 14 10 4 -5 -2 11 4 5 5 0 8 9 -3 7 4 1 1 2 -4 -2 2 4 -6 0 1
5855 1 -7 8 3 6 -2 12 1 8 10 12 9 1 14 13 14 8 9 13 11 -6 2 5 6 4 2 21 3 4 -1 -8 1 5 0 -7 -4 2 -4 -5 2 7 3 7 6 13 3 -1 1 4 7 10 7 0 8
5908 8 6 8 11 2 2 4 5 6 -2 6 -4 7 8 -4 9 4 9 1 -5 4 4 -7 -19 -3 -5 -2 -7 1 4 11 5 7 1 5 -2 8 13 2 12 -1 10 16 13 7 15 17 9 3 8
5957 8 5 12 4 7 3 -3 12 -1 2 -1 -1 3 7 -3 11 2 -9 -4 7 -2 2 4 5 12 -8 -4 3 6 11 8 6 12 8 11 4 18 16 11 9 5 -3 -1 17 8 10 7 7 -2 8 -5
6007 -5 -7 10 14 2 -9 -4 -2 -1 -4 5 -7 5 -12 -7 -8 -3 -1 -5 3 -5 5 2 6 10 17 8 2 11 10 4 1 5 18 8 8 1 9 9 -4 0 7 2 -7 3 -1 -6 -13 0 5
6056 5 -4 1 1 -2 4 6 -1 -2 8 -2 -1 4 7 2 2 10 9 10 10 11 9 -2 17 13 7 8 2 6 12 12 10 8 9 -2 10 4 1 3 -3 2 2 -11 2 -4 -4 -5 2 2 2 3 -7 -6
6108 -6 8 0 4 10 10 6 5 11 -2 3 8 10 14 8 10 4 13 13 6 10 11 0 3 4 5 8 -6 -2 -1 2 -3 -4 -2 -7 -3 -9 -1 -2 -2 1 -1 5 -1 -1 2 6 10 8 -4 3 12 22 9 7
6162 7 13 2 -1 -5 0 14 7 -5 5 4 2 -2 -6 -2 -2 7 2 -1 -5 -3 5 -2 4 8 4 6 0 2 4 3 5 7 1 -1 3 2 8 7 9 9 18 10 8 -2 4 0 -3 -1 3 7 0 -5 -4 0 9 4
6218 4 1 0 -19 -3 1 -13 -12 -5 -4 -2 -4 -4 0 3 1 6 6 4 1 -4 11 10 6 5 2 7 7 5 11 18 16 7 15 8 4 -7 3 15 -1 0 -3 13 4 0 -2 -5 1 12 1 -7
6268 -7 -3 -5 5 5 3 3 -2 2 7 13 -4 -6 9 0 7 12 12 17 8 13 6 9 -2 6 2 1 6 13 5 3 5 1 2 1 1 3 1 -2 -1 -2 4 0 -7 0 8 -1 0 0 6 16 5 8 4 7 14
6323 14 -2 4 13 7 11 10 6 14 -1 -3 11 5 5 -3 2 3 9 10 -3 5 1 -2 -4 2 6 -1 -4 2 -3 -4 -3 8 3 -3 0 5 -2 5 8 14 15 6 3 11 0 12 6 7 6 12 8 2 1
6376 1 6 6 1 -4 -5 -5 -6 -2 6 -1 3 -2 0 -2 -1 0 -2 0 -3 6 7 1 2 3 3 16 11 1 20 10 9 13 7 12 6 5 3 4 10 2 10 2 7 6 2 1 14 14 -2 0 0 -3 3 6 9
6431 9 4 -2 6 5 1 5 2 0 10 -4 4 -3 2 2 12 9 6 5 2 11 4 4 6 1 -2 1 10 4 12 6 -5 4 0 -3 6 5 5 -9 2 7 7 5 0 12 -2 5 -4 -1 8 3 12 -11
6483 -11 10 3 -1 -7 13 14 0 2 7 13 -8 17 8 1 5 9 -1 -4 5 8 3 7 -1 7 -5 0 -2 -6 -3 -2 -2 5 2 5 -12 -5 4 0 3 6 6 -1 7 2 -5 10 17 11 10 9 2
6534 2 8 9 5 10 8 4 15 10 6 14 9 4 4 11 -3 0 2 -1 2 2 2 -3 -1 -6 2 3 6 0 4 7 4 2 5 1 11 4 19 12 14 11 0 1 15 14 4 11 13 12 6 2 7 14 5 4
6588 4 8 6 1 2 2 -3 -5 4 -8 -1 -3 2 -2 -11 6 5 2 -4 -4 -2 -14 -1 9 7 -2 1 3 15 12 5 14 19 17 17 9 12 22 7 6 0 5 0 4 4 3 6 7 1 2 0 -1 6 3
6641 3 0 5 2 -4 4 9 12 7 4 7 5 0 9 6 3 3 10 15 16 11 11 15 8 12 11 3 16 4 0 5 6 -1 5 12 -1 9 -2 7 -7 -5 -13 -1 -3 -2 -9 1 -1 4 4 10 17 3
6693 3 8 1 5 15 12 9 10 8 10 3 8 15 9 12 12 7 2 1 -2 8 -5 -1 -6 3 2 7 10 -3 6 0 -1 -1 -5 -4 -3 -9 2 4 8 -10 7 -4 9 9 9 9 10 7 4 9 12 -3
6745 -3 6 3 12 12 7 7 1 -5 -2 2 3 8 2 7 4 -5 9 2 10 6 -15 1 -6 5 -9 -3 2 10 7 4 1 5 4 12 18 17 16 16 9 2 12 5 14 10 11 1 16 18 13 13 -1 2
6797 2 2 6 1 -1 -6 3 -8 0 2 -6 -4 3 -1 -1 8 3 9 4 -1 15 9 9 4 3 4 5 12 4 -2 -2 11 10 10 13 -5 10 11 7 10 1 10 -3 0 -6 3 11 -9 -3 -6 -5 2 -1 6 -1
6851 -1 0 2 8 7 -1 4 -5 13 6 0 12 16 7 17 13 23 3 18 18 12 8 4 18 11 9 14 8 -3 13 11 7 0 4 11 -9 4 2 4 -5 -6 3 7 9 1 0 0 0 7 8 5
6901 5 12 -12 1 11 6 3 -3 -1 3 11 6 12 8 8 5 12 6 1 5 -4 16 5 -1 -5 6 6 7 -8 -2 4 -4 -2 -1 -3 6 -3 -2 0 -2 0 7 -2 -8 6 2 -1 5 5 6 0 7 12 14
6954 14 16 15 4 10 5 16 10 5 16 12 -2 6 13 2 3 -1 3 -3 5 -3 -3 2 -1 6 2 3 5 -3 7 1 -5 1 11 12 2 11 -1 14 19 2 20 14 14 20 13 11 4 5
7002 5 6 4 3 19 2 3 1 7 4 5 7 0 7 -7 3 -3 0 5 11 5 4 5 16 11 3 14 17 20 7 8 15 14 11 12 9 19 12 10 6 5 11 4 13 3 12 11 -6 0 -3 6 5
7053 5 15 6 -8 -9 1 6 0 1 -10 -10 -6 2 3 8 9 14 16 6 4 12 7 13 8 11 9 13 4 12 13 7 5 19 4 6 1 -5 8 9 1 4 1 -6 11 3 3 5 5 9 1 -5 1 -2
7105 -2 1 4 1 7 -3 10 6 8 6 2 19 6 15 8 12 10 16 13 6 13 14 17 3 2 9 4 12 5 -6 -7 8 -8 -2 3 6 -2 1 -8 11 8 -4 1 -4 6 4 -1 0 5 13 6
7155 6 14 14 -1 5 9 5 2 8 8 20 12 4 9 6 1 9 4 -3 9 -1 -8 -2 -7 8 3 -2 3 1 7 -6 -1 -9 -6 0 -9 7 9 3 3 8 6 14 16 1 5 10 -2 7 11 12 8 1
7207 1 13 7 8 7 10 12 10 2 -4 10 1 -6 1 -8 7 1 -2 -5 -2 -6 2 -8 2 2 -4 0 3 15 2 2 2 3 12 8 7 11 2 4 7 4 9 16 8 11 10 2 8 3 8 -1 -6 -5 -2 2
7261 2 -2 -2 5 -1 -7 9 2 3 9 2 7 -7 -1 0 -1 -5 -6 7 6 11 9 6 12 15 6 18 1 14 6 12 9 4 11 8 7 8 4 2 9 10 1 -1 5 -8 -1 3 -8 -5 0 -7 9 1
7313 1 -1 5 2 8 3 6 14 8 -2 4 8 9 6 1 10 15 7 1 2 7 19 9 11 5 -3 6 -3 3 10 11 -10 4 -3 -5 -6 2 -13 -12 -2 -1 5 10 -6 4 3 0 6 7 4 -13 6
7364 6 4 1 0 10 -2 6 5 2 15 7 0 7 11 1 7 4 10 13 8 6 1 8 1 -4 12 -2 2 -1 1 6 -6 -8 6 2 2 4 3 1 1 -3 9 3 1 6 8 5 6 17 -2 16
7414 16 4 7 8 16 0 -1 8 8 8 9 -3 -6 1 2 -5 -4 5 3 -1 -6 6 -4 1 -2 8 11 13 4 3 4 10 20 5 13 -4 8 6 3 3 10 8 13 2 7 13 5 1 4 1
7463 1 1 8 4 7 4 -3 2 6 2 -6 3 -8 -2 -2 1 -20 -2 -10 -2 -7 1 4 4 5 10 -4 5 11 6 8 12 9 4 12 3 16 4 -4 7 -4 6 -3 -3 5 -7 3 -2 0 2 0
7513 0 -2 -5 16 -2 -7 2 0 -2 -5 1 1 -2 -2 3 7 4 10 9 -5 8 12 17 8 7 12 9 6 4 13 2 7 9 7 3 4 -6 1 -2 4 -3 1 5 -9 7 0 -2 7 -2 -3 4 2 -3 4
7566 4 11 6 -2 -1 2 2 0 8 7 9 6 9 9 9 14 3 12 18 15 0 8 4 2 2 3 11 -12 6 -4 -5 -5 -3 2 -6 4 5 -3 3 1 14 12 12 3 12 4 10 13 13 19 18 18 7 14
7619 14 11 15 9 3 2 5 13 0 9 0 13 13 7 9 2 6 15 -1 0 6 -4 2 11 4 3 1 -2 1 6 4 0 5 -1 3 -2 11 8 10 6 11 12 11 9 8 10 4 3 5 -6 6 9 12 -2
7672 -2 3 3 8 0 10 0 -4 -2 -5 -6 -8 -1 -3 -1 0 1 -5 7 11 -2 -5 -6 1 11 -5 0 1 18 12 9 10 10 11 4 9 12 4 7 4 10 12 4 10 2 3 2 3 4 1 4 4 -3 -9 -5
7726 -5 6 -1 -7 7 -4 1 0 4 9 -2 5 1 9 -1 3 9 9 3 7 8 11 17 8 4 5 6 5 5 8 9 -2 -2 16 -2 -3 2 -1 9 -4 -9 -2 -4 5 3 -10 2 5 3 -1
7775 -1 3 9 7 0 -1 6 -8 7 4 5 -3 12 7 11 10 7 7 1 -2 9 13 11 8 1 -6 -3 6 1 -1 3 2 -8 7 0 -4 -5 -2 -11 4 5 14 10 2 14 13 2 -2 -2 4 6 3 9
7827 9 8 12 4 3 3 2 5 6 -4 14 9 6 13 15 7 6 -3 0 3 9 -2 7 -3 -1 -6 4 3 -1 -3 -7 3 4 7 5 7 12 -2 7 9 15 10 12 7 2 15 11 9 10 5 -5 -9 2
7879 2 2 5 -2 5 1 -3 6 5 -2 -4 -8 0 -1 0 -3 4 -4 4 -8 3 -9 2 0 3 3 4 1 8 10 4 1 7 3 8 10 6 1 3 10 0 1 -4 -4 8 -8 6 -7 -5 9 0 4
7930 4 -5 -1 -6 -8 -2 -5 5 -3 -2 5 -6 3 7 -2 -3 0 9 10 14 2 6 16 7 -2 3 6 -1 9 5 22 6 -9 2 -5 6 13 3 -2 3 0 -1 -2 -10 -2 -2 -9 3 3 -13
7979 -13 -7 -5 7 9 -4 3 9 -11 6 5 13 2 -3 2 7 7 13 10 16 2 8 4 5 11 12 -3 -10 6 -1 -1 0 -2 3 -11 -1 -3 -9 9 -5 9 -7 4 2 7 12
8024 12 6 5 2 8 -2 -2 5 2 -4 -3 1 7 -1 18 9 8 8 4 3 4 3 6 9 -3 8 5 -2 8 -2 -5 0 7 3 4 10 -4 -10 3 7 0 -1 4 -4 3 4 11 12 8 -4 1 10
8075 10 7 9 1 12 15 5 9 5 -4 13 4 -1 4 7 6 2 0 4 4 -5 10 -7 -2 -9 -8 -9 -6 -11 5 6 2 -2 4 1 8 9 8 2 2 1 -3 11 12 7 6 3 13 15 7 4 2 5
8127 5 12 12 1 3 10 0 4 7 0 6 4 0 5 1 0 -2 -6 -8 -1 -10 3 4 6 6 4 9 0 7 12 8 11 12 3 17 9 8 11 10 3 0 8 3 11 -1 -11 -3 2 9 8 11 -2 2 3 -2
8181 -2 -6 -2 -3 -9 5 9 5 9 4 5
8191E
$$ Imaginary data points
##PAGE= N=2
##DATA TABLE= (X++(I..I)), XYDATA
0 0 0 0 0 0 0 0 0 0 0 0 0 0 0 0 0 0 8 -8 8 -8 8 -16 16 -16 17 -24 24 -32 33 -40 48 -56 62 -70 80 -88 97 -112
38 -112 121 -137 153 -169 187 -209 232 -255 281 -310 342 -376 415 -456 503 -556 616 -680 754
57 754 -841 940 -1057 1201 -1370 1588 -1872 2256 -2814 3689 -5296 9143 -37603 -744 91516
72 91516 -8611 -71343 -3383 58236 7433 -33576 -20325 13500 29626 9853 -42692 -26421
84 -26421 51215 41128 -58842 -47660 60254 50486 -58175 -46693 49647 40735 -37375 -31749
96 -31749 20275 22991 -1785 -14402 -17692 7946 34661 -3554 -48547 1799 56928 -1946 -59881
109 -59881 3409 56656 -4859 -48082 5713 35233 -4883 -19767 2474 3970 1986 10403 -7707
122 -7707 -21578 14353 28518 -20635 -30683 25583 28110 -28328 -21759 28127 12563 -25172 -2536
135 -2536 19385 -6968 -11803 14200 3121 -18369 5316 18843 -12347 -15625 17090 9473 -18652
148 -18652 -1080 17224 -8004 -12808 16739 6524 -23592 843 27874 -7951 -28984 13510
160 13510 26866 -16548 -22003 16199 14934 -12474 -6892 5457 -1297 3735 8467 -14120 -14038 24190
174 24190 17475 -32472 -18718 37784 18227 -38971 -16301 35923 13904 -28537 -11528 17768
186 17768 9936 -4634 -9398 -9298 10022 22556 -11530 -33787 13221 41648 -14605 -45606 14678
199 14678 45201 -13110 -40941 9278 33364 -3243 -23531 -4697 12705 13963 -1931 -23466
211 -23466 -7618 32274 15361 -38990 -20628 42804 23508 -42875 -24165 38983 23080 -31287
223 -31287 -20967 20312 18330 -7302 -15960 -6642 14036 19864 -12901 -31178 12252 39270 -11887
236 -11887 -43441 11296 43480 -9875 -39391 7410 32133 -3434 -22462 -1739 11899 8036
248 8036 -1471 -14704 -7567 21108 14416 -26400 -18664 29708 20067 -30652 -19085 28665 16067
261 16067 -24095 -12045 17061 7656 -8426 -3809 -935 1103 9974 236 -17614 36 23133
274 23133 -1429 -25682 3751 25299 -6174 -21944 8264 16311 -9363 -9191 9134 1615 -7527
287 -7527 5270 4567 -10664 -770 13671 -3523 -14138 7488 11889 -10684 -7497 12537 1651
300 1651 -12799 4795 11565 -10712 -8926 15384 5572 -17874 -1868 18011 -1313 -15567 3552
313 3552 10909 -4347 -4644 3557 -2471 -1327 9508 -2053 -15768 5859 20379 -9523 -22975
326 -22975 12178 23267 -13292 -21394 12368 17730 -9218 -12726 4112 7235 2629 -1782 -10118
339 -10118 -2900 17634 6580 -24048 -8927 28553 10044 -30458 -10218 29354 9758 -25321
351 -25321 -9232 18552 8862 -9956 -9108 262 9899 9388 -11174 -18085 12585 24933 -13645 -29253
365 -29253 14002 30880 -13039 -29627 10691 26053 -6674 -20546 1262 13949 5177 -7013
377 -7013 -12105 441 18699 5076 -24315 -9299 28069 11828 -29608 -12970 28424 12773
389 12773 -24690 -11790 18597 10405 -10747 -9043 2024 8118 6767 -7670 -14545 7839 20709
402 20709 -8233 -24453 8717 25634 -8817 -24184 8194 20467 -6666 -15127 4035 8862
414 8862 -536 -2663 -3684 -2973 8021 7211 -12086 -9817 15249 10583 -17071 -9649 17298 7460
428 7460 -15705 -4382 12617 1170 -8199 1729 3162 -3738 2015 4597 -6593 -4174 10035 2597
442 2597 -11917 -161 11957 -2765 -10312 5590 7127 -7973 -3032 9408 -1411 -9728 5490
455 5490 8906 -8526 -7012 10111 4468 -9815 -1491 7770 -1261 -4106 3551 -597 -4968 5815
469 5815 5481 -10761 -5147 14727 4094 -17248 -2795 17804 1475 -16410 -683 13083 551
482 551 -8282 -1311 2568 2958 3521 -5143 -9174 7695 13971 -9993 -17235 11717 18894 -12252 -18720
497 -18720 11469 16995 -9085 -13992 5224 10196 -195 -6126 -5613 2221 11474 1081 -16855 -3675
511 -3675 20947 5311 -23314 -6226 23567 6570 -21580 -6600 17565 6702 -11788 -6953
523 -6953 5054 7656 2143 -8639 -8874 9881 14609 -10960 -18701 11632 20885 -11562 -21078 10407
537 10407 19366 -8151 -16235 4701 12025 -384 -7445 -4526 2987 9471 867 -13949 -3805 17449
551 17449 5701 -19446 -6465 19763 6414 -18180 -5656 14971 4672 -10333 -3717 4879
563 4879 3130 819 -3051 -6137 3473 10515 -4358 -13483 5383 14737 -6361 -14276 6889 12230
577 12230 -6796 -9007 5885 5117 -4122 -1110 1764 -2391 1085 5016 -3909 -6387 6476 6511 -8290
592 -8290 -5338 9171 3207 -8966 -523 7654 -2335 -5533 4792 2781 -6580 45 7331 -2672
606 -2672 -7010 4588 5624 -5534 -3381 5377 645 -4071 2343 1887 -4970 1038 7119 -4042 -8384
621 -8384 6819 8772 -8785 -8225 9618 6962 -9094 -5258 7130 3339 -4008 -1657 -91 270
635 270 4541 561 -8925 -919 12607 838 -15163 -530 16292 281 -15745 -265 13713
648 13713 771 -10281 -1770 5991 3404 -1225 -5373 -3444 7570 7620 -9583 -10849 11086 12882
662 12882 -11797 -13680 11364 13216 -9782 -11784 6965 9601 -3162 -7082 -1330 4548 6054 -2235
676 -2235 -10545 417 14326 938 -16869 -1754 17963 2271 -17372 -2574 15208 2968
688 2968 -11651 -3520 7142 4381 -2196 -5506 -2742 6821 7061 -8120 -10442 9110 12516 -9573
702 -9573 -13214 9324 12615 -8175 -10850 6205 8369 -3416 -5445 167 2673 3362 -150 -6666
716 -6666 -1662 9495 2740 -11449 -3053 12291 2697 -11963 -1958 10383 991 -7861 -148 4614
730 4614 -404 -1122 473 -2322 -50 5144 -813 -7110 1994 8036 -3195 -7738 4283 6440 -4917
745 -4917 -4269 5053 1670 -4556 1013 3511 -3344 -2038 4967 320 -5725 1262 5404 -2648 -4210
760 -4210 3448 2167 -3713 290 3263 -2917 -2233 5271 892 -7030 627 8054 -1931 -8086 2887
775 2887 7258 -3152 -5580 2721 3398 -1498 -903 -353 -1596 2632 3717 -4995 -5406 7124 6392 -8693
791 -8693 -6752 9340 6458 -8972 -5775 7469 4793 -4968 -3772 1738 2915 1985 -2182 -5638 1798
806 1798 8962 -1570 -11457 1505 12914 -1375 -13126 1065 12120 -445 -10019 -584 7076
819 7076 1965 -3694 -3700 144 5530 3094 -7315 -5819 8768 7761 -9643 -8824 9758 9025 -8933
834 -8933 -8455 7253 7341 -4680 -5873 1562 4337 1915 -2923 -5368 1755 8407 -928 -10764 386
849 386 12075 -102 -12285 -112 11309 329 -9334 -735 6545 1366 -3353 -2280 70 3389
863 3389 2950 -4517 -5295 5629 6874 -6388 -7462 6724 7208 -6439 -6157 5550 4587 -4046 -2813
878 -2813 2111 1035 110 455 -2399 -1511 4344 1942 -5886 -1883 6705 1299 -6790 -417 6110 -571
894 -571 -4707 1510 2898 -2151 -753 2451 -1292 -2228 3058 1648 -4162 -690 4564 -394 -4199 1458
910 1458 3110 -2375 -1466 2943 -557 -3139 2517 2850 -4225 -2303 5354 1497 -5794 -669 5418 -52
926 -52 -4288 525 2562 -622 -383 381 -1937 242 4093 -1028 -5828 1870 6987 -2585 -7449 2975
942 2975 7171 -2907 -6217 2275 4749 -1130 -2991 -530 1066 2490 746 -4496 -2237 6341 3375
957 3375 -7742 -4024 8512 4300 -8412 -4200 7476 3894 -5681 -3507 3284 3160 -447 -2940
971 -2940 -2506 2809 5184 -2810 -7435 2835 8912 -2811 -9559 2569 9279 -2049 -8183 1193
985 1193 6462 44 -4278 -1519 2014 3237 258 -4828 -2138 6306 3626 -7331 -4515 7846 4900
1000 4900 -7639 -4791 6714 4314 -5143 -3654 3046 2920 -638 -2275 -1905 1753 4167 -1434 -6041
1015 -6041 1323 7266 -1329 -7702 1380 7370 -1310 -6274 1124 4668 -672 -2698 17 676 889
1030 889 1248 -1861 -2723 2828 3647 -3619 -3992 4125 3713 -4273 -2998 3942 1894 -3240 -698 2145
1046 2145 -487 -814 1420 -565 -1989 1845 2128 -2813 -1825 3388 1205 -3426 -304 2993 -664 -2085
1062 -2085 1603 890 -2331 468 2761 -1747 -2844 2760 2562 -3331 -2026 3403 1301 -2875 -493
1077 -493 1845 -241 -409 846 -1246 -1178 2887 1316 -4238 -1180 5195 965 -5581 -658 5371 448
1093 448 -4526 -382 3195 533 -1495 -929 -414 1472 2250 -2147 -3815 2784 5000 -3274 -5686 3508
1109 3508 5851 -3327 -5476 2761 4707 -1714 -3614 340 2392 1360 -1098 -3078 -20 4676 972
1124 972 -5957 -1639 6771 2046 -6987 -2258 6517 2271 -5437 -2277 3796 2262 -1833 -2348 -329
1139 -329 2467 2400 -2663 -4125 2856 5449 -2964 -6158 2957 6306 -2648 -5808 2112 4900 -1232 -3648
1155 -3648 110 2238 1202 -818 -2568 -428 3786 1387 -4772 -2017 5371 2301 -5507 -2290 5116
1170 5116 2034 -4245 -1689 2978 1324 -1417 -985 -247 812 1837 -749 -3125 872 4006 -1040
1185 -1040 -4370 1264 4256 -1419 -3635 1445 2646 -1275 -1427 927 162 -381 1012 -291 -1888 983
1201 983 2386 -1592 -2455 2050 2135 -2231 -1452 2174 594 -1784 366 1191 -1251 -409 1955 -368 -2368
1218 -2368 1085 2465 -1592 -2210 1815 1680 -1701 -947 1259 105 -525 732 -395 -1437 1367 1981
1234 1981 -2238 -2246 2915 2326 -3214 -2120 3152 1818 -2603 -1364 1721 962 -480 -562 -869 314 2253
1251 2253 -158 -3469 127 4321 -160 -4798 151 4798 -114 -4343 -88 3485 436 -2294 -935
1266 -935 934 1601 483 -2270 -1745 2936 2795 -3398 -3495 3671 3892 -3566 -3873 3159 3616 -2369 -3111
1283 -3111 1269 2449 73 -1741 -1503 1055 2857 -472 -3994 3 4779 317 -5151 -551 5051
1298 5051 712 -4470 -856 3537 1074 -2238 -1311 808 1638 643 -1958 -1915 2306 2928 -2535 -3527 2670
1315 2670 3775 -2580 -3629 2279 3200 -1713 -2488 928 1652 17 -806 -1015 45 1956 551 -2734
1331 -2734 -922 3276 1104 -3473 -1034 3350 857 -2853 -577 2097 306 -1132 -81 85 -62
1346 -62 911 68 -1745 49 2289 -268 -2519 513 2385 -751 -1951 899 1258 -927 -397 848
1362 848 -458 -585 1247 286 -1781 106 2097 -425 -2034 694 1717 -796 -1132 748 373 -513
1378 -513 436 143 -1227 294 1849 -769 -2289 1121 2456 -1359 -2371 1359 2056 -1125 -1531 650
1394 650 908 12 -217 -785 -397 1595 929 -2289 -1307 2836 1532 -3070 -1601 3018 1558 -2622 -1439
1411 -1439 1911 1291 -975 -1168 -139 1077 1261 -1026 -2290 1032 3108 -1026 -3631 979 3835 -839
1427 -839 -3674 576 3190 -152 -2460 -388 1577 1048 -600 -1703 -301 2353 1123 -2864 -1736
1442 -1736 3162 2140 -3224 -2313 2956 2305 -2437 -2123 1653 1839 -681 -1502 -365 1175 1409 -862
1458 -862 -2311 637 3024 -440 -3410 314 3503 -184 -3255 29 2698 167 -1932 -443 1026
1473 1026 757 -119 -1124 -737 1471 1401 -1781 -1860 1958 2064 -1994 -2002 1848 1764 -1502 -1330 1019 870 -377
1492 -377 -337 -273 -62 954 425 -1460 -590 1853 642 -1994 -551 1918 372 -1623 -134 1129 -120
1509 -120 -518 283 -149 -429 743 433 -1243 -374 1556 262 -1615 -73 1459 -81 -1054 233 524
1526 524 -286 155 303 -775 -194 1364 87 -1765 66 1966 -178 -1934 238 1672 -206 -1221
1542 -1221 44 618 197 56 -511 -702 859 1278 -1165 -1706 1377 1971 -1457 -2032 1390 1922 -1088
1559 -1088 -1644 651 1269 -51 -845 -618 404 1312 19 -1912 -355 2394 617 -2667 -793 2696
1575 2696 915 -2465 -990 1992 1048 -1312 -1096 509 1163 338 -1229 -1161 1282 1849 -1320 -2354 1282
1592 1282 2634 -1160 -2673 928 2469 -580 -2084 107 1537 420 -931 -994 310 1526 253
1607 253 -1963 -708 2279 1063 -2367 -1246 2292 1327 -1955 -1271 1492 1171 -846 -1001 166 849
1623 849 569 -681 -1218 572 1726 -475 -2064 389 2165 -319 -2087 226 1759 -131 -1319 -55
1639 -55 758 266 -161 -497 -377 736 828 -924 -1116 1075 1260 -1113 -1200 1063 1031 -862 -718 601 378
1658 378 -224 10 -155 -316 531 563 -834 -687 1029 705 -1089 -631 978 451 -764 -240 422 9 -1
1677 -1 232 -414 -382 820 505 -1096 -552 1274 555 -1263 -482 1106 426 -777 -332 341 264 178 -211 -700
1697 -700 204 1180 -198 -1528 188 1731 -158 -1741 97 1605 42 -1273 -196 849 451 -335
1713 -335 -685 -206 944 691 -1150 -1103 1295 1394 -1330 -1553 1233 1584 -1009 -1474 664 1271 -211 -1014
1731 -1014 -310 711 846 -418 -1333 145 1729 103 -1984 -284 2090 448 -1982 -561 1720 690
1747 690 -1279 -790 742 905 -144 -984 -448 1050 968 -1106 -1396 1076 1652 -1003 -1760 834 1689 -590
1765 -590 -1492 272 1180 107 -789 -484 399 892 3 -1177 -279 1444 539 -1524 -671 1515 751 -1338
1783 -1338 -720 1058 674 -674 -580 232 478 211 -385 -650 303 970 -259 -1210 217 1288 -179 -1227
1801 -1227 126 1046 -70 -742 -9 394 119 9 -224 -342 337 643 -430 -818 502 884 -497 -838
1819 -838 441 668 -337 -426 150 156 56 140 -268 -402 453 601 -587 -724 671 767 -650 -702 545 600
1839 600 -333 -425 77 233 243 -32 -539 -136 816 291 -1020 -415 1121 477 -1098 -520 962 532 -715
1858 -715 -524 372 516 46 -478 -439 478 829 -434 -1119 390 1334 -298 -1407 195 1340 -44 -1162
1876 -1162 -146 861 363 -539 -591 155 796 199 -991 -550 1094 790 -1158 -975 1089 1049 -933 -1064
1894 -1064 678 1006 -362 -875 -5 727 423 -534 -771 369 1101 -182 -1299 38 1425 111 -1392
1911 -1392 -252 1257 358 -1015 -476 660 551 -292 -648 -117 710 460 -748 -776 756 962 -698 -1061
1929 -1061 606 1049 -453 -944 252 765 -12 -516 -220 294 472 -59 -673 -146 835 307 -885 -400
1947 -400 898 451 -792 -438 620 385 -388 -338 121 258 172 -157 -405 115 624 -52 -741 11 789 28
1967 28 -729 -48 593 84 -392 -127 122 147 126 -178 -354 205 553 -220 -685 206 729 -176 -659 116 539
1988 539 -1 -335 -99 147 250 102 -365 -300 478 495 -539 -612 553 680 -494 -685 371 616 -208 -524
2008 -524 -16 382 233 -232 -487 77 688 60 -831 -191 914 297 -913 -388 818 456 -636 -488 404
2027 404 534 -93 -519 -190 522 494 -491 -728 436 899 -367 -997 253 986 -129 -912 -40 749 201
2046 201 -542 -384 303 569 -62 -722 -174 812 368 -842 -509 836 618 -733 -669 579 661 -365 -615
2065 -615 110 552 155 -451 -397 345 633 -231 -791 124 889 -8 -890 -88 818 189 -666 -264 470 333
2085 333 -224 -391 -17 436 242 -452 -439 443 559 -421 -636 348 621 -264 -568 133 453 6 -313 -155
2105 -155 141 286 17 -402 -141 479 237 -496 -296 506 346 -412 -323 311 295 -148 -227 -19 157 188 -87
2126 -87 -347 10 447 42 -530 -110 515 127 -477 -186 349 193 -211 -220 18 215 156 -220 -330 196 470
2147 470 -170 -542 131 588 -58 -550 5 477 107 -330 -187 180 296 -3 -383 -149 449 296 -496 -415
2167 -415 476 485 -430 -527 317 506 -200 -473 31 397 153 -306 -328 204 487 -81 -602 -3 678 114 -678
2188 -678 -198 628 279 -520 -336 373 388 -168 -418 -26 428 213 -418 -392 397 534 -328 -608 268 646 -160
2209 -160 -597 55 543 82 -424 -202 295 332 -143 -443 -3 512 122 -559 -240 546 328 -499 -371 409
2229 409 392 -268 -376 111 356 56 -311 -221 250 366 -163 -446 111 523 -22 -526 -25 480 106 -385 -156
2250 -156 273 212 -127 -242 -25 255 152 -272 -270 256 332 -247 -382 175 380 -119 -342 24 264 47 -175
2271 -175 -141 78 223 28 -278 -101 335 182 -325 -229 292 257 -239 -253 155 237 -31 -207 -85 156 200 -98
2293 -98 -299 21 348 18 -397 -92 380 140 -343 -173 263 214 -143 -240 23 251 97 -231 -229 222 342 -181
2315 -181 -380 144 435 -78 -410 18 370 67 -298 -157 196 240 -100 -306 -22 355 121 -382 -218 387
2335 387 291 -341 -323 272 352 -170 -345 59 321 66 -278 -189 217 297 -143 -393 60 432 2 -449 -89 423
2357 423 144 -360 -200 267 257 -136 -268 42 312 102 -287 -192 303 282 -246 -333 213 373 -128 -363 54
2378 54 328 21 -281 -127 181 192 -123 -270 29 311 46 -326 -130 321 189 -282 -222 227 232 -147 -227 58
2400 58 225 66 -171 -133 154 227 -89 -268 43 310 6 -305 -48 257 96 -214 -136 139 155 -42 -185 -27
2422 -27 178 125 -174 -189 162 227 -136 -257 74 249 -34 -219 -14 191 88 -134 -136 65 191 17 -224 -69
2444 -69 237 125 -235 -166 204 189 -147 -202 76 210 -10 -182 -88 157 161 -113 -217 60 270 -10 -289 -51
2466 -51 270 81 -251 -138 182 155 -131 -204 37 217 36 -230 -119 205 187 -182 -236 148 269 -98 -277 37
2488 37 272 30 -222 -88 182 167 -113 -193 52 239 22 -263 -75 261 126 -250 -176 199 195 -144 -227 46
2510 46 200 5 -207 -101 166 158 -130 -209 98 241 -40 -259 1 260 66 -207 -89 169 145 -109 -155 61
2532 61 179 16 -193 -75 185 136 -171 -168 126 190 -94 -214 30 182 7 -159 -69 127 126 -82 -158 36 194
2555 194 9 -194 -64 195 104 -160 -117 127 147 -73 -141 12 150 59 -125 -96 105 154 -71 -167 47 188 -1
2578 -1 -190 -42 159 75 -140 -105 84 128 -35 -140 -21 146 75 -132 -119 124 145 -102 -169 55 156 -39 -154
2601 -154 -34 142 70 -104 -118 69 163 -21 -172 -15 188 65 -173 -88 158 129 -101 -145 72 163 -3 -144
2623 -144 -36 131 86 -121 -137 90 167 -69 -191 25 181 18 -171 -58 149 85 -107 -124 64 134 -21 -168
2645 -168 -29 162 86 -158 -102 146 148 -88 -147 62 158 -4 -146 -26 135 81 -105 -115 71 148 -24 -156 -5
2668 -5 159 28 -164 -68 129 94 -100 -124 44 126 -5 -138 -41 130 80 -106 -108 84 124 -48 -146 33 148 11
2692 11 -118 -46 106 65 -68 -101 47 123 7 -119 -30 123 69 -109 -87 92 109 -60 -115 21 112 19 -111 -58
2716 -58 84 81 -66 -121 39 128 1 -132 -30 116 52 -106 -86 78 107 -38 -110 8 114 39 -99 -67 102 117
2740 117 -67 -120 53 131 -14 -120 -8 109 45 -94 -72 64 89 -42 -124 2 122 19 -122 -63 109 82 -83
2763 -83 -101 63 108 -19 -119 -10 105 51 -82 -69 74 114 -41 -111 29 144 13 -110 -32 112 61 -78 -64
2786 -64 63 96 -20 -103 -8 107 30 -105 -59 84 75 -79 -115 36 100 -13 -104 -21 86 43 -69 -66 55 88 -31
2811 -31 -98 2 113 24 -97 -39 97 64 -69 -64 58 78 -11 -74 -15 82 51 -61 -60 60 82 -36 -95 14 96 20
2837 20 -85 -26 76 31 -50 -72 22 68 -12 -82 -24 77 39 -77 -55 65 73 -51 -71 24 73 6 -68 -15 62 53 -42 -65
2865 -65 43 85 6 -77 -13 80 36 -71 -38 61 60 -36 -66 7 61 10 -67 -44 53 52 -57 -88 36 79 -27 -97 -2 84 26
2894 26 -66 -33 59 58 -27 -83 14 75 12 -72 -26 90 62 -56 -53 54 76 -29 -66 14 65 9 -69 -36 38 53 -33 -73 17
2923 17 79 -10 -85 -13 69 30 -74 -32 58 52 -35 -51 15 62 16 -70 -26 69 58 -49 -55 54 75 -34 -72 14 73 8 -45
2952 -45 -15 44 40 -26 -48 7 57 -1 -72 -20 62 21 -58 -44 49 43 -28 -31 11 38 -2 -30 -20 31 34 -25 -41 20 54 -16 -56 9
2984 9 52 15 -33 -3 39 43 2 -18 -4 30 19 -25 -32 35 47 -20 -39 13 39 -26 -43 2 25 10 -31 -24 9 28 -1 -35 -12 39
3016 39 18 -52 -21 42 31 -29 -19 32 43 -2 -20 -1 34 34 -2 -24 16 52 -2 -57 -1 62 7 -47 -5 44 24 -28 -25 11 25
3047 25 0 -31 -22 41 32 -38 -32 36 52 -31 -39 32 52 -7 -33 1 44 32 -21 -17 26 51 -1 -46 2 51 18 -39 -22 47 28 -41 -20
3080 -20 36 33 -19 -24 6 33 9 -37 -39 26 40 -26 -50 22 52 -16 -49 6 35 8 -19 -10 19 37 -3 -19 13 35 18 -21 -11 51
3112 51 32 -36 -19 34 29 -20 -20 22 21 3 -1 -3 10 16 -2 -30 12 26 -11 -36 -2 29 -9 -39 -16 19 6 -17 -6 -3 15 9 -11 -14 15
3147 15 25 -6 -14 17 38 -1 -12 25 26 7 5 12 8 8 10 -4 -9 26 14 -19 -10 19 10 -16 -9 11 4 -20 -16 5 0 1 -2 -17 -6 25 9 -19
3185 -19 -2 34 10 -31 -4 18 4 -12 -2 3 10 5 -8 -10 21 31 -11 -27 19 30 -16 -31 6 17 -17 -20 3 14 11 -19 -18 -4 15 5
3219 5 -38 -15 28 -1 -41 -14 32 21 -24 -11 25 15 -14 -22 -3 22 12 -2 -13 24 32 -1 -21 16 43 -3 -34 9 39 -3 -30 2
3251 2 27 15 -18 -33 -1 26 2 -29 -14 21 13 -39 -26 27 22 -25 -23 22 32 -14 -18 1 19 21 -4 -8 23 42 -5 -25 11 42 -11 -27
3285 -27 7 33 14 -21 -13 17 -1 -3 -16 -9 6 17 -26 -19 25 13 -25 -29 15 22 -10 -28 9 32 0 -8 -7 9 21 -2 -14 9 33 31 -26
3320 -26 -10 33 11 -12 -9 26 7 4 -1 4 13 17 -6 -18 15 26 0 -33 -3 36 -5 -33 -1 10 0 -25 -10 -6 9 12 -18 -18 19 12 -12
3355 -12 -22 9 39 -17 -25 13 36 9 -9 -7 16 14 0 -8 2 35 8 -30 -7 44 14 -32 -22 19 25 -16 -19 -1 23 -4 -43 -10 18
3388 18 28 -21 -37 10 46 -4 -47 -10 48 16 -33 -2 45 14 -7 -23 19 40 0 -26 -13 35 25 -20 -35 38 34 -16 -37 7 24
3419 24 -5 -43 -18 14 11 -23 -30 7 30 -5 -46 -7 45 15 -48 -19 39 21 -26 -23 18 40 15 -32 -4 31 27 -19 -25 17 51 -7 -43
3452 -43 10 47 -4 -33 -1 28 9 -11 -21 4 30 3 -38 -13 28 13 -25 -33 23 30 -16 -39 1 39 -3 -34 -7 19 20 -16 -27 -2
3484 -2 28 2 -26 4 34 8 -26 -16 26 33 -11 -21 1 23 13 -22 -19 21 38 -20 -54 -1 33 -10 -48 -14 32 3 -45 -20 17 22
3516 22 -9 -32 -3 45 21 -37 -31 40 34 -25 -35 24 43 1 -36 1 33 17 -22 -31 19 41 -2 -49 -7 49 6 -60 -25 36 19 -39
3548 -39 -42 11 27 -18 -49 -10 26 18 -32 -36 28 44 -20 -51 8 48 -4 -47 0 37 27 -38 -34 33 49 0 -35 -4 59 16 -42 -21
3580 -21 32 43 -28 -40 18 36 -7 -44 -4 30 13 -30 -34 16 36 -15 -50 -1 51 4 -49 -21 39 21 -24 -26 36 42 -1 -37 -7 37
3612 37 28 -28 -26 39 49 -8 -36 23 48 5 -45 -15 44 21 -26 -34 12 39 -4 -45 -18 31 20 -44 -37 25 33 -33 -47 9 37 4 -43
3645 -43 -10 33 30 -15 -33 19 55 1 -40 1 47 20 -32 -22 37 44 -29 -41 7 30 0 -41 -28 35 31 -34 -51 8 43 -15 -58 -12
3677 -12 42 11 -43 -40 27 32 -16 -40 0 42 15 -38 -22 36 39 -32 -44 28 42 -11 -44 -5 41 15 -43 -24 32 38 -23 -49 12 36
3709 36 20 -51 -14 51 27 -45 -38 21 34 -12 -43 -13 43 6 -49 -43 30 42 -19 -54 16 59 11 -36 -9 63 34 -40 -22 29 49
3740 49 -15 -43 12 55 12 -41 -31 43 34 -25 -44 14 44 -8 -52 -14 33 18 -38 -45 12 49 -21 -53 -11 36 12 -60 -28 39 31 -30
3772 -30 -36 28 48 -8 -35 -3 49 26 -28 -32 35 51 -8 -44 10 50 9 -45 -11 35 31 -30 -34 23 43 -11 -51 -6 42 19 -48 -38
3804 -38 29 37 -24 -56 16 49 12 -44 -13 42 31 -27 -37 17 52 6 -41 2 56 27 -32 -31 41 26 -26 -43 2 44 16 -43 -22
3835 -22 39 29 -28 -35 16 38 -10 -57 -9 40 19 -48 -38 28 49 -27 -50 7 52 7 -58 -25 28 28 -33 -40 32 39 -6 -50 -6 54
3867 54 23 -39 -23 29 36 -15 -50 11 46 2 -49 -19 31 24 -49 -55 21 40 -15 -45 -12 36 19 -39 -29 26 38 -24 -59 8 57 -4
3899 -4 -55 -11 52 39 -39 -30 34 55 -3 -43 -6 52 29 -33 -37 41 43 -35 -48 8 50 0 -48 -22 45 22 -44 -35 27 46 -17 -49 -4
3932 -4 50 10 -34 -27 38 32 -27 -32 14 56 1 -40 -8 42 31 -26 -32 42 39 -3 -34 10 43 8 -40 -21 36 25 -27 -49 20 34 -11
3965 -11 -45 -9 37 24 -34 -43 11 29 -31 -49 -1 52 7 -41 -22 26 28 -18 -38 14 49 -3 -55 -10 48 22 -34 -35 36 41 -21 -50
3997 -50 14 49 12 -48 -22 28 29 -30 -47 26 36 -8 -49 -4 41 9 -41 -44 18 41 -21 -41 2 40 1 -43 -16 43 25 -33 -43
4028 -43 22 47 6 -42 10 50 20 -33 -28 42 38 -26 -49 12 43 1 -55 -25 33 19 -40 -43 24 48 -16 -53 -7 38 5 -42 -29 31
4060 31 34 -24 -44 21 40 2 -46 -9 42 20 -37 -24 27 51 -9 -51 -4 43 20 -38 -20 37 36 -23 -38 6 34 -8 -47 -18 27
4091 27 18 -46 -43 10 42 -27 -52 1 34 -2 -48 -23 35 30 -20 -33 23 44 -2 -41 -7 40 18 -37 -24 38 35 -16 -41 1 36 15
4123 15 -41 -17 36 30 -29 -44 2 28 -7 -49 -13 36 8 -36 -30 26 39 -21 -50 -1 49 8 -45 -16 44 22 -27 -30 13 45 5 -39
4155 -39 5 53 18 -28 -26 39 29 -16 -34 13 51 5 -39 -22 33 27 -33 -30 22 37 -10 -46 -10 33 10 -44 -34 25 24 -17 -37 12
4187 12 46 8 -29 -4 41 30 -33 -24 26 42 -11 -32 12 50 11 -30 -22 32 30 -20 -38 1 40 -6 -45 -17 35 24 -30 -31 13 29
4219 29 -9 -50 -7 35 12 -41 -22 26 18 -21 -32 14 39 8 -35 -7 30 22 -38 -25 21 43 -9 -34 2 33 4 -47 -27 23 23 -31
4251 -31 -47 0 30 -2 -54 -14 31 7 -39 -42 15 21 -28 -49 2 43 -2 -32 -21 39 29 -22 -40 11 40 0 -35 2 54 25 -22
4282 -22 -18 33 43 -10 -33 13 45 4 -37 -18 33 31 -30 -36 25 34 -6 -40 -6 28 12 -28 -27 16 28 -18 -27 3 49 18 -33 -16 35
4315 35 26 -28 -30 25 40 3 -34 1 45 16 -24 -14 16 23 -18 -33 0 40 -4 -37 -16 21 11 -30 -36 15 37 -15 -34 -6 35 5
4347 5 -31 -29 21 30 -16 -32 5 31 -4 -41 -4 31 11 -30 -21 11 41 -6 -30 5 43 28 -28 -13 30 26 -17 -18 14 29 -4 -34 -14
4380 -14 23 15 -33 -35 19 30 -9 -36 -10 32 -2 -39 -25 27 27 -21 -24 14 34 8 -32 -7 34 24 -29 -14 21 44 -3 -32 4 38
4412 38 1 -25 -6 26 34 -9 -22 8 32 -2 -35 -12 29 19 -32 -19 21 23 -22 -38 0 34 3 -26 -25 33 26 -11 -22 24 34 2
4444 2 -20 3 28 28 -17 -3 29 17 -1 -26 -5 39 0 -30 -17 16 5 -28 -24 1 24 -15 -37 -15 26 8 -27 -28 16 15 -18 -26 -2
4477 -2 30 5 -41 -10 30 18 -21 -16 26 32 -2 -22 11 27 10 -26 -19 34 19 3 -19 14 30 3 -34 -15 28 16 -26 -26 8 18 -22
4510 -22 -41 -1 27 7 -22 -11 28 25 -25 -27 11 19 6 -19 -13 35 27 -10 -17 24 33 -5 -29 1 35 17 -15 -8 30 24 -23 -26 7 20 -5
4545 -5 -29 -20 17 6 -33 -28 12 30 -5 -34 4 35 6 -20 -17 21 25 -13 -23 8 28 -3 -24 -7 26 17 -10 -17 13 29 -12 -33 2 41
4579 41 -1 -32 -7 26 21 -22 -24 10 28 -12 -32 -15 27 8 -29 -28 12 20 -17 -27 2 27 5 -38 -8 27 13 -11 -22 18 31 0
4611 0 -22 1 44 28 -18 -13 19 20 -3 -19 6 31 8 -20 -12 22 14 -14 -12 14 23 2 -30 -3 22 -5 -31 -20 20 21 -12 -22 5 17
4645 17 5 -21 1 24 23 -13 -2 18 30 3 -8 1 30 20 -16 -19 19 25 -8 -39 -7 23 1 -20 -12 24 11 -23 -20 7 16 -3 -25 -9
4679 -9 9 -11 -29 -15 22 12 -17 -29 8 29 5 -20 -5 26 20 -14 -14 24 20 7 -10 7 22 14 -19 -19 21 17 -15 -14 9 23 -12 -28
4713 -28 -8 15 8 -17 -29 18 20 -16 -26 -2 24 -3 -29 -12 30 8 -10 -22 23 30 -11 -15 6 27 7 -16 -11 20 31 -5 -15 5 24
4746 24 5 -26 -11 23 8 -8 -19 4 21 -14 -26 -10 22 5 -19 -10 14 14 -19 -28 -6 14 2 -22 -10 11 15 -11 -11 4 17 1 -8
4779 -8 6 22 14 -19 -11 23 22 -4 -8 8 19 1 -14 -3 14 8 -26 -8 4 7 -14 -32 -6 13 9 -24 -10 18 11 -7 -9 -1 23 1 -20 -5
4815 -5 23 19 -4 -8 8 17 5 -11 3 23 16 -5 -3 15 24 -4 -19 4 18 -5 -27 -12 7 6 -10 -15 2 4 -9 -32 -1 15 6 -16 -18 4
4851 4 15 -7 -26 0 11 1 -18 6 13 10 -9 -2 17 24 11 -18 6 22 16 -20 -3 12 23 -9 -18 18 16 0 -23 1 11 10 -27 -17 13
4886 13 25 -12 -19 -1 7 3 -25 -12 15 15 -6 -8 9 26 9 -12 4 20 10 0 1 5 12 1 -16 15 13 11 -10 6 5 7 -17 -8 8 5 -8
4923 -8 -17 -4 -3 2 -20 -16 0 1 -17 -10 1 2 -7 -18 -9 20 15 -12 -15 10 22 6 -8 10 29 16 -12 -2 11 21 -10 -18 8 23 1 -3 -6 15
4961 15 14 -11 -6 3 5 -4 -17 1 12 4 -17 -5 4 19 -1 -6 3 11 6 -14 -9 15 11 3 3 16 22 3 2 12 26 11 -3 0 21 26 -1 -13 -3 18
5001 18 3 -17 -2 15 -2 -14 -8 4 17 -10 -16 2 11 3 -15 -10 10 16 -13 -10 10 19 0 -11 8 7 3 -14 -1 16 16 2 6 15 30 3 -3
5038 -3 -9 7 15 -2 -4 16 12 -2 -8 -5 14 -2 -12 -15 3 0 -11 -13 -7 13 -4 -22 6 17 12 2 -3 7 14 -4 0 7 11 18 -10 -13 8 18 5 5
5078 5 11 25 5 -13 0 11 3 -4 -4 -12 2 -10 -17 -4 2 -1 -19 -3 10 3 -20 -14 -5 2 -13 -12 -6 1 0 -4 -7 3 13 0 -1 -1 15 13 0 3 11 19 -7
5121 -7 0 -2 6 -1 -9 0 9 4 -10 -8 3 0 -13 -11 0 4 1 -19 -6 -3 0 -3 -13 -5 -3 6 -9 -1 14 12 3 -6 4 16 0 1 13 14 11 -4 -6 9 18 7 -9
5166 -9 -5 11 1 -23 -9 6 -6 -24 -13 -4 -9 -14 -13 4 16 6 -11 -12 1 5 -5 -6 8 9 0 -17 7 18 6 6 4 14 9 0 -6 13 18 10 1 -3
5206 -3 18 19 -8 -5 4 5 -12 -13 -13 -7 -9 -10 -17 6 -5 -9 -18 -8 11 5 -8 -6 9 2 -4 -6 0 2 12 -4 4 15 20 -11 8 4 -1 -1 -12 11 7 5 -8 -2
5250 -2 9 -2 -4 -8 3 5 -8 -12 -10 1 4 -6 -10 -6 -3 -8 -13 9 -8 -13 -5 -5 5 0 -9 -7 4 10 2 -3 3 15 6 -12 -5 6 4 -16 -12 3 0 3 -3 3 7 2
5296 2 -3 -6 3 5 -5 -12 -4 1 0 -10 -9 -3 -5 -18 -17 -6 7 -5 -10 1 10 6 -12 -1 4 17 2 -4 8 13 7 -4 -9 9 4 13 -3 13 14 -10 0 3 -5
5339 -5 -3 -8 -8 -5 0 -16 -6 -10 6 1 0 -5 -6 6 -3 -6 4 3 -4 -5 -1 6 -2 -3 -1 9 1 -5 -6 -2 12 8 0 6 4 0 -12 -6 4 -1 -9 -5 -9 12 -8 -5 -15 -1
5387 -1 -4 -9 -5 -14 -7 -5 5 -1 1 3 -9 7 -3 1 -3 5 3 9 12 0 2 5 2 -1 0 -5 3 -4 5 -1 2 -1 -2 -11 -12 10 -7 -7 -10 -6 1 -11 -10 -15 -8 -3 -4 -17 1 -12
5437 -12 -14 -5 0 -2 -4 -7 1 12 5 -2 -6 14 3 -1 -7 3 7 6 1 -6 1 5 -5 -1 2 4 -10 -14 -16 3 -10 -5 3 -5 -11 -15 -13 -7 -11 -5 -5 -7 -5 -4 0 -3 10 6 0 -6 0
5488 0 1 -4 -16 7 3 8 0 2 9 -1 8 -9 -7 -2 -5 -7 -12 7 0 -14 -3 4 2 -14 -1 -8 -1 0 -12 -10 1 -3 1 -2 7 -2 8 7 4 10 3 0 4 10 6 9 1 7 2
5537 2 15 5 -2 2 3 4 0 -6 -7 -11 0 0 -4 -13 -3 -10 0 -4 0 -8 -1 9 1 -7 -7 -5 -3 5 -1 1 -8 5 3 1 2 0 5 3 3 2 -5 0 3 3 -4 2 -2 -5 0 -3 -5 -6 -5 -12
5591 -12 0 -14 -8 -7 6 -9 -4 -2 -8 -10 -9 -4 2 -7 -4 -10 -1 -5 -3 1 15 2 13 7 4 6 -3 -4 -1 2 -3 -2 5 5 -10 -12 -8 -3 2 -18 -11 -2 -7 -8 -13 0 4 -6 3
5640 3 0 2 -5 -1 5 0 -3 -11 -4 3 10 -4 5 7 0 8 0 0 11 12 1 4 -1 6 8 -14 -4 5 -1 -1 4 2 -11 -7 -3 -4 -1 -11 -11 -3 -4 0 -4 -2 6 2 -8 0 3 1 2 0 1
5693 1 1 10 -2 5 -1 3 -4 6 2 -8 -1 8 9 -1 8 7 -14 -3 -5 -7 -6 -7 -9 -14 -11 -13 -7 -12 -1 1 -8 6 2 3 3 -4 2 10 0 0 -6 1 1 5 8 5 13 10 -7 2 11
5744 11 0 -4 -3 2 9 -10 8 2 0 -3 -5 3 -3 -3 -6 -12 -11 -12 -16 -7 -4 -6 -15 -3 -1 -10 0 -2 0 -3 0 -1 -4 2 6 14 -4 5 1 9 -6 6 16 7 -11 4 4 4 -5
5793 -5 -14 -2 -7 -1 -3 -3 -9 -5 -8 -15 -8 -8 -1 -6 -5 -5 -15 -3 -6 8 -5 0 0 -2 0 1 6 -6 9 3 11 12 0 1 1 0 3 3 -1 -1 -10 -6 -6 2 -5 1 -11 -3 -8 -5 -10 -13
5845 -13 -5 -9 -11 -6 -12 0 -7 -6 -4 -6 -2 6 6 4 4 11 -2 8 -4 16 -5 19 2 14 8 10 13 4 6 4 3 7 9 -6 -8 -9 -11 -5 4 -5 -3 0 -5 -6 -5 -16 0 -1
5893 -1 -4 -14 -1 -1 -1 3 0 11 4 5 7 0 6 14 8 1 2 5 7 11 4 6 9 4 -5 4 1 -7 -4 -10 -11 -7 -3 -13 -2 -10 -6 -2 -5 -4 -7 -3 -3 -7 -4 2 -2 -7 4 2 -3 7 0 7
5947 7 1 8 -3 1 -7 8 -6 2 2 13 11 -3 12 0 -11 -7 -5 -2 -7 -7 -2 -7 -2 -5 -2 -4 2 3 -8 -20 1 3 -1 -1 -8 1 10 1 14 1 -3 1 4 4 1 11 0
5994 0 8 10 6 2 -2 3 1 5 16 -7 -8 10 -1 -1 -8 -2 -9 -15 -3 1 0 -8 -2 5 -11 -6 -2 0 11 -3 -1 -10 -1 8 5 6 4 8 12 4 21 4 -3 3 -2 4 -8 4 1
6043 1 4 -1 -10 -5 -2 5 -8 -6 5 -5 -1 -10 -3 -16 -5 -9 -6 1 -1 3 -1 3 3 2 2 2 4 6 5 10 10 -3 11 2 6 8 4 0 -4 11 -3 2 -4 3 1 5 -4 -10 -3 -10 -5 -1
6095 -1 -10 -8 -8 9 -5 -6 -13 -5 -1 -4 -9 -4 2 8 2 -2 7 2 8 3 10 7 17 7 16 3 7 16 6 -3 8 11 2 3 2 -9 4 3 -3 2 -1 -1 -6 0 -19 -1 1 -7 8
6144 8 13 -1 -1 9 5 16 6 1 -5 0 1 5 16 9 6 6 2 7 21 5 8 12 2 8 6 -10 -3 -9 -6 3 -10 0 -1 -3 -11 -12 -9 -7 -9 1 0 -5 -1 2 3 0 -6 10
6192 10 1 0 -3 3 9 -3 2 -9 8 3 5 -4 -2 13 -6 -3 -9 -5 -1 -7 -14 3 -9 -3 -13 -27 -8 -4 -8 -7 -3 -6 -3 -11 -10 -5 -2 -6 -3 4 8 3 9 -1 0 7 -12 -7
6240 -7 -2 5 6 8 -3 11 5 3 5 8 -2 -2 0 0 -4 -3 -8 1 -6 -7 -13 -9 -3 -2 -8 -15 0 0 6 -14 4 -1 2 0 0 1 0 1 9 8 2 16 14 14 4 5 0 3 -2 2 3 9 4
6293 4 1 20 1 -10 -2 1 -3 -4 -5 -7 -7 -3 -14 -10 6 -11 -8 -2 -11 7 -7 -7 -3 -2 -11 1 12 8 12 5 1 0 10 4 3 0 4 -7 -6 6 2 -7 -5 -3 -1 -11 -4
6340 -4 -9 -9 -10 -1 -6 -6 -8 -8 -8 -12 -8 4 0 2 6 -4 -5 -3 1 -6 7 -1 4 16 4 2 8 -2 3 6 6 4 3 2 -4 0 -8 3 -5 6 -8 -10 -1 -1 -7 -9 -17 -3 -13 1
6390 1 -7 -10 6 -6 -10 -1 5 -1 1 12 -6 -6 -5 1 0 6 -2 9 14 5 -3 -4 -1 1 -9 -3 -2 1 -4 -8 -2 -4 -5 -9 -16 -16 9 -19 -15 -7 -5 -5 -18 -18 1 -3 -1 -3 3 6 0
6441 0 6 5 -1 -7 -1 4 10 9 -1 2 10 1 9 0 -3 0 8 -3 5 8 -5 -2 -14 -7 -7 -14 -10 4 -8 -3 -5 -13 -11 -4 -4 -16 -4 -6 -8 -9 -2 -5 -6 -6 -4 7 1 6 7 2 10 7
6493 7 5 6 9 5 2 -5 -3 -1 -7 0 -9 -13 1 -9 -8 -5 -4 -15 -3 -2 0 -13 -15 -13 -4 -6 -16 -10 -4 4 -2 -8 -6 0 0 3 4 -3 -9 -3 6 9 9 7 6 8 3 2 -1 4 1 4 3 -3 -1
6548 -1 5 -1 -4 4 -14 -10 -5 -8 -10 -8 1 0 -10 -4 1 -7 5 -2 11 4 -1 2 10 5 -2 -2 6 -1 5 1 2 -3 8 -5 -4 8 -2 2 -7 -7 -8 -7 -14 -9 -3 -5 -12 -11 -10 2 -3 -6
6600 -6 -10 1 -5 -2 4 -2 6 0 -9 10 11 -3 10 9 13 0 0 8 3 4 3 6 -11 3 11 -4 -3 0 -6 -8 -7 4 -3 -5 -10 3 -9 0 -6 -3 1 -10 -10 3 -1 -4 -5 -7
6648 -7 -16 -2 2 3 9 1 7 4 -3 8 10 0 0 -4 5 6 -4 4 -2 -4 1 -5 5 -6 -8 -10 -13 -12 -3 -1 -17 -21 -11 -18 -13 -11 -5 -10 -5 -8 -7 -1 1 -3 -7 1 4 7 6 8 4 5 0
6701 0 2 -5 8 2 1 -1 2 -2 -2 7 -7 -7 -12 -21 -13 -8 -10 -10 -9 3 -6 -15 -12 -4 -15 -8 0 7 0 -5 -16 1 3 7 5 4 6 3 9 3 9 4 -2 -1 5 4 0 0 2 5 -6 -21 4
6754 4 -5 -13 -9 -3 -12 -9 -12 -26 -6 -12 -9 -11 -13 2 -10 -10 -2 -6 2 -2 9 9 7 6 -4 -3 6 1 7 3 3 4 6 4 -3 4 -4 0 -3 -8 -3 -4 -7 -14 3 0 -12 -3 -11 -10 -13 -8 -1
6807 -1 0 -9 -8 -1 2 -5 0 -12 2 -10 -1 -5 -2 1 10 7 0 11 6 8 11 3 7 -1 2 -3 -5 -7 10 -2 -7 -9 0 3 5 -7 2 0 -7 -15 5 -2 -6 -2 -4 -3 6 4 1 -5 8 1
6859 1 1 5 3 4 6 8 13 5 4 10 10 13 2 7 3 7 7 -3 -2 -9 -9 -9 -5 2 2 -5 -14 2 -5 -5 -5 -5 -10 -1 -9 -9 0 -5 2 -12 -6 6 5 11 9 -5 3 -2 4 3 1 5 9 3 11
6914 11 -2 3 0 -4 -7 -2 1 -8 -6 4 -9 -7 -8 -3 -6 -5 -15 -4 -8 -10 1 -6 1 -1 13 7 2 0 5 7 6 8 9 4 11 4 10 6 -3 9 9 15 14 3 -3 7 -16 -1
6962 -1 8 8 -9 5 9 -2 -9 -9 -4 -5 -7 -14 8 -2 -8 -1 -2 5 -3 -1 2 -1 8 6 7 2 10 3 8 2 15 14 2 2 6 1 12 1 3 10 1 -4 -3 -3 11 -8 -4 8 -2
7011 -2 -6 -1 4 -6 -5 -7 -9 -8 4 -10 -6 -7 -1 -10 10 10 3 11 4 12 0 5 6 1 6 15 6 15 6 5 -6 5 -2 0 -7 4 0 6 -10 -2 -9 3 -6 -1 -4 -8 -6 -5 -4 0 -6
7062 -6 0 6 0 10 5 -1 10 2 3 0 6 4 14 18 2 7 3 7 2 10 2 -1 6 12 4 6 11 -6 -14 -4 -4 -2 -6 -5 -14 -5 -4 -10 -13 -9 -8 -2 -1 -3 -1 -6 -13 -2 -1 3 -8 19
7114 19 4 9 11 1 -6 -1 2 -3 -17 5 -5 0 -2 -4 3 -9 -1 -9 2 -3 0 -2 -10 -8 -3 -3 -10 -8 -4 -7 -9 -8 0 -6 -2 -4 11 -4 3 6 6 7 13 3 10 10 12 -2 1
7163 1 5 -6 5 -3 -1 -9 -1 5 -8 4 -7 -14 -7 0 -11 -5 -3 1 -2 -8 -6 -3 -10 -1 -3 -1 -4 9 0 -4 -10 4 0 8 7 12 12 5 13 9 12 2 -1 3 -1 7 8 3 1 -2 6 -2
7215 -2 -5 -2 -6 -6 -2 -20 1 -12 -2 -6 -13 -8 -11 -3 7 -2 8 0 -6 2 13 7 2 12 -1 3 2 5 -1 17 5 1 0 7 10 1 -2 8 6 -3 3 5 4 5 3 1 -5 -7 -13
7264 -13 -1 6 5 -6 -10 -6 1 -1 0 0 -3 5 8 4 6 14 16 9 9 10 2 6 18 17 -2 -1 -1 10 4 -9 4 -2 2 0 -3 -2 -8 -3 -8 -7 -13 -9 -9 -10 -12 0 -8 -5 -7 1 2 8
7316 8 4 10 6 7 0 0 3 6 0 13 1 7 5 4 0 11 1 7 -5 -2 -9 -3 -17 0 -6 -16 -1 -11 2 -7 -14 -8 -10 -13 -4 -1 -3 -1 -5 -6 2 2 -10 -3 8 9 -7
7363 -7 9 -2 6 5 16 7 1 3 1 9 9 10 -2 -2 1 2 -4 2 -1 -2 2 -11 -3 -3 -14 5 4 -3 -2 2 -8 -4 -7 -6 4 8 -3 6 -2 4 3 14 11 14 5 9 11 4 3 7
7413 7 0 1 7 5 4 4 2 5 1 -10 -1 -2 -12 0 0 -3 -13 -4 -10 4 0 0 0 -10 -5 -19 0 0 -5 11 -1 13 6 6 10 16 3 11 14 5 7 7 6 1 0 11 3 -2
7461 -2 -3 -2 0 -6 -12 2 6 3 -4 -2 -7 1 -2 -2 7 -1 0 0 9 1 7 4 11 4 7 6 -3 11 0 14 3 10 8 12 8 0 14 9 5 6 0 -3 0 4 -3 -3 -4 5 0 -4 -5 -5 -5 -5 -2
7516 -2 4 -3 0 3 -2 5 3 4 3 -1 0 -3 13 9 9 11 7 16 7 9 8 17 -4 10 16 1 2 5 -8 10 -3 0 3 -5 -4 -2 1 -6 -13 1 -7 -4 -7 -10 3 -12 -8 7 11 1
7566 1 -5 6 -2 1 4 0 8 4 20 10 10 4 1 12 8 2 17 1 9 5 5 6 -10 -11 -6 -5 -7 2 -5 -5 0 -13 -7 -8 3 -6 6 -9 -8 9 -4 2 3 -13 1 1
7612 1 3 1 8 8 5 12 0 2 7 2 -3 4 -1 -2 2 -6 -2 -8 -2 -9 -4 -9 7 -4 -3 -9 -7 -12 -7 7 -2 -6 1 -8 3 -13 -3 4 9 -3 8 -9 10 1 4 -3 5 -7 -4
7661 -4 12 0 10 4 3 7 7 4 0 0 1 -3 -8 -9 -1 -11 -3 -6 -6 -13 -2 -4 -6 -2 -13 -1 -3 -2 -1 -1 11 3 7 1 6 1 3 -1 8 2 7 0 14 7 3 6 7 5 12 5 -3 2
7713 2 -1 3 -5 4 -4 -5 5 -2 3 7 0 5 1 3 -5 -11 5 13 6 -1 4 -4 8 15 9 11 16 1 8 10 9 2 3 8 5 8 7 -4 0 -8 -4 -3 -4 -8 6 -4 -5 -3 5 -5 -2 -2 -9
7766 -9 -9 -11 -5 -4 3 3 -5 -14 5 -2 9 8 14 1 16 11 5 3 18 6 5 14 7 13 3 2 8 -8 -8 3 0 6 -4 -2 -2 -7 -8 -5 -9 -6 -1 -11 -8 -2 -1 4 -2 -6 -2 -9
7816 -9 4 2 -2 8 -1 7 10 14 1 6 8 13 4 -1 6 12 5 -6 -10 2 6 -1 -6 -1 -8 -4 -13 -9 -11 -18 -13 -9 3 8 -1 -2 3 -11 4 -1 1 -5 -9 8 8 3 2 8 -6 10
7866 10 12 3 11 14 9 13 1 3 1 0 9 13 5 4 -1 4 2 -9 1 0 -12 -4 -2 -6 -13 -7 -8 0 3 1 1 3 6 -2 -7 -4 0 4 3 7 14 10 8 6 9 8 10 8 2 8 10 0 9 9 5
7921 5 9 5 -11 2 -4 -4 -5 1 -3 -22 -4 -6 7 -10 -3 -7 1 -5 -1 -2 -3 7 -1 2 3 8 10 13 -2 12 4 16 0 13 15 10 8 8 7 -6 2 0 4 4 -1 0 6 -9
7969 -9 -3 -16 -7 -3 -10 6 -6 4 -3 5 -3 2 7 5 16 9 4 7 8 17 3 13 1 10 5 11 15 17 13 13 3 6 -2 5 4 -5 11 0 0 -5 3 -8 -2 -20 -4 -2 3
8016 3 -11 -6 -10 4 -4 -9 -8 -1 9 6 11 16 12 14 6 12 10 11 22 11 15 13 8 11 17 5 3 3 5 7 -2 2 1 2 -3 -7 5 8 0 -9 -13 -3 -7 -5 -6 -2 8 4 -5 5 -4
8067 -4 3 -3 11 10 16 6 20 14 17 11 15 21 8 15 8 10 11 -4 6 -4 4 -5 -3 4 -1 2 -6 -5 -3 1 4 -4 -4 4 7 -5 -2 -1 0 2 1 10 2 10 0 8 9 7 5 12 10 14
8119 14 16 12 11 -1 3 9 9 5 0 -2 0 2 -1 -9 -3 -10 -12 -8 -6 -5 -1 -11 -1 -5 -7 -4 -7 -1 -3 0 -2 0 8 -4 6 6 0 8 5 5 2 8 6 -1 9 4 0 4 11 6 2 -3 6 1
8173 1 7 -6 -2 -3 -7 -6 -10 -7 -2 -10 -4 -9 -3 -5 -6 2 8 1
8191A
##END NTUPLES=NMR FID
##END=
