##TITLE=1H_LY-DMAA.Per.1.26
 
 8 sc, 
 5.04.2022
##JCAMPDX= 6.0         $$ Bruker NMR JCAMP-DX V2.0
##DATA TYPE= NMR FID
##DATA CLASS= NTUPLES
##ORIGIN= UXNMR, Bruker Analytische Messtechnik GmbH
##OWNER= root
$$ XWIN-NMR		Version 3.5
$$ Tue Apr  5 11:32:35 2022 Russian Standard Time (UT+4h)  she@DPX200
##.OBSERVE FREQUENCY= 200.131346
##.OBSERVE NUCLEUS= ^1H
##.DELAY= (6, 6)
##.ACQUISITION MODE= SIMULTANEOUS
##.ACQUISITION SCHEME= undefined
##.AVERAGES= 8
##.DIGITISER RES= 18
##SPECTROMETER/DATA SYSTEM= spect
##.PULSE SEQUENCE= zg30
##.SOLVENT NAME= CD2Cl2
##.SHIFT REFERENCE= (INTERNAL, CD2Cl2, 0, 15.7039)
##AUDIT TRAIL= $$ (NUMBER, WHEN, WHO, WHERE, WHAT)
$$ ##TITLE= Audit trail, XWIN-NMR		Version 3.5
$$ ##JCAMPDX= 5.01
$$ ##ORIGIN= Bruker BioSpin GmbH
$$ ##OWNER= she
$$ F:/spectra/data/she/nmr/H-F/1/audita.txt
$$ ##AUDIT TRAIL=  $$ (NUMBER, WHEN, WHO, WHERE, WHAT)
(   1,<2022-04-05 11:31:28.95 +0400>,<she>,<DPX200>,
      <created by zg, POWCHK disabled, PULCHK disabled
       configuration hash MD5:
       00 E9 B6 7A A2 85 ED C7 34 08 36 98 17 FE 4E 26
       data hash MD5: 16K
       C2 36 5B 65 81 C6 50 44 8B 0A 14 19 58 F3 AA DA>)
$$ ##END=
$$ 
$$ hash MD5
$$ 28 78 8D 23 C2 AE E2 DE AC 98 93 68 08 95 51 98
##$RELAX= 
##$RELAX= 
##$RELAX= 
##$RELAX= 
##$RELAX= 
##$RELAX= 
$$ Bruker specific parameters
$$ --------------------------
##$DU= <F:/spectra>
##$EXPNO= 1
##$NAME= <H-F>
##$PROCNO= 1
##$TYPE= <nmr>
##$USER= <she>
##$AMP= (0..31)
100 100 100 100 100 100 100 100 100 100 100 100 100 100 100 100 100 100 
100 100 100 100 100 100 100 100 100 100 100 100 100 100 
##$AQSEQ= 0
##$AQ_mod= 1
##$AUNM= <au_zg>
##$AUTOPOS= <>
##$BF1= 200.13
##$BF2= 200.13
##$BF3= 200.13
##$BF4= 200.13
##$BF5= 200.13
##$BF6= 200.13
##$BF7= 200.13
##$BF8= 200.13
##$BYTORDA= 1
##$CFDGTYP= 0
##$CFRGTYP= 5
##$CHEMSTR= <none>
##$CNST= (0..31)
1 1 145 1 1 1 1 1 1 1 1 1 1 1 1 1 1 1 1 1 1 1 1 1 1 1 1 1 1 1 1 1 
##$CPDPRG= <>
##$CPDPRG1= <>
##$CPDPRG2= <>
##$CPDPRG3= <>
##$CPDPRG4= <mlev>
##$CPDPRG5= <mlev>
##$CPDPRG6= <mlev>
##$CPDPRG7= <mlev>
##$CPDPRG8= <mlev>
##$CPDPRGB= <>
##$CPDPRGT= <>
##$D= (0..31)
0 1.2 0 0 0 0 0 0 0 0.06 0 0.03 0 0 0 0 0.0002 0 0 0 0 0 0 0 0 0 0 0 0 
0 0 0 
##$DATE= 1649143888
##$DBL= (0..7)
120 120 120 120 120 120 120 120 
##$DBP= (0..7)
150 150 150 150 150 150 150 150 
##$DBP07= 0
##$DBPNAM0= <>
##$DBPNAM1= <>
##$DBPNAM2= <>
##$DBPNAM3= <>
##$DBPNAM4= <>
##$DBPNAM5= <>
##$DBPNAM6= <>
##$DBPNAM7= <>
##$DBPOAL= (0..7)
0.5 0.5 0.5 0.5 0.5 0.5 0.5 0.5 
##$DBPOFFS= (0..7)
0 0 0 0 0 0 0 0 
##$DE= 6
##$DECBNUC= <off>
##$DECIM= 32
##$DECNUC= <off>
##$DECSTAT= 4
##$DIGMOD= 1
##$DIGTYP= 9
##$DL= (0..7)
0 120 120 120 120 120 120 120 
##$DP= (0..7)
150 150 150 150 150 150 150 150 
##$DP07= 0
##$DPNAME0= <>
##$DPNAME1= <>
##$DPNAME2= <>
##$DPNAME3= <>
##$DPNAME4= <>
##$DPNAME5= <>
##$DPNAME6= <>
##$DPNAME7= <>
##$DPOAL= (0..7)
0.5 0.5 0.5 0.5 0.5 0.5 0.5 0.5 
##$DPOFFS= (0..7)
0 0 0 0 0 0 0 0 
##$DQDMODE= 0
##$DR= 18
##$DS= 0
##$DSLIST= <SSSSSSSSSSSSSSS>
$$ [...]
##$SUBNAM2= <"">
##$SUBNAM3= <"">
##$SUBNAM4= <"">
##$SUBNAM5= <"">
##$SUBNAM6= <"">
##$SUBNAM7= <"">
##$SUBNAM8= <"">
##$SUBNAM9= <"">
##$SW= 18.0517287032376
##$SWIBOX= (0..15)
0 0 2 0 0 0 0 0 0 0 0 0 0 0 0 0 
##$SW_h= 3612.71676300578
##$TD= 16384
##$TD0= 1
##$TE= 0
##$TE2= 300
##$TE3= 300
##$TEG= 300
##$TL= (0..7)
0 120 120 120 120 120 120 120 
##$TP= (0..7)
150 150 150 150 150 150 150 150 
##$TP07= 0
##$TPNAME0= <>
##$TPNAME1= <>
##$TPNAME2= <>
##$TPNAME3= <>
##$TPNAME4= <>
##$TPNAME5= <>
##$TPNAME6= <>
##$TPNAME7= <>
##$TPOAL= (0..7)
0.5 0.5 0.5 0.5 0.5 0.5 0.5 0.5 
##$TPOFFS= (0..7)
0 0 0 0 0 0 0 0 
##$TUNHIN= 0
##$TUNHOUT= 0
##$TUNXOUT= 0
##$USERA1= <user>
##$USERA2= <user>
##$USERA3= <user>
##$USERA4= <user>
##$USERA5= <user>
##$V9= 5
##$VALIST= <valist>
##$VCLIST= <CCCCCCCCCCCCCCC>
##$VD= 0
##$VDLIST= <DDDDDDDDDDDDDDD>
##$VPLIST= <PPPPPPPPPPPPPPP>
##$VTLIST= <TTTTTTTTTTTTTTT>
##$WBST= 1024
##$WBSW= 4
##$XGAIN= (0..3)
0 0 0 0 
##$XL= 0
##$YL= 0
##$YMAX_a= 413682
##$YMIN_a= -456153
##$ZGOPTNS= <>
##$ZL1= 120
##$ZL2= 120
##$ZL3= 120
##$ZL4= 120
##$ABSF1= 10
##$ABSF2= 0
##$ABSG= 5
##$ABSL= 3
##$ALPHA= 0
##$AQORDER= 0
##$ASSFAC= 0
##$ASSFACI= 0
##$ASSFACX= 0
##$ASSWID= 0
##$AUNMP= <proc_1d>
##$AZFE= 0.1
##$AZFW= 0.1
##$BCFW= 1
##$BC_mod= 2
##$BYTORDP= 1
##$COROFFS= 0
##$CY= 11.3945322036743
##$DATMOD= 1
##$DC= 2
##$DFILT= <>
##$DTYPP= 0
##$F1P= 2.36226072786647
##$F2P= -0.459571619588291
##$FCOR= 0.5
##$FTSIZE= 0
##$FT_mod= 4
##$GAMMA= 1
##$GB= 0.15
##$INTBC= 1
##$INTSCL= 1
##$ISEN= 128
##$LB= 0.24
##$LEV0= 0
##$LPBIN= 0
##$MAXI= 10000
##$MC2= 0
##$MEAN= 0
##$ME_mod= 0
##$MI= 1.114404
##$NCOEF= 0
##$NC_proc= 0
##$NLEV= 6
##$NOISF1= 3.799351
##$NOISF2= 2.8
##$NSP= 1
##$NTH_PI= 0
##$NZP= 0
##$OFFSET= 15.70392
##$PC= 1
##$PHC0= -17478.78
##$PHC1= 24.00078
##$PH_mod= 1
##$PKNL= yes
##$PPARMOD= 0
##$PSCAL= 0
##$PSIGN= 0
##$REVERSE= no
##$SF= 200.130013532006
##$SI= 16384
##$SIGF1= 3
##$SIGF2= 2
##$SINO= 400
##$SIOLD= 16384
##$SREGLST= <1H.CDCl3>
##$SSB= 0
##$STSI= 0
##$STSR= 0
##$SW_p= 3612.71676300578
##$SYMM= 0
##$S_DEV= 0
##$TDeff= 0
##$TDoff= 0
##$TI= <>
##$TILT= no
##$TM1= 0
##$TM2= 0
##$TOPLEV= 0
##$USERP1= <user>
##$USERP2= <user>
##$USERP3= <user>
##$USERP4= <user>
##$USERP5= <user>
##$WDW= 1
##$XDIM= 8192
##$YMAX_p= 0
##$YMIN_p= 0
$$ End of Bruker specific parameters
$$ ---------------------------------
##NTUPLES= NMR FID
##VAR_NAME=  TIME,          FID/REAL,        FID/IMAG
##SYMBOL=    X,             R,               I
##VAR_TYPE=  INDEPENDENT,   DEPENDENT,       DEPENDENT
##VAR_FORM=  AFFN,          ASDF,            ASDF
##VAR_DIM=   8192,          8192,            8192
##UNITS=     SECONDS,       ARBITRARY UNITS, ARBITRARY UNITS
##FACTOR=    0.0002768,     1,               1
##FIRST=     0,             0,               0
##LAST=      2.2672688,     0,               0
##MIN=       0,             -456153,         0
##MAX=       2.2672688,     413682,          0
$$ Real data points
##PAGE= N=1
##DATA TABLE= (X++(R..R)), XYDATA
0@%%%%%%%%Qj6J6j6K4l2M0n6P2q8J04j26J51j78K10k50K98l48M06m71N43o23P15
31C83q19R31j056J194j347J516j701J902k120K361k626K916l233L579l955M363
47B288m811N304n845O439p090P811q613R508j0512J1647j2944J4437j6182J8254
61I691k0757K3849k7781L2975m0185N0918o8740J05217k92166M01020O3600o93794
73d56153P53668k40847l25792M50366j22031k31559K25524Q1190k82109Q6747
83f0996L41290n41196K34241L62583p10201M59755K00060o99806O17612n9133
93A44209m66421N31527j66182k26929K93501o2548j36595O0601J83200k65959
103a11596J8756L59703m83104J71936L40042o07353L86351J33163n12765M65419
$$ y = [0, 0, 0, 0, 0, 0, 0, 0, 0, 8, -8, 8, -8, 16, -16, 24, -32, 40, -48, 56, -70, 81, -97, 113, -137, 161, -187, 219, -252, 291, -332, 383, -436, 495, -561, 633, -714, 802, -899, 1003, -1117, 1244, -1382, 1534, -1699, 1880, -2075, 2288, -2523, 2781, -3064, 3375, -3715, 4096, -4517, 4991, -5521, 6126, -6818, 7619, -8563, 9691, -11066, 12783, -14998, 17977, -22208, 28710, -40030, 65187, -226979, 174041, 237641, -456153, 297515, 56668, -269124, 181242, 59211, -172348, 53176, 134366, -147743, -60996, 280294, -260902, -26661, 335922, -374279, 85476, 285536, -414270, 203342, 144209, -322212, 209315, 43133, -183796, 109705, 47157, -89438, -28837, 154363, -111596, -92840, 266863, -216241, -44305, 295737, -311616, 74735, 207898, -304867, 160552]
113A60552q9029k65427L34454j50657m7054Q4454q017j2829r4958K12618j64548
124d0441p7017L29413l58939J06328K43714m17364K90719J9557k73538L13321
134A35753j65420k7479J45586j70058J41223q4850n840J22328k05371J83121m2757
145B6236j36191K37500j98346N2595J06301j99614J98170j12698k7993J74643
155A20603k52787J95490l988k15410L09483j98021m5789K43838k59714J07249
165I54P2109j47490J09463n0515M2658n1455r486J51758k56237J77700Q7621l50241
177b23161L72590r7925k70414M31237k55808r5072L22329k61759K1883J48021
187I1921j13596k2985N9117O7401k00495J35387J35376l75181L20670L9793m15720
$$ y = [160552, 71523, -193904, 140550, -10107, -57161, 27293, 19276, 6447, -88511, 124107, -40441, -117458, 211955, -146984, -40656, 203058, -214306, 76413, 95970, -177568, 135753, -29667, -57146, 88440, -81618, 59605, -25245, -31085, 91243, -114128, 68993, 26236, -109955, 127545, -70801, -18206, 88095, -111519, 86651, -26047, -54040, 120603, -132184, 63306, 59318, -156092, 153391, -44630, -90419, 153419, -106295, 954, 73063, -74427, 35036, -15479, 27179, -24276, -33762, 117996, -138241, 39459, 127080, -223161, 149429, 51504, -218910, 212327, -43481, -138553, 183776, -77983, -56100, 91921, -21675, -44660, 14457, 81858, -118637, 16750, 152126, -223055, 97615, 137408, -278312]
198b78312M69470j36191l00997M69421k47900j34695L30385k04984n8072J69720
208G7845m1169j37318J19576J13497l13226K22010J38460m49963L94904J9637
218A44253m43072M98964j41491l04332M51925k11097j50706K92083j29122j08683
228a01278J45904M2259k12444J27804J68487l77786K47394J52464m69659M00221
238A23366J3498m12163M55079j30439k50858L62232j59182j13928J90730m6981
248C1354j06156P0685J16879k26173Q9318K02661l69691K20139J46033m14411
258b39362L45986j695l19006L56645j18970j55086K36630j10394m7141P3460J6832
269C7899p1395j1814J59710j97365L8883K03531l12883J72625J14273l13388K69518
$$ y = [-278312, 191158, 54967, -246030, 223391, -24509, -159204, 171181, -33803, -91875, 77845, 36676, -100642, 18934, 132431, -180795, 41215, 179675, -270288, 124616, 144253, -298819, 200145, 58654, -245678, 206247, -4850, -155556, 136527, 7405, -101278, 44626, 86885, -125559, 2245, 170732, -207054, 40340, 192804, -276855, 123366, 136864, -275299, 179780, 49341, -201517, 160715, 1533, -112395, 78335, 31354, -74802, -4117, 112762, -113411, -24093, 178568, -191123, 29016, 175049, -239362, 106624, 104929, -214077, 142568, 23598, -131488, 105142, -5252, -52393, 21067, 37899, -33496, -45310, 114400, -82965, -44082, 159449, -153434, 19191, 133464, -179924, 89594]
280H9594l6161j87387K41012j27066k5723R9875q6142N3651n0782N0596O13r9672
292g7592J68985j28155j8127J70598k14063J15507N1802j73561J82651r4309k7451
303d3715J20995j53726J18590k7443q4708J61449j50782M9435Q1983j57992J34450
314D8536m0714n3338R7513r3598O9873l6407k2315J06497j64965J26758K1667
325E9507j91668K46330j20929j03330K53029k11094K1108J53762j81187P3895
335e77M1100o0185N266J6923N0677j36202J10570N8719k42255K55122m4290k34508
347a79640L41840j75212j26894L08216k28838j3369J89581j62797P005Q9271l0768
358A8395q7443R3226O0231k24572K02210L8100k99638L31338p5140k59407L80227
$$ y = [89594, 53433, -133954, 107058, -20008, -45731, 54144, -31998, 21653, -29129, 21467, 22080, -77592, 91393, -36762, -54889, 115709, -98354, 17153, 68955, -104606, 78045, -16264, -43715, 77280, -76446, 42144, 14701, -70007, 91442, -59340, -9905, 72078, -85914, 48536, 7822, -45516, 51997, -41601, 28272, -8135, -30450, 76047, -88918, 37840, 59507, -132161, 114169, -6760, -110090, 142939, -68155, -47047, 106715, -74472, -577, 40523, -19662, -14396, 2527, 53204, -82998, 27572, 86291, -155964, 99158, 54868, -179640, 162200, -13012, -139906, 168310, -60528, -73897, 115684, -47113, -40108, 49163, 18395, -69048, 24178, 84409, -140163, 62047, 100147, -199491, 131847, 56707, -202700, 177527]
369A77527j85593j42699L14654k03528m9681J92210j13307n9204J12958J3952
379E7289j65519J40889P7608k85345K53205L0877l25861L57114q3692k55976L66897
390A67486j70593j34017K73082j55688o0058J47681m6412r2882Q7055P1794k04267
401a16819J35938J06894l03031K48182L5746l06396L24936p9470k09453K98919
411A35446j42399q8823J85467r8424l8327O8901J8613r2693L6095J15771k02479
422a02852J05035J18641k73379K09604K9425k43114K57411p7346j31817K03861
432I5469j13962k3354Q3710n0021L543j5031O2590o3889k1826J34408j63154N8656
444a2861J08530k04382J51075O436j45417J72152q9513k5179R6013j02242O9260
$$ y = [177527, -8066, -150765, 163889, -39639, -89320, 102890, -10417, -69621, 43337, 57289, -108230, 32659, 110267, -175078, 78127, 109004, -216857, 140257, 56565, -199411, 167486, -3107, -137124, 135958, -19730, -79788, 67893, 21481, -71401, 15654, 87448, -116819, 19119, 126013, -177018, 71164, 106910, -199486, 125450, 45980, -163473, 135446, -6953, -95776, 89691, -8733, -47060, 21841, 40454, -52239, -16144, 99627, -102852, 2183, 120824, -152555, 57049, 86474, -156640, 100771, 23425, -108392, 95469, -18493, -41847, 41863, -8158, -4615, -19646, 42944, -20945, -42771, 91637, -71517, -12861, 95669, -108713, 42362, 48798, -96619, 75533, -13980, -39159, 56854, -45388, 23872]
455B3872k5089k2892P1997j01677Q2597r511p9863J26827r8250J3595P1910j11497
467e7981R4437l9049k9824R0435j18693Q9970j012j06968J61480j12188j7833
478d7226J37868j59721P2288M9266j12151Q6612k1887j5107J0869r230M7250r6657
490e7826Q4434K1554j54462J92282p4798j21421K36145j67825k9051J89079j85659
501f7548M3068R6568j15875L1343M0562j7639n8676P2848K7943j58772J72248
512F6070j5731j93306K63608j13657j39102K78409j87241m4635K08916j75984
522e2653Q384J16053q8877k7086P9159K521j24808J30339K5758k09039K28858
533H8609l4650k16347K97408j27999j44945K82879j77444n5610J97952j40758
$$ y = [23872, -1217, -24109, 47888, -53789, 28808, 19297, -60566, 66261, -31989, -18394, 53516, -57981, 36456, -2593, -32417, 58018, -60675, 29295, 28283, -78685, 82795, -29393, -47226, 90642, -69079, 3209, 52475, -59676, 26936, 5049, -10058, 811, -8419, 38831, -57826, 26608, 48162, -106300, 85982, 11184, -110237, 125908, -41917, -70968, 118111, -67548, -24480, 72088, -43787, -12444, 28118, 10479, -48197, 24651, 52594, -106178, 66070, 50339, -142967, 120641, 6984, -132118, 146291, -40950, -85585, 123331, -52653, -44269, 71784, -17093, -44179, 34980, 37501, -87307, 43032, 68790, -140249, 88609, 53959, -162388, 135020, 7021, -137924, 144955, -32489, -88099, 109853, -30905]
543c0905k3217J11646m5992p5170R3105L1825j69351J53806L4299k30815K41408
554I0639l5881k11751K82863j19115j27180K41187j44655m5043J45053q7141l1762
565d2786O8505R737r6446O8993P0034j84072J39787M9276k21815K17530l1637
576D7106j77331K34245j04852q3643J70542j07854j3687P1731l5141k0832J2244
587g472N5273r3486L2684R2707j67420J07505N1467j79209J68791l2453j14780
598h6393J60910r0078k0584Q2951p3276L3405j0071N408J0713n0397Q2442o2686
610a7656j3952R6882j20100O0867L8905j08556J06359m5048l0066P9330q7724
621d0759N9634o638n3975R5289q8688K7589N5489j05674Q8566j9221n1176P8833
$$ y = [-30905, -54122, 57524, 11532, -63638, 29467, 61292, -108059, 45747, 80046, -150769, 90639, 54758, -156993, 125870, 6755, -120425, 120762, -23893, -68936, 76117, -11024, -42786, 25719, 35456, -60990, 8003, 78037, -106035, 33752, 83028, -138787, 78743, 47106, -130225, 104020, -832, -84475, 86067, -21787, -35474, 36257, 1116, -19716, -7472, 47801, -45685, -13001, 79706, -87714, 19791, 71258, -107951, 60840, 28387, -86393, 74517, -15561, -36145, 46806, -26470, 6935, -3136, 2272, 12985, -37412, 45030, -17656, -31608, 65274, -54826, 6041, 44946, -63610, 42749, -2299, -32365, 46965, -40759, 18875, 12237, -41738, 53551, -35137, -7548, 47941, -57733, 30833, 11612, -39564, 39269]
633C9269n9798K3013N415k6245N1811p4126O1084O720r7571J39408q1501m8371
645f0892J52996j45550K9998R8521j38385P1262K8533p1918M0462O014l912l9489
657c2360N4091Q685j07299J39317m6344j12166J99347j26921n3804J90683j69020
668e5791J6803J25708j40461L8812O2369o5986q658N5825o404r0198J14760j0048
680C6731j43630J95526p4262j29082K35789j46742o1045K05232j68057J528J31845
691H3833j20484M950P7334m2169n5270Q6563M491j32064J51980j5401j66460K20769
703I8072q2892j32938K36837j40976o0916J87127j40112j0727J10957p8706k3083
714c7357O7238l940q7511Q7910K7513j52562J52623n180j66360K05388p2194j17088
$$ y = [39269, -20529, 2484, 7899, -18346, 33465, -40661, 20423, 27143, -70428, 68980, -12521, -60892, 92104, -53446, -23448, 75073, -63312, 7950, 36483, -35435, 5027, 11041, 7129, -32360, 21731, 30416, -76883, 62434, 16090, -96076, 103271, -23650, -77454, 113229, -55791, -38988, 86720, -53741, -14929, 47440, -18546, -27204, 28621, 22217, -67981, 46779, 36731, -106899, 88627, 14365, -114717, 121072, -25670, -86715, 118517, -49540, -48012, 83833, -36651, -31701, 45633, 3464, -51806, 34757, 39248, -92816, 59164, 43763, -122697, 98072, 15180, -117758, 119079, -21897, -82813, 104314, -35798, -46525, 64432, -14274, -37357, 29881, 25941, -61570, 26340, 53853, -98709, 53914, 48734, -117626, 87762, 15568, -101520]
726a01520J99989j16268m4582J37129r7857o944O3203k8979l2760L3831L7124
737D2366r9538O8082N0251j51430J32615L213j43800J69880o3498q0328J44362
748G2175r2496j0298P1249n7614J3026M008J4307k4608r281O7438q8607L4799
760e902O2010j22722R3130N298r5287J12333n4776k4878P1253o7924L6410l414
772E531k2938M5118n7392M4187n9n3843Q0299n6783k609N7260p3429M8741o009
785H074l1131N2983n8105M1571J007n6950R1682p0853m011Q4552j09374N7064
797F509L1943q8654P5893j7502l0693L6534j7698J2433k9856L6533K199p1034
809e3393J06223n6553n5510J40431j19327J327J17474j38699N1224O1242j02184
$$ y = [-101520, 98469, -17799, -62381, 74748, -23109, -30053, 33150, 4171, -28589, 5242, 42366, -57172, 10910, 61161, -90269, 42346, 45559, -98241, 71639, 8141, -72187, 72175, -20321, -30619, 40630, -16984, -3958, 50, 14357, -10251, -19532, 47906, -40701, -5902, 56108, -66614, 26516, 31814, -63473, 48860, -5916, -30794, 40459, -27465, 8945, 5531, -17407, 27711, -29681, 14506, 14447, -39396, 40903, -15880, -18489, 38771, -34658, 14083, 8074, -23057, 29926, -28179, 13392, 14399, -42551, 49131, -21722, -25733, 58819, -50555, 6509, 38452, -50202, 25691, 8189, -22504, 14030, -3668, 8765, -21091, 15442, 17641, -53393, 52830, -3723, -59233, 81198, -38129, -36802, 80672, -58027, -6803, 54439, -47745]
820d7745N2120K1904m2190J588L5283r159o1559R3901l0395q9065J53870q9490
832a0937o1689J70713j39775m640J34814j41393L3502P8025r3734J9675M9355
843C3916l5970l7185P4453j4937r3232J34820m7111j05149J82945j05860o5459
854g8769J81316j42324q958J32287j25632J6619P6356o8263j1007N8730j4982
865A5373p0713R2694o335j15471J49104m6106j10683J80628r8644o2321J60755
876H8281j18802j0677J03953q7840K216N3532k8140l3636M7142J5045q9213Q6204
888B8065J0723j19601J35716l4518j00123J52250q0778m6212J19085q7883o96
899b3972N9415m7434R77J7147J0685m0921K2258M2052r0742O5824K4304j06111
$$ y = [-47745, 4375, 26279, -15911, -14323, 20960, 11801, -49758, 44143, 13748, -75317, 78553, -10937, -72626, 98087, -41688, -46328, 88486, -52907, -19405, 58620, -35114, -15439, 33916, -2054, -39239, 35214, 20277, -72955, 61865, 14754, -90395, 92550, -13310, -78769, 102547, -39777, -48735, 83552, -42080, -25461, 50895, -17368, -28375, 30355, 15373, -55340, 37354, 31019, -84452, 64652, 18546, -92137, 88491, -10153, -72474, 88281, -30521, -41198, 62755, -25085, -22869, 30663, 2523, -31113, 16029, 31074, -58139, 28065, 38788, -80813, 54903, 20385, -79738, 72512, -8266, -54478, 64607, -23276, -23972, 35443, -11991, -11014, 6133, 16818, -24103, -1845, 40207, -50535, 15289, 39593, -66518]
911f6518J07404k5236p2141J08117o3501j4459O2443n6576K2329K719q341J2269
923H509k8460M4045l2883j1484O0665p3338L3904L0668p2737O5076j9819k8300
935b4154N2481m8508K7048J460l1266N3119n1701J8063L3758o9254O0264j1052
947A0258m2441O2599m0955J942K3641k7448K3649k4891K2735O17m3106P2644n2696
960a3452j6634Q6634r6847L2206N7584r9769O3587J3230o2893N1395o089j9373
972a0421M347J9268p312m0303P2154l8888m7380J13071r0112j3681J12972j21021
984d7306L1343P5918j09243N0146L5333o6168K6078K6666k7434k2952N9217k5221
996F377n8796J08896o1549n4851J37914j06771j6902J25368j24940K2745Q3689
$$ y = [-66518, 40886, 15650, -56491, 51626, -11875, -26334, 36109, -20467, 1862, 4581, -3760, 8509, -19951, 24094, -8789, -20273, 40392, -32946, 958, 31626, -41111, 23965, 4146, -24154, 28327, -20181, 6867, 8327, -22939, 30180, -21521, -3458, 30300, -38954, 21310, 10258, -32183, 30416, -10539, -8597, 15044, -12404, 11245, -13646, 9089, 9706, -33400, 39244, -13452, -30086, 56548, -40299, -8093, 49491, -50278, 13309, 26539, -36354, 15041, 8952, -10421, -6074, 13194, 5882, -34421, 37733, -1155, -48535, 64536, -25576, -39257, 73715, -47306, -15963, 59955, -49288, 858, 36191, -29977, -3899, 22767, -4667, -27619, 31598, 6377, -52419, 56477, -5072, -59923, 77991, -28780, -45682, 79686, -45254, -22509, 61180]
1007F1180j01969L0406M8128n5789j782M8250k3178m9629Q5450l0062p5667J29576
1019F4914o9242o0677J44914j06756j8841J19180j10726J4151P3235p5977J0367
1030a5458M2837k8084k8412N1717l612p1853R1063j9550q5645J26433n9381n9905
1042e9850J27733q8247j6902R2692q0697Q371M7387m0646l690K5317K180m3380
1054b9732M1607J5999p8363P9621p413p9599J05007m6045m6005R4274o5710m577
1066b0936N3066m8234J2675J0524n158o875k696L1541m6562K0362L4416p2094
1078c9971N6306L858o0831P1337l2391k0703M9352m2604J7674M158j6980K6138
1090A5343l2306K5639M97l4885N2531l5926o157M3643n0312K5736Q011k8660L1026
$$ y = [61180, -40789, -10383, 37745, -18044, -19826, 28424, 5246, -44383, 41067, 11005, -64662, 64914, -4328, -65005, 79909, -26847, -45688, 73492, -37234, -23083, 50152, -25825, -15458, 27379, -705, -29117, 22600, 18988, -52865, 38198, 18648, -66997, 59436, 55, -59850, 67883, -20364, -37266, 55426, -25271, -16900, 30487, -10159, -13849, 11468, 13648, -29732, 11875, 27874, -50489, 29132, 21719, -57880, 47127, 1082, -44923, 49351, -16359, -20936, 32130, -16104, -3429, 7095, 1937, -4938, -7634, 23907, -22655, -2293, 32123, -39971, 16335, 20193, -40638, 30699, -1692, -22395, 26957, -15647, 2027, 6185, -10795, 15343, -16963, 8676, 9173, -25712, 26819, -9107, -15264, 28379, -21933, 3803, 11814, -16846, 14180]
1103A4180k3720J3346K198k5293M5239m1170M423M4932o8438M2675J5720o1368
1115c7276N9294j5680k9488M1040k0269k306L358Q227m928k2912M9526l7886j7085
1128b6385P3587p7319J5537O4118r3775M8160L1485p6212N3502N418m0865K5926
1140C177J0267j8866j2483M4274k9258l1563Q1914o4333j7852R5686r6857J5941
1152a9953P7294j01846M1285M3608p6115L6569K4077m1494M474L6289k6379k9851
1164c2042P0944m2517m0367J01413p6299k0692J04863j00279J1719P9667r4606
1175c8196K9359M6613o3001J6454L3108k9751j8375N0287k0518m7959Q3670m0678
1187A013n0128J05915p1689k4914R8570q6467N858O6815p0865J5980L5395l5351
$$ y = [14180, -9540, 3806, 6004, -19289, 25950, -15220, -10797, 34135, -34303, 8372, 24092, -37276, 22018, 6338, -23150, 17890, -2379, -4685, -1327, 6900, 1972, -20940, 28586, -9300, -26385, 47202, -30117, -14580, 49538, -44237, 3923, 35408, -40804, 12698, 18116, -22749, 3177, 13444, -5422, -17905, 26369, -2889, -34452, 47462, -16871, -34723, 60963, -35894, -19953, 57341, -44505, -3220, 40388, -35727, 842, 24919, -16575, -12101, 24188, -2191, -32042, 38902, -3615, -43982, 57431, -18868, -39560, 65303, -34976, -23257, 56410, -38196, -8837, 37776, -25225, -8771, 24337, -5414, -23789, 26498, 5980, -41979, 41691, 1013, -49115, 56800, -14889, -39803, 58767, -27700, -21842, 44973, -25892, -9912, 25483, -9868]
1199i868l822K8697o532l8234N0508n526n9821Q0954l0224n2022R3549n7840k2294
1212c2475P6899o4259N290M2321m1957Q427J5414o817j5170J5355J5129m5958
1224b7801L8955R195n8908O4189j7134m3529O7896l9852j1883M4143l8244J0994
1236a979R035j1270P790j2449K1484j8014o123L5837m4226J9215K2180m7789L9104
1249A2795n991k4658L4073k3930P752N030j5301K4986k7948J4196J5326m1593
1261b5263M1817j1405k8297M6887l1383k667K6669k6212J1263j016J168j49j3005
1274a1593L0735l0705P36M1350n8479K9302K6885o3875N0298J221m5549M7137
1286A7463j2142k0986K2489m75j1920l668K8753k7828j0446N4522n7781O991N8058
$$ y = [-9868, -13690, 15007, 8475, -29759, 20749, 15223, -44598, 36356, 6132, -45890, 47659, -10181, -32475, 44424, -19835, -14545, 27776, -14181, -5754, 9660, 2843, -12327, 3028, 18157, -27801, 11154, 20349, -38559, 25630, 8496, -35033, 32863, -6989, -18872, 25271, -12973, -1979, 7056, -4214, 3576, -8873, 12611, -5403, -11526, 24311, -19915, -700, 21480, -26309, 12795, 6804, -17854, 16219, -7711, 41, 5071, -10230, 14756, -13192, 1004, 16330, -25263, 16554, 5149, -23148, 23739, -7644, -10311, 16358, -9854, 1409, 393, 1561, 1412, -11593, 19142, -11563, -10827, 30523, -27956, 1346, 28231, -35644, 14654, 15875, -29674, 17463, 5321, -15665, 6824, 6349, -5571, -9239, 19514, -8314, -18760, 35762, -22019, -15028, 43030]
1299D3030p8687L3639L8763p5330M7270J4568n1884L5891P571k8793Q021K4913
1311A8972k5491j4441N4278m5589j4366P3511p3005O681O8808q6045L0697M5512
1323C9522p4820L7045K4179m8630J9784K2662k8566p917M2770l0112k5341O9010
1335C9586n1108j9953Q0770p3318K070O9232p8134K1549M4307o0457K1190K6029
1347B1763l3080J7K9090j6745k6023N0505k2780l7278P2341m4326k5740P5972
1359D3716o1925k006N7798n9215J3353L1614l6642P381J7426j0517j5805K5516
1371A0694k13l7860M7280j1378m1447O3367l2791k4482N9237m4719j363L6773
1383B3098l5509R016J1933j0757j353K737J1812k4153J3805J6663m0792L3598
$$ y = [43030, -35657, -2018, 36745, -38585, 8685, 23253, -28631, 7260, 14831, -13962, -5941, 18972, -6519, -20960, 33318, -12271, -26637, 46874, -26131, -19450, 49358, -36687, -5990, 39522, -35298, 1747, 25926, -22704, -2920, 19742, -8824, -16741, 26029, -4083, -29424, 39586, -11522, -31475, 49295, -24023, -21953, 47279, -30855, -9306, 35001, -25456, -4266, 21763, -11317, -11300, 17790, 1045, -24978, 25527, 2747, -34531, 37810, -6516, -32256, 43716, -18209, -20215, 37583, -21632, -8279, 23335, -13307, -5926, 11500, 983, -14822, 10694, 10481, -27379, 19901, 8523, -32924, 30443, -2348, -26830, 32407, -12312, -13675, 23098, -12411, -3395, 8538, -2219, -3572, -835, 10977, -13176, 629, 17292, -23500, 10098]
1395A0098K376l7787M3632j7207j7538L3535k4047M089Q674j0599J0213j3296
1407g857J3971l021j7527L1766k4162l349L0135l4742J4692J2125k5051J9224
1419F204n918k199M093p921J6740k1216R015J7798l8572L2033J509l6559M3618
1432A8625j6968j9725L5654k1405m244J5689o908m677N32J6114k2619K769L1028
1445B3865m5657K0608K7530n6925L9613J0505m9612M4719m308l1458L1591l342
1457G129j8641J0802J4206k2870j106L5862m1859M643M5873o1389K2952L7585
1469C3187o6398L8353J9410n3902L7404P805l4856K0462J3331k5251O38L2383
1481B2566l3012p018N0880n2054K647N4818o6719K0563M2001o4938L0970K3978
$$ y = [10098, 12474, -25313, 18319, 1112, -16426, 17109, -6938, -2849, 5825, -4774, 5439, -7857, 6114, 3093, -14434, 17332, -6830, -10179, 19956, -14786, -94, 12031, -13020, 6204, 286, -1913, 2180, -5741, 10999, -10217, -1202, 16596, -21976, 10057, 11566, -24993, 18625, 1657, -18068, 17586, -3819, -8063, 7626, 718, -3959, -3427, 12687, -9932, -7163, 23865, -21792, -1184, 26346, -30579, 9034, 19539, -30073, 14646, 10338, -21120, 10471, 7129, -11512, -710, 13496, -9374, -10480, 25382, -16477, -11834, 34039, -27350, -4398, 33187, -33211, 5142, 24552, -29350, 8054, 15859, -18997, 1465, 14796, -10455, -9817, 22566, -10446, -17464, 33416, -18638, -15991, 38827, -27892, -7329, 34672, -30266, 704, 24682]
1493B4682m8086K4316J6219k9565N201K5042k3217j2365M3610l2855j5869N7491
1505C4604m9681l972N5733n8869J2305L9759n1543J8390K2631l2469Q307J7839
1517A3034j5722j0751K8581j2873k4462M5487k4754k2885N4330l9895p977M6764
1529B8877m4050O842K8334l2175Q859J3017j2193m257J2042J335k2174K4680r8
1542I039l1224L9013j3331k4640M2155k5558q316K9908k4740M029J0675r792K204
1555e78j635Q932j1726L62J8573k6830J3116J3586l0855K4117p1k0430K2613r788
1569f14l483P542n658O368j0791J0322J947j9637K6427j2251j4234L1315k4043
1582f790j238K2411k3003O826Q162r330J344J469O794j5367Q884J3116l1338K4926
$$ y = [24682, -23404, 912, 17131, -12434, -7233, 17809, -5408, -17773, 25837, -7018, -22887, 34604, -15077, -19049, 36684, -22185, -9880, 29879, -21664, -3274, 19357, -13112, -4805, 13034, -2688, -13439, 15142, 2269, -22193, 23294, -1460, -24345, 29985, -9910, -17887, 28877, -15173, -8331, 20003, -12172, -3313, 9704, -2489, -6746, 5296, 6631, -15543, 9137, 9039, -22185, 16828, 3497, -21143, 21012, -4546, -12862, 17046, -7694, -3665, 7010, -2782, -578, -2213, 6719, -5007, -4645, 13928, -12902, 214, 13800, -17055, 7062, 6991, -13439, 9174, -614, -4097, 3445, -2213, 4155, -6636, 3686, 5633, -14004, 12423, 172, -14062, 17253, -6790, -8028, 14383, -8620, -1794, 6368, -2962, -1618, -149, 6645, -8722, 162, 13278, -18060, 6866]
1596F866N619l5467L7323q115k6751L6942j5886j4015K4693j0277r040J0753N359
1609H004j7497O771J9757l3923J5784K2724m6181L0087J3526m5955L8246J162
1621A2505l5011L3616l083k3144J9765N082k0530P345K0693l0582O181L2041m5421
1634b0543J6414L1032n3392K9159J9737m8689L3283Q453l5437K4777P175k4369
1646a2400R748J7832k4627n60L2596l5668J265M0192m8078J2387L5134n1096K2307
1659i68K2690m2288K2102J3367k7916J0761J4786j8562l722K6107k0808j0967
1671a5418L8291l1543o441M1485m0831M877L3117l9824J2639K0196k8566R715
1683b303J2494j4540k374J5842p762j4921K6957j2102j8630L6297k2631j1223
$$ y = [6866, 12485, -22982, 14341, 6226, -20525, 16417, 531, -13484, 11209, 932, -8108, 2645, 8004, -9493, -2722, 17035, -16888, -1104, 21620, -24561, 5526, 19052, -26903, 11343, 12505, -22506, 11110, 8027, -15117, 4648, 9730, -10800, -3455, 17238, -13344, -7163, 24878, -20543, -4129, 26903, -26489, 2670, 22407, -26282, 7001, 15454, -19983, 4794, 11969, -12400, -2652, 15180, -9447, -10007, 22589, -13079, -11814, 28378, -19700, -7313, 27821, -23275, -968, 21722, -20566, 1536, 14903, -13013, -2252, 12534, -6028, -9750, 16357, -4451, -15418, 22873, -8670, -15111, 26374, -14457, -9580, 23537, -16287, -3648, 16548, -12018, -2303, 10191, -4349, -6723, 9119, 1357, -13564, 13393, 1291, -17339, 18958, -3673, -14896]
1695a4896L5251k8947P1K4168k4221N244J1278j1012k38N878J853j2859J1285
1708B855N677k2856K1840p36k2626K7561j0335j3007K2713j3593k311R876o237
1721a179P32j892P121o222m912J7408j7493J496J8234k4094J0500J0326k0478
1734a0453J3307J475r348N905N38J51p037R075J214j6827K1493o830j6995K8798
1748A4466j6806r216K6154j9933j302J6626j3218j254Q807j303j0696R931O803
1761I059k3195J9394N652l0099K9861k876k7312L3483j0755j8628K7456j0453
1773A587j2243J7025j435j4462J0731J0001k4521J3597J5851l5096K2791J2339
1785A6165l8520L0875L756l3153L1134k281k3920K3095J81j8788J2790R901k2393
$$ y = [-14896, 20355, -8592, -8521, 15647, -8574, -3330, 7948, -3064, -3302, 2576, 4429, -8430, 2855, 8532, -14324, 7516, 6780, -15846, 11715, 1380, -11627, 11086, -2507, -4818, 5058, -1179, -447, -2339, 4782, -1440, -6352, 11056, -6437, -4941, 13293, -10801, -301, 10025, -10453, 2854, 4329, -5019, 886, 1424, 1575, -5462, 3613, 4827, -12000, 9493, 2663, -14332, 14466, -2340, -11556, 14598, -5335, -6637, 9989, -3229, -4483, 4324, 3021, -7675, 2256, 9059, -14136, 5258, 10910, -19189, 10672, 7796, -19516, 13967, 3212, -15416, 12040, 1587, -10656, 6369, 4934, -9528, 1203, 11204, -13317, 280, 16131, -18965, 3826, 16165, -22355, 8520, 12276, -20877, 10257, 7976, -15944, 7151, 7332, -11456, 1334, 11235, -11158]
1798a1158Q224J9894l2074J2318K2976m0072K1037J7583m0157K6581Q912l2279
1810a8215K3475M947k2751J3504R583j9131L689J9779k4025J060K7740l2789O485
1823f649K7734l7693J4220K0324l4256J7019J2132k4628J1474R891j5751J278
1835d905J5429j3745o669K4530j9235o901K9625k6528m84K6725k8732O484J8090
1848A3684k3115P390J0494j2855O41R602n109r044J5709m760j4830K3378j0646
1861E39j2885K5779j6492n621K0262j6143K63J0821q471p74M290J783q408M988
1875f9P627j6806J1294N967j9685J6995k76j5176J6359m674p179Q856k215k592
1889a574m84O242m907n455J5140j2374l259J8565j8868K910J5117j9131O980Q511
$$ y = [-11158, -2934, 16960, -15114, -2796, 20180, -19892, 1145, 18728, -21429, 5152, 14064, -18215, 5260, 10207, -12544, 960, 10543, -8588, -4899, 14880, -9145, -8085, 19655, -13134, -6649, 21085, -16608, -2388, 17936, -16320, 699, 12831, -11797, -323, 9568, -6183, -4905, 10524, -3221, -9890, 14640, -4595, -11496, 18129, -8399, -8883, 17842, -10890, -4406, 13684, -9431, -2041, 8453, -4402, -3761, 5841, 732, -8312, 7397, 2637, -12193, 11185, 539, -12346, 13433, -3059, -8680, 11582, -4561, -4298, 6523, -1948, -2722, 1568, 3351, -5057, -69, 7558, -9248, 2046, 8013, -11672, 5323, 5047, -10129, 6230, 1556, -5623, 3233, 1018, -1574, -2058, 4184, -723, -6178, 8962, -3412, -6671, 11894, -6974, -4064, 11053, -8078, -1098, 7413]
1903G413j2940M460N420n204l735Q982j695j2278J7262m860j5420K4311j1808
1916i2j1938K5281j6109n967J9858j3782l601J3274o134p906J1282J371j6531
1929a0994J5786L506k3536K3415q26k4195K8038o911j9233K6214r108j3557J9331
1942G930m844j2412J3230L032j7575J2485R183k5324J7404R392k9926K3745M419
1955A0739k8361K6072r36k2331K2222j512j6997J4799L766j6917R208J1528k2291
1968a1011R357J6099k8632J4213J4765l0930J9043R300k7191J9015M935k0196
1980a1233J3141N968j5400N444J1979j6391J161J8678k1703K746K0930k6372P781
1993c271J7510k6129J1276J1461k0494R469P885j3365K992R781r575l812J5477
$$ y = [7413, -5527, -1067, 4353, -851, -4586, 4396, 2701, -9577, 7685, 2825, -12595, 11716, -92, -12030, 13251, -2858, -8825, 11033, -2749, -6350, 6924, 790, -7116, 4166, 5537, -10994, 4792, 8298, -15238, 8177, 7351, -16844, 11194, 4283, -14950, 11264, 2156, -11401, 7930, 3086, -9326, 3904, 6936, -10639, 1846, 11029, -14295, 3109, 12501, -17425, 6320, 10739, -17622, 8450, 7514, -14817, 7405, 5893, -11104, 3695, 7461, -9456, -248, 11280, -11011, -1654, 14445, -14187, 26, 14791, -16139, 2904, 12204, -14987, 4028, 8963, -11233, 1908, 7876, -7524, -2080, 9899, -6492, -5331, 13347, -8356, -5610, 15320, -11052, -3271, 14239, -11890, -614, 10847, -9647, -178, 7707, -5658, -2666, 7115, -2460, -6272, 9205]
2006I205j1361o374K0496j6148l708K0746j9131J110J5975j7052L457R869j0500
2019c416N19P151l727o038R656j035j1799J4931l503j2647J8175p676q822J6234
2033H003r126m033J0251n384k799M270J808o637K532P660j2837N711Q595j6638
2047h624J0153N191j5271J1450J375j0412P945J203n960J452N808n617l629J2396
2061G460r709m123J6608j4980n22J5867j6810K950J1919j3992K951Q520q490j629
2075c980R099m423q004J3899m645j2099J9510q658j1496K1994j2612p743J9687
2088A0529j2652m881J4928q359o200J2001k638j1325J3433N58j7059J8245q13
2101E767j9332K2451m830j7001K2658p640j2739J8874o259j0642J3932j189j2661
$$ y = [9205, -2156, -8530, 11966, -4182, -7890, 12856, -6275, -5165, 10810, -6242, -2785, 7084, -3416, -2897, 4254, 527, -5511, 4145, 3110, -8689, 6242, 2739, -9908, 8267, 591, -8231, 8003, -1123, -5156, 5095, -289, -3088, 1182, 2990, -3647, -1115, 6545, -6292, -581, 8014, -8624, 1529, 6720, -8551, 2899, 4274, -6138, 1807, 3010, -2950, -1498, 4310, -1307, -4936, 7460, -2249, -6372, 10236, -4744, -5266, 10601, -6209, -3259, 8660, -5332, -2381, 6139, -2351, -3980, 5119, 696, -7308, 6591, 1946, -10153, 9357, 699, -10797, 11197, -1415, -9158, 10529, -2123, -7004, 7924, -435, -6635, 5366, 2728, -8597, 4836, 5394, -11665, 6580, 5767, -13565, 8886, 4056, -12945, 9713, 2073, -10666, 8208, 1949, -8693, 5239, 4050, -8611]
2114h611J1727L936j7621J3483N934k1798J7565L901k2396K0297J10j8976J8783
2127F334j464j4703J3968J141j3232R113O288j5466P327J0752j9852R269J1629
2140A1104k2647J2782Q737k1497J4074N195j7104J1190M396j2688N832P396j1657
2153d887J585J2136j4154Q84J5190j7763L511J4274j8861O430J0496j6032O484
2166g07P040j0913K740P115p199k401J0381o821n664J4255r376n275J5853j1993
2180b965k486J3700j1688j26R457p895j012O473k735n067O906N66r649R938L32
2195C749j1716J2793k091j0261J2768l884o941R346k516n050M985J873o536K516
2209i65O524j0422L480Q558j3835O386P359j4367Q189M727j1717O896L491q202
$$ y = [-8611, 3116, 7052, -10569, 2914, 8848, -12950, 4615, 8516, -13880, 6417, 6527, -12449, 6334, 4870, -9833, 4135, 5276, -7956, 1157, 7445, -8021, -694, 10058, -9794, -525, 11104, -11543, 1239, 9976, -11521, 2553, 7748, -9356, 1834, 6230, -6458, -626, 6770, -4887, -3302, 8834, -5320, -4436, 10754, -7009, -3498, 10776, -8085, -1655, 8841, -7191, -707, 6333, -4580, -1840, 5275, -1924, -4325, 6056, -765, -6429, 7826, -1550, -6825, 9028, -2965, -5451, 8249, -3439, -3565, 5892, -2003, -3015, 3458, 723, -4344, 2562, 3128, -6521, 3417, 3749, -7967, 4826, 2735, -7526, 5242, 1358, -5583, 3763, 1247, -3803, 1182, 3055, -3481, -965, 5559, -4863, -1383, 7175, -6660, -274, 7085, -7282, 907, 5634, -6083, 813, 4304, -3898]
2223c898K767N697o804j353R945q614l007J3693j1966j643J4555j4210Q53J2498
2237H513j3199J626R787r817n64R225o264m929J1590n200q621J5443p054r400
2251h864J7943r777p556J7482j0779n271J4610q784n000J1879m968p701J1654
2264D868j831j1606J4053j524j4163J7107l677j3660J8259n850j1153J6336n658
2277A501r113J2915k844r384J0353Q97j2174J0476L563j5592J2607L387j7009
2290a0417J4775J227j5541J4592j73j2717J1788O29j0729Q075L717j1303N891
2303a86P205j3836O094Q850j6069Q069P750j6131R323N409j3643Q171M210j0525
2317e309N042N313q797J530Q407r623p7J1090j1847P89J1478j3084K661R620j2043
$$ y = [-3898, -1131, 4566, -2238, -3591, 6354, -2260, -5267, 8426, -3540, -5183, 9372, -4838, -3985, 8513, -4686, -3060, 6727, -3090, -3654, 5571, -693, -5622, 5968, 768, -7853, 7590, 536, -8864, 9079, -698, -8254, 9228, -1551, -6822, 7788, -996, -5996, 5883, 915, -6786, 4868, 3037, -8569, 5484, 3960, -10203, 6904, 3227, -10433, 7826, 1976, -9177, 7159, 1501, -7612, 5303, 2459, -6925, 3428, 4325, -7849, 2627, 6190, -9402, 3205, 6592, -10417, 4358, 5585, -9956, 4636, 4463, -8254, 3534, 4163, -6566, 1509, 5226, -6077, -186, 7019, -6817, -723, 8127, -7942, 127, 7877, -8254, 1069, 6478, -7165, 1006, 5216, -5309, -267, 5046, -3751, -2221, 6186, -3437, -3514, 7576, -4271, -3482, 7996, -5088, -2427, 7193, -4850]
2332d850L216P149q858J368O339n691k100P812m406n013J0332n273n919J2125
2346F231o943m631J1518p376k935Q977n428k905O564j993m999N853Q85q014P249
2361B053J778j0195R219P19j0158R973o71q321Q404m76o612N506J861o712L230
2376d02N105q834K916P302j1342M359P368j2416N769N898j1286N649M700q984
2390d198L326N545p493K30Q055p786j652J0767r592j684J2204j1322l41J1513
2404G572j1400N34R894r571l73Q944p071k877R733n606n609J1923n993o949J3965
2419G116p535o422J4385q603m935J2893p907m251J0818n515n441R881k948p848
2433f312J0757j940j0006J2643k599j0508J3759l853r461J3159m115q034J1075
$$ y = [-4850, -1634, 5515, -3343, -1975, 4364, -1327, -3427, 4385, -21, -5034, 5298, 25, -5894, 6231, -712, -5343, 6175, -1201, -4136, 4841, -587, -3492, 3072, 1079, -3920, 1933, 2818, -5196, 2053, 3831, -6364, 2855, 3574, -6584, 3389, 2718, -5603, 2801, 2325, -4287, 1219, 3080, -3632, -402, 4703, -4131, -1215, 6087, -5255, -896, 6472, -5944, -175, 5723, -5563, 86, 4786, -4198, -872, 4673, -2820, -2590, 5465, -2321, -3973, 6794, -2798, -4482, 7722, -3600, -3941, 7572, -3828, -3294, 6600, -2971, -3344, 5600, -1471, -4348, 5385, -221, -5830, 6093, 100, -6849, 7116, -419, -6841, 7544, -1059, -5994, 6899, -1008, -5259, 5559, 44, -5397, 4484, 1536, -6312, 4445, 2505, -7501, 5142, 2543, -7965, 5794, 1941, -7520, 5639, 1524, -6510, 4565]
2446D565k670p661Q918j13r024Q177K171j1151Q929K954j2594J0183K084j2298
2460g530J0559J002j0615R107J053q988O679K754q681M621N111r819M024O685
2474E962j1423M872O727j1915N803N475j0850N459M455q740L660M717p172J277
2488a693O345o965n18Q364q082o71R225r016J32Q577q678O67P164o984k36O278
2504C909m761k231O611l243m513Q057l086n755R535l987n531R565m352m619Q291
2519C890l429m288O616j488n118N645O62o924O002J826q651P102J701r086P807
2534B267Q17q271P312O79p231N696J749o757L783L873p699L055N641r185L429
2549h42O304j0262M193N871j0013M336N204q732L047N373p462J116O618p174n69
$$ y = [4565, 1895, -5766, 3152, 3039, -5985, 2192, 4363, -6788, 2141, 5095, -7499, 2684, 4768, -7530, 3029, 4031, -6584, 2523, 3576, -5412, 1267, 4021, -4660, -39, 5072, -4747, -723, 5962, -5461, -589, 6138, -5777, 26, 5501, -5349, 110, 4565, -4175, -515, 4202, -2970, -1693, 4652, -2313, -2831, 5533, -2549, -3220, 6005, -3011, -2879, 5698, -2980, -2313, 4851, -2133, -2369, 3909, -852, -3083, 3528, 285, -4228, 3829, 743, -5012, 4523, 536, -4995, 4570, 218, -4401, 3890, 461, -3827, 2789, 1301, -3817, 1828, 2490, -4434, 1568, 3394, -5257, 1845, 3546, -5540, 2267, 3084, -5187, 2125, 2804, -4427, 1269, 3018, -3739, 44, 3917, -3782, -727, 4914, -4271, -842, 5462, -4800, -607, 5264, -4749, -413, 4791, -3941, -894, 4479, -2983, -1867, 4751, -2423, -2992]
2564b992Q480p961j027R666q927p51R814r351MQ825q397k95Q043o872j582Q042
2580D719n520l478R194n174m788J0507n849m904J1084o453m309J0545o285l795
2594d506R341n047m128Q337l155n645Q390j839p306R310j802p938J0061k193p784
2609e904R996k440p062Q925j855o409P301j82o991O354J510q220O414K442r295
2624e416P014K283r359P227J806q632O672J647p598N217K432o989L670L852p417
2639c591K953N116q241K864N673q769L280N254q316L223M642p222K221M648o005
2654b270O47N433n430q84O723n729j452P546o210j328P529o236j013O765n284
2669a193j490O161l894k626O097k651m032O697k148n128P544k352n376P812k647
$$ y = [-2992, 5488, -2473, -3500, 6166, -2761, -3512, 6302, -3049, -3045, 5780, -2617, -2912, 5131, -1741, -3323, 4719, -801, -4279, 4915, -259, -5047, 5460, -389, -5293, 5791, -662, -4971, 5574, -711, -4506, 4835, -212, -4340, 3997, 842, -4803, 3587, 1748, -5558, 3752, 1950, -5988, 4073, 1880, -5904, 4092, 1652, -5410, 3515, 1660, -4749, 2552, 2370, -4621, 1733, 3243, -4977, 1437, 3879, -5416, 1598, 3881, -5478, 1749, 3555, -5077, 1595, 3242, -4356, 861, 3293, -3696, -26, 3826, -3591, -638, 4478, -3763, -899, 4774, -3995, -715, 4539, -3777, -554, 4088, -3134, -913, 3735, -2270, -1623, 3810, -1620, -2504, 4219, -1510, -2962, 4584, -1626, -2954, 4575, -1661, -2674, 4091, -1193, -2683, 3478, -416, -3042, 3055, 404, -3628, 3069, 921, -4207, 3337, 985, -4391, 3421, 774]
2684G74m898P249k234m701O309j171m999N581J97n949N290J258p027N774J547
2699C000p592O214J337p460O027J253o836N120J855o492L881L023o712K999M289
2714C906p448K821N131q197L065N275q327L163M917p719K536M901o820J396N462
2729D062o385K95O455o536m86P363o996n22P711p229l19P302o807m45O862n952
2745a627j065O685m929k214P088m384l224P803m423l758Q421m763l596Q200m551
2760c37l399P528l790l627O923k721m351O672j664n408O957j206o062P354j138
2775A731o255P371j172n938O752q03n589N870M7n713N109J084o256M749J921o879
2791c971M928K173p179N013K041o858M620K086o274L849K440n877K857L314n919
$$ y = [774, -4124, 3125, 891, -3810, 2499, 1328, -3671, 1910, 2107, -3842, 1448, 2706, -4321, 1453, 3000, -4592, 1622, 2959, -4501, 1526, 2779, -4057, 1063, 2918, -3574, 307, 3330, -3382, -383, 3906, -3542, -721, 4410, -3787, -722, 4553, -3774, -611, 4306, -3413, -877, 4024, -2796, -1400, 4062, -2323, -2028, 4427, -2109, -2595, 4768, -2228, -2750, 4961, -2268, -2587, 4715, -2092, -2537, 4325, -1627, -2692, 3993, -936, -3150, 3938, -446, -3670, 4133, -290, -4048, 4373, -390, -3986, 4214, -337, -3736, 3792, 2, -3625, 3298, 577, -3774, 2898, 1234, -4174, 2783, 1577, -4485, 2869, 1731, -4524, 2847, 1675, -4263, 2489, 1686, -3903, 1967, 2014, -3699, 1410, 2494, -3762, 987, 2908, -3971, 957, 3130, -4049, 964, 3005, -3853, 767, 2853, -3421, 428, 2868, -3009, -152, 3162, -2757]
2806b757K053M225o246J778M776o608J739M803o377J596M619n911J060M613n182
2821a819J67M909m491r83N633m422j626O266m534j866O408m565j749O150m127
2836f49j995N698l267k623N544k328l497N715j792m310O178j714m608O296j670
2851I78m568O128j535m381N529q58m594N047%n107M714P66n619M654J353o213
2867c706M811J468o259M737J536o064M277J908n895L503K539n833K838L360o180
2882b960K442M028o572K466M254o599K348M141o338K048M203n874J307M482n431
2897b055N45N025n336pN559n484l10N850n487l66N772n292n24N565m746r00N463
2914C272m078j703N700l653k361O035l404k895O308l262l146O332l037l209O043
$$ y = [-2757, -704, 3521, -2725, -947, 3829, -2779, -1040, 3763, -2614, -1018, 3601, -2310, -1250, 3363, -1819, -1652, 3257, -1234, -2217, 3416, -1006, -2632, 3634, -900, -2766, 3642, -923, -2672, 3478, -649, -2644, 3054, -213, -2836, 2708, 380, -3117, 2598, 806, -3504, 2674, 960, -3648, 2648, 978, -3590, 2538, 1003, -3378, 2151, 1293, -3301, 1746, 1746, -3361, 1353, 2119, -3500, 1154, 2507, -3706, 1105, 2573, -3686, 1051, 2587, -3477, 800, 2708, -3187, 316, 2855, -2978, -140, 3220, -2960, -518, 3510, -3062, -596, 3658, -2941, -593, 3548, -2790, -742, 3461, -2413, -1106, 3376, -2055, -1510, 3515, -1821, -1828, 3731, -1753, -2063, 3787, -1700, -2066, 3706, -1586, -2110, 3455, -1291, -2191, 3272, -806, -2509, 3191, -462, -2823, 3212, -192, -3087, 3221, -41, -3187, 3145, 108, -3101, 2942]
2929B942k680l355N690j991l739N393j241m301N340p00m748N436n65m984N435
2944A932l78m937N113p0m866M603M37m866M022J137n122L737J660n456L618J994
2960B558n551L426K141n556L258K361n318K736K612n088K153K994m938J531L585
2975B904m999J135M051n144R14M251n043O86M354m808K66M402m326l16M567l969
2991a075q89M862l657j477N193l586j767N380l454j893N206l193k089N116k736
3006e9k508M970k155k934M934j692l391N107j547l668N083j251l837M946r70m004
3022b976M726n61m059M358%m378M150N48m758L918J058n002L877J293n169L762
3038G87J445n143L432J801n058L043K148n007K565K596n089K200L073n139J868
$$ y = [2942, 262, -3093, 2597, 606, -3133, 2260, 1019, -3282, 2058, 1358, -3390, 2046, 1481, -3503, 1932, 1554, -3383, 1730, 1660, -3206, 1397, 1834, -3032, 990, 2127, -2995, 742, 2402, -3054, 564, 2558, -2993, 433, 2574, -2982, 276, 2637, -2681, 55, 2667, -2421, -268, 2726, -2212, -681, 2904, -2095, -960, 3091, -2053, -1139, 3112, -1931, -1245, 3109, -1699, -1433, 2969, -1357, -1673, 2894, -1075, -1964, 2898, -759, -2236, 2957, -629, -2396, 2984, -470, -2363, 2843, -350, -2439, 2677, -59, -2567, 2403, 248, -2686, 2248, 556, -2835, 2272, 725, -2943, 2140, 889, -2948, 1998, 1028, -2976, 1750, 1189, -2870, 1488, 1488, -2890, 1260, 1808, -2950, 968, 2026, -2976, 901, 2194, -2975, 787, 2232, -2911, 521, 2322, -2736, 307, 2455, -2552, 13, 2609, -2480, -280, 2793, -2346, -478]
3053d78L338n187J753L435m986J394L534m773J048L726m531O36L880m276Q5M261
3069B859m217j75M447m154m79M515l840o82M466l573j111M600l255j553M692k846
3085c06j953M717k540k361M883k316k691M952k154k772M655j678k989M485j287
3100F45l292M377q05l572M237m56l861M205j94m017M055P3m076L821L79m081L479
3117I17P76m168L171J134m314L008J482m413K714J838m566K574K064m458K194
3132d7K355m410J817K601m320J539K955m317J116L267m304Q22L478m134M82L680
3148B580m022J78L828l783j74L966l549n77M016l273r15M228l151j187M303k932
3164d64j500M346k697j711M371k527j944M247k061k243M246j861k462M243j507
$$ y = [-478, 2860, -2327, -574, 2861, -2125, -731, 2803, -1970, -922, 2804, -1727, -1091, 2789, -1487, -1402, 2859, -1358, -1533, 2914, -1240, -1719, 2796, -1044, -1726, 2740, -833, -1944, 2656, -599, -2152, 2540, -306, -2259, 2458, -82, -2443, 2440, 124, -2567, 2385, 231, -2541, 2114, 436, -2553, 1932, 645, -2647, 1730, 925, -2647, 1590, 1134, -2727, 1478, 1284, -2733, 1322, 1395, -2681, 1140, 1519, -2562, 917, 1693, -2475, 696, 1830, -2484, 524, 2006, -2407, 307, 2145, -2421, 153, 2217, -2241, -47, 2308, -2102, -285, 2316, -2004, -465, 2490, -1827, -711, 2556, -1748, -926, 2552, -1582, -1100, 2580, -1442, -1264, 2564, -1219, -1393, 2573, -976, -1553, 2463, -810, -1725, 2503, -648, -1835, 2468, -464, -1964, 2382, -315, -2026, 2345, -182, -2126, 2121, 60, -2183, 2063, 202, -2260, 1983, 476]
3179D76k836M206j278k998M160r68l209M015o04l448L885k45l627L662J34l838
3195b513L594L87l951L396O87m050L200R75m144L058J198m123K697J531m116K394
3211B20J779m166K088K230m170J840K332m102J611K533m007J365K652l860J022
3226f33K907l763O48L110l628L85L261l466K1L507l401k37L561l219n13L717k957
3243g00q19L735k752j152L829k432j546L888k163j827L976k062k044L959j724
3258A66k254L879j451k453L719j029k737L602p27k887L536n31l036L436k56l225
3274b248L418q4l314L266K22l402K949N72l500K778Q51l614K603J139l694K403
3290C45J408l784K206J652l811K071J810l723J697K122l703J364K440l687J067
$$ y = [476, -2360, 1846, 568, -2430, 1730, 762, -2447, 1568, 964, -2484, 1401, 1156, -2471, 1191, 1325, -2513, 1081, 1468, -2483, 913, 1600, -2450, 750, 1725, -2419, 639, 1837, -2286, 411, 1942, -2174, 220, 1999, -2167, -79, 2151, -2019, -179, 2153, -1949, -338, 2195, -1812, -447, 2205, -1655, -633, 2274, -1489, -841, 2269, -1359, -974, 2287, -1179, -1158, 2349, -1052, -1289, 2272, -947, -1460, 2257, -700, -1519, 2216, -536, -1688, 2141, -291, -1837, 2051, -112, -1939, 2037, -25, -2069, 1890, 166, -2088, 1791, 340, -2113, 1606, 577, -2160, 1442, 715, -2172, 1364, 833, -2203, 1233, 977, -2248, 1170, 1086, -2228, 1038, 1260, -2142, 807, 1379, -2121, 657, 1508, -2106, 497, 1636, -2058, 345, 1753, -2031, 175, 1827, -1984, 87, 1897, -1826, -129, 1993, -1710, -346, 2094, -1593, -526]
3305e26K711l702Q33K850l594O40K984l502L65L103l306N4L201l091j95L261k886
3322h00n58L465k757p95L561k688r94L627k519j138L514k181j420L537j973j654
3338a773L481j636j930L549j419k268L641j229k374L531j087k528L501q32k627
3353b000L249m74k783L058j11k964K956K40l239K903L99l261K732O06l294K616
3369F33P65l300K285J067l235K058J267l258J802J571l288J546J780l350J463
3384a94J987l336J278K021l148R39K216l005O73K392k929L68K564k787K3K860
3400A922k837j45K969k767k21K889k478n82L050k293p94L068k072j166L143j829
3416a43j438L251j660j663L267j480j845L239j284j977L131j060k067K995p52
$$ y = [-526, 2185, -1517, -684, 2166, -1428, -788, 2196, -1306, -941, 2162, -1144, -1090, 2111, -980, -1175, 2086, -800, -1358, 2107, -650, -1445, 2116, -572, -1566, 2061, -458, -1596, 1918, -263, -1683, 1854, -119, -1773, 1708, 72, -1858, 1691, 272, -1996, 1645, 416, -1958, 1573, 486, -2042, 1459, 627, -2000, 1249, 775, -2008, 1050, 939, -2025, 931, 1171, -2068, 835, 1234, -2027, 705, 1311, -1983, 633, 1398, -1902, 383, 1450, -1785, 273, 1540, -1718, 84, 1655, -1633, -87, 1693, -1657, -194, 1793, -1543, -265, 1756, -1392, -453, 1763, -1242, -569, 1823, -1106, -738, 1826, -961, -938, 1922, -915, -1060, 1909, -858, -1079, 1810, -668, -1250, 1800, -493, -1287, 1781, -291, -1457, 1686, -143, -1581, 1670, 10, -1653, 1614, 134, -1711, 1528, 244, -1733, 1398, 338, -1729, 1266, 514]
3431E14k272K905m62k468K846k42k648K824j57k677K765Rk762K627K33k788K349
3448E96N89k927K175R26l124K032J187l160J914J348l308J836J520l255J614J666
3464A629l122J307J868l068J090K040l080P59K408l062O42K449k998M15K546k940
3480a117L89K491k700R8K502k472j63K704k365m82K838k311o69K991k166q25K987
3497A730k083r81L031j955j130K908j588j387K890j289j660K906j117j938K991
3512A328j003k000K938p78k160K835o43k142K656m29k261K515n8k360K304K12
3528I54k595K265L91k638K153N18k617K018O46k596J790Q67k518J541J053k540
3544a308J335J355k675J162J539k657J119J591k679R16J727k540P64J771k432
$$ y = [514, -1758, 1147, 685, -1783, 1063, 821, -1827, 997, 840, -1837, 928, 937, -1825, 802, 1035, -1753, 596, 1185, -1742, 433, 1359, -1765, 267, 1454, -1706, 208, 1556, -1752, 84, 1604, -1651, -37, 1629, -1493, -186, 1682, -1386, -296, 1744, -1336, -577, 1831, -1231, -589, 1860, -1138, -723, 1823, -1117, -728, 1763, -937, -839, 1663, -809, -972, 1732, -633, -1115, 1723, -588, -1257, 1734, -432, -1257, 1730, -353, -1334, 1697, -258, -1388, 1520, -68, -1455, 1435, 146, -1514, 1392, 275, -1663, 1328, 325, -1675, 1263, 485, -1675, 1160, 517, -1625, 1031, 602, -1659, 856, 798, -1562, 742, 954, -1641, 624, 1015, -1623, 530, 1048, -1569, 449, 1095, -1501, 289, 1156, -1362, 179, 1232, -1308, 27, 1382, -1293, -131, 1408, -1249, -130, 1461, -1218, -302, 1425, -1115, -351, 1420, -1012]
3559a012M79J986k335J68K222k232j16K439k317k16K559k231l44K493k010n13
3575i80K485j902o61K402j532j023K490j289j314K623j282j372K688j259j437
3590a363K660j117j581K573q66j712K420n72j859K318l03k117K400k23k192K331
3606G97M1k480K375J10k363K145K77k336J904N83k489J763Q15k568J631J119k772
3623a448J542J251k780J486J281k664J321J379k626J114J510k500Q70J693k467
3638a038O28J872k457N22K004k557M65K067k406K92K091k266Q4K119k091j20K144
3655A353j849m16K334j860n78K402j756p22K499j673q61K421j470r37K358j291
3671d6j108K237r60j387K362p96j635K421p38j763K399o19j690K255n00j782K205
$$ y = [-1012, -533, 1453, -882, -714, 1508, -724, -840, 1599, -718, -934, 1625, -606, -950, 1543, -467, -980, 1505, -397, -1058, 1344, -188, -1211, 1279, -10, -1324, 1299, 17, -1355, 1333, 74, -1363, 1297, 180, -1401, 1172, 306, -1406, 1014, 442, -1417, 901, 598, -1519, 881, 658, -1534, 797, 838, -1642, 733, 843, -1520, 625, 902, -1434, 470, 1053, -1436, 327, 1142, -1426, 205, 1324, -1448, 94, 1345, -1435, 51, 1332, -1332, -11, 1368, -1258, -144, 1366, -1134, -264, 1429, -1038, -410, 1462, -995, -473, 1531, -1026, -561, 1506, -900, -608, 1483, -783, -699, 1420, -671, -791, 1353, -496, -912, 1422, -438, -1016, 1386, -370, -1092, 1407, -266, -1127, 1294, -176, -1113, 1245, -46, -1154, 1083, 123, -1264, 1098, 302, -1333, 1088, 350, -1413, 986, 367, -1323, 932, 432, -1350, 855]
3688H55l34j824J904K8j886J803J76j966J709L68k161J767M55k202J679N23k065
3705a171J417P32k109J251R29k103R99J195k176Q64J396k198P44J508k241O43
3721c20J564k116N58J547k039L79J643j946J55J799j805j77K057j824l23K063
3737A215j652l47K076j672m87K087j479o58K038j236q79K085j111j092K229j045
3753G2j211K227r70j276K197r17j241K095p18j411J996m73j574J952k62j748J904
3770F42m8j898J977L6k060J965J63k089J818K59j997J641N00k105J491O29k070
3787a146J313Q58k240J309R65k180J169J054k232J157J059k130R65J150j966O53
3803b42J373j949N38J482j986L87J593j973L24J708j976J82J750j877R4J714j686
$$ y = [855, 521, -1303, 601, 629, -1257, 546, 722, -1244, 465, 833, -1328, 439, 894, -1308, 371, 894, -1171, 246, 978, -1131, 120, 1049, -1054, -55, 1140, -1036, -172, 1224, -974, -230, 1278, -963, -320, 1244, -872, -314, 1233, -806, -427, 1216, -730, -575, 1224, -581, -758, 1299, -525, -848, 1215, -437, -784, 1292, -380, -867, 1220, -259, -917, 1121, -115, -994, 1091, -20, -1112, 1117, 72, -1139, 1088, 118, -1158, 1039, 122, -1119, 976, 258, -1153, 843, 370, -1204, 748, 486, -1262, 642, 594, -1304, 673, 709, -1351, 614, 777, -1312, 506, 765, -1232, 409, 909, -1196, 295, 924, -1146, 167, 1025, -1215, 94, 1059, -1121, 48, 1102, -1130, 27, 1086, -1044, -79, 1071, -895, -242, 1131, -818, -280, 1202, -784, -397, 1196, -777, -453, 1255, -721, -539, 1211, -666, -572, 1142, -544]
3820e44r8J767j565k90J882j461n86K014j395o55K051j282p47J987j258p97J966
3837I89j019r06J858q97j042J862o05j297J814m49j414J908m90j417J865m22j439
3854a101J720j91j466J615o5j527J483J69j667J355L88j745J360M72j872J296
3870B24N55j802J161O09j678R89P94j657P72R39j706O94J137j823N59J284j781
3887g30M51J382j859M35J333j626K09J448j592J5J522j461j13J646j455k41J702
3904A066j430l42J773j378m14J804j349n13J731j092o59J709q93r24J813r01r41
3921i40J864q02j135J841o27j241J921o85j234J733l54j334J595j99j419J612
3937E96l0j708J650O9j700J628R4j703J613J23j669J439K70j653J204N09j682
$$ y = [-544, -642, 1125, -440, -730, 1152, -309, -895, 1119, -276, -931, 1120, -162, -909, 1078, -180, -977, 989, -30, -936, 922, 25, -1017, 845, 240, -1057, 757, 308, -1106, 802, 312, -1105, 760, 338, -1101, 619, 428, -1038, 577, 512, -1015, 468, 637, -1030, 325, 713, -1032, 328, 800, -1072, 224, 779, -1023, 138, 747, -931, 58, 852, -805, -33, 906, -800, -106, 1031, -792, -233, 1051, -730, -279, 1103, -756, -321, 1012, -614, -405, 1043, -549, -534, 988, -473, -586, 1060, -395, -636, 1066, -364, -706, 1067, -311, -725, 1079, -270, -783, 948, -144, -803, 906, 13, -911, 902, 1, -940, 924, 122, -1013, 828, 201, -1040, 881, 196, -1038, 695, 341, -993, 602, 403, -1016, 596, 566, -1142, 508, 577, -1123, 505, 599, -1104, 509, 632, -1037, 402, 672, -981, 223, 732, -950]
3954i50J136O22j743J035Q02j902J012Q85j790Q79Q81j725Q19R93j785O45J164
3971I78j642M27J249j580K30J403j702K97J327j591J96J435j539K8J452j473l3
3988e38J494j281l28J570j156m76J622j076n95J673j073o22J660r50o68J562q80
4005f2p10J498o78q55J494n31j035J562m42j145J502l46j167J558l12j233J494
4022E92k13j228J291n1j268J232K11j458J138L89j502J111M05j486J029M50j507
4039h65R38O38j554R12O46j478P25Q07j448N22R88j505N31R89j488M45J111j506
4057e92L29J101j440L56J079j356J24J281j273r6J348j207k04J455j214k96J511
4074I06j167l36J465j051m62J499r60n70J465q14p54J494o64q56J546o19r60J559
$$ y = [-950, 186, 808, -935, 100, 902, -1000, 12, 897, -893, -14, 867, -858, -39, 954, -831, -186, 978, -664, -237, 1012, -568, -338, 1065, -637, -340, 987, -604, -408, 1027, -512, -484, 968, -505, -538, 956, -325, -653, 917, -239, -715, 907, -169, -764, 909, -164, -786, 874, -76, -744, 818, -62, -772, 726, 48, -807, 687, 156, -879, 683, 241, -904, 598, 252, -915, 643, 331, -902, 592, 379, -849, 442, 391, -877, 355, 566, -892, 246, 635, -867, 244, 649, -837, 192, 642, -865, 73, 711, -843, 69, 715, -763, -38, 769, -679, -157, 831, -674, -143, 846, -642, -197, 914, -592, -263, 838, -602, -246, 833, -523, -399, 882, -391, -487, 861, -346, -550, 905, -309, -605, 906, -261, -597, 868, -183, -645, 854, -106, -676, 789, -25, -779, 715, 51, -805, 741, 122, -838, 721]
4092G21n64j004J542n46j011J509l78j119J436k85j219J404p3j290J295K6j330
4109h86J292J53j449J234J98j427J215J74j317J041L61j387R54M97j411Q20O60
4126G22j458Q34O54j485P48P62j524O86Q62j484N48Q54j322L79R65j256K92J114
4144H91j382J30J151j282J38J154j238K1J224j207j4J165j055j99J254r42l41
4161e32J262r17m47J401r27m65J349q04n18J266p14n80J228n84o92J284n17q13
4179g20J214k75r26J228k41j119J383k47j094J209j04j041J093J9j103R83J91
4196D50j222J032K58j258R22L61j308R24M46j321P92N48j307P39N77j226N42O84
4214F33j229M79Q04j226L38R51j285K93J019j320L62R04j156J91R74j157R3J031
$$ y = [721, 157, -847, 695, 149, -862, 647, 269, -850, 586, 301, -918, 486, 413, -877, 418, 444, -886, 406, 559, -890, 344, 542, -885, 330, 504, -813, 228, 589, -798, 156, 653, -758, 62, 722, -736, 98, 752, -733, 15, 777, -747, -61, 801, -683, -135, 719, -603, -224, 741, -515, -223, 891, -491, -361, 790, -492, -354, 800, -438, -417, 807, -400, -414, 751, -304, -503, 751, -191, -532, 730, -187, -634, 767, -160, -625, 724, -80, -598, 668, -46, -626, 602, 18, -674, 610, 93, -720, 494, 219, -707, 521, 280, -839, 544, 297, -797, 412, 308, -733, 360, 379, -724, 259, 450, -772, 260, 518, -740, 182, 543, -765, 159, 605, -716, 76, 624, -683, 56, 633, -593, -51, 633, -596, -117, 687, -539, -201, 750, -535, -242, 777, -543, -181, 723, -433, -242, 732, -425, -332, 699]
4232F99j064k3J103j034j89J259j000k71J231r06l82J303r33l80J334q24m83J227
4250F67o52o56J228n60p27J300n04q40J376m98q61J313m51q39J226l54q41J124
4268D51k01r11J045o6j067J138j6j084J055L5j177J049J84j197J001K31j183R62
4286B49K09j160Q36M11j196O82N40j191O48N46j183N66O88j202N52O28j217N52
4304d2O65j114L40P42j060K41Q76j043R3R77j034P8R69j063M7R63r46o7R88q41
4324b31j70R55p11l21J025o62l86J126p19m17J097o51m29J028n37n27R57m04n75
4343e52J036l39p21R77k03p97R64r9r40J035j24q86J009p6r05R25j7q17P63J64
4363C97r95P87K42j045P57L18j074O85M03j147P63M39j109N80M75j022N57N14
$$ y = [699, -365, -388, 715, -319, -508, 751, -249, -520, 711, -195, -577, 726, -207, -587, 747, -77, -560, 667, 15, -641, 587, 27, -700, 600, 96, -744, 632, 134, -727, 586, 135, -704, 522, 168, -673, 451, 250, -661, 384, 318, -749, 389, 373, -711, 344, 379, -798, 251, 435, -762, 239, 470, -713, 249, 458, -702, 134, 545, -651, 31, 571, -620, 28, 574, -609, -43, 645, -557, -5, 623, -594, -42, 623, -491, -151, 591, -469, -228, 648, -395, -302, 675, -359, -281, 688, -375, -328, 635, -311, -378, 610, -231, -401, 554, -157, -478, 547, -115, -501, 625, -94, -511, 586, -65, -494, 534, -3, -530, 427, 23, -552, 484, 145, -576, 401, 198, -599, 365, 266, -674, 361, 237, -649, 360, 284, -621, 304, 287, -530, 233, 397, -598, 189, 431, -614, 143, 461, -613, 72, 475, -672, 91, 530, -579, 1, 476, -546, 11, 525]
4381E25r77M08N52r73L09P75j063K70P72j041K21Q36r77J28Q31r29L5Q88q97l
4401c10R09q02k07J024q21k61J061p79k93J095p94l02J129p67l30J048o37m58
4419d95R94m98n63J049m48o29J066l26p26J097m08o90R79k71p00J015k46p56R15
4438C59q5q32Q67M0r58Q95M6r90Q71J11r76R44M1r28P82J68r15O32L26r40N92
4459E0M56j019N34N07j057N40M57r58M71N57r99L51N83q69L00N82q63K01P20r04
4479c60J17P77q62J34P84q56L2P39p10j21Q46o76j84Q40o39k31Q17n30l35Q95
4499D77n19l80Q87n67l48R41m79m17Q14l71n13P98k13n72Q02j76p39Q83r5p47
4519e34Q38j07p25Q44n1p78P47K3p29P11Q6q62O89J50p47N26K99q64N46L52r01
$$ y = [525, -452, -44, 508, -465, -156, 619, -444, -174, 598, -443, -222, 614, -363, -235, 596, -333, -298, 590, -307, -310, 599, -203, -410, 614, -207, -468, 593, -186, -479, 616, -178, -480, 649, -118, -448, 600, -37, -495, 499, 1, -562, 487, 39, -590, 476, 150, -576, 521, 113, -577, 402, 131, -569, 446, 200, -556, 359, 274, -558, 309, 349, -609, 286, 332, -658, 213, 324, -652, 292, 333, -595, 187, 355, -560, 72, 398, -542, 50, 506, -513, 21, 528, -529, 11, 468, -490, -19, 538, -461, -110, 473, -396, -96, 486, -377, -176, 544, -360, -243, 534, -328, -194, 590, -266, -234, 505, -205, -326, 520, -156, -340, 500, -139, -370, 447, -83, -418, 477, -42, -422, 465, -102, -450, 491, 12, -405, 409, 38, -475, 323, 110, -462, 340, 164, -575, 308, 213, -534, 304, 197, -528, 316, 265, -513, 234, 257, -472, 239, 325, -537, 152, 302, -445, 81, 380, -484, 62, 414, -487]
4540d87M92M33r44N27M23q81M12M25q22L07N51q46L06N74q34J99P08q70J60O97
4560E30q59J44P07p59LP73p52l2P49p21j27Q36o76j80R28o64l06R37o10l06Q66
4581D81n99l04Q59n03l32Q56m94m33Q12k90n71Q70k97n01Q63l60n09Q53l44m94
4601d37P52j85n66P19r3o61P54l6o76O57O9p88O61Q8p70O98J64q40O68J48p68
4622d42N73K07q05N34L18q49M72L74q51M68M00q53M41M01p87L54M54p35K18N20
4642D12p09J98N01o50P2N56o10L1O34o07j3O89p12m1O73n63p5O52n82r9O14l86
4664a5k99P12m37l13P36l98m23P75l13m11P69l68l74P06k95m15O64j68n27O14
4684B20l6o12O95m5p01P20k8o75O60M9o29N45J43p16N23J72o83M80K46p47M87
$$ y = [-487, 5, 438, -506, 21, 444, -437, -25, 400, -422, -115, 436, -410, -104, 470, -364, -165, 543, -327, -167, 530, -329, -185, 522, -237, -234, 539, -213, -245, 504, -217, -344, 492, -184, -364, 564, -100, -406, 531, -79, -385, 481, -118, -422, 437, -66, -398, 458, -36, -469, 343, 53, -518, 352, 55, -446, 417, 57, -452, 401, 57, -437, 315, 130, -436, 283, 190, -471, 283, 247, -429, 228, 297, -491, 170, 258, -512, 186, 350, -490, 178, 326, -442, 131, 338, -467, 67, 385, -464, 8, 382, -469, -1, 399, -454, -13, 388, -399, -45, 409, -326, -108, 412, -297, -99, 402, -248, -176, 380, -230, -199, 435, -172, -185, 504, -208, -249, 424, -139, -214, 438, -144, -243, 371, -15, -314, 398, -39, -352, 384, -14, -437, 338, 25, -386, 383, 15, -359, 347, 52, -363, 301, 133, -394, 220, 184, -428, 267, 222, -479, 241, 213, -462, 198, 247, -382, 163, 306, -410, 113, 285, -398, 82, 328, -419, 68]
4705F8L18p65M07L68q02M23L45p72M07L31o48K64L89o16K02N24p48J59N79p04
4725b71J06O15p02O6N91o80J51N65o58n0P06o16p1O92n58j95O72m59k35P99n84
4746a16j92P00n26j85P40n15k13O45l48k95O29k62m34P05k74m63Q37l76m26P07
4766C38k41n21P41k33m12O41j52n15N32nn95O25K5o27N84N3o03N55K9o20N73L5
4788B07n77N30M9n40L69K12n79L77K57o36L33L62o96K86L63o44L07L57n71J77
4808e7L59n14J43L89m63MN68n71m1N41n09l3N00m41m4N26n00nM80l94j67N36l64
4831e7j96N11l03k52N89k74l19N68l20k73O73l42k77N00j89l30M95q1m82N10j1
4852A40m31M46L4n59N56J4n88N41L2m85M52M3n60M41J10m89M03K11o44L87K63
$$ y = [68, 386, -379, 28, 396, -406, 17, 362, -410, -3, 328, -320, -56, 333, -283, -81, 443, -305, -146, 433, -271, -165, 450, -252, -186, 405, -275, -124, 441, -217, -267, 439, -177, -248, 444, -114, -309, 363, -96, -331, 468, -116, -308, 392, -134, -319, 421, -94, -307, 338, -10, -305, 324, 62, -372, 333, 59, -404, 433, 57, -369, 338, 97, -424, 317, 84, -328, 313, 161, -354, 178, 173, -422, 203, 228, -399, 185, 238, -365, 190, 219, -401, 172, 207, -370, 160, 209, -331, 38, 250, -329, 48, 305, -331, 2, 364, -332, -46, 317, -327, -20, 337, -234, -57, 302, -212, -69, 320, -143, -139, 429, -142, -183, 358, -151, -184, 316, -125, -169, 357, -143, -148, 332, -62, -229, 307, -57, -253, 258, -45, -297, 292, 18, -301, 267, -53, -326, 347, 5, -272, 228, 39, -291, 204, 123, -359, 151, 140, -291, 155, 189, -370, 186, 200, -388, 153, 185, -300, 152, 195, -365, 76, 186, -303, 100, 311, -333, 54, 317]
4873C17o55L52L04o43L38K34n51K59L61n88K67K92n67J53M73n38J09M77o60O9
4893a97N56o06J41N18o19R4M83n64P7M77n04k2N23m47j24N67m05k26O30m31j53
4914b32O65n58j73O13l81j96N84l89k16N68l07k67N59k63l68O55k69l43N93k37
4934C8l01N33k22l38N22j52l35M82p9m71M71K0m94N39On58N52m1n18M85M5m58
4956b74L86Q1m36K71J67m38K02K38m24K07L14n63K13L52n50J90K97m89K46K32
4976B22l99J18L10l86L2L36l80j1M76m33q6M81l15j68M77l55j02M07l09q9M53
4997B79l29j45M56k82k26M86k01k43M73j82l66N52k69l05N14k26k17M19j10l45
5017b67M38j6m01L44J21m77L81L7m38M72k1m76M33Q1m90L58Q0m54L76J36n34L24
$$ y = [317, -338, 14, 318, -325, 13, 247, -304, -45, 316, -272, -5, 287, -280, -127, 346, -192, -83, 394, -266, -197, 359, -247, -106, 412, -207, -113, 370, -194, -117, 360, -144, -166, 357, -90, -214, 353, -52, -278, 352, -79, -232, 433, -125, -298, 315, -66, -262, 322, -67, -283, 285, -22, -289, 270, 7, -361, 294, 25, -318, 275, 38, -263, 270, 48, -290, 232, 80, -255, 227, 148, -323, 148, 168, -326, 213, 219, -339, 213, 172, -346, 139, 184, -274, 112, 193, -243, 28, 195, -243, -41, 197, -227, -20, 294, -269, -56, 296, -254, -64, 233, -256, -10, 222, -177, -59, 251, -135, -103, 233, -147, -158, 318, -115, -201, 280, -35, -203, 274, -81, -183, 224, -85, -174, 279, -50, -195, 261, -21, -247, 239, 38, -205, 268, 86, -280, 272, 3, -302, 212, -14, -231, 188, 78, -267, 171, 155, -246, 98, 219, -258, 123, 160, -278, 194, 173, -303, 130, 211, -279, 79, 159, -295, 81, 217, -317, 7]
5039GK56n30K95K68n80K59K85n39L14K77n69K01L16m96K15K63m63J77L53n62J25
5060a28M40n37Q8N06n94J03M38n48J20M21m33m2M15l16j08M20l29j37N50m38j03
5081b12N62m51r8N44m10j75N01l74l4L57k36j78L97j66k87M54j28l70N67k08l53
5102b98N51k22k29M11j92j97L78q6l42L90l8l19L57j5m04L87K0m29M39rl47L03
5124A09n3k55K68K0k84J92J84l66J55K10l46J97J33l82J92K71m47J51K39l37J41
5145hJ35k16k5K99k99j0L61k98m6L58l08r5L63k86m2L33l11RK40j91p7K96j36
5168D6k47M15j34l50M15q8k96M69k24k43M52j54l00M03j12k70L07J6l13K40J84
5189B16n21M11P9m78M13Rl72L59K1l78L26P2m16K91J84m57K61K54m76K20K53n32
$$ y = [7, 263, -267, 28, 296, -284, -25, 260, -279, 35, 312, -257, -56, 260, -236, -21, 242, -221, -44, 309, -253, -128, 312, -225, -137, 369, -225, -122, 316, -232, -112, 309, -124, -166, 249, -67, -175, 245, -84, -221, 329, -109, -212, 350, -101, -199, 345, -65, -240, 261, -113, -147, 210, -26, -204, 193, 27, -260, 194, 66, -304, 263, 55, -298, 253, 31, -198, 213, 21, -176, 202, 116, -226, 164, 126, -193, 164, 149, -255, 132, 152, -277, 162, 153, -194, 109, 56, -199, 69, 89, -195, -3, 181, -185, -30, 180, -166, 31, 164, -218, -26, 245, -202, -51, 188, -149, -8, 127, -89, -114, 185, -114, -124, 237, -61, -107, 251, -57, -152, 211, -75, -117, 216, -95, -86, 154, -37, -114, 182, 46, -201, 214, 80, -270, 145, 57, -239, 230, 6, -237, 215, 61, -239, 164, 52, -218, 89, 105, -208, 32, 216, -305, 106, 185, -293, 120, 129, -243, 116, 137, -241, 85, 157, -259, 32, 216, -241, 20, 274, -202, 18, 271, -261]
5211b61K92K40n62L00K40n33K80K08l55J00K35l65J09L04l89M2L60m34L5M26n00
5232b28J62L31m63J44L53m36O8L18l05n4L41l01r1M29l26j21M50k98j22M20l59
5253h8l7L10l28k0L84k80j17L73j79k71M15j36k66M29j76k17M35k49j67L82k11
5274a4j20K92j01k05K63p6k12K69J3l24L52m4k85L50m3l21L35m3k93K98l4k17
5296a60J55J01k09O7J89k72J34K02l34Q4K08l77J78J70k65R4K37k77L0K13j81
5317a3p6K83j77k10L67j88j23L58k86q3L78k93j0K33j66p7K34j04k38L06n2l14
5339b51M13j00l57M79j46k64L68r4k48L48j00k37L01o5k67L39L9l82L38K8l99
5360b57L12J25m41L57N7m20L98J1l46L30N7l71J57K25l60J77K40m19J58K02m30
$$ y = [-261, 31, 271, -291, 9, 249, -284, -4, 204, -151, -51, 184, -181, -72, 232, -157, -115, 245, -189, -154, 272, -228, -66, 265, -198, -54, 299, -137, -69, 249, -56, -110, 231, -70, -161, 268, -58, -179, 271, -27, -149, 271, -88, -125, 185, -143, -163, 221, -59, -176, 197, 18, -253, 162, 26, -240, 189, 13, -204, 231, -18, -185, 197, -14, -134, 158, 57, -148, 115, 39, -173, 96, 109, -215, 137, 93, -192, 158, 115, -206, 129, 86, -207, 91, 57, -160, -5, 96, -113, -46, 143, -129, 5, 207, -127, -43, 165, -212, -34, 136, -129, -35, 202, -75, -45, 168, -13, -89, 194, 17, -193, 174, -14, -137, 221, -65, -148, 230, -63, -73, 160, -6, -83, 151, 47, -191, 115, 63, -251, 162, 62, -295, 184, 38, -226, 142, 48, -200, 148, 48, -189, 112, 47, -220, 119, 158, -224, 114, 142, -257, 55, 180, -261, 96, 153, -267, 131, 142, -204, 126, 183, -188, -31, 194, -166, 11, 251, -168, -10, 192, -238]
5381b38K11K07m27K89J76l89K06J25l55J58J87k57J9L34m01M4L69m23J08L23m39
5402a73J12K82m20J41K40k82K5K68k76mK88l26p7M14k36j42L67l11l4L96l60k1
5424a29L11k05r6K51j44j81K71p4j74L21j01k21L41j49k09L49j67j23K40j23q6
5445i8J92o2j46J49O8k19J18J21k79J91O5k76K59K0k11K08n3j41J43N8j85Q3R3
5468I8j74M3J61k37J05J68k66M8J77l01J09K06k22K8J27j09o7K29j37p8K41j69
5490b0j34L03j72j16K96k02l7K59j46j53K23q8j03K15n0k84L05jk81K91m4k91
5512b30M04j40k05L39j34k15L44j02k28K43L2k51K47Q1m10L08P3m16L36M1l36
5533b19L89q2k62K30M7k97K23J18l37K17J74l38J26K02l74K44J41m11K31J64l92
$$ y = [-238, -27, 180, -247, 42, 218, -171, 35, 160, -195, -37, 150, -107, -88, 246, -155, -111, 258, -165, -57, 266, -173, -61, 221, -199, -58, 182, -100, -75, 193, -83, -87, 201, -125, -202, 212, -24, -166, 201, -110, -144, 252, -108, -129, 182, -23, -119, 132, -12, -193, 78, 4, -170, 151, 50, -171, 170, 21, -188, 161, -6, -129, 111, -12, -98, 94, 32, -114, 35, 103, -116, 2, 123, -156, 35, 100, -176, 83, 103, -108, 100, 47, -94, 49, 107, -78, 5, 98, -76, -33, 128, -109, -4, 164, -102, -54, 123, -178, -69, 137, -85, -57, 70, -39, -106, 123, -14, -92, 149, -20, -154, 149, -23, -139, 157, -45, -82, 177, 31, -122, 101, 13, -90, 125, 75, -209, 96, 95, -186, 105, 61, -230, 174, 34, -171, 168, 34, -181, 163, 61, -167, 76, 108, -143, 104, 185, -225, 83, 156, -260, 76, 117, -219, 170, 88, -174, 56, 103, -194, 29, 147, -190, 27, 201, -137, -11, 191, -183, 61, 202, -209, 22, 186, -206]
5554b06K49P5l30J95J79k96K6K65l39R5L01l25N9K36l36J27K06l83K09J89k98
5575a02J35R8k53M5K20k45m6K95k06o4L68l15J9K86l61M7K56k58M3J63k45n3K28
5598E5r9m7J86n0k26K36j8k16K83j56JK08j65p6J42j15l2J29j9q9J11L5j62J59
5622G5Nk51K23Lk33K46j6j10R5L0j27O5Q1j48kJ60k04K8K15k03J1K23k24OJ51
5647I9j70N4J27j03q1J42m6j43K32j49j04L04j30j61K98k15q5L33k25p1K06j13
5669aj24K21p0j91K79n0k32K85p6l01L78j03k25L37j34j17K19n9k00K46pk17K04
5692F2M7k76K04Q2l68L35P1l88L41m6k60L72q5k39K07N2k83J99J33l00J31J92
5714A83l58K08J51m08K88Q5l16K19Q7l14J76Q8j77J01J23k16J9K04k52Q0J95l44
$$ y = [-206, 43, 118, -212, -17, 162, -134, -108, 157, -182, -87, 214, -111, -52, 184, -152, -25, 181, -202, 7, 196, -102, 33, 131, -122, -77, 143, -102, -148, 147, -59, -123, 245, -70, -51, 235, -126, -79, 177, -81, -38, 125, -120, -173, 55, -44, -91, 95, 45, -181, 55, 37, -179, 104, -52, -51, 157, -8, -84, 58, -57, -89, 40, 21, -68, 43, 78, -84, 75, 80, -171, 52, 55, -178, 68, 52, -58, 37, 67, -60, 5, 86, -62, -64, 96, -108, -80, 135, -68, -57, 166, -58, -52, 99, -71, -17, 110, 7, -74, 68, 22, -121, 111, -38, -142, 162, 32, -129, 169, -46, -131, 202, -23, -94, 112, -1, -125, 96, 26, -165, 114, 64, -168, 117, 41, -260, 118, 15, -210, 127, -7, -124, 95, 36, -164, 82, 75, -142, 62, 109, -167, 37, 119, -249, 86, 157, -231, 110, 64, -196, 176, 91, -148, 59, 111, -172, 27, 160, -140, -9, 183, -175, 33, 184, -224, 64, 149, -167, 52, 139, -175, 1, 89, -88, 13, 136, -80, -61, 143, -109, -29, 166, -178]
5736a78J98J85l73J23J62k43J88O2k34Q0J72j89n0K03j04j06L04k52m4L04l50
5757a42R6K40k72L2J38j27k3J57j23nR4m2j60K22mk56K61j19j10K35j34l2J27
5780E3p4j1O2j6J0l2J36k17N3J62k11J18N4j99J44L2k04J71K6o8J2N5o4j09K01
5805H4j03o5J87j86L4K06k25RJ73j37OJ36j40m3J18p3j11K26q6j38L08j77j91
5828a88L95k26j34L03j85p3K55j32j16K11r0j22K06j5l06K92J3k54L29q6k78L34
5850A33j09k09K86n5j85K50p2k09K47%k74K06R3l22K76N5l50L85n0k86L45j01
5872E4k24L23q8k00J65J00k55J60J50l70J93J90m04K96L4l37K83K5l11K87J2k29
5894a46J89O9j82J6J83k13O7J53l03J37J72l16K31N5k47J77Q2j78P2K3p1J6O4
$$ y = [-178, 20, 205, -168, -45, 117, -126, 62, 124, -110, -30, 142, -47, -97, 106, 2, -104, 200, -52, -96, 208, -142, -46, 194, -78, -46, 92, -35, -58, 99, -24, -29, 65, 23, -137, 85, 81, -175, 86, -33, -143, 92, -42, -74, 53, -21, -32, 30, 14, 24, -8, 128, -89, -36, 126, -85, 33, 87, -112, 32, 64, -140, 31, 57, -11, 1, 56, -8, -117, 84, -19, -84, 103, -83, -49, 157, -68, -59, 114, -23, -17, 119, -21, -64, 54, -19, -130, 96, 10, -128, 180, 3, -188, 207, -19, -153, 150, -35, -108, 147, 15, -101, 110, 20, -102, 104, 89, -217, 75, 88, -166, 163, 77, -201, 133, 24, -185, 101, 46, -139, 111, 39, -170, 77, 77, -197, 9, 102, -220, 56, 111, -239, 146, 96, -190, 155, 54, -170, 153, 65, -135, 30, 130, -125, 35, 185, -185, 8, 198, -206, 90, 124, -213, 70, 95, -216, 71, 83, -146, 43, 112, -70, -54, 129, -84, -17, 136, -167, -30, 142, -174, 57, 112, -135, 42, 124, -54, 18, 41, -30, -14, 50]
5917E0r4RJ52j53k8J59j87R1J34j86M7J46j93J24m9r7N2N5J9r6J05l4j63K29r1
5942Al8J29j39m4J67n2j9ORm4nJ00p6oP5j95J16O6p7J9K8p7M3M2o9QJ18j05m4
5971f3J49q6j31K33j24r6K71j84j04K70j78j7J31q3kP5k6j29J90j06j27K70r0
5994D3j84K47j61j00L17j87j03K53j58p6K14r2j31J92L6k66K94j05k37K72o5k38
6016b35L95j37j88L53j40j69K45j10k03K28rj77K35Qk96K52N5k85K74m5k80L99
6038A70j72j31K38q5q9J17%j98J76Q5k48J43J00k38K15O2l15K50m5j94K41ok12
6061a36K01k0j08P3P0j39N4J71k92M8J55k05J49J27k76J47N1j30R7K0j09L5O8
6084E1m3m3P8n7n7K01j61l7K04k26Q6J13j73P5M0r2N3%Lo4O6M5j53J28O1j83Q1
$$ y = [50, -44, -35, 117, -36, -64, 95, -92, -1, 133, -53, -6, 140, -53, 71, 22, -75, -23, 32, 51, -45, 60, 26, -137, 92, 1, -37, 92, -47, -91, 76, 24, 5, 11, 20, -24, -29, 71, -5, -11, 64, -131, -15, 51, -26, -7, 21, -56, -13, 29, -40, -32, 86, -19, -63, 86, 0, -131, 102, -22, -118, 153, -31, -135, 135, -43, -60, 71, -12, -14, 61, 35, -94, 96, -10, -137, 133, 43, -141, 106, -55, -155, 162, -25, -128, 125, -33, -109, 105, 13, -118, 74, 110, -156, 138, 33, -204, 68, 3, -235, 160, 23, -165, 188, 48, -121, 124, 14, -189, 39, 30, -147, 88, 96, -200, 52, 107, -178, 96, 51, -229, 170, -2, -133, 105, 20, -69, 48, 48, -150, 26, 111, -137, 6, 106, -132, 83, 145, -170, 80, 35, -159, 82, 76, -136, 65, 45, -63, 10, 80, -59, -5, 166, -126, -78, 77, -128, 21, 148, -128, 19, 70, -60, 37, 57, -52, -17, 51, 8, -35, 43, -14, -71, 130, -31, -68, 136, -90, -4, 109, -64, 11, 51, -41, 12, 12, 15, -49, 17, 62, -91, 37, 98, -85, -4]
6111dL8j54K19j46ON5jj7l7R5k0p5J26j64P1J54k28M9R5j51J38k9l3RM8n7k3R9
6139F3j06o9K12j35j28L28k12l4K22k42N9J65k03N1J38j09q3J50l0j56J69l0j84
6162a64L32j64j71L68k21p7K30j82k3J80o6j16J96j03j17J30K4k14K70p0k59L93
6184A76k11j49L33j77j23K74j28p7K02j15j14J33M8k55K56qk43K72l8k96L77j60
6206b3k12L46o4j87K39p1j50J45J7j13Q7J00k67K13M6k95K29O7k50K52m2j81J64
6229E0l2r6J01j1n4L8P1j10J3J18j91N3J59k09J29Pj17J61m2r5N1J3M4mj7l1m4
6256d5J25l9j18J85j55k0J82j64J0P7nk7m0N3j9j18J43j08N4J48k32J50K3j29
6280f9J05Jn3N2j9L4q4J16j53k9K23j28p3K16k18M4J58j66L6Q3p2j0K8p4LJ80
$$ y = [-4, 34, -120, 99, -47, -41, 14, 13, -4, -41, 54, 34, -41, 85, -79, -8, 146, -82, -33, 62, -89, 49, 20, -13, -4, 44, -13, -36, 63, -43, -112, 100, -35, -163, 165, -47, -81, 141, -101, -42, 123, -80, -29, 109, 0, -83, 67, 37, -119, 50, 20, -164, 168, 4, -167, 201, -20, -97, 133, -49, -72, 108, 42, -74, 122, 19, -98, 32, 56, -158, 112, 42, -217, 176, -35, -184, 149, -28, -151, 123, -5, -82, 120, 5, -109, 24, 72, -183, 73, 65, -178, 94, 56, -240, 137, -23, -235, 111, 47, -140, 99, 28, -122, 23, 40, -73, 14, 114, -153, 60, 106, -189, 40, 107, -143, 109, 67, -114, 50, 18, -78, 23, 12, -42, -4, 67, -43, -30, 88, -103, -50, 109, -100, 29, 36, -81, 80, 38, -57, -6, 7, 51, 47, 30, -1, -45, 80, 41, -77, 108, -47, -67, 115, -49, -39, 38, 33, 6, -34, 19, 0, -118, 25, -83, -29, 119, -113, 37, 60, -69, 36, 37, -16, 36, 17, 51, -33, 83, -70, -99, 124, -4, -77, 139, -79, -35, 123, -43, -7, 76, 4, -6, 22, -52, -49, 131]
6306A31j41r8K26p8j15J69j29p6L15l14J3K67k46M0J34j46K2J27q3j20J63k1j48
6329a08K41j11k03M14k62j11L16k34l0K36k03l2K41j49j09K06m0j79K22l3j95
6350a23K51o1k06L04k04q0K56j96k6J87j17q7J63j0j93K08j8j96K27n3k16K82
6372I2j11j54L10j28r2J48p7n8Q9j2p6Q1N4j57J04P6k13J51J01l06K49o1q6K27
6396A51j78j8R6m2k3JNl3K2O7r8L5P3j37J07M1j18Q8l4p2J14m1K2j9l7O1n1L7
6424A9rj07J23j4o5J02j05N7M3m9P4r4Rn1L9Q9n3r2K16j62kJ36j77J31o4n2M6
6451a2M3n3QJ14n9j19J81j28m8K33k23j0K26k00O5O6j29QN8p3l4J19l8j16K51
6476A30j44j40K98j95k3K31k49j8K67k33M5J45k00kJ50q4j3N4l5j18K39j56j05
$$ y = [131, -10, -108, 118, 40, -75, 94, -35, -111, 204, -110, -97, 170, -76, -36, 98, -48, -26, 101, 18, -102, 61, 40, -108, 133, 22, -181, 233, -29, -140, 176, -58, -88, 148, -55, -87, 154, 5, -104, 102, 62, -117, 105, 72, -123, 128, 67, -139, 165, -39, -119, 137, -59, -85, 102, -15, -102, 61, 51, -142, 66, 48, -148, 79, 26, -190, 92, -19, -173, 137, 9, -83, 65, -12, -70, 19, 7, -69, 12, 66, -91, 13, 89, -124, 27, 128, -178, 71, 10, -76, 151, -27, -45, 51, 9, -14, -13, -8, -41, -19, 48, -50, -15, 58, -79, 28, 69, -49, 39, 5, -67, 47, 6, 28, 9, -28, 33, -18, 19, 10, -97, 26, 12, -53, 49, -56, 1, 44, -5, 69, -25, -16, -67, -28, 61, 8, -84, 132, -30, -32, 104, -73, 58, -6, -58, -12, 31, -22, -14, 100, 41, -78, 103, -25, -73, 160, -63, -73, 153, -47, 18, 84, -45, -37, 21, -52, -86, 33, -5, -121, 130, -14, -154, 144, -51, -74, 157, -92, -110, 157, -76, -31, 114, -86, -88, 62, -22, -35, 19, -16, -134, 105, -51, -156]
6499a56L16j90j05L15j96p8K24j67jJ84j92k3J41j00j4J89j51j25K57j02k03L31
6521A54j80j09L17k34m2J95j31qJ90j66n8J38k9j30J88n8k09K57o1j68K37j49
6543e6l6K44k49K5J81j32m8J54n4n7J9O6j28P3Q0k06J76j5j61J88o4m4J08r1Q
6568a9Q0o8m1L8pkJ0O6p6j0N5q7J22q1qJ03r5M4k0p4J34k7o6J11j74J15lm5Q6
6597F1j29O9kOL9j00R4k4r7J21o6RO2j48Q0J09j44N0N1j36R3K1q4M2P1o5m5J16
6625E4j32k2K13j61l4K03k37Q5J59k55J35P7j94Q8R5j18qJ09q3n4K18j59r3K77
6649A63j73k4K16l05O0K02k23K2J57j85M8J12o9p8J48j01n9K30j78j12K94j39
6671Fr6K76k33K3J71j44k7Q5o3m3Q3p3l6J53k5k05L21k02r4K63k31OK03j51JJ16
$$ y = [-156, 160, -30, -135, 180, -16, -94, 130, -37, -38, 146, -46, -69, 72, -28, -42, 147, -4, -129, 128, 26, -177, 154, -26, -135, 182, -52, -94, 101, -30, -38, 152, -14, -72, 66, 37, -93, 95, 37, -172, 85, 24, -144, 93, -56, -92, 152, -97, -72, 109, -23, -71, 83, 29, -28, -9, 57, -71, 2, 82, -124, 52, 37, -124, 64, 0, -44, 64, -27, -19, 61, -7, -48, -10, -17, -19, -9, 57, -19, -29, 26, -61, 61, -20, -28, 75, -20, 24, 4, -70, 64, 37, -29, 82, -92, 23, 20, -25, 61, -68, 1, -1, 5, 44, -56, 38, 14, -83, 38, -28, -19, 43, -105, -25, 84, -60, -10, 41, -95, -2, 19, -65, -23, 48, -17, -62, 54, -78, -100, 113, -48, -82, 121, -116, -31, 128, -127, 8, 85, -109, -21, 74, -44, -52, 57, -26, -80, 138, -21, -114, 163, -10, -34, 182, -123, -63, 139, -84, -62, 95, -90, -42, 70, 1, -77, 71, -30, -89, 141, -37, -149, 145, 6, -90, 186, -47, -24, 147, 3, -24, 61, -2, -45, 38, -35, -71, 82, 57, -148, 173, -29, -123, 140, -91, -85, 118, -33, -32, 84]
6697H4j64J5J15q0k5J04l6j55K34j9j81J90j04n8K07j90Q4R9j68L8R1q9PP9l1
6722D7q2M3K4o6J29q5j04J61q1o2J39j15P2jj79J90o0O4k8q4J55n1m7L6n8L3L2
6749B2oL5r8j5J06q7J46j20l4J47j50N2N8o6oJ3k0P4l6k1M8k9L2q8R9p4k2J57
6777A17j83oJ83j42l2J73k80J67K9n3N5J0o0k7R6p3n6K11j54o1K26k65M4K55k80
6802a06P2J19j65K0J18j21M0J13j20l2J89j32j19K81k20m0K58k10J5K01k49O4
6824b4J29j46l0J60n7r9J61r6q2J65j25n8K78j94j10L03k53L3J65k32J20J13j20
6847Am8J28r5j7R5q7m7J50j28l1K36j60n4K01k03L7J26j84M8L4n0Q8l1po6J09
6873D5kj39K00j51o1K07j67K9J09j50J04K0j07N6M9j0kn0K7PMj0p0P4J4m1Q9j35
$$ y = [84, -80, -65, 50, -30, -55, 49, 13, -142, 92, 73, -108, 82, -22, -80, 127, -63, 21, 120, -48, -10, 81, -8, -1, 78, 47, -35, 8, 32, -34, 95, 10, -94, 67, -14, -76, 63, -52, 20, 19, -160, 30, -30, 34, 6, -78, 77, 26, -21, 15, -43, -10, 22, 16, 51, -47, -62, 44, -43, 103, -17, -51, 96, -54, -2, 56, -10, -16, -3, -23, 51, 15, -6, 42, 13, 45, -43, 56, -18, -40, 117, -66, -72, 111, -31, -63, 110, -170, -3, 26, -27, 28, 38, -22, -49, 47, -26, -82, 129, -25, -86, 140, -125, -81, 174, -106, -34, 85, -80, -60, 58, -63, -23, 90, -30, -62, 127, -5, -124, 157, -63, -103, 155, -55, -40, 161, -88, -24, 105, -41, -71, 89, 32, -67, 94, -2, -84, 81, -44, -102, 176, -18, -128, 175, -78, -45, 120, -112, 8, 121, 1, -47, 81, -14, -31, 64, -23, -70, 80, -48, -79, 157, -3, -57, 144, -59, -22, 104, -80, -32, 2, -48, 40, 9, 2, -64, 45, 43, -96, 104, -47, -108, 99, -68, -39, 70, -80, 24, 44, -63, -7, 42, 32, 30, -20, 7, 14, 18, 8, -62, 12, 26, -15, 74, -61]
6901f1J02n2k3Q1p7j9P1j8k2J02j23O2j9PMj5K6j4mrJQ1j23k0J35j21L1J27j89
6930g9J05Q1j63N1M3p0L4N4p0l1R2r2KJ61j71K0J40j87N6J80l14J36R5j88J42
6955B7M2j46Q4P9j01n7J55j02r0K49k23MK69k88L8K04k48P6J01j47P7Q3j44M2
6979a6R9r4l1J30r8q7K40k32P2J53k46L8J73k21J15P3j38O2O2r2k9J15j05m6J73
7004G0j51L6J64k34J21J18k47Q4J06j30O1N4j02N6Rkr0J54j27j5J42r7l3J52j72
7029g3O7J11k32J31K8j28J11Jj6l5L2K7k2O8q0k8J09q1q0J54j30K5J42j55Q6o6
7055c4n5J47q7M8j7j5J3K1J3k0k8P4j04K5R4j59J46o1m4J11j21J0R3j35Q9j1m7
7082e4J17m3m6qM3op4J01k1r1J54j76P8J35k16Q7J09j67R0R0j73Q1M6o8qM8Rp8
$$ y = [-61, 41, -11, -34, 47, -30, -49, 22, 4, -18, 84, -39, 23, 4, 11, 15, 0, 26, 12, 8, -1, 0, 81, -42, -62, 73, -48, -17, 110, -79, 26, 107, -56, -5, 38, -32, 2, 56, -14, -45, 47, -45, -43, 118, -53, -33, 107, -80, -24, 156, -158, -22, 73, -115, 27, 69, -77, 7, 86, -15, -72, 83, -19, -109, 140, -83, -79, 190, -98, -60, 144, -104, -28, 73, -74, 3, 86, -58, -16, 83, -11, -42, 88, -10, -97, 143, -89, -17, 136, -110, -72, 101, -120, -5, 68, -70, -8, 54, -38, -67, 48, -57, -103, 70, -81, -45, 119, -115, 6, 124, -123, -39, 67, -63, -2, 52, -50, 6, 15, 13, -77, 77, -50, -65, 77, -20, -53, 99, -73, -6, 105, -127, 4, 32, -96, 15, 16, 0, -35, -3, 24, 2, 70, -10, -38, 71, -10, -90, 64, -66, -41, 101, -54, 32, -34, -89, 58, -29, 19, 2, -13, 0, 21, 34, 14, -14, 60, -44, -19, 75, -84, 62, 1, -43, 68, -53, -43, 50, -85, 4, -7, -54, 63, 20, -26, -34, 9, 3, -71, 30, 9, -82, 72, -104, -26, 109, -107, -20, 89, -78, 12, 102, -71, 10, 56, -12, -20, 28, 37, -41]
7110d1J92j06j28J89k35J03K51l07N9Q9k19K19Qj82J16J5p8QR0j10N1J15j08j09
7134a18K06j52O9J15k24R4J36k28P9J15j17L4P0r9n5J96j32oO1j12N4J53k89J13
7158c7J52k86K47J2k41J57K9r4M7Q0q7J6P8j39Q3J18j56k6J50k27J23J11j41O9
7182C8M0j78J41om4j0Q5r1m4J76j41l2J33j36K6J65k33J56K8j45P0k3j0M7m4M2
7208A0l5PK3k0N8q2N6N5j57Q4K7j41J68m7m7J32j32L9N2o6K8K2k2J8q3M5j4M8
7236B6n1j2J17p6n7O7mj04J77j62Q3nm6M1K7m2qk3Q3m2L9m9K0M5r9N5J02j63J6
7265d5J75k36J28M0j27J03J1q3L7P1n8l7Q2j11N8O3j39M4Q4j47P8O5k01J85O1
7290A01k05R7P6j92J04P2r8pJ07j31N3J22j78M1J29j37P0Q6k45K09jj71R9P4j15
$$ y = [-41, 151, 45, -83, 106, -129, -26, 225, -82, -23, 66, -153, 66, 74, -108, 8, 23, -55, -47, 43, -67, -16, 99, -9, -118, 88, -64, 5, 120, -104, -10, 126, -102, -23, 92, -25, 9, 79, -20, -75, 121, -11, -17, 44, -68, -14, 139, -150, -37, 115, -171, 76, 88, -153, 4, 33, -61, -14, 66, -21, -5, 73, -66, 17, 135, -21, -47, 103, -124, -1, 110, -31, 38, 78, -100, 41, 35, -9, -19, 66, -25, -69, 107, -34, -66, 67, -69, -43, 122, -111, 45, 73, -72, -2, -25, -35, 12, -32, 10, -25, -18, 5, -15, 43, -39, 17, 72, -85, -1, 26, -115, 53, 6, -41, 91, -41, -2, 50, -16, 12, 34, 12, 30, -53, -8, -22, 26, -25, -37, 80, 4, -53, 14, 10, -94, 83, -79, 4, -1, -47, -6, 21, -21, -29, -52, 31, -11, 28, -21, -1, 44, -55, 0, 102, -61, -45, 130, -106, 22, 62, -65, 38, 49, -34, 3, 74, 16, -21, 61, -50, 8, 71, -68, -24, 60, -87, -9, 56, -145, 40, 101, -104, -7, 69, -123, -19, 53, -45, -52, 55, -76, -23, 99, -79, -38, 91, -46, 24, 110, -135, 74, 73, -98, 1, 75, -40]
7315d0L3N0r1jJ13o0o3J54k04O8R9j45J11M2j99J54K7j10L5J5l9M6Q3r6l4J03
7341E1j20Q9J8j50J00M6j24J07K4j13J18oj14P6N7o3lK5m1j7J21j74J21Nr1O8
7367A0Mk8N7p9k4Q6j01N8M5m1lK8m7l9O9L4j28Q6L1p4N9k0n0J12j5n0O8p3M4k
7397A7o6P8l0k6O2j10Q0k7J21o0j04R8q2n1J78j32M5Q4j18O7kr3Q9Or6M2J27q3
7425A4l7oo0P8J06j73Q4Q7k49K03K0j63J19k7o1Q3Q6j76L4O6l1n2J03j09P4O9
7451H2j98J22J00k03J24O7k27J57K3j43J51Oj13O7qm1K1R3j55K2J64j68Q1R8k22
7476a00J13P8j78J14J0j06J37j2r2K8O9j28P6N2j32M4J10j59R9M0j10J04Mj37
7500g6J24k8k7j2L4p7OM2rrP9j63R9P4r4QP3r7J05J1n9L0o0K4jM8n7K6L5m7l3
$$ y = [-40, -7, 43, -48, -49, 64, 4, -59, 95, -109, -41, 58, -87, 24, 66, -133, 21, 48, -62, -27, -12, -51, -5, 78, -18, -52, 51, -69, 20, 38, -112, -12, 34, -90, 17, 41, -72, 46, 40, -74, 2, 59, -4, -7, 18, -23, -40, 81, -93, 28, 33, -58, 10, 14, -14, 43, -36, -60, 26, -75, -17, 28, -13, -16, 12, -35, -74, -5, 29, -99, -13, 18, -56, 3, -17, -67, 45, 30, -20, 48, -25, 19, 17, -49, 29, -1, -27, 35, -75, 5, -22, 99, 39, -65, 33, -49, -100, 78, -54, -9, 75, -43, 24, 22, -71, 18, 24, -72, -30, 97, 14, -23, -29, -89, -11, 95, -78, 6, 93, -156, 47, 67, -96, 23, -4, -65, 18, 104, -72, -38, 28, -3, -55, 48, -61, 13, 82, -116, 6, 106, -97, 27, 94, -133, 24, 47, -96, 55, 61, -52, 15, 7, -34, -13, 80, -75, -53, 111, -57, 24, 122, -100, 13, 91, -87, 27, 37, -69, 68, 56, -36, -8, 61, -67, 9, 61, -71, -27, 83, -76, 23, 63, -47, 57, 61, -76, 48, 20, -7, -19, 15, -62, -56, -14, -23, -32, 47, -116, -17, 57, -37, -29, 44, -53, 52, 63, 4, 34, -26, -2, -3, 45, -12, 14, 49, 2, -31]
7531c1N1m8O1Lq3J03j31K8J36j47M5N3p2Q0l1J1j4k3M3j22J11k4JM6p7mO6m6K7
7560A2N6j34Q7K0p1O0M3q7oR4r3L8M7j19j0J49q9k8J01j22J04K0j90J43K1j62
7586a16J55J0j04J02k2ko0Q6j24O7L6j30P9J05j72J14O7k09J84j0j38J26l2n3
7610d1N3mk7rP8n9J8O6j49N8R9j81R4R6j84Q5Mj07J27K9j05J18p3o2K9O5j18J01
7638AP0j56Q2N3j92J78N8k03J24l1j5M5K6l9J3Pj14P3M2l0oJ1j04J49L0r9Q8k2
7666C9j26J97r4o4J20q2k0N0kr1R9K1q2O0m5k3J19o0p2O2Nn6J37j30M6M6n6JL1
7695C0J1%p2R2r2J11q9%K4l8L8N9j22M8P8j07QL2k0J8N7q0O7k2n3l5N1pJ7M6p6
7726b6j4O2q8M9P7r8J03k2p1Q2nq5O6j3r1M8K1m1N4L1n8O0J6j20J08N4j70J04
$$ y = [-31, 20, -28, 33, 36, -47, 56, -75, -47, 89, -58, -13, 40, -32, 48, 17, 28, 14, -9, 34, -88, 23, -1, 0, 46, -31, -35, 31, -15, 12, 68, -66, 21, 41, -30, 30, 73, -14, -20, 74, -19, 19, 66, -53, -63, 86, -3, -31, 70, -52, 52, 72, -118, 25, 46, -116, 39, 49, -55, 47, 25, 23, -37, 49, -75, -8, 28, -102, -23, 82, -90, 24, 91, -118, 66, 56, -82, 44, 12, -41, 12, 8, -19, -28, 50, -9, 9, 75, -74, -16, 83, -98, -4, 92, -92, -7, -3, -110, 17, 46, -59, 59, -14, -76, -47, 18, -100, 1, 71, -85, -3, 50, -142, 36, 94, -109, 15, -16, -31, 14, 40, 1, 14, 21, -93, -20, 22, -8, -14, -3, -107, 42, 72, -27, 61, 39, -87, 110, 16, -48, 72, -10, -30, 20, 18, -73, 26, 47, -35, 25, -20, -43, 76, 16, -56, 6, 11, -45, 92, -38, 8, 54, -2, -1, 30, 41, 41, -31, 61, -31, 80, -9, -9, 15, -23, 15, 74, -48, 0, 78, -29, -21, 11, -9, 9, 66, -14, 53, 31, -22, -57, -6, -13, 4, 50, -26, -40, 22, -66, -17, 60, -38, 65, 43, -28, 54, 49, -36, 30, 17, -74, -26, -5, -46, 8, 39, -19, 41, 57, -63, 45, 99, -71, 33]
7754C3qn8K7K9j10O7O9j01M9J3o9L2J02j78J15K0p5O4j6m1J30r4p8J30nr3R7K5
7782G6j34P0M7j18N3M9j39J04O5j66J44j1j35J20n8k8O9k8j3N1on8K3M9q0Q9o6
7809c1m5O8J7o8Q4jn2J02o1l3O2q3PO0n4J6N7j7n2K5Jm2Q1j3r7J29m1m8O6r1j4
7840f8O8m5QO8m7k2K9M5r5O5O1q8P0k0n7O4q1N9K8%Pm3n4Q4J5m3j9L8l7L9Nl9
7872eL5J0n9N0L1p3J2L3j00Q6j3k1L5l4N8k7k6o5Q9M1j41J01M7r8k2R1n5R7k7
7901E0r8N0l0J6K8jo6P5n0q2J21j2n2L5P0j40R6K5q4J27o3j42J40rn7M7k5j3N6
7930A2QJl6J0r6J59K5j58R8J6j65K08r4j07J55J4p8M0k2J3K4n2%lM5r1R5j8m8
7959d5R3n5r4J56o9q5J84q8q7N4P4o3K8jj6J4orP9l3j01J06Jq0J28r9j9N9m2O
$$ y = [33, 25, -33, -6, 23, -87, -20, 49, -52, -3, 10, -59, -27, 75, -103, 12, 32, -43, 21, 5, -36, 94, 0, -78, 52, 47, -46, 51, 76, -58, 12, 59, -59, -6, 43, -96, 8, 73, -93, 51, 40, -95, 25, -33, -61, 8, -20, -33, 18, 12, -46, -23, 26, -54, 35, -31, -76, -8, 9, -59, 25, 24, -28, 74, 13, -20, 42, -41, -34, 26, -28, -12, 45, 28, -24, 1, 2, -40, 41, 28, -69, 60, 19, -29, 37, -54, -68, 0, -45, -37, 31, -16, -38, -9, 36, -59, 6, 67, -21, 49, 29, -28, 36, -45, 14, 42, 42, 49, 6, -48, 36, 51, 8, -11, 27, -10, 29, 34, -5, 30, 40, -19, 31, 62, -11, 1, 34, -66, 20, 7, -14, 21, -13, 45, 18, -8, -73, 16, 57, -84, 17, 64, -34, -56, 35, -20, 77, 50, -48, 2, -28, -12, 16, 15, -51, 24, -26, -108, 13, 1, -51, -16, 54, -86, 10, 35, -49, 78, 15, -127, 13, 4, -53, -6, -31, -44, 12, 20, 21, -15, -5, -101, 58, 83, -75, 23, 39, -126, 82, -12, -119, 36, 50, -28, 12, -10, 3, 27, -25, -25, -28, 17, -74, 21, 3, -45, 48, -7, -101, 55, -14, -99, 85, -3, -90, -36, 38, -25, 3, 2, -14, 0, -6, -15, 64, 31, -70, 36, 37, -43, 85, -14, -33, 26, -16, -10]
7989a0M5m9K1j3Ml2M7ko7O4K8o0M2l4OO3j25O3O7r0K7Q8j33l7J08l1m3J06l8L
8019A8l6Oj6J03o7jJ4p3M9pn4N8mk1P1o7J1L7Qr1M3P4j28N2N9m3M1n1p5J33m2
8050Am3M5J5m2N4p4K5k1K1j1M4j9k6L4M1o2J3M9k8KL2q4J01p7%P5m8k6j8M6Rl
8082B5K0j10J50l2j37J26k1r7J47m2o6J50j43k6J10o0JN8k6o1O3K0j16J19l4o2
8108d4P8k9n7J26j02J7M1q4R6J3m0j9ql7j3Q5K4j07O8L0k5K5q8K7O1m8L4k3K5
8137B6m2O6p6K1K2ooN2p7l6P9oq7J46j10L4L5m3K0J5j3j8L4k8n9O3k3j4R6n7l4
8168b6Q9n7j8M6j04j3J56q2K5k1K2mk3l8J1L7KN2rl3m5O3n8
$$ y = [-10, 35, -14, 7, -6, -2, -34, 13, 11, -56, 8, 36, -24, 18, -16, -10, 53, -72, -9, 58, -32, -5, 83, -50, -87, 21, -10, -53, 53, 15, 18, -18, -12, -28, 75, 8, 7, 21, -52, -3, -10, -64, -6, -10, -31, 40, -27, -16, 21, 29, -62, -19, 55, -73, -21, 38, -5, 36, -15, -90, 43, 1, -42, 3, 18, -24, 30, -44, -19, -40, -19, -30, 14, -5, -31, 3, 44, -18, -5, 44, 16, 18, 50, -34, 67, -10, -10, 65, 17, -9, -27, 19, 28, 25, 45, -65, 85, 53, -84, 42, 21, -76, 71, 29, -37, 113, -30, -56, 54, -6, -5, 53, 27, -34, 29, 49, -67, 52, 18, -44, 34, 5, -52, 74, -28, -11, 30, -54, 42, 55, 15, -4, -12, -49, -62, 23, 47, -60, 8, 38, 13, 38, -50, -23, 38, -10, 24, 1, 26, -16, 50, -26, -5, 17, 11, 5, 57, -20, -56, 23, 17, -70, 76, -34, 0, 35, -8, 12, 27, 14, -4, 30, 2, -57, 6, -17, -31, 65, 8, -26, 63, 6, -12, 34, -70, -83, 73, -9, 16, -5, 17, 13, -10, -48, -37, 0, 2, 54, 45, 12, -33, 30, -28]
8191b8
$$ Imaginary data points
##PAGE= N=2
##DATA TABLE= (X++(I..I)), XYDATA
0@%%%%%%%%%%%%%%%%%Nj3J4j0Qj0J4j6J6j4J2j1J1j2J0qOmMkkNj1K0k6L1l9N0
45B8o1P0q0R2j02J12j25J37j42J44j43J32j10P0jj08K82n60J013j780L139n752
67c745J1473k7507J29553K78042p88958M62910K30719o41853M58653M7570l50520
78a93663K06227J31219k28626m1582L63040l23622j22761N75486n65400L2907
88a66775N80457p28951K74449L80890o77246M06177J28940m38075L10022L0907
98A00795j99771O3906J48454j30030j45002L78738k68137j57872N28685m81797
108a62031K0759M70490n79037K37777K38995m60991L07524J4311k08044J68361
118D8114l5582m760o9143J09484P439k17761L15058j57948j66238M00994l45279
$$ y = [0, 0, 0, 0, 0, 0, 0, 0, 0, 0, 0, 0, 0, 0, 0, 0, 0, 0, 5, -8, 6, -4, 4, -6, 8, -8, 8, -6, 6, -5, 6, -6, 4, -4, 2, -2, 2, 0, -2, 3, -8, 12, -14, 17, -22, 28, -33, 37, -43, 49, -53, 59, -66, 71, -71, 73, -70, 62, -48, 22, 21, -87, 195, -365, 648, -1132, 2007, -3745, 7728, -19779, 109774, 387816, -401142, 61768, 292487, -349366, 109287, 156857, -193663, 12564, 143783, -84843, -126425, 236615, -87007, -209768, 365718, -199682, -166775, 413682, -315269, -40820, 340070, -337176, 69001, 197941, -240134, 69888, 100795, -98976, -35070, 113384, -16646, -161648, 217090, -51047, -208919, 319766, -162031, -141272, 329218, -249819, -12042, 226953, -234038, 73486, 87797, -120247, 48114, 12532, 7772, -61371, 48113, 55552, -162209, 152849, -5099, -171337, 229657, -115622]
129a15622L7133K82638l82342K22130M3030k21980K35129j36756K1165O7291j32231
140h0415J70025j43560K9539J28688k31424J99082m5640j30853K23601j93456
150g4413P4886O8011j79332K19106j57590o17J88536k88592K11384J4478k39957
161a64100L01456j58625p1181K14574j90058O4345L5123n1672M1661p9993J47615
172H9145j35886k5515K50448l39690J64168J79455m19160L42694j56l26498L75864
183A54869j37144j53455K47747j16115n2717O9518M9680j15372q990K29980k99252
194a31251P8125K85648m63709K59757J81326m85325L89856J0498l58497L68424
204A34852q2891j95616K16602j9935j33155N7782J52013k25365J9634K99072m01725
$$ y = [-115622, -78489, 204149, -178193, 43937, 86967, -135013, 100116, -36640, -15475, 51816, -80415, 89610, -53950, -24411, 104277, -127147, 71935, 26295, -104558, 119043, -74413, 473, 68484, -110848, 108258, -49332, -49949, 138587, -150005, 61379, 75857, -164100, 137356, -21269, -92450, 122124, -67934, -3589, 31534, -20138, 21523, -58470, 89145, -46741, -72256, 178192, -161498, 2670, 182125, -237035, 105659, 105503, -220995, 154869, 17725, -135730, 112017, -4098, -56815, 12703, 62383, -52989, -61979, 168001, -131251, -53126, 232522, -231187, 28570, 209896, -275429, 114427, 124925, -233572, 134852, 51961, -143655, 72947, 53012, -80143, -22361, 129652, -95713, -76079, 222993, -178732]
215a78732J30784L09620n23529K97728J82115m96589L83905K5066l46738L18112
225A01742k9904j96614J50253O4781j65957J1691K34878k77157R535L45042m36398
236a88108J38245L08702n09181K85336J58104m32197L25737J6760k63478K21575
246F1495j088j33141N1468J15795j36929n3452K69670k61487j6677L34631l95472
257a65187J21963K58299m21194K42345J01202l10630K42233j2727j44890J16721
267B8135L492m6034l8714J29864q1244j04612K58490k09485l5226K80067l14079
278a29346J05903J70834k97364J98836J2334j60794J63277p4491j530K2557k8481
289a8265O5751j13802J03118N75j39607K03795j29276l9623J82664k03542J00243
$$ y = [-178732, -47948, 261672, -261857, 35871, 217986, -278603, 105302, 130368, -216370, 101742, 71838, -124776, 25477, 90258, -75699, -64008, 170870, -106287, -96752, 248290, -188108, -49863, 258839, -250342, 34994, 193098, -239099, 86638, 103398, -160080, 61495, 60407, -72734, -21266, 94529, -42400, -95852, 173818, -87669, -104346, 230285, -165187, -43224, 215075, -206119, 36226, 137428, -173202, 69031, 56304, -88586, 28135, 31627, -14407, -53121, 76743, -4501, -109113, 149377, -60108, -95334, 184733, -129346, -23443, 147391, -149973, 48863, 61197, -99597, 63680, -10811, -12341, 10216, -18265, 47486, -66316, 36802, 37377, -102230, 101565, -27711, -67334, 115330, -88212, 12031]
300A2031M7408j49377J63627j01427P77R7624j54412J38175m4961q1883J65589
311I3171j49584M4934P4965j34507J12586m6605j4718N6057q9173J11933q8621
322b9562r082J43902k15034J39102N7056k33736K46442p6456j41866K36242j47651
333c0643k4568J26931r7730J1993J5972L4894p1621P68J44884k16855J00525J45662
345A40212l15350K39897M0807k96366L10745q0890j83990K61094j17475p7785
355g9101J35753l5763p1097L9896J00693j74202N3109J84437l08972J65273J53972
366A63998l72592K85505L9769l19944L18572o1695k00336K40576o5069j15099
376h6315J14787L5120j34487M2024J60136k44312P9351K12994l57360J92772J55946
$$ y = [12031, 59439, -89938, 73689, -27738, -26961, 70663, -83749, 54426, 9465, -72418, 93171, -56413, -11479, 63486, -71021, 41565, -5040, -19758, 36299, -52874, 59059, -29562, -38644, 105258, -109776, 29326, 86382, -147354, 99088, 22632, -119234, 117008, -30643, -55211, 71720, -26010, -14017, 1955, 36849, -34772, -34004, 110880, -105975, -5450, 140212, -175138, 64759, 105566, -190800, 119945, 39055, -144935, 116159, -1316, -79101, 56652, 20889, -50208, -10312, 90381, -83821, -30712, 153725, -155247, 10026, 163998, -208594, 76911, 116680, -203264, 115308, 53613, -146723, 93853, 28784, -86315, 28472, 63592, -70895, -28871, 131265, -113047, -33696, 179298, -178062, 14710, 170656]
387A70656l82612K87057L7903k99731K83581m2639j75542J80994j7720j07461
397f5514N6698R4100j47280P465K02980k59103O7120K22827l46818J79799J38882
408A51156l33848K48544J9874k26791K12754l6972j07015R5542J2888o3678j3444
419d0990J26379j24193l1981K10554k31028M6428J96978k89032J50830R5692k44894
430a35257J92325j3042j27510J32236m4970k1843J3725K0399k591p3012J25826
441F6286p5308o4244J82079j69892K6165J38457j98744J19700K5495j28988J36039
452E7045p1031o025N6998p9881Q2045n7606n37P4379j18854R5858j1986q0718
464f0313J23538r5281K1549N3290r7983J01898o4121r281R3473j41208J08373
$$ y = [170656, -211956, 75101, 113004, -186727, 96854, 54215, -121327, 59667, 41947, -65514, -8816, 85284, -61996, -54531, 148449, -110654, -43534, 179293, -167525, 12274, 151156, -182692, 65852, 85726, -141065, 71689, 34717, -72298, 23244, 36132, -27546, -40990, 85389, -38804, -70785, 139769, -91259, -44831, 152147, -136885, 13945, 109637, -135257, 57068, 44026, -83484, 48752, 3782, -18061, -4336, 16063, 13472, -59540, 66286, -9022, -73266, 108813, -61079, -34914, 103543, -95201, 24499, 49994, -78994, 57045, -13986, -20011, 36987, -42894, 39151, -18455, -18992, 55387, -63467, 32391, 20405, -60313, 63225, -32056, -10507, 42783, -55200, 46698, -17423, -26704, 66769, -74439, 33934]
475C3934K488j25033J69941r8804l7088J35676j29929M2443M3849o7822M1609
486A1264k1704L4984m5010r72R5371j54618R5745O6169k07165J97611k8090j68364
498a24779K29647j10808p6772J71887j13234j3956P6610l2169l7134K6200O7851
509F3343j33504O5146J08580k30894J64667O0334k56544K47569l5823j95372K50010
520A07512r9058j02074J71526p4647n7662P8608J9035j02043M8791J07738k01520
531a03794J05017J23794k78734K01028N8425k75611K60055l2700j97537K34101
541I4044p3090j09603J43082k7496q4150N9934O8056j40762M8823J38593k31995
552a14564J13787J30925k83481J98552N3842k52410K31329k8937j61175J80550
$$ y = [33934, 36422, -88611, 81330, -17474, -54562, 81114, -48815, -6372, 37477, -30345, 11264, -10440, 24544, -20466, -21438, 73933, -80685, 15060, 81229, -125936, 71675, 43585, -124779, 104868, -5940, -82712, 89175, -24059, -38015, 38595, 6426, -30708, -4508, 63343, -70161, -5015, 103565, -127329, 37338, 97672, -158872, 88697, 52874, -142498, 107512, 8454, -93620, 77906, 3259, -54403, 24205, 43240, -58803, -10012, 97726, -103794, 1223, 125017, -153717, 47311, 105736, -169875, 90180, 57480, -140057, 94044, 20954, -88649, 54433, 26937, -57213, 2721, 70777, -69985, -21162, 117431, -114564, -777, 130148, -153333, 45219, 99061, -153349, 77980, 49043, -112132, 68418]
562F8418m7942q0862Q2390J4002p3703J2652J06769j41089K2668J56074k23366
573a03989R7805J23694k49873J72488L5936j94512J81504l5994r6923J12055l3831
584H360l0836J5623L9401m3604l3953J21654j16574l757J46114j83251P4552R3015
596H6744j83644J33076L168j10709J19914n3476j5421M0142l3811L3657m6589
607b6949M1812N626p4703J08547o7546k7989J09431j17568N0682M0065r6469R4473
619C9412m8344j2528O3541q8385P5172k1538n2206J03305r3794K5060N7176r7568
631e0697P5279j6463l3956N2594m9569M2774k9318q796O9059j09744Q0591K1284
643D3038j29246J53643o2811p8348J57946j15496m839R7947r6182K6013K9921
$$ y = [68418, 20476, -60386, 22004, 36006, -37697, -25045, 81724, -59365, -36697, 119377, -103989, -6184, 117510, -132363, 40125, 76061, -118451, 63053, 27059, -69864, 42191, 8360, -22476, -6853, 32548, -11056, -45009, 76645, -39929, -43686, 102428, -80823, -6271, 86744, -96900, 36176, 39344, -71365, 48549, -4927, -20348, 19794, -14017, 19640, -26949, 14863, 20489, -54214, 54333, -13213, -41202, 68229, -49339, 1343, 41408, -55061, 39412, -8932, -21460, 42081, -46304, 28868, 7330, -44876, 58429, -35365, -10305, 46871, -50697, 24582, 8119, -25837, 26757, -22812, 19962, -9356, -18152, 50907, -58837, 21754, 43038, -86208, 67435, 4624, -73724, 84222, -31274, -36113, 61834, -34348, -8335, 21586]
654B1586k2714j4849J3398M5668r8832O5700N4929j64096J49794j884j63273K01942
666H7369p7394j02192J83526j09191l5686J13928p0667k2287N2689Q245p6528
677d8188N1465O5455j58682J13582N6718k06566J90954r248j84575K21873p6616
688A6172j13992J82670q8523n5796J06567l3571n9351N5416M4970j22762O9883
699A683Q6181j96403J36488O0194k22123J99624r304j80182K06674o3113j05812
710h6093J50193n5604n8796P3587Q233p5004L5079P8702j39511O1314J01906j98523
722a04517J26497O1444k02078J74083q621j45155J61559m9392p1351R4503k6595
733A0377l6882K3081M1575o6233J019J00882j31772M1145J04049j75849J05899
$$ y = [21586, -1128, -15977, -2579, 43089, -55743, 9957, 64886, -99210, 50584, 48700, -114573, 87369, 9975, -92217, 91309, -17882, -53568, 60360, -10307, -32594, 20095, 28340, -48188, 3277, 68732, -89950, 23632, 80350, -126216, 64738, 55490, -129085, 92788, 16172, -97820, 84850, -3673, -59469, 47098, 13527, -45824, 9592, 54562, -68200, 1683, 87864, -108539, 27949, 88143, -133980, 65644, 56340, -123842, 82832, 19719, -86093, 64100, 8496, -50300, 23287, 31520, -43484, -8405, 70297, -69214, -7900, 94006, -104517, 21980, 83424, -118654, 55429, 46808, -98347, 63212, 13820, -57531, 36972, 10377, -26505, -3424, 38151, -28082, -27063, 73819, -57953, -16808, 87241, -88608, 17291]
744A7291M8571j58123J38387k0156q8821J07245m6232j8986L3035r587N69k8354
756b5161N8309l9562l2849J01923r9897J6512Q5473j25319P5017K1009q9611R0604
768C6448m0299j5720M6358n1483M3498k5627o841M7442p1413N4714J68n8839Q0878
781C9284n3026k002M7435o2293M9544k1702j3780N0771p3578N9960k687p0076
793e2150J05820o9844j7875R2842r9019L6955L8276o9094M5813p199o813k118
805d406r67L5342p1398N6725K2286j10082J24262l6049r1425J51905r2494l5516
817e1817J22752j02385Q405O4921n8442J393K9149L445n4203M7200L4111j16778
829g2249J06697J0118j39673J62384m8111j08513J72105r2206n2003J30320q5647
$$ y = [17291, 65862, -92261, 46126, 25970, -62851, 44394, -1838, -20824, 12211, 2624, 3193, -25161, 33148, -6414, -39263, 62660, -37237, -20725, 64748, -60571, 14446, 35455, -54156, 36448, -3851, -19571, 26787, -24696, 18802, -6825, -13666, 33776, -37637, 17077, 17245, -41594, 39284, -13742, -15744, 31691, -30602, 18942, -2760, -16540, 34231, -39347, 20613, 17926, -52150, 53670, -16174, -34049, 58793, -40226, -3271, 35005, -34089, 11724, 4525, -2288, -4406, -5373, 29969, -41429, 15296, 37582, -72500, 51762, 15713, -75712, 76193, -16301, -51817, 70935, -31450, -23045, 41876, -16566, -15173, 13976, 17421, -36782, 10418, 44529, -72249, 34448, 44566, -95107, 67277, 19166, -89347, 82758, -9448, -61451, 68869, -16778]
840a6778j8992P3006l2944l8894M8309K4515r8437P7140M1730j51389J36957N977
852E0200j56914J79567n1547j12827J70282q2104n6592J16496n9195l5177O1219
863B3408O0o6392M7786M9979j24922Q4327N2586j63310J38556Q760j50770J63852
875F3920m3061r7776J37556n9094m6446P8364k5100l6356L0758L3100p3749K9080
887h804P0473j26168P0650N8814j49330J17930R325j22477J29255l6581o4847
898e1760R1494m0688k0247L1463Q69k1364o248N5183o3690M367P8977j09043N0325
911c62N3163j16239Q9582q12p5367Q5673l8566j5581L7512k9781J9344j9728J7018
924E856O757m4385O3430l7975k1336P1363p2975K5802L3635o5130N5273k0073
$$ y = [-16778, -35770, 37236, 4292, -34602, 13707, 38222, -60215, 16925, 58655, -92734, 44223, 50200, -106714, 72853, 21306, -91521, 78761, -3343, -59935, 56561, -2634, -37811, 23408, 23468, -42924, 4862, 54841, -70081, 14246, 66832, -96478, 42078, 50838, -99932, 63920, 20859, -76917, 60639, 1545, -44901, 33463, 8363, -27993, 2765, 35865, -37884, -8804, 61669, -64499, 6151, 64965, -84365, 33565, 42890, -79587, 49668, 13087, -51760, 39734, -954, -21201, 10262, 11131, -10233, -16481, 38702, -24988, -20621, 58356, -50687, -362, 52801, -63438, 26144, 25332, -50035, 35638, -2928, -18509, 19003, -10778, 8566, -11162, 5856, 12613, -31772, 31658, -6317, -27653, 43710, -29265, -3463, 30172, -34958, 20315, 242]
936B42j6216L9620m7544L9039j1490k9446O2044n9836J7123L9732p0181N2972
948A6059m336l7755M7063k9168Q365J745r801K8271m8363M2879K907o4782R1119
961D4203m8980l7615J00468q6874Q617O7953q2387L3629K4675m0542J4069R714
973F930L805l6900L8810J3503q0373R1708j9410q4393J28394o7587m9594J22852
985F7745r2325p158Q2931p4285O175M3589k7821k2922L8390R914p2891P3222R189
998C3753j05864J21220k8008r8167J45008p0088n8615J27281q2970k1082Q3372
1009D5840n4906j7808M9058p221n3044N2545K2678r9646R0845J2010j20845J31899
1021E1405k8131j00504J41074o3033n6596J10490o2613k5012O2826k5109l1283
$$ y = [242, -15974, 23646, -23898, 15141, 3651, -25795, 36249, -23587, -6464, 33268, -36913, 16059, 11723, -26032, 21031, -8137, 228, 1973, -7828, 20443, -27920, 14959, 17866, -46916, 44203, -4777, -42392, 58076, -28798, -20181, 47772, -34615, -986, 23689, -16853, -2784, 6930, 10735, -26165, 12645, 26148, -54225, 37483, 18073, -66320, 62074, -5513, -55107, 67745, -24580, -31738, 51193, -23092, -16917, 26672, -1149, -24071, 14319, 24233, -48658, 24564, 33753, -72111, 49109, 21101, -77066, 67942, -2146, -60761, 66520, -16450, -37532, 45840, -9066, -26874, 22184, 14963, -38081, 14464, 37142, -62504, 28341, 40351, -80494, 51405, 23274, -77230, 63844, 811, -55785, 54705, -7908, -32920, 29906, 4797, -26486]
1032b6486L4672K1304p0537M6845M0864j10270Q6229K0383j17417J17695k0968
1043B2314q6677J13989m7738m2257P5708l7385j8190L0791K956l2061J2294M2227
1055C5971p0980L1724N0152j00983O9358K1879r5670R1423j8261n7703P6726l6450
1067b814j5305L3651j7696P55o926K3843j9988j5839N5653n7708J0434N1622p7324
1080c7642M5950J5835n9794N7940k1647j6283L3198l0835K2034j1587n271K8440
1092B0338m3855L4217J762m1428N4972l1828r726L9308m0951K1901l1j4896K4922
1105A4705l1998K8628n048l2952N9160m6557l728N6188o8930L0984K6154n6679
1117c0073M1408k507k2011J7431k845M661k2653K8604J13m8322O9831l3050m1135
$$ y = [-26486, 8186, 29490, -41047, 5798, 46662, -63608, 22621, 43004, -74413, 43282, 22314, -64363, 49626, 1888, -40369, 35339, -2046, -20236, 10555, 13511, -18550, -6256, 35971, -35009, -3285, 46867, -54116, 15242, 37121, -58549, 32874, 14613, -43090, 33636, -2814, -18119, 15532, -2164, -1409, -8335, 15508, -4480, -20319, 35334, -22374, -11940, 39682, -37642, 8308, 24143, -35651, 22289, 642, -15641, 17557, -13278, 8756, -2831, -8102, 20338, -23517, 10700, 12462, -28966, 26006, -5822, -15548, 23760, -17191, 4710, 4679, -10217, 14705, -17293, 11335, 6287, -26665, 32495, -14062, -17790, 38398, -30532, 452, 26606, -30073, 11335, 8828, -13183, 4248, 1403, 6064, -16589, 12015, 12128, -36194, 33637, 587, -40548]
1130d0548R0865o9268q874P7799q0330K0314M4075n7751K0114K0442k0801j1316
1142a5279K8473O2n0023O3624j2036o6850R9169m6544n1212J08925p5479j7786
1154c4956Q6976p5418M450N2854m6241m345L5639j1325l8438N0151J661p1320
1166e0312Q4656j6191p8674J12083m9012n6522J11078o9554k3951Q2429n9937
1177a3907q500M8953k6112k4021L7434N911n8641N6013J2095q4759Q8103j0315
1189B2254q2162J06325m0984n3727R4492n3066k2438O0152l4848j3924K9482P17
1201A2273l4853K5309K6409o7279M8056K3280q4376P6802l746p1837Q5736l1097
1213D677l9342O5768l5593j1755L0160j2267r860N076K1202l3466P558L9005o1328
$$ y = [-40548, 50317, -18951, -27825, 49974, -30356, -10042, 34033, -23718, -3604, 16838, -3963, -15279, 13194, 13256, -36767, 26857, 14821, -52029, 47140, 596, -50616, 58309, -17170, -34956, 52020, -23398, -18948, 33906, -12335, -16680, 18959, 7634, -30804, 19347, 21008, -50312, 34344, 18153, -60521, 51562, 2550, -53972, 57106, -12448, -36399, 46030, -13907, -22407, 26546, 434, -23587, 13847, 19758, -38883, 17130, 29225, -55534, 32569, 22254, -59908, 46417, 5433, -48294, 46198, -6868, -29306, 30846, -4002, -17926, 11556, 12273, -22580, 2729, 29138, -38141, 9915, 33195, -51181, 25621, 21875, -49962, 35774, 4677, -34665, 31103, -4490, -16245, 13915, 1648, -8212, -3136, 18066, -15400, -7842, 31163, -30165]
1226c0165L2094K8514o9315N5512k77m9307N6014k2992j5448K9914k0360P348
1238A532m908O308K994k3309L5880k2140j3900M5035m4676J2252K6540m3357L0735
1251H986l987j6666K3384k1559J6714o503j2427L2845l7560J5677K1843m7226
1263b6479L9395l994l0839L9399k0407m639J5276j1522Q173j3628J7993m857k5151
1276b1280M7464l5004j1271N6146n9725J5625M0126o1063L2813J5354l9830K4928
1288D283M759j4410k584J9016o586k8847M9108k3489l4412P3184n1865j6505P3612
1301D5264o9284Q832N2291o1829J8919K8928l6065M053K3981j2927k5003M3054
1313B0214j1409m6191P1854l1972m4210Q8327n7702k2160Q0280o7194L14N5731
$$ y = [-30165, 1929, 30443, -38872, 16640, 16363, -32944, 23070, 78, -15370, 14544, -5816, 1532, -3376, 2932, 5926, -17383, 18497, -3643, -17543, 27492, -17184, -4932, 21608, -21749, 8986, 4999, -11667, 11717, -9842, 6872, 369, -12058, 20787, -16773, -1096, 20747, -26479, 12916, 8922, -21917, 17482, -2925, -7564, 7712, -3810, 4363, -9265, 8728, 3871, -21280, 26184, -8820, -20091, 36055, -23670, -8045, 32081, -28982, 3831, 19185, -20645, 4283, 9042, -5368, -7952, 11064, 4478, -24369, 24739, 1250, -33162, 40022, -11843, -28348, 45264, -24020, -15188, 37103, -24726, -5807, 23121, -12944, -8891, 15090, 2163, -22840, 20214, 8805, -37386, 34468, 2496, -41714, 46613, -11089, -33249, 47031, -20163, -19849, 35882]
1325C5882n2802L848L5090k5443j5203L5127o422m2480N5633r647n7465Q0107
$$ y = [35882, -16920, -13072, 22018, -3425, -18628, 16499, 10077, -32403, 23230, 13583, -43882, 36225]
$$ [...]
8191f
##END NTUPLES=NMR FID
##END=
