##TITLE=1H_LY-DMAA.Per.1.20
 CDCl3
 8 sc, 
 17.03.2022
##JCAMPDX= 6.0         $$ Bruker NMR JCAMP-DX V2.0
##DATA TYPE= NMR FID
##DATA CLASS= NTUPLES
##ORIGIN= UXNMR, Bruker Analytische Messtechnik GmbH
##OWNER= root
$$ XWIN-NMR		Version 3.5
$$ Thu Mar 17 13:22:02 2022 Russian Standard Time (UT+4h)  she@DPX200
##.OBSERVE FREQUENCY= 200.131346
##.OBSERVE NUCLEUS= ^1H
##.DELAY= (6, 6)
##.ACQUISITION MODE= SIMULTANEOUS
##.ACQUISITION SCHEME= undefined
##.AVERAGES= 8
##.DIGITISER RES= 18
##SPECTROMETER/DATA SYSTEM= spect
##.PULSE SEQUENCE= zg30
##.SOLVENT NAME= D2O
##.SHIFT REFERENCE= (INTERNAL, D2O, 0, 15.7039)
##AUDIT TRAIL= $$ (NUMBER, WHEN, WHO, WHERE, WHAT)
$$ ##TITLE= Audit trail, XWIN-NMR		Version 3.5
$$ ##JCAMPDX= 5.01
$$ ##ORIGIN= Bruker BioSpin GmbH
$$ ##OWNER= she
$$ F:/spectra/data/she/nmr/H-F/1/audita.txt
$$ ##AUDIT TRAIL=  $$ (NUMBER, WHEN, WHO, WHERE, WHAT)
(   1,<2022-03-17 13:20:50.59 +0400>,<she>,<DPX200>,
      <created by zg, POWCHK disabled, PULCHK disabled
       configuration hash MD5:
       00 E9 B6 7A A2 85 ED C7 34 08 36 98 17 FE 4E 26
       data hash MD5: 16K
       B9 36 4B 67 CF 64 4B D6 08 27 F4 8B 37 F2 D5 0C>)
$$ ##END=
$$ 
$$ hash MD5
$$ DE 54 11 43 D1 44 3B 5E 10 17 85 27 F9 A9 89 33
##$RELAX= 
##$RELAX= 
##$RELAX= 
##$RELAX= 
##$RELAX= 
##$RELAX= 
$$ Bruker specific parameters
$$ --------------------------
##$DU= <F:/spectra>
##$EXPNO= 1
##$NAME= <H-F>
##$PROCNO= 1
##$TYPE= <nmr>
##$USER= <she>
##$AMP= (0..31)
100 100 100 100 100 100 100 100 100 100 100 100 100 100 100 100 100 100 
100 100 100 100 100 100 100 100 100 100 100 100 100 100 
##$AQSEQ= 0
##$AQ_mod= 1
##$AUNM= <au_zg>
##$AUTOPOS= <>
##$BF1= 200.13
##$BF2= 200.13
##$BF3= 200.13
##$BF4= 200.13
##$BF5= 200.13
##$BF6= 200.13
##$BF7= 200.13
##$BF8= 200.13
##$BYTORDA= 1
##$CFDGTYP= 0
##$CFRGTYP= 5
##$CHEMSTR= <none>
##$CNST= (0..31)
1 1 145 1 1 1 1 1 1 1 1 1 1 1 1 1 1 1 1 1 1 1 1 1 1 1 1 1 1 1 1 1 
##$CPDPRG= <>
##$CPDPRG1= <>
##$CPDPRG2= <>
##$CPDPRG3= <>
##$CPDPRG4= <mlev>
##$CPDPRG5= <mlev>
##$CPDPRG6= <mlev>
##$CPDPRG7= <mlev>
##$CPDPRG8= <mlev>
##$CPDPRGB= <>
##$CPDPRGT= <>
##$D= (0..31)
0 1.2 0 0 0 0 0 0 0 0.06 0 0.03 0 0 0 0 0.0002 0 0 0 0 0 0 0 0 0 0 0 0 
0 0 0 
##$DATE= 1647508849
##$DBL= (0..7)
120 120 120 120 120 120 120 120 
##$DBP= (0..7)
150 150 150 150 150 150 150 150 
##$DBP07= 0
##$DBPNAM0= <>
##$DBPNAM1= <>
##$DBPNAM2= <>
##$DBPNAM3= <>
##$DBPNAM4= <>
##$DBPNAM5= <>
##$DBPNAM6= <>
##$DBPNAM7= <>
##$DBPOAL= (0..7)
0.5 0.5 0.5 0.5 0.5 0.5 0.5 0.5 
##$DBPOFFS= (0..7)
0 0 0 0 0 0 0 0 
##$DE= 6
##$DECBNUC= <off>
##$DECIM= 32
##$DECNUC= <off>
##$DECSTAT= 4
##$DIGMOD= 1
##$DIGTYP= 9
##$DL= (0..7)
0 120 120 120 120 120 120 120 
##$DP= (0..7)
150 150 150 150 150 150 150 150 
##$DP07= 0
##$DPNAME0= <>
##$DPNAME1= <>
##$DPNAME2= <>
##$DPNAME3= <>
##$DPNAME4= <>
##$DPNAME5= <>
##$DPNAME6= <>
##$DPNAME7= <>
##$DPOAL= (0..7)
0.5 0.5 0.5 0.5 0.5 0.5 0.5 0.5 
##$DPOFFS= (0..7)
0 0 0 0 0 0 0 0 
##$DQDMODE= 0
##$DR= 18
##$DS= 0
##$DSLIST= <SSSSSSSSSSSSSSS>
$$ [...]
##$SUBNAM2= <"">
##$SUBNAM3= <"">
##$SUBNAM4= <"">
##$SUBNAM5= <"">
##$SUBNAM6= <"">
##$SUBNAM7= <"">
##$SUBNAM8= <"">
##$SUBNAM9= <"">
##$SW= 18.0517287032376
##$SWIBOX= (0..15)
0 0 2 0 0 0 0 0 0 0 0 0 0 0 0 0 
##$SW_h= 3612.71676300578
##$TD= 16384
##$TD0= 1
##$TE= 0
##$TE2= 300
##$TE3= 300
##$TEG= 300
##$TL= (0..7)
0 120 120 120 120 120 120 120 
##$TP= (0..7)
150 150 150 150 150 150 150 150 
##$TP07= 0
##$TPNAME0= <>
##$TPNAME1= <>
##$TPNAME2= <>
##$TPNAME3= <>
##$TPNAME4= <>
##$TPNAME5= <>
##$TPNAME6= <>
##$TPNAME7= <>
##$TPOAL= (0..7)
0.5 0.5 0.5 0.5 0.5 0.5 0.5 0.5 
##$TPOFFS= (0..7)
0 0 0 0 0 0 0 0 
##$TUNHIN= 0
##$TUNHOUT= 0
##$TUNXOUT= 0
##$USERA1= <user>
##$USERA2= <user>
##$USERA3= <user>
##$USERA4= <user>
##$USERA5= <user>
##$V9= 5
##$VALIST= <valist>
##$VCLIST= <CCCCCCCCCCCCCCC>
##$VD= 0
##$VDLIST= <DDDDDDDDDDDDDDD>
##$VPLIST= <PPPPPPPPPPPPPPP>
##$VTLIST= <TTTTTTTTTTTTTTT>
##$WBST= 1024
##$WBSW= 4
##$XGAIN= (0..3)
0 0 0 0 
##$XL= 0
##$YL= 0
##$YMAX_a= 504813
##$YMIN_a= -436006
##$ZGOPTNS= <>
##$ZL1= 120
##$ZL2= 120
##$ZL3= 120
##$ZL4= 120
##$ABSF1= 10
##$ABSF2= 0
##$ABSG= 5
##$ABSL= 3
##$ALPHA= 0
##$AQORDER= 0
##$ASSFAC= 0
##$ASSFACI= 0
##$ASSFACX= 0
##$ASSWID= 0
##$AUNMP= <proc_1d>
##$AZFE= 0.1
##$AZFW= 0.1
##$BCFW= 1
##$BC_mod= 2
##$BYTORDP= 1
##$COROFFS= 0
##$CY= 11.3945322036743
##$DATMOD= 1
##$DC= 2
##$DFILT= <>
##$DTYPP= 0
##$F1P= 2.36226072786647
##$F2P= -0.459571619588291
##$FCOR= 0.5
##$FTSIZE= 0
##$FT_mod= 4
##$GAMMA= 1
##$GB= 0.15
##$INTBC= 1
##$INTSCL= 1
##$ISEN= 128
##$LB= 0.24
##$LEV0= 0
##$LPBIN= 0
##$MAXI= 10000
##$MC2= 0
##$MEAN= 0
##$ME_mod= 0
##$MI= 1.114404
##$NCOEF= 0
##$NC_proc= 0
##$NLEV= 6
##$NOISF1= 3.799351
##$NOISF2= 2.8
##$NSP= 1
##$NTH_PI= 0
##$NZP= 0
##$OFFSET= 15.70392
##$PC= 1
##$PHC0= -17109.94
##$PHC1= 14.20078
##$PH_mod= 1
##$PKNL= yes
##$PPARMOD= 0
##$PSCAL= 0
##$PSIGN= 0
##$REVERSE= no
##$SF= 200.130013532006
##$SI= 16384
##$SIGF1= 3
##$SIGF2= 2
##$SINO= 400
##$SIOLD= 16384
##$SREGLST= <1H.CDCl3>
##$SSB= 0
##$STSI= 0
##$STSR= 0
##$SW_p= 3612.71676300578
##$SYMM= 0
##$S_DEV= 0
##$TDeff= 0
##$TDoff= 0
##$TI= <>
##$TILT= no
##$TM1= 0
##$TM2= 0
##$TOPLEV= 0
##$USERP1= <user>
##$USERP2= <user>
##$USERP3= <user>
##$USERP4= <user>
##$USERP5= <user>
##$WDW= 1
##$XDIM= 8192
##$YMAX_p= 0
##$YMIN_p= 0
$$ End of Bruker specific parameters
$$ ---------------------------------
##NTUPLES= NMR FID
##VAR_NAME=  TIME,          FID/REAL,        FID/IMAG
##SYMBOL=    X,             R,               I
##VAR_TYPE=  INDEPENDENT,   DEPENDENT,       DEPENDENT
##VAR_FORM=  AFFN,          ASDF,            ASDF
##VAR_DIM=   8192,          8192,            8192
##UNITS=     SECONDS,       ARBITRARY UNITS, ARBITRARY UNITS
##FACTOR=    0.0002768,     1,               1
##FIRST=     0,             0,               0
##LAST=      2.2672688,     0,               0
##MIN=       0,             -436006,         0
##MAX=       2.2672688,     504813,          0
$$ Real data points
##PAGE= N=1
##DATA TABLE= (X++(R..R)), XYDATA
$$ [...]
1928D61NO78l631l05P001M32r676j238J1182K195j1166l222R914L611p442l354
$$ 461 466 1144 -2487 -2792 4209 4641 -5035 -6273 4909 7104 -4062 -7284 2630 6241 -1201 -4555
1944d555M061K296l85k29l166k383N957N312p702p992Q303J0154p512j1402N879
$$ -4555 -494 1802 1417 1188 -1978 -4361 1596 6908 -794 -8786 -483 9671 2159 -9243 -3364
1959c364J1018l305r421Q06O357J497k335l186k332L749O998l388j0826J997J3521
$$ -3364 7654 4349 -5072 -4266 2091 3588 1253 -1933 -4265 -516 6482 3094 -7732 -5735 7786
1974G786l7j4597k246J3758M332j1169n610P384N819k767m834j991K543O478N02
$$ 7786 7749 -6848 -9094 4664 8996 -2173 -7783 -399 5420 2653 -2181 -4172 -1629 4849 5351
1989E351r659m116J1561P367j1720j0009J0349J1529p772j1603M239J0180p14
$$ 5351 -4308 -8424 3137 10504 -1216 -11225 -876 10653 2881 -8722 -4483 5697 4983
2002D983p238k485L134M950J585o180o383O167J0520m957j3400K977J4516l63
$$ 4983 -2255 -4740 -1606 3344 4929 -1251 -7634 -1467 9053 4096 -9304 -6327 8189 7826
2016G826j3980k045J1683L985p940m974L475M709J223l329n606R77R072J880j1217
$$ 7826 -6154 -8199 3484 7469 -471 -5445 -1970 2739 3962 633 -4973 -3996 5076 6956 -4261
2031d261m711J1654P039j0734q383Q457Q615n346p505J904N260J162k013l456
$$ -4261 -8972 2682 9721 -1013 -9396 -939 7676 2330 -5175 -3271 1989 3151 1138 -2318
2045b318j659M833N324n129q487M663J0537l481j1155K006J0323m71q360r27N448
$$ -2318 -3977 856 6180 1051 -7436 -2773 7764 4283 -6872 -4866 5457 4986 -3374 -4301 1147
2060A147J660j970j638j472P36M582N93o967k311Q396L943q679m903P717N153
$$ 1147 2807 837 -801 -2273 -1537 3045 3638 -3329 -5640 2756 6699 -1980 -6883 834 5987
2075E987n930m505L740L107j369r70o27j572J868M112k535o214K471P839k068
$$ 5987 57 -4448 -708 2399 1030 60 -567 -2139 -271 3841 1306 -4908 -2437 5402 3334
2090C334q352J244P707m55o053p3L548K99n96k0k358r28M790K270o222l804O959
$$ 3334 -5018 -3774 3933 3478 -2575 -2648 900 1199 603 583 -1775 -2703 2087 4357 -1865 -5669 1290
2107A290N000o729n682N653N620l922m556J924K583J24j53j871k547K993N230
$$ 1290 6290 -439 -6121 -468 5152 1230 -3326 -1402 1181 1305 1152 -719 -3266 -273 4957
2122D957l186p534K517Q980j329r520j55Q919J482o933k430L975K644m64k066
$$ 4957 1771 -5763 -3246 5734 4405 -5115 -5270 3649 5131 -1802 -4232 -257 2387 1923 -143
2137a43l008Q58O043Q23p946l033Q897N007q453o641P144P421n068p083K331N590
$$ -143 -3151 -2293 3750 4573 -3373 -6406 2491 7498 -955 -7596 -452 6969 1901 -5182 -2851 2739
2153B739N60l213l044k7M911L403n855o500N562Q996m316j0420K344J0680k37
$$ 2739 3299 86 -2958 -2985 1926 5329 -526 -7026 -1464 7532 3216 -7204 -4860 5820 5583
2168E583r474j779P268L183l961l878J19L691L758k625o955Q38R268J234j0198
$$ 5583 -3891 -5670 1598 4781 820 -3058 -2939 752 4510 1885 -5070 -4232 5036 6270 -3928
2183c928l551R824N396q132o657N653O627k513n617n41L436L274m95n304k647
$$ -3928 -7479 2345 7741 -391 -7048 -1395 5232 2719 -2898 -3439 -3 3271 2776 -2528 -5175
2198e175O288N545o212p735N272R078l554r209J428Q205N17o160k083L336L010
$$ -5175 1113 6658 446 -7289 -2017 7061 3507 -5702 -4274 3931 4448 -1712 -3795 -459 2551
2213B551Pl124l388K373O247j142q104m27Q797K094q481l386O996M104m795m071
$$ 2551 2558 -566 -3954 -1581 4666 3524 -4580 -5007 3790 5884 -2597 -5983 1013 5117 322 -3749
2229c749K303L256K01j645k397m49L999K797m866m777M897O135m128o769K870
$$ -3749 -1446 1810 2011 366 -2031 -2480 1519 4316 -550 -5327 -430 5705 1577 -5192 -2322
2244b322O439j330n313L0L185R31p79j372j641J068L985l54n753n30O511J609
$$ -2322 4117 2787 -2526 -2496 689 1620 841 -531 -2172 -1104 2881 2527 -3226 -3756 2755 4364
2260D364o507k308N661K604m021k527K089J813j4n18j646j180K877K988l634m474
$$ 4364 -2143 -4451 1210 3814 -207 -2734 -645 1168 1154 636 -1010 -2190 687 3675 41 -4433
2276d433L524N630k946o013J900N464p30m234l65K392J123r5j368k276R54M378
$$ -4433 -909 4721 1775 -4238 -2338 3126 2396 -1838 -2203 189 1312 1217 -151 -2427 -1473 2905
2292B905j01n790r85O502K287o364l220N232L787l552l616J490K732O79j182k775
$$ 2905 2804 -2986 -3971 2531 4818 -1546 -4766 466 4253 701 -2915 -1425 1307 1986 804 -1971
2308a971p23M050K882m658m732M264O302l456p031K063O865l67n816j090L815
$$ -1971 -2694 1356 4238 -420 -5152 -888 5414 1958 -5073 -3010 3855 3488 -2328 -3418 397
2323C97K259j255k862j532K883M020j992o145O87P466R31p806k447P063L702n433
$$ 397 2656 1401 -1461 -2993 -110 3910 1918 -4227 -3540 3926 4857 -2949 -5396 1667 5369 -64
2339f4m419L154M345o60l377j945J711M061M17n430k663N854M777n469o205M153
$$ -64 -4483 -1329 3016 2356 -1021 -2966 -1255 2806 3223 -2207 -4870 984 5761 292 -5913 -1760
2355a760P072k493o822N26N654J383l692k687J083L480J583l440m092K722O085
$$ -1760 5312 2819 -4003 -3477 2177 3560 -132 -2819 -1736 1744 3327 -113 -4205 -1483 4602
2370D602j525p325o8P520J635o807k750N150L574l056l589M70K904J976j578l850
$$ 4602 3077 -4248 -4316 3204 4839 -1968 -4718 432 4006 950 -2639 -2169 735 2711 1133 -2717
2386b717j73N119K023n644l637N219M951m098n494K613N208q63m219p70K466J996
$$ -2717 -2890 2229 4252 -1392 -5029 190 5141 1043 -4451 -1838 3370 2507 -1712 -2482 -16 1980
2402A980l34k640j893K569L883k066n244J087N970O1n895j127M907J984l425k248
$$ 1980 1646 -994 -2887 -318 3565 1499 -3745 -2658 3312 3373 -2522 -3649 1258 3242 -183 -2431
2418b431J565K050L79j269k130J13L392J320m104k596M246L548l685m100K588
$$ -2431 -866 1184 1563 294 -1836 -1723 1669 2989 -1115 -3711 535 4083 398 -3702 -1114
2433a114M057j318l303K7J985R47l05j696j482J846L120j475m356Q13M964J30
$$ -1114 2943 1625 -1678 -1651 334 1281 976 -720 -2202 -356 2764 1289 -3067 -2254 2710 2840
2449B840m955r37M184J690k908j937J235J772M86j070k055k9L254J383l934k709
$$ 2840 -2115 -3052 1132 2822 -86 -2023 -788 984 1470 400 -1655 -1684 1570 2953 -981 -3690
2465c690L881L682l255m203K181M151q71l485n06K241J555n65k103j413K427L055
$$ -3690 191 3873 618 -3585 -1404 2747 1876 -1609 -2115 126 1681 1116 -987 -2400 27 3082
2481C082j908m517J111N354l6n454j063M800J999l520k535J745K605K97k184k086
$$ 3082 1174 -3343 -2232 3122 3086 -2368 -3431 1369 3368 -152 -2687 -942 1663 1960 -224 -2310
2497b310J104L500L45m520j843M665L277m217m275L126M669j629m421J31L372
$$ -2310 -1206 2294 2639 -1881 -3724 941 4218 1 -4274 -1148 3521 1892 -2529 -2398 974
2512I74J500j843k613j8L166J962l006l779K307N094j232n726m4N555J388m736
$$ 974 2474 631 -1982 -2000 1166 3128 122 -3657 -1350 3744 2512 -3214 -3258 2297 3685 -1051
2528a051k356L188K857j298k866p66K347K601j327l995l6M687J659m843k925M219
$$ -1051 -3407 -219 2638 1340 -1526 -2292 55 2656 1329 -2666 -2702 1985 3644 -1199 -4124 95
2544I5L931l163m201J588L944K9k946j482J521K583K16l157k006L097L524k482
$$ 95 4026 863 -3338 -1750 2194 2223 -723 -2205 -684 1899 2115 -1042 -3048 49 3573 1091
2560A091m602J393N064k17m824r18L941J787k402k315O22K265J160j792k651Q94
$$ 1091 -3511 -2118 2946 2729 -2095 -3013 928 2715 313 -2002 -1380 885 2045 253 -2398 -1504
2576a504L722L19m187j502M010K566l355l191K362L268j106k780l22J871J394
$$ -1504 2218 2537 -1650 -3152 858 3424 69 -3122 -760 2508 1402 -1378 -1700 171 1565
2591A565m64k274r09K498K277k413l250J707L902p13m014k04L474J012k465j536
$$ 1565 1101 -1173 -2082 416 2693 280 -2970 -1263 2639 1926 -2088 -2292 1182 2194 -271 -1807
2607a807J108J703N01j377j895P13K893R7l439j020L465J913l001k595K091K782
$$ -1807 -699 1004 1505 128 -1767 -1054 1839 1936 -1503 -2523 942 2855 -146 -2741 -650 2132
2623B132r69k465k02J708J129n63j840q52K261K101k012l126J586L598p75l597
$$ 2132 1163 -1302 -1504 204 1333 770 -1070 -1922 339 2440 428 -2698 -1112 2486 1711 -1886
2639a886k79L313J070k402j641J260J794J44j598j529R27K739l5l562q23L593
$$ -1886 -2165 1148 2218 -184 -1825 -565 1229 1373 -225 -1754 -827 1912 1877 -1685 -2508 1085
2655A085J803l186k579K353K895j161k795j34K152J310j152k092k18K553J607
$$ 1085 2888 -298 -2877 -524 2371 1210 -1585 -1719 433 1743 591 -1501 -1719 834 2441
2670B441k502k802K060L658j241l967K50L663Q78k946j814J888K216l89k295j105
$$ 2441 -61 -2863 -803 2855 1614 -2353 -2103 1560 2438 -508 -2322 -434 1782 1393 -902 -2007
2686b007J818K436r99l337j36L843J184l723k163L127K680j972k908O80K719O04
$$ -2007 -189 2247 1248 -2089 -2225 1618 2802 -921 -3084 43 2723 751 -2157 -1477 1242 1846
2702A846j957j756R25K478M34k817j714K607K877j987l686J100L872o9l466r64
$$ 1846 -111 -1867 -942 1536 1970 -847 -2561 46 2923 936 -2750 -1650 2222 2153 -1313 -2277
2718b277K511J768j311k236q6K215J516j736k626R05L296J65l651j093L394K017
$$ -2277 234 2002 691 -1545 -1631 584 2100 364 -2262 -1357 1939 2104 -1547 -2640 754 2771
2734B771k688k454J577K545l23k217r31J549J888n14k469o78K577J733k320k552
$$ 2771 83 -2371 -794 1751 1428 -789 -1720 -171 1717 1203 -1266 -1944 633 2366 46 -2506
2750b506J610L165q15l213j56K759R68j862j533O76J829N59j720j654J271K602
$$ -2506 -896 2269 1454 -1759 -1915 844 1812 -50 -1583 -907 922 1481 -239 -1893 -622 1980
2766A980n13k998m15L013J243k651j888J895K129p96k027l15J477J263o61k017
$$ 1980 1467 -1531 -1946 1067 2310 -341 -2229 -334 1795 999 -1028 -1343 134 1397 736 -1281
2782a281k01K221J271k160k093J635K629r64k730J77K453P13j893j251R19J529
$$ -1281 -1482 739 2010 -150 -2243 -608 2021 1057 -1673 -1496 957 1670 -223 -1474 -555 974
2798I74K60j495j272J192K127o66k648j67K732R68k443j629J876J918r69j936
$$ 974 1234 -261 -1533 -341 1786 1120 -1528 -1695 1037 2005 -438 -2067 -191 1727 758 -1178
2814a178m6J571J031r33j708J9K068R64k114j741J765K406j153k694L43K542N29
$$ -1178 -1224 347 1378 445 -1263 -1244 824 1788 -326 -2067 -302 2104 951 -1743 -1400 1142 1671
2831A671j980j202J121J668j26j778r60J479J901r68k551K59K775O07k724j290
$$ 1671 -309 -1511 -390 1278 1152 -626 -1586 -107 1794 826 -1725 -1466 1309 1916 -808 -2098
2847b098K061J913j294k069K92J945O72j395j555O68K057M18k299j347K145K052
$$ -2098 -37 1876 582 -1487 -1195 750 1422 27 -1528 -860 1197 1615 -684 -2031 114 2166
2863B166j630k483Q09K674Q4k383q83J647J530p76j794k98J686J407j435k196
$$ 2166 536 -1947 -1138 1536 1620 -763 -1646 1 1531 755 -1039 -1337 349 1756 321 -1875
2879a875P74K691K6k711q76K411J527j721k020Q93K036J78j762j073J140J838
$$ -1875 -1101 1590 1616 -1095 -1971 440 1967 246 -1774 -881 1155 1333 -429 -1502 -362 1476
2895A476l44k200o15K268J448j912k065J222K453n10k424k95J994J065j298j612
$$ 1476 1132 -1068 -1683 585 2033 121 -1944 -722 1731 1221 -1203 -1498 496 1561 263 -1349
2911a349L48J797O39j651j475J168K172m83k492k82K389R99j963j520J310J779
$$ -1349 -1001 796 1435 -216 -1691 -523 1649 1166 -1326 -1608 781 1780 -183 -1703 -393 1386
2927A386l82j742n47J371J270p00j867m7J994Q52j897j539J539K017q36k231J02
$$ 1386 1004 -738 -1285 86 1356 656 -1211 -1258 736 1588 -309 -1848 -309 1708 872 -1359 -1257
2944a257J900P07j451j166O43J567J75j526j049J264J702p60k057J01K201N96
$$ -1257 643 1350 -101 -1267 -624 943 1118 -408 -1457 -193 1509 749 -1308 -1207 994 1590
2960A590k003j077J373J442o58j602j01J382R32j019j478K93J768M70j796j156
$$ 1590 -413 -1490 -117 1325 667 -935 -1036 346 1278 259 -1219 -926 842 1312 -484 -1640
2976a640J557J665j029j892K70J946L95j469j012R08J369j37j540o70J361J380
$$ -1640 -83 1582 553 -1339 -1069 877 1272 -197 -1209 -301 1068 931 -609 -1279 82 1462
2992A462q90j938L16K103L18j923r64J449J435q62j524K9J485O97j169j253N19
$$ 1462 572 -1366 -1050 1053 1371 -552 -1516 -67 1368 506 -1018 -989 496 1193 24 -1229 -710
3009g10J730J48j868p70J698J335j214j779O50J899J00j687p89J140J303m56j545
$$ -710 1020 1168 -700 -1470 228 1563 349 -1430 -780 1119 1219 -468 -1257 -117 1186 730 -815
3026h15l13J455J073j225j557O51J870K4j933o17J639J146j249j433N27J524L18
$$ -815 -1128 327 1400 175 -1382 -731 1139 1163 -770 -1387 252 1398 149 -1284 -757 767 1085
3043A085j386r51R34J521k87j827l83J730J085j426j562R14J812k44j751n03J482
$$ 1085 -301 -1252 -318 1203 916 -911 -1294 436 1521 95 -1467 -553 1259 1015 -736 -1239 243
3060B43Q94q66j279J30J489O29j436j189J025J609m62j820r5J750P81j423j227
$$ 243 1137 271 -1008 -878 611 1240 -196 -1385 -360 1249 787 -1033 -1128 622 1403 -20 -1247
3077a247P92J505j79j437n28J183J066n85j554q3J786O03j591j127J132J506n52
$$ -1247 -455 1050 871 -566 -1094 89 1155 570 -984 -1067 719 1322 -269 -1396 -264 1242 690
3094F90j682o7J535O47j082j152N37J322J81j291r02J169J392p27j672K16J601
$$ 690 -992 -1059 476 1123 41 -1111 -574 748 929 -362 -1264 -95 1297 570 -1102 -886 715
3111G15M20j380r23J007J313m98j429j75J273P86q91j285L84J511K72j608q09
$$ 715 1135 -245 -1168 -161 1152 654 -775 -950 323 1109 218 -1067 -683 828 1100 -508 -1317
3128a317J299J238q40j449K80J383M27j271q91Q13J275j42j379m73J223J058q65
$$ -1317 -18 1220 380 -1069 -789 594 1021 -250 -1141 -328 947 805 -574 -1047 176 1234 369
3145C69j480L54J676J47j517o66J163J049o64j365J09J314N65j126r65N86J324
$$ 369 -1111 -757 919 1066 -451 -1117 46 1095 431 -934 -825 489 1054 -72 -1037 -451 873
3162H73o6j444m97J315J095j105j325N34J438J8j173p09R79J053m78j286m0J224
$$ 873 807 -637 -1134 181 1276 171 -1154 -620 818 836 -337 -1046 -67 986 508 -778 -818 406
3180D06O21r73j232O56J463r4j541l87J314Q57q81j186L50J259K03j065q75Q94
$$ 406 1027 54 -1178 -522 941 847 -694 -1081 233 1090 209 -977 -627 632 835 -230 -1105 -211
3198b11J183l76j288j82J269P52j047j183O87J316j39j296m45J133Q33p08j131
$$ -211 972 596 -692 -874 395 1147 100 -1083 -396 920 781 -515 -960 173 1006 298 -833
3215h33J00J311L79j157q93Q11J227l55j387j54J373N56j043r21N44J173J0j124
$$ -833 -733 578 957 -200 -1093 -282 945 590 -797 -951 422 978 -65 -986 -442 731 741 -383
3233c83n36R14R79n54j236Q6J337L47j127q87P84J236l30j317j06J173N29p93
$$ -383 -919 -5 974 420 -816 -730 607 954 -173 -1060 -276 960 630 -687 -793 380 909 116
3251A16j016L02J207J96j142p13R62J029n06j281K5J317M76j124q22P83J059l18
$$ 116 -900 -598 609 805 -337 -1050 -88 941 435 -846 -821 496 972 -152 -974 -191 868 550
3269E50j089k69J023O67o16j123K76J257J21j106o63R10J015m96j268QJ217M58
$$ 550 -539 -808 215 882 266 -857 -581 676 797 -309 -972 -62 953 457 -811 -803 414 872
3287H72r96p72N68J070q4j099m55J050P91p38j031K49J268J52j124o87R10R94
$$ 872 -124 -896 -328 742 658 -441 -896 154 945 207 -824 -575 693 845 -279 -966 -56 938
3305I38m84j104j5J052M30p99r53N23J138pj224m64J055Q21o72j084K61J192K13
$$ 938 454 -650 -665 387 817 18 -935 -412 726 719 -505 -969 86 907 235 -849 -588 604 817
3324H17j110n55P58R44m54r59q6J026N27q55r13N17J071n0j098l53Q60P77p09
$$ 817 -293 -848 -90 854 400 -559 -645 381 908 53 -860 -343 728 678 -420 -773 87 864 155
3343A55r59K50J034K23r74n40O42R33l35j036j77J086N79q28q91N09R89Mj057
$$ 155 -804 -554 480 703 -271 -811 -169 764 429 -607 -784 302 881 53 -838 -329 660 664 -393
3362c93m08R32P21n42j005J07J007L03q29p23O34R44k35j111j20R96N27p83p90
$$ -393 -801 131 852 310 -695 -588 419 722 -107 -830 -196 748 513 -598 -718 278 805 22 -768
3381g68M26R09N6r73l77P85P00m78q93M9R69L08p83p19O30Q95k74r62j58Q70N40
$$ -768 -342 567 623 -350 -727 58 758 280 -613 -564 405 713 -70 -789 -159 736 462 -500 -658 212 752
3402G52o46p92K69R55N4q42n47P21Q19m32r19M5R60L22q29o45N16R19j44r57j76
$$ 752 106 -686 -417 538 592 -250 -797 -76 743 311 -608 -563 397 719 -110 -755 -239 680 536 -421 -597
3423e97P97N50o03q45K76R07J64q57n39P32P18l62r65K6R07L96p89o25M53Q36
$$ -597 200 750 147 -698 -422 485 649 -208 -747 -15 703 341 -624 -598 309 705 -84 -709 -256 580
3443E80q2q99l14Q31O00n52p66J44R45J34q62m77O78P98l64r79jQ77L91o02p51
$$ 580 498 -401 -715 116 716 164 -602 -458 487 621 -241 -718 -40 758 394 -585 -586 291 682 80 -671
3464f71L72Q92l4q90l70P71O44n47q25J34R53J68q68m80O10Q08k55q95r0Q16M56
$$ -671 -299 593 559 -331 -701 70 714 167 -658 -524 429 597 -271 -751 -141 667 412 -483 -573 243 699
3485F99p08o50L75Q63nr01l83Q51O20n89q10J74R08K18q54n46N70P89k53q22j36
$$ 699 -9 -659 -284 579 574 -327 -710 141 761 172 -638 -464 444 662 -192 -738 -168 621 368 -454 -590
3506e90Q11M90p20o70L87Q39K4r20l27P47N63m09p95J28Q23K72p62n66N05P38
$$ -590 221 711 -9 -679 -292 547 571 -349 -676 71 634 225 -570 -442 381 653 -109 -675 -170 568
3526E68j19r04j34Q16M16n94o46K75P76M4p90k59N78N96l95q03Q0Q60J83n88n47
$$ 568 449 -455 -589 227 643 49 -597 -322 454 498 -292 -551 27 623 228 -575 -495 365 548 -40 -587
3547e87M00Q34k82p43j91P62L99n13o28K55P01M5o47m47O54N48l23p51J4P46L19
$$ -587 -187 647 365 -378 -569 193 592 79 -549 -294 407 452 -195 -642 12 560 237 -514 -500 246 565
3568E65o42n94M63P63j86p84j62O74N05m31o60J78O40K17o60m97N52O05k16p95
$$ 565 -77 -671 -208 555 369 -415 -577 97 602 171 -489 -311 329 546 -114 -611 -59 546 330 -465
3588d65QP86K50o57m29L27O68j46o34k24N47N28m58o32J12O95K13o44m27M93O52
$$ -465 -457 329 579 -78 -507 -180 488 342 -292 -516 31 559 101 -531 -419 276 489 -155 -582 -89 563
3609E63k95o92l1P09L05n37n38K77O48N9o98l17O17N61m88o25J01P25J56p17m22
$$ 563 268 -424 -455 254 559 22 -516 -239 409 468 -230 -547 70 631 143 -482 -381 344 500 -217 -639
3630f39N72O04k76o03j51O35L85m82n39K39O71K8p18k61O33M37l49o78J35P14
$$ -639 -67 537 261 -342 -493 142 527 45 -494 -255 416 444 -274 -535 98 535 186 -492 -357 357
3650C57P2o38k66L77M98p6p48q9O44M35m69o69K72O96R3p41l33O57M91l61o71
$$ 357 429 -209 -475 -98 400 324 -424 -513 131 566 97 -572 -300 396 489 -252 -585 72 563 202 -469
3671d69J46O09K69o38m44L52O98j77o66k24P49M01n61o29L03P09k8p39j89N26
$$ -469 -323 286 555 -83 -527 -175 523 346 -320 -544 205 606 45 -584 -281 428 400 -339 -528 -2
3691bM56l13o14O2O15K89n30n34M40N84q7p19o8N42M08m68n18K79N54Ko13k19
$$ -2 454 141 -473 -411 204 493 -37 -571 -131 453 366 -353 -421 121 529 61 -457 -178 376 378 -235 -454
3713d54M89M48k79o50k2O96L01o36m40L52O47j56n88j67N49L55m02m92J22O43
$$ -454 35 483 204 -446 -468 228 529 -107 -547 -195 452 296 -292 -459 90 445 43 -449 -327 316
3733C16O9n30l55M20N57k13o40OO38J19l96m43L16M80l9n18k05M30M03k77n16
$$ 316 385 -145 -500 -80 477 264 -376 -370 268 387 -9 -452 -136 344 305 -213 -418 12 415 138 -378
3754c78R8N53J68n80l48L88N53k52m80l1M51L05l88m09J78N41K9o04k43M21M59
$$ -378 -280 273 441 -139 -487 -99 454 202 -278 -309 142 447 59 -350 -172 369 398 -206 -449 -28 431
3775D31k46o24J11N81J66o18l08M32M18j03n60p3M91L18l40m53J23N41O0n00k68
$$ 431 185 -439 -328 253 419 -199 -507 -75 343 240 -320 -393 98 416 76 -377 -254 287 347 -153 -421
3796d21M88M40l70n54J40N30J61m70l59K95N26j89m66j53M80M03l98m95J30O27
$$ -421 67 507 137 -417 -277 253 414 -56 -415 -120 406 217 -249 -402 78 481 83 -412 -282 345
3816C45M6o00k51M87M18l13n00J00M87J96m51m42L31N66p0n76j80N30L64m05n25
$$ 345 391 -209 -460 27 445 132 -368 -268 219 415 -36 -478 -147 419 349 -227 -407 123 487 82 -443
3837d43K34N93L5o08k29M09M19j99n65JM95K58m00m66L50N14j09o52j6N24K48
$$ -443 -209 384 419 -189 -418 -9 410 211 -354 -353 142 400 0 -466 -116 398 289 -363 -379 145 393
3858C93l27m84K28N10L5m57k84K64N32j71o30N5M98K29m43m28L52N10j46m92j25
$$ 393 66 -418 -190 320 355 -102 -386 -122 410 239 -391 -336 162 391 -52 -480 -128 382 236 -256 -381
3879c81M59K76k90l92K0N74J27n10k53L50M25j95n35L2N42J49n02k84K22M72j7
$$ -381 78 354 64 -328 -308 266 393 -117 -370 -20 405 210 -325 -293 249 398 -104 -388 -166 306 289
3900B89n11j25L58L68k90m76J07N28J00n07k96L64M24j39m83RM84J56l36l39J58
$$ 289 -222 -347 11 379 89 -387 -280 248 348 -159 -455 -91 333 194 -289 -280 204 360 24 -315 -157
3921a57M37J8m77j79L95L48k35m91J26M96O5m58k94L73L69j76l95p5L96K24k72
$$ -157 280 298 -179 -358 37 385 150 -341 -215 281 346 -112 -406 -33 336 160 -235 -310 86 310 38
3942C8l95J49M30R2m48l21M50L98k45m54L4N26M6l38k30J58M03k7m87j15M21L12
$$ 38 -357 -208 222 314 -134 -455 -5 393 148 -306 -272 254 300 -38 -268 -110 293 266 -221 -336 85 397
3964C97k53n10J65M64O3n01j56L08L24j97l67m4M79J55l41l25K50M06o4m74j53
$$ 397 144 -366 -201 263 326 -175 -331 -23 301 104 -263 -307 172 327 -14 -339 -89 317 253 -221 -374
3985c74M11L77l50m05J70M09J21m51k46K48M62j59n02k5M12K89m03l99K57M70
$$ -374 37 414 64 -341 -171 238 359 -92 -338 -90 372 213 -289 -314 98 387 -16 -415 -158 312
4005C12r3m32q7L87K27k40l49Q8M14K5l02l14L49L10m0n25n1N19J64l92l57K41
$$ 312 219 -213 -300 87 314 74 -275 -187 227 252 -50 -364 -15 295 255 -270 -321 198 362 -30 -387 -146
4027a46L92j3m83r3L67K82k37l97O4M96M9l25l33L41L95j86n02O4M60J66l81k94
$$ -146 246 233 -250 -343 24 306 69 -328 -264 232 281 -44 -377 -36 359 173 -329 -265 195 361 -20 -314
4049c14J98L75Ml65j86L15L14k47l83J1N27L2l63l10L59L22j66l40j8L58R2k29
$$ -314 -116 259 263 -102 -288 27 341 94 -289 -278 249 281 -82 -392 -33 289 123 -217 -235 123 215 -14
4071a4l17J41L68M6l19k58L45L47k05l97OM67Q2l65k00K37L13j17l47j06L69K55
$$ -14 -331 -190 178 224 -95 -353 -8 339 134 -263 -257 210 292 -73 -273 -36 277 160 -187 -293 76 331
4093C31k48l60J11M25k0l84k01L34M39l11l85P1M08J8k66k02J25L82m2l94j24
$$ 331 83 -277 -166 259 239 -145 -346 -12 427 116 -269 -198 210 228 -38 -240 -115 267 225 -169 -293
4114b93L05K99k35l68J32L56O2l52j64K30L21j10m12K8K78K65l12l33J44M59o7
$$ -293 12 311 76 -292 -160 196 258 -94 -258 -28 293 183 -229 -201 77 342 30 -303 -159 300 233
4135B33l59j38L21K77k73l31J74L06R3l93j55J76L34j34k86o4L24K06l05l45J45
$$ 233 -126 -264 57 334 61 -270 -96 210 303 -90 -245 -69 265 131 -155 -219 105 311 6 -339 -194
4156a94M39p1l71j29L12L02j96m07P8M34J3k35k15J10M75j14m87L6M32Q2k62l13
$$ -194 245 174 -197 -326 -14 288 92 -315 -237 197 210 -25 -240 -130 345 231 -256 -220 212 294 32 -281
4178b81K12L41o4l47j33L14K32j48l60M1L03K03m32k60K77L88j33m06NL43J39
$$ -281 -69 272 208 -139 -272 42 274 126 -234 -193 110 313 -119 -379 -102 286 153 -253 -248 95 234
4199B34k05l31J51L82J5l21k10K97L09k16m08QM81J77m18k79K43M08j61l39p6
$$ 234 29 -302 -151 231 246 -75 -285 12 321 105 -303 -295 186 363 -55 -334 -91 317 156 -183 -259
4220b59L70J67k60k71Q8L75Ml58j30K23L19j89k94L5L87L0k78k09J86L22q8k79
$$ -259 111 278 18 -253 -165 210 214 -144 -274 -51 268 79 -215 -180 207 237 -41 -250 -64 258 170 -109
4242a09r9K61K90l36k65R2L88k1l15j56K30K95k06k32mK69P0j85k16J70L17p3
$$ -109 -208 53 343 7 -258 -166 222 201 -114 -270 -40 255 49 -183 -187 82 152 -33 -249 -79 238 165
4264A65l24q6K77K58k66k26P6K95O0l33r2J50K58r3l35j6K88J71k16k63J01L84
$$ 165 -159 -245 32 290 24 -202 -126 169 229 -104 -196 -46 212 119 -216 -232 56 227 11 -252 -151 233
4286B33r1k25j64K65K15j62k99J06K93M7k38k28K07L17o3m01j2K77J70j92k87
$$ 233 142 -83 -247 18 233 71 -228 -122 171 218 -20 -248 -41 276 213 -188 -200 77 247 55 -232
4307b32J71K84k4l44o5K57J84j78k93M6K68J14k11k42J52L64j56k94r3L51J72
$$ -232 -61 223 199 -145 -210 47 231 53 -240 -194 74 188 -23 -265 -113 251 95 -199 -292 59 231
4328B31j87l20J94K59qk18j79J86L01o2l75m5L44J09k25k76J38L73r0l54m2L52
$$ 231 44 -276 -82 177 169 -49 -228 -42 259 197 -178 -223 121 230 5 -271 -133 240 150 -204 -246 106
4350A06J18j84k26L4L26O2l18k10K27L16m8m64O3L12J21k76j94K15K18r4k74n6
$$ 106 224 40 -186 -152 174 236 -82 -292 -65 251 203 -261 -198 114 235 -41 -235 -20 198 104 -170 -226
4372b26L17J35j57l24L8L33J03l70j45K39L18j28l22j7K89J62k45j72J07K94p7
$$ -226 91 226 69 -255 -217 116 219 -151 -296 -57 261 133 -189 -206 83 245 0 -172 -65 229 152
4393A52k54j33K86J80j03l31K1L40J07l73j81K33L07j57l10N1K81L7j96j99P0
$$ 152 -102 -235 51 231 128 -203 -182 158 265 -108 -289 -56 251 94 -216 -165 116 153 -43 -242 -172
4414a72L53Pl27j42L48J57j52l26R4L52mk39j48J98K31j42k61m6K80J39j60k74
$$ -172 181 188 -139 -281 67 224 72 -254 -160 192 188 -51 -199 -1 230 88 -173 -219 61 200 40 -234
4436b34J30K03Q5l51l2K20J92j66k31pK94N9k02j23J10K66r6j94j09K45J67k15
$$ -234 -104 99 184 -167 -199 21 213 47 -184 -191 103 162 -40 -163 -53 213 117 -77 -186 59 226 11
4458A1k42J41K94j8l36l7K09J81j14l00R3K96J6k53j18J14K40K6l61l2K28J80
$$ 11 -231 -90 204 186 -150 -187 22 203 89 -211 -118 178 194 -59 -177 -63 177 203 -158 -190 38 218
4480B18k43j39O0K49J0k14j23J66K09n2k63p3L21J09k73j75J46K49k5k67q9K30
$$ 218 -25 -164 -104 145 155 -59 -182 -16 193 141 -122 -195 126 235 -38 -213 -67 182 157 -110 -199 31
4502C1J32j41k05L9K51J03k75j51K14K01p4k39j9K69J05k22k33J54J89J7k24r6
$$ 31 163 22 -183 -144 107 210 -65 -216 -2 199 125 -114 -133 136 241 19 -214 -60 129 146 -78 -174
4524a74K17J38j65j84L6K58N6k34k23K04K75j36k73RK74J26k56j17RL18K5k77
$$ -174 43 181 16 -168 -132 126 182 -52 -275 -71 204 68 -205 -196 78 204 -52 -169 -160 158 183 -94
4546i4r8K29J96j48k33M6K79M5l48m7J81K35j02k97M5K19P3k33j70O3L43k2l31
$$ -94 -192 37 233 85 -148 -102 177 222 -126 -173 8 243 141 -156 -111 108 181 -52 -222 -159 184 162 -169
4569a69p3K62K58k15k81N9K72M3j95j27J43J64m4j84j30K88J48k20k43Q5L16k9
$$ -169 -242 20 278 63 -218 -159 113 156 -39 -166 -23 141 97 -87 -217 71 219 -1 -244 -159 157 128
4591A28k17j67K96K70k53k17M7K33M9k13j68J37L12j42k26m3K33J11j57j63J38
$$ 128 -89 -256 40 310 57 -160 -113 120 169 -44 -212 -75 237 95 -131 -174 59 170 13 -150 -12
4612a2J96l1k59q7J93J78j19k29O0J81Q7k20j41R0K81m5l08j8K38J52j73j58L6
$$ -12 184 153 -106 -193 0 178 59 -170 -110 71 158 -62 -203 -113 168 123 -185 -203 35 187 14 -144 -108
4635a08K27Kj54j42J46K15m7k50o1K84O9j84j88J43K03o1j83o0J76J13n2k52N1
$$ -108 119 121 -33 -175 -29 186 139 -111 -172 112 181 -3 -191 -48 155 94 -89 -149 27 140 88 -164 -113
4658a13J65L4j40j40J50K34j05k87k1K93J18j59k32R9K66L8k52m2K12O2p6k69
$$ -113 52 86 -54 -194 -44 190 85 -202 -223 70 188 29 -203 -104 162 200 -52 -94 118 180 104 -165
4680a65O4K20L4k20j36J56K15j07k00l7K84J9j29j46N3J86M1k01j21J99J38o2
$$ -165 -101 119 153 -67 -203 -47 168 61 -139 -176 108 127 -2 -148 -95 91 132 -69 -190 9 147 85
4702H5k22kJ99J21k19k11K50J45j5k55n7K57O9q2k80J26J63P2k18j39K26J61r6
$$ 85 -137 -139 60 181 -38 -249 1 146 131 -124 -181 76 145 63 -217 -91 72 144 -74 -213 13 174 78
4725G8k46J8K31Q2j77j50J27J91m7j97j12K59J34j64j84P0K75K3l73k5J84K19
$$ 78 -168 -150 81 163 -14 -164 -37 154 107 -90 -202 57 191 27 -157 -87 188 211 -162 -187 -3 216
4747B16k04j91N2K51O1j93j78O9K31l0k31J8J97J11j31l19J80J83L0k20p6J59
$$ 216 12 -179 -127 124 185 -8 -186 -117 114 84 -147 -129 68 179 48 -271 -91 92 122 -98 -174 -15
4769a5J67p6k23RJ76J69k61j16N4K80r9j87o3K33Q5j08k20Q5J91N4k17q5R3K31
$$ -15 152 76 -147 -138 38 207 -54 -170 -116 164 65 -122 -185 48 133 25 -195 -110 81 135 -82 -167 -74 157
4793A57r3j99l5K48J14k39j31J19J95o2j32p6J65J48j13j48%J34R3j39k40K47
$$ 157 64 -135 -170 78 192 -47 -178 -59 136 74 -58 -134 31 179 66 -82 -82 52 145 6 -234 13
4815A3J41n1k46J5K04R6k27n2J00J13k0j35q9J29J69j57j25J0K72Qk33o8J32J65
$$ 13 154 103 -143 -128 76 172 -55 -107 -7 106 86 -49 -138 -9 160 3 -122 -112 160 168 -65 -133 -1 164
4839A64p9j66q9J77J51j79j10P4J26O3j42j32J61J20p6j89M0J59L2j10j81J40
$$ 164 85 -81 -170 7 158 -21 -131 -57 69 132 -10 -142 19 139 63 -126 -86 73 105 -5 -186 -46
4861d6J62m4q7j12J56J01j13j56O8J71O4k49j07J09J93p8j91j7K34O1j31j43J47
$$ -46 116 72 -15 -127 29 130 17 -139 -71 100 164 -85 -192 -83 110 32 -159 -176 58 119 -12 -155 -8
4884hJ65j03j74%J64J86j59k56Q7K55M7k40q3J79O5o1j61m0J28J75j43k37J70
$$ -8 157 54 -120 -120 44 230 71 -185 -98 157 204 -36 -119 60 125 64 -97 -137 -9 166 23 -214 -44
4907d4J54K1k32r5J94J79j78k10J44K10m4j43j52J41K02n6k27J3J58Q9j09k37
$$ -44 110 131 -101 -196 -2 177 -1 -211 -67 143 99 -44 -196 -55 147 91 -136 -123 35 124 15 -222
4929b22J22K26l5k40j4J91J30j36j64O7J62N8j41j75J45K04q2k47K3J67J05j67
$$ -222 -100 126 91 -149 -163 28 158 22 -142 -75 87 145 4 -171 -26 178 96 -151 -128 39 144 -23
4951b3j25J09K04j11j31m6J82J06j61j06M7J55O9j72j27J00J58j9k14RJ45M4j19
$$ -23 -148 -39 165 54 -77 -123 59 165 4 -102 -55 100 169 -3 -130 -30 128 109 -105 -96 49 93 -26
4974b6j13J56M6j4r8m3J27R0n2j73NK00M9j40j44R2J50l7j62J3R6O9p6q2JJ15
$$ -26 -139 17 63 49 -49 -92 35 125 73 -100 -95 105 154 14 -130 -38 112 75 -87 -74 22 91 15 -67 -66 49
5000D9L7j21j59J90J60j34j69J6K43mj55j11J22J50j9j49J2O1P5J7k11p6K80Q
$$ 49 86 -35 -194 -4 156 22 -147 -131 112 108 -47 -158 -36 114 95 -54 -42 19 94 111 -100 -176 104 112
5024A12j09j52J27J73j21r5j9J17J14q8j67L2J26M0j41r1J36J22p6k23J10J66
$$ 112 3 -149 -22 151 30 -65 -84 33 147 59 -108 -76 50 90 -51 -142 -6 116 40 -183 -73 93
5046I3L0k10j05K01J28m5j81K3Q3P1k1j94N2J93K2k59l5K05J11j37j74J7K24l0
$$ 93 123 -87 -192 9 137 92 -89 -66 17 88 67 -127 -75 118 140 -119 -154 51 162 25 -149 -132 92 62
5070F2p4r2R6J27j3j58p9J74J61j57k21J08K03Pk01q8K40J4j48o4mK04J7j75p5
$$ 62 -12 -104 -8 119 106 -52 -131 43 204 47 -174 -66 137 144 -57 -145 95 109 -39 -103 -107 97 114 -61 -136
5095a36P6J60Kk28l7K27R8j58j08O3J73m4j46J4R0M5m4j65qK01O3j63j02Q0J73
$$ -136 -60 100 102 -126 -163 64 162 4 -104 -41 132 88 -58 -44 46 91 47 -118 -126 75 138 -25 -127 -47 126
5120A26p8j16n8K09K7j43q8O8J00K9j26n2O8J15l9j42PJ65L2j26j27J37J16m8
$$ 126 48 -68 -126 83 110 -33 -121 -53 47 76 -50 -102 -34 81 42 -100 -93 72 104 -22 -149 -12 104 56
5144E6j68N0J21K4m7j04K0P9K7j43k1O5J98j17j63nK50o1q7r8R5K0M0k4j09J19
$$ 56 -112 -62 59 83 36 -68 -48 31 58 -85 -106 -41 157 40 -123 -128 122 61 -26 -124 -29 -9 31 7 -102 17
5170A7K2K4j86O2J11N1j06j30J31J09p6o6lR9K2o5j02K6Q7P4j16j04J03J47j06
$$ 17 39 63 -123 -61 50 101 -5 -135 -4 105 29 -37 -40 59 81 16 -86 -60 27 101 -15 -119 -16 131 25
5195B5j48P1J48K8j26n9N7N8l4k7n5N5J13q5j38M4J08L2q8q2O8J38r4j44P7J14
$$ 25 -123 -52 96 124 -2 -61 -4 54 20 -7 -62 -7 106 21 -117 -73 35 67 -21 -103 -35 103 9 -135 -58 56
5221E6L7r8r7j3K24K7k27k4J25J70j46j70O8J75N1k35l6R4Q8l4j38K9J17O7j23
$$ 56 93 -5 -102 -115 109 136 -91 -115 10 180 34 -136 -68 107 158 -77 -113 -19 69 35 -103 -74 43 110 -13
5246a3j10KK48k3k38%J74Q2j62j47P0K20m7j12o7J43P7m9j48m1J66J23r4j99J65
$$ -13 -123 -121 127 104 -134 -134 40 122 -40 -187 -117 103 56 -56 -123 20 97 48 -100 -141 25 148 54 -145 20
5271B0J14o2j79QJ58N8j11j04J10P5j4j42j6P7J26q7j41K1J44J7j47l3J33M7m3
$$ 20 134 72 -107 -99 59 117 6 -98 12 87 73 -69 -85 -8 118 31 -110 -89 55 72 -75 -108 25 72 29
5296B9j03j3J54K1j10o5M1P5J00k02m1J06J06q4j45N0J43K9j27k1M3R9n8j06L0
$$ 29 -74 -87 67 88 -22 -87 -46 29 129 -73 -114 -8 98 14 -131 -81 62 91 -36 -57 -14 85 27 -79 -49
5321d9L9R4k4j96N7J23M9j59m5J78N3j74mN0N6k6l5j9j5K7M4j13l8J24O4m7j64
$$ -49 -10 84 60 -136 -79 44 93 -66 -111 67 120 -54 -58 -8 48 22 -13 -32 -47 -20 24 -89 -127 -3 61 14 -150
5348a50Q2J02K9j03J7P0m1j3l1j6R2L8n2j52N2J39P6j46o6J07N8m6j02MJ08M4
$$ -150 -68 34 63 -40 -23 47 6 -7 -38 -54 38 76 24 -128 -76 63 139 -7 -73 34 92 46 -56 -52 56 100
5374A00r7p0QP2O8j05j15J12J11q3j30J01P3L0j08o6M9P1l2l3n3P9J22o8j39L4
$$ 100 3 -67 -59 13 81 -24 -139 -27 84 1 -129 -28 45 75 -33 -99 -50 21 -11 -44 -97 -18 104 36 -103 -69
5400f9J49N1k02m7J51P2j16j20J49O8j1j48l5N5J28jk04j6K02J19j66j64J19J56
$$ -69 80 131 -71 -118 33 105 -11 -131 18 86 75 -73 -108 -53 75 74 -130 -146 56 175 9 -155 -36 120
5424A20m4j65L2J10K6n5q8JM0J21j47o8Q4J43o9j60L8J85k6q7n8J16kn4k1o7J23
$$ 120 76 -89 -57 53 79 24 -64 -63 -23 98 -49 -117 -33 110 41 -119 -81 104 78 -9 -67 49 47 -7 -28 -95 28
5451B8P9j03p8MJ30Kj99J7J53P8o9j14k1J83l5r6j2L0N2Or4n5K4J53q1j65J38
$$ 28 107 4 -74 -70 60 62 -137 -120 33 111 42 -72 -93 90 55 -41 -53 -23 29 35 -59 -114 -90 63 -18 -183 -45
5478d5J71p1j36K2Q2L4q3n9P1M4K8r1J2N5K6Pj04p3K03m2q2n0Q8N6n5q9P5K2K7
$$ -45 126 55 -81 -59 23 57 -26 -85 -14 30 58 -33 -21 34 60 67 -37 -110 93 51 -31 -81 7 63 8 -81 -6 16 43
5507D3o7k2K0m0J08j6j38J00P1j6j50L0J01J2k5m2K4J2n0O8l0j6M3Rn9n1O5R0
$$ 43 -24 -46 -26 -66 42 26 -112 -12 59 43 -107 -77 24 36 11 -31 -7 5 -45 23 -7 -23 20 29 -30 -81 -16 74
5535G4p8j12J19O2k3m8n2ML4M6j1q5NQ4O0j92K5J33j9r3j7J10jr0o5P4L4N8m2
$$ 74 -4 -116 3 65 42 -6 -58 -54 -20 26 15 -70 -65 19 79 -113 -88 45 26 -67 -84 26 25 -65 -130 -56 -22 36 -6
5564fk5j2R9L9r3j49J80J44j88j21J15J05l6r5k5K1J13l0o7m3J22O0q5j28M1J86
$$ -6 -31 -43 56 95 2 -147 33 177 -11 -132 -17 88 52 -43 -68 -47 66 36 -31 -74 48 108 23 -105 -64 122
5590A22p9j82K1J33R2j67l0P2P1l3q9o5Q4K05q0k06L4J69R3j89j25J69J45j44
$$ 122 43 -139 -118 15 107 -60 -90 -18 53 20 -69 -134 -50 155 75 -131 -97 72 165 -24 -149 20 165 21
5614B1j75R5J70n7n6r5N4J33n4j02o3J30J06p9j87R5J57nj64n2J81L6o7j21J02
$$ 21 -154 -59 111 54 -2 -97 -43 90 36 -66 -129 1 107 28 -159 -64 93 88 -76 -128 53 89 22 -99 3
5639CK6P4j16j51J47Q3j8j31qJ52N7j61q8J49Q4j04n7K6O4N9j19k8J5O6R2p9j46
$$ 3 29 103 -13 -164 -17 66 48 -83 -91 61 118 -43 -131 18 102 -2 -59 -33 31 90 -29 -57 -42 24 116 37 -109
5666a09P4J69q4j61R1J16o4r1M8k7K4Kk5M7k7M6k6q6MJ05Q4j23j01J28K3p4l6
$$ -109 -35 134 50 -111 -20 96 32 -59 -11 -38 -14 -12 -37 10 -17 29 3 -83 -79 26 110 -13 -114 14 37 -37 -73
5693g3Q6p3P9n0J2n7O8O7n6n7j9J85q0r9O5M2K3r0Q0o3n7O5K3l6m5Q8k5p4QJ01
$$ -73 13 -60 19 -31 -19 -76 -8 59 3 -54 -73 112 32 -67 -2 40 63 -27 53 -10 -67 -2 21 -15 -60 28 3 -71 -63 38
5723C8k0n6m4K7J25q6j8QLJ9M3o9j7M7Q7l2j43oJ69J6k06P8J08j1r0qK0K4Q2p9
$$ 38 18 -38 -82 -55 70 -16 -34 -26 -23 -4 39 -30 -47 0 87 55 -88 -94 75 91 -115 -37 71 60 -30 -38 -18 6 88 9
5753Ij08J8J23Jj59L5J03M6j03p7J54M7m7q0j0J16k8J6j12k5Q3Q8j53n4Q2J47
$$ 9 -99 -81 42 43 -116 -81 22 68 -35 -112 42 89 42 -38 -48 68 40 56 -56 -81 2 90 -63 -117 -35 112
5779A12j07j82P8J93l8j37NN4O9J4q1p9J28L3k6j23O0J76j08j07j01K93l1j54
$$ 112 5 -177 -99 94 56 -81 -76 -22 47 61 -20 -99 29 62 36 -87 -27 149 41 -66 -167 126 95 -59
5803e9p8J47N0l7n5l4N5M6J4j10%M4Q6p2j11J02J26j35r0L6J74k5j32P6k2K4o2
$$ -59 -137 10 60 23 -32 -66 -11 35 49 -61 -61 -17 69 -3 -114 -12 114 -21 -111 -75 99 74 -58 18 -4 20 -42
5830d2l6L3N3Q4n7r9J4J14O7j81o6J24N3j47L4M3J4Ok7rk3P7k2j9n1P3O6l8j10
$$ -42 -78 -45 8 92 35 -64 -50 64 131 -50 -116 8 61 -86 -52 -9 5 11 -16 -25 -48 29 7 -12 -63 10 76 38 -72
5859g2K3J00n5l5K8L9k3n0R5n4m5M5O4j42K0J15K6j03j9P9j0n7J1L7k4J9M1j01
$$ -72 -49 51 -4 -39 -11 28 5 -45 50 -4 -49 -4 60 -82 -62 53 79 -24 -43 36 26 -31 -20 17 -7 12 53 -48
5887d8l4J6J41l0p6L2P0o9r1J22k0j1p2K5lL8rN7q2m8J35N4j27p0J29M7p1j10
$$ -48 -82 -66 75 45 -31 1 71 2 -89 33 13 2 -70 -45 -48 -10 -19 38 -44 -92 43 97 -30 -100 29 76 5 -105
5915a05Q5N9l9j5l8O8K9L8j12r7J49J03j19j13P6J24p5j38J6J83j6j74J1M3K6
$$ -105 -20 39 0 -15 -53 15 44 82 -30 -127 22 125 6 -107 -31 93 18 -120 -104 79 63 -111 -100 -57 -31
5940c1L7nn0k8J62K0k13L3J96%j64n6J67L3j08n5Q0N5J6q0j5o6J18N3k14J0J38
$$ -31 6 1 -49 -77 85 105 -108 -75 121 121 -43 -99 68 101 -7 -62 18 73 89 9 -6 -72 46 99 -115 -105 33
5967C3J10k06p9J08J11n8j48P8Q0K0o3q0N8L5Q0j09n8J00J17q4j27K3J28%j49
$$ 33 143 -63 -142 -34 77 19 -129 -51 29 49 -14 -94 -36 -1 79 -30 -88 12 129 45 -82 -59 69 69 -80
5992h0J4J24m0k8k4J5P9o0n2j8J4P9L9j76kJ89Mj14n4J16M7q2Jj5N7p5Q3r1J6
$$ -80 -66 58 18 -10 -34 -19 60 0 -52 -70 -56 23 62 -114 -116 73 77 -37 -91 25 72 -10 -9 -24 33 -42 41 -50 -34
6021c4M2O9n8q4Q0O7p5j43Q8Q9m6p8O8R5j5n8J8l4k3J5M9n7l6J52l0r5lR4q2K8
$$ -34 8 77 19 -65 15 82 7 -136 -48 41 -5 -83 -15 80 65 7 25 -9 -32 -17 32 -25 -61 91 61 -34 -37 57 -25 3
6051CJ6K4l9n2O0M1o6p7P9N4p1l5M7L4m3K2j3j6m4J12k0q2O6M5lj36Q9R6o1r9
$$ 3 19 43 4 -48 12 53 -13 -90 -11 43 -28 -63 -16 18 -25 -3 -16 -32 -76 36 16 -66 0 45 42 -94 -5 91 30 -69
6081f9K9L5Q7j51O1K5K2k9rJ3o9J27o5j11N1J12nj55k0J23P8j56o4J60Ol5j3k2
$$ -69 -40 -5 82 -69 -8 17 39 10 1 14 -55 72 7 -104 -53 59 54 -101 -121 2 80 -76 -140 20 26 -9 -22 -44
6109d4J5J06n3r1K7J02K2j45l7J20J11j66o9R2P6L4j49L2L4K8J9q1QL0P1q5j26
$$ -44 -29 77 24 -67 -40 62 84 -61 -98 22 133 -33 -102 -10 66 100 -49 -17 17 45 64 -17 -9 21 92 7 -119
6136a19Q4J72n1k39J11J29M8j89q2J21J08o8j8j09N9J16l1r5o6K13lj72o9J98
$$ -119 -35 137 86 -153 -42 87 135 -54 -136 -15 93 25 7 -102 -43 73 42 -53 -119 94 91 -81 -150 48
6160D8P6j95r2J86N4p3l8L2J5J7Rq1n0J12R7r6j37J27J23j15j40M9J71n4j17J
$$ 48 124 -71 -163 23 77 4 -34 -2 13 30 39 -42 -92 20 117 21 -116 11 134 19 -121 -72 99 45 -72 -71
6186g1P8l8L3l0m6N2M3J3j21N3R9m0q4j9J53j6p8k9R2J9j25P4N4o7k6O5j6m5K4
$$ -71 7 -31 2 -28 -74 -22 21 34 -87 -34 65 25 -59 -78 75 59 -19 -48 44 63 -62 12 66 -1 -27 38 22 -23 1
6215AQ2r5m6R2Rl2n1N4K0j06pJ35p0o1M7R3n8r5R0K4n5pP9j8j18Q8L2KK1K2K1
$$ 1 83 -12 -58 34 43 11 -40 14 34 -72 -79 56 -14 -75 -28 65 7 -88 2 26 -29 -36 43 25 -93 -5 27 29 50 72 93
6246I3j50PJ26k7j04k6N8O5j10K2L3oj5P2r8MJ00J3j20k2J61L2j18j46J41P0j9
$$ 93 -57 -50 76 49 -55 -81 -23 42 -68 -46 -13 -19 -34 38 -60 -56 44 57 -63 -85 76 108 -10 -156 -15 55 36
6273C6j15Q9J9l5m1j6N0O5L8q4j40P9J42m3j52R9Q3Q4j95n2J32M9q9k0mK0M4j1
$$ 36 -79 10 29 -6 -47 -63 -13 52 90 6 -134 -55 87 44 -108 -9 74 158 -37 -89 43 92 3 -17 -21 -1 43 32
6301C2j06J6J77o7j17n9J66P8j48j12J57N7j22mP8j4j9k2n8M0J02qq4q4J74J45
$$ 32 -74 -58 119 52 -65 -124 42 120 -28 -140 17 74 -48 -52 26 12 -7 -29 -87 -47 55 47 -37 -121 53 198
6327A98j84j25P5J52j27k6%J24k2q1k6M0K8K9l8j42O5J56n1j58J2J63M4k17KJ29
$$ 198 14 -111 -36 116 -11 -37 -37 87 65 -16 -42 -2 26 55 17 -125 -60 96 45 -113 -101 62 106 -111 -109 20
6353B0N4p1j09J03O2p9J9n8pL7J26j55n5J83op9p7J39K0o7r1R2M6k8J0j5m1k9
$$ 20 74 3 -106 -3 59 -20 -1 -59 -66 -29 97 -58 -113 70 64 -15 -92 47 67 0 -91 1 47 19 29 14 -27 -56
6381e6M4Nl2PR4m6q6J18O7q8m9K6Q4j22KJ1Q6j16oR2k1L0k6lm2l1M6O0r6L4J8
$$ -56 -12 -7 -39 -32 62 16 -70 48 115 27 -22 4 88 -34 -32 -21 65 -51 -57 35 14 44 18 15 -27 -58 -12 48 -48 -14 4
6412DJ3r0K6N0J4p0N1R9j33k5J17j0n9K5J3k3pKJ3r2L5J89j26j08L9J46m9j78
$$ 4 17 -73 -47 3 17 -53 -2 97 -36 -61 56 46 -13 12 25 2 -5 -3 10 -82 -47 142 16 -92 -53 93 44 -134
6440a34J13O2J0j20L3%J4j5N3j07NJ16lr0j6J15N9j70l3J30N5o7q3O3O3k5l4m8
$$ -134 -21 41 51 -69 -36 -36 -22 -37 16 -91 -86 30 27 -63 -79 36 95 -75 -108 22 77 10 -73 -10 53 28 -6 -54
6468e4pJ05Pp9m8J18N2r1r9P3J80j77r9M3J55j0o9o0M7O5j01L5m0O0J9J9j54Q2
$$ -54 -61 44 51 -28 -76 42 94 3 -96 -23 157 -20 -119 -76 79 69 0 -60 -13 52 -49 -14 -54 6 25 44 -110 -28
6496b8J59l2k19QJ25J02j70m7R5N1k7o7k4O1O5j4r8L1J18k0q7j01J50J40j49q9
$$ -28 131 99 -120 -112 13 115 -55 -102 -7 44 17 -50 -74 -13 52 38 -60 -29 89 69 -18 -119 31 171 22 -67
6522f7R9M2o8m7K1M5l9N3n7m8O2P9q6j20J16O4j3j58O0J98j09r9L6L1J6j5jON
$$ -67 32 74 6 -41 -20 25 -14 39 -18 -66 -4 75 -11 -131 -15 49 36 -122 -62 136 27 -72 -36 -5 11 -4 -5 1 6
6551FK5qr8L9N9Q0k08L6J34o1n3mJ09J0j13L4lk6N4k2m8K0M4J7m3m2M3L0l5n1
$$ 6 31 23 -75 -36 23 103 -105 -69 65 4 -49 -53 56 66 -47 -13 -16 -42 12 -10 -58 -38 6 23 -20 -62 -19 11 -24 -75
6581g5J26%l7l6N0M5q9j7R0n8m8N1nl8J2N6m8J0k2O5q2n5J62L9p9o2Q4R3j38p8
$$ -75 51 51 14 -22 28 73 -16 -33 57 -1 -49 2 -3 -41 -29 27 -21 -11 -33 32 -50 -105 57 96 17 -45 39 132 -6 -84
6611h4P7J1JPJm1N5%k8o5K9J56j29r3P0J34p8j17Q6N0m5o2N7O4jm9ko3P7P5k2
$$ -84 -7 4 5 12 13 -28 27 27 -1 -66 -37 119 -10 -103 -33 101 23 -94 -8 42 -3 -65 -8 56 55 6 4 -59 18 93 71
6642G1j50PJ82m6j63L0J64l0j12PJ08j5m6n1K6j5P0k1q8l1J62Mj05j12J23J33
$$ 71 -79 -72 110 64 -99 -69 95 65 -47 -40 68 53 7 -44 -18 -33 37 16 -72 -103 59 63 -42 -154 -31 102
6668A02j60l8J11R8r3r2N5N3rk5k5j7R4L4j01q6J12P8r3j05R2P3n7p7N5N6n7j6
$$ 102 -58 -96 15 113 20 -72 -17 36 27 2 -23 -40 54 88 -13 -99 13 91 -2 -107 -15 58 1 -76 -21 35 -22 -38
6696c8k6N6K2L7p8m9P8R1q5j27R9N1L9j72J4J12K9r8l3J11J0jl1p2L1P5J9r3M
$$ -38 -64 -8 14 51 -27 -76 2 93 8 -119 -20 31 70 -102 -88 24 53 -45 -78 33 43 42 11 -61 -30 45 64 -29 -25
6725b5M0L8q9l0M9N3o2l6R1P5j76J0J00l2qK9j9q7M3P5m8o6Q0L0qj16R2Q2j03
$$ -25 15 53 -36 -66 -17 36 -26 -62 29 104 -72 -62 38 6 -2 27 8 -79 -36 39 -9 -75 5 35 27 -89 3 85 -18
6754a8J2PQ0j04k9J4N5p5N8M7q4J2O4j4p8N0R9o0j77Q7J12q1k0kN9ql4j2L7l4
$$ -18 -6 1 81 -23 -52 -38 17 -58 0 47 -37 -25 39 25 -53 -3 96 36 -141 -54 58 -23 -43 -45 14 6 -28 -40 -3 -37
6784c7j2Qp%M8M0j34M3P3M8q7o2J21N8j67QJ14kl7r9N4K1J1j8Rj6M4O0j30n0J24
$$ -37 -49 -41 -48 -48 0 40 -94 -51 22 70 -17 -79 42 100 -67 -59 55 53 16 -83 -29 -8 3 -15 -6 -22 22 82 -48 -98 26
6815B6P5q0j11P0J01r4n5N5Q2n7l8j0j2N4N0j26k6J33O9p6j56P6K05r0j69J00
$$ 26 101 21 -90 -20 81 -13 -68 -13 69 12 -26 -36 -48 6 56 -70 -96 37 106 30 -126 -50 155 65 -104 -4
6841dQ5j0j03JL0M3l0l5n1J9J29J3j49qJ88m2j75oJ47Lq0n7J06J2n6k5K6rQ5j9
$$ -4 81 71 -32 -31 -1 42 12 -23 -74 -55 74 87 -62 -70 118 76 -99 -105 42 45 -35 -92 14 26 -30 -55 -29 -38 47 28
6871B8r1k5J66pj08l5L7J43r9p3K7O1n0l0K7L9l7J09j43L2K2N4o2o8R1J13j05
$$ 28 -63 -88 78 71 -37 -72 -35 108 9 -64 -37 24 -26 -56 -29 10 -27 82 -61 -29 -7 47 -15 -83 8 121 16
6898A6j14O4R2lj00jL3K6o9K9J5MM0m8OqM4J2j23NJ68L2j57QO7Qj18M3M0K0o8
$$ 16 -98 -34 58 55 -45 -46 -13 13 -56 -27 -12 -8 32 -16 -10 -18 26 38 -85 -80 88 120 -37 -29 38 46 -72 -29 11 31 -37
6929c7K6M8o4M9K4l2o4O6L8j40N6K5O6j14kJ08Nj24m3J45jl3n3Q1j4j5J6J0mk0
$$ -37 -11 37 -27 22 46 14 -50 16 54 -86 -30 -5 61 -53 -55 53 58 -66 -109 36 35 2 -51 30 16 1 17 27 23 3
6959CL7o3m4Q6N4j25n2R3J18j20o6R5OJ0o0K8jL8K9l6j17P2J35j19q8kJ97o6j06
$$ 3 40 -23 -67 19 73 -52 -104 -11 107 -13 -79 16 22 32 -28 0 -1 37 66 30 -87 -15 120 1 -87 -89 108 42 -64
6988f4L0J16m8j22O7pM4J9l9j0k2Q9Qj74L6J79n4j34l9J71J1l6j29J16N2q8m0
$$ -64 -34 82 34 -88 -21 -28 16 35 -4 -14 -36 53 61 -113 -77 102 48 -86 -125 46 57 21 -108 8 60 -28 -68
7015f8M3j0J9J04j23j1J03J0j25m2R6J22j57k5N5P1j0r5J7M8k7Ln0k8P8O1n6q0
$$ -68 -25 -35 -16 88 -35 -46 57 67 -58 -100 -4 118 -39 -64 -9 62 52 -43 -26 22 -5 -2 -52 -80 -2 59 3 -77
7043g7P7J20j08j14O9J02k3j14j2J19m4p8K2O2J2K5l3q1R0kJ0r8k6J40M7j35j9
$$ -77 0 120 12 -102 -33 69 46 -68 -80 39 -5 -83 -61 1 13 38 5 -76 14 12 22 -76 -102 38 85 -50 -69
7070f9P9M8j35K7O8n0OK2o0P5j1M2o7p9J18N3o8p7N3O6k9r8M8J8j8k4O5J3l3p
$$ -69 10 58 -77 -50 18 -32 -26 -4 -64 11 0 42 -25 -104 14 67 -1 -78 -25 41 12 -86 -38 -20 -38 -62 3 16 -17 -24
7100b4L8o4P5N3m3q0K3R1K9j62J9J58j06n3R0k9j8m4o5J20j0L3pk0o4L4K2q6L0
$$ -24 14 -50 25 78 35 -45 -22 69 98 -64 -45 113 7 -46 44 15 -3 -47 -112 8 -2 31 24 4 -60 -26 -4 -90 -60
7129f0J28o7j15P2Q5mj37L6M9K4J2m1M0J0l6k9N3KO5k6j40k2R4Q3j31k6J10L0
$$ -60 68 1 -114 -42 43 39 -98 -62 -13 11 23 -18 22 32 -4 -33 20 22 87 61 -79 -101 -7 76 -55 -81 29 59
7157E9o2l9M3M6o0o3M6L8J4%n7j3Q1L6j25m7J17O9j16p4J46L9o3p5J7R3m2J1k8
$$ 59 -3 -42 1 47 -13 -76 -30 8 22 22 -35 -48 33 69 -56 -103 14 83 -33 -107 39 78 15 -60 -43 50 8 19 -9
7186il5M8O9j08l5M6J05m9j48N6J57k3k15Q8J38J8j42k6N5J5k9J3l2N9Q7n9j66
$$ -9 -44 4 73 -35 -70 -24 81 32 -116 -60 97 74 -141 -53 85 103 -39 -65 -10 5 -24 -11 -43 16 103 44 -122
7213a22O9Q9K4j43K7P4M5p3m5N2N1j6n2l8R0M2m4n5l3J09Lo0o2M1P7j1j29Q0M2
$$ -122 -53 36 60 -83 -56 18 63 -10 -55 -3 48 32 -20 -58 32 74 30 -25 -58 51 54 -6 -68 -27 50 39 -90 -10 32
7242C2p2J6m8J06k5j9L0q2L3j4P0j12rJ40n6o4J0R7j1m9jP4j8k6k6O1n8J2j6l4
$$ 32 -40 -24 -72 34 9 -10 20 -62 -29 -43 27 -85 -94 46 -10 -74 -64 33 22 -27 -28 46 28 2 -24 37 -21 -9 -25 -59
7272e9L6%O3q9L1J0O2p5m1Q8M9j03n7J50m6n9O5n1N1k7j4k8K8M1K0m8ql3R0l4
$$ -59 -23 -23 40 -49 -18 -8 54 -21 -62 26 75 -28 -85 65 19 -40 25 -26 25 -2 -16 -44 -16 25 45 -3 -11 -44 46 12
7302A2o4P5N5j23P8K3n3%p9R0JJ1j2m3n7L8J09q2n3Q7N8l0j15O1J03p2k3MM6n9
$$ 12 -52 23 78 -45 33 56 3 3 -76 14 15 26 14 -29 -86 -48 61 -21 -74 13 71 41 -74 -13 90 18 -5 -1 45 -14
7332a4J1j5k1K3P8l4j31Q8P1j3j22J4J10j4j25lJ08K1m2MjJ5J4l1m8OR9n6mm8
$$ -14 -3 -18 -39 -16 62 28 -103 -15 56 43 -79 -65 45 31 -94 -97 11 32 -10 -6 -7 8 22 -9 -57 -51 48 -8 -12 -60
7362f0R9jo1p4J02J02j04n6O0M7q3m9K0L8R0q2k6J4M2P7j03j01J16Ok4j02R6Q2
$$ -60 39 38 -23 -97 5 107 3 -53 7 54 -29 -78 -58 -20 70 -12 -38 -24 18 95 -8 -109 7 13 -11 -113 -17 65
7390F5m5j15P8O2m8O4l7m9J8J22p1j13M4R6o4o2k3J38j2o3m3O2Ql8j9N1MJ6m1
$$ 65 20 -95 -17 45 -3 61 24 -25 -7 115 44 -69 -25 71 7 -55 -78 60 48 -15 -58 4 12 -26 -45 6 10 26 -15
7419a5o7M1N3mo4J0O0K5j14J3J08J7j33j4R2L6LK5q0k4K0M2n6l7N2P0q3p6N9O6
$$ -15 -82 -41 12 8 -56 -46 14 39 -75 -62 46 63 -70 -84 8 44 47 72 -8 -32 -12 30 -26 -63 -11 59 -24 -100 -41 25
7449B5p0j2J03m5moqK7l3RK3p3K4J59j30n6O0N8l7l1N5N0j40m7R0L8M7j11l2Q1
$$ 25 -45 -57 46 1 -3 -9 -17 10 -23 -14 9 -64 -40 119 -11 -67 -7 51 14 -17 38 88 -52 -99 -9 29 76 -35 -67 14
7479A4n4L8M6j6j6M3k7m8JJ20p1j30P9R4n8n8rM6L8j3m3j7R6n9jKm0L9Q4j44K7
$$ 14 -40 -2 44 28 12 55 28 -20 -19 101 30 -100 -21 73 15 -43 -52 -6 32 19 -24 -41 55 -4 -5 -3 -43 -4 80 -64 -37
7510c7N2N9q8k4P1M5n7j12Q4P1o6L2l4J2M9lq5J1N4Qn8n6O3Q7r5q8M6R0k4q1O5
$$ -37 15 74 -14 -38 33 78 21 -91 -7 64 -2 30 -4 8 57 54 -31 -20 34 42 -16 -72 -9 78 -17 -105 -59 31 7 -74 -9
7541il9M5Qn0K5m1P0Po9N2R8p5n1m5J36j8j14k2J23l0k0l0J8R0q7Q5m6KL1k5n6
$$ -9 -48 -3 5 -45 -20 -61 9 16 -53 -1 97 22 -29 -74 62 44 -70 -92 31 1 -19 -49 -31 59 -28 57 11 13 44 19 -37
7572c7%M8Rkj01J75l1n4q3J12qp6L3K7l4L3Oj8qpO0q2lJ8P1j04j4M4O0l1l1L2
$$ -37 -37 11 20 18 -83 92 61 7 -76 36 28 -48 -15 12 -22 11 17 -1 -9 -16 44 -38 -41 -23 48 -56 -70 -26 34 3 -28 4
7604DM3o6L4%k3K4N3o8m6kJ17q6o8K4J01kr2K4L5K7r9P1j6N8n1Kj0k7O1J4m9P
$$ 4 47 -19 15 15 -8 16 69 1 -45 -47 70 -16 -84 -60 41 39 -53 -29 6 33 -66 5 -11 47 -4 -2 -12 -39 22 36 -13 -6
7636fM6n3p7N1O1K9p7j4O8L2q1K4K3J6m2L1k3M0l1L3k3o8N2O1m0q7J08Jj02mP5
$$ -6 40 -13 -90 -39 22 51 -26 -40 28 60 -21 3 26 42 0 31 8 48 17 50 27 -41 11 72 32 -55 53 54 -48 -52 23
7667B3K6L3j32mM3n2N1Nn3K4Q5o0j07J18N0n8n7K7P9j0r3OO1J1NL4n9%opL6LK8
$$ 23 49 82 -50 -54 -11 -63 -12 -7 -60 -36 49 -11 -118 0 50 -8 -65 -38 41 31 -62 -56 5 16 21 55 -4 -4 -10 -17 19 22 50
7700E0l7n5nM4K0r5L8J22rr2l7N0j3J5lk8K7N4lp4m8P4J0o9j8O9P7p7n3O1L7p
$$ 50 13 -42 -47 -3 17 -78 -40 82 73 -19 -56 -6 -19 -4 -7 -35 -8 46 43 -31 -79 -5 5 -64 -82 -13 64 -13 -66 -5 32 25
7732B5o9M1K1K8m3N2q4K8N2m7n5Q4L9p8o2M3Q4l5j04N9P8m3J3n2m5M6K6k1j1K
$$ 25 -44 -3 18 46 3 55 -29 -1 51 4 -51 33 72 -6 -68 -25 59 24 -80 -21 57 14 27 -25 -70 -24 2 -19 -30 -28
7762b8M4Rj26N7M4J2l5k8J17K1j16P5o1J2L0j3o5P3O5qj05m7P7J3m6M0PK0r4L4
$$ -28 16 25 -101 -44 0 12 -23 -51 66 87 -29 46 -15 -3 27 14 -51 22 87 79 -26 -73 4 17 -29 11 18 38 -56 -22
7792b2K4K1o9L8Qj1lM3q3JL8N3l6q3N4P1l5o1P7j8l9J2O7j6l2L5o5N1NJ0L2o6
$$ -22 2 23 -46 -8 0 -11 -14 29 -54 -53 -15 38 2 -81 -27 44 9 -52 25 7 -32 -20 47 31 -1 34 -31 20 25 35 67 1
7824AL8K1q1k2K1P4k1o9M9J9Qk3o4Q8L5j02K4l9L9m4PJ0m0R2no2M0J4j3m4J36
$$ 1 39 60 -21 -43 -22 52 31 -38 11 30 38 15 -49 39 74 -28 -4 -43 -4 -48 -41 -31 -71 21 16 -46 -6 8 -5 -49 87
7855H7j09N4k3l8M8l5Kl0L7PJ8Rk5j2m1J17j28NR4L1j02mP4o2L4m8N0K7no0oO
$$ 87 -22 32 9 -29 19 -16 -14 -44 -7 0 18 27 2 -10 -51 66 -62 -57 37 68 -34 -38 36 -26 8 -40 10 37 32 -28 -34 -28
7887b8J2j3J2p8J12Pj9o8O7L9j4n0k2M5J2q3O2oK4j7J3m9P2Oj3q4K1R0o3k2k9
$$ -28 -16 -29 -17 -95 17 24 5 -63 4 43 29 -21 -43 2 14 -69 -7 -13 11 -6 7 -42 30 36 23 -61 -40 50 -13 -35 -64
7918f4R7M3p5n8J6N0k7j3k8K0M9K2o5RN6nn9o1R7J3j5n2M9R1o8m8mKJ4Q4q5K4
$$ -64 33 76 1 -57 -41 9 -18 -31 -59 -39 10 32 -33 -24 32 27 -32 -93 4 17 2 -50 -1 90 22 -26 -30 -28 -14 70 -15 9
7950I%N9n0m7L7O5k4j04L9R3m2q2M6J7jk3J0m8K7OM3q1K2O8p6j6MO0j5l3k6J00
$$ 9 9 68 18 -29 8 73 49 -55 -16 77 35 -47 -1 16 15 -8 2 -46 -19 -13 30 -51 -29 39 -37 -53 -49 11 -4 -37 -63 37
7982C7oo7M3K2m7L6j5J9n1J0K0l3kM8l1l3N9O0Rq3k5N3K4m1j3m2M3J2j8k1N1m7
$$ 37 31 -36 7 29 -18 18 3 22 -29 -19 1 -32 -34 14 -17 -50 9 69 78 -5 -30 23 47 6 -7 -49 -6 6 -12 -33 18 -29
8014b9Q4pq0J6K3p7KO0M3l8l1KM4J2j2J2p5Q2j6n4L7M6J3r9J6J0N4J2q9N7J0N6
$$ -29 55 48 -32 -16 7 -70 -68 -8 35 -3 -34 -32 12 24 12 24 -51 31 15 -39 -2 44 57 -42 -26 -16 38 50 -39 18 28 84
8046H4j14lJ12n0o6Q5n4L9l9L5o5j0O7J5q1NP7j05K1K7mPk6J4jP5n5j6J3MO2n1
$$ 84 -30 -33 79 29 -37 48 -6 33 -6 29 -36 -46 21 36 -45 -40 37 -68 -47 -20 -24 -17 -43 -29 -30 45 -10 -26 -13 -9 53 2
8078Brn1Q6jn6J0M7K0l7k3L7K7p2Pn8O2J9qK6m8J7n0K7n6P6N5o3J0l5O9M5j14
$$ 2 -7 -58 28 27 -29 -19 28 48 11 -12 25 52 -20 -13 -71 -9 10 2 28 -20 -3 -53 -26 -82 -6 49 -14 -4 -39 30 75 -39
8110c9J8J5P2jp2nL8N0p0n1K9L6j5j2l6O3Mn9nN1qj8j0J4N6r5P3j06jJ16l2j9
$$ -39 -21 -6 66 65 -7 -12 26 76 6 -45 -16 20 5 -7 -43 20 24 -35 -40 11 3 -15 -25 -11 45 -50 23 -83 -84 32 0 -19
8142a9k9N9N4r6k8K4P2k3m2P1n5l6qQ6JK2m0j0J0J9op2J1oO6l9m3J04J6n4rj5
$$ -19 -48 11 65 -31 -59 -35 37 14 -28 43 -12 -48 -56 30 31 53 13 3 13 32 26 -46 -35 -41 25 -14 -57 47 63 9 0 -15
8174a5L2M0l5q8R2l6N5r0NL9L1rk4k2L4Nn9
$$ -15 17 57 22 -66 26 -10 45 -45 -40 -1 30 21 -3 -25 9 14 -45
8191d5
$$ Imaginary data points
##PAGE= N=2
##DATA TABLE= (X++(I..I)), XYDATA
0@%%%%%%%%%%%%%%%%%%%%%%%%%kMmOqQqJ3k0K3k6K8l1L8m6N1n4O1p2Q2r0J02j16
$$ 0 0 0 0 0 0 0 0 0 0 0 0 0 0 0 0 0 0 0 0 0 0 0 0 0 0 -2 2 -2 4 -4 4 -4 9 -11 12 -14 14 -17 21 -25 26 -28 33 -39 43 -47 55 -61
48f1J28j39J53j70J84k01K21k37K53k70K85k94K96k84K43j53l1M15j276L473j0937
$$ -61 67 -72 81 -89 95 -106 115 -122 131 -139 146 -148 148 -136 107 -46 -77 338 -938 2535 -8402
69h402P5007M22082l54825n69868K52234M92704r8402l75630k9511K00480J36476
$$ -8402 66605 488687 133862 -436006 -183772 308932 210530 -165100 -194611 5869 142345
80A42345p722j93667j90735K11829L62409j88681m96973J40807N75291p1417n91229
$$ 142345 134623 -59044 -249779 -37950 324459 135778 -361195 -220388 354903 283486 -307743
91c07743j787N39766O8871m32503j15095K81455J33342j07866j15076o7888O1600
$$ -307743 -309530 230236 299107 -133396 -248491 32964 166306 58440 -56636 -124524 -62924
102f2924K21034J7421l37567j05477M06899J86148m27091k43441M00157K66084
$$ -62924 158110 175531 -162036 -267513 139386 325534 -101557 -344998 55159 321243
112C21243l36158k49808K48586J99871j50391j22974N4395K8702K8735P2870r1307
$$ 321243 -14915 -264723 -16137 183734 33343 -89631 -35236 -6534 22201 95071 3764
123C764j69008J31576K49309j51261l03909J52857L24956j41525l09600J23567
$$ 3764 -165244 -33668 215641 64380 -239529 -86672 238284 96759 -212841 -89274
133h9274K59875j05526j85379R1150R7030q3719o977Q3425p4241q7151J38794
$$ -89274 170601 65075 -120304 -29154 67876 -15843 -22820 60605 -13636 -100787 38007
144C8007Q9152j83077q2953K07673O5503k13925l5085K05268n485j85449N1701
$$ 38007 127159 -55918 -138871 68802 134305 -79620 -114705 90563 85078 -100371 -48670
155d8670J59231r6548j29705J33697R8691j59544o7475J70773L6009j66048l697
$$ -48670 110561 14013 -115692 18005 116696 -42848 -110323 60450 96459 -69589 -73286
166g3286J44926l1946j09833P0723O3918j11628j2652J53028l7234j91269P7672
$$ -73286 71640 39694 -70139 584 64502 -47126 -59778 93250 56016 -135253 -57581
177e7581K21560j02262k37503J09601K34922j00397k09941P9242J61259n2782
$$ -57581 163979 61717 -175786 -66185 168737 68340 -141601 -62359 98900 46118
187D6118r0552K8718M833j2544Q6061O541j72372j1967K43076K7344k89586m9152
$$ 46118 -44434 -15716 -10883 -23427 62634 69175 -103197 -115164 127912 155256 -134330 -183482
199a83482L05491P1838k90082r0023K44576R8116j73124r0559Q3814O3759J3177
$$ -183482 122009 193847 -96235 -186258 58318 156434 -16690 -107249 -23435 40324 53501
210E3501j8039j05506m2344J82866J11282k34576j78934K54242K34130k40700
$$ 53501 35462 -70044 -112388 70478 181760 -52816 -231750 22492 256622 15922
220A5922k66501J98408K69278j35660k39451O2341J77265R120q9120o8701j4971
$$ 15922 -250579 -52171 217107 81447 -158004 -95663 81602 90722 1602 -67099 -82070
231h2070J09142J22211j27045k20142J20929K96668r3601l41156N1866L48220
$$ -82070 27072 149283 22238 -197904 -76975 219693 126092 -215064 -163198 185022
241A85022m045l16538m0876K50194P4400j55971q8557M6055Q0205O5522n0523
$$ 185022 180977 -135561 -176437 73757 148157 -7814 -96371 -50316 29889 95411 44888
252D4888j65652M124K42933N1490k88963j07172K99261J52112k76140j78601K24904
$$ 44888 -120764 -116640 126293 177783 -111180 -218352 80909 233021 -43119 -221720 3184
263C184J81470j53903j58567P2956J10946O876m4058p5717l3128J27136J11792
$$ 3184 184654 30751 -127816 -54860 56086 62962 18904 -56813 -89941 37195 148987
274A48987j56342j81554J61980K32953j46393k57877J15816K53336p7383k19947
$$ 148987 -7355 -188909 -26929 206024 59631 -198246 -82430 170906 93523 -126424
284a26424L8462J61034o228q4777j4127R03K0972P9504j6404j48057L213J97338
$$ -126424 -87962 73072 66844 -17933 -32060 -31157 -10185 69319 52915 -95142 -91929 105409
296A05409J4094k23232k9773K25143L9077k05576l8995J69088K9121j20806q964
$$ 105409 119503 -103729 -133502 91641 130718 -74858 -113853 55235 84356 -36450 -45414
307d5414O7357j8455j5056M9362l1179p8735O8219J02190r4275j15797J08883
$$ -45414 21943 3488 -11568 37794 6615 -72120 -3901 98289 4014 -111783 -2900
318b900J16483j14325j03861J12986P9127j07848m6009J00673Q318r2635K8732
$$ -2900 113583 -742 -104603 8383 87510 -20338 -66347 34326 42644 -49991 -21259
329b1259Q3727o0760p2315Q4169N7281r7362l6870J00752J1196r5115J9462Q3247
$$ -21259 62468 1708 -70607 13562 70843 -26519 -63389 37363 48559 -46556 -27094 56153
341E6153n3169o7997Q7130N2298j17382l7933J39844K5744j51569j6307J49383
$$ 56153 2984 -65013 22117 74415 -42967 -80900 58944 84688 -66881 -83188 66195
352F6195Q473j32157n37J00525j0029n7796K4020Q273m2370M2492O5196q7886
$$ 66195 74668 -57489 -58026 42499 32470 -25326 -1306 6967 -35403 7089 72285 -15601
364a5601r0266J22071J14134j40828j32142J42805J41016j27905j36208R8619
$$ -15601 -105867 16204 130338 -10490 -142632 173 141189 13284 -122924 -24305
374b4305J15316o0255p8341J8863K8111J9784L0894n0638r3127O8408J50512p1634
$$ -24305 91011 30756 -47585 -28722 -611 19173 50067 -571 -93698 -25290 125222 53588
386E3588j95328O1011K21644l9983k25288J2608K04119J4805j58891l5622R5306
$$ 53588 -141740 -80729 140915 100932 -124356 -111748 92371 107176 -51715 -87337 7969
397G969M5441k0411m1874n7066K4905J27683M315j82246m0292K14478P6585k21903
$$ 7969 53410 32999 -8875 -65941 -41036 86647 90962 -91284 -131576 82902 159487 -62416
409f2416j07322K04441J26432j64921j29123J09320J12216m5875p7395j7722K7793
$$ -62416 -169738 34703 161135 -3786 -132909 -23589 88627 42752 -34643 -52365 -24572
420b4572P3962L1264j15876r2348J38493J46964j40595j87356J24330K08503r3341
$$ -24572 49390 80654 -35222 -127570 10923 157887 17292 -170064 -45734 162769 69428
431F9428k06196N4051J79552j3986j30995j9728O6522M2942O067n2989p8392M8961
$$ 69428 -136768 -82717 96835 82849 -48146 -67874 -1352 41590 47657 -5332 -83724 -34763
443c4763J40957l3222j86246R781K09541J5814k09858l8641J87699N3778j47154
$$ -34763 106194 72972 -113274 -103493 106048 121862 -87996 -126637 61062 114840 -32314
454c2314n6845R4085M6880l5595k4772k1914n524P2151M0436j09886p3597J31930
$$ -32314 -89159 4926 51806 16211 -8561 -30475 -35999 36152 76588 -33298 -106895 25035
466B5035R9739j37775j14959J29233J17207j09580j05455Q3220P9968n5122m4123
$$ 25035 124774 -13001 -127960 1273 118480 8900 -96555 -13335 66633 11511 -32612
477c2612K8865K176o848M0447r808p9162K0709J08433k6497j25060K9204J28326
$$ -32612 -3747 -1571 -8419 32028 22220 -56942 -36233 72200 45703 -79357 -50153 78173
489G8173l0293j19093L1875R9401l5025p2201M1127M1429m9101j0404N7138j8312
$$ 78173 47880 -71213 -39338 60063 25038 -47163 -6036 35393 -13708 -24112 33026 14714
501A4714o2686M2374O3523o0086n8108P1008M4971p6229k5917P7241K744p5756
$$ 14714 -47972 -5598 57925 -2161 -60269 10739 55710 -20519 -46436 30805 33549 -42207
513d2207K1912P3059m5816o9608O5788O4866p8891n7182Q3896M5429p9765k9036
$$ -42207 -20295 52764 6948 -62660 3128 67994 -10897 -68079 15817 61246 -18519 -47555
525d7555O7177Q331m7647J6317K5072m3405l104P0881j5304r6489K7855J17065
$$ -47555 19622 27953 -19694 -3377 21695 -21710 -24814 46067 30763 -65726 -37871 79194
537G9194l3482j29371L2195J29744k6142j16677J7272R0188q127n2309J349O970
$$ 79194 45712 -83659 -51464 78280 52138 -64539 -47267 42921 34794 -17515 -16166 -9196
549i196N93M0313M071q3637j4878J18599L0363j41131m7606J48746O2744j40078
$$ -9196 -8603 31710 35781 -47856 -62734 55865 86228 -54903 -102509 46237 108981 -31097
561c1097p1242J16262P0310q0266n8670L6210L6031J0007m272n1970l3486Q3700
$$ -31097 -102339 13923 84233 3967 -54703 -18493 17538 27545 23273 -28697 -62183 21517
573B1517P2595j02499j08206J06631J35587r6859j49635P5806J46897m7712j26516
$$ 21517 94112 -8387 -116593 -9962 125625 28766 -120869 -45063 101834 54122 -72394
584g2394J7283R0226J1601m1317l4084j4093M6421O9321m6970j17417L6488J52956
$$ -72394 -55111 35115 46716 5399 -28685 -42778 3643 72964 25994 -91423 -54935 98021
596I8021j7320j71965o469J71560K9056j52352m5408J16786N2338o9695m8384
$$ 98021 80701 -91264 -97733 73827 102883 -49469 -94877 21909 74247 4552 -43832
607d3832J6526L3379L5516r181p9800k0388J11665N1493j28502p9517J29837R9866
$$ -43832 -27306 6073 41589 32408 -47392 -67780 43885 95378 -33124 -112641 17196 117062
619A17062j16595j08085R2681J01968o1906q1936K8793M9789K696r976k8259l2612
$$ 117062 467 -107618 -14937 87031 25125 -56811 -28018 21771 24467 14491 -13768 -46380
631d6380M5205P1947n2944j03790N1615J24792m3371j32588L1162J26035j8427
$$ -46380 -1175 70772 17828 -85962 -34347 90445 47074 -85514 -54352 71683 53256
642E3256j06296Q170P5944k081l8209J113j689n009L8907J2722o8975k1932Q9359
$$ 53256 -53040 -44870 31074 28993 -9216 -8103 -9792 -14801 24106 36828 -32147 -54079 35280
655C5280L0449r9109l5925R8601L6420q9944l0447P5010J8192n6640j367L6524
$$ 35280 65729 -33380 -69305 29296 65716 -24228 -54675 20335 38527 -18113 -19480 17044
667A7044j7739j7023L6521l79n2321J4598O2673k5368o6453L3541O3556l9698
$$ 17044 -695 -17718 18803 18424 -33897 -19299 43374 18006 -48447 -14906 48650 8952
679H952n4095M4991L9571n0025k1645N5013K857n8640J4499N9691k8619n7251
$$ 8952 -45143 -152 39419 -10606 -32251 22762 25619 -33021 -18522 41169 12550 -44701
691d4701L8107N0099m2522l8176M2623K1306m0004j023L5929k1312l1871M3812
$$ -44701 -6594 43505 983 -37193 5430 26736 -13268 -14291 21638 326 -31545 12267
703A2267K8887o4092k7213P9096K6525q6448k5498Q5087K3690p4512j9614N5897
$$ 12267 41154 -22938 -50151 28945 55470 -30978 -56476 28611 52301 -22211 -41825 14072
715A4072J1907l1359n1M610j5753K1216L4521m3588n4339N9368P2276o7024q5322
$$ 14072 25979 -5380 -5431 -821 -16574 4642 39163 -4425 -58764 604 72880 5856 -79466
728g9466O6034R0508n7161q6722M2162P2642k3160m9054L983J8020J2135J7428
$$ -79466 -13432 77076 19915 -66807 -24645 47997 24837 -24217 -20234 -2214 9921 27349
740B7349k2857n3283K6953Q5915k3894j10487J4626J23815j948j23567j1527J09722
$$ 27349 4492 -48791 -21838 64077 40183 -70304 -55678 68137 66189 -57378 -68905 40817
752D0817K2948q3684k9753M8286K9361q318k1307l1216O059O5827J4289r1655
$$ 40817 63765 -19919 -49672 -1386 27975 19657 -1650 -32866 -26807 39020 53309 -38346
764c8346l7022J05591N8351j06676p3849R5481Q1007p4459p7658M6803O3685j6451
$$ -38346 -75368 30223 88574 -18102 -91951 3530 84537 10078 -67580 -20777 42908 26457
776B6457l9865j1787Q960L4659K5116m9780n8422N5829Q6836n3032j06302M2928
$$ 26457 -13408 -25195 -16235 18424 43540 -6240 -64662 -8833 78003 24971 -81331 -38403
788c8403J13812k8506j08705J2422R1323K290o3664j2891K8866J7483Q411j5660
$$ -38403 75409 46903 -61802 -49380 41943 44233 -19431 -32322 -3456 14027 22438 6778
800F778m3567Q310P3018L407r3475j6569J02660K8695j00332l6644Q8001L8658
$$ 6778 -36789 -28479 44539 47946 -45529 -62098 40562 69257 -31075 -67719 20282 58940
812E8940o7602l4184M2311K2745j5665n936q947j3773K8828L3552m3034n0765
$$ 58940 -8662 -42846 -535 22210 6545 609 -8338 -22111 6717 40269 -2765 -53530
824e3530N0272O3090n1394o8253M7723O5512m1003n5427L3048L9244k5042j8660
$$ -53530 -3258 59832 8438 -59815 -12092 53420 12417 -43010 -9962 29282 4240 -14420
836a4420J8481l454j3669K4388J0610m1998q354N4591O277o1159l597O1433q08
$$ -14420 4061 607 -13062 11326 21936 -20062 -28416 26175 32452 -28707 -32304 29129 28321
849B8321n6276P270M6719j5359l4736K4340K1461l3308q728M0638k318m4846J1372
$$ 28321 -27955 -20685 26034 10675 -24061 279 21740 -11568 -20296 20342 18024 -26822 -15450
862a5450M5004j8365m0453K3724L1623k7863j8891L1617L989l5350J1278L8943
$$ -15450 29554 11189 -29264 -5540 26083 -1780 -20671 10946 14935 -20415 -9137 29806
874B9806k4917m1892L5536M3262m1742m2482M2736L8181l8916k9769L1298J7182
$$ 29806 4889 -37003 -1467 41795 53 -42429 307 38488 -428 -30197 1101 18283
886A8283k1467j293J0790j7056j278L6380n653n3893R317O7526r601p5304P149
$$ 18283 -3184 -4477 6313 -10743 -12021 24359 18706 -35187 -25870 41656 32055 -43249 -36100
899c6100P5841k613o8160k006N2686N153l1270n513O099K343K0141M686m4454
$$ -36100 39741 37128 -31032 -33038 19648 24801 -6469 -11982 -5883 -3540 16601 21287 -23167
912b3167j5018O3227K6720p4651l7889P7538M6318p1493n0182N7384M7717l7644
$$ -23167 -38185 25042 51762 -22889 -60778 16760 63078 -8415 -58597 -1213 46504 8860
924H860l8261J5452K2476O613j700k5479k1998L8866M5746m5289o5783M4758P9673
$$ 8860 -29401 -13949 8527 15140 13440 -12039 -34037 4829 50575 5286 -60497 -15739 63934
937F3934l7995q5443K6606Q1454j2920o7924n96M6501J1138j9627j7496r880J8408
$$ 63934 25939 -59504 -32898 48556 35636 -32288 -32884 13617 24755 5128 -12368 -22248 -3840
950c840L8711j3792o3203M755Q0389O616q8589j7938Q6782K7446p5289l2571N5997
$$ -3840 34871 21079 -42124 -37369 43020 49636 -38953 -56891 29891 57337 -17952 -50523 5474
963E474L2040l1745k5342N977J3164J8322L147l8252k1725N1863L9250n8202n3188
$$ 5474 37514 5769 -19573 -13596 -432 17890 21037 -17215 -38940 12923 52173 -6029 -59217
976e9217N7402O1150n0456o1836L8661N4903k4669m1084J0837K2151R53m68r234
$$ -59217 -1815 59335 8879 -52957 -14296 40607 15938 -25146 -14309 7842 8795 8327 -907
989i07k1474J3511M1360j3875n6443J1505O5324p671o7064L793O1715r91n0156
$$ -907 -22381 -8870 32490 18615 -37828 -26323 39001 31330 -35734 -31941 29774 28783 -21373
1002b1373K2L4150j532j6128N164j774j0766J7926J7054l0770k3155L9479K7099
$$ -21373 -21351 12799 11267 -4861 303 -1471 -12237 5689 22743 -8027 -31182 8297 35396
1015C5396m3620k7820M3705K4695m0246j7783L4221Q156k6950L414J9646j4845
$$ 35396 -8224 -36044 7661 32356 -7890 -25673 8548 16704 -10246 -6832 12814 -2031
1027b031j3030K4930P432l2650k601L6962j761l7558O402L4072j1848k7340J7782
$$ -2031 -15061 9869 17301 -15349 -17950 19012 17251 -20307 -13905 20167 8319 -19021 -1239
1040a239J8223k3832q169K9551j447l4285Q948L7243j3968l7528J6662L4765j7190
$$ -1239 16984 -6848 -15017 14534 13087 -21198 -12250 24993 11025 -26503 -9841 24924 7734
1053G734k8522J6516J8669j5220n644J4188q913j3775K3469J4017l6174j5197
$$ 7734 -20788 -4272 14397 -823 -6467 7721 -1192 -14967 8502 22519 -13655 -28852
1065b8852M5224J7129m9442j9069M8288J9658m2152j8245L1708J3682j8081n600
$$ -28852 16372 33501 -15941 -35010 13278 32936 -9216 -27461 4247 17929 -152 -5752
1077e752L043n546J1425J8485k3595l1361L1896M2726l5291n0574L3449N3805
$$ -5752 -2709 -8255 3170 21655 -1940 -33301 -1405 41321 6030 -44544 -11095 42710
1089D2710k7102n1617J8471M3353q597k9795n77J1786P363Q811j0992k9498J1051
$$ 42710 15608 -36009 -17538 25815 17218 -12577 -13154 -1368 5995 14806 3814 -25684 -14633
1102a4633M7412p896o0454J848O6911N684o5771j3123N7472J8626m3294k0645
$$ -14633 32779 24883 -35571 -33723 33188 38872 -26899 -40022 17450 36076 -7218 -27863
1114b7863K4847J8358m072j1358j6322N59L3998J2500m6944k5604N3721L6897
$$ -27863 -3016 15342 11270 -88 -16410 -15851 18147 30647 -16297 -41901 11820 48717
1126D8717n3529m4643M6817M7174l5272m3906K1125L4699o715k0251o485K334
$$ 48717 -4812 -49455 -2638 44536 9264 -34642 -13517 21182 14467 -5784 -12269 -9935
1138i935J6242J7098k1973l5247K3588M9705k1337n8674J6140O0984r029n6151
$$ -9935 6307 23405 1432 -33815 -10227 39478 18141 -40533 -24393 36591 27562 -28589
1150b8589J750M5529M032l0424p184J2561P014O044l467k3304k542L7138R492
$$ -28589 -26839 18690 22722 -7702 -14886 -2325 4689 10733 7266 -16038 -18580 18558 28050
1163B8050m6332j6146M9899K1163m7896k3541M0972K2461l0711j7821J9000R948
$$ 28050 -18282 -34428 15471 36634 -11262 -34803 6169 28630 -2081 -19902 -902 9046
1175I046p092K34l259j1779J1477K2852j6904l1623J9720L6843k0125l7808J8910
$$ 9046 1954 2188 -1071 -12850 -1373 21479 4575 -27048 -7328 29515 9390 -28418 -9508
1188i508L4250j6650k6995J4382J7016j2804n830J1942n315j2009J5418J2347
$$ -9508 24742 8092 -18903 -4521 12495 -309 -6139 5803 488 -11521 3897 16244
1200A6244k3340j2382K8316J1179l0077q517K9046M293k5461J436K0239q080j4594
$$ 16244 -7096 -19478 8838 20017 -10060 -18577 10469 14762 -10699 -9263 10976 2896 -11698
1213a1698J5129R354k1278m958K6179J323k8919J350K8749l612k5313N863J9058
$$ -11698 3431 12785 -8493 -13451 12728 14051 -14868 -13518 15231 11619 -13694 -7831 11227
1226A1227q646j0709J1612J257j5210Q199J9170j6175k3076K1730K6044k4457
$$ 11227 2581 -8128 3484 4741 -10469 -2270 16900 725 -22351 -621 25423 966
1238I66k7231K4253K6169k1184k1927J5988J4545r833m512L782p138J478J9293
$$ 966 -26265 -2012 24157 2973 -18954 -2966 11579 1746 -2766 1016 -6122 -4644 14649
1251A4649m949l0467N958L9033m876m3804K132M4118J243l9829m494L0867O443
$$ 14649 9700 -20767 -14809 24224 19348 -24456 -22324 21794 23037 -16792 -21286 9581 16024
1264A6024j8416o107L885L534J0824J517k4282q243L4654J6002m0471k3250M1354
$$ 16024 -2392 -8499 -4614 -1080 9744 11261 -13021 -21264 13390 29392 -11079 -34329 7025
1277G025K8738l7498l1204K9622K9796j8764k4115O666J4427M678j860j4090j2167
$$ 7025 35763 -1735 -32939 -3317 26479 7715 -16400 -9734 4693 9371 7511 -6579 -18746
1290a8746K0428K5886k2952l7537K1478M5249j6974m7840J0498M5131l382l7078
$$ -18746 1682 27568 4616 -32921 -11443 33806 16832 -31008 -20510 24621 21239 -15839
1302a5839k977K4600P475r292r125o876P925K2139m100l4729j661M3098Q228m6325
$$ -15839 -18816 5784 13259 3967 -5158 -12034 -4109 18030 13930 -20799 -22460 20638 28866 -17459
1316a7459j4228M4204J8558l7685k0138K7332J8412j4766j3337J777N339R977
$$ -17459 -31687 12517 31075 -6610 -26748 584 18996 4230 -9107 -7330 -1991 7986
1328G986M370j9208j4610K5156K4071k7305l1107K5900L4642k1746l3975J5944
$$ 7986 12356 -6852 -21462 3694 27765 460 -30647 -4747 29895 8149 -25826 -9882
1340i882K9327r581k0946L764R905N73K152k893j3894L332K3764k308l0914L71
$$ -9882 19445 9864 -11082 -7318 2587 3160 5312 2419 -11475 -8143 15621 13313 -17601 -17230
1354a7230L4223J761l3768l027K9791L018k3208j479J4931j468n991N779k412
$$ -17230 16993 18754 -15014 -18041 11750 14768 -8440 -9919 5012 3544 -2447 3332 920
1367I20j0420R342J4718j4392j7760J7330J9200j8288j8353J7545J5127j5914
$$ 920 -9500 -158 14560 168 -17592 -262 18938 650 -17703 -158 14969 -945
1379i45r923J3817L313j1747L750J0088j0724q853J6276P888j9827o859K1173
$$ -945 -10868 2949 6262 -5485 -1735 8353 -2371 -11224 5052 12940 -6887 -13746 7427
1392G427N337k0166l011J7044l34j2256M794O974r924j931J5260k387k0010N448
$$ 7427 12764 -7402 -10413 6631 6297 -5959 -1165 5809 -4115 -6046 9214 6827 -13183 -7735
1406g735K3527p022k4972P190K3709o460j9732N299J3249m255n103L855m142m434
$$ -7735 15792 8770 -16202 -9012 14697 8237 -11495 -6196 7053 2798 -2305 1550 -2592 -7026
1420g026J3117O165k0778q611K6260J1310k8739j3774K8027J5173k3992j4522
$$ -7026 6091 12256 -8522 -17133 9127 20437 -8302 -22076 5951 21124 -2868 -17390
1432a7390J7355J1703r060o793L41q8P712Q234j3840j6732J7406K4198j8190k9806
$$ -17390 -35 11668 2608 -4185 -3844 -3932 3780 12014 -1826 -18558 -1152 23046 4856 -24950
1446b4950J6234L2460j2178l1384O785K6513j399j8149l245P390O337M554p100
$$ -24950 -8716 23744 11566 -19818 -13033 13480 12081 -6068 -9313 -1923 4414 8968 1868
1459A868j6274N528K6285j955l3207k705L6373P722l5486j1867L0465J4194k2240
$$ 1868 -14406 -8878 17407 15452 -17755 -20460 15913 23635 -11851 -23718 6747 20941 -1299
1472a299j3972J1796J1110n71n973j0149j086J8907R031k4547j6979K6859K3490
$$ -1299 -15271 -3475 7635 7064 1091 -9058 -10144 8763 17794 -6753 -23732 3127 26617
1485B6617k5580k7717K1506K8616j5186k5780P954J9415q48j0487m787k04Q780
$$ 26617 1037 -26680 -5174 23442 8256 -17524 -9570 9845 8997 -1490 -6277 -6481 2299
1498B299J1050j0410k0550R420K7857o757l1889K848L2380J057k9301m256K2942
$$ 2299 13349 2939 -17611 -8191 19666 12909 -18980 -16132 16248 17305 -11996 -16252 6690
1511F690N755j4239n257M303L200N129O26j3592n009J9698R624k2818j3372K3178
$$ 6690 12445 -1794 -7051 -2748 452 5581 6207 -7385 -12394 7304 16928 -5890 -19262 3916
1525C916J5682k1199j5955J7457J4043j2605r877P387L845k494K996j605r757
$$ 3916 19598 -1601 -17556 -99 13944 1339 -8538 -1151 2694 200 3196 1591 -8166
1538h166M499J5534o096j9487O035K1255n376k0508M495J7674l955j3019M122
$$ -8166 -3667 11867 5771 -13716 -7681 13574 8198 -12310 -7815 9859 5904 -7115 -2993
1551b993P244n179r78O963m745q749R315J0313j2504j1025J3786J0754j3414r035
$$ -2993 4251 -928 -1906 5057 312 -8437 878 11191 -1313 -12338 1448 12202 -1212 -10247
1565a0247J1608O140r554j937P209l075n158Q407L679j3352k974J6964K628j8625
$$ -10247 1361 7501 -2053 -3990 3219 144 -5014 3393 7072 -6280 -9254 7710 10338 -8287
1579h287k280J8047K031j5270j438J0858Nn320K402m51n441N655R165j0094j3003
$$ -8287 -10567 7480 9511 -5759 -7197 3661 3666 -1654 748 297 -5144 511 9676 -418 -13421
1594a3421J3097J6131j4072j7915J3209J7731j0731j5519O876J1259k677n292
$$ -13421 -324 15807 1735 -16180 -2971 14760 4029 -11490 -4614 6645 3968 -1324
1606a324r62j886L298R416m104j6424L518K1933j493k5179j056K5491L705k2780
$$ -1324 -2286 -4172 -874 8542 4438 -11986 -8468 13465 11972 -13207 -14263 11228 14933 -7847
1620g847n763J7451O848j0024o616J699M486O532p29j3711m209J8936R641k1736
$$ -7847 -13610 3841 10689 665 -5951 -4252 234 6766 6037 -7674 -11883 7053 16694 -5042
1634e042j4797K1816J8444j9259j9787J4468J8480q208j4753J626Q762M555j258
$$ -5042 -19839 1977 20421 1162 -18625 -4157 14323 6115 -8638 -7012 1750 6305 5047
1647E047r061o912J1564J4691j1678k1367J0013K5729o664k7147K636K5106J277
$$ 5047 -4014 -10926 638 15329 3651 -17716 -7703 18026 11362 -15785 -13149 11957 13234
1660A3234k0037m508J2627O357l949o378n010M498J2855j050j8776l374K2437
$$ 13234 -6803 -11311 1316 7673 3724 -2654 -7664 -3166 9689 8639 -10137 -13511 8926
1673H926P739k3337j1311K1454J3499j7370j3410J1671J1351n213p364j223K027
$$ 8926 16665 -6672 -17983 3471 16970 -400 -13810 -2139 9212 3999 -3365 -4588 -2561
1686b561O598L987j0124j0088J1948J5045j1782j8706J0164K0058p593j8842M666
$$ -2561 4037 8024 -2100 -12188 -240 14805 3023 -15683 -5519 14539 6946 -11896 -7230
1699g230J5263k033r871K6L385J065L374j109r309j9J4011J701j6686l509J7488
$$ -7230 8033 6000 -3871 -3845 -460 605 3979 2870 -6439 -6458 7553 9254 -7432 -10941 6547
1714F547M953j6324n364J3435M500r545k365N115o23r95M144k595p583N021J0445
$$ 6547 11500 -4824 -10188 3247 7747 -1798 -4163 952 329 -666 3478 883 -6700 -1679 8766
1729H766o265j2223O372J2673n893j1624N163R021m305n305L997Q02m086L823
$$ 8766 2501 -9722 -3350 9323 3430 -8194 -3031 5990 1685 -3620 377 1179 -2907 916
1743I16M534p744n199J0580O071j2042o575J1782O446j0254n407P813L145m607
$$ 916 5450 -2294 -7493 3087 9158 -2884 -9459 2323 8769 -1485 -6892 921 4066 -541
1757e41j66J452l794J313P943l295j1622M199J4281m038j5611L060J5157j470
$$ -541 -707 745 -3049 -1736 6207 2912 -8710 -4511 9770 5732 -9879 -6819 8338 6868
1771F868j2759Q4Q777R22l760j006j943J94P519J497j2026m092J5202O686j6393
$$ 6868 -5891 -5807 2970 3892 132 -874 -2817 -2623 4896 6393 -5633 -9725 5477 12163 -4230
1786d230q982J5537J0399j2781j0720Q668R298l782o269j251K025N613L103q667
$$ -4230 -13212 2325 12724 -57 -10777 -2109 7189 3407 -2862 -4113 -2088 3525 6628 -2039
1800b039q668J0267J3629j0054j7177Q384J8890n516j8344J987J5546J365j0666
$$ -2039 -10707 -440 13189 3135 -14042 -5658 13232 7716 -10628 -8641 6905 8270 -2396
1813b396l949M365N301K497n136r218L555J4757q06j8486k564J9831N846j8741
$$ -2396 -6345 -1980 3321 5818 682 -8536 -4981 9776 8970 -9516 -12080 7751 13597 -5144
1827e144q538J5620R812j0632r505M684P502J368l950o591o36J0525N753j2798
$$ -5144 -13682 1938 11750 1118 -8387 -3703 3799 5167 1217 -5374 -6010 4515 10268 -2530
1841b530j0474J3130J4201j1742j6181Q825J6310n326j4267J427J0375J849n056
$$ -2530 -13004 126 14327 2585 -13596 -4771 11539 6213 -8054 -6627 3748 5597 541
1854E41m225r22N198O880m959j1858L447J5595j265j7293j122J6844L214j4310
$$ 541 -3684 -4606 592 7472 2513 -9345 -5898 9697 8432 -8861 -9983 6861 10075 -4235
1868d235m539J0369M798n459l875L51J727M359J235q041m385J0263P227j1082
$$ -4235 -8774 1595 6393 934 -2941 -2590 -863 3496 4731 -3310 -7695 2568 9795 -1287
1882a287r418J0472J0315q651r767O175P833l589m827J193J117N06L103j486o792
$$ -1287 -10705 -233 10082 1431 -8336 -2161 5672 2083 -2744 -1551 -434 72 3175 1689 -5103
1897e103J583R684j123j1283K84J1697M87j0578r54Q276P14n184J20J714j587
$$ -5103 -3520 6164 5041 -6242 -5958 5739 6226 -4352 -5306 2970 3684 -1500 -1380 334 -1253
1912a253J664L413m327n528O097P176o758q205O490Q274n487p158L899N077k497
$$ -1253 411 3824 -503 -6031 66 7242 484 -7721 -1231 7043 1556 -5602 -1703 3374 877
1927H77j744J225j866m01N368L66q487p75J0589J650j1319k732J0652L459q801
$$ 877 -867 358 -1508 -1909 3459 3825 -4662 -5437 5152 6802 -4517 -7249 3403 6862 -1939
1942a939l614N905K937k277j447j366j058M581L895o922o780Q245R242q101j0890
$$ -1939 -5553 352 3289 1012 -435 -1801 -2859 1722 5617 -1305 -8085 160 9402 1301 -9589
1957i589O756J1430m623j0404K067Q055L98m503k374ML588M745l693r054K788
$$ -9589 -2833 8597 3974 -6430 -4363 3692 4090 -413 -2787 -2783 805 5550 1857 -7197 -4409
1972d409J2323j065j4251j126J4344L331j2643n098R371N881n134n494M46L835
$$ -4409 7914 6849 -7402 -8528 5816 9147 -3496 -8594 777 6658 1524 -3970 -3524 311
1986C11M304j167q221k204J0844N769j1864q773J1252J0947r231j1719O026J1025
$$ 311 4615 3448 -4773 -6977 3867 9636 -2228 -11001 251 11198 1967 -9752 -3726 7299
2000G299k410q810j065N306L837q68n705l993O260Q600n663j2184M040J4191j752
$$ 7299 4889 -3921 -4986 320 4157 3289 -2416 -6409 -149 8451 2788 -9396 -5356 8835 7083
2015G083j4488q24J3016L117r859m618N778N008j055m258l452K280P424M75j0372
$$ 7083 -7405 -8229 4787 7904 -1955 -6573 -795 4213 3158 -1100 -4552 -2272 5152 5627 -4745
2030d745l277J1638N936j1454p776R699Q652o977q270L645O500l29l710k389K09
$$ -4745 -8022 3616 9552 -1902 -9678 21 8673 1696 -6574 -2929 3571 3242 -468 -2857 -2648
2045b648M270L463n089p051N047R698m146j0945K780J0878j229r450k59O977J350
$$ -2648 1622 5085 -4 -7055 -2008 7690 3544 -7401 -4621 6257 5028 -4422 -4681 2296 3646
2060C646l708j732J99J312L081j31n944j467P836L122q714m497Q328N169o950
$$ 3646 -62 -1794 -1595 -283 2798 2667 -3277 -4744 3092 6214 -2500 -6997 1331 6500 -450
2075d50m917M832L912k463k117K74k28J357K882k296n211K585P059k200q262J628
$$ -450 -5367 -535 3377 914 -1203 -929 -1157 200 3082 786 -4425 -1840 5219 3019 -5243 -3615
2091c615Q207q56o960J28M822K73k140j98r67l55L669J507n600l105O754M430
$$ -3615 4592 3736 -3224 -3096 1726 1999 -141 -339 -1306 -1661 2008 3515 -2085 -5190 1564 5994
2107E994o911n494O335N743m813n126K845L699q53j409j022j185K489L887l128
$$ 5994 -917 -6411 -76 5667 854 -4272 -1427 2272 1419 10 -1012 -2197 292 4179 1051
2122A051o441K877Q409k006r368O13R327Q25q012k123N576K653k289k459j282
$$ 1051 -5390 -2513 5896 3890 -5478 -4865 4462 5287 -2725 -4848 728 3381 1092 -1367 -2649
2137b649J553M578l3p209j791Q513L999q777n871Q010P043o126p340L637O574
$$ -2649 -1096 3482 3449 -3760 -5551 2962 6961 -1816 -7687 323 7366 1240 -6100 -2463 4111
2152D111q78m545j837J599M103J729n503n053N826P891n073r836L364J0673j294
$$ 4111 3233 -1312 -3149 -1550 2553 4282 -1221 -6274 -448 7443 2370 -7466 -4102 6571 5277
2167E277j0243p78Q426K599n617l698K044L881J868l177n485J859Q232J65r885
$$ 5277 -4966 -5744 2682 5281 -336 -4034 -1990 1891 3759 582 -4903 -3044 5188 5353 -4532
2182d532k350J0167M569r168o211O998O816m090o362J049M598K029k142m367j063
$$ -4532 -6882 3285 7854 -1314 -7525 -527 6289 2199 -4163 -3114 1484 3513 1371 -2996 -4059
2197d059N929M094o424o728N945Q497m501r270K520Q859l60p337j360M804K642
$$ -4059 1870 5964 -460 -7188 -1243 7254 2753 -6517 -3997 4862 4502 -2835 -4195 609 3251
2212C251j650l128j752K835M926j831p309L36Q630J240q840k737P852L827n999
$$ 3251 1601 -1527 -3279 -444 4482 2651 -4658 -4322 4308 5548 -3292 -6029 1823 5650 -349
2227c49m211L613L742j046k586j335O70L323J654m626l751M964N517m602o471
$$ -349 -4560 -947 2795 1749 -837 -2172 -1502 1821 3475 -1151 -4902 62 5579 977 -5494
2242e494L562O681k126n909N93M302N68k061j132n29J288K869p91m939r1O196
$$ -5494 -1932 4749 2623 -3286 -2693 1609 2177 116 -1016 -1545 -257 2612 1821 -3118 -3209 2987
2258B987J135o653j977O155K527m869k727L091K262j005j278q23k80K329K155
$$ 2987 4122 -2531 -4508 1647 4174 -695 -3422 -331 1931 926 -352 -1175 -1455 874 3029
2273C029l368l730L593N233l345n896K379N877j309m989J70L428P54j345j213
$$ 3029 -339 -4069 -476 4757 1412 -4484 -2105 3772 2463 -2526 -2356 1072 1826 481 -732
2288g32j183J242L371n97n150m19O236J660o561k897O009L609m419l788K523L245
$$ -732 -1915 -673 2698 2101 -3049 -3468 2768 4428 -2133 -5030 979 4588 169 -3619 -1096 2149
2304B149l12k101j764L31L426J835m413l853M538N589l978o826K889P044j271
$$ 2149 1837 -264 -2028 -1697 1729 3564 -849 -4702 -164 5425 1447 -5379 -2490 4554 3283
2319C283o457l37M839J709k541k684j23L016K867k605n207J482O881J09p750j712
$$ 3283 -3174 -3511 1328 3037 496 -2188 -2311 705 3572 967 -4240 -2758 4123 4232 -3518 -5230
2335e230P585L173o349m176M336M478j841l950p52K682L058p46m861j483N758
$$ -5230 2355 5528 -821 -4997 -661 3817 1976 -1974 -2726 -44 3014 2268 -2593 -4076 1682
2350A682L741n773n611M803O825l384p003J411O416M20m742k089K448L174K72
$$ 1682 5423 -350 -5961 -1158 5667 2283 -4720 -3309 3107 3527 -1215 -3304 -856 2318 2590
2365B590l519k921L151N271k225o797O94P629P98p291k185O071L156m139l701
$$ 2590 -929 -3850 -699 4572 2347 -4450 -3756 3873 4671 -2620 -4805 1266 4422 283 -3418
2380c418J856L315P75k378k967P50M550J095n493k811N449M437m703n352L430
$$ -3418 -1562 1753 2528 150 -2817 -2067 2483 3578 -1915 -4726 723 5160 457 -4895 -1465
2395a465N436j766m768K4L411J426j443k338q23K702K957k419m656J641N755n86
$$ -1465 3971 2205 -2563 -2539 872 2298 855 -1483 -2306 396 3353 934 -3722 -2081 3674 3088
2411C088n992p34N517J626m216k269K521K295o19j770j271P29K894O28l894j895
$$ 3088 -2904 -3638 1879 3505 -711 -2980 -459 1836 1217 -553 -1824 -1095 1799 2427 -1467 -3362
2427c362M216L062l970l882L260M065j976l700O73K682N15j261j373n25J830K285
$$ -3362 854 3916 -54 -3936 -676 3389 1413 -2287 -1614 1068 1583 322 -1051 -1576 254 2539
2443B539j729l826J202M720m12n027n39M748J364l698j879K122J903l34j458j299
$$ 2539 810 -3016 -1814 2906 2494 -2533 -3072 1676 3040 -658 -2537 -415 1488 1154 -304 -1603
2459a603N26K738P59l701k033L960L224l574m032K789M271j635l931K44K933J010
$$ -1603 -1077 1661 2420 -1281 -3314 646 3870 296 -3736 -947 3324 1689 -2242 -1998 935 1945
2475A945j445j963k93K235K207k150l866J573N003o23n434n27N211J576m275k254
$$ 1945 500 -1463 -1756 479 2686 536 -3330 -1757 3246 2623 -2811 -3338 1873 3449 -826 -3080
2491c080K650K735p55k484j191J688K826m00m054j119M649K638m631l858L784
$$ -3080 -430 2305 1550 -934 -2125 -437 2389 1989 -2065 -3184 1465 4103 -528 -4386 -602
2506f02M571k429m623R12L866P40k685k115J011K994R84l198k874K715M510j860
$$ -602 3969 1540 -3083 -2171 1695 2435 -250 -2365 -1354 1640 2624 -574 -3448 -733 3777 1917
2522A917n448O29N793O94n296j814L992K634k255k896J69K690J728j902l392O72
$$ 1917 -3531 -2902 2891 3585 -1711 -3525 467 3101 846 -2050 -1881 809 2537 635 -2757 -2085
2538b085M460Q44m852k334M608L498l796m180K410M196q31l439p45K186K195o35
$$ -2085 2375 3219 -1633 -3967 641 4139 343 -3837 -1427 2769 1938 -1501 -2246 -60 2135 1500
2554A500l025j094L228K822k852m103J931M859p95m979m23M405J409l125k165
$$ 1500 -1525 -2619 609 3431 579 -3524 -1593 3266 2471 -2508 -2931 1474 2883 -242 -2407
2569b407J544K294K78k016k047J386L245k85m050r04M181K094l746k889K908L311
$$ -2407 -863 1431 1709 -307 -2354 -968 2277 1992 -2058 -2962 1219 3313 -433 -3322 -414 2897
2585B897j750l075L62K342R07j130j914k33K436J674k580k800K068L627j201m006
$$ 2897 1147 -1928 -1566 776 1683 553 -1361 -1594 842 2516 -64 -2864 -796 2831 1630 -2376
2601b376K40L691P03l010j324J837J647l77j561j110R94K476l00l290n16L578
$$ -2376 -2136 1555 2258 -752 -2076 -239 1408 1031 -530 -1640 -646 1830 1530 -1760 -2276 1302
2617A302J487l301k284K476K843j592k681L93K187O77j204j557j35K041J493k145
$$ 1302 2789 -512 -2796 -320 2523 931 -1750 -1357 830 1507 303 -1254 -1389 652 2145 0
2633@k634J839L413j183l735K53L555O70k790j485J834J816n20j716r47J396K221
$$ 0 -2634 -795 2618 1435 -2300 -2047 1508 2178 -612 -2097 -263 1553 1033 -683 -1630 -234 1987
2650A987n97l173m01L591J353l487k202K836K783j780k938M82K513Q59j757j757
$$ 1987 1390 -1783 -2184 1407 2760 -727 -2929 -93 2690 910 -2028 -1546 967 1826 69 -1688
2666a688N11K301R41k543k271K260L389j711l892Q07L880L26l383j319K471J995
$$ -1688 -1177 1124 2065 -478 -2749 -489 2900 1189 -2703 -1896 1984 2310 -1073 -2392 79 2074
2682B074j038k359l69K135J724j431k918M58L653O59l863j794L552K404k538k873
$$ 2074 1036 -1323 -1692 443 2167 736 -2182 -1724 1929 2588 -1275 -3069 483 2887 349 -2524
2698b524J260K991k7k464j193J535K164k77k683j093K745K416k413l360J719L786
$$ -2524 -1264 1727 1700 -764 -1957 -422 1742 1465 -1218 -2311 434 2850 437 -2923 -1204 2582
2714B582o60l690m58L002J421j910k075N83K296P88k004k078J328L006l89l548
$$ 2582 1922 -1768 -2226 776 2197 287 -1788 -1205 1091 1879 -125 -2203 -875 2131 1742 -1806
2730a806o25L536J593l062k314K144K659j047k375l04J917J499j144k207L4K512
$$ -1806 -2431 1105 2698 -364 -2678 -534 2125 1078 -1297 -1601 316 1815 671 -1536 -1502 1010
2746A010J217k424k254J987K928j286l208L67K949N92k343j242J242J745r1j850
$$ 1010 2227 -197 -2451 -464 2464 1178 -2030 -1663 1286 1878 -465 -1707 -465 1280 1189 -661
2762f61j107J507K139q79k798M2L024Q48k803j636K285K137j359k105J74J745
$$ -661 -1768 -261 1878 999 -1799 -1757 1267 2115 -688 -2324 -39 2098 739 -1366 -1192 553
2778E53Q74j125j632K59K113P60k297j598J928K291j328k704M84K763J94k249
$$ 553 1427 302 -1330 -1071 1042 1802 -495 -2093 -165 2126 798 -1906 -1422 1341 1535 -714
2794g14r19J396J432k76j636p49J437J732r70k380K34K739O12k640j325K184J780
$$ -714 -1633 -237 1195 919 -717 -1466 -29 1703 733 -1647 -1413 1326 1938 -702 -2027 157 1937
2811A937j388k004M80J801M83j268j412N08J923M47k170j336J962K200j505k626
$$ 1937 549 -1455 -975 826 1309 41 -1371 -863 1060 1507 -663 -1999 -37 2163 658 -1968
2827a968P21K658J49k340q19J592J500p34j746m20J651J542j257k295N79K768
$$ -1968 -1247 1411 1560 -780 -1599 -7 1493 759 -987 -1407 244 1786 529 -1766 -1187 1581
2843A581J33k758j033K482J632j696k075P99K001K68j721j153J073J778j11k246
$$ 1581 1714 -1044 -2077 405 2037 341 -1734 -935 1066 1334 -387 -1540 -467 1311 1200 -1046
2859a046q47K302J675j895k341J279K632l08k585n52K138J228j258j746K56J906
$$ -1046 -1893 409 2084 189 -2152 -873 1759 1451 -1134 -1686 452 1680 422 -1324 -1068 838
2875H38P68j665j785J130K426l71k762m48K621J274k159j782J294K118l66j961
$$ 838 1606 -59 -1844 -714 1712 1341 -1421 -1869 752 2026 -133 -1915 -621 1497 1131 -830
2891h30p18J522J628q73k065p3K285J042k142j796J671K266q91k428j0K284O84
$$ -830 -1548 -26 1602 729 -1336 -1409 876 1918 -224 -2020 -349 1917 1026 -1402 -1412 872 1556
2908A556j609j382Q07J683J69j778j062J423J822q58k357J49K545N96k264j269
$$ 1556 -53 -1435 -628 1055 1224 -554 -1616 -193 1629 771 -1586 -1437 1108 1704 -560 -1829
2924a829J715J677q36j808m1J627Q30j020j568L41J936M35k006j235J750J823
$$ -1829 -114 1563 727 -1081 -1122 505 1335 315 -1253 -912 1024 1459 -547 -1782 -32 1791
2940A791j182k126M87K032L03j661r70J038J376j93j617o35J447J432j118j813
$$ 1791 609 -1517 -1030 1002 1305 -356 -1326 -288 1088 895 -722 -1357 90 1522 404 -1409
2956a409M26K126K13k075q46J687J395j092j571L17J459N36j214j168O55J598
$$ -1409 -983 1143 1356 -719 -1565 122 1517 425 -1146 -829 630 1166 -48 -1216 -561 1037
2972A037J03j766q62J640J488j338j804O74J900O2j665p68J212J256m72j546l26
$$ 1037 1140 -626 -1488 152 1640 302 -1502 -828 1072 1134 -531 -1299 -87 1169 697 -849 -1175
2989a175J530J097j173j720O22K089Nk011p48J815J220j333j486M95J667J65j281
$$ -1175 355 1452 279 -1441 -819 1270 1275 -736 -1484 331 1551 218 -1268 -773 894 1059 -222
3006b22j003Q31J560k53j828m22J720J139j413j620Q78J858k36j817m26J504J043
$$ -222 -1225 -394 1166 913 -915 -1337 383 1522 109 -1511 -633 1225 989 -828 -1254 250 1293
3023A293q53j469J41J548O63j403j317R66J796m54j890l49J869Q67j480j383R19
$$ 1293 440 -1029 -888 660 1323 -80 -1397 -431 1365 911 -979 -1328 541 1408 -72 -1455 -536
3040e36J563r6j497o93J161J309n37j805m1J837P79j664j247J149J664m92j813
$$ -536 1027 931 -566 -1259 -98 1211 674 -1131 -1172 665 1444 -220 -1467 -318 1346 854 -959
3057i59j11J682O26j212j122N34J355K22j391r59J229J446p47j798J72J814M88
$$ -959 -1070 612 1238 26 -1096 -562 793 1015 -376 -1335 -106 1340 593 -1205 -1033 781 1269
3074A269j608j079J206J386n15j491j62J337Q04r13j349L36J598M61j701q80J344
$$ 1269 -339 -1418 -212 1174 659 -832 -994 343 1147 234 -1115 -779 819 1280 -421 -1301 43
3091D3J327q77j547J93J551N06j399r83Q50J269j62j378n14J278J111r68j573
$$ 43 1370 493 -1054 -861 690 1196 -203 -1186 -336 933 771 -607 -1121 157 1268 300 -1273
3108a273M92J709J31j596p10J283J127p42j325P2J343N17j088r47N59J397Kj653
$$ -1273 -781 928 1059 -537 -1247 36 1163 421 -904 -832 511 1028 -60 -1007 -448 949 951 -702
3126g02m68J409J017j070j343N04J485R2j378p18J085J097n35j302j18J273P48
$$ -702 -1170 239 1256 186 -1157 -653 832 924 -454 -1172 -87 1010 475 -827 -945 328 1076
3143A076r81j264O34J535oj708l75J383P85p89j266L34J401K25j279p86Q31J218
$$ 1076 95 -1169 -535 1000 994 -714 -1089 294 1079 290 -976 -642 759 984 -295 -1081 -250 968
3161I68l11j391k85J421P66j180j183P74J342k14j305m03J152Q48p56j114J54
$$ 968 657 -734 -1019 402 1168 -12 -1195 -421 921 707 -598 -1001 151 999 243 -871 -717
3178g17J314M39j183r22Q00J293l57j528j20J489N99j101r67N07J237L9j292n89
$$ -717 597 1036 -147 -1069 -269 1024 667 -861 -981 508 1107 6 -961 -454 783 822 -470 -1059
3196a059J049J033o26j264L8J355N37j278r52R10J349n66j255j59J219O20q50
$$ -1059 -10 1023 397 -867 -829 526 1063 -215 -1167 -257 1092 526 -729 -888 331 951 101
3213A01j007L76J292J09j251o59J002J111o48j308R0J381L96j239p65Q48J032
$$ 101 -906 -530 762 871 -380 -1039 -37 1074 426 -882 -792 589 985 -254 -1019 -171 861
3230H61k93j163k95J088P60p55j122L80J240J33j157p13J011J050n86j223P8J203
$$ 861 568 -595 -890 198 958 203 -919 -539 701 834 -323 -1036 -25 1025 439 -784 -706 497
3248D97M75j035q41N43J116n1j212m74J097Q57p84j118K32J389J50j237o67R76
$$ 497 972 -63 -904 -361 755 704 -508 -982 115 972 188 -930 -698 691 841 -396 -1063 -87
3266h7R95n57j070RJ100N10q64r43M98J192l3j238m56J037R14p73j105L18J198
$$ -87 908 351 -719 -710 390 900 36 -907 -409 783 750 -488 -944 93 1007 234 -871 -553 645
3285F45J62j160n20P71R09l56j100j89J114O11q98r78N49J201r0j223m08J070
$$ 645 807 -353 -873 -102 807 451 -649 -838 276 887 -11 -989 -440 761 671 -552 -960 110
3303A10Q53o91j104K39J171K03r11p46P11J006k61j255j11J084O56r32r58N08
$$ 110 963 272 -832 -593 578 781 -130 -876 -165 841 580 -675 -786 298 954 22 -936 -428
3321d28J109j5j136m59R79P66n76j025J94J052L26r53p16P00J013l18j167jR34
$$ -428 681 666 -470 -929 50 816 240 -785 -591 461 787 -166 -882 -182 831 513 -654 -655 279
3340B79O39q63r37M80J062Rj078l84Q51P19m78j009P2J096M33j008p89O85R56
$$ 279 918 55 -882 -402 660 669 -409 -793 58 777 299 -710 -638 458 891 -117 -906 -221 735
3359G35k40j090j02R78N53p41q72L44J009J24r89m83P83Q58m92j099J20J058L37
$$ 735 495 -595 -697 281 834 93 -779 -435 574 698 -291 -774 9 867 375 -724 -604 454 791
3378G91r36o79O14Q78k54q87k51Q84N79o75q22L32R64P6r02n03P77Q02m68r23
$$ 791 -145 -824 -210 668 414 -473 -724 160 739 64 -758 -426 538 614 -288 -791 -14 788 320 -603
3398f03K9R97K57p32p02N70Q69r0j022k60Q01O93n61r54K20R97J53r20m99O90
$$ -603 -574 423 680 -52 -754 -184 685 595 -427 -687 114 807 246 -708 -488 509 662 -258 -757 -67
3418f7P31l42r07l3R00L93p31o53M53Q58lr75l24Q39O12n62q23K03R25J54q04
$$ -67 664 322 -585 -618 282 675 -56 -709 -256 602 599 -376 -700 139 751 189 -634 -431 494 648 -156
3439a56n90O51P47k83q55j10Q53M14o67p35L93Q56P3r99k91P51O52m95q43J12
$$ -156 -746 -95 652 369 -486 -596 257 671 4 -731 -338 518 591 -408 -699 52 704 209 -634 -522
3459e22R71K11p69n91N56Q14k14r00j79Q23N61p20p91M26Q64J0r10l67P64O70
$$ -522 449 660 -109 -700 -144 670 456 -444 -623 200 761 41 -750 -324 540 550 -360 -727 37 707
3479G07m67q66J07Q91K54p57o15N72Q61k47q97j77Q85N02o84p08L28Q84n8p91
$$ 707 240 -626 -519 372 626 -131 -746 -174 687 440 -457 -634 251 753 69 -639 -311 573 515 -276
3499b76l71P32O00m20q36N0Q61L22q16n36M66Q91k53q83j45Q17M52o24o95L20
$$ -276 -647 85 685 265 -571 -521 340 662 -154 -690 -224 667 414 -469 -614 203 655 31 -664 -344
3519c44Q15J17q64l41O10O29l07q03mR20K24p56n51N18P02j60q06j22P07L99m58
$$ -344 471 588 -276 -617 -7 622 315 -488 -492 428 652 -104 -655 -137 565 405 -401 -523 184 583 125
3540A25p50K94P54O5p33m08N61O80k95q01j8P65L35o22n22M04O44p2o49l08O92
$$ 125 -625 -331 423 488 -245 -653 -92 588 293 -508 -526 239 574 -48 -570 -166 478 406 -243 -551 141
3561A41M62m81o92K45O90J96p42m97N83P17l28q21P2O67L25n56n91L53O85Qo98
$$ 141 603 122 -570 -325 365 561 -181 -678 -95 622 294 -527 -455 212 537 -19 -610 -257 428 436 -262
3582b62l09O43N20m33o73J73O97J66o57m56N93N24k80o32o2O16M33o07n54L27
$$ -262 -571 72 592 159 -514 -341 356 522 -135 -591 2 526 246 -386 -448 168 601 -6 -560 -233
3602b33O56n2o18l66O04N93m24o82J00P38K05o07m44L77O27j07p81m3O47M56o02
$$ -233 423 371 -247 -613 -9 584 160 -522 -422 316 521 -86 -530 -153 474 367 -414 -457 190 646 44
3623D4n92K74O51R9p03l58O08N47m36o53J41O48K32o28m67L76O78q1p61j04O19
$$ 44 -548 -274 377 476 -227 -585 23 570 134 -519 -378 270 502 -126 -593 -217 461 380 -381 -485 134
3644A34M07m69n68J84O90R2p16k72N87M47k67o74rP05K95o22n36M45O54j64o79
$$ 134 541 72 -496 -312 378 470 -246 -518 69 516 249 -425 -434 271 566 -56 -592 -147 507 343 -336
3665c36j97O78M44n43n97K67O08Q1n93l33M69N44j98p04l3P65J74n67m21L61O20
$$ -336 -533 145 589 46 -551 -284 324 405 -188 -521 -52 492 294 -410 -443 322 496 -71 -492 -131 489
3686D89j19o66j66O12M10n13n03K17N57J36o24l94N23N23k77o77Q4O49K18n24
$$ 489 370 -296 -462 150 560 47 -456 -239 318 454 -170 -564 -41 482 205 -472 -388 261 479 -45
3706d5m65L40O70j95n81j59M96M09l50n66J08O69J49o34l77M89M98k40o07n1O84
$$ -45 -510 -170 500 305 -276 -435 61 470 120 -446 -338 331 480 -154 -531 -42 456 216 -391 -442 242
3727B42J96m64m79K66N92J8n59k97N29M58l25n87Q4P14K0n49l48M88M66k12n87
$$ 242 438 -26 -505 -239 353 371 -188 -485 44 502 177 -410 -326 388 408 -141 -489 -1 465 253 -334
3748c34n7N49L17m71l90J41O16On77k59M61M50l81m99P4N62J83m92l33L40M84
$$ -334 -391 158 475 4 -386 -245 371 377 -200 -459 2 452 71 -428 -354 208 391 -101 -434 -94 390
3769C90j45n16j21N07L00l69n04K67N88Po26k37M63M76l44n20P5N34J68m44l84
$$ 390 245 -271 -392 115 415 46 -458 -191 397 404 -222 -459 4 480 136 -384 -309 225 393 -51 -435
3790d35L05M17M1n75j75M68L88m16m73J53O06L1n12k37L55M46j90m97m7N06L47
$$ -435 -130 287 328 -247 -422 46 434 18 -455 -302 304 335 -177 -414 -59 387 197 -300 -347 159 506
3811E06n43m26L35N10r2n74j12M90L50l90m40J21N27Q2m49l68M32M91k38n37o4
$$ 506 -37 -463 -128 382 290 -284 -396 94 444 54 -386 -265 262 344 -105 -473 -41 450 212 -325 -389
3832c89N55K91m86m45L04N94j90n18j13N06K88k77m79M5N46J46n01l16L23N20
$$ -389 166 457 -29 -474 -170 424 234 -284 -397 109 397 120 -359 -314 232 378 -123 -439 -116 404
3852D04k12n52RN79K10n44l63L31N21j01n52q7M12L82k91n31J12O04J16n97k83
$$ 404 192 -360 -351 228 438 -106 -469 -138 383 282 -270 -357 55 437 146 -385 -273 331 447 -150 -433
3873d33L96M74k11n35J5M50K78m39m21K75M75K5n26j96L57M36l45n16J38N80N4
$$ -433 -37 437 226 -309 -294 156 434 -5 -426 -151 324 349 -177 -373 -16 420 75 -441 -303 277 331
3894C31m70k62L13M89j67m80j1L90K62l45m16J51N17N2n31j38L75L09k66m88J22
$$ 331 -139 -401 -88 401 234 -246 -257 133 395 50 -366 -215 302 354 -177 -315 60 369 103 -385 -263
3915b63M66J11m13k22K56L96j41m19j65M57L23l12m02J30N20J2n14j81M43K88
$$ -263 203 314 -99 -321 -65 331 190 -229 -394 63 386 74 -328 -198 322 334 -180 -361 82 370
3935C70k55m11O5M01J54l26l74J77N18n2n15j22M36K70k88l90J70M17P0m33k40
$$ 370 115 -296 -231 170 324 -2 -376 -199 319 267 -248 -370 66 336 48 -342 -172 245 315 -118 -358
3956c58L20L61j49m17m9M61K36l95l94K58M77n7n19q7L72K95k82l75Q9M07O0l36
$$ -358 -38 323 174 -243 -292 169 405 10 -384 -126 351 294 -225 -312 60 355 73 -302 -213 194 254 -82
3978h2k55K37M45j85m43m9N04J97m08l28K32M16k3m17j45L61L20k69m22J10L69
$$ -82 -337 -100 345 160 -283 -332 172 369 -39 -367 -135 281 258 -159 -304 57 377 108 -314 -204 165
3999A65K16m07l89L31M18j22m82k5M32K53m26k74J62L92L4m24k18L68L25k30m15
$$ 165 381 -26 -415 -84 334 212 -270 -295 137 390 -36 -310 -148 244 278 -146 -364 4 329 99 -316
4020c16M7M66J43m48k99L95L46j64m37l0M63J58k86m07K57L66jl83k37L40L89
$$ -316 -269 197 340 -108 -407 -12 334 170 -267 -297 166 324 38 -369 -112 254 253 -130 -367 -27 362
4041C62k28m54P7M70Q5l83l14L03L69j07l97j02L96K74l00l36R6M26Q6m66j83
$$ 362 134 -320 -243 227 312 -71 -385 -82 287 180 -217 -319 77 351 51 -285 -189 237 323 -143 -326
4062c26L61L13k86l43J07L69J02l23k77J48M27o4l90j20M35K03k84l76Q5M88j0
$$ -326 35 348 62 -281 -174 195 297 -26 -303 -155 272 208 -182 -302 133 336 52 -324 -239 249 239
4083B39l87j65L51K39j13l73J2K94K03l24k62J59M00j01m14n2L53K66k41l97J41
$$ 239 -148 -313 38 277 164 -209 -197 97 300 -24 -286 -127 273 172 -242 -294 59 325 84 -313 -172
4104a72L93J2l84j34K45L16j24l58q8L36K56l35k09J63L19k8l70j99M81J51j81
$$ -172 221 233 -151 -285 -40 276 152 -206 -294 42 298 -37 -246 -83 236 208 -162 -361 120 271 90
4125I0l46O9L55N5l12k03J67M25j22l75j12L97K18l16l17J04N57p0m31j08L27
$$ 90 -256 -187 168 223 -89 -292 -125 300 178 -197 -309 88 306 -10 -327 -223 334 264 -167 -275 52
4146E2K07j86l12L7L55J56l20k85K19M05j48l66n7L75J22k20l55K06K88K8l03
$$ 52 259 73 -239 -202 153 309 -11 -296 -77 328 180 -186 -243 132 254 34 -321 -115 173 201 -102
4167a02j78K70K79j81l62LM81O9l52k53L30K10M3m20p6L72J61l07k82J46K92J49
$$ -102 -280 -10 269 88 -274 -271 210 279 -73 -326 4 214 257 -163 -239 133 294 -13 -295 -149 143 292
4189B92l52k49K88L12j93l68L6L81N4k05l20K06L53p6l48p0L20K56k11l57O8L88
$$ 292 -60 -309 -21 291 98 -270 -234 147 201 -4 -324 -118 235 159 -189 -259 61 317 106 -251 -183 205
4211B05J19l94k06K47L05j54k94l1L21J59k49k60J01L80k2l58j65L69K09k13l63
$$ 205 324 -70 -276 -29 276 122 -172 -203 118 277 28 -232 -131 249 227 -131 -296 73 282 69 -294
4232b94J56L35J0l49j13J91K89j33l28j1M36P5k80k48J44L24l2l41j11L16K76
$$ -294 -138 197 207 -142 -255 -64 225 92 -236 -247 189 264 -16 -264 -120 204 172 -169 -280 36 312
4253C12k03l89J01L37L0k82j17J16L42j71l16L1K91K31l42k59J96L26o3l39j4
$$ 312 109 -280 -179 158 188 -94 -211 -95 247 76 -240 -209 82 313 -29 -288 -92 234 171 -168 -182
4274a82K60J53j28l16M2L25J17l42j74J66L22r1l35n6K98J49k30k77J87K88n2
$$ -182 78 231 103 -213 -171 154 271 -71 -245 -79 243 152 -183 -239 59 208 -22 -299 -112 176 124
4295A24k31j40J75K83q7l35mL71J03l07k51K45L27j31l61j8L15J68k06k52Q2K95
$$ 124 -107 -247 -72 211 124 -211 -215 156 259 -48 -299 -54 273 142 -219 -237 78 246 40 -212 -130 165
4317A65N4k61k33K68K85j97l06N7K96Q5k68k35K25K63ol59m9K28K27j78k54l2
$$ 165 219 -42 -275 -7 278 81 -225 -168 128 213 -55 -290 -65 198 192 -167 -216 12 239 61 -193 -225
4339b25L79R6k93j84K47K52j37l16n3L45R6k27k50J14L44m0l01j15K43K83j87
$$ -225 154 250 -43 -227 20 272 135 -181 -234 111 207 -20 -270 -156 188 148 -153 -268 -25 258 71
4360G1l32J02L40P3l01j93K48K14r9l15M1K19J36j78k29J26K60Nk54j96L19J72
$$ 71 -261 -159 181 254 -47 -240 8 222 123 -192 -151 68 204 26 -203 -77 183 188 -66 -262 57 229
4382B29j61l06N0L75l1k83j15K33K06m3l15j2K05K26k58k15J00L61j9l70j06K77
$$ 229 68 -238 -188 187 156 -127 -242 -9 197 154 -161 -173 32 258 0 -215 -115 246 227 -143 -249 28
4404B8K44k16k68O2L59Qk68k04K17K16m6l11k7K77J77k72k72J98L02m1k87p2K35
$$ 28 272 56 -212 -150 209 217 -51 -255 -38 178 132 -179 -206 71 248 -24 -296 -98 204 163 -124 -196 39
4427C9J89j51k15K3K35Q6k28k05J73L04j36k95K1K66J33k69k10J10K64L5k92n3
$$ 39 228 77 -138 -115 120 206 -22 -227 -54 250 114 -181 -160 106 239 -30 -240 -130 134 169 -123 -176
4449a76K11J27r2k39L7K09Q9j91j64J10L30j40k68n8K74J63k01j99L3K99rk04
$$ -176 35 162 70 -169 -132 77 166 -25 -189 -79 251 111 -157 -215 59 222 21 -178 -145 154 145 -59
4471e9j85J74K80o6l45L0K18J58k68j58J83K05m3k67p4K24K06j39k46J5K65J3
$$ -59 -244 -70 210 144 -201 -171 47 205 -63 -221 -38 167 124 -143 -217 7 213 74 -172 -157 108 121
$$ [...]
8191b5
##END NTUPLES=NMR FID
##END=
