##TITLE=1H_LY-DMAA.Per.1.19
 CDCl3
 8 sc, 
 14.03.2022
##JCAMPDX= 6.0         $$ Bruker NMR JCAMP-DX V2.0
##DATA TYPE= NMR FID
##DATA CLASS= NTUPLES
##ORIGIN= UXNMR, Bruker Analytische Messtechnik GmbH
##OWNER= root
$$ XWIN-NMR		Version 3.5
$$ Mon Mar 14 12:18:20 2022 Russian Standard Time (UT+4h)  she@DPX200
##.OBSERVE FREQUENCY= 200.131346
##.OBSERVE NUCLEUS= ^1H
##.DELAY= (6, 6)
##.ACQUISITION MODE= SIMULTANEOUS
##.ACQUISITION SCHEME= undefined
##.AVERAGES= 8
##.DIGITISER RES= 18
##SPECTROMETER/DATA SYSTEM= spect
##.PULSE SEQUENCE= zg30
##.SOLVENT NAME= CDCl3
##.SHIFT REFERENCE= (INTERNAL, CDCl3, 0, 15.7039)
##AUDIT TRAIL= $$ (NUMBER, WHEN, WHO, WHERE, WHAT)
$$ ##TITLE= Audit trail, XWIN-NMR		Version 3.5
$$ ##JCAMPDX= 5.01
$$ ##ORIGIN= Bruker BioSpin GmbH
$$ ##OWNER= she
$$ F:/spectra/data/she/nmr/H-F/1/audita.txt
$$ ##AUDIT TRAIL=  $$ (NUMBER, WHEN, WHO, WHERE, WHAT)
(   1,<2022-03-14 12:17:12.87 +0400>,<she>,<DPX200>,
      <created by zg, POWCHK disabled, PULCHK disabled
       configuration hash MD5:
       00 E9 B6 7A A2 85 ED C7 34 08 36 98 17 FE 4E 26
       data hash MD5: 16K
       95 AB FF 9F BB 92 81 1F F7 EA E7 89 CE AC 91 14>)
$$ ##END=
$$ 
$$ hash MD5
$$ 8F D4 36 6F 5F 8C 33 B2 79 E2 24 B5 35 36 EA 2E
##$RELAX= 
##$RELAX= 
##$RELAX= 
##$RELAX= 
##$RELAX= 
##$RELAX= 
$$ Bruker specific parameters
$$ --------------------------
##$DU= <F:/spectra>
##$EXPNO= 1
##$NAME= <H-F>
##$PROCNO= 1
##$TYPE= <nmr>
##$USER= <she>
##$AMP= (0..31)
100 100 100 100 100 100 100 100 100 100 100 100 100 100 100 100 100 100 
100 100 100 100 100 100 100 100 100 100 100 100 100 100 
##$AQSEQ= 0
##$AQ_mod= 1
##$AUNM= <au_zg>
##$AUTOPOS= <>
##$BF1= 200.13
##$BF2= 200.13
##$BF3= 200.13
##$BF4= 200.13
##$BF5= 200.13
##$BF6= 200.13
##$BF7= 200.13
##$BF8= 200.13
##$BYTORDA= 1
##$CFDGTYP= 0
##$CFRGTYP= 5
##$CHEMSTR= <none>
##$CNST= (0..31)
1 1 145 1 1 1 1 1 1 1 1 1 1 1 1 1 1 1 1 1 1 1 1 1 1 1 1 1 1 1 1 1 
##$CPDPRG= <>
##$CPDPRG1= <>
##$CPDPRG2= <>
##$CPDPRG3= <>
##$CPDPRG4= <mlev>
##$CPDPRG5= <mlev>
##$CPDPRG6= <mlev>
##$CPDPRG7= <mlev>
##$CPDPRG8= <mlev>
##$CPDPRGB= <>
##$CPDPRGT= <>
##$D= (0..31)
0 1.2 0 0 0 0 0 0 0 0.06 0 0.03 0 0 0 0 0.0002 0 0 0 0 0 0 0 0 0 0 0 0 
0 0 0 
##$DATE= 1647245832
##$DBL= (0..7)
120 120 120 120 120 120 120 120 
##$DBP= (0..7)
150 150 150 150 150 150 150 150 
##$DBP07= 0
##$DBPNAM0= <>
##$DBPNAM1= <>
##$DBPNAM2= <>
##$DBPNAM3= <>
##$DBPNAM4= <>
##$DBPNAM5= <>
##$DBPNAM6= <>
##$DBPNAM7= <>
##$DBPOAL= (0..7)
0.5 0.5 0.5 0.5 0.5 0.5 0.5 0.5 
##$DBPOFFS= (0..7)
0 0 0 0 0 0 0 0 
##$DE= 6
##$DECBNUC= <off>
##$DECIM= 32
##$DECNUC= <off>
##$DECSTAT= 4
##$DIGMOD= 1
##$DIGTYP= 9
##$DL= (0..7)
0 120 120 120 120 120 120 120 
##$DP= (0..7)
150 150 150 150 150 150 150 150 
##$DP07= 0
##$DPNAME0= <>
##$DPNAME1= <>
##$DPNAME2= <>
##$DPNAME3= <>
##$DPNAME4= <>
##$DPNAME5= <>
##$DPNAME6= <>
##$DPNAME7= <>
##$DPOAL= (0..7)
0.5 0.5 0.5 0.5 0.5 0.5 0.5 0.5 
##$DPOFFS= (0..7)
0 0 0 0 0 0 0 0 
##$DQDMODE= 0
##$DR= 18
##$DS= 0
$$ [...]
##$SUBNAM2= <"">
##$SUBNAM3= <"">
##$SUBNAM4= <"">
##$SUBNAM5= <"">
##$SUBNAM6= <"">
##$SUBNAM7= <"">
##$SUBNAM8= <"">
##$SUBNAM9= <"">
##$SW= 18.0517287032376
##$SWIBOX= (0..15)
0 0 2 0 0 0 0 0 0 0 0 0 0 0 0 0 
##$SW_h= 3612.71676300578
##$TD= 16384
##$TD0= 1
##$TE= 0
##$TE2= 300
##$TE3= 300
##$TEG= 300
##$TL= (0..7)
0 120 120 120 120 120 120 120 
##$TP= (0..7)
150 150 150 150 150 150 150 150 
##$TP07= 0
##$TPNAME0= <>
##$TPNAME1= <>
##$TPNAME2= <>
##$TPNAME3= <>
##$TPNAME4= <>
##$TPNAME5= <>
##$TPNAME6= <>
##$TPNAME7= <>
##$TPOAL= (0..7)
0.5 0.5 0.5 0.5 0.5 0.5 0.5 0.5 
##$TPOFFS= (0..7)
0 0 0 0 0 0 0 0 
##$TUNHIN= 0
##$TUNHOUT= 0
##$TUNXOUT= 0
##$USERA1= <user>
##$USERA2= <user>
##$USERA3= <user>
##$USERA4= <user>
##$USERA5= <user>
##$V9= 5
##$VALIST= <valist>
##$VCLIST= <CCCCCCCCCCCCCCC>
##$VD= 0
##$VDLIST= <DDDDDDDDDDDDDDD>
##$VPLIST= <PPPPPPPPPPPPPPP>
##$VTLIST= <TTTTTTTTTTTTTTT>
##$WBST= 1024
##$WBSW= 4
##$XGAIN= (0..3)
0 0 0 0 
##$XL= 0
##$YL= 0
##$YMAX_a= 682835
##$YMIN_a= -603430
##$ZGOPTNS= <>
##$ZL1= 120
##$ZL2= 120
##$ZL3= 120
##$ZL4= 120
##$ABSF1= 10
##$ABSF2= 0
##$ABSG= 5
##$ABSL= 3
##$ALPHA= 0
##$AQORDER= 0
##$ASSFAC= 0
##$ASSFACI= 0
##$ASSFACX= 0
##$ASSWID= 0
##$AUNMP= <proc_1d>
##$AZFE= 0.1
##$AZFW= 0.1
##$BCFW= 1
##$BC_mod= 2
##$BYTORDP= 1
##$COROFFS= 0
##$CY= 11.3945322036743
##$DATMOD= 1
##$DC= 2
##$DFILT= <>
##$DTYPP= 0
##$F1P= 2.36226072786647
##$F2P= -0.459571619588291
##$FCOR= 0.5
##$FTSIZE= 0
##$FT_mod= 4
##$GAMMA= 1
##$GB= 0.15
##$INTBC= 1
##$INTSCL= 1
##$ISEN= 128
##$LB= 0.24
##$LEV0= 0
##$LPBIN= 0
##$MAXI= 10000
##$MC2= 0
##$MEAN= 0
##$ME_mod= 0
##$MI= 1.114404
##$NCOEF= 0
##$NC_proc= 0
##$NLEV= 6
##$NOISF1= 3.799351
##$NOISF2= 2.8
##$NSP= 1
##$NTH_PI= 0
##$NZP= 0
##$OFFSET= 15.70392
##$PC= 1
##$PHC0= -17108.67
##$PHC1= 11.60078
##$PH_mod= 1
##$PKNL= yes
##$PPARMOD= 0
##$PSCAL= 0
##$PSIGN= 0
##$REVERSE= no
##$SF= 200.130013532006
##$SI= 16384
##$SIGF1= 3
##$SIGF2= 2
##$SINO= 400
##$SIOLD= 16384
##$SREGLST= <1H.CDCl3>
##$SSB= 0
##$STSI= 0
##$STSR= 0
##$SW_p= 3612.71676300578
##$SYMM= 0
##$S_DEV= 0
##$TDeff= 0
##$TDoff= 0
##$TI= <>
##$TILT= no
##$TM1= 0
##$TM2= 0
##$TOPLEV= 0
##$USERP1= <user>
##$USERP2= <user>
##$USERP3= <user>
##$USERP4= <user>
##$USERP5= <user>
##$WDW= 1
##$XDIM= 8192
##$YMAX_p= 0
##$YMIN_p= 0
$$ End of Bruker specific parameters
$$ ---------------------------------
##NTUPLES= NMR FID
##VAR_NAME=  TIME,          FID/REAL,        FID/IMAG
##SYMBOL=    X,             R,               I
##VAR_TYPE=  INDEPENDENT,   DEPENDENT,       DEPENDENT
##VAR_FORM=  AFFN,          ASDF,            ASDF
##VAR_DIM=   8192,          8192,            8192
##UNITS=     SECONDS,       ARBITRARY UNITS, ARBITRARY UNITS
##FACTOR=    0.0002768,     1,               1
##FIRST=     0,             0,               0
##LAST=      2.2672688,     0,               0
##MIN=       0,             -603430,         0
##MAX=       2.2672688,     682835,          0
$$ Real data points
##PAGE= N=1
##DATA TABLE= (X++(R..R)), XYDATA
$$ [...]
$$ plain form
2048 6051 2634 -6338 -3239 5879 3501 -4813 -3280 3274 2624 -1370 -1643 -682 393 2558 873 -4127
2064 -4127 -2120 5055 2993 -5402 -3549 5010 3781 -4013 -3536 2569 2918 -737 -1762 -1255 444 3036
2080 3036 1091 -4573 -2424 5498 3608 -5749 -4437 5228 4693 -4162 -4615 2363 3997 -423 -2917
2095 -2917 -1767 1452 3759 184 -5430 -1767 6614 3293 -7050 -4413 6740 5170 -5580 -5360
2109 -5360 3779 5220 -1544 -4564 -933 3352 3346 -1928 -5460 237 7063 1418 -8040 -3041 8087
2124 8087 4270 -7365 -5098 5789 5483 -3527 -5355 1028 4825 1787 -3746 -4194 2356 6430 -632
2139 -632 -7874 -967 8604 2557 -8501 -3739 7350 4538 -5599 -4915 3134 4845 -469 -4527 -2234
2154 -2234 3562 4605 -2509 -6576 1141 7828 231 -8389 -1449 8011 2520 -6815 -3284 4970 3845
$$ packed form
2048F051l417q972L099R118k378q314J533O554o50l994k73R61J075K165j685n000
2064d127K007P175k062q395J853Q559j229p794M77O105L49l655j025N07J699K592
2080C036j945n664K149P922j890r357J312R665n35q855m53O978J634m420k494
2095b917J150L219K307l575n614L663Q381l321j0343K637J1153j570j0750K20
2109e360R139J441o764l020L631M285on274l532N697O826n645r458M999J1128
2124H087l817j1635K267J0887l06r010j828O383L797l038n533m48O550M074p062
2139f32p242O907R571o047j1058M762J1089k812j0137O84Q049J711n314m058K293
2154b234N796J043p114m067P717O687p597q620O940R460n491r335L531Q254j125
$$ plain form
2169 3845 -2555 -3956 191 3753 2413 -3120 -4489 2289 6092 -1255 -7096 116 7262 866 -6733
2184 -6733 -1798 5377 2430 -3550 -2804 1335 2865 907 -2633 -2930 2086 4548 -1393 -5652 629
2199 629 6095 237 -5797 -826 4866 1421 -3370 -1780 1488 1875 480 -1797 -2253 1506 3720 -1015
2215 -1015 -4835 467 5252 137 -5108 -761 4279 1207 -3068 -1488 1413 1685 501 -1546 -2197
2230 -2197 1292 3811 -730 -4673 177 5248 534 -5088 -1230 4332 1630 -3168 -2124 1376 2116
2245 2116 532 -2134 -2427 1625 4039 -1138 -5244 313 5823 492 -5776 -1306 5175 2070 -3856
2260 -3856 -2676 2228 3078 -154 -3025 -1921 2815 3814 -2244 -5328 1517 6340 -641 -6607 -431
2275 -431 6217 1469 -5310 -2421 3651 3128 -1774 -3659 -504 3730 2586 -3454 -4467 2841 5933
$$ packed form
2169C845o400j401M147L562j340n533j369O778L803p347n841P212P146o396p599
2184f733M935P175k947n980P46M139J530j958l540k97N016K462n941m259O281
2199F29N466n858o034M971N692l445m791J590L268L87j395k277m56L759K214m735
2215a015l820N302M785n115n245M347N040l072m275J580K901K72j184k047o51
2230b197L489K519m541l943M850N071m714n622L858N562k702m798J044L500P40
2245B116j584k666k93M052K414n177m106N557N510n331o268M470O481l105n926
2260c856J180M904Q50l232k871J104M736R99o058l084O845M823o981n966O176
2275d31O648m748o779K889O072n23m902j885L155M234j144o040j013P308L092
$$ plain form
2290 5933 -1985 -6685 926 6857 404 -6188 -1476 4964 2581 -3198 -3355 1160 3929 990 -4058
2305 -4058 -3048 3740 4690 -3214 -5931 2250 6427 -1188 -6432 -77 5596 1237 -4309 -2302 2634
2320 2634 3273 -655 -3754 -1306 4015 3139 -3794 -4473 3286 5415 -2421 -5725 1338 5387 -129 -4565
2336 -4565 -1073 3204 2075 -1691 -2989 -141 3354 1808 -3532 -3272 3268 4241 -2687 -4778 1855
2351 1855 4791 -843 -4191 -237 3231 1217 -1804 -2045 316 2637 1180 -2917 -2489 2833 3519 -2468
2367 -2468 -4119 1793 4115 -1039 -3777 62 2869 774 -1696 -1607 282 2182 1071 -2531 -2286 2546
2383 2546 3291 -2199 -3764 1765 4007 -945 -3616 175 2897 792 -1813 -1634 380 2310 1000
2398 1000 -2636 -2353 2563 3333 -2381 -4083 1668 4285 -848 -4113 -118 3369 1091 -2277 -1966 943
$$ packed form
2290E933p918m700P611N931o453o592M712O440k383n779j57M515K769k939n048
2305d058J010O788R50p904k717Q181M177p615n244O355N673m359n546K007M936
2320B634O39l928l099K448N321q76o933o79P759K129p836l304P063M049n516m436
2336d565L492M277j129l766j298K848L495j546n340K60O540R73o928k091O633
2351A855K936n634l348L954L468k014l021k41K361K321j457m097M28N322O86n987
2367b468j651N912K322n154k738L839K807k095k470Q9J889J900j111l602K45M832
2383B546P45n490j565N529K242m952k671L791K722k105k605J79K014J930j310
2398A000l636K83M916P70n714j702N751K617n133l265L995L487k278l368L11K909
$$ plain form
2414 943 2725 605 -3096 -1998 3230 3314 -2893 -4157 2341 4649 -1426 -4598 415 4115 747 -3160
2430 -3160 -1875 1882 2777 -397 -3486 -1159 3798 2517 -3763 -3753 3301 4486 -2478 -4834 1393 4686
2446 4686 -90 -3994 -1200 2941 2416 -1536 -3413 29 4026 1432 -4203 -2795 3966 3800 -3442
2461 -3442 -4504 2407 4603 -1204 -4364 -140 3646 1417 -2616 -2682 1244 3563 107 -4103 -1503
2476 -1503 4310 2731 -4039 -3518 3367 4026 -2260 -4068 1066 3750 279 -3033 -1575 1991 2702 -799
2492 -799 -3536 -428 3912 1538 -4073 -2546 3619 3086 -2856 -3456 1760 3347 -502 -2865 -717 2202
2508 2202 1950 -1117 -2799 88 3514 1045 -3558 -1848 3430 2543 -2866 -2841 2010 2884 -923 -2606
2524 -2606 -299 1990 1362 -1234 -2249 290 2885 621 -3259 -1512 3255 2173 -2720 -2513 2097
$$ packed form
2414I43J782k120l701J098N228Q4o207j264O498K308o075l172N013L700l368l907
2430c160J285L757Q95l174l089K327M957j281o280J0P054J185o964k356O227L293
2446D686m776l904K794M141n25l952j877L442L997k594n635J408O761j66p242
2461c442j062O911K196n807l160M224L786k229m033o6L926K319l456m210K600
2476a503N813j579o770N21O885O59o286j808N134K684l471l312J458L566P11l501
2492g99k737L108M340k374n611J527O165n33n942o00N216J587l849k363K148K919
2508B202k52l067j682K887L426k469m603J710N278q87n409K5M851Q74l807j683
2524b606K307K289o28k596j015K539K595k264l880J747M767j082m893K07M610
$$ plain form
2539 2097 2659 -1047 -2462 48 2050 1160 -1242 -1969 433 2749 522 -3148 -1419 3146 2041 -2837
2555 -2837 -2562 2124 2786 -1192 -2663 1 2184 1101 -1563 -2100 637 2847 256 -3360 -1232 3418
2571 3418 2089 -3125 -2641 2541 2990 -1497 -2940 423 2698 782 -2092 -1927 1400 2817 -478 -3460
2587 -3460 -562 3735 1465 -3668 -2280 3144 2834 -2319 -3135 1224 3050 117 -2667 -1315 2093
2602 2093 2589 -1183 -3412 309 3910 783 -3907 -1636 3614 2462 -2973 -2951 1906 3052 -722 -3009
2618 -3009 -655 2495 1871 -1897 -2914 1041 3632 -136 -4006 -890 3924 1717 -3431 -2313 2646
2633 2646 2760 -1582 -2859 396 2758 938 -2259 -2082 1675 2968 -879 -3500 70 3739 801
2648 801 -3527 -1551 3012 2063 -2192 -2471 1016 2501 56 -2343 -1297 1891 2328 -1295 -3082 548
$$ packed form
2539B097N62l706j415K510K002q90k402p27K402K316k227l670J729M565j105m878
2555b837K75M686O62l978j471K664K183j083k664n37K737K210k591l616K128M650
2571C418j329n214M84N182M49m487j443L363K275j916k874J65L327J417l295k982
2587c460K898M297k270n133J388N424l10n153q16M359J826k933k784J352L408
2602B093M96l772k229L721L601l127m690K271N250j152n435K2M857J146l774k287
2618c009K354L150o24l768j017L955K591l768l870L116M814k207n148J118M959
2633B646J14m342j277L255K362j820l197J77L757J293l847k621L570L669k938
2648H01m328J976M563r49m255k79L487J485k445k399J046L188M37l623j787L630
$$ plain form
2664 548 3460 217 -3418 -916 3039 1604 -2288 -1999 1410 2209 -335 -2097 -797 1779 1846 -1301
2680 -1301 -2598 691 3046 -104 -3185 -575 2884 1239 -2363 -1740 1580 1979 -614 -1966 -383
2695 -383 1727 1383 -1413 -2201 858 2739 -212 -3015 -401 2833 1029 -2446 -1576 1672 1875 -801
2711 -801 -2020 -234 1854 1182 -1612 -2120 1048 2690 -438 -3068 -302 3041 1004 -2604 -1528 1963
2727 1963 1938 -966 -2164 63 2161 1009 -1853 -1944 1350 2598 -779 -3062 39 3137 639 -2975
2743 -2975 -1342 2353 1787 -1580 -2259 562 2345 413 -2269 -1385 1866 2296 -1325 -2975 637 3248
2759 3248 169 -3198 -856 2805 1515 -2038 -1986 1108 2391 -60 -2406 -955 2202 1905 -1813 -2727
2775 -2727 1093 3085 -389 -3261 -392 3032 1064 -2561 -1791 1698 2150 -798 -2384 -324 2358
$$ packed form
2664E48K912l243l635K502L955j435l892K89L409P99k544j762J300K576O7l147
2680a301j297L289K355l150l081K610L459j645l602O23L320L99k593j352J583
2695c83K110l44k796p88L059J881k951k803K614L234j804l475Q70L248K03k676
2711h01j219J786K088o72k794n08L168J642l128k630K766L343k037l608J076L491
2727A963k5k904j198K227K098j152k862r1L294J248l377k283L101L098k498l614
2743b975J633L695n66l367o79K821J783j932k682Q84L251M30l621j650L612K611
2759C248l079l367K342L661j290l553N2L094J283k451k346J451L157k97l718r14
2775b727L820J992l474k872K869L424j968l625P70L489M52k948j586K060K682
$$ plain form
2790 2358 1290 -2070 -2104 1589 2766 -946 -3035 205 3053 511 -2685 -1204 2099 1752 -1305 -2106
2806 -2106 290 2261 594 -2170 -1536 1790 2240 -1333 -2718 707 2871 79 -2716 -739 2256
2821 2256 1335 -1586 -1803 694 2038 245 -2069 -1108 1844 1841 -1503 -2374 845 2629 -278 -2633 -431
2838 -431 2253 1035 -1784 -1506 922 1849 -128 -2024 -704 1929 1460 -1549 -2005 1114 2394 -507
2854 -507 -2413 -112 2306 770 -1788 -1227 1193 1758 -431 -1910 -454 1914 1265 -1694 -1866 1192
2870 1192 2281 -702 -2549 -21 2336 627 -1983 -1247 1445 1694 -638 -1940 -206 2044 1007
2885 1007 -1877 -1642 1503 2248 -915 -2439 261 2437 409 -2219 -1050 1645 1568 -1030 -1987 170
2901 170 2130 618 -2054 -1400 1794 1943 -1333 -2350 686 2501 -14 -2356 -633 2035 1303 -1383
$$ packed form
2790B358j068l360l4L693J177l712k089L240K848k542l196J481L303l47l057q01
2806b106K396J971j667k764O34L326M50l573j385L425K164k792k795J977K995
2821B256r21k921k17K497J344j793k314R61K952ll344q71L219J784k907k355K202
2838d31K684j218k819K78K428R27j977j896J320K633m69l009m56L119J280k901
2854e07j906K301K418j536k558N61K420N65k189j479J456K368o49k959j72L058
2870A192J089k983j847K528K357j709k610P36K692K49k332j302J734K250j037
2885A007k884K35L145P45l163j524K700K176k028k628J169K695p7k598r57K157
2901A70J960j512k672O54L194J49l276j017L036J815k515k342J723K668p32k686
$$ plain form
2917 -1383 -1751 710 2078 132 -2147 -889 2012 1576 -1639 -2149 1040 2454 -440 -2497 -240 2179
2933 2179 942 -1756 -1502 1075 1948 -279 -2151 -483 2105 1269 -1885 -1844 1479 2210 -832 -2344
2949 -2344 213 2295 567 -1959 -1157 1362 1713 -737 -1977 -11 2056 746 -1994 -1373 1654 1884
2965 1884 -1174 -2135 617 2172 101 -2037 -711 1620 1351 -1045 -1746 417 2046 341 -1966 -928
2981 -928 1789 1570 -1388 -1984 808 2094 -192 -2030 -481 1723 1081 -1227 -1605 595 1847 87
2997 87 -1923 -779 1797 1321 -1519 -1663 983 1964 -403 -1957 -166 1780 777 -1333 -1313 873 1750
3014 1750 -267 -1838 -403 1828 955 -1555 -1480 1153 1828 -703 -1959 59 1803 541 -1592 -1152
3030 -1152 1032 1553 -455 -1884 -144 1947 832 -1737 -1329 1382 1749 -857 -1854 312 1924 330
$$ packed form
2917a383l68K461J368j946k279J258K901m36l215n10L189J414k894k057K257K419
2933B179j237k698K54K577Q73k227j872J668K588q36l154M1L323P31l042j512
2949b344K557K082j728k526Q02K519L51k450j240J966K067j310k740O21L027K30
2965A884l058r61K752J555k071k138J326K331k69k396p01K163J629j705k307J038
2981i28K717k19k958n96K792J286k286j838J549K204o42k308l78K200J252j760
2997H7k010J144K576m76k840j44K646R81k367j554J791J946j003k110K0K186Q77
3014A750k017j571J435K231q73k510P5K633O75k531j256K018J744j262k133M40
3030a152K184N21k008j429J740K091j115k569M08K711L67k606r97K166J612j594
$$ plain form
3046 330 -1661 -960 1297 1443 -723 -1797 141 1923 454 -1846 -1034 1577 1473 -1205 -1789 548
3062 548 1870 -12 -1797 -621 1542 1194 -1020 -1532 515 1873 79 -1842 -652 1733 1160 -1444
3078 -1444 -1591 970 1803 -321 -1841 -344 1596 837 -1317 -1442 743 1747 -195 -1908 -402 1852
3094 1852 925 -1532 -1335 1141 1729 -615 -1773 40 1769 671 -1388 -1080 1040 1503 -572 -1796
3110 -1796 1 1835 593 -1732 -1061 1331 1374 -939 -1702 321 1708 247 -1607 -811 1225 1265 -763
3127 -763 -1642 235 1767 309 -1753 -717 1551 1141 -1093 -1453 633 1698 53 -1615 -600 1374
3143 1374 1061 -1040 -1489 500 1688 2 -1752 -601 1604 988 -1310 -1308 779 1563 -218 -1577 -373
3160 -373 1488 818 -1137 -1198 775 1543 -259 -1682 -229 1664 747 -1393 -1120 1024 1387 -507 -1533
$$ packed form
3046C30j991P01K257J46k166j074J938J782j469k300Q12K611j04k678n84K337
3062E48J322j882j785J176K163l48k214n12K047J358j794j921J190K385n73k604
3078a444j47K561Q33k124j520J497J940p59k154j25K185J004j942j713J506K254
3094A852r27k457J97K476N88k344j158J813J729j098k059L08K120M63k075j224
3110a796J797J834j242k325O71K392M3k313p63K023J387j461j854P96K036M0k028
3127g63q79J877J532j458k062J036K268m10k234l60K086J065j645j668J015J974
3143A374l13k101m49J989J188j686j754J151K205o16k298KK087P84j781j359J204
3160c73J861o70j955o1J973P68j802j423J453J893r17k140K73K144L63j894j026
$$ plain form
3177 -1533 -58 1514 608 -1349 -1061 942 1381 -461 -1674 -12 1668 524 -1472 -965 1190 1266
3193 1266 -745 -1470 252 1495 370 -1399 -867 1163 1269 -723 -1536 232 1660 288 -1618 -829
3209 -829 1320 1145 -987 -1397 483 1458 77 -1513 -568 1249 1013 -954 -1307 565 1562 -30 -1555
3226 -1555 -473 1487 890 -1114 -1232 767 1444 -209 -1434 -307 1361 778 -1167 -1224 712 1414 -304
3243 -304 -1546 -194 1502 649 -1280 -1107 920 1328 -379 -1439 -48 1436 541 -1227 -982 982
3259 982 1286 -524 -1463 53 1531 396 -1307 -855 1033 1141 -696 -1354 189 1389 235 -1332
3275 -1332 -755 1031 1052 -757 -1355 314 1407 179 -1401 -640 1201 947 -831 -1211 398 1372 80
3292 80 -1331 -541 1177 968 -893 -1239 496 1476 -50 -1461 -417 1197 838 -982 -1128 604 1315
$$ packed form
3177a533J475J572r06j957K88K003M39j842j213J662J680j144j996N07K155P6
3193A266k011p25J722J243j125j769N32K030J06j992q13J768J428j372j906P89
3209h29K149j75k132m10J880R75j381j590R45J817k36j967l53J872R97j592j525
3226a555J082J960n97k004j18J999O77j653j225J127J668n83j945n7J936P02j718
3243c04j242J352J696q53j929J73K027M08j707j060J391J484q95j768K45J964
3259I82L04j810r39J516J478j135j703M52J888J08j837o58J543J200j154j567
3275a332N77J786K1j809n98J669J093j228j580P61J841k54j778l80J609R74j292
3292H0j411P90J718k09j861l46J735R80j526j411J044J614l59j820j46J732P11
$$ plain form
3309 1315 -162 -1349 -282 1228 814 -1083 -1082 701 1366 -306 -1364 -117 1327 597 -1081 -978 793
3326 793 1186 -374 -1373 -45 1284 449 -1219 -884 787 1156 -533 -1388 83 1334 375 -1249 -728
3343 -728 977 1120 -557 -1236 170 1357 314 -1212 -712 1089 1039 -665 -1259 357 1337 117 -1274
3360 -1274 -538 1109 898 -794 -1209 403 1307 -21 -1370 -506 1135 783 -864 -1103 502 1282 -128
3377 -128 -1268 -297 1175 691 -958 -985 664 1261 -181 -1250 -170 1196 596 -980 -922 674 1130
3394 1130 -309 -1242 -110 1216 465 -1054 -854 763 1048 -401 -1263 -3 1193 420 -1091 -811 835
3411 835 1098 -468 -1200 79 1232 308 -1069 -694 882 1003 -559 -1137 173 1166 190 -1150 -590
3428 -590 952 831 -644 -1108 243 1167 111 -1103 -498 1004 788 -771 -995 399 1211 35 -1146
$$ packed form
3309A315j477j187J067J510m14j897JJ783O65j672j058J247J444p30j678J03J771
3326G93L93j560r99J328J329q35j668L35J671L69j689q55J471J251r59j624N21
3343g28J705J43j677o79J406J187j043j526N00J801n0j704n94J616R80j220j391
3360a274P36J647k11j692m15J612R04j328j349Q64J641l52j647k39J605P80j410
3377a28j140R71J472m84j649k7J649N97j442j069J080J366o00j576N8J596M56
3394A130j439r33J132J326p51j519K00J617K85j449q62J260J196p73j511K80J646
3411H35K63j566p32J279J153r24j377L75J576J21j562n78J310R93r76j340N60
3428e90J542j21j475m64J351R24j056j214O05J502k16j559k24J394Q12j176j181
$$ plain form
3445 -1146 -405 1045 716 -821 -985 493 1130 -119 -1199 -314 997 640 -885 -958 522 1151 -197
3462 -197 -1221 -229 1148 598 -937 -838 579 1109 -238 -1136 -112 1192 566 -940 -813 691 1100
3479 1100 -350 -1163 31 1199 347 -1006 -732 809 925 -475 -1103 119 1141 236 -1116 -648 841
3496 841 899 -612 -1070 214 1135 205 -1159 -522 943 817 -672 -1030 313 1164 57 -1118 -407 949
3514 949 794 -721 -1025 411 1123 2 -1119 -392 1049 662 -848 -934 504 1075 -114 -1099 -229 1005
3532 1005 599 -870 -790 522 1030 -206 -1071 -107 1045 431 -887 -771 670 933 -319 -1086 -49
3549 -49 1025 345 -921 -719 665 877 -391 -1054 55 1069 327 -902 -607 721 867 -402 -920
3566 -920 110 1014 259 -918 -575 825 808 -497 -912 215 1026 124 -975 -435 851 705 -538 -839
$$ packed form
3445a146P41J450l29j537j64J478O37j249j080Q85J311l57j525p3J480O29j348
3462a97j024R92J377n50j535R9J417N30j347q98J024J304o26j506J27J504M09
3479A100j450q13J194J168q52j353K74J541J16j400o28J222J022r05j352M68J489
3496H41N8j511m58J284R21r30j364O37J465j26j489l58J343Q51j107j175P11J356
3514I49j55j515l04J436P12j121j121P27J441l87j510q6J438N71j189r85Q70J234
3532A005m06j469Q0J312N08j236q65R64J152o14j318J16J441K63j252p67J037
3549d9J074o80j266K02J384K12j268o63J109J014p42j229K95J328J46j269n18
3566i20J030R04p55j177L43J400j7j305m15J127Q11r02j099N40J286j46j243l01
$$ plain form
3584 -839 269 900 31 -954 -434 854 633 -637 -856 351 881 -74 -950 -295 856 580 -621 -798
3602 -798 448 979 -14 -966 -241 946 544 -716 -854 495 897 -200 -1022 -202 877 481 -776 -742
3620 -742 515 874 -213 -945 -114 1006 465 -767 -687 628 955 -297 -928 54 1004 312 -826 -596
3638 -596 639 799 -387 -926 57 1003 246 -954 -528 687 771 -480 -876 210 918 79 -904 -391
3656 -391 755 691 -577 -885 246 908 65 -967 -404 837 671 -613 -851 327 960 -57 -973 -239
3674 -239 829 517 -604 -764 379 941 -154 -973 -229 902 462 -750 -712 554 871 -247 -872 -51
3692 -51 883 418 -722 -573 584 817 -248 -865 43 844 241 -753 -597 590 723 -412 -847 43 856
3711 856 171 -820 -458 607 653 -366 -833 198 934 223 -849 -456 675 665 -504 -774 228 898
$$ packed form
3584h39J108O31q69r85N20J288k21j270k19J207N30r55q76O55J151k76j201j77
3602g98J246N31r93r52P25J187m02j260j38J349M02j097q22Q20J079l96j257L4
3620g42J257L59j087p32Q31J120n41j232Q0J315L27j252o31R82R50o92j138K30
3638e96J235J60j186n39R83R46p57j200M26J215Q4j251l96J086P08q39r83N13
3656c91J146o4j268l08J131O62q43j032N63J241j66j284k38J178O33j017r16P34
3674b39J068l12j121j60J143N62j095q19P44J131m40j212L8J266L17j118o25Q21
3692e1R34m65j140J49J157K33j065o17R08Q01o03r94J56J187J33j135m35Q90Q13
3711H56o85r91L62J065M6j019m67J031P36p11j072L93J131j0j169k70J002O70
$$ plain form
3729 898 93 -789 -305 700 591 -484 -741 228 846 63 -892 -296 712 528 -610 -790 333 791
3747 791 -50 -816 -264 691 482 -557 -706 325 757 -114 -825 -214 809 432 -602 -597 423 730 -162
3766 -162 -780 -108 798 341 -678 -626 414 764 -143 -866 -60 868 327 -728 -598 530 699 -255 -815
3785 -815 9 746 263 -699 -543 512 721 -301 -787 -5 812 216 -774 -433 659 610 -409 -768 135
3804 135 792 140 -778 -352 656 599 -389 -780 171 860 75 -805 -336 762 605 -483 -650 307 781
3823 781 -35 -726 -262 725 458 -601 -733 358 825 -124 -889 -179 748 403 -694 -598 439 685 -215
3842 -215 -724 -70 722 364 -634 -523 445 717 -179 -789 44 809 265 -726 -464 556 609 -329 -786 70
3862 70 720 193 -712 -454 528 621 -365 -785 116 786 167 -724 -367 607 533 -372 -638 154 760 120 -636
$$ packed form
3729H98q05q82M84J005j09j075k57R69O18p83r55N96J008j84j138j80J123M58
3747G91q41p66N52R55k09j039j49J031M32q71p11O11J023l77j034NJ020L07q92
3766a62o18O72R06m57j019N2J040L50r07p23Q06R28n41j055J30J128J69r54n60
3785h15Q24P37m83r62J56J055K09j022m86P82Q17n96r90L41J092m9j019l59R03
3804A35O57o52r18M26J008n7r88l91R51O89p85q80M69J098j57j088j67R57M74
3823G81q16o91M64R87k67j059j32J091M67r49p65P10R27l45j097R6J037K46r00
3842b15n09O54P92l58r98J11R68K72q96o10Q33P65n44r91K62J020N3r38m57Q56
3862G0O50n27r05K58R82R3r86m20R01O70o19q91L57R74p4r05k66P92O06o40p56
$$ plain form
3883 -636 -328 594 549 -426 -720 182 719 30 -761 -251 662 481 -487 -632 281 673 1 -640 -229 614
3903 614 417 -478 -633 235 692 -74 -717 -109 684 344 -583 -493 374 634 -128 -723 -146 669 352 -544
3923 -544 -536 405 676 -207 -783 -30 719 270 -666 -465 410 582 -216 -717 22 694 267 -594 -463 447 671
3944 671 -239 -691 56 754 190 -656 -366 572 517 -394 -721 64 679 147 -700 -368 524 528 -399 -718 163
3965 163 767 67 -740 -316 600 459 -439 -587 254 684 57 -670 -221 626 489 -526 -658 306 769 -8
3985 -8 -735 -144 679 396 -590 -488 380 704 -99 -739 -80 650 386 -548 -563 397 662 -193 -737 -27 699
4006 699 199 -589 -444 392 575 -213 -662 31 683 255 -582 -454 487 552 -284 -656 159 648 143 -573
4026 -573 -278 545 487 -340 -611 100 678 163 -597 -282 633 497 -385 -597 152 640 20 -650 -272 537
$$ packed form
3883f36L08R22m5r75k94R02N37o89p91N10R13j81r68j45R13L92o72o41M11Q43
3903F14j97q95j55Q68M57p66o43O08P93l40r27R0Q67K60p62n95N77Q15l17q96
3923e44QR41K71q83n76P53P49m49r36K01Q75J72p98n01P39O72m27q61J31R10K24
3944F71r10m52P47O98n64q46K90R38n5r11l27P85O15n32q47L32Q92Mr27l19Q81
3965A63O04p00q07M24R16j41q98j48Q41M30o27p27M49Q47j37j015j32R64M63p77
3985hp27N91Q23k83r86J02Q68L24q03o40O59P30k64r34j5R60K65q55n44P10P26
4006F99n00p88J45Q36J83p88m49O93O52m28q37J28R41O5q36l72Q15M89n05p16
4026e73K95Q23n8q27k71P11N78n15p60L15R15j36q82k12P49M88o20o70L78Q09
$$ plain form
4046 537 406 -384 -585 129 567 0 -637 -192 550 426 -413 -574 273 639 -48 -656 -102 630 381 -426
4066 -426 -449 253 641 -66 -604 -89 580 313 -472 -497 285 585 -163 -682 -37 597 221 -473 -392 364 504
4087 504 -135 -626 -2 651 270 -584 -439 398 559 -234 -644 29 664 146 -562 -335 488 510 -268 -533
4107 -533 6 619 178 -607 -358 500 463 -328 -589 111 623 67 -638 -261 511 404 -380 -547 141 593
4127 593 31 -641 -279 558 468 -474 -552 284 651 -12 -604 -125 594 367 -449 -468 280 559 -65 -651 -209
4148 -209 654 358 -516 -486 382 578 -206 -630 -83 619 295 -509 -369 392 506 -170 -567 -33 610 214
4168 214 -559 -401 431 494 -265 -563 107 604 127 -519 -342 408 448 -235 -584 88 602 139 -580 -321 505
4189 505 460 -334 -487 225 605 51 -524 -193 500 410 -274 -488 90 572 7 -634 -237 538 400 -453 -474
$$ packed form
4046E37j31p90k01P14M38n67o37M45P42j24q39j61Q47L66o87o08N54P32k49q07
4066d26k3P02L88p07n38N15O69k67p85k5P82L00p48n19O45O34l76o94Q1P56J40
4087E04o39m91O24O53l81q54J45Q37J61p93m10O73O35n18p08K27Q23K2p78k65
4107e33N39O13m41p85K49Q58l7p91k61P00N12n56p05L77P72j07p84j67O88M52
4127E93n62o72L62Q37r0r42p8Q36L67o63n92M79P19k27q16j9P48K79o24n86M42
4148b09Q63k96q74L0Q68J96p84m24N47P02l24q04J40P61J14o76l97N34O43l96
4168B14p73J58Q32O3p59k98O70M97m77o46J77P50M0o83l49O72N14m63p19K59Q26
4189E05m5p94j53P12L80n54n75L31O93r0o84k14N78M82n65o41L97P75j38q53k1
$$ plain form
4210 -474 246 553 -87 -588 -127 535 317 -424 -445 255 504 5 -510 -172 532 333 -375 -434 329 522 -123
4231 -123 -538 -88 534 237 -399 -401 296 502 -133 -582 -43 559 244 -481 -432 354 510 -221 -544 36 528
4252 528 178 -466 -329 334 475 -215 -577 47 542 162 -572 -311 457 481 -288 -532 100 575 95 -522
4272 -522 -257 459 351 -274 -498 138 538 76 -536 -229 544 412 -342 -488 214 579 -11 -502 -136 513
4292 513 278 -357 -486 242 546 -87 -596 -166 546 298 -470 -430 269 546 -185 -537 -84 574 241 -391
4312 -391 -392 371 527 -133 -635 -48 568 161 -449 -336 367 451 -193 -505 53 526 132 -427 -330 356 397 -233
4334 -233 -561 26 505 81 -468 -213 395 395 -329 -479 128 568 62 -532 -247 405 385 -240 -423 148 503
4355 503 39 -490 -215 446 365 -345 -456 166 462 -36 -487 -171 435 281 -338 -425 161 493 -32 -509 -125
$$ packed form
4210d74P20L07o40n01M61O62k18p41k1P00K49m99n15L38P04j99p08n9P63J93o45
4231a23m15M50O22k97o36kO97K06o35m49N39O02l15p25M9P86J56p31l23N80M92
4252E28l50o44J37O63J41o90l62O24M95l80p34K61P68K4p69k44O32M75m80o17
4272e22K65P16j08o25k24O36M00m62o12L07P73j32p54j46P02L65n90m91L66O49
4292E13k35o35j29P28L04o33n09M30P12k48p68M0O99K77p31l52M53O58l33o32
4312c91jP63J56o60n02N87O16m07o10J13P03Q4o44l12N58M73l94n59R7O86M1o30
4334b33l28N87M79m24n49K55O08%p24j50O07M40n06n94K85O52k0o25j83N71L55
4355E03m64n29K75O61q1p10j11O22K96m98m51L16O06j54o19q7N86L32n25m77L84
$$ plain form
4376 -125 481 283 -360 -371 235 403 -78 -473 -64 447 259 -348 -442 246 498 -146 -557 -42 510 181 -430
4397 -430 -317 303 427 -132 -490 17 434 143 -398 -297 343 438 -148 -523 22 490 159 -509 -318 334
4417 334 332 -241 -474 14 510 126 -457 -272 305 363 -253 -449 58 478 85 -464 -224 409 307 -249 -409
4438 -409 201 435 -3 -392 -140 412 366 -241 -443 165 544 54 -499 -148 490 288 -364 -404 229 444 -106
4459 -106 -500 -135 412 248 -380 -442 190 423 -110 -541 -53 530 223 -396 -320 267 411 -90 -448 -33 416
4480 416 181 -411 -279 303 384 -140 -473 34 476 96 -454 -239 354 363 -211 -440 42 453 144 -401 -203
4501 -203 352 358 -229 -403 142 456 50 -391 -144 448 321 -272 -375 139 387 68 -404 -213 335 324 -226
4522 -226 -462 148 442 -19 -380 -161 423 221 -241 -323 160 371 2 -327 -112 404 311 -313 -423 203 384
$$ packed form
4376a25O06j98o43j1O06J68m81l95M09N11j88o07r4O88K52o44m11N15N52l29o11
4397d30J13O20J24n59l58N07M17k91n41J01O40R5n86l75N45M68l31o68J91O52
4417C34kn73k33M88M96l84n83J85N77N8o16j96N07M20l93n49K40O33j02n56j60
4438d09O10K34m38l89K52N52m6o07k02O08L79m90n53L51O38k02o52m0O33K15n50
4459a06l94L65N47j64o28o2O32K33n33m31M88N83l07o19P6N87J44n01l58M15M49
4480D16k35n92J32N82Q1n24l33N07M42l80n50K15N93Rn74k29M82M11l09n45J98
4501b03N55On87j74N45L14m06m41K47N92j27n93j03N14K48l19m72J91N48j1n50
4522b26k36O10K94m61l61K19N84k02m62q2M83K11l69l29K15N16r3o24j10O26J81
$$ plain form
4543 384 -61 -443 -64 400 211 -328 -330 153 361 -125 -391 -76 371 210 -272 -296 281 390 -78 -431 11
4564 11 376 148 -330 -247 255 384 -121 -363 45 407 224 -341 -243 286 367 -176 -468 1 433 94 -367
4585 -367 -277 354 323 -197 -359 77 387 88 -373 -261 280 326 -221 -389 139 473 102 -431 -123 342 262
4606 262 -263 -345 84 394 25 -404 -167 391 266 -323 -348 176 407 -79 -437 -69 371 208 -351 -274 242
4627 242 353 -91 -380 6 383 205 -317 -280 221 377 -119 -467 6 377 73 -379 -231 225 323 -107 -346
4648 -346 -18 409 171 -293 -246 313 324 -163 -390 80 437 26 -341 -136 314 222 -189 -358 27 338 23
4669 23 -376 -141 291 286 -211 -361 72 359 -14 -357 -58 304 166 -236 -282 116 341 62 -323 -105 272
4690 272 245 -212 -268 188 391 -76 -340 -79 342 169 -262 -239 129 267 -91 -328 -157 352 150 -260 -258 134
$$ packed form
4543C84m45l82L79M64j89n39kM83K08m86k66L15M47j61m82k4N77J09m68l53M42
4564A1L65k28m78Q3N02J29n05k42M08L62j83n65R8N29Q1n43k92M69M32l39m61
4585c67R0O31l1n20j62M36L10k99m61J12N41M6n47j68N28L34l71n33L08M65q0
4606B62n25q2M29L10l69m29K37N58j25n89k5N24K31m86l58L68M40j63n59P7N16
4627B42J11m44k89L86L77j78n22L7N01J56m96l48M73L71l04m52J48M56R8m30k39
4648c46L28M27k38m64M7N59J1m87k27M70L57m11l67K05M50r2m11j69L85L11l15
4669B3l99K35M32nm97j50M33K87l73l43K99L62j38m02m6L98K25k79l85K18L77
4690B72k7m57n6M56K03m67k64K61M21j73m31K3L68J38l58k37J71N09k02m10KL92
$$ plain form
4712 134 320 -77 -394 -70 295 72 -290 -184 201 275 -22 -320 -20 391 178 -308 -239 253 362 -134 -428
4733 -428 43 353 118 -342 -150 229 234 -96 -321 28 331 134 -330 -241 268 316 -189 -347 73 312 40
4754 40 -351 -140 268 270 -216 -331 86 343 23 -365 -181 334 245 -247 -378 157 332 -39 -355 -84 295
4775 295 190 -291 -330 192 309 30 -350 -66 360 220 -295 -313 248 322 -31 -344 19 314 58 -317 -211
4796 -211 156 269 -109 -312 -87 329 166 -317 -251 225 306 -163 -324 64 318 52 -298 -135 240 248 -97
4817 -97 -279 36 357 80 -282 -123 307 258 -211 -322 102 293 -36 -320 -126 212 209 -138 -302 123 253
4838 253 69 -351 -73 311 185 -233 -278 178 298 -37 -330 -62 295 110 -149 -278 86 306 -34 -271
4858 -271 -63 273 192 -263 -220 164 280 -84 -267 -44 246 98 -226 -188 169 280 -38 -295 -36 303 144
$$ packed form
4712A34J86l97l17L24L65k23l62J06L85P4k97k98L00M11k13m86O9M92J09m96k94
4733d28M71L10k35m60J92L79Nl30k25L49L03j97m64Q9N09M8n05j58M20K39k72
4754D0l91K11M08Km86j15M17K57l20l88J84N15q9m92j31N35J75l71l16K71L79
4775B95j05m81l9N22J17k79l80K84M26j40n15j8N61P4l53l13L63K95k56l75J06
4796b11L67J13l78k03K25M16j63m83O6M76Q1m69j61L88K54k66l50J63L75Ql45
4817i7j82L15L21k77l62J59M30m9m69j11M24J91l29k84J94L38ll47j64M25J30
4838B53j84m20K78L84j26m18m5M56J20l35k93K68L57j85k59j29L64K20l40k37
4858b71K08L36q1m55M3L84J16l64j83K23K90j48l24L8L57J11l18k57K59L39j59
$$ plain form
4879 144 -269 -257 199 249 -77 -312 20 264 50 -235 -184 166 219 -71 -346 -22 255 102 -291 -221 212 278
4901 278 -173 -280 44 320 48 -240 -103 196 266 -143 -287 41 267 45 -312 -181 287 224 -208 -297 125
4922 125 296 -31 -293 -103 172 173 -183 -315 74 263 -9 -379 -99 334 166 -171 -283 191 299 -119 -255
4943 -255 -13 310 162 -207 -274 189 267 -71 -331 -69 339 80 -347 -224 247 240 -141 -209 60 315 37 -257
4965 -257 -148 206 228 -85 -296 21 331 64 -296 -78 252 204 -179 -212 89 208 -59 -199 -119 210 224 -184
4987 -184 -229 64 259 27 -327 -110 282 163 -211 -195 177 215 -46 -241 -8 189 90 -123 -175 68 273 6
5009 6 -273 -41 238 104 -217 -161 121 146 -102 -199 -53 154 83 -160 -183 75 254 21 -251 -54 186 105 -219
5032 -219 -137 173 185 -56 -201 -56 204 76 -189 -200 128 236 -49 -291 -50 262 60 -208 -102 122 178
$$ packed form
4879A44m13J2M56N0l26k35L32K44k14k85N1L50N3k90k75L24K77j53l93P0M33O6
4901B78m51j07L24K76k72k88J37K99P0m09j44L28K26k22l57J31M68o3m32q9M22
4922A25J71l27k62J90K75Jl56j32L89J89k72l70K80M33j68l37j12M74J08m18j36
4943b55K42L23j48l69o7M63P8l38k60K62M08k59m27J23M71pl81o8K69K55k78k94
4965b57J09L54K2l13k11L17L10k67l60K18L30m8l83l3L01J19k67j40Q0L29J4m08
4987a84m5K93J95k32l54K17L92j19l74J6L72L8k61j95K33J97r9k13n2K43K05k67
5009Fk79K32K79j34l21N6K82K5k48r7J46K07p1k43k3K58J79k33k72J97K40q1l24
5032b19Q2L10J2k41j45J45K60j28k65j1L28J08k85k42K41L12k02k68J06K24N6
$$ plain form
5053 178 -103 -229 28 193 87 -227 -201 133 275 5 -274 55 307 116 -243 -127 234 234 -156 -243 78
5074 78 236 29 -228 -136 168 207 -159 -266 64 328 13 -351 -130 303 184 -185 -248 136 202 -28 -261 -66
5096 -66 280 107 -175 -224 89 268 -90 -341 -27 311 68 -252 -117 183 189 -49 -229 35 230 74 -247
5117 -247 -211 146 236 -74 -334 38 332 21 -271 -148 232 179 -156 -183 31 170 63 -182 -126 156 169 -155
5139 -155 -284 58 202 -15 -264 -9 264 66 -171 -135 114 127 -13 -129 -21 195 151 -164 -171 64 242 -20
5161 -20 -233 -56 213 62 -114 -114 114 154 -66 -176 -58 38 137 -122 -209 70 154 -49 -224 -46 223 83 -162
5184 -162 -93 96 170 -59 -106 51 145 115 -87 -142 112 220 -47 -210 26 200 106 -116 -147 120 142 -66 -179
5207 -179 -27 139 41 -162 -145 53 171 -42 -222 -10 269 63 -190 -104 110 163 -73 -190 1 197 64
$$ packed form
5053A78k81j26K57J65j06l14K6L34J42k70k79L29K52j91l59J16L61%l90q7L21
5074G8J58k07k57R2L04L9l66j07L30K64l15l64K21M33j19l69o3L84O6k30k33J95
5096f6L46j73k82m9L13J79l58k51L14L38k43l20J35L00Ok38j80K64J95j56l21
5117b47L6L57R0l10k60L72K94l11k92J23L80n3l35k7K14J39j07k45N6K82J3l24
5139a55j29L42J44k17k49K55K73j98k37L6K49J3j40j16J08K16m4l15pK35J78k62
5161b0k13J77K69j51j76%K28M0k20j10J18R6R9k59q7K79Q4k03j75J78K69j40k45
5184a62O9J89P4k29m7J57R4l0k02n5K54J08k67j63K36J74r4k22l1K67K2k08j13
5207a79J52J66r8k03J7J98J18k13j80K12K79k06k53Q6K14N3k36j17J91J96j33
$$ plain form
5228 64 -146 -156 127 212 -111 -273 -24 257 -4 -271 -121 205 141 -127 -130 112 234 45 -190 -27 162 210
5250 210 -153 -203 126 214 -41 -272 3 232 46 -190 -155 103 183 -42 -172 -59 193 107 -200 -195 169 271
5272 271 -124 -255 60 247 -29 -215 -25 195 157 -131 -174 30 225 48 -232 -117 226 193 -169 -223 80
5293 80 235 -53 -210 -46 227 44 -125 -129 14 171 -17 -153 -99 167 150 -116 -210 186 228 -95 -187 6 173
5316 173 48 -124 -77 77 159 11 -139 -38 111 93 -151 -133 92 232 -54 -158 -17 141 47 -116 -88 44
5338 44 92 -50 -106 -75 84 75 -151 -107 104 104 -22 -109 16 181 -10 -104 -24 78 45 14 -112 -39 92 76 -105
5363 -105 -128 104 203 -23 -134 14 109 36 -132 -63 90 120 -42 -179 -27 200 77 -81 -100 114 165 -137 -174
5386 -174 -15 190 32 -181 -52 148 56 -90 -167 -49 143 98 -196 -113 164 191 -128 -185 163 269 26 -211
$$ packed form
5228F4k10j0K83Q5l23j62K49K81k61k67J50L26o4k68lK42J22j89k35J63J89M8
5250B10l63n0L29Q8k55k31K75K29j86k36L5K58Q0k25j30J13K52q6l07NL64J02
5272B71l95j31L15J87k76j86J90K20l8k88m3K04J95j77k80J15L43l3l62n4L03
5293H0J55k88j57J64K73j83j69mJ43J57j88j36N4K66j7k66r4L96M2l23r2J93J67
5316A73j25j72M7J54Q2j48j50J01J49j8k44J8K25J40k86j04J41J58r4j63K8J32
5338D4M8j42n6L1J59rk26M4K11%j26q7J25J65j91r4Q0J02l3l1j26P3J31j6j81
5363a05k3K32R9k26j11J48R5p3j68O9J53L0j62j37J52K27j23j58j9K14N1l02l7
5386a74J59K05j58k13J29K00r2j46p7J18J92m5k94Q3K77K7l19n7L48J06k43k37
$$ plain form
5408 -211 16 246 87 -176 -114 116 198 23 -156 -92 225 102 -205 -213 140 173 -123 -255 62 157 14 -181
5430 -181 -117 107 90 -85 -166 12 210 84 -186 -121 173 204 -142 -128 130 207 -39 -101 -9 209 128 -76 -124 6
5454 6 170 -1 -191 -89 170 87 -153 -192 18 124 -117 -134 45 142 11 -164 -70 50 117 5 -103 -53 152
5477 152 96 -116 -132 130 66 -89 -116 45 79 -1 -65 -64 27 114 5 -89 34 113 79 -102 -111 80 127 -45 -105 19
5503 19 104 25 -31 -38 28 121 35 -106 -93 18 107 -97 -139 114 79 -54 -101 -26 104 -2 -17 -116 34 113 20 -102
5529 -102 -8 166 141 -117 -124 87 143 -51 -181 12 136 -17 -85 -90 59 100 -46 -157 -117 163 75 -166 -147 157
5553 157 138 -139 -161 79 147 -25 -168 -46 108 101 10 -136 7 240 5 -187 -65 207 142 -189 -137 157 155
5576 155 -68 -150 4 159 54 -100 -106 111 174 -67 -195 -13 219 43 -209 -141 178 78 -143 -115 89 100
$$ packed form
5408b11K27K30j59k63O2K30Q2j75j79O4L17j23l07qL53L3k96j32L17R5j43j95
5430a81O4K24j7j75q1J78J98j26k70O5K94L1l46J4K58P7k46o2R2K18q1k04m8J30
5454FJ64j71j90J02K59q3k40l9K10J06k41j7J79R7j31j75R4J20O7j12j08N0K05
5477A52n6k12j6K62o4j55k7J61L4q0o4JR1Q7j09r4J23P9l4j81rJ91M7j72o0J24
5503A9Q5p9n6pO6R3q6j41J3J11Q9k04m2K53l5j33m7P5J30j06j5r9J50P9r3j22
5529a02R4J74k5k58pK11N6j94j30J93J24j53o8nJ49M1j46j11M0K80q8k41J9L04
5553A57j9k77k2K40O8j72j43J22J54pr1j46J43K33k35j92J22K72o5l31N2K94k
5576A55k23q2J54J55j05j54oK17O3k41j28J82K32j76k52O8L19j00k21K8K04J1
$$ plain form
5598 100 -63 -165 -94 60 106 -56 -132 25 179 34 -256 -78 153 51 -147 -101 110 170 -94 -124 49 138
5620 138 33 -62 -101 37 167 0 -144 -23 155 29 -181 -66 127 62 -63 -55 14 14 16 -53 -61 -18 123 -70 -105
5645 -105 -42 131 -6 -73 -18 82 90 -67 -45 42 46 -35 -2 -93 64 61 -12 -134 -14 131 -9 -93 18 39 60 -28
5671 -28 -103 -24 -10 -15 -20 -95 -28 80 53 -90 -65 99 60 -130 -92 52 73 -55 -42 9 32 92 -25 -88 13 129 83
5698 83 -166 -20 155 122 -144 -114 163 75 -84 -113 70 114 55 -97 -80 77 138 -22 -186 25 237 82 -183
5721 -183 -76 165 59 -183 -36 121 112 -9 -118 -81 81 111 -49 -112 27 197 -16 -176 -26 231 87 -146
5743 -146 -42 161 61 -70 -102 23 143 42 -90 -47 85 118 -55 -164 70 183 -38 -163 -39 95 40
5764 40 -134 -20 63 16 -59 -97 -43 59 86 -90 -110 53 151 -81 -143 43 178 22 -125 10 156 53 -25 -40
$$ packed form
5598A00j63j02P1J54M6j62p6J57J54j45k90J78K31j02j98M6K11O0k64l0J73Q9
5620A38j05r5l9J38J30j67j44J21J78j26k10J15J93o5j25QO9%Ko9qM3J41j93l5
5645a05O3J73j37o7N5J00Qj57K2Q7Mq1L3r1J57lp3j22J20J45j40q4J11K1K1q8
5671b8p5P9J4nnp5O7J08k7j43K5J64l9j90L8J44K1j28J3N1K3O0j17o3J01J16m6
5698H3k49J46J75l3k66L0K77q8j59k9J83M4n9j52J7J57O1j60j64K11K12j55k65
5721a83J07K41j06k42J47J57rj21j09L7J62L0j60o3J39J70k13j60J50K57j44k33
5743a46J04K03j00j31l2J25J20j01j32M3J32L3j73j09K34J13k21j25J24J34n5
5764D0j74J14Q3m7p5l8N4J02K7j76k0J63R8k32o2J86J35j56j47J35J46j03p8j5
$$ plain form
5788 -40 1 67 31 -45 -28 79 67 -67 -129 42 143 -19 -90 -30 100 -4 -45 -51 -8 -3 3 -33 -86 -10 58 -55 -65 12
5816 12 113 -25 -97 -17 87 -26 -56 42 -63 15 60 -33 -102 -26 88 -38 -113 -38 82 3 -108 -9 23 22 -24 -15 -40
5843 -40 27 14 -4 -107 -26 149 -27 -157 -41 158 45 -71 -64 51 144 -6 -63 15 75 44 -84 -46 10 192 -60
5868 -60 -178 6 143 19 -128 21 108 63 -60 -76 16 54 25 -143 -107 75 78 -108 -168 84 188 -71 -233 -15
5892 -15 179 46 -179 -18 59 84 32 -151 -24 139 60 -47 -112 84 134 -15 -154 61 213 -17 -124 9
5914 9 109 32 -83 -35 -10 134 -8 -102 -64 94 93 -104 -92 83 118 -53 -129 46 139 -41 -98 -27 61 53 -24 -52 -59
5941 -59 132 110 -88 -91 123 73 -51 -60 52 94 -19 -115 43 56 9 -10 26 -29 2 45 -35 -58 26 42 -66 -26 72
5968 72 86 -67 -57 49 -28 -43 14 63 -79 -25 21 -40 -39 49 81 -35 -74 45 31 -7 5 -42 68 14 64 -25 -18 -7
$$ packed form
5788d0M1O6l6p6J7J07j2j34o2J71J01j62p1O0J30j04m1oM3NOl6n3P6O8j13j0P7
5816A2J01j38p2Q0J04j13l0R8j05P8M5r3o9P6J14j26p5P5J20p9j11R9L2jm6Rk5
5843d0O7j3j8j03Q1J75j76j30J16J99j13j16PJ15R3j50n7P8O0l1j28L8N6J82k52
5868f0j18J84J37j24j47J49Q7m5j23j6R2L8k9j68L6J82Lj86o0K52J04k59j62K18
5892a5J94j33k25J61P7K5n2j83J27J63p9j07o5J96N0j49j39K15J52k30j07J33
5914IJ00p7j15M8K5J44j42r4L8J58jj97J2J75L5j71p6J75R3j80n7P1Q8qp7k8p
5941e9J91k2j98lK14n0j24rJ12M2j13r6J58J3m7j9L6n5L1M3q0k3Q4J6j08M0R8
5968G2J4j53J0J06p7j5N7M9j42N4M6o1JQ8L2j16l9J19j4l8J2m7J10n4N0q9PJ1
$$ plain form
5996 -7 149 -29 -111 -10 113 -19 -106 -34 75 0 -43 -89 -38 34 48 -57 -108 29 84 -33 -145 -2 139 -26
6020 -26 -174 13 69 -7 -109 21 37 24 25 -46 -52 138 118 -47 -89 126 143 -87 -117 45 135 16 -108 9 75
6045 75 14 -99 -90 30 72 -21 -135 -53 93 79 -137 -137 126 202 -64 -124 32 151 -25 -107 -62 25 54 -8 -51 85
6071 85 120 67 -92 -115 145 65 -109 -110 42 99 -72 -112 25 80 28 -28 19 46 76 -3 -71 -7 121 26 -143 -62 105
6098 105 32 -157 -26 38 53 -43 -28 37 -39 -9 -35 -102 -41 49 34 -85 -33 99 -20 -134 -22 88 17 -43 47 41
6124 41 -38 -36 2 -38 -42 64 -18 -111 -46 6 20 -64 -19 -13 -73 -96 9 -9 -28 -1 11 37 -79 40 47 8 8 19 7 -38 6
6155 6 10 -23 46 40 -20 -57 26 105 8 -37 41 69 -12 -77 27 26 -13 -118 -16 91 34 -61 -40 -13 35 54 -114 -131 95
6184 95 68 -134 -75 67 137 -38 -108 41 100 -22 -58 -12 42 100 31 -65 6 100 74 -126 -70 124 65 -74 -48 69
$$ packed form
5996gJ56j78q2J01J23j32q7P2J09p5m3m6N1P2J4j05n1J37N5j17j12J43J41j65
6020b6j48J87N6p6j02J30J6j3Jp1oJ90k0j65m2K15J7k30l0J62R0j19j24J17O6
6045G5o1j13RJ20M2r3j14Q2J46j4k16%K63P6k66o0J56J19j76q2M5Q7K9o2m3J36
6071H5L5n3j59k3K60q0j74jJ52N7j71m0J37N5n2n6M7K7L0p9o8O4J28r5j69Q1J67
6098A05p3j89J31O4J5r6J5O5p6L0k6o7O1R0j5j19N2J32j19j14J12J10p1o0R0o
6124D1p9KL8m0mJ06q2r3O5N2J4q4M5Oo0k3J05j8j9K7J2K6j16J19Pl9%J1j2m5M4
6155FMl3O9oo0l7Q3P9r7m5P8K8q1o5J04jl9j05J02J07n7r5K1K7M8J9j68j7K26
6184I5k7k02N9J42P0j75p0J49N9j22l6M6N4N8o9r6P1R4k6k00N6J94n9j39K6J17
$$ plain form
6210 69 68 -18 -83 35 22 3 -98 -117 28 137 13 -174 -98 98 41 -159 -112 125 95 -96 -102 99 35 -49 -56 -11
6236 -11 82 64 -54 -112 27 75 19 -94 -10 123 43 -136 -50 124 96 -48 0 33 126 -13 -67 -66 26 16 5 -128
6262 -128 37 75 -63 -94 5 69 -21 -58 -21 38 21 -7 12 -20 7 30 24 -77 -36 71 26 -25 10 57 39 -19 -20 49 -17
6291 -17 2 35 -28 -45 16 15 -1 18 5 -34 -39 7 26 -38 -2 2 -9 -24 -10 24 -36 -50 17 26 -42 -81 85 87 33 -23 17 -12
6323 -12 2 -17 3 -22 5 41 6 -33 120 59 -27 -50 35 64 -3 -79 36 71 -26 -39 24 3 -4 28 -49 -41 81 64 -153
6352 -153 -34 118 42 -153 -85 58 64 -38 -10 54 32 -2 -52 -11 22 58 26 -130 -4 112 -2 -39 -31 127 23
6377 23 -111 -39 100 14 -110 -48 -49 53 15 -48 -112 64 36 -89 -113 1 140 -35 -149 -18 121 -12 -136 2
6401 2 65 18 -22 -43 46 96 60 -77 -67 75 76 -45 -84 -12 10 -24 -108 39 72 21 -24 29 43 -32 -9 -45 -8 72 85
$$ packed form
6210F9jq6o5J18j3j9j01j9J45J09j24j87P6J96n7k00M7K37l0j91oK01o4q4pM5
6236a1R3j8j18n8J39M8n6j13Q4J33q0j79Q6J74k8j44M8L3R3j39n4JR2j0j1j33
6262a28J65L8j38l1R9O4r0l7L7N9j7k8J9l2K7K3oj01M1J07m5n1L5M7j8n8jO9o6
6291a7J9L3o3j7O1jj6J9j3l9nM6J9o4L6Mj1j5J4L4o0j4O7Ro8l9J66Kn4n6M0k9
6323a2J4j9K0k5K7L6l5l9J53o1q6k3Q5K9o7p6J15L5r7j3O3k1pL2p7QJ22j7k17
6352a53J19J52p6j95O8J43Oj02K8O4k2l4n0M1L3L6l2j56J26J16j14l7QJ58j04
6377B3j34P2J39q6j24O2jJ02l8o3o4J76k8j25k4J14J39j75j14J31J39j33j24J38
6401BO3m7m0k1Q9N0l6j37J0J42Jj21l9P2K2l4q4J47L3n1m5N3J4p5K3l6L7Q0J3
$$ plain form
6430 85 -73 -52 31 41 -71 -61 -32 54 -49 -38 15 -7 -35 36 27 26 -1 7 9 -57 33 11 -3 15 63 10 -50 -49 80 2 -19
6461 -19 11 56 -20 -89 5 -37 -64 -15 16 33 -14 19 20 -24 50 5 -23 -26 14 47 -55 -97 46 60 -67 -35 29 28 -9 -27
6491 -27 61 25 -26 7 14 23 70 -6 -105 27 67 42 -121 -44 83 5 -55 -99 32 29 -18 -37 -42 42 22 -10 -55 15 117 -24
6521 -24 -144 -10 146 14 -108 -14 69 31 -76 -34 53 68 79 35 -27 55 25 -40 -84 68 54 -8 -104 -40 92 -77
6547 -77 -88 22 89 -10 3 -1 5 46 48 -50 -113 37 49 -96 -65 33 49 -29 -108 0 50 7 -52 40 -7 -33 2 -21 -50 45
6577 45 5 -22 -8 91 60 -51 -41 34 74 -93 -49 117 104 -47 -51 26 22 8 -8 -66 -1 -1 33 -71 -50 -1 -39 -62 -30
6606 -30 58 32 -7 23 59 -8 -20 5 -1 -52 -37 -14 -12 11 69 -29 45 -2 45 -3 -26 53 22 -27 -2 44 -13 -7 -62 12 -13 -6
6638 -6 -12 48 17 -7 -9 -55 -31 24 26 -83 -29 25 28 -109 -33 108 56 -70 33 33 -16 -4 -7 -46 65 56 -23 -34 28 74 24
$$ packed form
6430H5j58K1Q3J0j12J0K9Q6j03J1N3k2k8P1rjk7QKo6R0k2j4J8M8n3o0JJ29p8k1
6461a9L0M5p6o9R4m2k7M9L1J7m7L3Jm4P4m5k8lM0L3j02m2J43J4j27L2O4jl7j8
6491b7Q8l6n1L3PRM7p6r9J32M0k5j63P7J27p8o0m4J31lm7j9nQ4k0l2m5P0J02j41
6521b4j20J34J56j32j22R4Q3l8j07M2Q7J5J1m4o2Q2l0o5m4J52j4o2r6O4J32j69
6547g7j1J10O7r9J3mOM1Kr8o3J50J2j45L1R8J6p8p9J08N0m3n9R2m7k6L5k3k9R5
6577D5m0k7J4R9l1j11J0P5M0j67M4J66j3j51mP7mj4j6n8O5%L4j04K1M9l8k3L2
6606c0Q8k6l9L0L6o7j2K5on1J5K3KK3N8r8P4m7M7m8k3P9l1m9K5M6n7On5P4k5P
6638foO0l1k4km6K4N5Kj09N4N4Lj37P6J41n2j26J03%m9J2ll9J11rp9j1O2M6n0
$$ plain form
6669 24 -68 12 44 2 -93 -5 58 -7 -68 -19 28 22 -34 -12 -39 32 20 -78 -90 67 108 -49 -129 43 51 -12 -114 -38 114
6698 114 -6 -49 -37 11 14 66 -31 -11 59 116 -32 -6 58 96 -69 -66 55 80 -54 -103 -32 7 50 -17 -24 2 3 -12 -49
6727 -49 -28 52 18 -48 -77 50 89 -25 -63 56 35 -34 -30 41 57 8 38 -4 5 23 4 -55 -10 18 48 -62 -78 47 -11
6756 -11 -30 12 72 15 -36 -25 15 -18 78 -24 39 -22 53 -9 -66 -30 31 -28 -110 4 32 -31 -31 19 41 17 29 49 60 28
6786 28 5 -9 -17 -2 29 -39 -36 42 4 -51 -9 64 16 -36 -2 15 6 -62 -26 25 12 -14 21 32 8 26 -71 -56 -16 1 -21 -69
6818 -69 52 50 -30 -139 -37 94 32 -60 49 49 -28 -24 15 5 4 57 -85 -8 78 112 -20 -13 84 102 -84 -107 -34 82
6846 82 1 -52 -18 30 -25 -85 -76 0 71 39 -83 1 66 -11 -99 -59 37 28 -92 -40 36 70 -7 -29 -20 40 12 7 -50 19 110
6877 110 18 -70 -28 98 -11 -71 -64 49 26 -87 -63 -30 31 2 -40 -51 -20 25 -19 -29 12 78 -6 -99 -28 114 42 -50
$$ packed form
6669B4r2Q0L2m2r5Q8O3o5o1M9M7on6K2k7P1j2r8j2J57M1j57q0J72Qo3j02P6J52
6698A14j20m3J2M8LN2r7K0P0N7j48K6O4L8j65LJ21K5j34m9P1L9M3o7pK6Jj5l7
6727d9K1Q0l4o6k9J27L9j14l8J19k1o9MP1J6m9L0m2RJ8j9n9M5K8L0j10j6J25n8
6756a1j9M2O0n7n1J1M0l3R6j02O3o1P5o2n7L6O1n9q2J14K8o3%N0K2k4J2K0J1l2
6786B8k3j4qJ5L1o8LP8l8n5M2P3m8n2L4J7ro8L6N1j3k6L5J1k4J8r7J5M0J7k2m8
6818f9J21kq0j09J02J31o2r2J09%p7ML9j0jN3j42P7Q6L4j32PR7J8j86k3P3J16
6846H2q1n3L4M8n5o0RP6P1l2j22Q4O5p7q8M0R6rj20N2P6L4p7k2RO0k8nn7O9R1
6877A10r2q8M2J26j09o0PJ13k3j13K4L3O1k9m2j1L1M5m4j0M1O6q4r3P1J42p2r2
$$ plain form
6905 -50 -51 56 36 12 17 -57 -16 -1 -17 30 16 20 0 -34 21 33 -29 -30 45 -1 28 -57 75 12 -14 -58 53 7 -31 5 38
6936 38 -1 -7 -8 -13 13 48 -13 -63 -30 42 10 -73 -46 25 -3 2 24 13 42 -58 -19 -41 68 47 8 -51 -12 40 -29 -105 56
6967 56 89 36 -104 -63 47 7 -79 9 17 -17 -39 -37 -42 16 43 -68 -45 43 20 -64 -41 -16 64 -90 -28 52 22 -16 -35 40
6997 40 76 27 -59 -11 -20 26 22 -6 -18 31 21 -76 -30 101 31 -41 -39 29 12 36 -76 -24 0 26 -79 -87 -6 61 -58 -52 5
7028 5 63 6 -91 -47 62 16 -7 -42 32 38 26 -36 -30 -13 88 6 -72 28 70 7 -55 9 93 2 -71 32 46 -61 -14
7057 -14 -44 -13 29 32 -13 -78 42 6 -20 -70 11 34 16 -88 35 12 20 -39 7 31 33 -46 -3 -14 22 22 30 -26 58 16 -28
7088 -28 -46 45 31 -68 23 7 -25 -15 -51 63 26 -47 -31 12 13 12 -11 -21 -8 54 17 -66 27 49 -10 -59 13 27 -27 -10 24
7119 24 53 9 0 6 81 25 1 -22 47 23 -6 53 -67 39 86 -45 -42 37 72 -73 10 45 46 -44 6 11 11 13 -100 -44 -35 39
$$ packed form
6905e0jJ07k0k4Np4M1J5j6M7j4Mk0l4N5J2o2jP5m6K9q5J32o3k6m4J11m6l8L6L3
6936C8l9ojnK6L5o1n0L3P2l2q3K7P1k8NK2j1K9j00L9k2J09k1l9n9L9N2o9p6J61
6967E6L3n3j40M1J10m0q6Q8Ql4k2KnN8K7j11K3Q8k3q4K3K5Q0j54O2Q0l0l8j9P5
6997D0L6m9q6M8rM6mk8j2M9j0r7M6J31p0p2KO8j7K4j12N2K4K6j05qQ1O7j19ON7
7028EN8n7r7M4J09m6k3l5P4Oj2o2OJ7J01q2p8J00M2o3o2O4Q4r1p3J03J4j07M7
7057a4l0L1M2Lm5o5J20l6k6n0Q1K3j8j04J23k3Qn9M6K4Kp9M3j1L6%Qn6Q4m2m4
7088b8j8R1j4r9R1j6l2J0l6J14l7p3J6M3Jjk3j0J3O2l7q3R3K2n9m9P2J4n4J7L4
7119B4K9m4rOP5n6k4k3O9k4k9N9j20J06M7j31LP9L5j45Q3L5Jr0N0N%Kj13N6RP4
$$ plain form
7151 39 -9 -74 -2 44 -22 -76 6 84 60 -45 -27 39 17 -36 11 19 9 7 -51 -47 37 93 24 -71 12 94 11 -90 5 59 -31
7182 -31 -107 38 61 -22 -22 -24 -24 33 9 -45 -51 52 -39 -77 -32 0 65 -19 -88 1 31 -11 -78 38 42 11 2 -32 -32 26 55 -47
7214 -47 -14 74 59 -25 -39 44 44 -52 -64 44 19 -69 -45 -4 -4 -31 28 16 -44 -27 27 -10 9 5 39 -42 -20 52 -5 -9 -17 30
7246 30 27 -2 -12 7 -5 20 -40 12 11 8 -35 26 6 46 -50 -47 40 69 -24 -47 2 24 -76 -59 -35 15 46 -46 -37 -22 11 -29
7278 -29 -89 -21 29 24 35 -20 72 37 -40 -10 95 54 -29 -55 49 -7 -33 -7 7 -17 2 32 -75 61 64 30 -39 -23 48
7307 48 32 -111 -21 77 -38 -60 -22 9 39 14 11 -61 -13 23 -32 -28 43 53 -27 -35 35 85 31 -62 53 34 47 11 2 65 -21
7338 -21 16 -45 16 65 52 -61 -13 23 23 -28 -66 53 26 -20 -43 7 14 21 -34 16 -16 5 68 -51 -63 28 22 -39 -28 59 22
7369 22 -13 -29 11 62 10 -3 83 11 -46 23 0 63 72 -17 0 44 30 4 0 11 70 32 -33 -26 28 31 -66 -47 -6 29 -34 -32 -41
$$ packed form
7151C9m8o5P2M6o6n4Q2P8k4j05J8O6k2n3M7Qj0kn8MQ4N6o9r5Q3Q2q3j01R5N4r0
7182c1p6J45K3q3%k%N7k4n4oJ03r1l8M5L2O5q4o9Q9L0m2o7J16Ml1rl4%N8K9j02
7214d7L3Q8j5q4j4Q3%r6j2J08k5q8K4M1%k7N9j2o0J7N4l7J9mL4q1K2P2n7mqM7
7246C0lk9j0J9j2K5o0N2jlm3O1k0M0r6LQ7K9r3k3M9K2j00J7K4N0L1r2RJ5L3m0
7278b9o0O8N0nJ1n5R2l5p7L0J05m1q3k6J04n6k6K6J4k4J9L0j07J36Ll4o9J6P1
7307D8j6j43R0R8j15k2L8L1L0k5lp2M8L6n5MP1J0q0qP0N0n4r3J15j9J3l6rO3q6
7338b1L7o1O1M9j3j13M8L6%n1l8J19k7m6k3N0PPn5N0l2K1O3j19j2R1oo1J1Q7l7
7369B2l5j6M0N1n2j3Q6p2n7O9k3O3Rq9J7M4j4k6mJ1N9l8o5PN4Lr7J9M1L5o3Kr
$$ plain form
7402 -41 15 13 -39 -31 11 44 -64 -52 88 69 -53 -31 15 26 -18 -7 34 9 -21 -2 15 27 6 29 -17 -12 -8 -16 -42 -21 35
7433 35 -9 -16 -32 -21 16 -6 -23 15 -8 64 -77 -32 -13 -10 -2 -83 46 67 -16 -57 7 25 36 -53 31 43 6 24 -25 -2 36
7464 36 29 6 -13 1 39 -17 -95 3 84 21 -80 -37 60 -50 -68 -30 40 -33 -84 -37 -3 20 -56 -64 -54 34 72 -66 -29 55
7494 55 1 -89 -36 59 73 -12 -53 30 43 27 -4 16 62 39 45 -9 -22 56 41 -45 -43 65 51 -119 -104 14 3 -88 6 -17
7524 -17 13 3 -41 5 33 5 -36 -39 -43 53 -29 -84 -14 124 9 -57 -9 40 -5 -46 35 45 14 32 17 -16 16 14 -45 -23 47
7555 47 49 -30 -38 32 36 -63 -26 34 21 9 -14 8 27 36 -14 1 -3 27 14 6 -65 31 14 -41 -16 90 40 -102 -17 84 -3 -28
7587 -28 -32 79 37 -14 18 -53 -12 -14 8 -73 -3 13 -13 -61 -25 59 -41 -58 -18 24 9 -80 2 -11 -20 -20 -29 -10 26 -34 -67 -79
7619 -79 32 43 -27 -70 16 84 -17 -48 45 84 15 24 -12 40 24 -28 -11 -29 54 7 -33 -76 18 23 -82 3 20 45 -68
$$ packed form
7402d1N6kn2QM2L3j08J2J40j9j22K2M6J1m4J1M1k5l0J9J7J2k1K3m6NMqk6K1N6
7433C5m4pj6J1L7k2j7L8k3P2j41M5J9LQq1J29K1q3m1O4J8J1q9Q4J2l7J8m9K3L8
7464C6pk3j9J4L8n6p8R8Q1o3j01M3R7j10j8L8P0p3n1M7L4K3p6qJ0Q8L8j38L7Q4
7494E5n4r0N3R5J4q5m1Q3J3j6l1K0M6k3On4j3P8j5q6KJ08j4j70J5J18j1r1R4k3
7524a7L0j0m4M6K8k8m1lmR6q2n5P0J38j15o6M8M9m5m1Q1J0l1J8j5l3L2kn9K2P0
7555D7Kp9qP0Mr9L7O0j3j2k3K2J9Rn0J5mL0j3qp1R6j7n5K5J06n0j42Q5J01q7k5
7587b8mJ11m2n1L2p1M1kK2q1P0J6k6m8L6Q4j00j7M0M2j5q9Q2j3r%rJ9L6o0l3j2
7619g9J11J1p0m3Q6O8j01l1R3L9o9Rl6N2j6n2J7j8Q3m7m0m3R4Nj05Q5J7K5j13
$$ plain form
7648 -68 -68 37 27 -49 -66 -25 15 -5 -51 -26 13 57 0 -86 -29 72 21 -45 -8 90 30 -53 -55 37 99 -11 50 39 -4 17
7678 17 18 -27 -29 27 5 -94 -1 67 -6 -29 12 26 -12 -69 9 -16 -37 -10 -21 -25 5 -5 -13 -18 56 33 4 22 -14 55 -36 16 16
7711 16 59 2 22 -2 42 28 14 2 49 -10 -14 -45 -5 39 -7 -16 -39 -9 -2 -45 -42 2 -7 -34 12 15 45 -48 -14 -23 48 57 -6 -6 -26
7746 -26 -2 -11 -17 19 36 25 -11 -58 27 -28 -37 29 16 4 -55 -1 -32 57 67 12 -56 26 40 16 -29 7 38 -18 -53 -3 33 -42
7778 -42 -2 9 -2 -15 -18 -37 7 32 -81 -28 -1 21 9 -55 26 88 77 -42 -30 35 20 16 -35 -67 19 62 -25 -7 30 12
7808 12 37 -79 13 61 -48 -54 -5 68 2 -19 -3 -1 2 3 -63 -33 30 30 -26 -43 40 10 11 -118 31 41 -105 -37 41 59 0
7839 0 8 42 23 25 -48 20 51 33 32 29 -24 68 34 -44 -73 3 41 -45 -31 -7 44 -46 3 37 -7 4 18 15 -3 53 -20 -3 -10 25
7873 25 21 -54 -9 63 10 -26 13 41 49 -10 -13 14 -20 14 -4 -37 41 24 -28 -1 35 52 -42 -117 -23 27 -5 -52 23 -5 -31 -50
$$ packed form
7648f8%J05j0p6j7M1M0k0m6K5L9M4n7q6N7J01n1o6L7R8o0q3kR2O2j10O1j1m3K1
7678A7Jm5kN6k2r9R3O8p3k3M1J4l8n7P8k5k1K7j1mL0j0qnP4k3k9J8l6O9r1N2%
7711A6M3n7K0k4M4j4j4j2M7n9ml1M0M4m6rk3L0Pm3LM4rk7M6LL0r3L4rP1Ro3%k0
7746b6K4roL6J7j1l6m7Q5n5rO6j3j2n9N4l1Q9J0n5o8Q2J4k4m5L6L1n6l5N0L6p5
7778d2M0J1j1j3lj9M4K5j13N3K7K2j2o4Q1O2j1j19J2O5j5mn1l2Q6M3q7J8L7j8
7808A2K5j16R2M8j09oM9P3o6k1J6KLJo6L0O3%n6j7Q3l0Jj29J49J0j46O8P8J8n9
7839@QL4j9Kp3O8L1j8jln3R2l4p8k9P6L8q6J4K4N1r0M9L4m4J1J4lj8N6p3J7pL5
7873B5mp5M5P2n3l6L9K8Qn9lK7l4L4j8l3P8j7n2K7L6J7r4p5R4N0l2m7P5k8k6j9
$$ plain form
7905 -50 -26 20 -5 -5 -12 8 5 -34 2 7 31 -9 -83 -61 38 37 -43 -35 58 13 -16 -36 7 10 15 8 -35 -31 -7 -59 -33 28 34 68 -78
7940 -78 -9 10 24 -46 -21 39 -23 -24 -44 -13 37 -13 -6 0 55 75 -34 -70 60 68 -34 -12 38 82 44 43 34 42 26 -39 -39 30 -17
7973 -17 40 9 -29 39 12 -50 -58 49 35 -47 -66 -41 32 -68 -40 -12 25 -53 -24 -24 -55 46 8 -2 10 62 33 -40 -13 30
8003 30 -12 -98 -10 30 3 -4 8 -19 38 -13 8 -3 -36 34 30 -29 -31 20 -10 -109 -28 -5 -39 -54 -44 -9 -25 -2 -47 0 6 11 -24
8036 -24 20 63 17 -27 22 32 -19 32 -40 30 88 25 -43 4 23 -19 -12 -6 26 19 -8 -3 17 43 55 -71 -7 51 10 -9 16 54
8068 54 42 15 -68 19 0 -56 -17 0 26 28 25 11 26 68 -4 -19 13 48 8 -39 7 65 -5 -3 14 43 21 -48 -3 24 28 -3
8100 -3 -4 -34 27 26 -38 2 -25 55 -74 -78 14 34 -6 -103 -3 -13 44 -4 18 10 62 25 -26 36 8 -25 -78 -17 99 -27 -34
8131 -34 -30 59 5 28 -32 18 37 -7 46 -16 -3 48 -18 -61 3 49 20 -93 -4 13 -13 -73 -56 15 8 -37 -8 17 40 -50 -31
$$ packed form
7905e0K4M6k5%pK0ll9L6NK4m0p4K2R9jq0QR3m5k9k0M3LNpm3MK4n2K6O1OL4j46
7940g8O9J9J4p0K5O0o2jk0L1N0n0PON5K0j09l6J30Qj02K2N0M4l8jrQj6o5%O9m7
7973a7N7l1l8O8k7o2qJ07j4q2j9K5P3j00K8K8L7p8K9%l1J01l8j0J2N2k9p3K7M3
8003C0m2q6Q8M0k7pJ2k7N7n1K1j1l3P0mn9kN1l0r9Q1K3l4j5J0L5j6K3m5M7ONl5
8036b4M4M3m6m4M9J0n1N1p2P0N8o3o8M7J9m2POL2pk7NK0K6J2j26O4N8m1j9K5L8
8068E4j2k7q3Q7j9n6L9J7K6Klj4J5M2p2j5L2L5m0m7M6N8p0KJ7K9k2o9M5K7Ml1
8100cjl0O1jo4M0k7Q0j29mR2K0m0r7J00j0N7m8K2qN2l7n1O2k8l3n3O1J16j26p
8131c4MQ9n4K3o0N0J9m4N3o2J3N1o6m3O4M6k9j13Q9J7k6o0J7P1pm5K9K5K3r0J9
$$ plain form
8162 -31 4 -7 20 -39 14 4 53 5 -80 62 75 -33 -44 -19 55 17 -26 -7 73 -7 2 35 9 37 24 -13 -1 69 -61
$$ packed form
8162c1L5j1K7n9N3j0M9m8q5J42J3j08j1K5P4l8m3J9Q0q0RL3k6K8j3l7J2P0j30
8191f1
$$ Imaginary data points
##PAGE= N=2
##DATA TABLE= (X++(I..I)), XYDATA
$$ plain form
0 0 0 0 0 0 0 0 0 0 0 0 0 0 0 0 0 0 0 0 0 0 0 0 0 0 0 0 3 -1 2 -3 4 -4 4 -7 8 -8 13 -14 16 -20 23 -27 29 -34 39 -44 48 -54
48 -54 62 -68 73 -83 88 -96 103 -110 114 -117 116 -110 91 -60 1 113 -325 742 -1660 4043
68 4043 -12535 94957 651230 113195 -603430 -143742 464025 178516 -298703 -196375 103075
79 103075 207850 89658 -207321 -273234 198096 423203 -176829 -531061 146762 582303
89 582303 -105233 -573257 60660 508118 -11185 -397333 -36027 257676 84490 -102107
99 -102107 -127639 -53708 164450 195452 -190887 -311193 204549 387865 -205788 -421755 191319
110 191319 407047 -165627 -352125 128068 264459 -82436 -158782 29646 46566 26647
120 26647 61537 -79832 -152722 127757 220053 -163843 -253821 188817 254398 -198349 -221090
$$ packed form
0@%%%%%%%%%%%%%%%%%%%%%%%%%%LmLnPqQj1J5j6K1k7L0l6M3n0N6o3P3q3R2j02
48e4J16j30J41j56J71j84J99k13K24k31K33k26K01j51O1J12m38J067k402N703
68D043j6578J07492N56273n38035p16625M59688O07767k85509m77219J02328K99450
79A03075J04775j18192k96979o5913M71330K25107o00032l54232O77823M35541
89E82303o87536m68024O33917M47458n19303l86148L61306K93703j73186j86597
99a02107k5532P3931K18158L1002l86339j20306N15742J83316n93653k15967O13074
110A91319K15728n72674j86498M80193J36391l46895p6346J88428J6920j9919
120B6647L4890j41369p2890K80479R2296l83896q9978M42638O5581m52747k2741
$$ plain form
131 -221090 194216 162332 -176640 -88780 146491 10971 -107303 59097 59736 -116399 -11125
142 -11125 151757 -36967 -163626 78922 148761 -113114 -110192 137261 53312 -149585 14880
153 14880 151670 -82179 -141982 141314 124363 -181723 -98394 200447 69111 -193004 -38083
164 -38083 159389 7717 -102212 19573 25822 -44129 58883 62306 -144644 -75957 217874
175 217874 82852 -271294 -85257 296610 83305 -290839 -78203 254425 72418 -188442
185 -188442 -64717 100667 57206 2816 -47327 -108548 37207 206955 -25331 -286591 11784
196 11784 338669 3448 -358540 -21623 342621 40312 -294717 -61409 216870 81160
206 81160 -117916 -99647 5631 112817 107784 -119643 -210924 119207 294684 -108859 -349403
$$ packed form
131b21090M15306l1884l38972Q7860K35271j35520j18274J66400O39j76135J05274
142a1125J62882j88724j26659K42548O9839k61875K922K47453q3949k02897J64465
153A4880J36790k33849n9803K83296j6951l06086Q3329K98841j31336k62115J54921
164c8083J97472j51672j09929J21785O249o9951J03012L423k06950O8687K93831
175B17874j35022l54146J86037L81867k13305l74144K12636L32628j82007k60860
185a88442J23725J65384m3461n4390n0143o1221J45755J69748k32286k61260K98375
196A1784L26885l35221l61988L36917L64244l02309l35029K33308K78279j35710
206H1160j99076J8269J05278J07186n033k27427r1281L30131J75477m03543k40544
$$ plain form
217 -349403 89791 371578 -60341 -357082 24645 309946 16849 -233804 -60216 136383
227 136383 101461 -27859 -137287 -81524 163130 178670 -178648 -256768 179599 306602 -166543
238 -166543 -325873 138446 312616 -98288 -270602 48814 205546 7291 -123415 -63282
248 -63282 34692 115922 52910 -158501 -128629 189400 187452 -204178 -223937 201263 235858
259 235858 -181183 -224013 144943 190397 -97303 -141359 40224 81109 18994 -18169 -76337
270 -76337 -41327 125708 90029 -163666 -123579 187131 140249 -192847 -137575 182520 119099
281 119099 -155859 -86626 117598 47211 -69890 -4937 18401 -33920 31635 63455 -76446
292 -76446 -80876 110838 82847 -134182 -71715 142550 47269 -138017 -14873 120824 -21897
$$ packed form
217c49403M39194K81787m31919k96741L81727K85301k93097k50653J73588J96599
227A36383l4922j29320j09428N5763K44654J5540l57318p8120M36367J27003m73145
238a66543j59330M64319J74170m10904j72314L19416J56732j98255j30706O0133
248f3282R7974Q1230o3012k11411K9872L18029j948l91630j9759M25200L4595
259B35858m17041m2830L68956M5454k87700m4056J81583M0885o2115l7163n8168
270g6337L5010J67035l5679k53695M0087L10710m6882l33096N5272L20095o3421
281A19099k74958O9233K04224p0387j17101O4953K3338n2321O5555L1820j39901
292g6446m430J91714k7991k17029O2467K14265r5281j85286J23144J35697j42721
$$ plain form
303 -21897 -94510 57082 62106 -85440 -26981 103772 -5496 -107395 33946 96942 -53934
314 -53934 -71179 65846 34234 -68047 10972 62056 -58969 -49980 103866 33505 -141223
325 -141223 -16876 164594 1094 -172398 9736 161084 -15594 -132201 14503 87024
335 87024 -7463 -30106 -3956 -32197 18751 94881 -33036 -149692 45702 192470 -52327
346 -52327 -216606 52549 220331 -44790 -202500 28765 164597 -6040 -110653 -22595
356 -22595 44543 52100 25304 -81037 -93636 104552 152715 -120036 -198136 124060 224917
367 224917 -115026 -230249 93756 215253 -60168 -180079 18236 129612 29742 -67060
377 -67060 -77215 532 120680 64544 -155330 -122077 176722 166373 -182633 -194471 170634
$$ packed form
303b1897p2613J51592N024j47546N8459J30753j09268j01899J41341O2996j50876
314e3934j7245J37025l1612j02281P9019N1084j21025Q989J53846p0361j74728
325a41223J24347J81470j63500j73492J82134J51348j76678j16607J46704P2521
335H7024r4487k2643K6150k8241N0948P6130j27917j16656J95394J46768k44797
346e2327j64279K69155J67782k65121j57710K31265J35832j70637j04613Q8058
356b2595O7138P557k6796j06341j2599J98188M8163k72751p8100L22196J00857
367B24917l39943j15223L24005J21497k75421j19911J98315J11376r9870r6802
377f7060j0155P7747J20148n6136k19874L3253K98799j0349l49006j1838L65105
$$ plain form
388 170634 202444 -143261 -192335 100894 164331 -48300 -122690 -10362 71486 69039 -16630
399 -16630 -121918 -35272 165165 80979 -192847 -115079 203482 136162 -194518 -141770 168398
410 168398 133984 -126726 -114314 73243 85289 -13791 -51446 -46735 15825 101210 15999 -146330
422 -146330 -42943 176152 61496 -189074 -71387 183516 71850 -161234 -64079 125076
432 125076 50636 -77870 -32367 25995 13774 26647 3757 -73350 -16533 110995 23766
443 23766 -135485 -24568 144915 18699 -139819 -8259 120691 -6371 -91819 20983
453 20983 55184 -34583 -16298 43615 -21273 -46737 53080 42472 -75820 -30513 87990 12787
465 12787 -87834 9928 77597 -33735 -58110 57403 33812 -76762 -7212 89817 -17743
$$ packed form
388A70634L1810l45705m9074K93229O3437k12631p4390J12328Q1848k447q5669
399a6630j05288Q6646K00437q4186k73826P7768L18561o7320l30680N2748L10168
410A68398l4414k60710J2412J87557J2046r9080l7655M711O2560Q5385q5211j62329
422a46330J03387K19095j14656k50570J17687K54903j11666k33084R7155J89155
432A25076p4440j28506M5503N8362j2221J2873k2890p7107N6817J27528q7229
443B3766j59251J10917J69483j26216j58518J31560J28950j27062q5448J12802
453B0983L4201q9767J8285N9913o4888k5464R9817j0608j18292M5307J18503p5203
465A2787j00621R7762O7669j11332k4375J15513k3591j10574O9550R7029j07560
$$ plain form
476 -17743 -94725 37575 89630 -50228 -75560 52687 51854 -46552 -22365 31378 -11320 -10592
488 -10592 45355 -13439 -77035 36976 103284 -56132 -120305 69323 127389 -72976 -122104
499 -122104 67238 105819 -50482 -78546 25480 43940 5491 -5205 -39235 -34454 71155
510 71155 70699 -98275 -101452 115741 122159 -122830 -132441 116573 130365 -97310 -117166 65918
522 65918 93884 -24947 -62957 -20832 28396 67766 7924 -109333 -41847 142323 72002
533 72002 -161717 -94571 166150 108341 -154641 -112661 127168 106897 -86760 -93242 36094
544 36094 72195 18218 -47734 -72099 20735 119053 5675 -155080 -29727 176353 49582
555 49582 -180778 -62986 168641 70198 -139876 -70304 98330 65353 -47147 -55537 -7368
$$ packed form
476a7743p6982J32300N2055j39858k5332J28247q33r8406K4187N3743m2698P28
488a0592N5947n8794o3596J14011O6308j59416o4173J89628N8066k00365m9128
499a22104J89342L8581j56301k8064J04026J8460l8449j0696l4030M781J05609
510G1155m56j68974l177K17193O418k44989r611K49014J3792k27675j9856J83084
522F5918K7966j18831l8010M2125M9228L9370n9842j17257O7486J84170p0321
533G2002k33719O7146K60721n7809k62982M1980K39829k0271j93657o482J29336
544C6094L6101n3977o5952k4365R2834R8318j13378j60755J25353K06080j26771
555D9582k30360J17792K31627r8443k10074O9572J68634l2977j12500q390M8169
$$ plain form
566 -7368 43431 60262 -30071 -106451 16344 141126 -3903 -162075 -7279 166544 15213
577 15213 -155685 -21131 129739 24287 -92104 -25948 46623 26554 1624 -25990 -46763
588 -46763 25873 85352 -24744 -112808 23860 128071 -22364 -129142 21218 117410 -19886
599 -19886 -94579 17729 63033 -14711 -27387 9826 -8975 -3990 40535 -3914 -65303 12270
611 12270 80154 -21159 -84629 29687 78614 -37409 -63289 43936 41643 -47256 -15467
622 -15467 47519 -10436 -43396 33625 35638 -50052 -24161 58314 10072 -57690 4921 47938
634 47938 -20405 -31315 34230 8868 -46694 15059 55212 -38622 -59982 57594 59851 -69463
646 -69463 -55193 72099 46633 -64512 -34100 48386 19865 -24119 -3665 -4071 -12249 34434
$$ packed form
566g368N0799J6831r0333p6380J22795J24782j45029j58172J54796J73823j51331
577A5213j70898J34554J50870j05452j16391O6156P2571k0069k4930k7614k0773
588d6763P2636N9479j10096q8064J36668J04211j50435j06778J50360R6192j37296
599a9886p4693J12308M5304p7744j2676L7213j8801M985M4525m4449o1389P7573
611A2270O7884j01313o3470J14316M8927j16023k5880J07225k293q8899L1789
622a5467O2986n7955l2960P7021K013q5690K5891Q2475m8242o7762O2611M3017
634D7938o8343j0910O5545k5362n5562O1753M0153r3834k1360J17576K257j29314
646f9463J4270J27292k5466j11145L0412Q2486k8521m3984K0454m06q178M6683
$$ plain form
658 34434 27647 -62518 -40639 85391 50090 -100365 -55798 104474 56760 -97620 -54187
669 -54187 78910 47271 -51167 -37957 16184 26120 21898 -13015 -59516 -331 92981 13508
681 13508 -117797 -24600 132139 33930 -133067 -40291 121015 44590 -96082 -46084 61197
692 61197 45144 -19830 -41944 -24244 36132 66063 -28732 -102440 19093 128416 -8824
703 -8824 -142292 -2097 141985 12615 -127933 -22688 101728 31594 -65668 -38186 24609
714 24609 43053 18413 -44883 -58139 44502 91991 -40969 -115780 35149 127645 -27401
725 -27401 -127070 17425 113958 -6307 -90531 -6245 58676 18293 -22889 -30033 -13686 39997
737 39997 47126 -47571 -74424 52072 93063 -52537 -100804 49689 98458 -42444 -85566
$$ packed form
658C4434o787r0165K1879J26030l5301j50455M4567J60272m7714j54380M3433
669e4187J33097l1639r8438J3210N4141R936m222l4913m6501N9185R3312p9473
681A3508j31305R3197J56739r8209j66997R2776J61306p6425j40672M9998J07281
692F1197j6053o4974k2114J7700O0376K9931r4795p3708J21533J09323j37240
703h824j33468J40195J44082j29370j40548J05245J24416p0134r7262K7482O2795
714B4609J8444k4640o3296j3256J02641M7489j32960p4811J50929R2496j55046
725b7401r9669J44495R6533j20265q4224Q4286O4921m0383m1182p144J6347N3683
737C9997P129r4697k6853J26496M0991j45600m8267J50493M8769j40902m3122
$$ plain form
748 -85566 32187 65178 -18698 -38941 3957 10712 11014 16143 -25442 -39505 37208 56038 -46210
761 -46210 -65297 50896 65475 -51968 -58205 48647 44161 -41795 -25815 31785 5617 -19683
773 -19683 14006 6998 -29882 6087 41031 -17716 -45281 27814 42998 -34728 -33941 38814 19666
786 19666 -39665 -2425 37190 -16091 -32282 32590 24786 -45836 -16711 52661 7859 -52869
798 -52869 292 45760 -7536 -32081 12983 13236 -16308 8945 18317 -31221 -18256 51681 17290
811 17290 -66861 -15291 75708 13370 -76295 -11547 68236 9975 -52587 -9251 30156 8486
823 8486 -4060 -8517 -24103 7961 50339 -7310 -72559 5787 87901 -3359 -94904 -82
835 -82 92677 4942 -80674 -10209 60870 16304 -34270 -22148 4164 27695 27060 -31722 -55978
$$ packed form
748h5566J17753L2991q3876k0243M2898O755L02N129m1585j4063P6713J8830j02248
761d6210j9087J16193J4579j17443o237J06852m486q5956J5980N7600k6168k5300
773a9683L3689p008l6880L5969L4944n8747k7565P3095J5184p7726P87P2755j9148
786A9666n9331L7240L9615n3281j6191O4872p804p0622K9125O9372m4802o0728
798e2869N3161M5468n3296k4545M5064K53k9544K5253R372m9538J2965O9937l4391
811A7290q4151N1570R0999o2338q9665O4748P9783n8261o2562M3336L9407k1670
823H486j2546m457j5586L2064M2378n7649o5249P8346Q2114r1260r1545R4822
835h2R2759q7735q5616P0465P1079m4566n0574J2122K6312K3531o35n8782k4256
$$ plain form
848 -55978 33458 79526 -32957 -95763 29013 102314 -22387 -99576 12518 86581 -949
859 -949 -65744 -12068 38742 24955 -8492 -36632 -21851 45995 49796 -51324 -71572 52854
871 52854 86263 -49295 -91847 41592 88692 -29564 -76834 14631 58223 1778 -35031
882 -35031 -18729 9309 34215 15538 -47419 -38151 56269 55250 -60777 -66168 59858 69879
894 69879 -53631 -66421 42721 56738 -27608 -41659 10384 23905 8125 -4804 -25575 -12905
906 -12905 40926 28035 -52239 -38560 58600 43555 -59603 -43243 54909 37523 -45652 -28168
918 -28168 32054 15754 -16524 -2812 104 -9365 15502 19100 -28707 -25210 38726 27330 -43999
931 -43999 -24667 45153 18454 -41685 -9142 34631 -1373 -24630 12006 13206 -21360 -1841
$$ packed form
848e5978Q9436M6068j12483o2806J24776P3301j24701p7189J12094P4063q7530
859i49o4795N3676N0810j3787l3447k8140J4781O7846L801j01120k0248J24426
871E2854L3409j35558m2552J33439M7100j18256m7270R1465M3592n6445l6809
882c5031J6302K8038K4906j8677o2957R268R4420j019j16027n391J26026J0021
894F9879j23510j2790J09142J4017q4346j4051N2043J3521j5780j2929k0771J2670
906a2905N3831j2891q0274J3679R7160j5045j03158J6360R8152j7386q3175J7484
918b8168O0222j6300l2278J3712K916r469K4867L598m7807L497O3936j1396p1329
931d3999J9332O9820k6699o0139L2543M3773l6004k3257L6636J200l4566J9519
$$ plain form
943 -1841 27535 -8935 -30430 17329 28741 -23340 -23294 25556 13627 -24801 -1544 20924 -11847
956 -11847 -14848 24895 7541 -35802 177 43786 -6454 -46727 11324 45046 -13432 -37958
968 -37958 13225 26502 -10115 -11396 4679 -5747 1816 22709 -9003 -38249 15189 49987
980 49987 -19900 -57490 21558 59146 -20357 -55298 16043 45981 -8890 -31964 -261 14888
992 14888 11027 4204 -21404 -22508 30810 39008 -37338 -51601 40444 59607 -39375 -62188 33754
1005 33754 58768 -24513 -50367 11675 37038 2991 -20768 -18898 2583 33642 15195 -46014
1017 -46014 -31039 54340 43553 -57442 -51484 55134 54580 -46929 -52127 34423 45235 -18056
1029 -18056 -34170 -221 20635 18963 -5966 -36165 -8302 50037 20582 -59393 -30127 62743
$$ packed form
943a841K9376l6470k1495M7759J1412n2081M6M8850j1929l8428K3257K2468l2771
956a1847l001L9743j7354m3343L5979M3609n0240m0273N8051L3722n8478k4526
968c7958N1183J3277l6617j281J6075j0426P563K0893l1712k9246N3438L4798
980D9987o9887l7590P9048L7588p9503l4941P1341K9938n4871k3074L1703J5149
992A4888l861o823k5608j104N3318Q198p6346j4263R2045J9163r8982k2813R5942
1005C3754K5014q3281k5854O2042K5363l4047k3759J870K1481L1059j8447o1209
1017d6014J4975Q5379j0787j00995N958J06618n54j01509n198Q6550J0812o3291
1029a8056j6114L3949K0856j672k4929l0199K7863N8339k9455p9975K9266R2870
$$ plain form
1041 62743 35944 -60399 -38507 51984 37014 -39031 -32467 22341 25177 -3779 -16242 -14940
1053 -14940 6956 32384 2094 -46124 -9412 55437 14954 -58991 -18045 56982 19065 -49446
1065 -49446 -17927 37377 14801 -22232 -10587 5173 5497 11416 -1110 -26668 -2731 38205
1077 38205 4955 -45226 -5541 47159 4612 -43953 -2343 36484 -477 -25602 3989 13163
1089 13163 -6994 104 9216 -12235 -9895 22384 9030 -29163 -6570 31657 2406 -30361
1101 -30361 2360 25159 -7711 -17618 12573 7887 -17020 1866 20156 -10841 -21444 18069
1113 18069 20661 -22273 -17499 23418 12581 -20558 -5686 14807 -1790 -6510 9623 -2729
1125 -2729 -16660 12243 22550 -20572 -26919 26307 28588 -29134 -28026 28011 24387 -23446 -18848
$$ packed form
1041F2743k6799r6343K1892R0491j4970p6045O564N4808K836k8956j2463J302
1053a4940K1896K5428l0290m8218L6712O4849m0483p3945M0946P5027l7917o8511
1065d9446L1519N5304k2576l7033J1645J5760L24N919j2526k5558K3937M0936
1077C8205l3250n0181L9685N2700m2547m8565M1610L8827l6961k5125K9591R174
1089A3163k0157P098R112k1451K340L2279j3354l8193K2593L8227k9251l2767
1101c0361L2721K2799l2870r907L0191m686k4907J8886J8290l0997j0603L9513
1113A8069K592m2934M774M0917j0837l3139J4872K0493j6597m720J6133j2352
1125b729j3931K8903J0307m3122o347N3226K281n7722J108N6037l624m7833M598
$$ plain form
1138 -18848 14943 11328 -4144 -2940 -7928 -5663 19832 13871 -29886 -20649 37326 26071 -40814
1151 -40814 -28893 40289 29546 -35018 -27429 25904 23333 -13336 -17510 -1363 10427 16254 -3021
1164 -3021 -30294 -4756 41394 11650 -48934 -17867 51493 22081 -49071 -24480 41679 24761
1176 24761 -29936 -22983 14982 19731 1897 -14977 -18390 9733 33469 -3851 -44901 -1717
1188 -1717 52134 6820 -54149 -11093 50859 13967 -42696 -15841 30095 16189 -15039 -15816
1200 -15816 -1568 14286 17508 -12250 -31356 9710 41804 -6719 -47837 3751 49308 -426
1212 -426 -45727 -2400 38006 5148 -26710 -7328 13201 9229 1059 -10737 -14701 11544 26028
1225 26028 -11885 -34245 11265 38340 -10373 -38587 8652 34485 -6695 -27050 4459 17058
$$ packed form
1138a8848L3791l615j5472J204m988K265K5495n961m3757R237N7975j1255o6885
1151d0814J1921O9182j0743o4564P589N3333k571l6669m174J6147J1790N827j9275
1164c021k7273K5538M6150k9744o0584L1067O9360k9412p1152K4591O6159j6918
1176B4761n4697O953L7965M749j7834j6874l413K8123K3736l7320m1050M3184
1188a717N3851m5314o0969M3056O1952l6892n6663K6855M5936j3906l1228p77
1200a5816J4248J5854L222k9758j9106M1066L2094m8523m1118N1588M5557m9734
1212d26m5301M3327M0406l2858l1858J9382K0529l972q170j1796l964K6245J4484
1225B6028l7913k2360M5510K7075m8713k8214M7239K5833m1180k0355L1509J2599
$$ plain form
1237 17058 -1918 -5809 -602 -5234 3499 15192 -5802 -22434 8136 26734 -9787 -27356 11018
1250 11018 24809 -11530 -19286 11197 11505 -10318 -2878 8533 -5797 -6464 13073 3509 -18605
1263 -18605 -718 21188 -2183 -20778 4692 17611 -6869 -11816 8561 4618 -9350 3707
1275 3707 9872 -11552 -9620 18336 8978 -22726 -7705 24470 6063 -23120 -4357 18515 2285
1288 2285 -11632 -422 2694 -1505 6765 3099 -16244 -4624 24133 5816 -29677 -6687 32171
1301 32171 7261 -30953 -7441 26586 7645 -18756 -7264 8814 6897 2535 -6139 -13956 5175
1314 5175 24189 -3823 -32408 1859 37268 120 -38777 -2605 36063 5048 -30063 -7697
1326 -7697 20694 10039 -9313 -11814 -2987 13138 15222 -13265 -25762 12622 34036 -10656 -38649
$$ packed form
1237A7058j8976l891N207m632Q733J1693k0994j6632L0570J8598l6521j7569L8374
1250A1018J3791l6339p756L0483L08k1823P440J1411j4330o67J9537r564k2114
1263a8605J7887K1906k3371j8595K5470J2919k4480m947K0377l943j3968J3057
1275C707O165k1424J932K7956r358l1704J5021L2175j8407k9183J8763K2872j6230
1288B285j3917J1210L116m199Q270l666j9343J1620K8757j8317l5493K2990L8858
1301C2171k4910l8214K3512L4027j8941k6401J1492J6078j917m362q674p817J9131
1314E175J9014k8012k8585L4267L5409l7148l8897L6172L8668l1015l5111K2366
1326g697K8391j0655j9352k501Q827J6125K084k8487j2497L8384K1414m4692k7993
$$ plain form
1339 -38649 7853 39619 -4097 -36538 -204 29955 4642 -20520 -9103 9056 12627 2898
1351 2898 -15606 -14499 17153 24093 -17550 -31302 16394 35126 -13876 -35318 10068 32048
1363 32048 -5304 -25646 139 17200 5444 -7123 -10456 -2937 14960 12463 -17899 -20074 19548
1376 19548 25342 -19542 -27895 17552 27163 -14357 -24019 9637 18235 -4357 -11263 -1503 3295
1389 3295 6900 4428 -11602 -11091 15098 16059 -17148 -18697 17646 19155 -16385 -17014 13834 13077
1403 13077 -10062 -7613 5677 1608 -973 4183 -3751 -9238 7566 12641 -10593 -14295 12216
1416 12216 13640 -12799 -11326 11812 7194 -9833 -2061 6952 -3423 -3636 8647 341 -12653
1429 -12653 2887 15304 -5148 -15991 6597 14665 -6822 -11352 6154 6509 -4567 -725 2408
$$ packed form
1339c8649M6502L1766m3716l2441L6334L0159k5313k5162J1417J8159L571r729
1351B898j8504J107L1652O940m1643j3752M7696J8732m9002k1442M5386K1980
1363C2048l7352k0342K5785J7061j1756j2567l333P519J7897k497l0362k175L9622
1376A9548N794m4884q353M5447R611m1520r662L3656Q598k2592o906R760M798
1389C295L605k472j6030N11K6189R61l3207j549L6343J509l5540o29L0848p57
1403A3077k3139K449J3290m069k581N156p934n487J6804N075k3234l702K6511
1416A2216J424k6439J473K3138m618j7027P772R013j0375k13J2283q306j2994
1429a2653J5540J2417k0452j0843K2588Q068k1487m530J7506L55j1076L842L133
$$ plain form
1442 2408 -5686 -80 11525 -2308 -16630 3927 19738 -4984 -20997 5041 19899 -4057
1454 -4057 -16477 2275 11361 234 -4594 -2793 -2622 5637 10132 -7855 -16562 9512 21661 -9976
1468 -9976 -24491 9329 24884 -7469 -22967 4193 18580 -325 -12561 -4229 4990 8456 2721
1481 2721 -12548 -10512 15509 17170 -17157 -22086 17137 24916 -15107 -25200 11696 23283 -6523
1494 -6523 -19059 720 13371 5548 -6267 -11340 -1104 16275 8240 -19881 -14530 21510 18893
1507 18893 -21215 -21538 18669 21747 -14466 -20031 8592 16471 -1897 -11642 -4983 5976 11507
1520 11507 90 -16938 -5587 20978 10370 -23024 -13651 22842 15493 -20368 -15539 16045
1532 16045 14174 -10083 -11642 3167 8033 3644 -4092 -10236 -41 15444 3690 -19258 -6603
$$ packed form
1442B408q094N606J1605j3833j4322K0557J5811k4722j6013K6038J4858k3956
1454d057j2420J8752R086j1127m828J801J71Q259M495j7987q707K6074J2149l1637
1468i976j4515L3820J5555l2353j5498K7160J4387j8905j2236Q332R219L466n735
1481B721j5269K036K6021J661l4327m929L9223P779m0023j0093L6896J1587k9806
1494f523j2536J9779J2651p823j1815n073J0236J7379q035k8121N351L6040k617
1507A8893m0108l23M0207L078l6213n565K8623P879j8368r745O659J0959N531
1520A1507j1417j7028J1351K6565j0608l3394R373L6493p349l5861M829L1584
1532A6045j871k4257j559J4809M866m389p736o144J0195J5485j1754k2948J2655
$$ plain form
1545 -6603 20912 8491 -20486 -9089 18070 8712 -13722 -7192 8366 5192 -2238 -2662 -3659 74
1559 74 8824 2415 -12784 -4271 15225 5235 -15981 -5393 14916 4414 -12297 -2960 8292
1572 8292 696 -3932 1401 -813 -3376 5146 4956 -8474 -5976 10753 6208 -11516 -5437 10914
1586 10914 3934 -8737 -1644 5486 -872 -1548 3625 -2509 -6022 6168 7887 -8991 -9200 10266
1600 10266 9477 -10435 -8964 8950 7157 -6517 -4748 2890 1555 1293 1815 -5461 -5096 9139 8155
1615 8155 -11621 -10262 13106 11795 -12723 -12147 10922 11449 -7624 -9535 3380 6678 1492 -3289
1629 -3289 -6660 -594 11289 4136 -15045 -7432 17049 9868 -17558 -11578 16072 12292 -12892
1642 -12892 -11889 8308 10576 -2608 -8263 -3512 5416 9582 -2015 -14788 -1301 18641 4475
$$ packed form
1545f603K7515j2421k8977J1397K7159r358k2434O530J5558l174p430m24r97L733
1559G4Q750o409j5199Q513J9496r990k1216J0588K0309j0502j6711R337J1252
1572H292p596m628N333k214k563Q522j90j3430K498J6729m545j7724O079J6351
1586A0914o980j2671P093P130o358o76N173o134l513J2190J719j6878k09J9466
1600A0266p89j9912J471J7914j793j3674J769P638j335k62N22p276L65J4235r84
1615H155j9776J359K3368j311k4518N76K3069N27j9073j911J2915L298n186m781
1629c289l371O066J1883p153j9181P613K4481p181k7426N980K7650l780k5184
1642a2892J003K0197K268j3184n655M751Q928M166j1597j2773J3487J9942j4166
$$ plain form
1655 4475 -20490 -7132 20215 9177 -18049 -10444 13852 10615 -8508 -10005 2154 8384 4249
1668 4249 -6302 -10422 3869 15470 -1177 -18931 -1430 20603 3791 -19976 -5641 17648
1680 17648 7131 -13478 -7842 8150 7916 -2048 -7289 -4120 6131 9674 -4779 -14365 3090
1693 3090 17308 -1432 -18539 -294 17668 1729 -15238 -3006 11203 4013 -6143 -4550
1705 -4550 819 4675 4602 -4296 -9165 3865 12650 -3053 -14419 2234 14657 -1247 -13050 326
1719 326 10296 344 -6486 -981 2184 1304 2043 -1495 -6031 1438 8779 -1483 -10677 1364 11065
1734 11065 -1204 -9965 1099 7763 -828 -4578 858 1086 -708 2703 791 -5888 -816 8463
1748 8463 943 -9878 -871 9943 801 -8751 -742 6340 486 -3235 -282 -697 -198 4375 584
$$ packed form
1655D475k4965J3358K7347j1038k7226P605K4296l237j9123j497J2159O230m135
1668D249j0551m120J4291J1601j6647j7754J7501K2033j6812k3767J4335K3289
1680A7648j0517k0609N636J5992k34r964n241L169J0251L543j4453r586J7455
1693C090J4218j8740j7107J8245J7962j5939j6967J2232J4209p190j0156J593
1705d550N369L856p3q898m869J3030Q785j5703j1366J6653J2423j5904j1803J3376
1719C26R970r952o830N505L165q80P39l538m536P469P341j0262r194J2041R701
1734A1065j2269q761J1064O664q591l750N436K28j794L411j912o679N072R279
1748H463p520j0821R007J0814r142r552Q009P082n854l721K953m15M99M573l791
$$ plain form
1763 584 -7698 -1207 10227 1846 -11515 -2440 11529 3045 -9970 -3230 7374 3381 -3621 -3136
1777 -3136 -554 2684 4857 -1981 -8731 967 11750 112 -13697 -1435 14044 2690 -13168
1790 -13168 -3899 10669 4725 -7016 -5398 2567 5580 2246 -5412 -6957 4836 11043 -3719 -13995
1804 -13995 2304 15611 -501 -15708 -1279 14114 3074 -11115 -4783 6890 6001 -2107 -6944
1817 -6944 -3078 7160 7715 -6817 -11756 5766 14383 -4347 -15591 2365 15280 -195 -13319
1830 -13319 -1992 10258 4141 -5998 -5776 1494 7148 3151 -7745 -7393 7782 10687 -7131 -12932
1844 -12932 5859 13685 -4102 -13294 1907 11356 284 -8443 -2664 4702 4532 -763 -6230 -3220
1858 -3220 7117 6604 -7495 -9165 7145 10732 -6074 -10798 4585 9945 -2564 -7855 548 5126
$$ packed form
1763E84q282O491J1434q381j3361R075J3969q484j3015O740J0604l993p002M85
1777c136K582L238K173o838o750R698J0783j1638j3809J2262J5479j1354j5858
1790a3168R269J4568n944j1741J618P965L013l334p658j545J1793O207j4762j0276
1804a3995J6299J3307j6112j5207J4429J5393j1040j4189O332J1673q89q108m837
1817f944L866J0238N55j4532m939J7522Q617j8730j1244J7956J2915j5475j3124
1830a3319J1327J2250o117j0139K22P270N654l997j0896L52J5175K905j7818n801
1844a2932J8791P826j7787r192J5201R449j1072q727N779P366j70n295n467L010
1858c220J0337n13j4099j670J6310L587j6806m724J5383N360j2509n291Q403M578
$$ plain form
1872 5126 1551 -1835 -3376 -1452 4766 4281 -5634 -6581 5875 7857 -5598 -8247 4693 7462 -3452
1887 -3452 -5928 1904 3714 -296 -1124 -1253 -1558 2571 3968 -3349 -5726 3930 6864 -3871 -7070
1902 -7070 3422 6409 -2475 -4880 1372 2708 -120 -230 -1159 -2446 2053 4728 -2838 -6689 2984
1917 2984 7716 -2785 -7819 2166 7118 -1186 -5329 -58 3057 1404 -166 -2546 -2692 3476 5416
1932 5416 -3944 -7651 3970 9071 -3427 -9559 2326 8868 -995 -7449 -738 5085 2411 -2238
1946 -2238 -4101 -993 5256 4127 -6049 -6920 6188 9036 -5652 -10253 4585 10565 -2796 -9671
1960 -9671 754 7915 1570 -5330 -3817 2288 5811 989 -7284 -4252 7974 6950 -8077 -9087
1974 -9087 7130 10113 -5652 -10288 3360 9182 -819 -7364 -1937 4849 4525 -1848 -6732 -1075
$$ packed form
1872E126l575l386j541J924O218m85r915r47J2456J982j3455k649J2940K769j0914
1887c452k476P832J810m010q28j29l05M129J397p317k377R656K934j0735l199
1902g070J0492K987q884k405O252J336k828j10r29j287M499K675p566l851R673
1917B984M732j0501n034R985M952q304m143N271L115j653j570k380j46O168J940
1932E416r360l707J1621N101j2498o132J1885O542r863o454O711N823k674m649
1946b238j863L108O249j129j0176q71J3108K848j4688m601J4838N980j3361o875
1960i671J0425P161o345o900J513O105L523m822q273L032J2226j024j5027j010
1974i087J6217K983j5765m636J3648N822j0001o545N427O786l24o373m884N657
$$ plain form
1988 -1075 8273 4072 -9041 -6252 8996 8067 -7957 -8875 6216 8844 -3887 -7853 1107 6182
2002 6182 1652 -4138 -4453 1666 6571 738 -8188 -3083 8858 4869 -8790 -6165 7808 6781
2016 6781 -6092 -6603 3783 5817 -1094 -4360 -1595 2663 4141 -742 -6035 -1063 7370 2653 -7777
2031 -7777 -3945 7422 4514 -6333 -4661 4587 4029 -2402 -3163 29 1850 2292 -411 -4212 -943
2046 -943 5560 2192 -6247 -2940 6226 3471 -5377 -3409 4075 3045 -2305 -2126 367 1024 1610 243
2062 243 -3459 -1533 4639 2496 -5317 -3338 5290 3653 -4622 -3817 3311 3270 -1677 -2361 -253 1127
2078 1127 2137 357 -3811 -1766 5199 3147 -5622 -3998 5606 4660 -4743 -4687 3347 4292 -1477 -3535
2094 -3535 -704 2189 2774 -669 -4698 -1016 6065 2541 -6938 -3900 6977 4835 -6230 -5303 4803
$$ packed form
1988a075R348m201j3113K789J5248r29j6024r18J5091K628j2731l966Q960N075
2002F182m530n790l15O119M905n833q926N105J1941l989j3659K625J3973j027
2016F781j2873n11J0386K034o911l266K765M258J478m883n293M972Q433m717j0430
2031g777L832J1367k908j0847J672R248n58o431p61L192J821M42k703l801L269
2046i43O503l368q439L307R166k755q848J968P484j030n350J79K493O57N86j367
2062B43l702J926O172k143p813J979Q628j637q275Q05P128m1m947o84K108J380
2078A127J010j780m168K045O965k052q769J624R604r46r403N6Q034R45n769k058
2094c535K831K893N85l443m029L682P081l524r479L038J0877k142j1065R27J0106
$$ plain form
2109 4803 5417 -2702 -4964 389 4113 2193 -2675 -4401 1105 6333 615 -7580 -2245 8228 3672
2124 3672 -7840 -4801 6632 5364 -4736 -5543 2278 5158 341 -4401 -3020 3039 5329 -1535
2138 -1535 -7212 -151 8352 1818 -8650 -3171 8055 4200 -6471 -4728 4413 4971 -1800 -4696
2152 -4696 -902 4078 3416 -3063 -5720 1835 7249 -449 -8207 -872 8211 1978 -7470 -3028 5969
2167 5969 3552 -3805 -3849 1387 3926 1176 -3447 -3417 2766 5390 -1714 -6667 682 7316 422 -7046
2183 -7046 -1367 6116 2074 -4487 -2618 2397 2875 -274 -2830 -2001 2372 3742 -1761 -5227 1022
2198 1022 5939 -155 -6040 -540 5455 1200 -4114 -1550 2529 1850 -491 -1789 -1357 1665 3093
2213 3093 -1265 -4323 814 5117 -200 -5258 -482 4725 937 -3789 -1384 2219 1578 -499 -1669
$$ packed form
2109D803O14q119k262N353L724j920m868j726N506N228n718q195N335J0473m556
2124C672j1512L039J1433j268j0100q07P821K880m817m742J381O059K290o864
2138a535n677P061Q503o534j0468N479J1226l855j0671J743R141N58o771k896
2152d696L794M980o62o479k657P555N414p698p758P335R083o233r448M442Q997
2167E969k417p357m4N236K539k750m623L0O183K624p104m953P349O634o894p468
2183g046N679P483m042o561J869N015M78l149k556Q29M373J370n503l466O249
2198A022M917o094n885N500N995m255n314K564M079o79k341j298M32L022J428
2213C093m358l058N137M303n317n058M776N207l788m726K405L603o41k077j170
$$ plain form
2228 -1669 -1424 1425 3077 -1063 -4364 448 5079 208 -5244 -826 4836 1483 -3754 -1876 2303
2243 2303 2163 -497 -2107 -1430 1896 3268 -1426 -4779 714 5633 4 -5931 -943 5520 1655
2258 1655 -4619 -2459 3077 2857 -1171 -3052 -865 3019 2931 -2503 -4564 2029 5913 -1072 -6525 88
2274 88 6512 990 -5828 -1947 4501 2778 -2742 -3420 590 3680 1578 -3651 -3626 3151 5213 -2512
2290 -2512 -6385 1395 6809 -280 -6538 -907 5666 2134 -4125 -3026 2272 3782 -65 -4069 -1996
2305 -1996 4009 3953 -3538 -5409 2811 6213 -1747 -6573 541 6070 681 -5031 -1906 3420 2810 -1691
2321 -1691 -3603 -351 3948 2267 -3995 -3848 3623 5051 -2856 -5626 1958 5693 -720 -5052 -388
2336 -388 3944 1607 -2446 -2560 793 3228 938 -3555 -2594 3390 3735 -3095 -4624 2342 4845 -1427
$$ packed form
2228a669K45K849J652m140l301M812M631m871n452M418N662l353n237J878M179
2243B303j40k660j610O77L326J372m694l353N493M919n629n935M988O463l865
2258A655o274K160N536k20m028j881K187L884q8n434k061O593L884o985n453O613
2274H8O424n522o818L881O448j723n520o78M010L090k102n229K5O777K062p725
2290b512l873P780N414p089o258N631O573l532o259J099N298J510l847m004K073
2305a996O005n6p491j871Q220L402p960m826P114N529n389n712L125N326o10m501
2321a691j912L252M299j681o262J47P471J428p907k770P584L735o413m332M664
2336c88M332k337m053j14L353K435k290m493R61N984L45o830j529O966K503o272
$$ plain form
2352 -1427 -4534 216 3715 767 -2536 -1649 993 2412 439 -2810 -1852 2929 3132 -2677 -3813 2207
2368 2207 4191 -1427 -3954 616 3377 345 -2316 -1235 969 1866 325 -2426 -1717 2602 2820 -2499
2384 -2499 -3645 2031 4002 -1319 -3895 595 3333 356 -2354 -1249 1091 2016 338 -2507 -1678
2399 -1678 2654 2909 -2492 -3751 2033 4211 -1339 -4312 372 3804 593 -2905 -1553 1580 2370
2414 2370 -205 -2969 -1282 3226 2741 -3090 -3723 2640 4487 -1914 -4725 969 4434 190 -3700
2429 -3700 -1336 2610 2369 -1180 -3167 -407 3666 1837 -3862 -3171 3538 4154 -2925 -4745 1895 4777
2445 4777 -822 -4455 -542 3543 1857 -2281 -2932 861 3773 735 -4053 -2073 4172 3411 -3674
2460 -3674 -4205 2959 4684 -1833 -4629 525 4060 785 -3207 -2129 1922 3155 -582 -3909 -816
$$ packed form
2352a427l107M750L499k948l303Q87K642J419j973l249R58M781K03n809j136O020
2368B207J984n618k527M570K761l032k661J081K204Q97j541k751P09M319K18n319
2384b499j146N676J971n321k576M490K738k977k710J105K340R25j678k845Q29
2399a678M332K55n401j259N784K178n550k973M684L432l211l498J352L133P90
2414B370k575k764J687M508m85n831o33O363J847o401k811N694L465m244l890
2429c700K364L946k41l549j987K760M073j829n699O91O709O16p079j820O640K882
2445D777n599l633L913M085j686m138o51L793K912l038m788J980O245p61p085
2460c674n31P164J725o517k796N154L535l275l992J078M051J233l737l327L093
$$ plain form
2475 -816 4272 2081 -4198 -3162 3689 3757 -2803 -4121 1671 3914 -427 -3408 -922 2571 2193 -1421
2491 -1421 -3153 145 3849 1037 -4064 -2036 3868 2846 -3290 -3357 2315 3398 -1153 -3168 -93
2506 -93 2590 1290 -1713 -2425 589 3171 463 -3637 -1369 3587 2257 -3178 -2720 2451 2938 -1436
2522 -1436 -2812 323 2388 821 -1648 -1788 748 2546 205 -3101 -1132 3253 1855 -3071 -2442
2537 -2442 2456 2640 -1618 -2607 541 2267 634 -1633 -1600 826 2462 123 -2956 -948 3264 1809
2553 1809 -2995 -2299 2488 2630 -1678 -2708 602 2450 516 -1895 -1686 1107 2472 -239 -3206 -832
2569 -832 3395 1616 -3362 -2398 2837 2871 -2014 -2992 983 2903 194 -2416 -1363 1762 2487 -855
2585 -855 -3159 -35 3615 1059 -3669 -1939 3387 2603 -2776 -3059 1788 3086 -610 -2959 -761 2396
$$ packed form
2475h16N088k191o279J036O851O8o560j318N792K243m341k981K486L493l78l614
2491a421j732L298L704k812n101K028N904j022o136o7N672J083m551k015L075
2506i3K683j300l003p12L014K582k708m100K268M956j330n435M58N171M87m374
2522a436j376L135K065j567k469j40K536J798k341l306J969M385j398m926O29
2537b442M898J84m258r89L148J726j633k267L3K426J636k339l079K008M212j455
2553A809m804O96M787J42m308j030L310J848j934k411K09K793J365k711k967K374
2569h32M227j779m978R64N235L4m885r78L975J920k709k610J053L125P25l342
2585h55k304L124L650k556m728J730N326p84n379k83M847J298l696k349K198L157
$$ plain form
2601 2396 1964 -1659 -3023 742 3696 264 -3949 -1257 3871 2118 -3335 -2683 2556 3034 -1336 -3034
2617 -3034 34 2824 1247 -2219 -2448 1550 3342 -571 -3861 -366 3977 1251 -3764 -2060 3090
2632 3090 2622 -2166 -2866 970 2796 295 -2513 -1524 2029 2558 -1271 -3304 488 3743 360 -3640
2648 -3640 -1210 3292 1884 -2641 -2292 1713 2471 -505 -2478 -748 2060 1830 -1578 -2766 933 3244
2664 3244 -187 -3446 -598 3307 1371 -2689 -1823 1912 2145 -813 -2163 -206 2026 1320 -1622 -2227
2680 -2227 1086 2845 -419 -3081 -295 3008 911 -2642 -1561 1936 1847 -1104 -1993 74 1873 880
2696 880 -1640 -1816 1177 2517 -571 -2894 -75 2997 794 -2591 -1278 2112 1742 -1252 -1990 312
2712 312 1971 747 -1739 -1661 1303 2450 -690 -2981 49 3108 606 -2859 -1288 2298 1777 -1602
$$ packed form
2601B396m32l623j364L765K954l432m213K692N128j753n453O52N239M78m370j698
2617c034L068K790j577l466k29L998J792l913l290L495M343k726n015J704N150
2632C090m68m788p00L836J826k501k808R89L553N29l829k033L792L255l383m000
2648c640K430M502j408m525L49M005P58k976j973J730K808k30l408j188L699K311
2664C244l431l259K848L905j936m060Q66L735K33k958j350J957K232p06k942o05
2680b227L313J759l264k662K786L303k097l553J081L497q9k951q89K067J799r93
2696H80k520j76K993J340l088k323K819L072k203l385J313L390l70k994p38K302
2712C12J659j224k486P8K964J147l140k291L030L059k502l465J571L586n21l379
$$ plain form
2728 -1602 -2090 492 2188 511 -2037 -1463 1600 2329 -1057 -2860 431 3212 280 -3153 -1015 2652
2744 2652 1610 -2037 -2078 1077 2263 -104 -2344 -991 2041 1907 -1579 -2687 920 3141 -231 -3253
2760 -3253 -512 3091 1258 -2434 -1858 1657 2210 -633 -2441 -402 2335 1487 -2017 -2292 1513 2964
2776 2964 -789 -3243 -15 3181 750 -2897 -1446 2140 1971 -1234 -2364 213 2355 771 -2218
2791 -2218 -1727 1856 2488 -1244 -2909 620 3078 182 -2910 -829 2467 1526 -1656 -1966 827 2252
2807 2252 160 -2296 -1138 1974 1902 -1605 -2533 945 2764 -376 -2888 -481 2452 1103 -1902 -1602
2823 -1602 1163 1974 -270 -2131 -639 2022 1564 -1707 -2119 1247 2605 -543 -2608 -117 2460 765
2839 765 -1963 -1295 1300 1703 -569 -1958 -335 1918 1147 -1805 -1871 1331 2276 -855 -2484 197 2416
$$ packed form
2728a602m88K582J696j677k548N74L063P29l386j803L291K781k932l433K138L667
2744B652j042l647m1L155J186k367k240J353L032j34l486j108L607K221l372l022
2760c253K741L603j833l692N76L515N53k843j808K039K737q48l504k75L805J451
2776B964l753k454L228L196k431l647J451L586j69l205j130K577K142j584k989
2791b218M91L583O32l732j665L529K458k896l092K081L296r41l182l10K793J425
2807B252k092k456J158L112p2l507r28L478J819l140k512K407K933j349l005L00
2823a602K765Q11k244j861J492K661m58l271m12L366J358l148k065K491K577j695
2839G65k728O68K595M03k272j389J623K253p71k952o6L202R45l131j629K681K219
$$ plain form
2856 2416 441 -2084 -1006 1561 1511 -804 -1799 -1 1963 881 -1800 -1560 1490 2156 -956 -2369
2872 -2369 412 2456 320 -2288 -916 1720 1427 -1021 -1858 219 2035 588 -1955 -1384 1699 2012
2888 2012 -1200 -2345 630 2502 25 -2331 -694 1939 1273 -1365 -1748 602 2043 144 -2129
2903 -2129 -1027 1894 1678 -1556 -2198 1040 2425 -385 -2471 -295 2182 929 -1736 -1519 1073 1955
2919 1955 -179 -2113 -495 2156 1289 -1783 -1907 1433 2400 -734 -2486 91 2346 679 -2012 -1308
2935 -1308 1360 1784 -676 -2073 -109 2095 844 -2098 -1547 1656 2031 -1169 -2325 547 2394 175
2951 175 -2111 -810 1731 1419 -1060 -1893 362 2121 361 -2069 -1047 1820 1661 -1426 -2041 897
2967 897 2145 -307 -2146 -463 1821 1093 -1401 -1574 664 1919 12 -2028 -687 1964 1340 -1591
$$ packed form
2856B416j975k525J078K567n0k315r95J798J964j082k681K40L050O66l112j413
2872b369K781K044k136k608J372K636k93k448q37K077J816j447k543N71L083L13
2888B012l212j145K975J872k477k356J637K633o66k638l83K350J441j899k273
2903b129J102K921k16l234o42L238J385k810k086K176K477j253k665K17K592Q82
2919A955k134j934J618K651q67l072j24L340R67l134j752K577K255j667k691P04
2935a308K668M24k460j397J964K204j251k942N51L203L75l200j156K872J847k219
2951A75k286J301K541l12k479q33K255J759j760k430J022K867j59l087o15K938
2967H97J248k452j839J683K284p28k494j73K238J255j907k040J341K651o24k931
$$ plain form
2983 -1591 -1820 1126 2089 -458 -2080 -122 1867 764 -1484 -1397 956 1728 -271 -1976 -403 1906
2999 1906 976 -1738 -1502 1259 1843 -761 -1991 125 1895 506 -1522 -1076 1086 1543 -559 -1777
3015 -1777 -74 1863 705 -1736 -1264 1458 1668 -930 -1926 397 1919 196 -1739 -817 1278 1351
3031 1351 -807 -1761 157 1895 452 -1881 -1015 1547 1528 -1107 -1810 601 1922 53 -1817 -652
3047 -652 1525 1258 -965 -1565 453 1941 233 -1961 -734 1769 1280 -1404 -1685 861 1920 -332
3063 -332 -1890 -342 1636 875 -1327 -1372 745 1716 -178 -1895 -384 1879 952 -1596 -1390 1206 1738
3080 1738 -586 -1856 43 1790 606 -1502 -1198 1076 1614 -508 -1840 -129 1873 668 -1743
3095 -1743 -1180 1365 1545 -920 -1788 282 1823 314 -1604 -859 1273 1322 -803 -1594 279 1846 319
$$ packed form
2983a591k29K946R63k547j622J958J989j103k248Q7K353P72j999j705J573K309
2999A906r30k714K36K761N84k604j230K116J770j389k028M46K162M57k102j218
3015a777J703J937j158k441M72K722K10k598r96K323J522j723j935R22K095P3
3031A351k158r54J918J738j443k333Q66K562j9k635p03K411J321j869j870J165
3047f52K177k67k223o00K018J488j708k194J227K503m89k684k81K546J059k252
3063c32j558J548J978p61k202m5K117R71j894j717J511K263r27k548K06K596N32
3080A738k324j270J899J747j184k108L04K274N38k122j332J711K002j205k411
3095a743N63K545J80k465q68K070J541j509j918P45K132M9k125p91J873J567j527
$$ plain form
3112 319 -1824 -802 1560 1277 -1109 -1548 608 1677 -34 -1640 -552 1442 1038 -1034 -1485 538
3128 538 1718 17 -1760 -546 1602 1009 -1328 -1351 893 1653 -229 -1600 -312 1585 908 -1215
3144 -1215 -1255 801 1611 -212 -1745 -316 1698 792 -1444 -1244 1002 1397 -510 -1587 -56 1523
3160 1523 504 -1351 -1017 950 1403 -512 -1634 -21 1701 525 -1498 -935 1283 1291 -742 -1481 203
3177 203 1532 341 -1453 -857 1160 1262 -708 -1573 171 1628 241 -1615 -786 1337 1100 -973
3193 -973 -1375 440 1517 81 -1492 -634 1327 1133 -946 -1464 521 1678 16 -1643 -492 1482
3209 1482 966 -1211 -1243 726 1456 -244 -1510 -352 1389 790 -1177 -1244 755 1443 -335 -1606 -243
3226 -243 1550 649 -1286 -1058 977 1300 -473 -1466 -48 1462 633 -1232 -1014 990 1366 -587 -1537
$$ packed form
3112C19k143J022K362k83k386m39K156J069j711j606J088J994m04k072m51K023
3128E38J180j701j777J214K148n93k337k3K244P60j882j371J288J897o77k123
3144a215m0K056Q10j823j533J429K014r06k236K00K246L95j907j077J531J579
3160A523j019j855L34J967M53j915j122J613J722j176k023N63K218Qk033p39J684
3177B03J329j191j794N96K017J02j970q65J744J457j387j856Q29K123k37k073
3193i73m02J815J077j436j573Q58J961j94k079n18J985J157j662j659J151J974
3209A482n16k177l2J969P30j700j266J158J741n99j967o7J999O88j778j271J363
3226b43J793r01j935K28K035L23j773r93J418J510q29j865K18K004L76j953r50
$$ plain form
3243 -1537 92 1506 411 -1428 -853 1098 1215 -687 -1419 195 1419 328 -1358 -788 1113 1201
3259 1201 -721 -1425 367 1540 213 -1396 -588 1238 1021 -858 -1240 419 1384 15 -1350 -504
3275 -504 1196 894 -933 -1283 472 1407 -145 -1472 -385 1254 755 -1060 -1144 631 1346 -199 -1345
3292 -1345 -299 1228 805 -1042 -1122 685 1393 -275 -1436 -173 1392 621 -1112 -1004 783 1236 -394
3309 -394 -1335 -139 1329 545 -1185 -958 894 1185 -470 -1453 47 1384 356 -1225 -812 1018 1122
3326 1122 -565 -1316 134 1281 298 -1260 -678 1070 1080 -662 -1294 303 1372 121 -1324 -621 1092
3343 1092 886 -853 -1166 401 1302 55 -1323 -487 1202 921 -900 -1180 486 1319 -87 -1325 -319
3360 -319 1214 756 -921 -1056 590 1250 -194 -1326 -278 1198 678 -1063 -992 683 1195 -373 -1361
$$ packed form
3243a537J629J414j095j839N75J951J17j902p32J614J224j091j686N70J901Q8
3259A201j922p04J792J173j327j609Q08J826k17j879l82J659R65j369j365Q46
3275e04J700l02j827l50J755R35j552j327J087J639m99j815q4J775P15j545j146
3292a345J046J527m23j847q0J807P08j668j161J263J565p71j733J08J787M53j630
3309c94r41J196J468p84j730K27J852K91j655r83J500J337j028j581M13J830J04
3326A122j687p51J450J147r83j558N82J748J0j742o32J597J069j251j445P03J713
3343A092k06j739l13J567R01j247j378Q36J689k81j821k80J666Q33j406j238J006
3360c19J533m58j677j35J646O60j444j132J048J476n20j741P1J675N12j568r88
$$ plain form
3377 -1361 -105 1291 445 -1092 -852 794 1121 -458 -1207 7 1306 409 -1097 -731 867 1046 -524
3394 -524 -1210 88 1285 324 -1117 -716 900 992 -601 -1216 153 1173 203 -1234 -628 970 913 -671
3412 -671 -1094 299 1242 84 -1153 -497 1005 882 -689 -1061 366 1250 38 -1221 -426 1058 756
3429 756 -808 -976 491 1135 -26 -1201 -347 1080 638 -854 -890 580 1079 -174 -1166 -223 1106
3446 1106 541 -941 -870 623 1039 -269 -1177 -96 1164 504 -999 -824 696 1026 -379 -1217 -57
3463 -57 1173 373 -1083 -798 778 997 -416 -1138 38 1177 288 -1006 -740 854 917 -513 -1082 138
3481 138 1174 199 -1075 -551 937 801 -576 -1039 277 1144 115 -1097 -462 964 766 -676 -981
3498 -981 327 1166 -1 -1177 -368 993 713 -817 -951 489 1046 -68 -1090 -310 1075 649 -776
$$ packed form
3377a361J256J396q46j537K40J646L27j579p49J214J299q97j506L66J598J79j570
3394e24o86J298J197r61j441M01J616R2j593o15J369J020r70j437O06J598n7j584
3412f71m23J393R43j158j237O56J502j23j571l72J427Q84j212j259P95J484l02
3429G56j564j68J467O44j161j175Q54J427m42j492l6J470M99j253r92R43J329
3446A106n65j482P1J493M16j308r08J081J260o60j503J75J520L30j405q38J160
3463e7J230q00j456K85J576K19j413p22J176J139q89j294K66J594O3j430n69J220
3481A38J036r75j274N24J488j36j377m63J316Q67j029j212O35J426j98j442l05
3498i81J308Q39j167j176Q09J361k80j530j34J440N57j114j022P80J385m26j425
$$ plain form
3515 -776 -901 609 1089 -201 -1127 -125 1084 503 -930 -810 614 964 -286 -1115 -129 997 372
3532 372 -952 -715 666 911 -384 -1051 46 1032 288 -960 -627 811 828 -494 -974 124 1051 253
3550 253 -937 -553 806 740 -597 -967 191 1032 77 -1000 -479 818 722 -565 -985 285 985 85
3568 85 -1037 -440 909 681 -670 -890 361 1002 -31 -1012 -222 912 583 -718 -777 355 915 -104
3586 -104 -950 -235 899 532 -742 -779 518 882 -192 -944 -124 902 436 -774 -676 539 842 -294
3604 -294 -908 -84 931 421 -821 -710 627 894 -374 -941 17 907 288 -870 -624 586 800 -380
3622 -380 -991 -12 933 256 -910 -587 702 778 -499 -972 226 971 208 -829 -446 825 772 -521
3640 -521 -873 259 971 120 -942 -395 806 648 -615 -909 388 924 -93 -1015 -277 848 550 -692
$$ packed form
3515g76j25J510M80j290r26J002J209n81j433J20J424L50j250q29R86J126o25
3532C72j324K37J381K45j295o67J097R86p44j248L33J438J7j322m80J098R27p98
3550B53j190L84J359o6j337l70J158Q41r55j077N21J297r6j287m20J270P00r00
3568H5j122N97J349k28j351k20J251O41j033r81P90J134l29j301n9J132N60j019
3586a04q46P15J134l67j274l7J297L64j074p52Q20J026m66j210R8J215L03j136
3604b94o14Q24J015n10j242J11J337K67j268n67R58Q90o19j158K46J210K14j180
3622c80o11R79R45o77j166L23J289P6j277m73J198P45p63j037L83J271n3j293
3640e21l52J132P12q51j062N47J201j58j263k94J297N36j017r22P38J125k98j242
$$ plain form
3658 -692 -832 412 953 -102 -1011 -257 881 494 -808 -774 510 916 -223 -904 -71 929 367 -729
3676 -729 -645 493 884 -235 -968 -22 887 344 -864 -594 642 776 -394 -955 96 909 185 -787
3694 -787 -488 576 664 -385 -886 112 958 169 -864 -402 766 724 -520 -803 248 902 45 -831 -339
3713 -339 722 581 -490 -772 238 871 25 -874 -294 834 609 -610 -728 316 861 -114 -825 -213
3731 -213 730 491 -547 -690 351 853 -96 -862 -156 780 433 -658 -685 433 747 -238 -799 -114 741
3750 741 328 -647 -510 470 769 -173 -812 -39 805 278 -688 -487 594 676 -296 -809 31 827 262 -707
3770 -707 -481 521 739 -275 -873 39 791 213 -814 -512 620 679 -452 -779 152 844 79 -785 -397
3789 -397 619 645 -410 -713 132 887 120 -796 -305 721 546 -539 -658 252 796 23 -810 -253 663
$$ packed form
3658f92j40J244N41j055r09P54J138l87j302L4J284M06j139o81Q33J000n62j096
3676g29Q4J138L91j119p33R46R09n43j208K70J236J34j170n61J051Q13p24r72
3694g87K99J064Q8j049n01R98Q46p89j033M62J168m2j244k83J051O54q57q76M92
3713c39J061j41j071k82J010O33q46q99N80J128k25j219j18J044N45r75p11O12
3731b13R43k39j038j43J041N02r49p66P06R36l47j091k7J118L14r85n61O85Q55
3750G41m13r75J37R80K99r42o39P73Q44n27r66K01J081Q2r72n13Q40P96n65r69
3770g07K26J002K18j014n98R12P52n78j027L02J132N9j131l27R31O92p65q64L88
3789c97J016K6j055l03Q45P55p67r16M91J026j75j085j19R10N44p73q33N57R16
$$ plain form
3808 663 534 -560 -718 298 815 -56 -911 -200 792 428 -679 -650 406 763 -112 -749 -110 773 370
3827 370 -640 -599 424 755 -195 -841 -29 862 294 -726 -527 585 648 -332 -787 50 749 221 -688
3846 -688 -477 527 645 -312 -761 71 845 186 -781 -353 645 578 -422 -712 190 768 87 -710 -385 574
3866 574 547 -426 -680 230 802 6 -748 -242 657 445 -538 -603 322 637 -30 -717 -227 681 468 -436 -600
3887 -600 301 772 -100 -750 -154 729 380 -541 -524 344 627 -70 -695 -112 681 291 -602 -566 355 636 -247
3908 -247 -722 -11 666 254 -608 -444 472 556 -242 -676 22 692 286 -637 -453 519 623 -259 -692 30
3928 30 730 226 -703 -365 511 561 -406 -677 130 704 159 -602 -385 561 531 -338 -692 201 762 33 -675
3949 -675 -292 653 425 -410 -650 222 699 68 -728 -258 594 487 -508 -601 262 745 -41 -740 -234 654
$$ packed form
3808F63j29j094j58J016N17q71q55P11R92l64j107K9J056L57q75o37O39Q83m03
3827C70j010M1J023L31r50o46Q12Q91n68j020J99J112O3r80m55Q37O99n28r09
3846f88K11J004J18r57m49Q32P74o59r67M28R98o7j000k90R02N78o81p97L25R59
3866E74k7r73k54R10N72p96p54N06Q99k12r83o5R25L15o67o87M90R08k13r04j64
3887f00R01M71q72o50N96Q83l49r21J7Q68K83o97o25N83P93l90q93L6R21K81q83
3908b47m75P11O77m12q62J64R16Q4p98m34O98O70m06r23J84R72J04q82m33P22
3928C0P00n04r29L38Q76N0r67k71Q07N74n45p61K17R46l0q69l54Q93N61p29p08
3949f75L83R45k28q35k40Q72M77o31p96M70Q52j07r95r3Q63M83p86o99N06Q88
$$ plain form
3969 654 378 -580 -548 325 653 -110 -667 -125 705 335 -595 -558 397 745 -206 -724 -4 743 248 -663 -482
3990 -482 421 653 -236 -684 -17 677 257 -664 -476 500 613 -326 -724 112 718 177 -630 -255 541 534 -310
4011 -310 -567 140 722 68 -577 -337 572 536 -383 -592 183 679 -28 -629 -242 574 429 -443 -581 160
4031 160 598 36 -674 -236 549 435 -487 -616 284 645 -64 -671 -71 632 293 -461 -517 302 598 -90
4051 -90 -644 -96 598 343 -466 -488 340 615 -173 -636 -23 614 250 -570 -407 406 554 -142 -580 -15 596
4072 596 189 -514 -410 407 546 -245 -612 72 595 121 -598 -349 413 463 -305 -564 48 594 140 -636
4092 -636 -372 483 494 -353 -618 98 680 71 -582 -258 534 504 -343 -563 163 666 127 -599 -243 507 437
4113 437 -398 -566 251 642 -45 -677 -195 580 357 -467 -491 218 577 -60 -584 -159 596 319 -495 -467 336
$$ packed form
3969F54k76r58L2Q73L28p63n57N42Q30l70r30L7R55L48r51n18P20P47m95r11J81
3990d82R03K32q89m48O67O94m20r21J88R76J13r39l98Q36O06n41q07L75P96pq44
4011c10k57P07N82o54o45K40R09l6r19k09P75M96p07o01L87Q16j45q72j38P41
4031A60M38n62p10M38P85j14r22j29R00L61p09o07O00P03l39p54n6Q19K96o88
4051i0n54N48O94k55q09k2Q28K75p88m63O13O37l64q20J63Q13J48o96m38N65O11
4072E96m07p03J04Q17J39p91l67O84N23m74p19K49P62N0p68k59O12N46m54p76
4092f36K64Q55J1q47k65P16N82o09o53L24P92l0q47k20P26N03n39p26L56P50p0
4113D37q35j68Q17L91o87o32M82P75k23q24k4P09L59o37n24M25P55k77q14K8Q03
$$ plain form
4134 336 708 -138 -567 -39 617 294 -556 -431 365 618 -149 -634 -48 618 296 -558 -420 428 505 -302
4154 -302 -618 49 649 161 -595 -356 419 473 -312 -601 57 581 101 -577 -317 523 545 -387 -541 212 574
4175 574 35 -555 -234 495 420 -385 -510 150 556 -28 -568 -229 511 369 -508 -524 248 550 -83 -546 -171
4196 -171 558 287 -388 -424 246 540 -95 -591 -168 554 295 -461 -517 277 549 -173 -624 -63 519 272 -492
4217 -492 -386 280 483 -122 -516 -61 532 268 -471 -385 453 449 -204 -467 56 544 113 -464 -298 404 488
4238 488 -226 -541 35 580 144 -579 -370 440 368 -367 -532 83 579 56 -551 -292 424 396 -293 -464 162
4259 162 564 100 -501 -259 525 379 -388 -475 233 572 -43 -503 -121 491 325 -418 -494 139 497 -63 -627
$$ packed form
4134C36L72q46m29N28O56l23q50J25P96K53p67m85N86O66l22q54J38Q48P7q07
4154c02l16O67O00m88p56K39P75N4p85k89O58N24m80o78K60Q40K2r32j54P53L62
4175E74n39n90L21P29p5q05j25O60M06n84n40L39P40j42q77j6P72L02o33m63L75
4196a71P29k71o75l6O70K94o35m96M23P22k59p56n6P94K72p22m51N61N82k47p64
4217d92J06O66K03o05l94M55N93k64p39Q6Q38mo53k63N23M88m31n77J66P02Q4
4238D88p14l15N76N45m36p23K09Q10p2p35j65O15M96n23o07K59P16k8o89j71O26
4259A62M02m64o01K42P84j46p67q7P08L39o15m60L82O12j66p43p6O33L58n60n64
$$ [...]
8191g6
##END NTUPLES=NMR FID
##END=
