##TITLE=1H_LY-DMAA.Per.1.17
 CDCl3
 8 sc, 
 14.03.2022
##JCAMPDX= 6.0         $$ Bruker NMR JCAMP-DX V2.0
##DATA TYPE= NMR FID
##DATA CLASS= NTUPLES
##ORIGIN= UXNMR, Bruker Analytische Messtechnik GmbH
##OWNER= root
$$ XWIN-NMR		Version 3.5
$$ Mon Mar 14 10:48:26 2022 Russian Standard Time (UT+4h)  she@DPX200
##.OBSERVE FREQUENCY= 200.131346
##.OBSERVE NUCLEUS= ^1H
##.DELAY= (6, 6)
##.ACQUISITION MODE= SIMULTANEOUS
##.ACQUISITION SCHEME= undefined
##.AVERAGES= 8
##.DIGITISER RES= 18
##SPECTROMETER/DATA SYSTEM= spect
##.PULSE SEQUENCE= zg30
##.SOLVENT NAME= CDCl3
##.SHIFT REFERENCE= (INTERNAL, CDCl3, 0, 15.7039)
##AUDIT TRAIL= $$ (NUMBER, WHEN, WHO, WHERE, WHAT)
$$ ##TITLE= Audit trail, XWIN-NMR		Version 3.5
$$ ##JCAMPDX= 5.01
$$ ##ORIGIN= Bruker BioSpin GmbH
$$ ##OWNER= she
$$ F:/spectra/data/she/nmr/H-F/1/audita.txt
$$ ##AUDIT TRAIL=  $$ (NUMBER, WHEN, WHO, WHERE, WHAT)
(   1,<2022-03-14 10:46:57.68 +0400>,<she>,<DPX200>,
      <created by zg, POWCHK disabled, PULCHK disabled
       configuration hash MD5:
       00 E9 B6 7A A2 85 ED C7 34 08 36 98 17 FE 4E 26
       data hash MD5: 16K
       68 AB 74 2B 0C 19 6E 31 80 20 60 37 83 8A 5A 22>)
$$ ##END=
$$ 
$$ hash MD5
$$ 00 FC 08 71 5B FA 41 AA 8D DC 65 A4 77 74 1A E1
##$RELAX= 
##$RELAX= 
##$RELAX= 
##$RELAX= 
##$RELAX= 
##$RELAX= 
$$ Bruker specific parameters
$$ --------------------------
##$DU= <F:/spectra>
##$EXPNO= 1
##$NAME= <H-F>
##$PROCNO= 1
##$TYPE= <nmr>
##$USER= <she>
##$AMP= (0..31)
100 100 100 100 100 100 100 100 100 100 100 100 100 100 100 100 100 100 
100 100 100 100 100 100 100 100 100 100 100 100 100 100 
##$AQSEQ= 0
##$AQ_mod= 1
##$AUNM= <au_zg>
##$AUTOPOS= <>
##$BF1= 200.13
##$BF2= 200.13
##$BF3= 200.13
##$BF4= 200.13
##$BF5= 200.13
##$BF6= 200.13
##$BF7= 200.13
##$BF8= 200.13
##$BYTORDA= 1
##$CFDGTYP= 0
##$CFRGTYP= 5
##$CHEMSTR= <none>
##$CNST= (0..31)
1 1 145 1 1 1 1 1 1 1 1 1 1 1 1 1 1 1 1 1 1 1 1 1 1 1 1 1 1 1 1 1 
##$CPDPRG= <>
##$CPDPRG1= <>
##$CPDPRG2= <>
##$CPDPRG3= <>
##$CPDPRG4= <mlev>
##$CPDPRG5= <mlev>
##$CPDPRG6= <mlev>
##$CPDPRG7= <mlev>
##$CPDPRG8= <mlev>
##$CPDPRGB= <>
##$CPDPRGT= <>
##$D= (0..31)
0 1.2 0 0 0 0 0 0 0 0.06 0 0.03 0 0 0 0 0.0002 0 0 0 0 0 0 0 0 0 0 0 0 
0 0 0 
##$DATE= 1647240417
##$DBL= (0..7)
120 120 120 120 120 120 120 120 
##$DBP= (0..7)
150 150 150 150 150 150 150 150 
##$DBP07= 0
##$DBPNAM0= <>
##$DBPNAM1= <>
##$DBPNAM2= <>
##$DBPNAM3= <>
##$DBPNAM4= <>
##$DBPNAM5= <>
##$DBPNAM6= <>
##$DBPNAM7= <>
##$DBPOAL= (0..7)
0.5 0.5 0.5 0.5 0.5 0.5 0.5 0.5 
##$DBPOFFS= (0..7)
0 0 0 0 0 0 0 0 
##$DE= 6
##$DECBNUC= <off>
##$DECIM= 32
##$DECNUC= <off>
##$DECSTAT= 4
##$DIGMOD= 1
##$DIGTYP= 9
##$DL= (0..7)
0 120 120 120 120 120 120 120 
##$DP= (0..7)
150 150 150 150 150 150 150 150 
##$DP07= 0
##$DPNAME0= <>
##$DPNAME1= <>
##$DPNAME2= <>
##$DPNAME3= <>
##$DPNAME4= <>
##$DPNAME5= <>
##$DPNAME6= <>
##$DPNAME7= <>
##$DPOAL= (0..7)
0.5 0.5 0.5 0.5 0.5 0.5 0.5 0.5 
##$DPOFFS= (0..7)
0 0 0 0 0 0 0 0 
##$DQDMODE= 0
##$DR= 18
##$DS= 0
$$ [...]
##$SUBNAM2= <"">
##$SUBNAM3= <"">
##$SUBNAM4= <"">
##$SUBNAM5= <"">
##$SUBNAM6= <"">
##$SUBNAM7= <"">
##$SUBNAM8= <"">
##$SUBNAM9= <"">
##$SW= 18.0517287032376
##$SWIBOX= (0..15)
0 0 2 0 0 0 0 0 0 0 0 0 0 0 0 0 
##$SW_h= 3612.71676300578
##$TD= 16384
##$TD0= 1
##$TE= 0
##$TE2= 300
##$TE3= 300
##$TEG= 300
##$TL= (0..7)
0 120 120 120 120 120 120 120 
##$TP= (0..7)
150 150 150 150 150 150 150 150 
##$TP07= 0
##$TPNAME0= <>
##$TPNAME1= <>
##$TPNAME2= <>
##$TPNAME3= <>
##$TPNAME4= <>
##$TPNAME5= <>
##$TPNAME6= <>
##$TPNAME7= <>
##$TPOAL= (0..7)
0.5 0.5 0.5 0.5 0.5 0.5 0.5 0.5 
##$TPOFFS= (0..7)
0 0 0 0 0 0 0 0 
##$TUNHIN= 0
##$TUNHOUT= 0
##$TUNXOUT= 0
##$USERA1= <user>
##$USERA2= <user>
##$USERA3= <user>
##$USERA4= <user>
##$USERA5= <user>
##$V9= 5
##$VALIST= <valist>
##$VCLIST= <CCCCCCCCCCCCCCC>
##$VD= 0
##$VDLIST= <DDDDDDDDDDDDDDD>
##$VPLIST= <PPPPPPPPPPPPPPP>
##$VTLIST= <TTTTTTTTTTTTTTT>
##$WBST= 1024
##$WBSW= 4
##$XGAIN= (0..3)
0 0 0 0 
##$XL= 0
##$YL= 0
##$YMAX_a= 424402
##$YMIN_a= -365854
##$ZGOPTNS= <>
##$ZL1= 120
##$ZL2= 120
##$ZL3= 120
##$ZL4= 120
##$ABSF1= 10
##$ABSF2= 0
##$ABSG= 5
##$ABSL= 3
##$ALPHA= 0
##$AQORDER= 0
##$ASSFAC= 0
##$ASSFACI= 0
##$ASSFACX= 0
##$ASSWID= 0
##$AUNMP= <proc_1d>
##$AZFE= 0.1
##$AZFW= 0.1
##$BCFW= 1
##$BC_mod= 2
##$BYTORDP= 1
##$COROFFS= 0
##$CY= 11.3945322036743
##$DATMOD= 1
##$DC= 2
##$DFILT= <>
##$DTYPP= 0
##$F1P= 2.36226072786647
##$F2P= -0.459571619588291
##$FCOR= 0.5
##$FTSIZE= 0
##$FT_mod= 4
##$GAMMA= 1
##$GB= 0.15
##$INTBC= 1
##$INTSCL= 1
##$ISEN= 128
##$LB= 0.24
##$LEV0= 0
##$LPBIN= 0
##$MAXI= 10000
##$MC2= 0
##$MEAN= 0
##$ME_mod= 0
##$MI= 1.114404
##$NCOEF= 0
##$NC_proc= 0
##$NLEV= 6
##$NOISF1= 3.799351
##$NOISF2= 2.8
##$NSP= 1
##$NTH_PI= 0
##$NZP= 0
##$OFFSET= 15.70392
##$PC= 1
##$PHC0= -17110.1
##$PHC1= 14.00078
##$PH_mod= 1
##$PKNL= yes
##$PPARMOD= 0
##$PSCAL= 0
##$PSIGN= 0
##$REVERSE= no
##$SF= 200.130013532006
##$SI= 16384
##$SIGF1= 3
##$SIGF2= 2
##$SINO= 400
##$SIOLD= 16384
##$SREGLST= <1H.CDCl3>
##$SSB= 0
##$STSI= 0
##$STSR= 0
##$SW_p= 3612.71676300578
##$SYMM= 0
##$S_DEV= 0
##$TDeff= 0
##$TDoff= 0
##$TI= <>
##$TILT= no
##$TM1= 0
##$TM2= 0
##$TOPLEV= 0
##$USERP1= <user>
##$USERP2= <user>
##$USERP3= <user>
##$USERP4= <user>
##$USERP5= <user>
##$WDW= 1
##$XDIM= 8192
##$YMAX_p= 0
##$YMIN_p= 0
$$ End of Bruker specific parameters
$$ ---------------------------------
##NTUPLES= NMR FID
##VAR_NAME=  TIME,          FID/REAL,        FID/IMAG
##SYMBOL=    X,             R,               I
##VAR_TYPE=  INDEPENDENT,   DEPENDENT,       DEPENDENT
##VAR_FORM=  AFFN,          ASDF,            ASDF
##VAR_DIM=   8192,          8192,            8192
##UNITS=     SECONDS,       ARBITRARY UNITS, ARBITRARY UNITS
##FACTOR=    0.0002768,     1,               1
##FIRST=     0,             0,               0
##LAST=      2.2672688,     0,               0
##MIN=       0,             -365854,         0
##MAX=       2.2672688,     424402,          0
$$ Real data points
##PAGE= N=1
##DATA TABLE= (X++(R..R)), XYDATA
0@%%%%%%%%%%Qj6J6j6K4l2M0m9N7p2Q8j05J22j45J76k07K38k73L15l62M14m74
32b53N42o14O92p80Q78r86J103j232J372j525J695j878K074k294K537k797L081
49A615l395L739m116M537n006N529o117O783p543Q422r457J0689j2183J4045j6445
64h903J9665k4233L1267m3601P1345k42480P8081N43261k97275m28715J06858
75a94730M00116k7977k35545r5245R4877J32092J02410j63851k55035J23519M03771
86B84402p3767m81017j6333N15458R0604m73119j59984L90092J85187k61694j80407
97a80578J24852J28773J5410n1772j30382n0068K18140J53730k63319k50533K71042
108a4705L19678k40556l52447J87917L40072j23031k86565O2492J98118j5049
$$ plain form
0 0 0 0 0 0 0 0 0 0 0 0 8 -8 8 -8 16 -16 24 -25 32 -40 48 -57 65 -80 96 -111 127 -146 169 -193 221 -253
32 -253 289 -325 367 -413 465 -521 582 -650 722 -803 892 -986 1088 -1206 1331 -1466 1615
49 1615 -1780 1959 -2157 2380 -2626 2903 -3214 3569 -3974 4448 -5009 5680 -6503 7542 -8903
64 -8903 10762 -13471 17796 -25805 45540 -196940 -118859 424402 127127 -301588 -194730
75 -194730 205386 177409 -58136 -153381 -58504 73588 175998 12147 -242888 -119369 284402
86 284402 210635 -270382 -286715 228743 319347 -153772 -313756 76336 261523 -171 -180578
97 -180578 -55726 73047 88457 36685 -93697 -143765 74375 228105 -35214 -285747 -14705
108 -14705 304973 64417 -288030 -100113 239959 116928 -169637 -107145 90973 75924
118G5924q9218j1789k5986J7754J32603n715k20389j9169K79060M8671l04652
129a22906p3431K96975Q4975k61989p8538K08047N3280j45259j2165Q3374l7399
140e036k8228Q8356j6400j33066M9812J66163p2008j82802Q6175J80979r5745
151C8200j61935J03907J28833j13615q7458J24356M3704j34604l597J40425l0384
162D7832j38533N6532J26367p5653j02290Q9327O7404r9845k3931J09983k3600
173C3593j20555P0245J32585j09215j43718J35226J50374j44741j48183J37609
183f780J32964j16428j02780Q5698N7080n2343Q60K1862o6218l5J32051j0182
195G5749j90013P075K32381O937k51658k7225K44618M7233k10465n9651J53494
$$ plain form
118 75924 -13294 -25083 -51069 -33315 99288 93573 -126816 -145985 133075 181746 -122906
129 -122906 -196337 100638 185613 -76376 -154914 53133 106413 -38846 -51011 32363 -5036
140 -5036 -33264 55092 38692 -94374 -44562 121601 49593 -133209 -47034 133945 38200
151 38200 -123735 -19828 109005 -4610 -92068 32288 75992 -58612 -62209 78216 47832
162 47832 -90701 -34169 92198 16545 -85745 3582 70986 -28859 -52790 57193 33593
173 33593 -86962 -16717 115868 6653 -137065 -1839 148535 3794 -144389 -6780
183 -6780 126184 9756 -93024 -7326 49754 -2589 -1729 20133 -46085 -46120 85931 75749
195 75749 -114264 -107189 125192 132129 -119529 -146754 97864 145097 -65368 -125019 28475
206B8475N9240q0594m1776J491P197P3610M1872j35058r9674J74875J57270j88984
218b056k05194J76331K33719j41489k35921R1386K08308l6176j52255j4076P3394
229d029N0690J8826o7255j12436O2145J95558l7076k56512j907K87564M6683k84588
241a02337q6746K48648J13123j85657j18975J04908J00641j8569n9358o1976j64
252f6462J26031O9253j66516j38440J79770J96621j66814k34189J32604K44608
262A76466q4986k24695L3745J76427J1759j05039m3216K0312N6415O6901m9823
273C4266j45295K5963K04993R321k39194m7949K44360Q1226k22466j01664J77692
284B1253J03800j18444q5631N3393M9146P703P18n7650n6689R1797J10518j07672
$$ plain form
206 28475 87715 7121 -34655 -33164 -25967 47643 89515 -45543 -145217 29658 186928 -2056
218 -2056 -207250 -30919 202800 61311 -174610 -83224 125084 88908 -63347 -77423 -4029
229 -4029 46661 65487 -1768 -114204 -52059 143499 106423 -150089 -151996 135568 182251 -102337
241 -102337 -189083 59565 172688 -12969 -131944 -27036 73605 55036 -4322 -66298 -66462
252 -66462 59569 128822 -37694 -176134 3636 200257 33443 -200746 -68142 176466
262 176466 91480 -133215 -99470 76957 88716 -16323 -59539 -39227 17188 84089 34266
273 34266 -111029 -85066 119927 129248 -109946 -157895 86465 167691 -54775 -156439 21253
284 21253 125053 6609 -79022 -25629 23517 31220 31938 -25712 -82401 9396 119914 12242
296A2242j53823J07053J80747r3520j87089P2733J72250n0129j38443L1414R0373
307D3808j9892l4987J6799k1022k1930P1021L2377j09981m4879J34512N4886j44382
319d3670n9178J40718N5064j26282m1424J05412J9420q1769Q368N8753l7805l7768
331d0161O5414K0065q7035m820R9937r315j03305K3749R7509l9431q4416N6428
343e381O6552p4672m7167R1284K8512j04197j2266J10552r83j08205J1764R5959
355E1752k1485p3983L2056M4749m4384j1034N9581k2812p6914N2574R4768p4138
367A0730j10221Q5435J19908q5557j20616P5227J09041n7541q4640L6500M7904
378B6170j6729k184J939m8176M349R7096j008j38053j0539J65576K7575j75221
$$ plain form
296 12242 -141581 -34528 146219 52699 -134390 -61657 110593 60464 -77979 -46565 43808
307 43808 23916 -11071 5728 -15294 -37224 33797 66174 -43807 -88686 45826 100712 -43670
319 -43670 -102848 37870 92934 -33348 -74772 30640 50060 -31709 -23341 35412 -2393 -40161
331 -40161 25253 45318 -41717 -46537 53400 44085 -59220 -35471 62038 22607 -61809 -5381
343 -5381 61171 -13501 -60668 30616 59128 -45069 -57335 53217 52234 -55971 -44207 51752
355 51752 30267 -43716 -11660 33089 -11295 -22329 37252 14440 -62474 -9900 84868 10730
367 10730 -99491 -14056 105852 20295 -100321 -25094 83947 26406 -58234 -21734 26170
378 26170 9441 7257 9196 -38980 -34631 62465 61457 -76596 -87135 78441 106016 -69205
390f9205m5593J65703N9359j37520o3652R5051N5610m4036l3867q738j55N5631
402B8588M2801r0822q8229J09885J29455j11763j60243R7514J74313p1174j68441
413a08116L8580J41781o234r6697j9719L8250L4583K6519l5204q8893K2156J41196
425H8202K180j76445l2685J90413O3094j81770q6504J52590R7126j07916r1777
436h3492N4463O8796n21l0605m6561j8036Q0597P0007r8265j17850R8864J54281
448A31678q4567j73215O0154J71955l1466j49907M770J10331J4729n8056k3286
459b6880L62J9853N5245n562j02274j6282J35091M0933j50852o3279J48802P8173
471A13330j31495q2064J02375P3048o7018n1461L0942J9754R66J7950k5168n6258
$$ plain form
390 -69205 -114798 50905 110264 -27256 -90908 4143 59753 15717 -18150 -26888 -27043 28588
402 28588 71389 -19433 -107662 2223 131678 19915 -140328 -42814 131499 60325 -108116
413 -108116 -69536 72245 66011 -30686 -50405 -12155 22428 48947 13743 -75150 -52994 88202
425 88202 90382 -86063 -118748 71665 134759 -47011 -133515 19075 116201 8285 -83492
436 -83492 -29029 39767 39246 8641 -37920 -55956 24641 94648 -3617 -121467 -22603 131678
448 131678 47111 -126104 -65950 106005 74539 -75368 -70598 39733 54462 -3594 -26880
459 -26880 -26518 -6665 48580 43018 -59256 -75538 59553 100486 -50366 -113645 35157 113330
471 113330 -18165 -100229 2146 75194 8176 -43285 -12343 7411 8377 26327 1159 -55099
483e5099L9990R0387m5209j15145M2971J27557l5866j26211K7522J11750k0850
494D1797q6867J8334N4756k0655k0521K7433j2374l7224M0474M6947o1558n4304
506f3762P4897N6561q0836n2534Q0934M1872p6694k5361P0248N391o2737J5963
518a6058N5112l5682m7270N1704L8577o2181k8137O6610J4978o5342Q34N9562
530C2707j9504n1134L9426M1785n8970l3502P5678K6773q7200k1749R1457J7716
542E3483q7150j2936P4486N882n4314M759K9553j9524l000L8143k1453n8830M0770
555a0131P8919n2656r5368N6092J04734n1569j04509M0887R2750k7337o9914J3893
567b4209L7455l951J164j12m1454k936P8674J2490j07568k6763J24828M2757j27536
$$ plain form
483 -55099 -15109 75278 30069 -85076 -42105 85452 49586 -76625 -49103 62647 41797
494 41797 -45070 -26736 28020 7365 -13156 14277 1903 -35321 5153 52100 -9458 -63762
506 -63762 11135 67696 -13140 -65674 15260 57132 -19562 -44923 25325 30716 -32021 -16058
518 -16058 39054 3372 -43898 7806 46383 -15798 -43935 22675 37653 -27689 -26855 32707
530 32707 13203 -37931 1495 43280 -15690 -49192 26486 53259 -33941 -55690 35767 53483
542 53483 -33667 -46603 27883 33765 -20549 -15790 13763 -5761 -8761 29382 7929 -50901 -10131
555 -10131 68788 16132 -79236 -23144 81590 30021 -74488 -33601 59149 31812 -38102 -24209
567 -24209 13246 9295 10459 10347 -31107 -34043 44631 57121 -50447 -77210 47618 90375 -37161
580c7161n6357J16001O3892r1977o2134N8965M9509k1908k6102j3687o155M2812
592A5698M2929o1985p9682O8947J10627o4027j30953M9196J36949k8590j27025
603f7916O786J01951J1672o4300k2610J9295K3713K7629j4663p0180k612J03157
615E1922K5358j22791m8598J26967O7831j16577p8781R3739P8376o2751o5780
626e1085K8561M1343L583q290k9502k9480M6149O6808n2260r8344M8548J19614
638H5645l7093j27419K1464J21114n416j01024o919P0274J2945l3074j1255n660
650a6418K028M1002J3092o9057l1124Q6715M8032r3407o0559Q9535O5770p7297
662a688o2201N9740M9414m0233k9027K1869L982o928K3128l170m8439Q710O8730
$$ plain form
580 -37161 -93518 22483 86375 -5602 -67736 -8771 40738 18830 -7272 -20959 -27114 15698
592 15698 58627 -3358 -83040 -14093 96534 32507 -98446 -49250 87699 59109 -67916
603 -67916 -61130 40821 52493 -11807 -34417 -15122 8591 36220 21557 -48623 -51235 51922
615 51922 77280 -45511 -94109 32858 100689 -15888 -94669 -930 77446 14695 -51085
626 -51085 -22524 18819 22402 14112 -15390 -44870 1279 68087 15827 -82517 -33969 85645
638 85645 48552 -78867 -57403 63711 58295 -42729 -49648 20626 33571 497 -10758 -16418
650 -16418 -14390 26612 39704 -29353 -60477 26238 74270 -19137 -79696 9839 75609 -1688
662 -1688 -63889 -4149 45265 5032 -23995 -2126 1856 -5072 18056 14886 -33553 -24843 43887
675D3887j0242q1905R921Q6522r054q2615R331P1336j2119n4781J7504L5151k5067
688b131j5298L3682l154m1866J8349M7778l0011m9814L7975M7433m3009m0058
700d0124M5997K8705m7885j4397M9288o01n0094J4735N0127k6367m8414L4243
712d787M4046l8296l6076L8753K4178l7005q702L3796r336l0959K8228K9078m5886
725a2968k8543N9991K9017o8594k9549P0492K8931o5204k5267N3379J8044l6813
737g084o046J7775r973Q60K9282j6763m9515K7710O7967l2802q1955L1685Q8674
750E9815k5649q6481J6463P4712o956n4299m04K7064L511L655j075l3942o828
763c0414O0380J9033p9138l3210Q8266M6598q6873n5706P5607N8229n6634n2555
$$ plain form
675 43887 33645 -48260 -38339 48183 39129 -43486 -34155 37181 25062 -29719 -12215 22936 -2131
688 -2131 -17429 16253 13099 -28767 -10418 37360 7349 -42465 -4490 42943 -66 -40124
700 -40124 5873 34578 -13307 -27704 21584 20983 -29111 -14376 35751 9384 -39030 -4787
712 -4787 39259 963 -35113 3640 27818 -9187 -17889 15907 6571 -24388 3840 32918 -12968
725 -12968 -41511 18480 47497 -21097 -50646 19846 48777 -16427 -41694 11685 29729 -7084
737 -7084 -13130 4645 -5328 -4468 24814 8051 -41464 -13754 54213 21411 -60544 -28859 59815
750 59815 34166 -52315 -35852 38860 31904 -22395 -22799 4265 7776 11431 10356 -23586 -30414
763 -30414 29966 48999 -30139 -63349 24917 71515 -15358 -71064 4543 62772 6138 -46417
775d6417L3211L7993q910j6015j2570j1295K8212M0340l6533o7375L6783Q8290
787F5714l0077j00079J8582J00821n060q9919p223O8887J5254m0039j6950P410
799a2679J1909K4776j96n2625j5974P2549L3888q2627n0113Q2302O1320p2729
811a99o5048N5856N9794l5391m5650J4560K4080L468K061j6191k9579K2581N4637
824D4979k2470p3925J7454Q5197r261q6925P18P9214O036o3495q899M2102O977
837A7702j8011k94n958j0187K6479K2805m2049l5262N1324M5089n4239n0566N1555
850a612N0041m4811m3324L6058L1193k6960j4680J8913l764j2897K1917R343l7525
863a8108p357M9064O274n5260n091N6011K595n2049J825M4253q187l4413J5946
$$ plain form
775 -46417 -13206 24787 15877 -138 -12708 -24003 4209 44549 8016 -59359 -22576 65714
787 65714 35637 -64442 -45860 54961 49901 -40018 -47241 21646 36900 -3139 -20089 -12679
799 -12679 -770 24006 23810 -28815 -44789 27760 61648 -20979 -71092 11210 72530 -199
811 -199 -65247 -9391 50403 15012 -30638 -16078 8002 11470 13531 -2660 -32239 -9658 44979
824 44979 22509 -51416 -33962 51235 41974 -44951 -44233 34981 41017 -22478 -31377 10725 17702
837 17702 -309 -603 -6561 -16748 9731 32536 -9513 -44775 6549 51638 -2601 -53167 -1612
850 -1612 48429 3618 -39706 -3648 27545 585 -14095 4818 1054 -11843 10074 19417 -18108
863 -18108 -25465 23599 29873 -25387 -30478 25533 28128 -23921 -22096 22157 13970 -20443 -4497
876d497K3614k4388j3378L2122M302l7796L317M0385r649l9439J5245L4795k0276
889D357k6953K5673J7093l1099o520L6596l727m1219J2200M4379j8220m4743K1481
902a0702M1462k2441l4375K1677K3110k0157q823J9033p326j9212K3510K0757
914B6513l7894k3465M8590K6740n3999k9229N3746K9661m7878k6588L7318J9695
926B3210k3752q537R492o162L349K2828j3127l9739J8592N4470j9592o4793J6374
939b7387O8737j0378o5683L521N5194K486l8451n621J7262M763N765M24k7497
952a6865r384M5690K0891n7714l2855O2488M2861n9718m8526N0227M8353l6052
964I396m1303J9437K7512l434q609r781j3390J8345L5506k1387n4807J8935O8586
$$ plain form
876 -4497 19117 -5271 -18649 13473 17775 -20021 -16704 23681 14032 -25407 -10162 24633 4357
889 4357 -22596 3077 20170 -10929 -17449 19147 15420 -25799 -13599 30780 12560 -32183 -10702
902 -10702 30760 8319 -26056 -4379 18731 -1426 -10249 8784 1458 -17754 5756 26513
914 26513 -11381 -34846 13744 40484 -13515 -42744 11002 40663 -7215 -33803 3515 23210
926 23210 -542 -9079 413 -5749 -2400 20428 7301 -32438 -13846 40624 21032 -43761 -27387
939 -27387 41350 30972 -34711 -31190 24004 26490 -11961 -17582 -320 4443 10208 10632 -16865
952 -16865 -26249 19441 40332 -17382 -50237 12251 55112 -4606 -53132 -2905 45448 9396
964 9396 -31907 -12470 15042 11608 2999 -6782 -20172 -1827 33679 12292 -42515 -23580 45006
977D5006j2522p4679M022P2517M511o2152j0797M5282J3054k3989j0467J412L306
990e496J9680P709l6987k0656M8365L3337n3011m3569N1106M9208m3907m9023
1002d3244L2833M2417k0452k9794Q566J2700J061O685o963k6016Q859M2940p233
1015B2359n5017L417O0939J374o0231n306N3351P068m1514n680K6594J025j0835
1028b456O469m233j5634J6475K4900k5202l2689K9999L7562l1287l8550K9809
1040d837L5317k6670k8012K2909J7900j9661n792J7340o598j5734J7788J5038
1052A8988k6783j4242L2647J2779l5329j0120L4930N598l2110M74K7666p853k2604
1065a5959J5670J7448k2983j2748K8862Q641l2477m574L2933N93l0352M069K5070
$$ plain form
977 45006 32484 -42195 -38173 34344 38855 -23297 -34094 11188 24242 253 -10214 -8802 -5496
990 -5496 14184 21893 -15094 -35750 12615 45952 -7059 -50628 478 49686 5779 -43244
1002 -43244 -10411 32006 11554 -18240 -9674 3026 4087 10772 3809 -22207 -13348 29592 22359
1015 22359 -32658 -29241 31698 33072 -27159 -32465 20886 27954 -13560 -19240 7354 8379 -2456
1028 -2456 4013 -220 -15854 621 25521 319 -32370 -2371 35191 3904 -34646 -4837
1040 -4837 30480 3810 -24202 -1293 16607 -3054 -8846 8494 1896 -13838 3950 18988
1052 18988 -7795 -22037 10610 23389 -11940 -22060 12870 18468 -13642 -13168 14498 6645 -15959
1065 -15959 -289 17159 -5824 -18572 10290 18931 -13546 -18120 14813 15406 -14946 -10877 14193
1078A4193r448j7835J5882R788k2744j973K9455m540l5231R158L8789j1640l9429
1091b5575J2211L6381j1638k9646J0648J9358j0028o953J0643o529j2766J9451
1103E557J6441l0192k0855L7439K5234m0320k8195L8737K8862l2984k6139K4292
1115b123J9536j4119r162M000l917M305J8493j0046l2605J2070M4281j0812n1945
1128c2044P098N4031j909n0430k923M0983O082k7052o288J0515L290O685L027
1141A1065k2203j1761L4171K1664m1272l0658M2883L7256l9313m0044L1609L7704
1153C1101k1285l0359J0245J8430m21l294o921j3411J0751K9361j0828m2519P725
1166b1425N1206k474n4081l591N1151Q640m2557j1218K9863J0613j4694o339r23
$$ plain form
1078 14193 4745 -13090 2792 12580 -10164 -12137 17318 12778 -22453 -13295 25494 13854 -25575
1091 -25575 -13364 23017 11379 -18267 -7619 11739 1711 -5242 5401 -1128 -13894 5557
1103 5557 21998 -8194 -29049 8390 33624 -6696 -34891 3846 32708 -276 -26415 -2123
1115 -2123 17413 3294 -5868 -1868 -5785 -1480 17013 6967 -25638 -13568 30713 19901 -32044
1128 -32044 -24946 29085 27176 -23254 -26177 14806 20888 -6164 -12452 -1937 1353 8038 11065
1141 11065 -11138 -22899 11272 32936 -8336 -38994 3889 41145 1832 -38212 -6603 31101
1153 31101 9816 -20543 -10298 8132 7711 4417 -2504 -15915 -5164 24197 13369 -29150 -21425
1166 -21425 29781 27307 -26774 -30365 20786 29426 -13131 -24349 5514 16127 1433 -4906 -5829
1179e829j130J4836J0766k5543k0913L1882K9842l3853l6156L1597L8262k6244
1191G517l5708J9262K8620j2067j7849O027M568j823R374J01k2140n94L2514K654
1205B0456l9155n174M1367P472l9415q200L3845O933k5833l428J6274k055o917
1218c830Q914j419j6159P860K2626j2301k7357J4660K9491j5407k8517J5317K4494
1231A8372j4752j8163J4585J0256j4807j695J5711o309j6744J3059J7329j8026
1243a184j6960K0940J5000k1778j1411K1079O057j9623N26J7631p713j5761J4630
1256A433J4169k0437j2743K4229J1284k5661r218K4625O388k1185k315J6257l155
1269C671j0375R609M692j6652K51K3367l796k8833N507L2183n809l2670M975K9870
$$ plain form
1179 -5829 -6959 7877 18643 -6900 -27813 4069 33911 58 -36098 -4501 33761 7517
1191 7517 -28191 -8929 19691 7624 -10225 -4198 370 -1453 7921 8022 -14118 -14712 17802 20456
1205 20456 -18699 -23873 17494 24966 -14449 -22649 11196 18129 -7704 -11132 5142 3087 -3830
1218 -3830 5084 3665 -12494 -4634 17992 5691 -21666 -7006 22485 7078 -21439 -6122 18372
1231 18372 3620 -14543 42 10298 -4509 -6204 9507 3198 -13546 -487 16842 -1184
1243 -1184 -18144 2796 17796 -3982 -15393 5686 11743 -7880 -7354 10277 2564 -13197 1433
1256 1433 15602 -4835 -17578 6651 17935 -7726 -16944 7681 14069 -7116 -9431 6826 3671
1269 3671 -6704 2905 7597 -9055 -8804 14563 10767 -18066 -12559 19624 13815 -18855 -13880 15990
1283A5990l848k3877K984J5244l346m875N279n828q714J5687J3260k3190j8454
1296b3688K7946K2840k8990k5449K6676K5505k1554k2422J4757J5920p414o726
1308b599R33m436L688J6168o069k7079N823L5426l406m0218k75M0650M248l6585
1322a3731p346K8681Q489j7743p024N538K866O500L777j6750j1905K4089K0185
1335B5626k7538k7354K7267L1767k3616l2721J7590K9426j0561k2386L980J1997
1347C477J135J97m147j2550M370K3972k476l2466j073L7353N083l7829q668L4370
1361A0748J0648k7284j0341J7972P440p689k136k206m800J0377J2573j6283k0003
1374b0984J9256K5729j9424k8995J7339K9013j3828k5714R887J9375o443j0691
$$ plain form
1283 15990 12142 -11735 -8751 6493 3147 -1728 3551 -2277 -10991 4696 17956 -5234 -23688
1296 -23688 4258 27098 -1892 -27341 -665 24840 3286 -19136 -4379 11541 4127 -2599
1308 -2599 -1666 -6102 -2414 13754 7685 -19394 -13571 21855 18449 -21769 -22044 18606 22854 -13731
1322 -13731 -21077 7604 16093 -1650 -8674 -3136 -270 6230 10007 -6743 -18648 5441 25626
1335 25626 -1912 -29266 -1999 29768 6152 -26569 -8979 20447 9886 -12500 -8520 3477
1347 3477 4612 4809 662 -11888 -7518 16454 13978 -18488 -19561 17792 22875 -14954 -23622 10748
1361 10748 21396 -5888 -16229 1743 9183 1494 -642 -2848 -7648 2729 15302 -981 -20984
1374 -20984 -1728 24001 4577 -24418 -7079 21934 8106 -17608 -7721 11654 5211 -5480
1386e480M024J097l097Q478L692j6698n437K2922P495k6264r144K6806R615k4676
1400f667q658K0585N807j5439j352R888m174m802R912P39j5435K361J9475m340
1414G900k1676N603K1738o447j9566P361J5706q592j0523J0382M861j2473O94
1427e032J4465n400j6147Q998J6837j1186j6172J2031J3886j2143j0056J1610
1439A691M940j1090J034J0817p120j1043J2535J1485j6470j1929J8751J1935j8898
1452c362j0964J7128Q752j3818m948R691k01n369O336J612j2837J040J8899k481
1466I478k3604K589K6069j763k6057M22K3287N30j7845p56J0564k07k295K709
1480C121n989o484J3173J1072j8338j5639K1021J9506k0934k1613J8323K1368
$$ plain form
1386 -5480 -1456 -359 -3456 5022 8714 -7984 -13421 9501 16996 -9268 -18412 8394 18009 -6667
1400 -6667 -15325 5260 11067 -4372 -5724 4164 -10 -4812 5100 5839 -9596 -7235 12240 7900
1414 7900 -13776 -8173 13565 7118 -12448 -5087 10619 2027 -8496 1886 6747 -5726 -5032
1427 -5032 9433 4033 -12114 -3116 13721 2535 -13637 -1606 12280 137 -9919 1691
1439 1691 6631 -4459 -3425 7392 272 -10771 1764 13249 -3221 -15150 3601 15536 -3362
1452 -3362 -14326 2802 11554 -2264 -7212 2479 2278 -3091 3245 4857 -7980 -6940 11959 9478
1466 9478 -14126 -11537 14532 12769 -13288 -12866 10421 10951 -6894 -7650 2914 2707 412 3121
1480 3121 -2868 -9352 3821 14893 -3445 -19084 1937 21443 509 -21104 -2781 18587
1492A8587j3868j8392Q504J2833l269n233r71l827L504J2901m001k1055K716K6920
1506A5349M4k9845l390K9354O421k5532q117J9108P961j0851n707K037J395O213
1520D440M557j2806j1067J6916J7369j8593k2259J7665K4758j4635k4454J0245
1532g864K1150n723j5086J624P000J237K063k257j0992J602J8607N75k3969l534
1546a5567K6588O483k6037q588K2716R288j7329q054J0717M808l811n7k265n730
1560f838O880J1581r834j6660J0795K0159j0293k1425Q597K0432o723j6903M826
1573e406J1727l679n375L596j356m221P572N631j2480p245J5788Q601j7232r201
1587a3280J6824Q615j5135o574J2329L325r187P52O205n392l690R636J929j3201
$$ plain form
1492 18587 4719 -13673 -5169 7664 4395 -838 -1809 -5636 -2132 10769 6768 -14287 -11571 15349
1506 15349 15393 -14452 -17842 11512 17933 -7599 -15716 3392 11353 502 -5205 -3168 -1773 4440
1520 4440 8997 -3809 -14876 2040 19409 816 -21443 -3778 20980 6345 -18109 -7864
1532 -7864 13286 7563 -7523 -5899 1101 2338 4401 2144 -8848 -7246 11361 11936 -12033 -15567
1546 -15567 11021 17504 -8533 -17121 5595 14883 -2446 -10500 217 5025 1214 1157 -1108 -6838
1560 -6838 42 11623 1789 -14871 -4076 16083 5790 -15635 -7038 13394 6671 -10232 -5406
1573 -5406 6321 2642 -2733 863 -493 -4714 2858 8489 -3991 -11236 4552 13153 -4079 -13280
1587 -13280 3544 12159 -2976 -9550 2779 6104 -3083 -2331 3874 -1518 -5208 4428 6357 -6844
1601f844p53J5575l7j6151O20J5246j563j2769L033R293m898n463P399J587r958
1616e683J619J2395l995j4162N389J4653n924j3756N786J1440n660p625N493K985
1630B955n878K092O751o866q100J0848R596j3536j0663J4464J1281j3727j0695
1643a1478J1631Q727q604n307N204O51j979M659l87j0282J705J5167j823j8799
1657a0915Q97K0588M23j9928j993J7220K864j2584k830O738J494l69J313n641
1671b723m884J0296R210j3347j3240J4449J6250j3501j7706J0977J7099p551j4290
1684h961L839R375m92l116j901l868K796J0631k178j6421L64K0357K166k1819
1698i228m824K0851O874j7502p642J2417O789o259m244J02K11N319M683r185r958
$$ plain form
1601 -6844 -7597 7978 7941 -8210 -7590 7656 6093 -6676 -3643 5650 752 -4711 2688 4275 -5683
1616 -5683 -4064 8331 4336 -9826 -4437 10216 4292 -9464 -3678 7762 2102 -5523 -30 2955
1630 2955 -2923 -831 5920 -946 -9046 1802 11398 -2138 -12801 1663 12944 -783 -11478
1643 -11478 153 8880 276 -5031 173 824 -1155 3504 3117 -7165 -5460 9707 7884 -10915
1657 -10915 -10018 10570 10993 -8935 -10928 6292 9156 -3428 -6258 480 1974 1605 2918 -2723
1671 -2723 -7607 2689 11899 -1448 -14688 -239 16011 2510 -15196 -4219 12880 5329 -8961
1684 -8961 -5122 4253 3761 645 -1256 -5124 -2328 8303 6125 -10296 -9932 10425 12591 -9228
1698 -9228 -14052 6799 13673 -3829 -11471 946 7735 1476 -2768 -2666 -2455 2864 7547 -1638 -11596
1713a1596J1428J4430j1599j7666J0179J8785p590j7791M557J4516j749r578j92
1726c866L398J009L110n53r001r75J3753L256j6768n493J7657P368j6554q272
1740a1931J3899P767j0014n908N696K668j619J411j713n994M063J0178n361j3321
1754a0179N278J5292m630j5384L553J3838k641j0669K158O606k322k052L295k376
1768b33m706O143O325q766p760J0103Q551j0219q400R411P086q061m869O459J704
1783B768n037J871L982n393l331Q358L119j0429l116J1457K926j1103k432R779
1797C419J353p593N31M928k953k235N660N6q442J663J0586k558j2064K748J2208
1812G307k475j1110K064Q782j969n374K168J471l172K758M468o209o211Q829Q085
$$ plain form
1713 -11596 -168 14262 2663 -15003 -4824 13961 6371 -11420 -6863 7653 5904 -3674 -3866
1726 -3866 -468 541 3651 3098 -5903 -6878 6875 10131 -6637 -12130 5527 12895 -3659 -11931
1740 -11931 1968 9735 -279 -6187 -491 2177 558 1969 256 -5738 -1675 8503 3142 -10179
1754 -10179 -4901 10391 5761 -9623 -6070 7768 5127 -5542 -3384 3222 900 -1152 2143 -233
1768 -233 -4939 1204 7529 -1237 -8997 1106 9657 -562 -8962 449 7535 -526 -5395 1064 2768
1783 2768 -2269 -398 3584 -1809 -5140 3218 6337 -4092 -7208 4249 7175 -3928 -6360 3419
1797 3419 4772 -2821 -2290 2638 -315 -2550 3110 3166 -5276 -3613 6973 4415 -7649 -4901 7307
1812 7307 4832 -6278 -4214 4568 2599 -2775 -607 864 -2308 450 4918 -1291 -7502 1327 9412
1827I412j0183r520J0225J0116q945r542O837P750m361m784K005O93l6L819j118
1842B368q188J145J1956m64j4543r14J5491K481j4710l650J2204M197q415l682
1856d724L938J984P98O69m851m114P982P699r563j0989R791J3167q541j3972O272
1871d454J3025l661j0265R92O198Q68j196j813m096J574Q937k61j2715j645J4877
1886F365L892j5270n692J3748O860j0886o751P069N406k872k833j090o64M189
1900A471M716o290q545O952J1668o495j3562N081J3832l162j2544J294R670J54
1914D240n708p08J069N09L426O58p262k355J0036M350j1427o031J1418P029j0150
1929i06p033P926N851n224l702K627O89m76K735j094o070J857Q687j839j0501
$$ plain form
1827 9412 -771 -10291 -66 10050 1105 -8437 -1600 6150 1789 -2995 -990 -297 -333 3486 2368
1842 2368 -5820 -4675 7281 6817 -7726 -8640 6851 9332 -5378 -9028 3176 7373 -1042 -4724
1856 -4724 -786 1198 1996 2665 -2186 -6300 1682 9381 -182 -11171 -1380 11787 3246 -10726 -4454
1871 -4454 8571 4910 -5355 -4363 1835 2703 1507 -306 -4402 -2828 6109 5848 -6867 -8512 6365
1886 6365 10257 -5013 -10705 3043 9903 -983 -7734 -665 4741 1869 -964 -2054 -2718 1471
1900 1471 6187 -103 -8648 -1696 9972 3477 -10085 -5004 8828 5666 -6878 -5584 4086 4240
1914 4240 -1468 -2176 -1107 -598 2828 3486 -3776 -6131 3905 8255 -3172 -9203 2215 9244 -906
1929 -906 -7939 -13 5838 614 -3088 -461 228 -248 2487 1393 -4677 -2820 5867 4028 -6473
1944f473J409J1151q15j0509L29Q707j58o142O48L234j702j99L231k447m796M266
1960b66O372n363p418N637P689n391p098M639N594l818l279L136M60k797K483
1975E80K852n104l233P029L775q154m033Q155M082p397l389N848K167l896k44
1990i62K080k287l97M797o44p261J086R064j039r982N77R745L9q521m27O262M67
2007B597l444K26K57j482K840L113n205n017O648P059p236q326O781Q758n509
2022B060q135L672O488j747l867J59L29Q45L375j118o792M98R569N45j1140j944
2038g203J1398L328j0403m027Q057M247n074l308J619J608J648Q86m275l811N942
2053F32O778o571r149O104J0474m751j0738K960R630j118p255n86M014J432k00
$$ plain form
1944 -6473 -5064 6087 5272 -5237 -4908 3799 3641 -2501 -1853 1381 -321 -520 2711 264 -4532 -266
1960 -266 6106 743 -6675 -1038 6651 1260 -5838 -1199 4395 577 -2702 434 894 -1903 580
1975 580 3432 -1672 -4905 2124 5899 -2255 -6288 1867 5949 -1448 -4837 1011 3178 -718 -962
1990 -962 1118 -1169 -1566 3231 2587 -4674 -3588 5476 4437 -5545 -4968 4777 4816 -3705 -4132 2130 2597
2007 2597 -847 -621 -364 -1846 994 4107 -1098 -6115 533 7592 356 -7970 -1189 7569 2060
2022 2060 -6075 -2403 4085 2338 -1529 -1370 -1041 -196 3179 2061 -4731 -4233 5336 5881 -5259 -7203
2038 -7203 4195 7523 -2880 -6907 1150 5397 323 -2985 -1366 242 1890 2776 -1499 -5310 632
2053 632 7410 839 -8310 -2206 8268 3517 -7221 -4261 5369 4251 -3004 -3590 424 1856 1656
2068A656j471l721Q49O960O59r302k481J0458M190j0157n454Q848N957o560n361
2083d930L631L866q98j350j535j623L246M620l972p395L882R210l048j0113J927
2098d482R744p04q216l10N742P51k607n87n33k43L434J593n647l076O935M606
2114F400p365n640O908N905n686n471M100M110k439k038R25l77k5K986m24n280
2130c411K67P002J15p790o21P620J192o796j199N226O81l143L36J029j722Q94
2146c20L211k177m804K955N923l116o508K927O234k352n403J808L708j456j511
2161h81J348p66j704K976K267m598l050N675L771n870m255N485M192m439l553
2176c402L108K322j711m70M73j804M24L952o87n910M56P214P4p682p99P250J441
$$ plain form
2068 1656 185 -3536 -2687 4273 4932 -4370 -6851 3607 7797 -2360 -7814 1034 6991 431 -4930
2083 -4930 -1299 2567 1669 319 -1216 -2839 407 5027 1055 -6340 -2458 6752 3704 -6409 -4482
2098 -4482 5262 4558 -3658 -3968 1774 2525 -82 -669 -1202 -1445 1989 3582 -2065 -5141 1794 6400
2114 6400 -965 -6605 303 6208 522 -4949 -849 3261 822 -1216 -291 -668 -693 2293 1869 -3411
2130 -3411 -3144 3858 3973 -3817 -4438 3182 4374 -2422 -3621 1605 2286 -857 -521 508 -1214 -320
2146 -320 2891 714 -4090 -1135 4788 1672 -4836 -1909 4325 1973 -3430 -1622 2086 630 -881
2161 -881 467 -299 -2003 973 3240 -1358 -4408 1267 5038 -832 -5087 398 4590 151 -3402
2176 -3402 -294 2028 317 -153 320 -1484 -1060 2892 2205 -3705 -3249 3965 4039 -3643 -4442 2808 4249
2193D249o053j697M096J391j714m77o93r54K831K641m264m432N010O048n028o835
2209e881M195P056k898o433J459M767k12k447p01l16J069L096q57n504j4P298
2225C677J203q181k438Q039L471o895l931N019L775k754k781L21J113J791J122
2240B551l287l534M048N701m041p259L266Q008k093p750P24O586L56m489j216
2255b429J959J389P92q48l465j31N507J506o664k908P017M104o555m670N220M645
2271D469l432l841J569K273J93l14j481j999K166M174k319n886J845O925j030
2286C312p174J50O438O63m994j108L138R48r15l13j145p80K890K177m025l445
2302d183M445M417m257m889L551M713k563l939J602K430p09o59K33j415QL131
$$ plain form
2193 4249 -1804 -3501 595 1986 272 -205 -898 -1852 979 3620 -644 -5076 -66 5982 954 -5881
2209 -5881 -1686 5370 2472 -3961 -2502 2265 2053 -394 -1095 -1411 -342 2754 1897 -3607 -3621 3677
2225 3677 4880 -3301 -5739 2300 5771 -1124 -5055 -36 3739 985 -1796 -1475 -362 1429 2551
2240 2551 -736 -4270 -222 5479 1438 -5821 -2555 5453 3360 -4390 -3666 2920 3276 -1213 -2429
2255 -2429 -470 919 1711 863 -2602 -2733 2774 4280 -2384 -5292 1725 5829 -726 -5396 -176 4469
2271 4469 1037 -2804 -1235 1038 1231 917 -564 -2563 -397 3777 1458 -4428 -2583 4342 3312
2286 3312 -3862 -3712 2726 3389 -1605 -2713 425 1373 458 145 -1000 -1780 1110 3287 -738 -4183
2302 -4183 262 4679 422 -4467 -916 3797 1234 -2705 -1103 1327 618 -41 192 -1223 -1215 1916
2318A916L15m659o73N363J259n490j676M983J902l938j578K582Q45j156L39k85
2334D9j617J206L103j741m306J808N058j585n230J067M814n64l766J41K231q1
2350E87m96M26j284j099K815K070l857k918M209L708m076l964L341L843k363l164
2366b222J251J862k54j22m18j816P51L532o89m862J44N677N33n815j255N336J718
2383C351m052j868K406J495n49o49j140o51K592K216l498l606L652M784l284n390
2399d191K388N440j310m801K36L289O13j397j106o75J027K723m35m434m72N458
2415B353J598n791k530N327L309m343l475K890L063j206j956m60M64J814J276
2430B333k568l112K739M573k399n555J680N782o98n413k40M262R83k633j230O36
$$ plain form
2318 1916 2231 -2428 -3101 2262 3521 -1969 -3645 1338 3240 -698 -2276 306 1151 -5 334 49
2334 49 -1568 -362 2741 1000 -3306 -1498 3560 1975 -3255 -2188 2626 2062 -1704 -1563 668 587
2350 587 91 517 -767 -1866 949 3019 -838 -3756 453 4161 85 -3879 -538 3305 942 -2222
2366 -2222 -971 891 637 515 97 -1719 -968 2564 1875 -2987 -2843 2834 3367 -2448 -3703 1633 3351
2383 3351 -701 -2569 -163 1332 783 134 -1006 -1657 935 3151 -347 -3953 -301 4483 1199 -4191
2399 -4191 -1803 3637 2327 -2474 -2238 1051 1664 267 -839 -1514 -487 2236 1801 -2633 -3105 2353
2415 2353 3951 -1840 -4370 957 4266 -77 -3552 -662 2401 1195 -761 -1221 -757 1057 2333
2430 2333 -235 -3347 -608 3965 1566 -3989 -2309 3473 2775 -2638 -2878 1384 2367 -266 -1496 -860
2446h60J101J233l58k987o14M140J848m649k956M537L726l836l859K653L519j362
2462A276k639J85J146Q06M53j188k250J300L625r32m628K86N087L45m786r82L965
2479A069J320k752j248J354P84J56R1j447j156K373K208k786l202K789L754k284
2495A023l852J571L422q83k537K47J256J02K34j24j698j90K864P00l637j278L943
2512A163J844l618k127K906K062j910j632Q96P54N6M27p40j723J145K783j108
2528A178l656P84M040k82m040j67L393N32k395o94J155M37K94M0j464q41K472
2545G86J763k982k562L003L235k607l378J773L105q64k469J61J202M80K28q14
2561F0j737P94K946l81l841l53M303J082m148j661L397K064k366j948J055J441
$$ plain form
2446 -860 241 1474 1116 -1871 -2485 1655 3503 -1146 -4102 435 4161 325 -3534 -881 2638 1276
2462 1276 -1363 -1178 -32 774 1227 39 -2211 -911 2714 1782 -2846 -2560 2527 2872 -1914 -2896 1069
2479 1069 2389 -363 -1611 -257 527 683 774 -673 -1829 544 2752 -34 -3236 -447 3307 1023
2495 1023 -2829 -1258 2164 1281 -1256 -1009 247 349 583 459 -1239 -1429 1435 2135 -1502 -2780 1163
2512 1163 3007 -611 -2738 168 2230 320 -1312 -416 338 394 821 81 -1642 -497 2286 1178
2528 1178 -2478 -1694 2346 2064 -1976 -2143 1250 1782 -613 -1307 -152 285 579 619 -845 -1686 786
2545 786 2549 -433 -2995 8 3243 636 -2742 -969 2136 1272 -1197 -1036 166 646 874 60
2561 60 -1677 -883 2063 1682 -2159 -2512 1791 2873 -1275 -2936 461 2525 159 -1789 -734 707
2577G07K54n30j301o66K111J865k344l059K271L902j827m207J049L911j17l307
2593a288n42K073R81n57j077j002P24K442j50l356p95L939J653l871k397L379
2609A56K719k306k752J270K134m4j185r61o2J516J512j849k681J584L666j158
2625A559m034K88M083L77l427r98K456J256j151j172j89O90J399J18k348r34K795
2642G68J876k892k616K557L064j938k891J015K430k60j496m35L08Q72R08r33k119
2659a782O53K950j00l417n90L510J008k920j414K138J456j106j065J38L84P95
2675F38M62j422j367J701K185j661k797J371L027q27k859J78K347J78j453m55
2691g54L23N18O92j96j636l58K330R05k573j474K556J930k118k063J448J843o50
$$ plain form
2577 707 961 431 -870 -1536 575 2440 96 -2963 -692 3210 1383 -2824 -1775 2136 2019 -1288
2593 -1288 -1830 243 1224 667 -410 -1412 -688 1754 1604 -1752 -2547 1392 3045 -826 -3223 156
2609 156 2875 569 -2183 -913 1221 1177 -8 -969 -1031 485 1997 148 -2533 -949 2717 1559
2625 1559 -2475 -2187 1896 2273 -1154 -2152 304 1560 409 -763 -952 -262 1137 1255 -1093 -2027 768
2642 768 2644 -248 -2864 -307 2757 819 -2072 -1057 1373 1113 -383 -818 -510 362 1270 337 -1782
2659 -1782 -1129 1821 1721 -1696 -2286 1224 2232 -688 -2102 36 1492 386 -679 -541 -157 638
2675 638 1100 -322 -1689 12 2197 536 -2261 -890 2137 1310 -1549 -1371 976 1154 -299 -754
2691 -754 -431 87 779 583 -1053 -1411 919 1824 -749 -2223 333 2263 145 -1918 -470 1373 723
2708G23j260j31M81N84N81r23j526Q89K352o19k870J05L028L84k774q37K122J025
2726A334j168j000K01P26P13Lj543q24J994J670k108k291J841K690j322k682O48
2743a118K327jj662n72O97Q96L66q75j491N50K277L3k862n57K929J219k617j654
2761b115J960J914j134j648J13J192P14l38j273p15J622J705j562k569J305K919
2777B090p20k993KK634N78j935r88R54J084J33r00j142L90J963L03k432j038K602
2795E85J651k232k115J680K279r77k016J60J494M30n46j036l82J222J339j061
2811D75k159O39K697j24k842m91K563R51j928j252J086J239j60q38p03K96J333
2828G82M97j760j234J868J824j565k257J096K277n02k019r0J473N42o63p95k55
$$ plain form
2708 723 -537 -668 -187 397 978 55 -1471 -582 1770 1151 -1719 -1614 1414 1798 -976 -1813 309 1334
2726 1334 166 -834 -633 93 806 809 -734 -1558 436 2106 -2 -2293 -452 2238 916 -1766 -1118
2743 -1118 1209 1208 -454 -1026 -329 567 933 58 -1433 -883 1394 1427 -1435 -1992 937 2156 -461 -2115
2761 -2115 -155 1759 625 -1023 -910 282 996 658 -615 -1330 292 1997 435 -2134 -829 2090
2777 2090 1370 -1623 -1621 1013 1591 -344 -1332 -378 706 839 -61 -1203 -813 1150 1453 -979 -2017 585
2795 585 2236 4 -2111 -431 1848 871 -1145 -985 509 939 393 -643 -1025 197 1536 475
2811 475 -1684 -1045 1652 1528 -1314 -1805 758 1709 -219 -1471 -385 854 694 -144 -847 -551 782
2828 782 1279 -481 -1715 153 1977 412 -1845 -749 1528 1026 -993 -1083 390 932 269 -526 -781
2845g81O84J155m98j753l5K231N65k268j051K085J349j575j464R23J261j25p77
2862g4n35J27R72N64j112j348J083J890q07k218L10K202K19j913n95J325P84n58
2880C16p89j92M53R64m5j401o33J846J079j710j536J453J735r13j670K93J407
2897F57J87q45n76J03P10P80q58j360M60J988j63k133l85K055Q08j679j117J145
2915b23J135m13r87j88M65R20J01j323o72J391J402j304j816R04K037m00j952
2932i23j93J599N67r55q36J66Q06O50o32j347K05J886K84k019q62J921J313j493
2950A37j513R33J484k87j221l34O63Q49%j065q01J139J426q76j929M94K139p8
2968A160j989n06J598Q79j021r84L02R07M96o12j109J27J517M35j658r59J452
$$ plain form
2845 -781 -97 1058 560 -1193 -1228 1003 1568 -700 -1751 334 1683 108 -1356 -433 828 703 -74
2862 -74 -609 -482 490 1054 -58 -1406 -323 1567 760 -1458 -1148 1054 1273 -640 -1235 90 874 316
2880 316 -473 -665 -212 752 707 -694 -1327 519 1598 -112 -1648 -195 1540 627 -1043 -750 657
2897 657 844 -1 -577 -474 236 1016 158 -1202 -742 1246 1083 -1050 -1435 620 1428 -251 -1368 -223
2915 -223 912 499 -488 -676 -211 709 810 -513 -1185 206 1608 304 -1512 -608 1429 1029 -923
2932 -923 -1116 483 1050 95 -741 -575 231 881 249 -1098 -893 993 1277 -742 -1604 317 1630 137
2950 137 -1376 -443 1041 754 -467 -801 -138 711 711 -354 -1155 -16 1410 534 -1395 -901 1238 1160
2968 1160 -829 -1335 263 1142 121 -863 -561 346 842 230 -879 -752 765 1200 -458 -1417 35
2985C5J550j204j738P02J603q5j275m39Q29P52j34q93o36Q06J243n54j638M5J930
3004H99L22j796p39J417J057q88j123K71R38L59n37q14m0J134O18j226j072J032
3022a88J537p33j734L12J593J56j303n14P04P89j17p40n48N11J094j41j512k29
3040a063J518P68j379j063J016J292o07j191M5R59L34l44p88j32R06P12q87j176
3058a080O39J518k81j623j81J490N33j149p42N66Q32N5p91m91L88R66J04j199
3076d46o74J322J057j141j201O32J431k55j334j62R54N18l58p97j87P54P18n58
3094B73j211K43J412K70j540o04J357Q72r21j017L93J048O4p07n85L27R08J63
3112G45j070o91J031J148p24j438L48J463L3j311m29R29P15m39q61p8P01O33m19
$$ plain form
2985 35 1585 381 -1357 -655 948 863 -412 -851 -22 730 596 -297 -933 -127 1116 562 -1076 -1031 899
3004 899 1221 -575 -1314 103 1160 272 -851 -580 358 717 180 -634 -674 460 1078 -148 -1220 -188
3022 -188 1349 616 -1118 -806 787 943 -360 -874 -170 619 502 -238 -786 -275 819 678 -834 -1063
3040 -1063 455 1223 -156 -1219 -203 1089 482 -709 -664 295 629 285 -503 -635 271 983 96 -1080
3058 -1080 -441 1077 796 -827 -1008 482 1015 -134 -876 -310 522 577 -214 -705 -317 649 753 -446
3076 -446 -1120 202 1259 118 -1083 -451 980 725 -609 -771 183 701 343 -454 -641 113 831 273
3094 273 -938 -695 717 987 -553 -1157 200 1072 151 -866 -473 575 639 -68 -653 -326 582 745
3112 745 -325 -1016 15 1163 439 -999 -651 812 845 -466 -895 34 749 310 -551 -629 72 705 286
3131B86j065O4J261M58j324q48J112J104o87j220K26J210J67p90n91L27P74K89
3149G53q91p36O82J160l37j470KJ380L75j212o54Q70Q09l92p88j95O63O17l03
3168C33r19j65J103O12j066r13P79J191m14j254Q6J010L83p33o70K69P14L04p41
3187i1p11M99J070j64j233k33J220O21j009q93O49Q82p4r01k77N94O14j68p95
3206d00k68Q67P13p50j035M13J251j06j201k56J028N09o99p35K37P38K37n25o90
3225f72K95R36P8j092m21R77Q34p62j031M67J019k2q85l33N88N86j14p37l65P66
3245A12O26m55r92J18J221J63j239m59R04P40n33q30R3P93L03m97o47J39R13J98
3265F71r51n45P61R41m71j111K37R93J71q52n31N46O84j06p01l11N41O79l03r31
$$ plain form
3131 286 -779 -715 546 1004 -320 -1168 -56 1048 361 -859 -633 577 744 -46 -637 -310 464 753
3149 753 -138 -874 -192 968 631 -839 -837 543 918 -294 -948 -78 731 339 -449 -644 19 636 333
3168 333 -586 -751 352 964 -102 -1015 -236 955 541 -713 -627 383 766 33 -637 -368 346 650 -91
3187 -91 -802 -303 767 603 -630 -863 357 978 -31 -924 -275 607 533 -368 -645 -51 563 395 -400
3206 -400 -668 199 912 162 -873 -460 791 685 -516 -772 256 765 66 -669 -432 306 543 18 -672
3225 -672 -377 559 637 -455 -876 101 935 173 -858 -391 628 606 -279 -612 -24 562 448 -289 -654 112
3245 112 738 283 -709 -591 630 793 -446 -905 -1 739 206 -624 -531 262 565 68 -579 -440 473 671
3265 671 -280 -825 -64 877 406 -705 -468 525 696 -156 -687 -141 543 437 -264 -575 -34 645 342 -589
3285e89k4J057K85r32o64P40Q33l18r13l8P68M64n23o41Q4P83L52p57p06N05J005
3306G71k68j056p9J003L30p59o15M52P26k5p25l25M03O92j53q38j45Q53M71o65
3326D8p38M66Q86k10q64j65P41M00l12p41Q7O76K81n92o42L93Q68q1r29l21Q98
3347A49N42o23o74K70P36P4o08m21L63P44j36o95l63P73N68n17q55L17Q73np60
3368b48l25O09N04k59o80j15O59M15n03o77K18Q31J23q35l84O73O68m89p60J90
3388c85P21J65n65m17L51N86L7o93l55O22N83m05p76N1Q81K32p75m61M84O72j86
3409C67p33j29N77L80l07n98l9Q29K66p61n66O12O87k84p57j3Q00K51n92m69K55
3430b24O00P6o17m24N11O02j80q10m2P76L24o25o02M55O51j82n21k53N87M12l19
$$ plain form
3285 -589 -613 444 729 -203 -867 -127 706 388 -525 -563 205 669 146 -495 -411 372 724 -33 -739 -234 771
3306 771 503 -553 -632 371 701 -58 -673 -221 505 480 -245 -570 -167 525 372 -466 -611 242 713 48
3326 48 -690 -224 662 452 -412 -577 164 564 252 -489 -402 274 555 -37 -679 -286 582 501 -428 -749 149
3347 149 691 68 -606 -336 400 474 -134 -555 -192 552 416 -279 -642 131 699 182 -673 -356 517 512 -248
3368 -248 -573 36 540 281 -399 -514 145 560 57 -620 -402 429 552 -283 -667 6 674 185 -575 -385
3388 -385 336 501 -64 -481 -130 456 493 -200 -555 67 650 245 -531 -480 401 633 -142 -603 -119 553 367
3409 367 -366 -495 82 462 155 -443 -482 347 613 -148 -714 -102 585 301 -456 -469 331 582 -10 -479 -224
3430 -224 376 452 -165 -589 -78 524 344 -466 -508 268 592 -33 -635 -180 471 289 -232 -485 102 514 195
3451A95n69q9P71K54n34o69M70P20j30q02j04O75M31n60n54J71N79J90o00l58
3471e13L63N99j51p38j31P24M03m90o08L02O67mo28k34M60M76k60n78l9N62M03
3492E85n54n35K38P47p5p31k12N77M41l39n82O2O00J89m61m47L30N33qo86k04
3513e32O24M21l69o68K38O27R5n49l66M12N22j23n69j54N13L77l54o03J43O99
3533C84Qn39l59M69M44j48o39J8N05K24l57m31K09N15P1n32l15M51N31l01n72
3554c64k6O54J56m73l57K55M93m4n35k03M17M70k50n95K8N68K41m91m13K93N87
3575D11j81m91j03M66M00m22m41Q1N66J58n38l69M08N21j81o36p3N99K34m18m50
3596d59K12N30O9n04l47M31M62j17n94o8N72K93m58m66K32N74K3o00j81M19L90
$$ plain form
3451 195 -374 -463 308 562 28 -641 -171 549 419 -383 -487 188 619 59 -495 -324 255 445 -155 -513
3471 -513 -150 449 298 -440 -571 153 556 66 -542 -240 427 423 -205 -439 21 497 237 -341 -380 182 585
3492 585 31 -504 -266 481 406 -325 -537 40 481 142 -440 -378 222 411 -50 -497 -167 366 358 -328 -532
3513 -532 92 513 144 -524 -286 341 436 -113 -479 -67 455 332 -237 -391 122 499 145 -458 -315 384
3533 384 392 -147 -506 -37 407 259 -380 -362 143 367 10 -421 -212 303 374 -158 -473 -22 509 208 -364
3554 -364 -390 264 420 -53 -410 -155 338 294 -241 -444 -27 443 193 -402 -374 194 435 -56 -469 -176 411
3575 411 230 -261 -364 102 502 80 -361 -280 286 444 -94 -463 -55 466 285 -351 -424 175 409 -9 -459
3596 -459 -247 283 352 -152 -499 -68 394 277 -317 -385 187 480 22 -444 -212 362 385 -215 -396 23 413
3617D13k11n74O5N26J74m40l75K96M76q0m38k51M88L28l66m91Q6O31J27n07k69
3638c92L48M55j75n28j30N77K08k84m31J36N49nm45l19M03M08j78m91n2M94K70
3659D18m55l80J79N76l9n10k02L65M34k17m93K8N14J54l91l65K62M55k3n16j73
3680c79M56L31l25m00M0N14J16m40l10L02L82j05m25p4L82L30l23m63J81M68R4
3701C52m52k58L25L81j13m45o2L97K67l95l02J42M45N9m84k10L38L57k27m27L4
3722b78M55J31l32l61K29M44m9m45j84M34L55k43m56N1M32J45l48k84K06M52q2
3743B72m64p1L98J92k49l97J02M23J15l96l05L76K71j3n13j00M58J85k50l54J15
3764b05M31Q2m24k21L09L58q4n05p4M64K25l31l77J29M71J6m45j28L68L21k40
$$ plain form
3617 413 202 -372 -307 219 393 -47 -422 -126 350 270 -168 -419 69 397 31 -460 -374 257 384 -123 -392
3638 -392 -44 411 236 -292 -422 155 363 79 -352 -216 333 328 -117 -436 -33 375 197 -294 -346 148 418
3659 418 -37 -417 -238 338 299 -211 -413 -48 386 169 -324 -296 218 372 -19 -384 -122 333 310 -206 -379
3680 -379 77 408 83 -317 -277 237 353 -87 -397 -95 287 182 -243 -317 65 395 72 -391 -210 258 352
3701 352 -100 -358 -33 348 235 -210 -272 125 392 -3 -305 -163 282 341 -143 -353 -15 342 115 -312 -278
3722 -278 177 308 -24 -385 -156 288 239 -206 -390 44 399 156 -300 -249 183 328 -20 -304 -98 354 272
3743 272 -192 -263 135 327 78 -319 -217 206 321 -75 -380 -4 267 254 -259 -359 99 284 34 -320 -205
3764 -205 226 308 -116 -337 -28 330 246 -259 -333 131 356 25 -352 -223 248 264 -181 -309 59 380 140
3785A40m19k0M81J44l82l09K40M66o6m54j61M11K96k59m26J53L87Q7l97k08K19
3806g7L58r6l65j16M02J78k35l35R5M32J0l49k14L16L54j90m40k0M36J90k96l90
3828c52J83M42N7m70j40L44L02k33l70PL82J94l61k69P1N15j10l93j52L52L51
3849C50k84l20K4M01N8l34j35K20L00j18k87j53L36K70k68l33R3L97R3l35k75
3870c00K72K86q7l34o5K43K20j92k90P2L46M0l65j33K41L39j77l53l2M28P6k27
3892Hk51J38L12J7l08j78K73K35r6l86J8L51K07m00k35J87K94ql19j24K62K93
3914B90k02k76j3L30J10l27j44J54L52q7l74n0L40J69k10k69O9L74l1k60k04K15
3936d4L08j17l23j30L69K58l19k82J38L39M7m00m9K25K74k08k74JK95J68k52k66
$$ plain form
3785 140 -279 -299 182 326 -56 -365 -125 341 275 -179 -340 71 367 108 -318 -165 222 309 -88 -296 -77
3806 -77 281 185 -180 -296 106 284 49 -286 -191 241 251 -98 -312 4 358 168 -272 -292 144 334 38 -352
3828 -352 -169 273 330 -140 -280 64 366 133 -237 -230 152 346 -15 -284 -213 302 192 -201 -353 -1 350
3849 350 66 -254 -230 171 229 -105 -240 -20 280 162 -125 -278 58 328 60 -273 -180 217 310 -25 -300
3870 -300 -28 258 171 -163 -228 15 235 43 -247 -175 171 211 -154 -287 -46 293 116 -237 -269 159 235 8
3892 8 -243 -105 207 224 -84 -262 11 246 150 -236 -218 133 340 -60 -295 -108 186 178 -141 -265 -3 290
3914 290 88 -188 -201 129 239 -88 -232 -78 274 187 -187 -237 103 272 62 -207 -138 236 205 -55 -259 -44
3936 -44 264 147 -176 -306 63 321 2 -280 -142 197 244 -156 -205 20 294 86 -188 -187 108 276 24 -242
3958b42J05L13K8l42j60L22K63k18k85Q1K65Q4k68k26J87L11%l74j42L70K03k37
3980C8l03Q2M26K6l49k30K95K07l2l47j2L03J57k37k46N5L49J4l06j13K79J95
4002B51j67k54m1L39O2k08k02J31L05J4l47j16K36K43j64k93L9K82J45l44j61
4023b50K19K46j02k66l6K21J92j86k31M7K73O5k88r7J50K84q1l32j1K74J39k22
4045Hk47J22K49Q8k58j72J93K00m5l14j4K85J38k94j93K04J60k6j90p1J85K82
4067B90k22k33OK43J54k02k60J91K71n4l25l8K13K01j70k09J8K30Q9j90k19J92
4089b4K14l4k80q6K66J56k13k84J04L35L1l35p4J87K08m0k28j19K62J48j15k44
4111a65R2K93k3l02r1K55J90j00l26J9K53R4j67k25J32J76L9k45j44K44K12j49
$$ plain form
3958 -242 -137 176 204 -138 -298 24 287 69 -216 -135 130 214 -54 -280 -93 218 218 -156 -298 72 275 38
3980 38 -265 -183 243 269 -80 -310 -15 192 160 -187 -199 104 261 24 -222 -167 182 196 -110 -223 56 251
4002 251 84 -170 -211 128 190 -18 -220 -89 216 230 -117 -233 3 246 82 -211 -172 110 255 -89 -250
4023 -250 -31 215 113 -153 -189 32 224 38 -193 -146 127 192 -96 -193 -43 241 160 -172 -183 91 230 8
4045 8 -239 -117 132 220 -38 -210 -17 183 138 -176 -190 95 233 -61 -254 -50 110 84 -106 -177 8 290
4067 290 68 -165 -159 84 238 36 -224 -33 238 184 -141 -179 34 235 65 -144 -126 104 193 3 -216 -24
4089 -24 190 156 -124 -210 56 212 -1 -285 -181 154 185 -150 -224 -37 171 131 -97 -216 46 194 79 -165
4111 -165 -73 220 197 -105 -196 59 249 149 -177 -158 95 189 22 -203 -71 105 144 -101 -245 -1 211 62
4133F2k48K1L29O2k98j42J91J60l7j95j28K30K44j69l18P2L69K0l42j41K38K24
4155B04j27k14j6J58J67j88j43P5K36J9k31j32K05J75j35k26N7K48J02k43j21
4176a30J06J77Rk10j41K09K07j76k40M1K45P0k43j63J86K09m8k49l4K50O9j31
4198A3j83Q4J95M2j66j63J13K90j29j79q3K51R9j26k49J33K01qj45j09N6K10n4
4221I3k30k2J87J45k44j43J39J97l6k13L3R5Q8l4j89K3J76J34k23j01P5K19m4
4244A25k30m5J72K31k26k28R5K18L1j60j18J08J17M1k47p5J65J85j46j92N8K68
4266A47Qk19q9J50J74l7k35k1J46J24q7k20O7K14L3k32r8J64J97j02k23J1K55
4289A27j8q6j67M8J81j3j09j31J87J48j03j87n8L21J1j92j29J20J97m4k25j9K06
$$ plain form
4133 62 -186 -165 164 226 -72 -214 -23 137 100 -95 -223 7 251 82 -236 -164 205 225 -117 -258 -20 204
4155 204 77 -137 -153 5 172 -16 -159 -84 152 171 -60 -192 13 188 53 -173 -116 132 234 -9 -130
4176 -130 -24 153 162 -48 -189 20 227 51 -189 -148 97 167 -76 -239 -53 156 108 -141 -175 75 144 13
4198 13 -170 -86 109 151 -15 -178 -65 225 96 -83 -166 85 184 58 -191 -58 143 135 -10 -119 -63 147 93
4221 93 -137 -159 28 173 -71 -214 -75 122 86 -127 -94 1 89 55 -134 -111 65 199 -24 -125 -50 169 125
4244 125 -105 -150 22 253 27 -201 -106 112 143 -17 -135 -27 90 131 -116 -191 -26 159 13 -179 -121 147
4266 147 155 -64 -153 -3 171 134 -101 -122 24 148 61 -159 -92 122 155 -77 -175 -11 186 84 -139 -128 127
4289 127 109 23 -144 -96 85 72 -37 -168 19 167 64 -123 -181 140 151 -41 -170 -50 147 103 -122 -141 65
4312F5J02j56j20k2J95J11k09j33J01K48n0k99Q7J55P5j59j01O6J81Lk04n1J25
4335A0J87r1k14k4K52N9j56k16J43J61l7j69p1J39J54j33j30J4J59J04j85j61
4357b05J69J53m9j63q0K11J46j40j83J13J25P4k48qR1J09Mk48l9K14J53j87j61
4380a49J12J58q1j03q7J35J02J7j65m0J38J12j11k46J51K01k7j84n5J37J33q3
4402F5j55L5J28K1j18r2L2K17kj58j43J76J25q7j64kJ85N6j58j06J75P6j14l5
4426d3n4J68J10j71j87N1J90N3j50o7N2J25mk00K5J15P5r8o4LJ31L9p8j12Q8J68
4452A65q5j82M8J50Q2j86l1Q2N3j4r2j14J31J34o2j98%J36J21j52j53J11R4L1
4476F9j74j1J47J19j30j34L2J64M1j02j09L8J28k5j24k9J44P8j12r2J4J86n6j01
$$ plain form
4312 65 167 11 -109 -131 64 175 -34 -167 -66 182 132 -167 -80 75 150 -9 -110 -44 137 140 -64 -115 10
4335 10 197 106 -108 -132 120 179 23 -193 -50 111 74 -95 -166 -27 127 -6 -136 -122 37 141 -44 -205
4357 -205 -36 117 68 -95 -175 36 182 42 -141 -28 97 171 -77 -85 6 115 119 -129 -168 46 199 12 -149
4380 -149 -37 121 40 -63 -150 -15 87 104 -61 -101 37 149 38 -208 -57 144 117 -67 -122 15 148 65
4402 65 -90 -55 73 94 -24 -116 -84 133 131 -27 -170 6 131 44 -120 -122 63 119 -39 -145 30 106 -8 -43
4426 -43 -97 71 181 10 -177 -126 64 117 -33 -100 -48 77 73 -127 -102 13 88 -10 -74 -71 60 99 21 -91 -3 165
4452 165 80 -102 -54 96 178 -8 -39 43 96 82 -10 -124 7 141 79 -119 -119 17 138 -14 -167 -56 38 69
4476 69 -105 -116 31 150 20 -114 -82 82 123 21 -88 -50 78 53 -71 -100 44 122 10 -82 -68 118 62 -39
4500c9q3J05J30k8j43p1J64J41j55j76R8J92o7j47j2J36R1r3j60N0J25M3j24j29
4524a52P1J70Rj52p6J47J06j03j42M5J51J7j37m0R6O5m4o7q6J03J57r8j38N9J04
4549F5N1k22o2K32M2l8j00n4J10Q0q0j38JJ55Q4j98o7J47J91j38j84K8J88oj44
4574e7L2K3N8K4j29m4J56N6m8j47L9J54j4j41l9J37J0j1j31K1J08n0Rj00qJ72
4600H0M5j47j11O4K11j28j05K0J24O5p2j45P2J50J3j48k5J5J20M2k17j5J73m8
4624C3p2l0L4J00N4k00l9J17P8j2n2o9R0N8n7j34M0J74k1k28M7J07J11j83q3M2
4650i5J99n6p7j3J7J21m2j03m5P8J14r1j24M9J31J6p4j27J63Q5q0q0n2J07M3j4
4676E0r7J9Q3j1q2o1J59Q6o9j53J8P5L3m4j29N0J38K6j34q4J20J10p6q9j7J66
$$ plain form
4500 -39 -122 -17 113 85 -58 -129 35 176 21 -155 -57 135 68 -79 -91 45 136 43 -117 -67 58 101 -23 -152
4524 -152 -81 89 98 -54 -130 17 123 20 -122 -77 74 91 -46 -86 10 75 31 -36 -122 -19 138 40 -98 -39 65
4549 65 116 -106 -168 64 106 68 -32 -86 24 104 24 -114 -113 42 126 -72 -139 8 199 61 -123 -95 93 87 -57
4574 -57 -25 -2 56 80 -49 -93 63 119 71 -76 -37 117 103 -38 -77 60 70 59 -72 -51 57 7 16 -84 -92 80
4600 80 125 -22 -133 -69 142 14 -91 -71 53 118 46 -99 -27 123 136 -12 -37 -22 98 140 -77 -92 81 33
4624 33 -39 -69 -35 65 119 -81 -120 -3 75 63 11 -58 32 90 33 -101 -61 113 92 -136 -89 18 129 -54 -137 -95
4650 -95 104 48 -29 -42 -25 96 54 -49 -94 -16 98 7 -117 -68 63 79 5 -122 41 126 46 -34 -86 21 64 50
4676 50 -47 -28 55 44 -38 -99 60 146 77 -76 -58 17 50 6 -123 -73 65 91 -43 -127 -7 103 27 -62 -79 87
4702H7Q1j72j13J21J20m7j08l5J33L4q9q2LJ30O6j86M2L3N4p0r9M8J25l3n1p9
4728h7N1O6J3j00l7M7J45r0o5K7R3J8p2r3O7J02n5j22lJ08J10m8j71K2R6Q2r5
4755Ip3N8O4k6j19MJ45Ol7j33L7R8rm3m5N2N8K3j35j0J46K4j37oO7Llj9p2L6O6
4786B9j2l2k1O5J01r8j41P5O4N5j51N1K1P1o5p6N5K3P7j07m5J7O5R1j56j9R7J4
4814D8m1q8NJ52m0n1j7NL0K9l6r1J73J9k3j46L8J07J9o8j17J44J5M0j47%K7N2
4842C8o4l3j7J48j7j09n0P9Q9j7j25j3J26M3r1o6Q0L8mo1r1J19O5j1j13m6J86
4869H3j1n5j18J23P0k0j23k0P3N1j8q0QO1M1p2q6R6P4m8q1k1R9J1pq6K3O0N3j09
4899b9q2M1J23j0j04OQ2K0r5n4J12O5j7j10%Q1k8n3M7K6RO2q0o4N4O4nr5jR7L7
$$ plain form
4702 87 168 -4 -117 4 124 77 -31 -66 67 101 12 -70 -67 63 129 -57 -15 18 72 2 -97 -49 76 43 -8 -87
4728 -87 -36 30 43 -57 -94 -47 98 8 -57 -30 63 81 9 -84 -17 85 30 -92 -95 13 123 75 -96 -74 22 104 9
4755 9 -64 -6 58 32 -87 -83 62 68 31 -102 -65 33 24 -19 -64 -12 46 69 -66 -76 70 94 -43 -49 18 21 18 -1 -73 -37 29
4786 29 17 -15 -36 29 130 32 -109 -34 30 85 -66 -15 6 77 12 -64 -9 14 91 -16 -61 -44 21 112 -44 -63 34 48
4814 48 7 -81 -76 76 36 -15 -32 -27 3 32 -4 -95 78 97 74 -72 -34 73 92 24 -93 51 66 106 -41 -41 -14 38
4842 38 -26 -59 -76 72 55 -54 -104 -25 64 47 -78 -91 35 78 -13 -79 1 39 35 -26 -117 2 67 56 -57 -103 83
4869 83 72 17 -101 22 92 72 -51 -71 2 53 35 -45 -37 24 65 -7 -93 3 77 29 -52 -73 26 37 30 -56 -33 27 80 -29
4899 -29 -111 -70 53 43 -61 -55 27 47 -48 -102 10 75 58 -52 -52 29 1 -52 -5 21 30 92 12 -52 2 66 61 -34 -35 62 99
4930I9p1j39J22%k2q4M6OQ8m1q3K8M9L8q5k6L1Q7k5p0PO0K8l8k5J5RP9l8m7J2
4961A0O3kp3k3j4R9k0p2L3K1K0k5Nl8oO6m5j04R2Q4l7p3K4L4Q3r7o4O2N1m9rN
4993AK9L8m5k2k1O1N6j60K1mJ02j9q4k1P1L8l2j6j0O1l3j2p5R0R3n9r7k8J14N9
5023I6j21l2L4N0Oo4rM8oJ8r1M2J2P7J3j40O5P4Pj59%J22Lm2k6k7M2O1rj13O1
5054hJ53n3j47J9mR0q0p%R2j7k5n8K2N3j0n2k9R4Lj4r3N7Q4o1m3%J14J1n4o6m8
5086g7J40K9j12k3J7P3K0j05n7J18N8p8r2PJ20k6l2k1M6J4n4%O2j6K9Jq3J0P4
5115D2Mn9m6P9R4o5j11K3L1%Lk7J8K2N8j11J9M9k5kj5J3N0j2j7k1K4J9j7K5o6
5146b1L5KK4l5m4J0L8n0j0L6J6Mo2J9M5J5k0j1QN1M2j15m2Q6K3k4k2m7Q9L1k3
$$ plain form
4930 99 28 -111 11 11 -11 -95 -49 -43 45 4 -79 -51 -2 36 -49 -75 -44 43 18 -52 -45 15 43 5 -20 -5 4 83 45 -2 10
4961 10 73 71 -2 -25 -39 60 40 -32 1 22 42 17 22 -16 -22 44 -1 -105 -13 71 34 -39 -15 19 102 5 -59 3 54 5 -4 1
4993 1 30 68 23 1 -20 41 97 -63 -42 -46 56 37 -47 -68 3 41 9 -7 -17 44 11 -1 -76 14 107 48 -49 -77 37 96
5023 96 -25 -57 -23 27 33 -31 -40 8 2 20 -71 -29 -17 60 73 -67 -2 72 79 -80 -80 42 45 3 -23 -50 -8 53 44 -69 -8
5054 -8 145 92 -55 -36 -40 50 -30 -37 -37 55 38 13 -45 -23 30 20 -32 -61 33 36 22 -71 -14 70 9 -34 -34 80 91 37 -29 -77
5086 -77 63 92 -20 -43 -26 47 67 -38 -95 23 81 3 -89 -82 38 12 -20 -41 5 19 -35 -35 27 11 40 41 -42 -32 42
5115 42 46 -13 -59 20 114 49 -62 -39 -8 -8 -5 -32 -14 8 66 -45 -26 23 -2 -4 -19 -6 44 32 15 -6 18 37 20 45 -21
5146 -21 14 16 40 5 -39 -29 9 -41 -51 -15 1 5 -57 -38 7 22 2 -9 -1 50 92 -23 -65 21 44 20 -2 -49 40 71 48
5177D8j09R2qlK6m8%O0k4r2J2K9R2r1n4K3J05q8j4J6N3J3k7m4J0QM7k3p8N9J3
5208CO9j17J9R8Po7q7Q6J2j5k7K4n0J28k7m9q4O3R6j2j31mJ08j6m7m5J18Qm0l5
5238a4m1N0M8l2j5m0Q0ko5l7N4N8m4o4N1J1J5l9o1N0L8K2n7j6J33l3Oj44N5M9
5268A6jpj00R2P4q6J2k8R0q9j6l0k3J57oj18LP2j7K0r9Q8KPl0JK7k0L0JKkK5k2
5302B5k4l4J01kr1k1M6L9o5n1Q4M4m3Km2kM7M5j7n3QL5M2l8o7Q6k5m8K9j8ML6
5334C2J9m0k1OL9n3n0O8M9m3o7O8J6j0m4L7jJ9j2k9M6m8L5k6n1L9L4Pj5j0K7l2
5366a1L5o7N5J3lL8m8o2P9pj8o2J3Q5l6k8L1L9K6q3j4M5K1n3j6M9k5Q0j8q0k6
5397d8P9M8q7o5O4P6n0o5O7m1N6j1j9q9%J15k9m8L8M2j7p2J8R0J4r4L6N8qn4j
$$ plain form
5177 48 -61 31 23 20 46 -2 -2 58 34 -58 -46 -17 75 -16 -70 -47 58 -30 -44 -28 25 38 11 -33 -23 -15 32 9 -69 -10 3
5208 3 72 -45 -26 72 79 12 -75 11 23 8 -19 5 -45 83 56 7 -77 -14 82 70 -61 -65 43 27 -20 -65 53 61 21 -14
5238 -14 -55 -5 43 11 -4 -44 36 34 -31 -68 -14 44 0 -64 -13 -2 13 -26 -87 -37 1 23 -34 -50 83 50 56 -88 -33 16
5268 16 15 8 -92 0 74 -12 0 -28 62 -27 -43 -73 -96 61 55 -63 -60 12 -5 15 -84 4 6 13 -17 -16 11 -9 21 22 24 22 47 25
5302 25 1 -33 68 66 -25 -46 0 39 -26 -77 7 51 8 10 -32 -34 13 58 41 -12 -4 31 73 35 -32 54 29 -19 10 -8 -4 32
5334 32 51 11 -10 -4 35 -18 -68 0 49 6 -61 7 23 13 -31 6 5 24 12 -17 29 -19 16 -10 -61 -22 12 19 4 -6 21 -11
5366 -11 24 -43 12 25 22 60 12 -50 29 22 4 -58 -45 40 4 -24 7 46 72 -11 -25 20 41 -12 -28 21 -4 76 58 -22 -48
5397 -48 31 79 -8 -73 -9 67 17 -48 19 -22 34 23 4 -85 -85 30 1 -47 -9 33 16 -56 -38 52 66 -28 8 66 58 4 3
5428COQP2o8p2L8qP7l3q9P2Q3j53j6J42n7J6n7L5l6L2M4k5q0N5P0jj04j0RJ15
5459F8n1o9J52j15L8n0M1l9K1N0o0n0J42m9l7k5L3K3K5q1QJ21m1q6nK8L1m4M6
5488B5n8j4N0J0o1J2P7J4q6KK7M1l7o0O8Oj1k9ML4l6Q1%r5LR5k9r1O7K1K1o9q
5521b6O7K9n2Lm0J9K9K1p0jL2k9N0p0M4j2K9m1O6l8J7J3k8m4O1qK4j05Q2j1LO
5553B0K9o2N5k7p0O7Ll4N2p9k3J28l1l3q9P0M2K9j08L0O0N1r1J8k4rM0O1q2qM1
5584B6O0j36J7M7P6m3q9L7L6ln0N1n0R2k1n0n6M3M2j4k9l8J20k4o9J0O7l3k5j5
5614b1lM1J3o9kL5K6K5j18K9J8P9p5n1O0N5J5j14L9M9j8k5M1n6J3N0j3k2K7lK7
5645E2k8m2P4n8m0j1O1M8q7O2n5K4M6p1k0j6Q1j1j0o0K1O0Oo0K3L5j1m1L9K8l0
$$ plain form
5428 3 9 17 89 21 -51 -13 -21 56 23 -66 6 89 -64 -80 62 5 21 -36 -1 -37 -5 39 14 -66 -11 59 58 -46 -56 -47 68
5459 68 17 -52 100 -15 23 -27 14 -25 -4 46 -14 -64 78 29 -8 -33 0 23 48 -33 -25 96 55 -31 -36 -8 23 -21 25
5488 25 -33 -47 3 13 -48 -36 41 55 -31 -29 -2 39 2 -58 10 16 5 -24 -20 14 -22 59 59 -36 -33 62 33 -58 9 30 51 -18 -26
5521 -26 41 70 18 21 -19 0 29 50 -20 -21 11 -18 32 -38 6 -6 23 -18 48 10 27 40 12 -32 29 21 45 -60 22 11 14 20
5553 20 49 -13 42 15 -55 12 15 -19 33 -46 -69 59 28 -5 -94 -24 18 47 -61 -31 29 80 -11 7 -17 -26 14 75 -7 -15 26
5584 26 86 -50 -33 14 90 47 -42 -5 31 28 -22 29 -21 71 50 0 -56 -13 29 15 -14 -52 68 44 -25 -15 52 19 -6 -21
5614 -21 -24 17 30 -39 -41 -6 20 45 -73 -44 -26 53 -22 -73 -13 42 57 -57 -18 31 13 -12 29 -27 -14 36 23 1 28 25 52
5645 52 24 -18 56 -2 -42 -53 8 56 -31 31 -24 0 46 -25 -45 -61 20 9 -1 -61 -40 20 26 -34 -11 24 13 -28 11 39 9
5676IkN6%o6K9L9n8p7M0Q2rr9J9K3K0J2J0k3l9J3M1o7J5M6J4o6ML0oK4J5o9O3
5709B3p6K8O9o6m3J05K6p3l6J29p8m6PR3K2r8M7kl7J5jj0k4J5K6l7kP8pk8k5j7
5741b3J03j07M2l8kK3j5K0k2J2R9p8m1J1L3j2n7k5J43n0k4k1O7K5n4k9kK5K5J2
5771D0n7PN2J7q6K7m2J19p2l6k2P5jk6j1J5j8j2J3OrP6L2j34O2J7K1q4KN5K2m5
5803CJj3L1j2l9L9kj3O9n1p8L4O3k1m2O0N1n3p0J0Q5o8J2LpnN1l9rJ9m1L4k4n3
5837g5N6L2n4j6P6MNp2j9N5K0rm9K4K6N4K7j19P8%Oo0kJ6K9p6P2j7J5J1l1l6P
5870b2J2J1J4p1N5M1l5oMO0r8O6Oo6J0L5j6M7q1N3l2O3r7M0M0k5mQmK2k0k7PJ6
5904Fpk7J1j3K9oL4o3J1N3q8M9K6k9J6k5K2Rk7J01m9q6Q3J2n6J9L8l3j8m0jO0
$$ plain form
5676 9 7 63 63 -3 26 65 7 -70 -30 52 43 -56 -37 -14 6 18 28 5 -34 -21 20 -47 -32 14 28 -38 -34 -4 -10 14 29 -40 23
5709 23 -53 -25 44 -22 -65 40 66 -7 -43 86 8 -38 -31 62 84 -14 33 31 -6 9 8 -2 -26 -11 15 -22 -24 54 47 19 -6 -23
5741 -23 80 -27 15 -23 -25 -2 -17 3 -19 -7 92 14 -27 -16 17 5 -52 -77 66 16 -8 -29 38 63 9 -20 -22 3 28 40
5771 40 -17 -10 42 59 -27 0 -42 77 5 -31 -53 22 21 -5 -16 -1 -19 -31 -18 -12 -21 55 87 -47 15 32 53 -31 -29 26 48 3
5803 3 4 -9 22 10 -29 10 8 -5 64 13 -65 -31 32 11 -31 29 80 27 -43 -33 52 -16 -4 -1 -8 -13 38 -1 -10 9 -32 2 -22 -75
5837 -75 -19 13 -41 -57 19 23 28 -44 -63 -8 12 3 -46 -22 4 58 85 -34 44 44 50 -10 -12 4 33 -43 29 12 27 38 7 -29 -22
5870 -22 -10 1 15 -56 -1 40 5 -1 3 63 -35 31 37 -29 -19 16 0 47 -34 19 -13 50 -47 -7 33 8 4 12 8 30 10 -17 -10 6
5904 6 -1 -28 -17 -30 -1 -7 27 -36 -25 28 -60 -11 15 -14 2 -23 -1 8 -19 82 33 -53 30 42 -14 5 43 10 -8 -48 -49 11
5936A1Ql0Jl1P4J7k9o8%R6Lq9j3J00Ko3j8N3lJl6N9l5n4N6l6m3Q3J7q1k5O6M6
5969C9o1M2j5L2k9o0J25o1L3kk2m2K4M9K4j04l4O3L5l4m8N9O0n4j7K8qj5J7l5
5999a1j0J5j7J7j4N5qkp4J6N3Kn0k2P3j2nk1j3K0N6j8j7m5P5n4j0j8O0rL8j06
6031e6J00o8mO1n7Ml3M8n3M0k1Q2n0j3J3J4Mm7M5m1K4l1M9L5l0k9M6o1O6n3K6
6062A0J7l1k6J8J0Pk8P1m1J6jm6M7m7K9j6p3N3O6j8p2N6J0rj1N5o8K8P%kk7j4
6095c0J27j52KR8m0j8qN9m7J0Mom4Q4j4k0K2l4O5kp6K1M9n5j3K0k8J3M4n0k0M9
6127A0p0O4K5r9Q4j5k6J8P5j9l9k9K4N4n4lOK2K6o6j3k2Q2ol3l2J5nR0r0j2Q4
6159D6o5M1l0M1q6n9N8M1Rl8M5k6KL2J9l2J3M3k0q9K3M2qKK2k3m7P7l9N8m6OK8
$$ plain form
5936 11 19 -11 -10 -41 33 50 21 -47 -47 49 52 -37 -50 50 52 -11 -29 24 21 22 -14 45 10 -44 12 -24 -67 16 33 -48 -73 -7 39
5969 39 -22 20 5 37 8 -52 73 12 45 43 21 -21 3 52 76 -28 -62 1 36 2 -46 13 73 19 2 30 22 7 24 -11
5999 -11 -21 -6 -23 -6 -20 35 27 25 -49 -33 20 22 -28 -50 23 11 6 -15 -28 -8 48 30 13 -32 43 -11 -21 -39 21 12 50 -56
6031 -56 44 -24 -28 33 -24 -20 -53 -5 -58 -18 -39 43 -7 -20 -7 7 11 -36 9 -32 -8 -39 10 45 15 -14 32 -29 37 -16 10
6062 10 27 -4 -30 -12 -2 5 -23 48 7 23 22 -24 23 -24 5 -11 -84 -31 35 17 -55 1 11 2 -9 46 -22 6 13 13 11 -16 -30
6095 -30 97 -55 -53 45 5 -13 -21 38 -9 1 5 -1 -45 39 25 5 27 -7 58 56 -20 1 50 -5 -18 2 -26 -13 31 -19 -39 10
6127 10 -60 4 29 -70 14 -1 -27 -9 66 47 8 -21 3 57 3 0 6 28 54 -12 -25 -47 35 29 -4 -36 -21 -26 64 -26 -38 46
6159 46 -19 22 -8 33 -53 -112 -54 -13 -4 -42 3 -23 -21 11 30 -2 11 54 34 -55 -32 10 2 4 26 3 -44 33 -6 52 6 12 40
6192D0n3nL3J3l1J9lK6J0p4P7j7pk7K5n8nk0P7mlM5Pj01O4%j8Jk7nM7l4J2J0L2
6227D6l9LP9o4j7N1m4k8J0M0oNo5L3j1Rj2j7ML2rjj0k8K6j3j2k6P8K0Jm2k3J5
6261a5J5L5J9q9O8Rm6oK5j8Nl7O2L3m7l1O2q8N5N4m1n5oM6M8j05J9M5k3j1m2R0
6293C0l8j2K2pL5K3l2m5j5O0J3k8k6QK2J7l6kK3pk0J8k2K7k2M4o5P2K1l4o5nO8
6326B2J0o8J6M0K5q8RJ9K5n4K9O9j10K9j0nO7o1J4K3l0P8j4L9o0n4R9n8L3o6O1
6357B9l8L3OJ0p6N9J6p0K1lO2kr0P3k9o4L8J9Lk1oL6Pm8N2o0QL4K1K3k7m2P8l6
6391A6k0K7J5K1o5KNk9mN7Kj6Lk0NJ9k5M1q2J6M8o7M8%Nm6K9ok5Q7l5j9K7l2N0
6426C2j2Oo2M1MKJ4k0N7n4k3L5l9K7L0p3N9n7J1Q7j12N7L2n7L7m5N6K7o4k2Q3
$$ plain form
6192 40 -13 -18 15 28 -3 16 13 39 49 -25 52 35 28 1 26 -32 -37 -57 20 16 13 58 65 -36 28 28 10 11 -16 -21 26 -8 4 14 46
6227 46 7 10 89 25 8 59 15 -13 -3 37 31 36 -29 4 -7 2 -10 -27 -23 9 0 -1 -11 -39 -13 -26 -38 -64 14 34 35 -7 -30 -15
6261 -15 0 35 54 -35 33 42 -4 -10 15 -3 2 -35 27 60 13 -18 44 -44 11 65 24 -31 -37 9 57 -48 -29 16 -7 -18 -60 30
6293 30 -8 -20 2 -5 30 53 21 -24 -39 21 34 6 -20 -12 10 27 -9 -11 12 5 -15 3 -19 8 -14 30 -35 37 58 24 -41 -46 22
6326 22 32 -36 -20 20 45 -43 -34 -15 10 -44 -15 54 -56 -27 -37 -42 25 -36 -22 1 -29 49 35 74 14 -40 59 1 34 -32 29
6357 29 -9 24 30 40 -36 23 39 -31 -10 -13 49 47 -43 30 1 -63 -25 -6 -3 -24 -30 6 13 -35 17 -43 -35 -1 20 43 16 -26 52 16
6391 16 -4 23 38 59 -6 -4 1 -28 -32 25 27 11 14 -6 -1 18 -7 34 -48 -32 16 -51 -3 -3 2 -44 -15 -21 -46 41 6 -13 14 -18 32
6426 32 20 26 -36 5 9 11 25 5 62 8 -15 20 -19 8 38 -35 24 -33 -22 65 -47 10 42 -15 22 -23 33 60 -4 -26 57
6457E7m3p9O6J1qK6l1K2k2L7j2m9P3o0mL8k0l1L0K2p8J08K1q6k8K9Q7q7j1LP8
6488E9l8k9L4m5N6K6p1kM4k4Nk5k9N2rJj7Nl1PRj7O3J5j0n8j5J15k4l4k3O6k3
6521C3m1K4mK8o1L7l7L2Nk0k5J0QN0j8j09M6O6%m7J7J8J1k0l4P9n9k4P5m6m4Q5
6553C5o2k6M7Qj5l5M2OKN2q2QM6j2N0k0l5j4L3Kk5l0N4m4J4k5N1K1p8K7rN6n7
6586a5%P2m9K1k3o7M4%N1n9k4Q0n7j3J7M9m4J5P3q6J6nL8l5M5o0L3Nm3J9N6m9
6618Ej8mJ5Rl6N9k3j8j13J42k7J2NM6j9l9qM5j4k4k7K1K4k1N5j2m9K3j0k9QK5
6650CJ8Pn7N1Pm0J9K2k6k1M7k8k4m1K8N8rm9K2O1p4j6O7pj9L2Qj16R6PK0r8L1
6683b1M6K4m5JL4j3k9l3Q1o4N0Nj4k0j3rK6l9L6lj8J8JJ7np1P1j8jnRJ9m6%rM2
$$ plain form
6457 57 14 -65 1 12 4 30 -1 21 -1 36 24 -25 48 -12 -16 22 2 -29 1 23 -55 53 74 -12 -40 -11 76 -11 -22 -19 59
6488 59 21 -8 26 -19 37 63 -8 -10 34 10 15 -10 -39 13 4 5 -12 -7 -38 -31 -22 -39 24 39 29 -29 -44 71 47 13 -10 56 33
6521 33 -8 16 12 40 -21 16 -21 11 16 -4 -29 -19 -11 39 21 -88 -42 24 24 -23 -6 12 23 3 -31 48 -11 -35 40 -6 -50 35
6553 35 -27 -53 -6 2 -13 -48 -6 0 2 54 -28 -20 26 14 64 44 9 -5 28 30 5 -25 29 -15 -1 -26 25 46 -32 -5 -14 42 -15
6586 -15 -15 57 8 29 6 -61 -17 -17 34 -25 -49 31 -26 -39 -22 27 -17 -2 71 -15 1 -4 34 -1 44 -16 17 22 -21 -2 54 5
6618 5 -13 -17 -2 7 -29 30 7 -11 -124 18 -9 3 8 54 35 -4 -12 33 19 -5 -32 -11 13 -8 47 35 -14 9 -1 -30 -22 3
6650 3 21 28 -29 22 29 -11 8 30 4 -17 30 2 -22 -63 -35 23 14 -35 -13 48 -26 -42 25 18 -1 31 39 -77 19 26 46 -52 -21
6683 -21 25 49 4 5 39 26 -3 -36 45 -19 31 36 22 2 -11 -20 6 -33 3 0 -18 0 1 18 13 -58 13 -5 -6 -11 -2 17 -29 -29 -38 4
6719DrN4r1PK7m9R6p6P6pJ1r4M3N2l1klj2LJ0n5L1j3N6K3k3lKl7j6rJ8Lj1k6N2
6755AN5n6j2K2jl8M0K1l0n6M6j5j8J6N7Kp4O2K1m6q1M8Q2k1Nl7Mj8K9oM5p1j9
6788d3O2p3P0m2oON7K9r9j4J8mM4qRoKl5M8J3J2q2M4j0k2N9l6K5l0N0k6j0N3l5
6822B0j2ql4O3l5kN0o7qK3L6Ln6K8j6L5j4M5m6Mn9N6Rm2K4J4m4M4l8P8k1q3P8
6855B5J0o2j6O6J2k6j5J1J0k8K3N0m6PM5n7m3J02n6j9k2j0K0J6m2ML6j0j8l2Q8
6886B3o8L5K6o3M0j5J7k8k5R8o9L5k3J1O1j8m2L1j5j5PJ7k1K1L6j02K1j5P3j6
6916A7lk0%QKOoK3k2k6k9M9m5M2J4k5J9J5j4PR1j72O1RN0Jn4nL1J3o6P6l1K6m
6951C8n0j5N0m0J4L8k8L0k9J7J2n1O5p0K1pQJ5l2j6K4K9k6OrL9n1L5Pk0L1n9l0
$$ plain form
6719 4 -5 49 -42 -35 -8 -57 39 -37 39 32 43 -51 -8 44 13 11 8 -4 -1 9 -46 -15 -28 28 51 28 25 27 -10 -26 -35 -17 -14 -25 -51 1
6755 1 56 0 -12 10 9 -29 11 32 2 -54 -8 -23 -41 -25 32 34 -40 22 43 -3 -84 -36 46 25 30 -7 -3 -21 8 2 47 -24 -43
6788 -43 19 -54 16 -26 -32 -26 31 60 -39 -53 -35 -39 5 -3 6 0 2 -33 15 28 40 -42 2 -8 -30 29 -7 18 -12 38 12 2 55 20
6822 20 8 0 -34 29 -6 -8 42 -25 -33 -10 26 29 -27 1 -15 20 6 51 5 9 -50 6 15 -27 -3 11 -33 11 -27 51 30 -53 25
6855 25 35 -27 -43 23 35 9 -6 5 15 -13 10 60 14 21 66 9 -34 68 12 -7 -29 -39 -19 -3 -45 -41 -5 -15 -33 -65 23
6886 23 -45 -10 16 -47 -7 -22 -5 -33 -58 40 -29 6 -17 -6 55 37 -5 26 11 -4 3 20 -1 20 56 -46 -25 -40 33 17
6916 17 14 -6 -6 2 4 10 4 27 5 -21 -50 -1 -46 -4 10 -15 4 19 5 12 103 -69 -8 1 51 52 -2 -7 24 37 -29 47 16 42 38
6951 38 -12 -27 23 -17 -3 35 7 37 8 25 37 -14 51 -19 2 -5 3 18 -14 -30 -6 23 -3 3 -6 33 -18 17 24 4 35 -24 -54
6984e4L8R6n8k6L2j8M9n3o5N6N5q5L0O1q1N1j6n4L1L7Mk2j0M1Jn3j6J1m4P7K3
7015C8o8%KJ9Mrm3P6Nl5nO8l4k3J1M6k7l3J7K5%n2L1l2nmN1rk6K5O7j05M3j7K9
7050C0o7M9K0m4KN1n5L6k4rl7N1mK4k4J5J7k4M4p2O3n7J8ljMK3l8L2J7n5J9K0
7083B1l8J5L0k3m7L2N1r0L9l6M1mo6Q7np6N0L4km7kP5p6J9jN5rj5k7J8j1L1l3
7116a0O2m4k9L9J4l4k4L2MPk6JQl1P9k4qj9O7j02jM9m6ON7l5L4m5M4Jj8k5k0P1
7150C4J0n1k1N5k4JN0l3j9n6J01m1k7L7Qk6RPj6L7p7O1n8kLJ6L6n5K9L5lK7o1
7183a4QM8k6rK5j0l0M1o1l3O0j8M9m3k4Q5n6OK1Kk0l9O3k1J7J7k5n0N3k5Pj8l
7216b3P3k9j0l0N0l7%qJ0j8k6O0m9N7k3N7r8O8j3kq%J8L6n3oK0n5O3j0n2K2P3
$$ plain form
6984 -54 -16 80 22 -4 28 10 59 6 -59 -3 52 -33 -3 58 -23 28 12 -42 -11 26 30 8 -2 39 40 -13 -29 -18 -62 15 38
7015 38 -30 -30 -28 -9 -5 -14 -57 19 24 -11 -16 52 18 -5 6 52 25 -8 9 34 34 -18 13 -19 -24 -28 23 14 -12 13 80 -25 18 1 30
7050 30 -37 12 32 -12 -10 41 -14 22 -2 -11 -48 3 -1 23 -1 14 31 7 51 -21 42 -15 3 0 -1 3 26 -12 20 37 -18 1 21
7083 21 -17 -2 28 5 -42 -10 41 -49 -10 -46 -5 -9 -75 12 7 -69 -19 15 13 -34 -36 39 -37 -18 -19 36 27 12 -15 3 -8 23 -10
7116 -10 52 8 -21 18 32 -2 -26 6 10 17 -9 -8 0 -31 48 24 16 -3 64 -38 -39 10 -36 -30 27 -8 26 -19 25 26 8 -17 -37 34
7150 34 44 -7 -28 27 3 4 54 21 2 -54 47 6 -21 16 24 -2 7 14 -2 35 -42 19 -39 -41 -38 -22 14 -41 -12 23 20 47 -14
7183 -14 -6 42 16 7 32 22 -8 33 -28 -61 -1 -19 30 -13 -37 48 -8 -2 19 21 1 -38 25 4 21 38 13 -37 16 -9 -2 -20 -23
7216 -23 50 21 11 -19 31 -6 -6 -14 -4 -22 -48 12 -37 20 -3 54 -44 24 11 9 1 1 19 55 2 -4 16 -39 24 14 -38 -16 57
7249E7n0j9J1J0J6J9o7L8j6N9j20N8k0K9mJM3n6lk6j4L3R0p7L6k7l2N3n1k2Q8
7280C7J4pr1k9P5j5k3R2n5K2K5n7J6qL4oj8j2K7j1l9K9j3K7m9oP2oK7p9N6l1K9
7313B7k6j8OL4l9L4k5K8J6m9Nk5M0J1n4N8qJ7k7LlK8M8n0Jn7N2n6mJN6Lk2o4N8
7348ar%K3l8PK5J3j0L4mOm5%M2Lm8j2L5Qm8L7OKk7M5n2lpJ3l9M9n4N3k6O6l7k0
7385a3M6m0qJMm3K8M3l6L2k8nn0J27o8n4O1OJ8m0L2k2MK9mj3K0j3mk3M1Pm7lj
7420a6O3p0O5o7jN3K1ol7pK7l4k1LMk5M1NqK6l1J2l9LP0k7j0N2j0k4L1l7l3M4
7454A7n3P2k1K4j8k9K3p5Q9Lq6P7J2k0j8Ll3J6j8L3K3m2K9N0q8N6q0O9ll4K4j0
7486hj1l8M4P5o6n4P7kJ4n9N0J6l8%m9P8rL7j02j3J34j4n7ok2qM6Jk7J6l8K6j2
$$ plain form
7249 57 7 -12 -1 9 25 44 -23 15 -1 58 -62 -4 -24 5 1 2 45 -11 -14 -40 -54 -21 69 -8 28 1 -31 22 -29 -51 37
7280 37 51 44 -47 -76 -1 -16 -39 53 -2 20 45 -12 4 -4 30 24 6 -6 21 10 -29 0 -13 14 -35 -41 31 25 52 -27 29 -2 27
7313 27 1 -17 -11 23 -16 18 -7 21 37 -12 -7 -32 8 19 -35 23 15 32 5 8 5 33 81 31 32 -25 27 -29 -33 -32 24 27 5 -59 -1
7348 -1 -10 -10 13 -25 -18 7 20 10 44 40 46 1 1 43 46 -2 -14 21 29 -19 18 24 26 -1 44 -8 -11 -18 -5 -44 5 -49 4 -22 44 7 -13
7385 -13 33 -7 -15 -14 -10 -53 -25 18 -18 14 -14 -19 -69 58 -10 -64 -3 3 21 -19 13 -9 -5 24 20 7 27 14 10 -13 28 35 -12 -15 -16
7420 -16 47 -23 42 -25 -26 27 48 42 5 -2 25 -9 -30 -27 -23 -48 -7 -2 -10 16 -15 -3 -42 -39 31 4 -6 46 36 12 43 6 -27 17
7454 17 -36 36 15 39 21 -8 15 -60 29 32 -54 23 35 15 -3 0 -33 -17 -35 -2 21 -21 8 58 -30 26 -54 15 12 -22 2 -8
7486 -8 -19 -57 -13 62 -4 -58 19 17 31 -28 22 38 0 0 -49 29 20 57 -45 -58 76 62 5 -1 -23 -31 15 16 -11 5 -33 -7 -19
7519a9k2K3j2P9m3nL4k3l0kQ4n8l9J4K6J7j1L1l2K0M4p7n7P4nj7J7J3l6L6n6j0
7551d2L5M4j9K3n2L8m6mN2m7M0M%o1M4%J3L9m4kJ8o2K0K1j0k0j6O3l8M8k7j2L6
7584C6qk5k4N9m4RJqP5p3J0m3lJJ4K4l7N0j9j2M9m7n0Q9j2LPj4jk8j3N7n4R6o9
7619dk9M8On2P6K8n9m2k0P2m4N3n1O6o8N4m9o1J15m6%J8kJ2j2l2M7o3K7J7j3m4
7651e2N2L2m6pL3%m1k6L5M3Ol0MoL6j3Jk2j6M1Rn5O9m5j6J6mK1lj2j4m7N4K4o1
7686d0K8M0rk6J9J3m0M5K8m5qMl0L1L4j5l7jJ6k2K6kr5Q5J4l7K5lrL2K6q6J7K9
7720Gl0l5K6Qn0N9L7q4K5K5Oj4J9QJ3km7L9m5NPJ6K3J5K4m5%J6J0o2L4k7rK2m1
7755d7L4L5Rq2ML3M7p2L8m7j1N1J9m8O1k9m3N6m4Q2m0n7O4k9P2j2o7j4M9l3pP5
$$ plain form
7519 -19 -41 -18 -30 49 6 1 35 12 -18 -20 64 6 -33 -19 7 24 13 44 12 32 76 -1 -58 16 11 -6 11 24 -12 24 -32 -42
7551 -42 -7 37 18 41 -11 27 -19 -23 29 -18 22 26 26 -35 9 9 22 61 17 15 33 -29 -9 12 2 -18 -34 29 -9 39 12 0 36
7584 36 28 3 -21 38 -6 3 4 -4 71 -2 8 -35 -38 -37 -23 1 -36 14 -5 -17 32 -15 -65 24 12 15 22 8 7 -21 -34 23 -31 65 -4
7619 -4 -33 15 21 -31 45 73 14 -28 -48 24 -20 33 -18 48 -20 34 -15 -76 39 -7 -7 11 9 21 9 -23 24 -39 -12 5 -8 -52
7651 -52 0 32 -14 -21 12 12 -29 -55 -20 23 29 -1 3 -3 33 20 21 -1 -17 24 33 -22 47 2 -14 2 -2 19 16 4 -10 -57 -3 21 -40
7686 -40 -12 28 19 -7 12 25 -15 30 58 13 5 9 -21 10 44 29 -8 -9 7 -15 11 9 -86 -1 13 -24 1 -2 -11 21 47 -39 -22 7
7720 7 -23 -58 -32 -24 -74 -15 22 -62 -37 -12 -6 -20 -1 7 20 18 -29 10 -35 -30 -23 -7 16 31 55 10 10 26 36 -26 8 -19 -28 -6 -47
7755 -47 -13 22 31 -51 -47 -14 33 -39 -1 -48 -59 -8 11 -37 24 -5 -48 8 -36 46 6 -51 13 -16 56 44 -23 -37 12 -21 -28 47
7787D7o3L4J5K5q1m6O4L1pk6o1N2J0M1n7M8n7NK7k2L7l4N5n5Lo2N1J6K8l4K4J0
7819A8n3M9J7l7jK7Jj1J0J5l1J2k1K4n2j3Q1o9K7K1Kk3M1L7j13L9K6o0Pj3N6j9
7851fK6o7qO8K7j01J04k4q4J00on2P2k4n9J3K1J3K8mj3j2K7Qr4O9K7j6k0m8JN3
7883A9k4k5N4K6r2kJ1N0Jl1O0m3Qj0Ok8j6L2o2J3k5O3K4J9m2M7J8k9m3M6K9p9
7915b5N9m5N5Jm7l0L6J3J4J6p3N7l0k7L2j5L9J0q9M8m8Q2lo0pL4J6k2o1M6J7J7
7947A0l9M6J0J0j05R0k8K8k4L2o7M8K3o0M3l4K8j3j5J3jkj8pk1O9J4k8l0MQ6r7
7979c5pJ1M4n0O8n7J4J1J6Qn7K1J2j5J7nRk7J4j4QP0o0K9m9QOkJN0j7K7q8O8n1
8014b2K9k6J0J3L0o7jJ4N8j6o0j9N0j4N2p1J2L8RQkk7J6j3L8l2k4J6J6k9K6o2
$$ plain form
7787 47 -16 18 33 58 -23 -69 -5 26 19 -7 -68 -16 -6 35 -22 26 -31 -26 1 -21 16 -18 37 -18 -15 -77 -26 -10 18 -16 8 18
7819 18 -35 14 31 -6 -7 20 21 10 20 35 4 16 -5 19 -33 -46 35 -34 -7 14 16 -7 34 71 -42 -3 23 -37 -30 -43 13 -6
7851 -6 20 -47 -55 13 40 -61 43 19 -65 35 29 -23 49 25 -34 -21 0 13 41 37 24 12 39 47 -47 22 49 33 13 -35 -34 19
7883 19 -5 -30 24 50 -42 -44 -33 17 18 -13 47 4 12 2 8 -20 -36 -4 -66 -53 -78 -15 9 28 -14 33 51 22 -21 25 54 -25
7915 -25 34 -11 44 45 -2 -32 4 17 31 47 -26 31 1 -26 6 -9 30 40 -49 -1 -49 33 30 -30 -37 -3 13 -9 -70 -24 -7 10
7947 10 -29 17 27 37 -68 22 -6 22 -2 30 -37 11 34 -26 17 -17 11 -2 -17 -4 -5 -7 -25 -32 -53 16 30 2 -28 -24 62 -35
7979 -35 -42 -31 13 -37 31 -26 -12 -1 15 23 -34 -13 -1 -16 1 -4 5 -22 -8 -22 -14 56 -4 25 -24 -16 -10 -12 -11 39 22 49 -39 29 -22
8014 -22 7 -19 -9 4 34 -33 -34 -20 38 22 -38 -57 -7 -21 31 -40 -28 10 19 27 25 -2 14 1 39 7 -17 -1 15 -14 12 -50
8046e0J06nj6k2n1N0k0K4m1R7q4O0m4j5K3j4J5K5m1ok1M3o1M3K1J1j1j4k2QL4
8077B2l8J7QJ1N5q7OQJn5K8M0k2L1r3Q1l8L2K6l5J4j5N2j4j5Kj4J1Lnj3QrPk4
8112a4j2J3L2k2Q4r6L1Rl3J2L4l4k1K4k1M3k6Lk1L3l7L5j6Ro3K8J7L8l9J9Qj8
8144amj3K1K8n5QJ7Nk0KnPO%rpj6M3nrO7q3N4mJ8m4pK3k9L0j9LM5k5L4o3OPj1
8183ek8K0N7o4L5Qoj4
$$ plain form
8046 -50 56 51 35 13 -38 12 -8 16 -25 72 -12 48 4 -11 12 -2 13 38 -3 -9 -30 13 -48 -5 16 27 16 2 -20 -12 22
8077 22 -16 1 9 20 75 -12 -6 2 3 -52 -24 16 -6 25 -68 13 -25 7 33 -2 12 -3 49 35 20 22 8 19 22 17 4 12 3 10 -14
8112 -14 -26 -13 19 -3 81 -15 16 25 -8 4 38 4 -17 7 -14 29 3 6 -15 18 -19 16 0 9 -54 -26 -9 29 -10 9 17 -1
8144 -1 -5 -18 3 31 -24 -16 1 6 -14 -12 -17 -10 -4 -4 -13 -20 -36 7 2 -7 60 -23 31 27 45 1 -6 17 -12 18 -1 2 47 22 56 -7 -1 6 -5
8183 -5 -33 -13 44 -20 15 23 17 3
8191C
$$ Imaginary data points
##PAGE= N=2
##DATA TABLE= (X++(I..I)), XYDATA
0@%%%%%%%%%%%%%%%%%%%%%%%%%%%%JnQqQqQj4K1k3K5k9L3l7M3n0N5o2P1p8Q7r6
50e0J07j18J27j38J49j59J71j83J86j87J85j65J18k9j41M87j242L139r509O3800
70E6548L55156k93370m84188J98721M23841o6664l22912l8112J68543J18914L829
81A20306j53354j81339J48625L34561j01908m49411L0282N06320N4730n01711
91a92899j28597M37256J77354l29262j87906J93887J59056n3228r3619p6339K329
102i1968J78474J01952k45845k04326K72156K89259k59809l41449K16551L51831
112B66826j55763l18116R1837K45916l6484j45284r65L1644J7448Q1059j3699
123F4419j79589n616K53694L3942k96204o2297L04574Q1063k82527q4204K36592
$$ plain form
0 0 0 0 0 0 0 0 0 0 0 0 0 0 0 0 0 0 0 0 0 0 0 0 0 0 0 0 0 0 1 -4 4 -4 4 -4 4 -10 11 -12 13 -16 17 -20 23 -27 28 -34 37 -41 46 -50
50 -50 57 -61 66 -72 77 -82 89 -94 92 -95 90 -75 43 14 -127 360 -882 2257 -7252 56548
70 56548 411704 118334 -365854 -167133 256708 190044 -132868 -170980 -2437 116477 120306
81 120306 -33048 -214387 -65762 268799 166891 -282520 -252238 254082 308812 -192899
91 -192899 -321496 115760 293114 -36148 -224054 -30167 128889 75661 -17958 -94297 -91968
102 -91968 86506 188458 -57387 -261713 10443 299702 39893 -301556 -85005 266826
112 266826 111063 -207053 -115216 130700 94216 -51068 -52033 -20389 -2941 78118 64419
123 64419 -115170 -120786 132908 166850 -129354 -191651 112923 193986 -88541 -172745 63847
134F3847O8078j77152l4361J13700j2059n4614O3182M488j11859L4638J51591
145A09479o2022j76574P9968J84165r1166j73447R9959J46961j08470j08816J18687
156A8724O5513j29880k3011J38352j4397j40771M4382J33665o7080j15744Q2981
167g266Q5981r4831m6554J04853L89j15020M7466J26542r0964j38398J24253J47937
179A44388j41981j50590J43223J42401j28415j19795J01934Q1603o9017k9356
189b5605L6155l2993r591R9484o809j62671J0128K13587j203k45179j6758K51556
201A10101L7559k30745n4710J84465O1478j18372n2610M1228K6646L7240J5915
212E8195j06538p0072J58116J29013j85251j83082J85753K22401j61350k38545
$$ plain form
134 63847 131925 -45227 -79588 34112 22053 -32561 30621 35109 -76750 -42112 109479
145 109479 47457 -129117 -49149 135016 43850 -129597 -29638 117323 8853 -99963 18724
156 18724 84237 -45643 -68654 69698 55301 -85470 -41088 92577 25497 -90247 -7266
167 -7266 78715 -16116 -62670 42183 42572 -72448 -24982 101560 10596 -127802 -3549 144388
179 144388 2407 -148183 -4960 137441 9026 -110769 -8835 72768 3751 -25605
189 -25605 10550 -22443 -32034 67450 60641 -102030 -91902 121685 120482 -124697 -141455 110101
201 110101 147660 -83085 -137795 46670 108148 -10224 -62834 -21606 5040 42280 58195
212 58195 -48343 -118415 39701 168714 -16537 -199619 -13866 208535 47185 -191360
222a91360J17699K25846o3945j83638R814J15074L4409k8293o1652o6249O7463
233b4832J55997n1883k29254J8839K76303K4321k90290o7867K70479J02204k19920
244c5903j18786J46842J12843o1688q2650k3228L1429R6530L4065j49522j04692
255a54760J76523J69427j76436k18483J51838K42944j09876k38451N9270K03856
265A05852r798j42977k9565O3703N2374K3753n5406j07791L9780J78097r235k25546
277a16759k8677K45385O5818k36674r3519K02520J05226j49369r7264Q5870O9369
288E1926k2022k5501l4504k8441P6897Q4356j02006j33895J09205J69694j01572
299D4137j86507Q3739J82368o1215j57454M0082J15829k4592o3120J7362O645
$$ plain form
222 -191360 -73661 152185 88240 -95398 -85584 29490 63899 35606 -26046 -92295 -24832
233 -24832 131165 79282 -149972 -131133 145170 169491 -120799 -188666 81813 184017 -35903
244 -35903 -154689 -7847 104996 43308 -39342 -62570 -31141 65389 99454 -50068 -154760
255 -154760 21763 191190 14754 -203729 -51891 191053 81177 -157274 -98004 105852
265 105852 96054 -46923 -76488 -12785 39589 63342 7936 -99855 -60075 118022 108787 -116759
277 -116759 -145436 99949 165767 -70907 -164426 38094 143320 -6049 -103313 -17443 51926
288 51926 29904 4403 -30101 -58542 18355 102711 705 -133190 -23985 145709 44137
299 44137 -142370 -58631 123737 62522 -94932 -54850 60979 36387 -26733 -9371 -2726
310b726j8400M7110K6645r2158l8715J24065N0393j41298n7987J43888N8227j34652
322c5608m9428J16454L1232r3762o009P0050k3039m7909N2287K8585p7166j2164
334d6477R4683k220j02747J6470J01549l1346r1739M7798P5932o5674n6870Q3302
346B2661L7582r8463k0107J08288N184j10691O562J03287j6655q5989K6539O0059
358C8257l7911k8219N1598o055o7923L8554Q5961o4429j03098Q1351J16032q6860
370A7258j21506Q1580J16464o7089r8479M7161O7596k6263k5933Q346k2835K303
382b1397P3225l926j18986l929J53743J8567j72726l6755J72893N3283j53696
393c9704o2859J17898O1355p0199m6322J7413J8377L3269K0814p4952o5535J02380
$$ plain form
310 -2726 -21126 25984 52629 -39529 -78244 45821 96214 -45084 -103071 40817 99044 -35608
322 -35608 -85036 31418 62650 -31112 -37121 32929 9890 -38019 14268 42853 -34313 -46477
334 -46477 48206 45986 -56761 -40291 61258 29912 -61827 -14029 61903 -3771 -60641 22661
346 22661 60243 -38220 -58327 49961 55145 -55546 -48984 54303 37648 -48341 -21802 38257
358 38257 346 -27873 23725 17670 -50253 -11699 74262 9833 -93265 -11914 104118 17258
370 17258 -104248 -22668 93796 26707 -71772 -24611 42985 16722 -9211 -865 -23700 -21397
382 -21397 51828 47902 -71084 -75013 78730 97297 -75429 -112184 60709 113992 -39704
393 -39704 -102563 15335 76690 6491 -39831 -22418 -4041 29228 50042 -24910 -90445 11935
405A1935J09763j13017j46538J06471J69586q5576j74033N5158J57573k2011j21437
416e2126p817O8703K8768o254l6639n8531L0333J16785j1071j61225j6899J86282
428H0309M8300j88811p5938J69487R3750j31725r6641Q1845Q2362k7129n1361
439a5552k4420P257O5441M3953r1667r4924J00553J37831r3348j66208P3274J75141
451A17331m5923j63386J7536J32070O174q5249k0373K9497K2977K8154j3799q0120
463e5111m658J20700K8621j45211n2742J51938P1797j41855q1615J17969P9184
474H9017q5221o3835M8761L6597j4290j400j4159l7354L3752P4253m3660j04185
486h1724M4905J23085l9745j28479L1669J20548k3733j00371J8994P1497j8858
$$ plain form
405 11935 121698 8681 -137857 -31386 138200 52624 -121409 -66251 91322 69311 -52126
416 -52126 -59943 8760 37528 31274 -5365 -63896 -33563 83222 72151 -89074 -105973 80309
428 80309 128609 -60202 -136140 33347 127097 -4628 -101269 -19424 62938 35809 -15552
439 -15552 -39972 -32715 32726 76679 -14988 -109912 -9359 128472 35124 -131084 -57810 117331
451 117331 71408 -91978 -74442 57628 63802 -21447 -41820 -12323 10654 38808 25009 -55111
463 -55111 -59769 60931 89552 -55659 -108401 43537 115334 -26521 -108136 9833 89017
474 89017 3796 -60039 -11278 25319 11029 9629 -4530 -41884 -8132 66121 22461 -81724
486 -81724 -36819 86266 46521 -81958 -50289 70259 46526 -53845 -34851 36646 17788
497A7788l7790K3629L657l2142K7139M2268n2083n1053O9065N6143p8782n5486
509f7647Q1482M7948p9153l4279P3565J5767o6531N305N8983k6091n1211M4327
521B465M3133n7679l3553O5063K2058o6541p406O2865r849n5516K9308M6415m9413
534h650l7474O7787K9797q2245k4104R0263J9630r0360j5546Q1771R740o5111
546b4502j094M2343j1536j6214K8409r699m8239L2048O9098m7711q7778N5524
558a9351J01094n4707j05916M6790J00028l4320q2752K0351N4807q393j8703R94
570g8k1484n85O0810O979r4476j9208J17860L4764j27970n0050J23549O1091j05285
583a4083o4296P6303N7324m0575l9010L686J0799K9350K4280n3778o1625O6880
$$ plain form
497 17788 -20002 3627 7284 -24858 2281 44549 -7534 -58587 10478 66621 -12161 -67647
509 -67647 13835 61783 -17370 -51649 21916 37683 -28848 -23543 35440 9349 -41862 2465
521 2465 45598 -12081 -45634 19429 41487 -25054 -32460 30405 20556 -34960 -5652 40763 -8650
534 -8650 -46124 21663 51460 -30785 -54889 35374 55004 -35356 -50902 30869 40609 -24502
546 -24502 -25596 16747 5211 -11003 17406 7707 -40532 -8484 60614 12903 -74875 -19351
558 -19351 81743 27036 -78880 -32090 67938 33618 -49134 -28783 26024 17631 -1072 -78
570 -78 -21562 -22147 38663 45642 -48834 -68042 49818 84582 -43388 -93438 30111 91202 -14083
583 -14083 -78379 -2076 55248 14673 -24337 -20651 -9852 19498 43778 -10000 -71625 -4745
595d745R6158o7899j22478N7593J35840l9455j33955J7597J16071L191q4420j8309
607d4811M2378K4438M337k0389m9667O944Q8160J3682j14835l7114J26819N9051
619I8993j23506p4379J06415Q0123p9037p3657M5707N4913j1981k5711j7513j0401
631c0034L9059M8439n0595q3635N1569J10407m3550j25294K9560J26088j3302
642E8712j12585j369Q6731J0945n2033j3080J3618P541K4006N011n6204k1865
654e0572P9211L9937r1489n4976R2561O4218q4333o5187O8937N6774m9975m0110
666c5004L0747J6858j3885R573J341l6301O495N9516r909p6330J0374Q5301r412
679C9364q5511Q970P7807j0414o3471J4517M5167k1160k5065K9280N676l7916
$$ plain form
595 -4745 91413 23514 -98964 -41371 94469 55014 -78941 -61344 54727 57918 -26502 -44811
607 -44811 -2433 22005 26342 5953 -43714 -36770 51390 65072 -49763 -86877 39942 98993
619 98993 -24513 -98892 7523 87646 8609 -65048 -19341 35572 23591 -2120 -19633 -30034
631 -30034 9025 57464 6869 -76766 -25197 85210 41660 -83634 -54074 72014 58712
642 58712 -53873 -55242 31489 42434 -9599 -22679 -9061 -1520 22486 27497 -28707 -50572
654 -50572 28639 68576 -22913 -77889 14672 78890 -5443 -70630 -1693 55081 5106 -35004
666 -35004 -4257 12601 -1284 8289 9630 -26671 -20176 39340 29431 -46899 -36525 48776 39364
679 39364 -46147 -37177 40630 30216 -33255 -18738 26429 5269 -19796 9484 15160 -22756
691b2756J1178M5154k4675m9359L4326M9190m0795m4408M4774L4783m7029k1823
703c1440M8650P010m9781P948N0268k0891m9517L0824M6573l6619m0470L8897
715A452L0549l8033j6898L5452n4l2313J8756K9832l7412k8710N3394K8702o5127
728b0410k9304P0382K9487o8730k7512N9975K2248m5575j2622K7461j362q192
740d154J9352r294l9406K3015N9135l1015p5687L3013Q6345k9197q8877K1340
752c5430Q1789j1667o5540K810M1264K577j1898l040j9177k240M7859J2543p0801
765c0951k6084Q5055M0235q8863n1841Q2436N7903o6818n6439M5214M6363k0880
777A5330k7789k334K761K1305K5828l3453n4403L7654P8725l4302r5425K4661
$$ plain form
691 -22756 -11578 33576 8901 -40458 -6132 43058 2263 -42145 2629 37412 -9617 -31440
703 -31440 17210 24220 -25561 -17613 32655 11764 -37753 -6929 39644 3025 -37445 1452
715 1452 32001 -6032 -22930 12522 12468 -19845 -1089 28743 -8669 -37379 16015 44717 -20410
728 -20410 -49714 20668 50155 -18575 -46087 13888 36136 -9439 -22061 5400 4038 -4154
740 -4154 15198 5904 -33502 -10487 48648 17633 -58054 -25041 61304 32107 -56770 -35430
752 -35430 46359 34692 -30848 -28038 13226 15803 3905 865 -18312 -20552 27307 39850 -30951
765 -30951 -57035 28020 68255 -20608 -72449 9987 67890 1072 -55367 -10153 36210 15330
777 15330 -12459 -14793 -12032 9273 35101 1648 -52755 -15101 63624 29322 -66103 -41442
789d1442J01914j1855r6841j432Q0542J1905n5140j7050K3952J5360R057o761
801A2209l9495p387O3698K4982p8862m2418Q3830N6488p8593o4175O4970O3579
813E8826m5899n3868K4850L5583n012j1463j0635j5937K0190M2668k3333o5200
825d9230K0522Q0665j3569q7284M948Q4222L071p2182p967N3299Q535l0133m124
838i227N804m520J6731J6370l4972k9236M7462M0597n3580m8451N3422N1039m8557
851B882m7542M0565L7879l1508k3279K2681N578j5672J3080J0861l0186q036M3811
864B1114O838n2746n775N6387M011n4485o54M8530m775l9500J1907K8998k0205
877c55j8413K8436Q606l5266l46L9412o669m0333J2445L7614j7849l1173K2952
$$ plain form
789 -41442 60472 48617 -48224 -49656 30886 42791 -12349 -29399 -5447 9913 18970 12209
801 12209 -27286 -34673 29025 54007 -24855 -67273 16557 73045 -5548 -69723 -4753 58826
813 58826 12927 -40941 -16091 19492 14480 3017 -7618 -23555 -3365 39303 15970 -49230
825 -49230 -28708 51957 38388 -48896 -43948 40274 43345 -28837 -36804 16495 25030 -5103 -9227
838 -9227 -3423 -7943 8788 25158 -9814 -39050 8412 49009 -4571 -53022 400 51439 2882
851 2882 -44660 -4095 33784 2276 -21003 1678 7256 -8416 4664 15525 -14661 -22697 21114
864 21114 27952 -24794 -30569 25818 29829 -24656 -25310 23220 18445 -21055 -9148 19850 -355
877 -355 -18768 9668 18274 -16992 -17338 22074 15405 -24928 -12483 25131 7282 -23891 -939
890i39K2251k8435j1782L3875J367l9001Q183M3100j5475m4920K0166M3594k2185
903I799l8427K2214K9205k0963j6308J9537P72j8971J5539J9772l1098k1978M3699
916A2792K5149n2048k8258N4699K9790n1415k8598M3047K3757l0816j4528J6554
928A25J642k800J4356q650l1355J6436M7510j9666o0333J8398O7651j3619o8193
941c8498O958O1238k69m7589m442K8228N637n899k610j6883m546L7266J4888n2478
955a8999k6991O1069L8335o1983m6363N5782M9337m3658m5659K7904L5248j1250
967A2772j8638l678k171J4695K4571k0567m5766K0724O2515j6142p2693Q344P4670
980C8636M61o8370q048N4431J2471l5019j2306J2794P366R541J845k8934j4093
$$ plain form
890 -939 21312 -7123 -18905 14970 16337 -22664 -14481 28619 13144 -31776 -11610 31984 9799
903 9799 -28628 -6414 22791 1828 -14480 5057 5829 -13142 2397 22169 -8929 -30907 12792
916 12792 37941 -14107 -42365 12334 42124 -9291 -37889 5158 28915 -1901 -16429 125
928 125 1767 -1033 13323 4673 -26682 -10246 37264 17598 -42735 -24337 43314 29695 -38498
941 -38498 -31540 29698 29429 -18160 -22602 5626 11263 5364 2754 -14129 -18675 18591 33479 -18999
955 -18999 -45990 15079 53414 -8569 -54932 850 50187 6529 -39130 -11226 24022 12772
967 12772 -5866 -9544 -11715 2980 27551 6984 -38782 -18058 44457 28315 -44378 -36034 38636
980 38636 39097 -29273 -37321 17110 29581 -5438 -17744 -4950 2416 11957 13802 -15132 -29225
993b9225M3572K7246n1473l9000N2884M7051m8160m9939L8785M6427k6678l6795
1005b5305J4236K1666l390l229m538j6478Q399L4944q447m9683N569N8827j039
1018C1532o1371l516N7536O578m7962o816L4370L793j8666K503K970j0893J0733
1031G91K0348k1364k9097K8159L5461l1083l8615L0851L7421k8363l2182K4846
1043b827K3193k1259j1883J8270l80j6430J2422J5468k2663j4669L0177J3671
1055B3090l4385j1608L5463Q026l3686k793K9996l987k5161J1661J9962j9454
1067b876j5049K6155J0622l1046o601L3020K684l2008J542K8073o626k1608J2509
1080a209J3857j9167n755K6227j558l2526P148L7399j0699l9558J2295L8334j2112
$$ plain form
993 -29225 14347 41593 -9880 -48880 4004 51055 2895 -47044 -8259 38168 11490 -25305
1005 -25305 -11069 10597 7207 3978 -560 -17038 -8639 26305 17858 -31825 -26256 32571 31532
1018 31532 -29839 -33355 24181 30759 -17203 -24019 10351 14144 -4522 -2019 951 -9942 791
1031 791 21139 -225 -29322 -1163 34298 3215 -35400 -4549 32872 4509 -27673 -2827
1043 -2827 20366 -893 -12776 5494 5114 -11316 1106 16574 -6089 -20758 9419 23090
1055 23090 -11295 -22903 12560 20586 -13100 -15893 14103 10116 -15045 -3384 16578 -2876
1067 -2876 -17925 8230 18852 -12194 -18795 14225 16909 -15099 -13557 14516 7890 -13718 -1209
1080 -1209 12648 -6519 -12274 13953 12395 -20131 -12983 24416 13717 -25841 -13546 24788 12676
1093A2676l3482J1184K4883j0306j3394J0181J24j1475J3142J4375k5214j8550
1105b5856L4329K3067l9421k6931L9996K9006l6258k7949K8907K3295j9242j4675
1117a1732Q909K924M98J1128p602k5675J1506L8822j1868m8686R166N3742m645
1130B6487n3002o35M6334M761l4481o631J8963N249j856n41j4735p185K8710J6780
1144B8218l8351k6323M2748L4416m1690l9171L5892L9562k6683l4691J5768K4901
1156A4596n133j1160l669n005R271K1589j1278l6376R573M7482n252n3509n50
1169b9421N3443O320m7568j0308L6705J1375k2376q889O793K958Q272N754k0626
1182g568j5874K9208K5756l3525l3414L3165L7744k9239l7567K2879L2645j5651
$$ plain form
1093 12676 -20806 -9622 15261 4955 -8439 1742 1866 -9609 3533 17908 -7306 -25856
1105 -25856 8473 31540 -7881 -34812 5184 34190 -2068 -30017 -1110 22185 2943 -11732
1117 -11732 -2823 101 599 11727 4125 -21550 -10044 28778 16910 -31776 -22610 31132 26487
1130 26487 -26515 -27150 19184 23945 -10536 -17167 1796 7045 5189 4648 -10087 -17272 11438 28218
1144 28218 -10133 -36456 6292 40708 -982 -40153 -4261 35301 8618 -26073 -10305 14596
1156 14596 9463 -1697 -5366 -10371 -1100 20489 9211 -27165 -17592 29890 24638 -28871 -29421
1169 -29421 24022 30342 -17226 -27534 9171 20546 -1830 -10719 -3926 -968 7304 13058 -7568
1182 -7568 -23442 5766 31522 -2003 -35417 -2252 35492 6253 -31314 -8435 24210 8559
1194H559k3602Q680J1490l592K375O56j6016j34K7765J470l6325l855M0736O629
1208B4836m0972p995L7011P936l0092n435K1109R37j1479N359K555j2653M878
1221d005J9599j0379k5363J3740K8753j5225k9403J5387K6906j5068k1689J4665
1233b082J4374j4624n944J5296k460j6317J0014J7068j5779j7218J9745J6253
1245A8326k1582j3457K1611Q894k0402k894J8611m062j6732J1317J4788j7732
1257c314j3424K2596J2025k5297j0287K5370P974k3218m487J8926k57j3432O334
1270d91P522j3105j956K0093k285k6238M850L0806n835l2770N490L1628m343k7269
1284a3903L281J9741l025j0175M048m18o892J0936J0909j9853j5861K6046K0763
$$ plain form
1194 8559 -15043 -6363 5127 1535 3910 4566 -11450 -11584 16181 17651 -18674 -22529 18207 24836
1208 24836 -16136 -24131 12880 20816 -9276 -14711 6398 7335 -4144 1215 3770 -8883 -4005
1221 -4005 15594 5215 -20148 -6408 22345 7120 -22283 -6896 20010 4942 -16747 -2082
1233 -2082 12292 -2332 -8276 7020 4560 -11757 -1743 15325 -454 -17672 2073 18326
1245 18326 -3256 -16713 4898 13792 -6610 -9504 9107 5045 -11687 -370 14418 -3314
1257 -3314 -16738 5858 17883 -7414 -17701 7669 15643 -7575 -12062 6864 6607 -6825 -491
1270 -491 7031 -6074 -8030 12063 9778 -16460 -11610 19196 13361 -19409 -13919 17709 13366 -13903
1284 -13903 -10622 9119 6094 -4081 -33 -451 -7343 3593 14502 -5351 -21212 4834 25597
1297B5597k8856k4388K8154K5970k4424k4401J8371J9595j1075j1584M074J282
1309a685J661J0348n278k1851O240L1666m924l8295J629M0954K334l9281n922
1322b2404L3012Q206k3497q088J1728N204P07K46j1964p717K0835J6093k6149
1335c788k3995K7897K9922k5823l2658K0866L1559j4182k6373P189J7468j191
1347F891o107k942o465M579J8482l665k8688Q40L5408L090l8128o990L6544R909
1361B2758l1131j0812K2865R245j2852n099K651j131O564Q709j3645j6450J8064
1374b64K3171j9614k7765J8620K9325j5682k7811J1869K2786p978j5262N011N968
1387B374l395L765L209j2777m449K0176O430k4873q363K6821R593k6034r325K2899
$$ plain form
1297 25597 -3259 -27647 507 26477 2053 -22348 -3977 15618 4543 -7041 -2967 -1685
1309 -1685 -24 10324 5046 -16805 -10565 21101 16177 -22118 -20489 20465 22799 -16482 -22404
1322 -22404 10608 18814 -4683 -12771 -1043 4161 4868 5114 -6850 -14567 6268 22361 -3788
1335 -3788 -27783 114 30036 4213 -28445 -7579 23980 9798 -16575 -9386 8082 6891
1347 6891 784 -2158 -8623 -4044 14438 10773 -17915 -17075 18333 21423 -16705 -23695 12849 22758
1361 22758 -8373 -19185 3680 12925 73 -5026 -2375 -3506 3058 11767 -1878 -18328 -264
1374 -264 22907 3293 -24472 -5852 23473 7791 -20020 -8151 14635 6657 -8605 -3594 2374
1387 2374 -1021 2744 5953 -6824 -11273 8903 15333 -9540 -17903 8918 18511 -7523 -16848 6051
1401F051P383j8094l729J2616j234p376P124K584j2701Q26J7617l434k0858M995
1415h230K1935o030k0911O895J7900q000j3236R561P609j1342j989J3519l204
1428D477j5314P349J6623j0224j6665J1809J5150j2134j2187J1933P608j1420
1440b995j975J0847m032j0881R810J1275j4765j1737J7871J2021j9158j1590J8324
1453C015J0034j5605p002J1791K575p520L152L480r620r2J6041j886k1490K669
1467a0458K5139k229k6505J123K4992Q7k0901p01J4321M01o492J310j983m394
1481f290R698Q745j6044j3394K0006J7687k1227k0760J9870K1895j6309k0223
1493a6346J1289J5929n769r262R46P86K426Q502l978j7308L599K4274j461k8766
$$ plain form
1401 6051 13434 -4660 -8389 4227 2993 -4383 2741 5325 -7376 -6550 11067 7633 -13225 -8230
1415 -8230 13705 7675 -13236 -6341 11559 3559 -9677 -116 7493 -3849 -5838 7681 4477
1428 4477 -10837 -3488 13135 2911 -13754 -1945 13205 1071 -11116 817 8425 -2995
1440 -2995 -4970 5877 1845 -9036 774 12049 -2716 -14453 3418 15439 -3719 -15309 3015
1453 3015 13049 -2556 -9558 2233 4808 -2712 440 3920 -5700 -5792 10249 8363 -13127 -10458
1467 -10458 14681 12452 -14053 -12930 12062 12149 -8752 -9453 4868 5269 -1223 87 -1896 -6290
1481 -6290 3408 12153 -3891 -17285 2721 20408 -819 -21579 -1709 20186 3877 -16346
1493 -16346 -5057 10872 5103 -4159 -3213 -2427 -1 8501 4523 -12785 -9186 15088 13627 -15139
1507a5139j765L0041N019k7959p381K2623Q287j5172p082O497L770K255J353r645
1521d298p770J5193J4315j8139k0007J8490K3824j6344k5007J2526K3153p997
1533G939j8406L487J1240J6k550j981o582K103J4990o36k1643k034K5767M985
1547A6695k6618p772K4738R222k0270q890J4122O707p210k606O30k787M855Q690
1561I506q619j4252J0527J8609j0718k1083R479K1174p687j8889N653J4566m170
1574D096q593L408J999l809M609M869j0170o435J4422P979j6708r035J7232R036
1588A2900j6074p672J3729N106j0729j375P602l028m912P553K761j1633j238J4516
1602G506L21j6049L53J5778j092j4091K268J1084l877p385O091L489q661J10J1230
$$ plain form
1507 -15139 -16904 13137 18156 -9803 -17184 5439 13726 -1446 -8528 -2031 1739 3994 5347 -4298
1521 -4298 -12068 3125 17440 -699 -20706 -2216 21608 5264 -19743 -7217 15936 7939
1533 7939 -10467 -6980 4260 4276 1726 -255 -6837 -4734 10256 9620 -12023 -14057 11710 16695
1547 16695 -9923 -17695 7043 16265 -4005 -12895 1227 7934 724 -1882 -1252 -4039 816 9506
1561 9506 887 -13365 -2838 15771 5053 -16030 -6551 14623 6936 -11953 -6300 8266 4096
1574 4096 -4497 -1089 910 -2899 1710 6579 -3591 -10026 4396 12375 -4333 -13368 3864 12900
1588 12900 -3174 -10846 2883 7989 -2740 -4115 3487 459 -4453 3100 5861 -5772 -7010 7506
1602 7506 7827 -8222 -7869 7909 6817 -7274 -5006 6078 2201 -5184 907 4396 -4265 -4155 7075
1617G075k829j3316M702J4595n726j4451N982J2776n758r688N536N407n684m66
1631a845O223m565p340Q939Q826j2310j0281J4193J1137j4286j1123J2833R942
1644A0343j0291p068O904L102l516J989O56p510J248J2788j883j7200J528J9840
1658A0930k82k0510j271J8816K587j5154l038R803K223l497k88k675k979Q026
1672B691P127j2079j1182J4102J4942j4230j7193J2451J7631r238j5938N640J2032
1685F756k061o437q55l67K514P377k668j3844J483J8586Q78k1376l589K1640N871
1700A3908j9350p449J5173P424r395n669L119K365K812K184p486p361J0632J2369
1714A3276j1810j6208J0994J8482q994j8489O106J6311l085j2209N52O582P67
$$ plain form
1617 7075 4246 -9070 -4368 10227 4501 -9950 -3968 8808 3050 -6638 -1102 4305 -1379 -1845
1631 -1845 4378 -187 -7527 1412 10238 -2072 -12353 1840 12977 -1309 -12432 401 10343
1644 10343 52 -7016 -112 2990 -526 1463 2119 -5391 -4143 8645 6762 -10438 -8910 10930
1658 10930 10648 -9862 -11133 7683 10270 -4884 -7922 1881 4104 607 319 -2356 -5335 2691
1672 2691 9818 -2261 -13443 659 15601 1371 -15822 -3371 14260 5022 -10916 -5276 6756
1685 6756 4695 -1742 -2597 -2964 -450 6927 4259 -9585 -8102 10484 11362 -10014 -13603 8037 13908
1700 13908 -5442 -12891 2282 9706 311 -5358 -2239 126 2938 5122 -2364 -9725 907 13276
1714 13276 1466 -14742 -3748 14734 5740 -12749 -6643 9668 6583 -5626 -5074 1508 2275
1727B275o9j038o182n3J1552K005j5444m436J7438O575j7246p988J5376Q256j2051
1742a030o988P895M436l668o42k18l675L093Q134m869j1961N378J4592n040j5584
1757a0147M155J4766l099j2402K297Q717k124m308K703k94l885M395N484p524
1771a266p074R581Q263j0311q606J0013P892q833o070P206L320n678J5M459l633
1786g22l650O972L173r608l063J1047L105j1395k792J0588J875q672n09O313j661
1801A001l523M248J090p013R30R534k218j1334K707J2285k632j1931K351J0016
1815E511k010p204K028L459k570O42L683m496n370P600P218r648q874J0359R892
1830A0220r627j0056Q066Q798n616o399L108K894q42J446o22o020J200J0245r74
$$ plain form
1727 2275 2206 1168 -5014 -5067 6485 8490 -6954 -11390 6048 12623 -4623 -12611 2765 11021 -1030
1742 -1030 -8018 -123 4313 645 3 -215 -3890 -797 7337 2468 -9493 -4115 10477 5437 -10147
1757 -10147 -5992 8774 5675 -6727 -4430 4287 2163 -2145 558 264 -3621 774 6258 -1266
1771 -1266 -8340 1241 9504 -807 -9413 600 8492 -341 -6411 795 4115 -1563 -1548 2911 -722
1786 -722 -4372 2600 5773 -3835 -6898 4149 7254 -4141 -6933 3655 5530 -3142 -3651 2662 1001
1801 1001 -2522 1726 2816 -4197 -3267 6267 4049 -7285 -4578 7707 5075 -6856 -4505 5511
1815 5511 3501 -3703 -1675 1784 -786 -144 3539 -957 -6327 1273 8491 -1157 -10031 328 10220
1830 10220 593 -9463 -1397 7401 1785 -4614 -1506 1388 546 1992 1370 -4650 -3450 6795 5821
1845E821j3480p6J5194J648j5255l195J3633M021j0445m085O203L067j623p71
1859F57k936k343O613N905q938r368R860J2207r232j3755P402J3678m920j1804
1873f974K245Q387N8l764j550j439J790O641j054j0956o87J4002K753j5260m876
1888a0684J4735O346j2454p005R133O311n067m177P87J179K782K686n393o580
1902g401O635J0332o917j2730N856J3835m212j3346K231J1221m71p808o00L477
1916A02P25J186k3n470j497Q854L409j0916n261J1554O693j0906p095R104O533
1931F992o619m773L901K249j500J067m65m458J541P520j979r739J648J0981j117
1946E249j0995N48R646j51p577M10M713j131j684K405j155l989L540N566m911
$$ plain form
1845 5821 -7659 -7735 7459 9107 -6148 -9343 4290 8311 -2134 -6219 -16 3051 1428 657
1859 657 -2279 -4622 1991 7896 -1042 -10410 -550 11657 2425 -11330 -3928 9750 4830 -6974
1873 -6974 -4729 3658 3716 -48 -1598 -3037 -1247 5394 4340 -6616 -7303 6699 9452 -5808 -10684
1888 -10684 4051 10397 -2057 -9062 71 6382 1315 -2862 -2075 -896 1886 4572 -821 -7401
1902 -7401 -766 9566 2649 -10081 -4225 9610 5398 -7948 -5717 5504 5033 -2775 -3375 102
1916 102 827 2013 1990 -3480 -4977 3877 7286 -3630 -8891 2663 9356 -1550 -8645 459 6992
1931 6992 373 -4400 -499 1750 250 1317 852 -3606 -2065 5455 3476 -6263 -4615 6366 5249
1946 5249 -5746 -5198 4448 4297 -3280 -2870 1843 712 -972 1433 278 -3711 -171 5395 484
1961D84o900N627P627n611p511N072O412m156m575L493J902k995J030K774l866
1976a193k937O070L520p714l958Q262M076p824l906O749K905m963j229L046j027
1991a23j209L583j67o036R32Q231j116r681P79J0098k89r227l19P483M98m920
2007a483k14J774p37J352K232m115m048O102O044p081p769P161Q661o202q569
2022f892M610P492k746n215Q81K117M40J533j089n163J001Q247j17j0500j278
2037f679J1447K644j1001l813R374M236o596l947L331K559R2l21l095k394N298
2052A135N323o384q057O558R879n456j0795L958J0279k009q618K62N648J108k107
2067G24j606j820J238N422j11q303j597J0083L337j0442m994R695N885p779n863
$$ plain form
1961 484 -6416 -789 6838 1227 -6284 -1212 5200 1044 -3531 -38 1864 -1131 -101 2673 -1193
1976 -1193 -4130 1940 5460 -2254 -6212 2050 6126 -1698 -5604 1145 4050 -913 -2142 904 -123
1991 -123 -1332 2251 2084 -3952 -3020 5211 4095 -5586 -4807 5291 5002 -4225 -4544 2939 3437 -1483
2007 -1483 -1697 77 -660 692 2924 -1191 -5239 863 6907 -174 -7943 -782 7879 1677 -6892
2022 -6892 -2282 5210 2464 -2751 -1870 247 687 2220 1131 -4032 -3031 5216 5099 -5401 -6679
2037 -6679 4768 7412 -3589 -7402 1972 6208 -388 -4335 -1004 1555 1647 1326 -1769 -4163 1135
2052 1135 6458 74 -7983 -1425 8454 2998 -7797 -3839 6440 4431 -4187 -3925 1723 2831 724
2067 724 -882 -2702 -1464 3958 3847 -4456 -6053 4030 7367 -3075 -8069 1626 7511 -268 -6131
2082f131N167M753k258k695l15o6K421L184l697o172M153Q448l625r809K506J0043
2098E907j302r039R6P033O41m315p00J057J67K083Q47m635k299O414L935p337
2114a447n110P233N836o319n844M959M851l203l182J702Q89n48J733k36m240L97
2130b529O195j18p419m22P815R64p363j189N976J029m125k90K068r54m7K503j579
2147E15m113K747N407l115o298L075O456k606n858K008M579j573k670J326L54
2162B34j430J908J876l845k641N205L385n815m100N857M284n075l964L854L038
2177B771k388j373R73o07K4K932o51m982O42O609k35p560m51P615J051o649j640
2194c919N119J582k944j030M94j73J803J776l649l530M730N224n011o496M624
$$ plain form
2082 -6131 -964 3789 1531 -1164 -1479 -1545 876 4060 363 -5809 -1656 6792 3167 -6642 -4136 5907
2098 5907 4605 -4434 -4338 2695 3336 -979 -1679 -622 -455 1628 2475 -2160 -4459 1955 5890 -1447
2114 -1447 -6557 676 6512 193 -5651 -692 4159 956 -2226 -524 365 -183 1550 1314 -2926 -2529
2130 -2529 3666 3548 -3871 -4293 3522 4486 -2877 -4066 1910 2939 -1186 -1476 592 -362 -409 2094 515
2147 515 -3598 -851 4556 1441 -4857 -1782 4674 2068 -3790 -1782 2797 1224 -1446 -120 234
2162 234 -1196 712 2588 -1257 -3898 1307 4692 -1123 -5223 634 4918 -157 -4121 -267 2771
2177 2771 383 -990 -17 -624 -600 2332 1681 -3301 -2659 3950 3715 -3845 -4296 3319 4370 -2279 -3919
2194 -3919 1200 2782 -162 -1192 -698 -871 932 2708 -941 -4471 259 5483 472 -6024 -1400
2209a400P144l608o800K199N655q12l687l03J050J082J664j039m381M85O510N21
2225D280p848j812Q173K983p534l784O009L977l984l284J492K041P91j0k676k264
2241c450L807M601m167o454L698P686k580q092J414P246j49n601r18L338J303
$$ plain form
2209 -1400 5744 2136 -4664 -2465 3190 2378 -1309 -1612 -562 520 2184 1145 -3236 -2751 3759 4280
2225 4280 -3568 -5380 2793 5776 -1758 -5542 467 4444 460 -2824 -1332 709 1500 1490 -1186 -3450
2241 -3450 357 4958 791 -5663 -1965 5721 3141 -4951 -3537 3709 3560 -2041 -2959 379 1682
$$ [...]
8191F
##END NTUPLES=NMR FID
##END=
