##TITLE=1H_LY-DMAA.Per.1.15
 CDCl3
 8 sc, 
 10.03.2022
##JCAMPDX= 6.0         $$ Bruker NMR JCAMP-DX V2.0
##DATA TYPE= NMR FID
##DATA CLASS= NTUPLES
##ORIGIN= UXNMR, Bruker Analytische Messtechnik GmbH
##OWNER= root
$$ XWIN-NMR		Version 3.5
$$ Thu Mar 10 11:10:43 2022 Russian Standard Time (UT+4h)  she@DPX200
##.OBSERVE FREQUENCY= 200.131346
##.OBSERVE NUCLEUS= ^1H
##.DELAY= (6, 6)
##.ACQUISITION MODE= SIMULTANEOUS
##.ACQUISITION SCHEME= undefined
##.AVERAGES= 8
##.DIGITISER RES= 18
##SPECTROMETER/DATA SYSTEM= spect
##.PULSE SEQUENCE= zg30
##.SOLVENT NAME= CDCl3
##.SHIFT REFERENCE= (INTERNAL, CDCl3, 0, 15.7039)
##AUDIT TRAIL= $$ (NUMBER, WHEN, WHO, WHERE, WHAT)
$$ ##TITLE= Audit trail, XWIN-NMR		Version 3.5
$$ ##JCAMPDX= 5.01
$$ ##ORIGIN= Bruker BioSpin GmbH
$$ ##OWNER= she
$$ F:/spectra/data/she/nmr/H-F/1/audita.txt
$$ ##AUDIT TRAIL=  $$ (NUMBER, WHEN, WHO, WHERE, WHAT)
(   1,<2022-03-10 11:09:11.73 +0400>,<she>,<DPX200>,
      <created by zg, POWCHK disabled, PULCHK disabled
       configuration hash MD5:
       00 E9 B6 7A A2 85 ED C7 34 08 36 98 17 FE 4E 26
       data hash MD5: 16K
       8A 56 B1 34 78 28 C9 13 78 8F E4 19 A0 95 BD 58>)
$$ ##END=
$$ 
$$ hash MD5
$$ C9 DA 55 E2 5E E4 D2 25 C1 AB 37 B8 E1 1D F4 1B
##$RELAX= 
##$RELAX= 
##$RELAX= 
##$RELAX= 
##$RELAX= 
##$RELAX= 
$$ Bruker specific parameters
$$ --------------------------
##$DU= <F:/spectra>
##$EXPNO= 1
##$NAME= <H-F>
##$PROCNO= 1
##$TYPE= <nmr>
##$USER= <she>
##$AMP= (0..31)
100 100 100 100 100 100 100 100 100 100 100 100 100 100 100 100 100 100 
100 100 100 100 100 100 100 100 100 100 100 100 100 100 
##$AQSEQ= 0
##$AQ_mod= 1
##$AUNM= <au_zg>
##$AUTOPOS= <>
##$BF1= 200.13
##$BF2= 200.13
##$BF3= 200.13
##$BF4= 200.13
##$BF5= 200.13
##$BF6= 200.13
##$BF7= 200.13
##$BF8= 200.13
##$BYTORDA= 1
##$CFDGTYP= 0
##$CFRGTYP= 5
##$CHEMSTR= <none>
##$CNST= (0..31)
1 1 145 1 1 1 1 1 1 1 1 1 1 1 1 1 1 1 1 1 1 1 1 1 1 1 1 1 1 1 1 1 
##$CPDPRG= <>
##$CPDPRG1= <>
##$CPDPRG2= <>
##$CPDPRG3= <>
##$CPDPRG4= <mlev>
##$CPDPRG5= <mlev>
##$CPDPRG6= <mlev>
##$CPDPRG7= <mlev>
##$CPDPRG8= <mlev>
##$CPDPRGB= <>
##$CPDPRGT= <>
##$D= (0..31)
0 1.2 0 0 0 0 0 0 0 0.06 0 0.03 0 0 0 0 0.0002 0 0 0 0 0 0 0 0 0 0 0 0 
0 0 0 
##$DATE= 1646896151
##$DBL= (0..7)
120 120 120 120 120 120 120 120 
##$DBP= (0..7)
150 150 150 150 150 150 150 150 
##$DBP07= 0
##$DBPNAM0= <>
##$DBPNAM1= <>
##$DBPNAM2= <>
##$DBPNAM3= <>
##$DBPNAM4= <>
##$DBPNAM5= <>
##$DBPNAM6= <>
##$DBPNAM7= <>
##$DBPOAL= (0..7)
0.5 0.5 0.5 0.5 0.5 0.5 0.5 0.5 
##$DBPOFFS= (0..7)
0 0 0 0 0 0 0 0 
##$DE= 6
##$DECBNUC= <off>
##$DECIM= 32
##$DECNUC= <off>
##$DECSTAT= 4
##$DIGMOD= 1
##$DIGTYP= 9
##$DL= (0..7)
0 120 120 120 120 120 120 120 
##$DP= (0..7)
150 150 150 150 150 150 150 150 
##$DP07= 0
##$DPNAME0= <>
##$DPNAME1= <>
##$DPNAME2= <>
##$DPNAME3= <>
##$DPNAME4= <>
##$DPNAME5= <>
##$DPNAME6= <>
##$DPNAME7= <>
##$DPOAL= (0..7)
0.5 0.5 0.5 0.5 0.5 0.5 0.5 0.5 
##$DPOFFS= (0..7)
0 0 0 0 0 0 0 0 
##$DQDMODE= 0
##$DR= 18
##$DS= 0
$$ [...]
##$SUBNAM2= <"">
##$SUBNAM3= <"">
##$SUBNAM4= <"">
##$SUBNAM5= <"">
##$SUBNAM6= <"">
##$SUBNAM7= <"">
##$SUBNAM8= <"">
##$SUBNAM9= <"">
##$SW= 18.0517287032376
##$SWIBOX= (0..15)
0 0 2 0 0 0 0 0 0 0 0 0 0 0 0 0 
##$SW_h= 3612.71676300578
##$TD= 16384
##$TD0= 1
##$TE= 0
##$TE2= 300
##$TE3= 300
##$TEG= 300
##$TL= (0..7)
0 120 120 120 120 120 120 120 
##$TP= (0..7)
150 150 150 150 150 150 150 150 
##$TP07= 0
##$TPNAME0= <>
##$TPNAME1= <>
##$TPNAME2= <>
##$TPNAME3= <>
##$TPNAME4= <>
##$TPNAME5= <>
##$TPNAME6= <>
##$TPNAME7= <>
##$TPOAL= (0..7)
0.5 0.5 0.5 0.5 0.5 0.5 0.5 0.5 
##$TPOFFS= (0..7)
0 0 0 0 0 0 0 0 
##$TUNHIN= 0
##$TUNHOUT= 0
##$TUNXOUT= 0
##$USERA1= <user>
##$USERA2= <user>
##$USERA3= <user>
##$USERA4= <user>
##$USERA5= <user>
##$V9= 5
##$VALIST= <valist>
##$VCLIST= <CCCCCCCCCCCCCCC>
##$VD= 0
##$VDLIST= <DDDDDDDDDDDDDDD>
##$VPLIST= <PPPPPPPPPPPPPPP>
##$VTLIST= <TTTTTTTTTTTTTTT>
##$WBST= 1024
##$WBSW= 4
##$XGAIN= (0..3)
0 0 0 0 
##$XL= 0
##$YL= 0
##$YMAX_a= 402544
##$YMIN_a= -343859
##$ZGOPTNS= <>
##$ZL1= 120
##$ZL2= 120
##$ZL3= 120
##$ZL4= 120
##$ABSF1= 10
##$ABSF2= 0
##$ABSG= 5
##$ABSL= 3
##$ALPHA= 0
##$AQORDER= 0
##$ASSFAC= 0
##$ASSFACI= 0
##$ASSFACX= 0
##$ASSWID= 0
##$AUNMP= <proc_1d>
##$AZFE= 0.1
##$AZFW= 0.1
##$BCFW= 1
##$BC_mod= 2
##$BYTORDP= 1
##$COROFFS= 0
##$CY= 11.3945322036743
##$DATMOD= 1
##$DC= 2
##$DFILT= <>
##$DTYPP= 0
##$F1P= 2.36226072786647
##$F2P= -0.459571619588291
##$FCOR= 0.5
##$FTSIZE= 0
##$FT_mod= 4
##$GAMMA= 1
##$GB= 0.15
##$INTBC= 1
##$INTSCL= 1
##$ISEN= 128
##$LB= 0.24
##$LEV0= 0
##$LPBIN= 0
##$MAXI= 10000
##$MC2= 0
##$MEAN= 0
##$ME_mod= 0
##$MI= 1.114404
##$NCOEF= 0
##$NC_proc= 0
##$NLEV= 6
##$NOISF1= 3.799351
##$NOISF2= 2.8
##$NSP= 1
##$NTH_PI= 0
##$NZP= 0
##$OFFSET= 15.70392
##$PC= 1
##$PHC0= -16749.89
##$PHC1= 15.60078
##$PH_mod= 1
##$PKNL= yes
##$PPARMOD= 0
##$PSCAL= 0
##$PSIGN= 0
##$REVERSE= no
##$SF= 200.130013532006
##$SI= 16384
##$SIGF1= 3
##$SIGF2= 2
##$SINO= 400
##$SIOLD= 16384
##$SREGLST= <1H.CDCl3>
##$SSB= 0
##$STSI= 0
##$STSR= 0
##$SW_p= 3612.71676300578
##$SYMM= 0
##$S_DEV= 0
##$TDeff= 0
##$TDoff= 0
##$TI= <>
##$TILT= no
##$TM1= 0
##$TM2= 0
##$TOPLEV= 0
##$USERP1= <user>
##$USERP2= <user>
##$USERP3= <user>
##$USERP4= <user>
##$USERP5= <user>
##$WDW= 1
##$XDIM= 8192
##$YMAX_p= 0
##$YMIN_p= 0
$$ End of Bruker specific parameters
$$ ---------------------------------
##NTUPLES= NMR FID
##VAR_NAME=  TIME,          FID/REAL,        FID/IMAG
##SYMBOL=    X,             R,               I
##VAR_TYPE=  INDEPENDENT,   DEPENDENT,       DEPENDENT
##VAR_FORM=  AFFN,          ASDF,            ASDF
##VAR_DIM=   8192,          8192,            8192
##UNITS=     SECONDS,       ARBITRARY UNITS, ARBITRARY UNITS
##FACTOR=    0.0002768,     1,               1
##FIRST=     0,             0,               0
##LAST=      2.2672688,     0,               0
##MIN=       0,             -343859,         0
##MAX=       2.2672688,     402544,          0
$$ Real data points
##PAGE= N=1
##DATA TABLE= (X++(R..R)), XYDATA
$$ [...]
1326A0875m624j3215M804N099n607L320P332j0546j0395J6288J4278k0492j7339
1339b0222K2058J8754k0567j8879J7196J7046j3386j2302R011N186m595K573J626
1352C499j0514o89J8349J065k4623j929K7910L700k8066n766K6037O424k1501
1365f104n149J4653K552p081J235M03o774N246J3166r789j8762J2071K2596j1885
1379F378k4983J0371K5095q486k2057O340J6385m289r381L501J973m519N903O546
1393H777j2885q706J7520J1291j9788j3771K0381J4644j9233j3246J5911J0462
1405A1357j2047o336Q645N29n757O077L176j2031j601J6638J439k0180j483K1953
1419A0379J169k1207n50J8466k47j4810K075J0682n098n807Q386J137j1337K256
$$ plain form
1326 10875 6251 -6964 -2160 2939 -2668 652 7984 -2562 -12957 3331 17609 -2883 -20222
1339 -20222 1836 20590 23 -18856 -1660 15386 2000 -10302 -1291 3895 -700 1873 3499
1352 3499 -7015 -7704 10645 11710 -12913 -14842 13068 16768 -11298 -17064 8973 15397 -6104
1365 -6104 -11253 3400 5952 -1129 106 509 -6265 -1019 12147 2358 -16404 -4333 18263 6378
1379 6378 -18605 -8234 16861 8375 -13682 -7342 9043 4754 -4627 -1126 847 -3672 2231 8777
1393 8777 -4108 -12814 4706 15997 -3791 -17562 2819 17463 -1770 -15016 895 11357
1405 11357 -690 -7026 1619 2148 -3609 2468 5644 -6387 -7988 8650 10089 -10091 -11574 10379
1419 10379 11548 -9659 -10209 8257 8010 -6800 -4725 5957 859 -4948 3438 4575 -6762 -4506
1433d506J4068m693j6339O631J6940p988j5698Q300J3438q508j0453R338O260
1446F790j0280j499J0972k524j1692N782J2521q374j2634J0432J1349j1186r051
1459i394J1045O339j1154k685J1240j877j0804O015J0366r274j0411J1802J0139
1472A1347j3568r043J3981O900j2751m481J1056J316r415L187P313p659n256J1679
1486D606L983j4867l581J7461L054j8409k361J7208J913j4758j003J1331j085
1499C492p173M150K402p464J666J0852m391j4530O297J7314p166j8436O934J7745
1513A1692n648j5552M444J1898l977o355L798L18m247N324N827j0288q236J4265
1527C263J0310j6454j1689J6340J2464j4771j2160J2338R657q970n533N229O14
$$ plain form
1433 -4506 9562 4869 -11470 -4839 12101 4113 -11585 -3285 10153 1645 -8808 530 6790
1446 6790 -3490 -4989 5983 3459 -8233 -2451 10070 1696 -10938 -506 10843 -343 -9394
1459 -9394 1651 7990 -3164 -5849 5391 3514 -7290 -1275 9091 -183 -10594 1208 11347
1472 11347 -2221 -11264 2717 9617 -3134 -7615 3441 4757 -4658 -1471 5842 -1817 -7073 4606
1486 4606 8589 -6278 -9859 7602 10656 -7753 -10114 7094 9007 -5751 -6754 4577 3492
1499 3492 -3681 469 2871 -4593 -2927 7925 3534 -10996 -4699 12615 5449 -12987 -6053 11692
1513 11692 6044 -9508 -5064 6834 2857 -3498 300 618 -3629 1695 7522 -2766 -11002 3263
1527 3263 13573 -2881 -14570 1770 14234 -537 -12697 -359 9298 328 -5205 24 638
1540F38k169M786N01j0497K03J5672l01j8814n58K0049K144j9633l055J7258K869
1555I093j2914j929P657R4k767L164j808p300N642J1150q204j4172Q869J6309
1569A2884q343j7153P449J5918o127j2560M525Q298l451l511L761k132m389P320
1583B489N443j1233o857J3610Q464j4896r162J4624Q579j2886p029J0153M727
1596F026p721j162N346l290k997P335J476j0656r36J3369Q13j4996l82J4911K7
1611G163j3305L88J1088j495q302L500M960n776j622P662p75r712K560J1353m175
1626C512j1926N217J1175n642r630N883P560o598m575P397J167p879J871Q497
1640F029m203r195O320R370p828q517Q237P109q035n301P872K584p700Q17P176
$$ plain form
1540 638 -1531 3255 3756 -6741 -6538 9134 8833 -9981 -10539 9510 11654 -7979 -11034 6224 9093
1555 9093 -3821 -5750 1907 2001 -766 2398 590 -6710 -1068 10082 1878 -12294 -3425 12884
1569 12884 4541 -12612 -5163 10755 4628 -7932 -3407 4891 1440 -2071 1690 -442 -4831 2489
1583 2489 7932 -3301 -10158 3452 11916 -2980 -12142 2482 11061 -1825 -8854 1299 6026
1596 6026 -1695 -2857 2489 -801 -3798 3537 5013 -5643 -6579 6790 7603 -7393 -7775 7136 7163
1611 7163 -6142 -5754 5334 3839 -4463 -963 3997 -1779 -3401 4261 3486 -6226 -3666 7687 3512
1626 3512 -8414 -3197 7978 2336 -7294 -1411 6149 -449 -5024 2373 3540 -4339 -2468 6029
1640 6029 1826 -7369 -1049 8321 493 -8024 213 7322 -713 -6014 1858 4442 -3258 -2441 4735
1655D735m200o605O647O738q841o849J0444O340j0894n240R927M100q647k168
1669d513P249p59n224L976L349o967k071R667J586j2062j248J3379Q67j3136q92
1684f799J1759P75r685J76O718k074k869L894o04o026L154Q716n129j1139O520
1699b613J2476o706j2619N837J1971m787r951M056O357l182k209K742k048l135
1713c811N931M405r484n666J1744O720j2376p698J1704Q077j0308p077Q034M779
1727D974n044k007K531j450p96N560m23r266J056J2125r47j3593m5J4145P89j3187
1743e578r70J0608Q52p186k69L717j533j86M020l263o425N720Q515o819j0399
1758i196O969J1564o729j1131N913R272m415o747L300L657l057L02L135m109l348
$$ plain form
1655 4735 535 -6070 577 7315 -1526 -8375 2069 8409 -2485 -7725 2202 6302 -2345 -4513
1669 -4513 2736 1977 -3247 729 4078 -2889 -4960 4707 6293 -5769 -7017 6362 7229 -5907 -6799
1684 -6799 4960 5735 -3950 -3774 2944 870 -1999 1895 1291 -4735 -1581 7135 2006 -9133 -2613
1699 -2613 9863 3157 -9462 -3625 8346 3559 -6392 -2336 4021 839 -1370 1372 -676 -3811
1713 -3811 2120 6525 -2959 -8625 3119 9839 -2537 -10235 1469 9546 -762 -7839 195 4974
1727 4974 -70 -2077 454 -996 -1792 3768 3345 -5921 -4865 7260 6313 -7280 -7325 6820 7609 -5578
1743 -5578 -6548 4060 4912 -2274 -2543 1174 -359 -545 3475 212 -6213 -493 8022 1203 -9196
1758 -9196 -2227 9337 2608 -8523 -2610 6662 2247 -4500 -1200 2457 -600 -298 2837 -1272 -4620
1773d620P033M054r085n120J0352N694j0621n424R528M623p858l444O234J264
1787B610m491J621K738m456j339O716Q09q760m13J0253j01j0318L88R477n60q134
1803c960J214O306k524m026M134J435n422M54O691j880q029L175Q477l951q019
1818e925M126P012m172n670M665L424n059p68N403j503n693L151O444m771o691
1833f027N903O239n997n547N665M356n388k523N112qm554K498M025m549m111O337
1849A431M220p731m058Q240L752p892l144O968K243n835m26M220j759k371L882
1864A740J055o006l48Q150k19r601O00R804m89r174J78P928m56n912J190L156
1880A596k127l66L371j953m977L703O826n144p978N719Q442n141q506M368P723
$$ plain form
1773 -4620 2413 6467 -2618 -7738 2614 8308 -2313 -7737 1791 6414 -1444 -4888 1346 2610
1787 2610 -1881 -260 2478 -1978 -3317 3399 4208 -4552 -4965 5288 5187 -5131 -4743 4734 4174 -3960
1803 -3960 -2746 3560 1036 -2990 1144 2579 -2843 -2389 4302 2422 -5607 -2432 6045 2094 -5925
1818 -5925 -1799 5213 1041 -4629 36 3460 -1599 -2367 3036 1533 -4160 -1009 5435 664 -6027
1833 -6027 -124 6115 118 -5429 236 4592 -796 -3319 1793 1785 -2769 -271 3754 -795 -4906 1431
1849 1431 5651 -2080 -6138 2102 5854 -2038 -5182 1786 4029 -1806 -2232 1988 229 -2142 1740
1864 1740 2795 -3211 -3559 4591 4372 -5229 -4629 5175 4686 -4488 -4310 3618 3162 -2750 -1560 1596
1880 1596 -531 -897 2474 521 -4456 -753 6073 929 -7049 -1330 7112 1971 -6535 -2167 5556
1895E556l689n625K760K867j947k7J760k897k238N781K831p942l499Q896M273
1910F860q921m950Q411M702p039l627M875K136k756l8J249k751J98N518j215p584
1926d932J361R031q36r971M72R648k33q150k2N967j00l659R57J060k417J618L860
1943C654l696n148M724O571n183p557N297P574m744o716L864N200k802l420K588
1958B06P41k338K062K087m166k499N819L244p170l626P580L487p131l123N986
1973A159K545m888j128L672r49k110K746J083m503m55O042K44p226K93P348m94
1989C379o799N42N926q65m703J781K939k790j131L638k81m721J294N742k259o140
2005d448K811N867k753n354K759M392k997k809L301Q54l413Q68L774k254m317
$$ plain form
1895 5556 1867 -3758 -998 1869 -78 -105 1655 -1242 -3480 2301 5132 -2810 -6309 2587 6860
1910 6860 -2061 -7011 1400 6102 -937 -4564 311 2447 -309 -347 902 -1849 -1651 3867 2652 -4932
1926 -4932 -3571 5460 4624 -5347 -4875 4773 4540 -3610 -3632 2335 2235 -1424 -467 593 -1824 -206 3654
1943 3654 -42 -5190 -466 6105 922 -6635 -1338 6236 1492 -5224 -1360 3840 1038 -2382 206
1958 206 947 -1391 671 2758 -1408 -3907 1912 5156 -2014 -5640 1940 5427 -1704 -4827 1159
1973 1159 3704 -1184 -2312 1360 411 -1699 1047 2130 -2373 -2828 3214 3458 -3768 -3475 3873 3379
1989 3379 -3420 -2878 3048 2183 -2520 -739 2200 -590 -1721 1917 1636 -3085 -1791 3951 1692 -4448
2005 -4448 -1637 4230 1477 -3877 -1118 3274 277 -2532 769 1623 -1790 -922 2852 598 -3719
2020c719L524M769m512m605M585M307m439l629M054K492l701o98L047j216k536
2035b277K812K511m474k531N790K499o347k379O174K319n628j824M818Q01l471
2050a207O73J754j937p47L595ln293O55O462j010p001Q62O891n00o443M83N174
2067B408p14l217R53J217j581O43K707k267l962L662M894m248n505M137O009l848
2083A288n733L333M527k452k895J655R01j265J208J349l454j597N275J799o154
2098b215k436O497L060o459l045N655K502m114j793K679N89j367J218J77l160
2113b212Q42M715j233n854J019O759p96o959N77O162l01m806L7L400n26j602J337
2130E59l91k239K050L153k961m278L617N055l873n133L659M721k972l955K285
$$ plain form
2020 -3719 -195 4574 62 -4543 42 4349 -90 -3719 335 2827 -874 -1572 1475 259 -2277
2035 -2277 535 3046 -1428 -3959 1831 4330 -2017 -4396 1778 4097 -1531 -3355 1463 2264 -1207
2050 -1207 -534 1220 -717 -1464 2131 2128 -3165 -2510 3952 2942 -4059 -3197 3694 3194 -3249 -2766 2408
2067 2408 1694 -1523 -570 647 -934 -291 2416 149 -3813 -151 4743 495 -5010 -873 5136 1288
2083 1288 -4445 -1112 3415 963 -1932 -277 624 -641 567 1916 -1538 -3135 2140 3939 -2215
2098 -2215 -4651 1846 4906 -1553 -4598 1057 3559 -555 -2348 331 920 -447 771 948 -2212
2113 -2212 -1370 3345 2112 -3742 -2723 4036 3240 -3719 -3142 3020 2719 -2087 -2050 1350 824 -778 559
2130 559 168 -2071 -21 3132 171 -4107 -490 4565 692 -4441 -782 3939 967 -2988 -703
2145g03K821k071r49J811j049j538K600J645l802k193M905K384n436k309N129
2160A245K176m465j852L847P75k782M60J726j671q94K858N32m033k56N052j69
2176B549n234K57M973k17m434L94L551j025k238J608R56k280N7L005p69m024J594
2193a277M381j926m366J952M062j810l536K038K316k073p97K074m55k329J580
2208a66K810k616l274L477L228l557l178L358K857l010k277K683J012k077K21
2223e09J608j516j383K794J393l936j340M583J361m567j611M410J577l901r64
2238b001K881J83j697P00P15j794j9L084n76m253R96M778r66m969O72M842n59
2255B017m081M81K849n28j385P57J09j490J326K319k517k967L235L529l326m016
$$ plain form
2145 -703 2118 47 -902 909 -140 -1678 922 2567 -1235 -3428 1477 3861 -1575 -3884 1245
2160 1245 3421 -1044 -2896 951 1726 -1056 -596 1130 -541 -1435 1423 1955 -2078 -2334 2718 2549
2176 2549 -2685 -2428 2545 2328 -2106 -1712 1839 814 -1424 184 1140 -1140 -1083 1922 1153 -2871 -1277
2193 -1277 3104 1178 -3188 -1236 2826 1016 -2520 -482 1834 -239 -1036 1038 583 -1746 -166
2208 -166 2644 28 -3246 231 3459 -98 -3276 82 2939 -71 -2348 335 1347 -730 -509
2223 -509 1099 -417 -1800 994 2387 -1549 -2889 1694 3055 -1512 -3123 1287 2864 -1037 -2001
2238 -2001 880 1063 -634 66 781 -1013 -1032 2052 1476 -2777 -1781 2997 2031 -2938 -2266 2576 2017
2255 2017 -2064 -1583 1266 738 -647 110 219 -1271 55 2374 -143 -3110 125 3654 328 -3688
2271c688L216M014k888l359K132K490j540j274J001j53r03J864P19l170q99M048
2287A610J357m565j795M731J968m343j749L347J489k331p61J409l35m28J638m31
2303H11k761Q40L715q76m508P28M871p23m490M15L657j44k749L79J519q92m4J373
2321A121j183j921J949K684k487l299K837L541k831l239K352K829j801k111J506
2336e3R56j248L16R79j447j090K398J383l250j561L671J596l545j665L176J454
2352B070k717q19K106l7j322R85O07j762l62K717J59l408P6L619j9l526o6L256
2370A557j46k700N56J693r65p23J352j29j903O62K633j193l031J618L027j525
2386G83k920J336K643j301j896J346Q90j254N8J331r49j682J781J968k384k117
$$ plain form
2271 -3688 -472 3542 654 -2705 -573 1917 377 -897 104 -49 -952 912 1631 -1539 -2438 1610
2287 1610 2967 -1598 -3393 1338 3306 -1037 -2786 561 2050 -281 -1042 367 32 -396 1242 811
2303 811 -1950 -1110 2605 1729 -2779 -2051 2820 2097 -2393 -1978 1679 1535 -1214 -835 684 -208 -252 1121
2321 1121 -62 -1983 -34 2650 163 -3136 -299 3242 411 -2828 -476 2353 552 -1559 -53
2336 -53 903 -345 -29 950 -497 -1587 811 2194 -1056 -2617 1054 2650 -895 -2560 616 2070
2352 2070 -647 -1466 640 603 -719 266 873 -889 -1251 1466 1625 -1783 -1707 1912 1893 -1633 -1699 1557
2370 1557 1411 -1289 -733 960 -5 -728 624 495 -1408 -746 1887 694 -2337 -719 2308 783
2386 783 -2137 -801 1842 541 -1355 -9 881 -373 -315 1016 67 -1615 166 2134 -250 -2367
2402b367K544K267k547k220K318J866k011j084J486J49r45O46Q01j633p94K630
2418A106P06l145o46L263R48l321r78K995P38k269l69J411j05p04P95J07j766
2435a234N63K527r74l057J034L287p77l559P31L164o32k269L51J436l28m50O72
2452D85n81j178J592J645k186k009K331K527k392k731K223K483j791j952J129
2467d05J351q17l83N83q16m36J869L46k451o78K943J093l306j160L115J154k576
2484e74r95J897P15j252j9N47q65K19J541o37k169O89K822o97l278P55L001m52
2502A248k623J67K151k82j308N26K92p87O32J163j202j684J722K099j949k318
2518b153J896K271j549k094J232J689j070r12Q49j6n72O81O45j437q90K124R92
$$ plain form
2402 -2367 177 2444 -103 -2323 -5 1861 -150 -1234 252 401 -544 102 903 -730 -1524 1106
2418 1106 1812 -1333 -1979 1284 2232 -1089 -2067 928 1666 -603 -972 439 334 -370 425 532 -1234
2435 -1234 -671 1856 882 -2175 -1141 2146 1369 -2190 -1459 1705 1073 -1196 -845 591 263 -187 485
2452 485 -96 -1274 318 1963 -223 -2232 99 2626 234 -2497 -274 2209 418 -1534 -405
2467 -405 946 129 -254 329 -487 -923 946 1292 -1159 -1837 1106 2199 -1107 -2267 848 2002 -574
2484 -574 -1569 328 1043 -209 -228 319 -546 -327 1214 577 -1592 -903 1919 1222 -2056 -1301 1700 1248
2502 1248 -1375 -1208 943 661 -647 -121 171 -616 16 1179 -23 -1707 15 2114 165 -2153
2518 -2153 -257 2014 465 -1629 -397 1292 222 -690 159 143 -429 252 897 -540 -1430 694 1686
2535A686k527j010K449J139k209j133K009P79j597j21Q47l91l29R89J79j697J2
2552i25K254j03k597K28K411J7k343rJ998k32j319L95N19o82L3J111l86j665Q85
2571d10J956j075k132J035K169r27k043R87J536p92q13N64K23o66M58R00j140
2588a70j123J625J204j816j406J777J594j729j467J457J024j038l79N34j24l74
2604d11P98L76j542k70K099K40k245m27K298O18k214n61J767M00j161j58N60k13
2622d6j19P86l08j475P03J860q10k057N56K352n36k254M88J751j88j239J27O92
2640B83l11Q6O32q29q51J282J146j480j590J681J719j630j625J253J424q80j161
2657h51O75M68m37L21J88r34j27J468J86j785n73K216O63k148o65J776P77j374
$$ plain form
2535 1686 -841 -1851 598 1737 -472 -1605 404 1183 -414 -535 312 -79 -408 581 760 -937 -925
2552 -925 1329 1226 -1371 -1143 1268 1285 -1058 -1067 931 699 -620 -225 294 -388 -355 756 370 -1295 -410
2571 -410 1546 471 -1661 -626 1543 616 -1427 -440 1096 304 -509 55 278 -388 70 970 -170
2588 -170 -1293 332 1536 -280 -1686 91 1685 -44 -1511 -54 970 -68 -447 87 -37 -411
2604 -411 387 763 -779 -1049 1050 1290 -955 -1382 916 1534 -680 -1241 526 926 -235 -393 167 -46
2622 -46 -165 621 313 -1162 -459 1401 591 -1466 -910 1442 906 -1348 -860 891 703 -536 -409 283
2640 283 -28 58 690 -139 -990 292 1438 -42 -1632 49 1768 138 -1487 -234 1190 310 -851
2657 -851 -176 292 -145 176 364 -570 -697 771 957 -828 -1401 815 1478 -670 -1335 441 1218 -156
2675a56o31J004J64m24K99r4q16L87J206m22j764M47K114n13k029K89J869j40
2693G90j544Q7J082k56k66L03l04m54O19R26j013j317J357J434j237j514J052
2710b55J468p93j341O89P67n17j20K81l47m10Q77N11j373n91J660O16j608p41
2728a227J514P91j285n92R52L31n18Q0J37m43o6R55n8j419J92J623j48j640n7
2747h78J608J34j496M2R38j28m15K29Pm11K38Q89o56j127Q22J286p23j440N91
2766d90J473m80j256N17O61k54k74K37j60l93O55N53j077p34J292Q34j258j105
2784a259J280J050j128p67P62M89l57k03K32k81j22Q17j6j158NJ390J47j426l85
2803i30J588L13j355l56R31L30n56j37K19k92J70P60o22r56N85J240m60j480M47
$$ plain form
2675 -156 -787 217 381 -43 256 162 -654 -267 939 517 -1247 -800 1314 801 -1228 -939 930 790
2693 790 -754 -667 415 159 -107 196 -108 -562 57 983 -30 -1347 10 1444 207 -1307 -255
2710 -255 1213 420 -921 -232 535 18 -102 179 -168 -578 299 810 -563 -1154 506 1122 -486 -1227
2728 -1227 287 1078 -207 -799 153 484 -34 46 183 -260 -326 629 571 -848 -656 967 819 -821 -878
2747 -878 730 864 -632 -590 348 220 -195 34 41 -370 -132 757 101 -1026 -204 1082 359 -1081 -490
2766 -490 983 503 -753 -236 425 171 -103 134 -26 -419 236 789 -288 -1022 270 1104 -154 -1259
2784 -1259 21 1071 -57 -824 -62 427 70 -133 99 -182 -304 513 497 -661 -656 734 881 -545 -930
2803 -930 658 971 -384 -740 191 521 -35 -172 47 -245 -75 685 63 -893 -308 932 472 -1008 -561
2822e61J566m76j185Q8R99K1o61O8J37k13M75K63p44n52R91Q31j045j131J141
2841A2J047r55r70O22Q72m11n71K99qj20M63l6p47n0J093K28j324l51J426L41
2861H60j151n06R93N41p21l40L20oO7K54k16o51K96J035l75j287L75J239j88j198
2881f59L1J052K7p39N0K49n1J26J69l47m75O56P38q34q76R17Q50o41j004M98R22
2902F59m83n75K51K00p9O2J13m40j88Q71K07j084k70J056N04j017o22R69N10o79
2922c5k95L13J13r9J34J5m84J33Q13k35j053J48J102M3j154j15J009P2o78o9L62
2943D0J1m7J12j10n08M86O60o32p00N28R03m57r87M28Q84k70o29R0L05O4j40R3
2965A24k91k27O47K41q01l96P96O42q13o70P54N20n24m16K91L31j31l8L4l28Q3
$$ plain form
2822 -561 1005 529 -656 -568 431 452 -209 -141 -4 -217 258 521 -223 -775 216 1047 2 -1129 12
2841 12 1059 104 -866 -244 628 217 -354 -55 -63 -183 280 244 -503 -553 540 768 -556 -907 519 860
2861 860 -291 -797 196 737 16 -324 -4 -10 57 311 95 -556 -260 775 400 -887 -512 727 539 -659
2881 -659 -628 424 451 -288 -238 11 -40 86 255 -92 -567 89 827 -7 -883 34 884 243 -761 -263 659
2902 659 176 -399 -148 52 -27 35 148 -292 -480 391 598 -486 -756 300 804 -213 -835 134 644 -35
2922 -35 -330 -17 96 -3 131 146 -338 -205 608 373 -680 -532 570 613 -541 -656 353 425 -253 -322 40
2943 40 51 4 116 6 -502 -16 644 12 -688 -160 743 286 -701 -273 611 341 -288 -198 107 171 31 124
2965 124 -167 -394 253 494 -307 -703 93 735 -78 -748 6 526 2 -414 -123 208 77 39 73 -255 -172
2986a72O47r1p93n8R65J32j042k60J000K07o61k66L62K44k43O9j78j99L04M80
3006D47l91o76L95R26l79r30K31Q35q3o93L6M65J00k58Q4k39oM01J78n66m72O95
3028A00N72p07o89N81P08m25o19K47N08j69j51Nj80K32L26j18n43j47Q75J72q74
3049b96k11P38M04o38m00M14L16l01J0j02j05J87K90k31n34K22P89k86q17K48
3069c03O93J5p07o1N18M6j68j41K5QK49J35m02l53N52N03o03n40M27O51k42p32
3091d30K61L93j02k18m3O4P1J61J2m57j24O97J72p11k58O44M38o28m20N27K04
3112B53j65j51K1M6P4Q2o3m74J47O60k68n46pO85Q0o62q5M78J24k17k20J36L4
3135c8P0J85k85l11L90M53l99n00K77O53k33o55K06M50m9k92j32J47N1J50j3l45
$$ plain form
2986 -172 475 384 -409 -467 498 630 -412 -672 328 535 -126 -392 -30 214 -29 40 -138 -337 -33 447
3006 447 56 -620 -225 701 322 -608 -377 458 375 -318 -282 183 283 25 109 -130 -136 265 443 -123 -595 100
3028 100 672 -35 -724 -143 565 140 -479 -232 276 107 -44 -39 -219 13 339 221 -322 -469 406 578 -296
3049 -296 -507 231 635 -3 -403 11 327 26 36 -66 -171 16 306 75 -459 -237 552 266 -551 -303
3069 -303 390 405 -302 -363 155 201 33 -108 -83 -75 174 309 -93 -446 106 609 6 -534 -107 544 302 -430
3091 -430 -169 224 122 -96 -139 -75 -4 157 169 -288 -412 285 457 -254 -512 132 570 -58 -478 49 253
3112 253 88 -63 -42 4 78 160 97 -377 -230 430 162 -384 -391 294 374 -288 -373 105 229 12 -208 -72 -38
3135 -38 32 217 -68 -379 11 464 65 -435 -158 495 262 -393 -187 263 214 -78 -210 -63 -12 138 125 -220
3157b20m6L97J70m29l82N48M73n66l81L51L81j48l01OJ47NK13j93k42J23M21n2
3179B75n37m6O32Q7o24j26L92L13l74k18J67O6O5K9k33j48K84L01k17n16K67N74
3201D13j53n78OM93R5l64q4J59J38J0o2k13kK89K29n02l25M91L49l92l47K05M35
3224B90k00k99R3J36J1O4j51j57J41L19K0n21m3N73Q3m88j46L57L00l58k93K19
3246e0J12J3o0j09q6J59K64j81m75K15N30j15n24JM63R5l63m1J92O6Lj43l2l5
3270a01K16J98l29k81L64K47k38m06K19M06k01l20J13J65J2n4q1m4l0L72k7m61
3292b61L0M07J08l80k47M25J96k62j96J17J90J8j22n7m0P2K42j18m10J80L47j1
3314B28m65o6M84N9l46j35J30K25j5k07O4p2J96Q8k44j66K52L13k09l99J71L66
$$ plain form
3157 -220 -266 131 301 -128 -510 38 511 -55 -436 -85 296 148 -153 -147 0 5 218 25 -217 -94 327 275
3179 275 -262 -308 324 411 -213 -339 53 366 -8 -226 -59 7 72 101 -132 -280 4 305 88 -428 -161 413
3201 413 260 -318 -312 181 276 -88 -172 -13 125 135 73 -140 -142 147 376 -126 -451 40 389 -3 -350 -145 290
3224 290 90 -209 -116 20 31 95 -56 -213 -72 247 267 -254 -297 276 359 -129 -275 82 382 24 -269 -50
3246 -50 62 75 15 -94 -180 -21 243 62 -413 -198 332 217 -307 -306 157 252 -111 -152 40 106 109 -34 -66 -101
3270 -101 115 313 -16 -297 67 314 76 -330 -111 295 94 -226 -113 52 64 10 -71 -115 -145 227 200 -261
3292 -261 -231 176 284 -96 -343 82 278 16 -180 -63 127 145 23 -34 -74 -2 240 122 -288 -108 239 228
3314 228 -237 -303 181 240 -106 -241 -111 114 99 -108 -44 -116 80 168 -76 -242 10 323 114 -285 -114 252
3336B52m6l34m7K32O8j51n3l6M4K09p5k47j7K79K62m10k70L26K87j90k63O7K65
3359A52rj66J6l6J06J22j87j87M1L62L3m47k9L89P6l27j14J54K29j08j97l0J16
3382d1J24N0j95j36J63K76j78l13J33K96l1k58p3L05R8k24o3rJ39M0pj39j35K55
3406G7J34l35j81K67K49j56k68Q6J84L0j48j05P1J93l1q2j00l0L40rl33o3K81
3429G1K07k60k66K31K02r6j75k2J08J08p9l4j38J38K01j72k55J41K82Pk71p9K14
3452F3O1j34q8oJ72Mjj16j00K06J42k85j71K14K43j30l21J08J79P3j63j13Q8J42
3476F7jj18q3L8K47k9k51k7K04J46j91j67J88J45j04j06o4J53P7o8j50m4J30J73
3500A65j57k03N4K61mk83o3K62J32j76j04OJ99l7lj68J07J27Mj52q3J12K11r8
$$ plain form
3336 252 206 -128 -175 57 125 -26 -79 -115 -71 138 63 -184 -201 78 340 -70 -340 -14 273 83 -180 -113 152
3359 152 143 -23 -7 -43 63 185 -2 -189 -148 214 247 -200 -229 160 236 -91 -205 -51 178 70 -127 -157 -41
3382 -41 83 133 -62 -198 -35 241 63 -250 -117 179 148 -110 -183 122 220 -4 -67 -76 63 103 96 -43 -178 77
3406 77 211 -124 -305 -38 211 55 -213 -127 57 87 -61 -166 -95 98 67 -15 -115 -145 195 186 -147 -210 71
3429 71 278 18 -248 -17 185 89 -86 -108 0 108 29 -5 -143 -5 196 24 -231 -90 192 199 -72 -151 63
3452 63 124 -10 -98 -104 68 72 71 -45 -145 61 203 -82 -253 -39 204 74 -247 -139 40 113 -50 -163 -75 67
3476 67 66 -52 -135 -97 150 121 -130 -157 47 193 2 -165 23 168 64 -42 -106 47 124 56 -94 -138 -8 165
3500 165 8 -195 -141 120 116 -167 -230 32 164 -12 -116 -110 89 52 49 -119 -12 115 119 -33 -116 -4 207 109
3524A09k86Q0K32j6j24j62J23P7K1k9j91J04J81p0j18r2K46J27k59j21J18K08
3546A58p1j48l7J40N%r0n7J22M1m8j66Q3K53m5k67l6J52J80j94j25R1J14K7j35
3571e3j00P7J91l7j31r1J54J99j32k33M7J85P4k27n3J03J29K3j77m6J52N2q9p6
3595e9j01K32M1j30j20O1J39N1k47K0J47O1l7j06QQ8O3p4j28K6K01m9j16j09J56
3620A8J45j52j35K7J57P1j42j25N3O4O7j16j35J86J07k4j61k0J83P9j66r0J28
3643A9J08k1j12n8R6N3k1j22p3J94O3j15j38M4K54j49j12l7O9J64r3j46P0O7J13
3668A17r9q8L4J74J4k01r3K20J25j64j16LK12Oj32q2M9O4Qj35q0K08M8q7q3MJ80
3695A06o5j16j11J23J31M4j76MJ01J33q0j18lR2M3j16o8O6J07l3j18p4J33J21
$$ plain form
3524 109 -177 -97 135 119 -5 -167 -44 33 54 25 -166 -62 119 49 -69 -161 85 212 -47 -168 -50 158
3546 158 87 -61 -98 42 47 47 -43 -100 22 63 15 -151 -68 185 140 -127 -163 -11 169 -25 -150 -59 55 82 -53
3571 -53 -153 -76 115 78 -53 -144 10 209 77 -156 -109 76 150 -77 -130 -27 102 125 -52 -98 54 106 17 -59
3595 -59 -160 72 113 -17 -137 -76 63 114 -133 -113 34 95 58 -48 -40 48 111 37 -91 -65 136 87 -29 -138 18
3620 18 163 11 -124 -97 60 131 -11 -136 -83 -19 48 -68 -203 -17 90 66 -95 -115 68 147 -19 -109 19
3643 19 127 106 -6 -64 32 85 64 -58 -131 63 126 11 -127 -83 171 22 -90 -127 -58 106 13 -133 -63 4 117
3668 117 18 -70 -36 138 152 -49 -142 78 203 39 -77 -74 138 144 12 -70 -21 43 51 -84 -164 44 92 5 -78 -74 106
3695 106 41 -75 -186 -63 68 112 -64 -60 41 174 94 -24 -27 65 108 -8 -76 -10 97 64 -54 -128 5 126
3719A26j25j33Q2O2N6r6r5Q8J79r6j15n7J65J06j11j24RJ61Q4k35PL4J29m0j60
3744i9J2J03R1n3j65L3J28n8k1j06J08J14p0p0j9K6R5k4m8QN3J4k8j28J35P3j7
3771H7j03m9J09R4r6j80P9J12K9j50j3mJ97p2j22j1J27N4q3j08R9N4on9j12J00
3797b7J51q8j15J0J25P1o8j32l4K00Op9j10O8J02p0p2k2J06P3p9j18M1J08P6j16
3823Gj53J17J11k6j57K9Q3J08m1j38J9J01M8j63o6J46J00n0j88M8N0P6l1j15L1
3848e4R0mn9q1J30P9n0m5q3J23O1j32mO7M9Po8j48J26K0L9r3k0O7P3o1j31L3R2
3877B3K3q6m9P6P6l5j32J3J26L6q9p9Q1J17m9r4p1J59J8%o5n0O0N4r9o8R7Q3r
3906F7j07o4J15P5o8n4r9J97L9k02j4M8J10J2o9l1R4k8R4j78J7O2L7p5m4P0Q5
$$ plain form
3719 126 1 -132 -50 12 68 -28 -123 -35 144 48 -67 -124 41 147 36 -88 -79 82 166 -69 -62 -28 101 61 -99
3744 -99 -87 16 107 54 -111 -78 50 -8 -29 -135 -27 87 17 -53 -72 -46 49 25 -23 -15 38 52 24 -104 31 104 87
3771 87 -16 -65 44 138 42 -138 -59 53 82 -68 -81 -85 112 40 -82 -93 34 88 5 -103 -4 50 44 -15 -127 -27
3797 -27 124 36 -79 -69 56 127 59 -73 -107 93 99 20 -90 -22 80 10 -62 -84 22 95 16 -102 -61 47 123 7
3823 7 -146 -29 82 56 -101 -72 11 119 78 -60 -41 60 108 -55 -121 25 125 75 -113 -65 -15 61 30 -85 -54
3848 -54 36 32 -27 -108 22 101 51 6 -77 46 107 -25 -29 38 87 94 26 -122 4 24 63 -30 -50 17 90 29 -102 -69 23
3877 23 46 -40 -89 -13 63 28 -104 -91 35 71 -18 -97 -16 101 52 -42 -113 46 64 64 -1 -51 9 63 -36 -104 -7 76 67
3906 67 -40 -104 11 86 18 -36 -135 62 101 -101 -115 -67 43 55 -14 -45 49 21 115 -63 -46 16 53 -22 -66 4 89
3933H9o2l2k6K2J19j73nQM7N2n8q5P4O1J7o3m9O6R1l8q5j7J02mo8o2M1J16Kj03
3963b3m7J48ll9j55J3J20M3p3p2R0J6M0j47L7Q0K9m9l3k2Q0P6r5k9J6O8j7n8q3
3992h9R0J22j14l3%M4O3j88K1O0L3O8j24p2J18N7o1q6J1J39Kn8l2J5L6R1j30P
4020a0M9P5k6j23NN6L5q3m5K0R9n3n0k3J7R9k6m0m6P4Q2p9j03J07M5L9j39l7Q2
4049AP6m1p0j1K2J00j08JN8qP5j24QJ3Q1n6j09k9J73Mq1j9P5J5Rl1j14R0P0j7
4079E3p7Q3l0opj42J39N7p8Rn6M8N6o6p2O3OP3o4o2L4O4l0n2L8N7L2k9o8j0O6
4110B9k7L4r3J9J24J2j45m9J64k8k9p0K8K9N3m5q6Q5M2j7mj50Q3J14n7n7L1PJ01
4139I8j17QJ2L9J5j15K9O7k6np2L1Q3L4j05pj1O6J8r5l8Q2M9o2k4O4j7N6m5p7
$$ plain form
3933 89 27 -5 -31 -9 110 -63 -68 -60 -13 39 -19 -104 -30 31 48 -15 -64 2 93 55 -30 -47 55 51 -17 -79 -38 78 80 -23
3963 -23 -70 78 75 36 -119 -106 14 57 -16 -88 2 18 58 -89 -52 28 57 8 -25 -47 33 109 14 -15 1 69 52 -6 -89
3992 -89 1 123 9 -24 -24 20 83 -105 -84 -24 9 77 -47 -119 -1 56 -5 -91 -80 59 61 3 -29 -14 22 113 -17 -10
4020 -10 39 114 88 -35 -30 26 61 -22 -67 -47 52 -1 -51 -74 -57 42 16 -24 -70 4 86 7 -96 11 56 95 -44 -81 1
4049 1 77 36 -34 -45 -23 77 -31 -30 28 20 95 -29 -21 -8 73 17 -92 -121 52 56 -25 -44 31 46 55 24 -90 0 70 53
4079 53 -24 59 29 23 16 -126 13 70 -8 1 -55 -7 49 -17 -89 -26 -20 53 -11 -73 -39 25 -5 -57 -19 38 70 41 -27 -37 29
4110 29 2 36 -57 -38 86 98 -47 -96 68 40 11 -59 -31 -2 51 6 -80 5 47 30 26 -124 -41 73 16 -41 -10 -3 98
4139 98 -19 -11 1 40 55 -60 -31 36 10 5 -67 -36 47 81 -24 -31 -42 24 42 -53 -91 -9 40 -22 -46 18 1 57 12 -65
4169f5P5M8k9p5nK7J25p4o9K7N6L6p2o1R6kmj6o3N0n2N3Kr6O4N5p4J2K3L0J2l7
4201ck9O2K9p7jK3P8p4j3l0QR1Kj14j1M0O0Jj12N2MN2q6j5M1L2R0p8r5J08K5o
4233E4j23P2O5J1n5m7O4m5R2p2m3R5q1L9o0K2K2Q6j53j7R0j6kn5N1M0k2ml4M5
4263A9K9L7r2o5L6Q1kq5O3j9O6n7J4m0Q4rp1k9M5L6o9L6o5Q0l5llk9L2N0l2q7
4295h4O2O2J5q8L5L3K6l2p7L2j2N8J9r8L6J15r9k6j6O2K8p5J7O2k4qk5k4L5M7
4325E6n7K8p0J5J16o9Pm6R5m8m7NJ8L2j7p0L7L3l8O1r3M0M7n6Nl9L5N1m7MJO2
4357E1n0Loj3N3J8Kj51J02K9n8K4jM9l3o0QM0M3m1k2j6L2kL1j11O6j4K5Op1J01
4389C4j9nJj6rN4l7j4N7l2K6Qp1QJ0k5N5p3K7Q4j15L2l9M6L4n9K1K0l5N4l5l4
$$ plain form
4169 -65 10 58 29 -46 -51 -24 101 27 -42 -15 41 77 5 -56 40 38 34 18 -45 5 -47 6 8 -88 -24 31 -43 -31 -8 22 34 -3
4201 -3 -32 30 59 -18 -19 4 82 8 -5 -35 -27 64 66 -48 -59 -19 41 42 -70 -18 -14 38 -48 -63 -22 10 100 22 -73 35 60 54
4233 54 -69 3 68 79 24 -23 41 -4 88 16 -27 68 -13 26 -34 -12 10 96 -57 -74 16 0 -2 -57 -6 34 12 8 -26 19
4263 19 48 85 -7 -72 -36 45 43 -42 21 2 68 11 25 -15 69 60 -11 -40 5 41 -28 8 -57 23 -12 -15 -18 -47 -15 35 3 -84
4295 -84 -22 40 55 -33 2 35 61 29 -48 -16 -28 30 49 -49 -13 102 3 -23 -39 23 51 -24 -7 55 31 23 -2 -26 9 56
4325 56 -1 27 -43 -28 88 19 26 -20 75 27 -20 -15 3 35 18 -52 -15 18 -20 41 -52 -12 35 -21 -16 -55 -20 31 -16 -12 -11 51
4357 51 1 4 -2 -15 38 56 58 -93 9 38 -20 4 3 52 19 -41 -33 7 50 9 -13 -29 3 1 32 -79 -13 -27 -2 4 -67 34
4389 34 15 10 11 -5 -14 40 3 -11 46 14 40 48 -23 -15 -5 -30 25 -48 -21 63 -52 -20 -59 -13 21 -38 -17 3 -32 22 -13 -47
4421d7jR4L8j26K6Q5l3k3p2M3L5K8n5l9M4k9O8l2o0J0J37o3j45J08K8J4J7q4Q6
4450E2K5j12L2L9qk4%jJ2LM9p5m4P9j9k8K0j0O1k5p9K4lJ8N9mp9K7K2K3o2LL6
4483A1L5n3Qk1M4m8L1N2p1N8j3lj8J4l2lp4P7M2m0po0P2l2%l8L1L2POl2L7KJ5
4517B9Oj01J45k5k2n5L7P3j0p0l1M3o0L1m6N0j2M5J0j00O7MO4j15K0M3L1o2j9
4546c0K3K1J0Mo5LO4M3n5p8M7O3j7q6P3kn0j7L7k2N7k0J2j1nK2Q2p2q8Q3Qj4p3
4579e3L6M3J9p5M4j1K0jkn9M2P4j8j12n7J16M2p5j5P6l1p0J3L5L2K5k0n1K1J4
4609BQ8n9n3L2M5j0o2qM7pJ0l6rP0m5mm3L1kK1l3Mk2J15l7l1J2l9K5k3k2L7M3
4642C7m5J0m0K6M1l2k2OQM2ln4K1K%l1l8O4l2M6J2n6K4J8L7n5J7P1m9q3N0J3K5
$$ plain form
4421 -47 -48 46 84 -42 -16 69 36 13 -59 -16 19 47 -8 -47 -3 -32 36 4 -56 -46 91 28 -117 -9 19 33 50 -34 52
4450 52 77 -35 -3 36 28 4 4 3 15 18 67 -8 -52 27 8 -20 0 -10 51 26 -53 -29 -32 -14 45 41 -38 -11 11 34 -28 -25 11
4483 11 46 -7 1 -20 24 -24 7 59 -12 46 33 30 12 26 -6 -9 -83 -6 36 -4 -11 -71 1 -31 -31 -69 -38 -6 1 7 -25 12 14 29
4517 29 35 -66 79 54 32 -23 14 87 77 7 -24 19 -41 -10 -56 -6 -18 27 37 -63 4 8 72 -43 -23 20 51 -11 -30
4546 -30 -7 14 24 28 -37 -34 30 73 18 -60 -13 50 33 -53 20 18 -32 -49 -12 -34 23 3 15 4 -1 21 103 31 -57 26 34 20 -53
4579 -53 -17 26 45 -30 14 3 23 22 20 -39 3 77 59 -53 -110 6 48 -27 -42 34 3 -67 -54 -19 13 38 18 -33 -12 2
4609 2 90 31 -22 10 55 45 -17 -25 22 15 25 -11 -20 50 5 1 -42 -11 -13 8 -25 -21 -43 72 35 4 16 -23 2 -21 -43 -6 37
4642 37 -8 2 -38 -12 29 -3 -25 -19 -11 31 28 -26 -5 -3 -3 -34 -72 -8 -40 6 18 -38 -14 4 41 -14 3 74 25 -58 -8 5 30
4675C0q2O4m0R5n3l8OK0K2n5M3j8k3R5o9j7K1J9L9j12N7J2m0J3J5m7K8M3Jn1n
4706b7P2J6p2M5k6J3Ko8MP7o2O9m3n0kL0Mn4L5L8M8j15M6P8l1k5OM0L3q0L6q6
4738d9Q6k9J9j2n8K0Pj4O5o0J0N5o1jN5o9N8k4roNN6m3l4K2O3o2n2MJ17p3K2r
4771aJOk9J9MpM5l4qK4M7o8n3K6MK1K1j5J2l8N4k1J6l7JJ2p0P8j6L9k2k2J4L3
4805C6j8k9k2M4K0p3N9m0J9j3N5r3N3M8j9m2m2J08k0Rj3k2Q1q6pK7L7j09R1Kl5
4836FN1l2J4m5r3Q7K9j00K6N0J2N2p0L7p8K0j0K9K8n7O0Omm1O9j1kp6O7L8m2j7
4868CJ5J2j8O2p2nj6M3k6k3O5j4k6j9m3R4o5L3K5j6j1J2j1nK7l9L0jl2N9j8l0
4900a0k3K6nJ8J0K4l2M7p7L0Qm6K2On8N4K7j1lm8M8L8p6kJ1N1LJ6j6m9QO9n2m2
$$ plain form
4675 30 -52 12 -28 67 14 -24 -18 2 24 -31 12 -6 -29 66 -3 -20 1 20 59 -53 4 16 -24 -11 4 -43 -15 28 29 -22 -27
4706 -27 45 61 -11 34 8 21 23 -45 -41 36 -26 43 0 -50 -52 -22 -18 -72 -37 1 49 -66 -20 58 27 2 8 48 81 1 37 -49
4738 -49 37 8 27 15 -43 -23 -16 -30 35 -25 -15 40 -21 -22 33 -36 22 -2 -11 -17 -12 44 1 -33 -11 52 -10 -62 -58 59 -14 8 -1
4771 -1 0 6 -23 -4 0 -7 38 4 -4 20 67 -1 -54 -28 -24 -3 18 3 15 -23 31 10 26 -11 -10 2 -68 10 -6 33 11 -11 3 36
4805 36 18 -11 -33 11 31 -42 17 -23 -4 -17 38 -55 -2 46 27 -15 -57 51 31 40 27 5 86 0 -7 20 57 -52 39 41 6
4836 6 57 25 39 -6 -99 -12 17 -83 -57 -7 5 57 -13 24 -54 -34 -44 -15 13 -44 16 22 18 -23 46 35 33 -43 24 62 20 3
4868 3 18 30 12 74 2 -3 -19 24 -2 -25 40 26 0 -19 -62 32 -33 0 25 9 -2 10 -1 -6 21 -18 12 11 -21 38 20 -10
4900 -10 -33 -7 -12 6 16 40 8 55 -22 8 16 -30 -8 -2 -60 -6 21 10 7 -41 7 45 -31 -33 -22 29 32 48 32 -17 -9 60 8 -34
4934c4L5nPKl4N1o9Q1lo4P6k4L9k4p2R0l5%l5O1k2K6n1j2jO7l6n7N1Qpj7k6M0
4968Fqqp4J00M4l8k6J9j3K4n9PN0j4K1L0p3J2N1k1l0K1o0N4k8j1L8JJ5j9qk4N7
5001C6%o1j4L6M8o8Nl6J6N4j8o9J12n6M8k4k0N0k4Rm0J6p8J13j1Oj08Q1lRj9J1
5033ALn7N2Rmk8K3K0m6N6o9O9k6j0k0M9J4lJJ8l0m2O1qn5L2J2m0oN9l6o1N2L1
5067B1pm8J2N1l6K4m8K5L7PJ5k1K2m3l5nJ0jmjL3J2k0qk6L8K6m7J8l6J5l7J6k0
5101f1P1o4O7Jq0L1P8L2j8m3o7N2J1J2k1J6J7m0K1n3N4m7qML2koJ6k2J6l0K6J2
5134Gk0qM3J5j00N6K6j6l7jQK5qn7Q5K8m6pKJ4k8K3kk5K3K3l8M0m6L6K3l4m8R9
5168E5m3kn4N2mk6N2n4J3J7NJjm2O2k4j8k4l4N1JJ6j3j4j0K5j1J3L9n7O7n7QO1
$$ plain form
4934 -34 1 -4 3 5 -29 22 -47 34 31 -33 43 19 58 34 -38 52 17 17 -18 43 21 47 -4 -16 -17 50 14 -43 8 16 9 -8 -34 6
4968 6 -2 -10 -84 16 60 22 -4 15 2 26 -33 -26 24 10 31 61 -12 0 51 30 0 21 -39 15 -13 -24 14 15 30 11 3 -21 36
5001 36 36 -25 -39 -3 45 -23 -18 -54 -38 16 -2 -71 41 -15 33 9 -11 39 15 24 -16 0 -78 35 24 30 -78 3 0 9 -10 1
5033 1 4 -53 -1 8 4 -24 -1 19 -27 29 -40 29 3 -7 -27 22 36 33 34 52 22 -20 41 33 -22 10 22 -18 -24 35 -1 -62 -10 21
5067 21 14 -34 -22 29 -7 17 -31 -6 31 38 53 32 54 11 -24 -29 -19 -20 -24 -25 8 20 0 -8 -34 4 30 -17 1 -35 -20 -57 -41 -61
5101 -61 10 -54 13 14 -66 -35 43 75 57 14 -53 -1 10 22 1 17 34 -6 15 -38 16 -31 -39 -35 -3 -5 -11 5 -17 -1 -31 -5 7
5134 7 -13 -21 22 37 -63 -7 19 3 -34 -35 -27 -2 -10 -67 18 46 0 -7 -5 9 -19 4 2 -23 0 23 -15 25 -21 15 38 4 -44 55
5168 55 12 10 -44 8 4 -22 30 -24 -11 6 11 12 11 -31 31 7 -11 -35 -69 -18 -17 -1 -14 -28 -38 -13 -24 -11 28 -29 38 -19 -11 50
5202E0q6L0L7k2ok1j0L3j7K8k7M6l4rMJ9k4K3Kmkk4L8n3mK9m2L0M8m9J8L1lJ0
5236C9J4k7n7OK2kN4p1jj7J06n7j0j5K3m4l2J12o9qL3j4j4k0k1N1M7m4K5K5o2
5267b8K4m3O6o5P6or4L0K4N7n7L7j5Rn1K9j7j5J9j9L6rJ6j7M1l4J2m6M4M6p0J9
5299aK2m3J9jl8N2j8j1n0O7L3pl3L6k9k9N5o3L4Kno3J01Ljk6J3pO1p1L6k4l4L3
5333A3jJ3l7J1J4m1L0J2j6Qn3OL2K7l5MqJKqJJ6J6j5j9N7Nj3O3m7o8l7L4M5M9
5368F1r8R2l2oK9n8L9j4l9K7J4l5M2J4n9L2k6M5l4N1n7pk0K7K1K9m0j6P2p3L4
5399A5k1k5L9k6k5O8l0K5k9K1Rj1pL9r8Q5Lko2N0j9L0rok4J5JJ3p8N7Nj5Km9Q4
5434B5j8m3L8j3lj6M9m7K4j7L2%j5j4K0Kk4j1O6m1JN9l4l0J8K7k3K9j8j7kKj6
$$ plain form
5202 50 -36 -6 31 9 3 -18 -28 5 -12 16 -11 35 1 -8 -4 15 -9 14 16 12 10 -14 24 -29 -33 -4 -46 -16 32 -17 1 32 29 39
5236 39 53 26 -31 -25 -3 -5 49 -22 -23 -40 66 9 -1 -16 7 -37 -69 43 -26 -34 -1 -15 -29 -49 -70 -19 28 -16 9 34 -28
5267 -28 -4 -47 19 -46 30 24 -70 -40 -16 41 -16 21 6 15 -36 -7 -24 -39 -20 -39 -3 -12 4 -13 28 -6 6 -40 4 50 -20 -1
5299 -1 21 -22 -3 -4 -42 10 -8 -19 -69 -2 31 24 -9 27 -2 -31 24 -39 -5 -3 -8 -71 30 33 32 6 19 12 73 2 38 14 -20 13
5333 13 12 25 -12 -1 13 -28 2 14 -2 6 -47 -41 -9 18 -17 -13 -21 -20 -18 -26 -25 -9 7 -8 -27 30 35 22 85 38 -30 -67 -33 12 61
5368 61 -37 55 23 17 46 -12 27 13 -26 1 15 -20 22 36 -23 9 -17 28 -6 45 -12 -19 -39 -12 9 38 -2 -18 54 -19 15
5399 15 -6 -31 8 -18 -43 25 -5 20 -9 12 21 10 3 42 -56 29 32 30 -32 18 -1 29 20 14 -10 5 6 19 -59 -2 3 -12 -10 -59 25
5434 25 7 -36 2 -11 -14 -30 19 -28 -4 -21 11 11 -4 -18 2 4 -20 -31 35 -6 -5 54 20 -10 8 35 12 41 23 6 4 6 -10
5467a0O2q1K2J9k4J9qL6j0o0J3r5R0K1L2J9o1j2K6k1M5oK0j4l8J5K9j6rj5oJ3
5499eKJ3j2k3M3j0o6K3P1Rr2N4J4k6nKlM2J8m4J1j3qOk0J8l2jKL1J6o%j6l9N2
5535Fp0O9%m0L7J9Kn3N9Rl8K8l2LL8r6M0ql1kK7J0L5j2j6KL7j9m2L8k8mj0M6p
5570cNNNLl7K5rJ0J1K3rJ5n6J4L1l5j3N2j3o1K9J5qK2j5n1lpP2Kn1M0l6L1PJ4
5606B4j5Mk7K5Kj5QJ9Ql6L8Lo4M9L2m1K4m9N9j10O1l6J8M9o1L0j0JKj7J9L6n1
5639b1L3J1j1j7NlM3n8%NJ8Rm6N6m6J4l2L6M2jp0K1K4J7nrL9j17Q9%m7k7M8O6
5673F6l7K4m3jLm0L0J9M7j6p4L3k7k4O6K7p2Pn9R5k0j7K6l4mJ2Rln5J11j4j13
5705g8J17n5M8k1RLpl4PK5l9o6Q8J8n9QP9m8j3J9l3O8q2J6j0J07j04J6Q9r1K0
$$ plain form
5467 -10 52 -29 -7 12 -12 7 -1 35 25 -35 -22 -117 -27 -6 26 45 -16 -28 -2 -23 22 16 36 22 -16 -1 28 12 3 -12 -18 -5
5499 -5 -3 10 -2 -25 18 8 -58 -35 36 45 -47 7 21 -5 -10 -8 -11 31 49 5 16 3 -5 1 -19 -1 -33 -34 -32 -1 15 9 9 -7 -46 6
5535 6 -64 5 5 -35 2 21 23 -30 29 38 0 28 -4 -1 37 -59 -19 -27 -58 -60 -33 -23 12 0 -16 -14 23 4 -38 0 -28 -32 -42 4 -3
5570 -3 2 7 12 15 -22 3 -6 4 15 38 29 44 -12 2 33 -2 -15 37 24 -37 -8 7 -1 21 6 -45 -48 -55 17 19 -32 8 -28 3 10 24
5606 24 9 13 -14 11 13 -2 6 25 33 -3 35 38 -26 23 55 14 38 -11 48 -62 -1 -37 -19 30 -31 -1 -11 -10 -8 -25 -6 30 -21
5639 -21 12 23 12 -5 0 -3 40 -18 -18 -13 5 14 -32 24 -22 -8 -40 -4 38 37 -33 -12 12 29 24 15 54 -63 26 26 -21 -48 0 66
5673 66 29 53 10 9 12 -28 2 21 68 52 -22 11 -16 -40 26 53 -19 -12 -71 24 4 -13 13 -21 -25 -13 -4 -7 -62 49 35 -78
5705 -78 39 -16 32 11 20 23 16 -18 -11 14 -25 -91 -3 15 -44 -36 43 -5 -18 1 -32 36 -46 -30 -40 67 -37 -21 68 -23 -3
5736cL7L5j17N6pl4K9k1M5K3k3K%k4K4k7j5K1j9J4JnnP1k4o5nj5PO9Mm7nN8j6
5771A9q2N1n1M9J0M1ol7O1q4N6n2lL6Ko4J6O3n2k9Q8m2m4J18o4K7Rj9j5QpJ5L6
5804E4k4Ml3J9j9N2j01PK3O5m7l8K1qJ5J0n3M2j0RO5l2j2j4lKL4m8N4m8K6j2l7
5837c7O4K9p5L0Jj4M0m7%l3J2p4J18k5l1j0L3RpM3n5L3L0n9Rj0K2J0j0L4n7N0
5869B3l5rJ7MlL3q7N7k6L0lJ9J9m1KqK7K7j2j9pK5J8p6M5m2J4L7o0N9p1K8K2K
5903ILk1K3j03P1lJ5m2L3M3l9J8N0n7M4k2l9K9m0k6M1L8n6O2Nl5j8OM4n6k4L9
5935hl1P2l6k5K7K9n0J0J2m0J7K8L5o2K1nN0n8K6L4o8K1k1Q2m8K6k7Qj7k1J9m
5967dlJn6O3J5p5P4n6L2M5o4K2LMj5k6k4JM3J4K8J0o3K0L1N8m6o8O5n1N2l2J8
$$ plain form
5736 -3 34 69 -48 8 1 -33 -4 -25 20 43 20 22 22 -2 22 -5 -20 1 -18 -4 -3 -8 -13 58 34 -31 -36 -51 -44 25 29 -18 -23 35 19
5771 19 -63 -12 -63 -14 -4 37 31 -6 55 -29 27 -25 -28 8 10 -54 -38 25 -27 -56 32 -10 -54 64 0 27 36 17 2 10 3 18 54
5804 54 30 34 1 20 1 53 -48 -41 -18 47 0 -38 -17 -25 -10 0 -53 -11 -21 -12 53 21 9 -5 -8 -6 28 -20 34 -14 12 0 -37
5837 -37 27 56 -19 11 12 -2 38 -9 -9 -42 -30 -104 14 -11 -42 -52 -19 -10 -17 26 -29 4 34 -25 -16 -26 -4 6 -4 30 -27 23
5869 23 -12 -21 -4 0 -3 30 -57 0 -26 4 1 20 39 -2 0 -8 19 46 34 15 8 33 51 -25 20 -22 -8 29 -31 28 -43 -15 7 9
5903 9 12 -9 14 -89 -18 -21 -6 -48 -15 28 -11 7 57 0 44 22 -17 12 -28 -54 -13 25 -31 31 36 1 -17 -11 33 -23 -47 -8
5935 -8 -39 33 -3 -28 -1 28 -22 -12 0 -40 -23 5 40 -22 -1 -6 44 -14 12 46 -22 -1 -22 60 12 38 11 19 2 -19 0 -4
5967 -4 -7 -6 -62 1 16 -59 15 -41 -9 36 -28 -6 -3 1 -14 -40 -64 -63 -20 -6 22 32 -31 -11 20 78 32 -36 29 -22 30 -2 16
6000A6j6j5j9L7m4O5Lp1O2m3L2k8J9n4P1KJ0jn7LkK4rN3m4J8l0N7n3ML6l4qM3
6034B7o5J2l7N3K4l2L4Qn6L0J9J3l0O1l8j05O2O7r2M1K1o4N2kj2mjk9M1l6LkN5
6067A8j8p3R6j5m6M8J2n3oM3rqJ2M6j1k5JJ8l7L3j1qOJ7k7pj4J6j9M5l9j5LL4
6101Gl5M6Kj4K2rk0m2M7Lk2Mll3L7mM7%j9k5N3Nk8K4K3n5ln7P5J4p1K4P2m6m5
6136b6j4K9J7k8Q1k9n8L1J5j5k3K2qm4L4K9L4k2Npo6J7j3J09p8mK1J8m6J7j2K2
6168HJ3k8K3k3mk7N9k2K2r1O7J3j7O6o1n8M3N4o0M7o0M0j8l6M9L9p0LN0j2l2J0
6200a3k6J08n9j9K7k3M7l4L2k6m1K7J7m0L1ll8K5k0O4Lo1M4l4j7l8R9o4N2o5Q6
6231D1n1K2l9l5N4l1L5N1p1j8O3L3k9l7L1k7J5mn6KK2P4n7j8M2p9P1j3PN3j03
$$ plain form
6000 16 0 -15 -34 3 -41 24 27 -44 18 -25 7 -21 -2 -56 15 17 27 26 -31 -28 -30 -6 -15 38 -6 12 -18 39 -14 -10 26 -8 -16 27
6034 27 -38 -26 -63 -10 14 -18 16 24 -32 -2 17 30 0 61 23 -82 -20 47 -45 -4 17 -47 5 3 -9 -13 -14 -43 -2 -38 -35 -37 18
6067 18 0 -73 23 8 -38 10 22 -31 -37 6 -3 -11 1 47 36 11 12 30 -7 26 15 7 13 30 3 -4 -18 -2 -21 24 -15 -30 -27 7
6101 7 -28 18 20 6 28 19 -1 -43 4 7 -15 -11 -14 -47 -10 -14 33 33 14 -11 42 47 19 43 66 11 8 -49 26 40 -31 -7 65 19 -26
6136 -26 -40 -11 6 -22 59 30 -28 3 18 3 -20 2 -6 -50 -16 13 47 25 30 23 -43 -26 -39 70 -8 -12 9 27 -19 -2 -14 8
6168 8 21 -7 16 -7 -11 -38 21 -1 21 -70 -3 10 -7 59 -2 -60 -17 37 -23 24 -36 4 -14 -50 -1 38 -32 -29 21 9 -23 -13
6200 -13 -39 69 10 -9 18 -5 42 8 40 14 -27 0 17 -23 8 5 -33 -8 -28 36 39 -22 22 -12 -29 -67 32 -32 20 -45 41
6231 41 -10 12 -27 -62 -8 -39 -4 47 -24 -42 21 54 25 -12 19 -8 7 3 -53 -51 -29 45 -12 -30 12 -67 4 -9 -2 51 -52
6262e2N6k0j6MoP8l4K6%Ll0m2N4m9l6Q1n0M2j0m0N6o0L8l5J4J7O7m6L7n3MN4l1
6295B1k2J5N7m8J8n1k2N9n7O8n2j1MQJ9n4N9om2j9L7j3j8J04j25J01o9K6J9m5
6325c9P2j0On9M9p2P1N0o8j5O7j17K9L6j1J1j0M1k1Jk7K5n0L2J3j4QK2j7J0j1
6356Bk1mK1oQK3OJ4q5L2Rrm2P1j6rj9L8Ro3K2K2LKj1K0rL9q2O2k3M8m8j1L6l2
6392cJ4l1jN4Lr7P9m0K5j9Rmj7p1J11%m7L2l8j1J6rL9J8poK6j9L6j4m7Q7j12Q2
6426C8o8M0pj7kK7j6L3q6M0m1J07l6n9M7J5K0n9NL0j1mkjK0Kl7N4j7Kk1pK6O1
6460G6m0k1KPK7l2k4nJ2n1L1QJ3l0N8m1LKpl8M0kOl0O4m4K1M0m8M2l1m0O0Qn8
6495b2K6Kj8K9k4k0k1L3j3L9jK3k1J4m4K2j3J8m6J3nJ4J4MJj2M3n5J2nm2M4L0
$$ plain form
6262 -52 4 -16 -32 -28 -34 44 10 36 36 39 9 -33 21 -28 -64 17 -33 9 -1 -41 15 -45 -7 -42 -28 -11 56 10 47 -6 -2 52 21
6295 21 -1 14 71 23 41 -10 -32 27 -30 38 -14 -25 -21 -13 6 -48 11 5 -37 -56 -19 -32 -50 54 -71 30 -39 -13 6 -39
6325 -39 33 23 29 -30 19 -53 18 68 0 -15 52 -65 -36 0 -11 0 -10 31 10 11 -16 9 -41 -9 4 -10 -2 20 3 13 2
6356 2 -19 -23 -2 -8 0 23 29 43 -42 -10 -1 -10 -52 19 3 -6 -25 13 22 -41 -19 3 6 8 -3 17 8 47 -35 27 4 52 4 -7 29 -3
6392 -3 11 -20 -21 33 36 -61 18 -22 3 -16 -7 -11 -28 -99 12 12 -35 -3 -41 -52 -36 -45 -6 12 5 -1 25 6 42 28 -19 68 -44 38
6426 38 -30 10 3 -14 -16 11 -5 28 -58 -18 -59 48 12 -47 0 15 35 -24 -19 11 0 -4 -6 -7 13 15 -22 32 15 17 -4 -11 15 76
6460 76 36 15 17 24 51 19 -5 -10 2 -49 -18 -10 3 -27 31 -10 -7 -5 -12 -50 -10 -12 -6 -36 28 -16 5 45 -3 39 8 -32 28 36 -22
6495 -22 4 6 -12 17 -7 -27 -48 -15 -28 11 10 33 12 26 -18 4 -9 9 -37 -24 -29 -15 -1 3 4 -8 35 -20 -8 -13 -55 -11 19
6528A9p5Q4j9l3J9j3k6K1JK9j0K9J3L3k2p9M9J1o1O9rn1J0k0Q3o9J5l5j5K6J3
6559a3qK6m1J9n8N2L2p5P6p8M6M2n6RNN9m8M3jk6j0K5L3o8J4k4K0J4rJ6RM1o7
6592ak2QL0j2n1J8j6J0k8N4j6j1M0J1l6N1j4K9n9k4M5j1L2n6M5k1L9p8M1j4j7
6623c4M4nL9m0m1R4o0J9lK9r1P2k3j3L3J8n9L5j7n1L0k3K0J1M1j6J7k4J5m4J0
6654a7N0o3j9J7K5lM5p9j2N3JL0K2m7M7l3Lj1pL2k5rPJ4NLk0rrj1M3o2J1M7k6
6689gKj7J6N1m2Jl4K1k3N0J9J0q8RM8j3mPj0K5QK7p4QK9m2K6Qk4M2Oj3kk6n1M8
6725iPJ1m7P5n3l8L5N1n5J6J1j6k6O9q1L3J4J2K4oJo9N6k6K9rjLj5J2L1qo0K0
6759ik0L7m7K5K2j9L0j2K7j8kL3op4L0%Nm2J3qJ6K5j5k3M3m4O7m4PJ8j6K4m5J2
$$ plain form
6528 19 -56 28 9 -24 -5 -18 -44 -23 -22 7 -3 26 39 72 50 -29 20 31 -30 39 30 -21 -11 -31 52 -17 -2 -37 -52 -26 -13
6559 -13 -21 5 -36 -17 -75 -23 9 -66 10 -68 -22 20 -36 -27 -22 37 -11 32 31 5 -5 20 53 -15 -1 -25 -5 9 0 16 25 66 -1
6592 -1 -23 -15 15 3 -48 -30 -46 -36 -64 -10 -26 -37 3 14 -22 29 15 44 -15 -39 6 -5 27 -29 16 -5 34 -44 -3 -17 -34
6623 -34 10 5 44 4 -37 57 -3 16 13 42 -49 23 0 -13 20 38 -21 14 -3 -54 -24 -47 -27 -16 25 9 26 2 17 -27 -17
6654 -17 33 -30 -49 -32 -7 -10 35 -44 -56 -3 -2 28 50 3 50 17 20 9 2 34 9 0 7 21 26 29 9 0 -9 -20 23 -39 -28 19 -7
6689 -7 -5 -22 -6 45 3 4 -30 -9 -32 18 37 47 -41 -32 16 3 -1 6 -4 21 29 56 -18 -10 19 -23 3 11 -13 29 35 22 20 -6 -57 -9
6725 -9 -2 9 -38 37 -16 -54 -19 32 -23 -7 4 -12 -38 31 -50 -17 -3 9 33 27 28 -41 15 -11 18 9 8 11 -4 8 39 31 -29 -9
6759 -9 -29 8 -39 -14 8 -11 19 7 34 16 14 47 41 -33 -3 -3 2 -40 -27 -35 -19 6 -9 -32 11 -33 34 -10 -3 15 -1 23 -22 -10
6793a0J3pM1l0K3N4q0mKk1J0MN2k4M7p1J4k6j9kK5N0n9pM5p0J8K5rK2L1m5k9Q0
6827D3n7N8o7O3n3Q6m2K9q5j9N9J5j5K8rm0oORMm2k6M5L9lj8o2P3J8m1RLOm3K0
6862a5K1K3l8Lm0M0K1k8k0O6p6j1L7k6RN6j6l5j0J6K5j3K2m1M9m2N9K9o2l3N6
6893B6m5m1O3lJ0n1L2Pj5Qk2M1nJ0m3J2nK9l2N3n8L1K4k2o5N0o%kO2m8PJ2n2P5
6928C7n4k2L6K6m3k1J5M2k2L1n2J7l9P0l2Nm7O8k9jO%M4n3M9L6r6J5kNO9q0J4
6961hK2m7N3m7J4J7N4p1OJ8K7n0J5Mpl8J3J0JJj7J4M7m9J9j0j2Q3q2J9n4KN1j2
6995a4L8k8M3o2kL5kJ6n0kK8j4j9M3J4n3L8N3q1M3jon0J1j4L3JL8l9nK0n6M1J9
7029A6k3o1O5K2J5o1ML4n5J2K7L0rqK8m5Nj2O1o2O7j06N6L8kl7rj6p2J27k4l9
$$ plain form
6793 -10 3 -4 37 7 30 84 4 0 2 -19 -9 -5 47 23 70 -1 13 -13 -32 -34 -9 41 -18 -25 20 -50 -32 -7 -16 6 37 -8 -37 43
6827 43 -14 44 -23 40 -13 73 31 60 -25 -44 15 30 15 43 34 -6 -12 -6 3 7 -35 -61 -16 23 20 2 -60 13 31 -10 -1 2 8 -35 -15
6862 -15 6 29 -9 -6 -46 -6 15 -13 -33 33 -43 -54 -17 -43 -34 22 6 -29 -39 -23 2 -11 11 -30 19 -23 36 65 3 -30 26
6893 26 -19 -60 3 0 10 -41 -9 -2 -17 -9 -31 10 5 15 -28 -16 -21 8 -24 29 -29 2 26 4 -61 -11 -17 -17 -19 43 -5 2 14 -38 37
6928 37 -17 -39 -3 23 -20 -41 -26 16 -6 25 -27 -10 -49 21 -11 -6 -53 15 -14 -15 -9 -9 35 -18 31 67 -29 -14 -16 -11 58 -22 -8
6961 -8 14 -33 20 -27 -13 4 58 -13 -7 11 38 -12 3 7 0 -38 -25 -15 -14 -13 -30 -16 31 -18 1 -9 -21 62 -20 -1 -55 -53 -2 -14
6995 -14 24 -4 39 -23 -25 10 8 24 -26 -28 0 -14 -33 10 24 -29 9 62 -19 24 23 17 -33 -22 -36 -3 -2 36 -3 -8 12 -44 -3 16
7029 16 -7 -68 -3 19 34 -27 -23 11 -44 -32 -5 25 16 8 36 -9 -4 -16 45 -17 50 -56 0 38 36 -1 -10 -26 -98 29 5 -34
7061c4K6k5M4J2l1Nm8O8j7okm7K7N3j4mrJ7o7N5K9k7J6j8oM3K9o8M5l9k9J9k0
7094b3j4L4Ml2O5l1m3K4M5m8Kkj4L6jJ7M0p1%K5k3L5n1K2j4M4k9j8K0j6L7J1l4
7127co4M6M3Ok4M8M9j09J5M1p6L7K0lm1J7lMk7L9l3K8P3r2Rjl1j3M2L8l4pj3N2
7161C3m6l1N2m1J9o3O5J0K8ormj2O3k2r1O0n3Q7jj9j8l3Ql2M2JK3j3JJ4k4O3j16
7195f5Q1Nkjl2M0n4QMj3P2rKl9M9j3m7KL4o7J8P6p5L1l9M5J2l3L0k6KL4q4k9R2
7230Ij4K9L0p2L9Pn1k5N8K1p7O3Qm9K4K1l6j0J3N2n7k3l4O4j0oO4p7N2p6J8L1
7262a4K4QQj1l9N1o2M9Kk4k4LJj1K9Ll%k0k0L8m5N8%j4l9J6O5m9K0j5J3n1O4k5
7297a4j1O6p3N8L7n2lqJJ8j1rQK1k0l8L5l6K0J8K0j7k9QM5l0l4m2P7j4o3L7L4
$$ plain form
7061 -34 -8 -33 11 23 -8 -3 -51 17 0 -6 -8 -55 -28 25 11 7 -2 15 -52 3 32 5 21 3 -3 40 69 1 46 7 -22 -3 -23
7094 -23 -37 -3 1 -31 34 3 -40 -16 29 -19 -17 -19 -33 3 2 19 59 -12 -12 13 -10 25 -26 -4 -18 26 -3 -21 -1 -17 20 31 -3
7127 -3 -67 -21 22 28 4 52 101 -8 7 48 -28 9 29 26 -15 2 -1 3 -24 15 -18 10 83 -9 0 -1 -32 -45 -3 35 1 -6 -19 33
7161 33 -13 -44 8 -33 -14 -77 -12 -2 26 20 11 7 -5 58 36 -55 5 -48 39 38 19 1 -32 -24 -56 -14 -13 10 -3 -2 12 -12 51 -65
7195 -65 16 21 19 18 -14 26 -28 -20 -16 -29 43 34 36 -3 46 33 -14 -12 22 -45 -27 49 -26 5 -34 11 23 -10 20 -6 -4 30 -54 -83 9
7230 9 -5 24 54 -18 21 28 -23 -48 10 31 -46 17 25 -24 0 21 -15 -25 -12 40 -17 -40 -74 -10 -20 -26 38 -39 13 -63 -45 -14
7262 -14 10 18 26 15 -24 27 -35 14 16 -8 -32 -29 -28 -39 -10 -7 -10 -10 -30 -50 -12 -57 1 1 -13 -52 -36 29 -20 0 -15 -2 -53 11 -14
7297 -14 -25 41 -32 26 63 11 8 0 1 19 8 -1 7 28 8 -30 5 -31 -11 7 27 10 -19 -11 34 4 -30 -72 5 -9 -72 -35 -1
7330aJ1Pl6nj9J4L8k8K2J8j2J4k5RJ2Kk9j7M2j2J2J5l9Ok2O2jqk4j7j0J6N2p7
7364c0J4l7M7K2qk8n8M9K2j7M5n5O4l5m4M1rL2rl3L7j1J4l2M7o1O9l4P5r9L2O
7396A6l1k4M1K8p7j4P5n6N2k7l0N4J4o9O3J8m3M9pl9jl2J2l6K7N4p4J02m8pN2
7427D2m1k2K3oJ3K6J4k8l5K7n0N7QNp4L3Qj2j4K9l6L6l1J3J1mM0l5J9l3K8n8k
7460d9N9J6nl0m0P5n6O9K4Mo0Kj5JM0o1N5k0l5J5L3Po2L1K0m7Q4j6k2m5jK0J6
7493GmJ7lj8J1LJJ5o1j1M4k7l0O2J9l4l9J13l8nl7K7k9KoN0m1j5QK4l0K5j4LK
7528ij6l9N0nK3j6J1K9n2j8L6L6q5M6k2J3M5m5kP9p6O1k3L8l1k2j3L7p4N1k5k0
7560c8J4K4K2k0mL2ko6O9q5L9LL9K8p2J9L6k5K1m7L5l7L2n0nM9k1K6l7M8m3L8
$$ plain form
7330 -1 10 17 -19 -24 -43 -29 9 -19 3 21 9 23 -2 7 19 21 -8 -25 17 5 17 32 -7 -1 -23 39 38 30 6 -11 -21 -5 47 -30
7364 -30 -16 -53 -6 16 8 -20 -78 -29 -7 -24 21 -34 30 -5 -49 -8 -17 15 6 -27 10 -1 13 -19 28 -33 36 2 77 -22 10 16
7396 16 -15 -39 2 30 -47 -61 14 -42 10 -17 -47 7 21 -48 15 33 -10 39 32 -7 -8 -40 -28 -64 -37 17 -57 45 -3 -10 42
7427 42 1 -21 2 -4 9 35 49 21 -14 13 -37 20 28 33 -41 -8 0 -12 -26 3 -33 3 -28 -15 -4 -8 32 -3 16 -17 11 -47 -49
7460 -49 10 26 21 -9 -49 26 -30 39 63 67 7 9 -6 -5 35 -26 29 9 -26 -11 22 29 -33 -2 18 -29 55 39 17 -28 -29 -9 7
7493 7 3 20 17 -1 10 13 14 29 -32 -43 1 -26 -56 6 25 -9 -48 65 27 22 -15 12 -17 -15 -21 29 -12 -27 -19 5 -25 0 -14 -11 -9
7528 -9 -25 -64 -14 -19 4 -12 -1 28 -24 -42 -6 30 -55 -9 -31 -18 27 -18 -20 59 -17 44 21 59 28 6 -7 30 -44 7 -18 -38
7560 -38 -24 0 22 2 -2 30 28 -38 31 -54 -15 -12 27 55 -17 2 38 13 34 -13 22 -15 17 -33 -38 11 -10 16 -21 27 -16 22
7592B2p2O8n8M4l3M8Rkl7j4P9m2OrKj6Qqj6J7lj4K9m1N1J7l6j9J7j4oL8p0K2N0
7627A7k5QJ3qkJ4K6Jln0K8p0J2Q0jm5j4j4pP1o1N2m0O3m4k0K8m0j3N0Ok0l4L9
7661ck7M1k4mMJ3o1L2M7l3M6l0L3n3J1%L1J8j8j0lK1m3N7k3j7Rp7Q7j6J7n5J4
7694a6N8j7n1K9op0N2n1J5P5j6J1k0l5OL4l0O0m5K1J1j9M2m6k2J9Qj7j0N3m1Q
7726a0pl5K4MM7k3J1j1J%K0k0J3J4j1Nj1l3l0nQ3k0onJ1K6mo5K9RNp4J15o9QJ5
7762AlM6j3k6K1m0M3Rn2K2j0j1J9K4j6Mm4k3J6K4J0kK0l7J8M8q9lMM1k7N7p3N6
7796A4n3nK0lm1O8K3m8k6L7J6k5P7k6n3OmNK7m5N0pn2L3PJ4m5M4m7K5O8q5kj0
7830d3K1L1q4J15n6Rkk2K9Kl6K0j8M6m7O1q4P3j0Rk2K6p3O7k4kRk9J7J4L7Kk1
$$ plain form
7592 22 -50 18 -40 4 -29 19 28 26 -11 -25 54 12 18 9 11 -5 3 -5 -21 -4 -7 -21 8 -33 18 35 -1 -20 -3 -17 -23 15 -55 -33 17
7627 17 -8 0 13 5 3 17 43 44 41 -9 19 -51 -39 41 40 -5 -19 -33 -40 31 -30 22 -18 45 1 -19 9 -31 -44 6 12 -8 -42 -3
7661 -3 -30 11 -13 -17 -13 0 -61 -29 18 -15 31 1 34 -19 -8 -8 23 41 23 13 10 31 -12 45 22 5 14 -63 24 8 25 -30 -16
7694 -16 42 25 -26 3 -3 -73 -21 -72 -57 18 2 13 -7 -42 -36 -2 -32 28 -17 4 15 -4 38 -8 -30 -11 -3 -20 -30 23 -18 -10
7726 -10 -17 -52 -28 -24 23 0 11 0 1 1 21 1 14 28 17 22 11 -22 -52 -57 26 6 0 -5 6 32 28 -37 -8 1 6 -68 47 -22 -14 1
7762 1 -2 44 31 5 26 -14 29 38 -14 8 -2 -13 6 30 14 18 -26 -49 -33 -9 1 -1 19 -18 0 48 -41 -44 -40 1 -26 31 -42 14
7796 14 -39 -44 -24 -27 -68 0 23 -25 -51 -14 2 -23 54 28 -25 -19 -23 -18 9 -36 14 7 -45 -12 -5 9 -36 8 -39 -14 54 -31 -33 -43
7830 -43 -22 9 -75 40 -16 -7 -9 -31 -2 0 -36 -16 -34 12 -35 26 -58 15 5 14 -8 18 -55 12 -12 -14 -5 -34 -17 -3 34 36 15
7863A5l5%oMk3J0M3k3k3O0j0p7N1Kk1P2p7N6j6LqM4n6J8j8M0k4k6O4j3p3M3k2
7896b6j4M0oKj3J8J0j0l5K0Rk8L1m2N6m7P0j7j6j4%j8qJM3j0PK1k5K3p2K7M4l6
7930a5l1K2QL7k7M4r5R1q2L7M2m6N9j02K2L4Lm8M1nK2Ln1O6Lm9jk2J2M9n0NL6
7963A2OJ8l4j9K9k9K0l3K6N5q5K6K0n5k5O8L7j2k5PK2m2N5m5N9j4n3J7n2L1ll
7995b1L2jj8Q2r4LL5p1N4j4K3j6J2OJ7j6nj1j4MJ3J8k8j2J3k4Q8K2m1j7p2O0l4
8028b7J2M8o2L7NK6j3j1m7O0rj05P8j0J4K7Op6ON2mO7k6q1Q3l8l6MK4K4n2N3q4
8061e5K7K5k4K0J4PK4j00L8K8K1m9RL1k4k1K4K4QLj2%k1M0j7K5m2J1j1k0j0N0
8093B3J1n6L8k0l6%O6p3L5J4L5l9N3j9nJ5m7PlN2o8K9m7j1ML1J6L0j9m1K9j6L3
$$ plain form
7863 15 -20 -20 -26 -22 -45 -35 8 -15 -38 22 12 -65 -14 -12 -33 39 -38 18 2 5 -3 41 -15 3 -15 25 1 -25 39 26 -47 -4 -26
7896 -26 -40 0 -6 -4 -17 1 11 1 -34 -14 -5 -33 -2 -44 12 -35 35 18 2 -12 -12 -30 -38 -37 6 -4 3 24 -1 22 -50 -23 21 -15
7930 -15 -46 -24 -16 21 -6 38 -57 34 -48 -11 31 -15 44 -58 -36 -2 1 -47 -6 -11 11 14 -37 29 32 -17 -18 -40 -28 21 -29 -24 12
7963 12 18 36 2 -17 12 -17 3 -30 -4 51 -34 -8 12 -43 -68 0 37 25 0 7 29 -13 42 -3 56 42 -11 6 -46 -15 -18 -21
7995 -21 11 10 -8 74 -20 -17 18 -53 1 -13 10 -6 6 12 29 13 8 -3 -17 -13 0 18 -10 -22 -9 -33 55 77 36 19 -53 7 -27
8028 -27 -15 33 -29 8 13 39 26 15 -32 28 19 -86 -8 -18 -4 23 29 -47 -41 11 7 74 48 -33 50 12 -24 -20 4 28 -24 29 -55
8061 -55 -28 -3 -27 -7 7 14 38 -62 -24 4 25 -24 -15 16 -8 -29 -5 19 27 30 18 18 -3 37 20 45 3 14 3 -17 -27 23
8093 23 34 -22 16 -4 -40 -40 26 -47 -12 2 37 -2 51 32 27 42 -5 2 -1 51 -17 12 -35 -46 -42 -11 5 35 16 -25 4 -12 21
8126B1K5q2J6K5j8Pkj3NO6m3j3M2n9M4k4m2M6oKrN0o1L3Nm5O4k2pp2M1L6l7K5
8160bk4nj0K4rL2o5O5j1K6m5jM2p3L6M4lJ7j7m5K7j5M1%rmm7J1L9n1L5
$$ plain form
8126 21 46 -36 -20 5 -13 -6 -8 -21 -16 50 7 -6 36 -23 21 -3 -45 1 -5 -3 -12 38 -23 10 15 -30 34 12 5 -67 -26 10 -27 -2
8160 -2 -26 -31 -41 -17 -26 6 -59 6 -5 21 -24 -25 17 -56 -20 24 21 38 21 -24 3 -12 29 29 20 16 -31 -20 19 -32 3
8191C
$$ Imaginary data points
##PAGE= N=2
##DATA TABLE= (X++(I..I)), XYDATA
0@%%%%%%%%%%%%%%%%%%%%%%%%%mQqJ0j4J6j8K2k4K4l1L9m3M7n5O2o8Q0r0R8j08
46e7J21j37J51j66J84k03K23k44K68k91L15l41L67l93M14m26M24l93L02p3m93
67d48K037p535N5872L42781k66467m70099J71023M09444m2136l14652n0824J58980
79a2024J20068J7607j40229j90991J14304L30309m4304m31595l9669M76139J24857
90C24472m56865j94368L81743K34851k75796k27315J51345J73914k4420q6398
100A163q4569k2773J54144J43942j85678k56389J83827L36797j51232l75516R5334
111a60950L73928l6797l29708p384K45539L2960j37029l6873K6758J3887P4878
122E9209L3094j60469q8184K17918J37940k39174j77274K31544J98648k07329
$$ plain form
0 0 0 0 0 0 0 0 0 0 0 0 0 0 0 0 0 0 0 0 0 0 0 0 0 0 0 -4 4 -4 6 -8 8 -10 12 -12 12 -19 20 -23 24 -31 31 -37 43 -47 51 -57
46 -57 64 -73 78 -88 96 -107 116 -128 140 -151 164 -177 190 -203 211 -215 209 -184 118 45 -448
67 -448 1589 -5946 49926 392707 126240 -343859 -172836 236608 194472 -120180 -171004 -12024
79 -12024 108044 125651 -14578 -205569 -91265 239044 194740 -236855 -276524 199615 324472
90 324472 -132393 -326761 54982 289833 14037 -213278 -61933 111981 87561 1163
100 1163 -83406 -106179 47965 191907 6229 -250160 -66333 270464 119232 -256284 -160950
111 -160950 212978 176181 -153527 -160911 84628 117588 -19441 -56314 -29556 -15669 59209
122 59209 92303 -68166 -156350 61568 199508 -39666 -216940 14604 213252 5923
132E923j92120J69559J56457j24092j02772Q3697L8774n7808L1786M2017r9347
143d7926l2007J51150K9630j82256l1967J97661K9315j97437j5527J80181m408
154G6409j52235K8487J23951n8421r7566R0965O9477j16032m3168J28518K1729
165G2114j32238m65J26899k7540j09964N9555Q4615r1067o0593J23332M1888j55706
177f9170k5480J79493J3310j86239q588J77730P816j55281j541J16659j2679o3692
189b7662L2173P580n9586M2012R7211q3130j38574J11461J72204j20152j94130
200a60593J08203K02059q4562j88956N5697J49924k4579r0135j360J9850J1737
211b715N6539l215j31430j8550J91585N0388k26013q9156K33249J25598k15460
$$ plain form
132 5923 -186197 -16638 139819 15727 -87045 -3348 35426 -22382 9404 51421 -47926
143 -47926 -79933 71217 100847 -81409 -113376 84285 113600 -83837 -99364 80817 76409
154 76409 -75826 -47339 76612 18191 -79375 11590 81067 -34965 -78133 50385 72114
165 72114 -60124 -60589 66310 38770 -71194 -11639 72976 -18091 -78684 44648 86536 -69170
177 -69170 -94650 84843 98153 -88086 -96674 81056 88872 -66409 -67950 48709 36030 -27662
189 -27662 4511 12091 -47495 -5483 91728 8598 -129976 -18515 153689 33537 -160593
200 -160593 -52390 149669 65107 -123849 -68152 81772 57193 -32942 -34302 -14452 -2715
211 -2715 53824 50609 -80821 -99371 92214 142602 -83411 -172567 60682 186280 -29180
222b9180j46252J72234J44645j09492j21745M1411P5449J9080p347o6292p2765
233a00254R4855J49321r8001k12786P6652K56765m0961k71419J307K51061L7238
244A43778k00544o5141J30469P1765m7928n3738l7922J6926J12261L3348j63061
255e9787r3235J87637J50830j87225j92299J61244K10018j15154k03133O1506
265g9598J69290j2460j08660k6261L0901M9725N0305n1147j25221L1305J86957
276A15136J508k25171l7932K33232P2920k13584r8581J73760J04398j19076q7642
287h1032N6071N2838K635n094m7445n2427P5797J10215q8463j55903Q4206J83438
299A34836o5711j92269M2461J80579k2410j46808Q137R8183j301m4493O746q351
$$ plain form
222 -29180 -175432 -3198 141447 31955 -89790 -48379 27070 46150 38803 -27489 -100254
233 -100254 -5399 143922 45921 -166865 -90213 166552 125591 -145828 -144521 106540 143778
244 143778 -56766 -121907 8562 80327 32399 -21339 -59261 -42335 69926 103274 -59787
255 -59787 -153022 34615 185445 -1780 -194079 -32835 177183 62029 -141104 -79598
265 -79598 89692 77232 -31428 -57689 -26788 22937 73242 22095 -103126 -71821 115136
276 115136 116644 -108527 -146459 86773 159693 -53891 -152472 21288 125686 6610 -81032
287 -81032 -24961 27877 30512 25418 -22027 -74454 1343 111558 23095 -132808 -48602 134836
299 134836 69125 -123144 -80683 99896 77486 -69322 -61185 36998 35697 -8796 -2050 -10401
311a0401k4083N7251M6255r5003o7641J15866Q6388j22356r9006J18888R8339
322A04497j06877q3677Q8018N9438o9030k9027N4862p003m4416M3777L5852p3270
334b6856k9987R3544K6693j06223k0648J11012Q929j05719O378R4395k3250q2419
346e4151M2489P0189o2996n5985P8287M1685q5849k9323Q6833J5590q2609L025
358c2815P0816k4789n3547M7143L7078p0719k3873R5094J2996j14432n173J24165
370F1944L456j23806m983J13717M261r1967J039N9016r891k1624K4404j4329m7482
383d6245M6189P5032p1406j00357Q3655J20370q1802j33067P0275J32516n2786
394D2374j14516L1618Q1698j1029l8836j096j0781K039O2994O263j08510k1995
$$ plain form
311 -10401 -34484 22767 69022 -25981 -93622 22244 108632 -13724 -112730 6158 104497
322 104497 -2380 -86057 1961 61399 -7631 -36658 18204 11201 -33215 10562 46414 -26856
334 -26856 -56843 36701 63394 -42829 -63477 47535 56464 -49255 -42877 51518 28268 -54151
346 -54151 -11662 58527 -4469 -60454 17833 59518 -26331 -55654 31179 46769 -35840 -32815
358 -32815 38001 13212 -40335 6808 43886 -26833 -50706 44388 57384 -57048 -62221 61944
370 61944 65400 -58406 -63389 50328 54589 -37378 -36339 22677 12786 -8838 15566 1237 -46245
383 -46245 -56 74976 3570 -96787 -13132 107238 25436 -107631 -37356 95160 42374
394 42374 -72142 -40524 41174 30145 -8691 -9787 -20568 -18529 44465 50728 -57782 -79777
406g9777J39607M4666j54561o8655J52772Q5137j33334r0073R8418Q2446n6288
417B0358o0640J4501K3289K2223K4387m9916p3396O2490J18483n8482j54559M2797
429f8465J74757k0553j72836m793J50796K7386j13094l8798O3140L5523o420j9608
441G035m7074p367Q8699M3090j15724q1188J26448J11929j19845j29771R7505
452b6263J33155o7072j19567L6063Q7478p965m1917j2914q515K1900N8502j7326
464C5559j03313M008J35825J3867j50301l3573J47252N0396j30318n7572J00978
475A2808N2012o3171l5883K4200J0700Q586K2369l3414n8531M9497Q9586n4439
487B4320j11233M9038J22752l8432j21537K8034J05792j8723p8773J2859M6779
$$ plain form
406 -79777 59830 104496 -50065 -118720 34052 119189 -14145 -104218 -5800 76646 20358
417 20358 -40282 -25781 -2492 19731 44118 -5798 -79194 -16704 101779 43297 -111262 -68465
429 -68465 106292 85739 -87097 -91890 58906 86292 -26802 -65600 -2460 33063 26643 7035
441 7035 -40039 -47406 41293 84383 -31341 -112529 13919 125848 6003 -123768 -26263
452 -26263 106892 39820 -79747 -43684 43794 35829 -6088 -19002 -27517 -5617 52885 35559
464 35559 -67754 -63746 72079 85946 -64355 -97928 49324 99720 -30598 -88170 12808
475 12808 64820 1649 -34234 -10034 666 9252 31621 -1793 -60324 -10827 78759 24320
487 24320 -86913 -37875 84877 46445 -75092 -47058 58734 40011 -38762 -25903 20876
498B0876j3719j3069K2030k0306l3681M8265M5034o6769n5714P6462O2925q0123
510g789o2553P7584N3385o9552l8804O0028K0291n2258K225M5578k5525l8434
522c5824M4743L2446n8324k7334O7826K0409p2325r440P0487l476o4819J7071
534a8560N8488l1997n2240M7280M4311n8915l6467O4598K9439o5594k1319O2227
546B1251R228n3277O036L9986k2450k6797M0979J6156o0988o869P8489N05q9497
559d7248J242R3552M08r0600r66P8306q84n6844M467L0384j2282l532K6355k2554
573a96m4746M5236O2635n9453p8675O3366R1147n9402r5543M9785Q8436l4889
585B7701p0401J8345M4400n899j1321L25k5790q59O1011P675q8321k1208J05343
$$ plain form
498 20876 7157 -5912 16118 -4188 -37869 10396 55430 -11339 -67053 9409 72334 -7789
510 -7789 -70342 7242 60627 -8925 -47729 12299 32590 -19668 -17443 28135 2610 -35824
522 -35824 8919 41365 -16959 -44293 23533 43942 -28383 -37823 32664 29188 -35631 -18560
534 -18560 39928 7931 -44309 2971 47282 -11633 -48100 16498 45937 -19657 -40976 21251
546 21251 30479 -22798 -16762 23224 774 -26023 14956 31112 -29876 -36745 41744 42249 -47248
559 -47248 -46006 47546 47954 -42646 -43612 34694 33810 -23034 -18567 11817 -465 -3997 22358 -196
573 -196 -44942 294 62929 3476 -75199 -11833 79314 19912 -75631 -25846 62590 27701
585 27701 -42700 -24355 20045 14146 2825 3150 -22640 -23499 37512 45187 -43134 -64342 41001
598D1001L7826j11362n1514J04090N8751q4431n8969N7420M9259k8689k7877R32
610a3563j912K2542L4678l6628o6842L9646R5469l4275j14512K3484J19870q558
622E9399j11392o694R1673J6305o2038j7465K5221J1055J1954K512m3932k3366
634d6768O7756M7462q2234o8551Q4761Q3046p5559q9570N8894Q5629l9693o8734
646d3561K0267M1950l296j0062o520k3279P527N5608k314q1382o497R6016J7983
659F2440r9536k9154R3397L4681p8578l2568N6412K3922l2122r509J0188j0789
671a1216P898L3902k1711n4414K9299O9850k9985p9624K7250Q2090k4038p4560
683d5259K0473N9543j7303m0907J7799J9817k2387K263K8399k2139l4278L6436
$$ plain form
598 41001 78827 -32535 -84049 20041 78792 -5639 -64608 -7188 42071 13382 -14495 -13563
610 -13563 -15475 7067 41745 5117 -61725 -22079 73390 39115 -75397 -51913 67957 59399
622 59399 -51993 -58687 32986 49291 -12747 -30212 -4991 6064 18018 20530 -23402 -46768
634 -46768 20988 68450 -13784 -82335 2426 85472 9913 -79657 -20763 64866 25173 -43561
646 -43561 -23294 18656 15360 5298 -1222 -24501 -16974 38634 36320 -45062 -51559 44457 62440
659 62440 -37096 -66250 27147 61828 -16750 -49318 7094 31016 -1106 -10615 -427 -11216
671 -11216 -3318 30584 8873 -45541 -16242 53608 23623 -56001 -28751 53339 29301 -45259
683 -45259 -24786 34757 17454 -23453 -5654 14163 -8224 -5961 22438 299 -33979 2457
695B457L9889m5719m4071N1218M3268n2624l7024M9852K7579m5565j5724M2245
707A5781R69l8695J4456L4629k7099l0478L6208K7000m3006k1412M6686J2659
719B7698m6181k306M3179q711m0347K0819L7384l3551l3315M3315K9068m8827
731a1775k5573N0717K0965m9268j3126M3070K844l2949Q732K2734k2326j3528
743a9483L7998N258n2531J208O2981l558o9030K818P0122j922o4203J666N0745
756B2069k085l3036N039J3405j2783O809K4065k5727l6151L9287M8059m5655n8839
769e5543M6381O5234m2199o3799L3058N5212k1329m0526J1413J9968m975N059
781G954K043l0427l356N1891R790o8005j9566P7364K8503p7805l4775O8630L7553
$$ plain form
695 2457 42346 -3373 -47444 3774 47042 -5582 -42606 7246 34825 -10740 -26464 15781
707 15781 16750 -21945 -7489 27140 41 -30437 5771 32771 -10235 -31647 15039 27698
719 27698 -18483 -20789 22390 13679 -26668 -5849 31535 -2016 -35331 7984 37052 -11775
731 -11775 -37348 13369 34334 -14934 -28060 15010 17854 -15095 -6363 16371 -5955 -19483
743 -19483 18515 23773 -28758 -27550 35431 31873 -37157 -34339 35783 33861 -30342 -28676 22069
756 22069 19984 -13052 -8013 5392 -7391 -582 23483 -2244 -38395 892 48951 3296 -55543
769 -55543 -9162 56072 13873 -49926 -16868 38344 17015 -23511 -12098 7870 2895 7954
781 7954 9997 -20430 -23786 28105 37895 -30110 -49676 27688 56191 -21614 -56389 12241 49794
794D9794n3193l4461L4552K3640j4318o343n069j4024J9342L5859k6370n7063
806d7654K7817P3489k4153q1342J5901Q0244n564p1316k371N4417N872l1066n344
819a1070N510o9J7538J1090l6897k5431N1019L8817n7305m9368N5477N5916m7874
832G353n6298L7609M8485k5241l3602J2885J4944m176O284M85k8356k09M7568
845B7731K558o0495p994O6762J4104o6999j7609O0483J7052m7984j3323L2674
857F960N685j7567O152L757k0279Q188L3464j6139m3947J9377N1685j9897n4616
870c7177J9767N1254j8441m2853J6730L1746j7005j8803J9852M253k3150R165
882d662K5810j9340k8932K6594L1027l1946k9786L4609K5101l4309j8739L3205
$$ plain form
794 49794 -3399 -37860 -3308 20332 6014 -329 -5398 -19422 -80 35779 9409 -47654
806 -47654 -19837 53652 29499 -51843 -35942 44302 38738 -32578 -34949 19468 25340 -5726 -11070
819 -11070 -5560 -5629 11909 22999 -13898 -39329 11690 50507 -6798 -56166 -689 55227 7353
832 7353 -48945 -11336 37149 11908 -21694 -8809 6135 1959 8243 8728 -19628 -19837 27731
845 27731 30289 -30206 -38200 28562 42666 -24333 -41942 18541 35593 -12391 -25714 6960
857 6960 12645 -4922 1230 4987 -15292 -7104 26360 10221 -33726 -14349 37336 17439 -37177
870 -37177 -17410 33844 15403 -27450 -10720 21026 4021 -14782 5070 9323 -13827 -4662
882 -4662 21148 1808 -27124 -530 30497 -1449 -31235 3374 28475 -5834 -24573 8632
894H632J0720l2305n83L1103r968k8653J8692K6173k5007k3824K9989J9678l2712
907h065j2941L2235M878l0144L658K8023j3533k6012K3894K3180l2301k0611L7504
920I765J8812l9993j6525L9714J2112l5369n804K7779j322j9551J0406J1968k1617
933i625m432L2669j561m1420M267M7691m403n1080L960M9265l351m1903K412L0726
947A3215k987j7612O779K693j3193J2309K0749k4391k9009L1889L7656l5546m3733
960d1181L5341M5255l0495m1878K2728L4281j4991k1801Q736N032m066J2956K015
973A1932k9354m136M3028Q996n2858j4347N6427J8847n3091k2111M4690K2240
985C0263l3330j6989J9327P635m790M330o976j8047J4675L2629j8664m5046J9319
$$ plain form
894 8632 19352 -12953 -13536 17567 7599 -21054 -2362 23811 -1196 -25020 4969 24647 -8065
907 -8065 -21006 11229 16107 -14037 -10379 17644 4111 -21901 1993 25173 -7128 -27739 9765
920 9765 28577 -11416 -27941 11773 23885 -11484 -17288 10491 9169 -10382 24 11992 -9625
933 -9625 -14057 18612 17051 -24369 -20102 27589 23186 -27894 -23934 25331 21980 -19923 -17511 13215
947 13215 10228 -7384 -605 2088 -11105 1204 21953 -2438 -31447 442 38098 2552 -41181
960 -41181 -5840 39415 8920 -32958 -10230 24051 9060 -12741 -4005 1027 -3039 9917 11932
973 11932 -17422 -21558 21470 30466 -22392 -36739 19688 38535 -14556 -36667 8023 30263
985 30263 -3067 -20056 -729 6906 2116 6446 -530 -18577 -3902 28727 10063 -34983 -15664
998a5664N2619j5994n4835R970N2068m665m3558J246K9439L75j3000P58l260o082
1012a0583J8330J4166l0962k2343L8704K9532m0545l5053L8220L7075l3061l3580
1024c0100K5478K5372j6545j4263R440Q36n183J4196K726k7884k230L7846L955
1037B3644m3845p019M6065Q609m3719q309L6898O284k7615k358J8078m428q472
1050f187J2935m94k0938P361K7644j1050l3073J3228L5960j4714l4565J4869L0015
1063B0991j4481k3485J4835J5319j6744n557J8517l832k0026J1178K1580j6859
1075A436k2614K1368K1390k4088j7586K4401J2828k3987o871K3882m61k3298Q293
1088e307K1873j4488k0373J8986J8990k2391j6241K4062J1497k3333n893K1118
$$ plain form
998 -15664 36955 20961 -33874 -23904 28164 23499 -20059 -18813 10626 11001 -1999 -1241 -4501 -10583
1012 -10583 7747 21913 -9049 -31392 7312 36844 -3701 -38754 -534 36541 3480 -30100
1024 -30100 -4622 20750 4205 -10058 -618 218 -4965 9231 11957 -15927 -18157 19689 23644
1037 23644 -20201 -27220 18845 27454 -16265 -24574 12324 18608 -9007 -11365 6713 2285 -6187
1050 -6187 6748 6254 -14684 -7323 20321 9271 -23802 -10574 25386 10672 -23893 -9024 20991
1063 20991 6510 -16975 -2140 13179 -3565 -9122 9395 5563 -14463 -3285 18295 1436
1075 1436 -21178 190 21580 -2508 -20094 4307 17135 -6852 -13723 10159 9698 -13600 -5307
1088 -5307 16566 2078 -18295 691 19681 -2710 -18951 5111 16608 -6725 -12618 8500
1100H500l81j9160P784J7191j5951j4822K2759J2793k7348j1985L0337J1094l1172
1113a0361q715K8649N545k3295j655J7148l854j0609J1439L744j9406K251K6306
1126A7187n806l2126P103L6264p497l6997O948L3448n602k6907M567J8203n564
1139C221p341Q314m413j1833J4529J6542k1872k2196K6836K7097k8756k9216K6893
1152b195K8635k2020k5432J6307J8829j0963q498N645l278j910J4647J119k5498
1165a4612k750L4417N186l9398q102L9531J1229l6012j2738K9601J1228k0350
1177b770o608R625J91N1Q127p392j7940J2746K7230j5619l3683J5161L6729j2183
1191A3665l6930R014L2848o306k4624L986J4011l228k920M920p913q899J8160
$$ plain form
1100 8500 8119 -11041 -3257 13934 -2017 -16839 5920 18713 -8635 -20620 9717 20811 -10361
1113 -10361 -19076 9573 15118 -8177 -9832 7316 3462 -7147 4292 8036 -11370 -9119 17187
1126 17187 11381 -20745 -13642 22622 15125 -21872 -14924 18524 12922 -13985 -9418 8785 3221
1139 3221 -4120 4194 -219 -12052 2477 19019 -2853 -25049 1787 28884 128 -29088 -2195
1152 -2195 26440 4420 -21012 -4705 14124 3161 -5337 308 -2970 -4880 9767 10886 -14612
1165 -14612 -17362 17055 22241 -17157 -25259 14272 25501 -10511 -23249 6352 17580 -2770
1177 -2770 -9378 247 438 489 8616 1224 -16716 -3970 23260 7641 -26042 -10881 25848 13665
1191 13665 -23265 -14251 18597 12291 -12333 -8347 5664 2436 -484 4436 -3477 -12376 5784
1204E784J3080k5225j7141K8418K0935k8720k2921K6840K1774k2414j7495J6330
1216g55J1488j0868l509O780o168l618J5611J553k3081j602K8303K765l1407l414
1230a7922L1255L143k7697k283K2141J95j5917L868R273r149k364J4305l200j8626
1244a2978O550K2519q970k4587J0943K3887j1868k0872J1872J6603j2420j1340
1256a0661J3875M563j4895J859J5543o986j6466J0960J6982j4327j5776J6390
1268A061J2958j6629r506J6489N292j6553L32J6256o042j5344J0698J4633j4176
1281e31j4194J6827J2755j8143r859J7365O226j5517k111J3638l353j1810R755
1294A048R439j5290p615J9527O931k2763o383K4335N204k3153l503J9728J603
$$ plain form
1204 5784 18864 -6361 -23502 4916 25851 -2869 -25790 1050 22824 410 -17085 -755
1216 -755 10733 -135 -3644 3136 -3032 -6650 8961 10514 -12567 -14169 14134 16899 -14508 -17922
1230 -17922 13333 16476 -11221 -13504 8637 8832 -7085 -3217 6056 -3093 -5457 8848 5648 -12978
1244 -12978 -6428 16091 7121 -17466 -6523 17364 5496 -15376 -3504 13099 679 -10661
1256 -10661 3214 7777 -7118 -5259 10284 3298 -13168 -2208 14774 447 -15329 1061
1268 1061 14019 -2610 -12116 4373 9665 -6888 -6556 9700 3658 -11686 -988 13645 -531
1281 -531 -14725 2102 14857 -3286 -13145 4220 10446 -5071 -7182 6456 3103 -8707 1048
1294 1048 10487 -4803 -12418 7109 14040 -8723 -15106 9229 14433 -8720 -12223 7505 9108
1307I108j5144J432J0086o303m114J1495j392j6292N067K0827p038k4857Q175
1320h950K6458q133k5219O640K1813n059j6665M609R344n105q07O372p178q651
1334a0531J3720J2308j8658j5947K1686J8168k1601j8987J9008J8251j5307j5081
1346a2971J1213Q975o774j386K843o448r99J4413Q63k1830j460K6663K803k8288
1360a2383m830K7357O342k4071n997J8323M026j0857q75L673l816K549J0032p742
1374A731j6137J1272K0824j2294k4022J1199K5341r489k3928P465J9397n242j2987
1387f870L615N804l746J969N389r594p515J5482R946j8785j2637K0304J4512k0049
1401b175j4173J7700J1998j3942q550J0213L649p182K769M299r297k106J4400
$$ plain form
1307 9108 -6036 -4604 5482 -821 -4935 6560 5168 -11124 -6057 14770 7732 -17125 -8950
1320 -8950 17508 9375 -15844 -9204 12609 7550 -9115 -4506 4838 -267 -1074 5298 -1880 -10531
1334 -10531 3189 15497 -3161 -19108 2578 20746 -855 -19842 -834 17417 2110 -12971
1346 -12971 -1758 7217 443 -943 1900 -4548 -5547 8866 9729 -12101 -13561 13102 15905 -12383
1360 -12383 -17213 10144 16486 -7585 -13582 4741 8767 -2090 -2965 708 -3108 -559 9473 1731
1374 1731 -14406 -3134 17690 5396 -18626 -7427 17914 8425 -15503 -8038 11359 6117 -6870
1387 -6870 -3255 2549 -1197 772 6161 -3433 -10948 4534 14480 -4305 -16942 3362 17874 -2175
1401 -2175 -16348 1352 13350 -592 -9142 1071 4720 -2462 307 4606 -4691 -6797 7603
1414G603J425j8536j513K1305J372k1892r03K0126K02j6810J029J2950l429q389
1428e460O873L346r854P09J2671l493j5325N728J6911p442j6629Q239J4759q441
1442B592j2107Q842Q554r910l973J0750o99j1305M226J2181p208j2654R572J2152
1456A1013j0979j0303J1241P747j1005m645J1247M53j1032M057J0542p779j0323
1469i766J0608J0319j2842r725J4010P986j3508n801J1866L058j0284Q38Q337
1482E096n360o274R751M466j3251l758J6347L383j8170k737J8075K130j6070j561
1496g933J3094K07r353K536M735n819k07R084l206j2705N378J6165o894j8194
1510a3112P274J8239o341j6870M986J3965m109r295L870L385l922K588M902p862
$$ plain form
1414 7603 9028 -9508 -11021 10284 11656 -10236 -11139 8987 9189 -7621 -6592 6358 2929 -5460
1428 -5460 1413 4759 -5095 -4386 8285 4792 -10533 -4805 12106 4664 -11965 -3726 11033 2592
1442 2592 -9515 -673 7881 -2029 -6002 4748 4049 -7256 -3030 9151 1943 -10711 -1139 11013
1456 11013 34 -10269 972 8719 -2286 -6931 4316 4769 -6263 -2206 8336 557 -9766
1469 -9766 842 11161 -1681 -11406 2604 10590 -2918 -8719 3147 6205 -4079 -3241 5096
1482 5096 -264 -6538 3213 7679 -5572 -9330 7017 10400 -7770 -10507 7568 9698 -6372 -7933
1496 -7933 5161 5368 -3985 -1449 3286 -2533 -2740 6344 3138 -9567 -4189 11976 5082 -13112
1510 -13112 -5838 12401 6060 -10810 -5824 8141 4032 -5263 -1393 1992 -1930 658 5560 -2302
1524b302o957J2422R361j5544j1215J6756J2155j5729j2485J3598J1134j0739
1536D55p781P056L196l592J977J197p650j24J3269l69j7493O2J9565J346j9962
1551h848k673J8659L124j5162k554J0284J184n118J368M72n295L896R261p141
1565A457j2720Q612J5426q688j7065Q012J6748o905j4414N343J0527l837o029
1578c533L517P24m075M902M861r494o002J2640P607j4372q921J5011Q969j3871
1592b037p893J1490O005q888l111O520j092m105N367K072r011j178J2069R01j4417
1607g308o54J5262K46j4302J42J2233p63r713K406O708m650l173O693L75q704
1622e202J717J0638l435j1782M737J1671n484j0504N715Q696o216o209O998K891
$$ plain form
1524 -2302 -9259 3163 12524 -3020 -14235 2521 14676 -1053 -13538 60 11194 455
1536 455 -7326 -270 2926 -666 1311 2508 -5142 -5266 8003 7634 -9859 -9797 9768 11114 -8848
1551 -8848 -11521 7138 10262 -4900 -7454 2830 4014 -1104 264 736 -4559 -663 8598 1457
1565 1457 -11263 -2651 12775 4087 -12978 -4966 11782 4877 -9537 -4194 6333 2496 -3533
1578 -3533 -16 708 -3367 1535 6396 -3098 -9100 3540 11147 -3225 -12146 2865 11834 -2037
1592 -2037 -9930 1560 7565 -1323 -4434 2086 994 -3111 2256 4328 -4683 -5861 6208 7109 -7308
1607 -7308 -7962 7300 7546 -6756 -6614 5619 4856 -4857 -2451 4257 -393 -3566 3127 3502 -5202
1622 -5202 -3485 7153 3718 -8064 -3327 8344 2860 -7644 -1929 6767 551 -5658 1340 4231
1636D231p761M92Q145l102q741N242R408p159r078Q212P855q140o221P892M059
1651E334p776q96P459k592o866N511O609p885o789R771O579j0841n847J0550M725
1666G046r311l248P911Q35o282K311M342n555k547Q300J861j0927j387J2911R59
1681G219j3429q19J2608Q07j0779l94Q324j097m831K883J106m926J950P343m234
1696A731j0092N963J1958o750j2664O322J2445n272j1131M380Q364l610m326K889
1710B07P8k798M013L719p687n107J0785O280j2327p217J2148P954j1105p744R252
1725D51N983o571l438L681L42j577L466J45p535Q97J0850j095j2931L11J4135
1740G114N31j3908q89J2025J011q929o78N444m22j978K680j638n259M624P531
$$ plain form
1636 4231 -3530 -3038 5107 2005 -6736 -1494 7914 755 -8323 -111 7744 -396 -6617 1275 5334
1651 5334 -2442 -3338 4121 1529 -5337 174 6783 -1102 -7891 1880 8459 -2382 -8229 2321 7046
1666 7046 -2265 -5513 2398 3233 -3049 -738 3604 -1951 -4498 3802 5663 -5264 -6651 6260 7219
1681 7219 -6210 -7029 5579 6386 -4393 -4787 3537 2440 -2391 492 1598 -3328 -1378 5965 1731
1696 1731 -8361 -2398 9560 2810 -9854 -3532 8913 3641 -7490 -3110 5254 1644 -2682 207
1710 207 285 -2513 1500 5219 -2468 -7575 3210 9490 -2837 -10054 2094 10048 -1057 -8801 451
1725 451 6434 -137 -3575 106 448 -1129 2337 2482 -5053 -4156 6694 5599 -7332 -7021 7114
1740 7114 7645 -6263 -7152 4873 5884 -3045 -3723 1721 1299 -679 2001 363 -4896 -272 7259
1755G259o447r510O983J1037o903j1549O382J0297n157q056L785N308l114j702
1769a387L120k357l203N830L587q105m590R800N499j0600n619J0118N142q731
1783a496m167O996K458n401J57L654l245j824N573R59p733o41R661J92j0480K73
1799e064R975m50q784Q04P329j799n228L357K607m745l83O080j208p448K536Q416
1815E995l680q333M057P541m092o444M338M586m810k157N184l35n611K460O083
1830D782l967o707N423O649o073n881N926M943n532l521N275J382m915J229M264
1845C277l541l968N341M228p151m194Q247L767q211l421P418K837o498j341N026
1860A816o67l218K876J550m878o02P042O2q899M39R776n35r519K45Q606j77p081
$$ plain form
1755 7259 812 -8698 -1715 9322 2419 -9130 -2748 7549 2392 -5664 -1879 3429 315 -1387
1769 -1387 1733 -624 -3827 2003 5590 -2515 -7105 2695 8194 -2406 -8025 2093 7235 -1496
1783 -1496 -5663 1333 3791 -1610 -1453 2201 -1044 -2868 2705 3664 -4069 -4710 4951 5143 -5337 -5064
1799 -5064 4911 4461 -4323 -3519 3810 2011 -3217 140 2747 -1998 -2381 3699 2491 -4957 -2421 5995
1815 5995 2315 -6018 -1961 5580 1488 -4956 -618 3968 -842 -2999 2185 1850 -3761 -1301 4782
1830 4782 815 -5892 -469 6180 107 -5774 152 5095 -437 -3958 1317 2699 -2216 -987 3277
1845 3277 -264 -4232 1109 5337 -1814 -6008 2239 6006 -2205 -5626 1792 4629 -1869 -3210 1816
1860 1816 1149 -2069 807 2357 -2521 -3123 3919 3981 -4918 -4479 5297 4762 -4757 -4512 4094 3917 -3164
1877c164P93M587j682j757K735r77m062K838O007m592p444N581Q187n443q528
1892f921M795Q264m133o710L170M357k275j439J730j368j994M420K507o980l130
1907e707Q516L947r101m738Q781M993p826m274N929K965l756j233J991j320n15
1922a348M249q30o665J494Q431j194r580O62R881k87q978N5P110Q0m836M04K359
1939A007j655L12L127k731m554M288N891n031p187N383P647n194p117M310N962
1954D458l212m457K710K131k444O79K238l178k275N197K816o580l418P355L612
1969E632p468l275O557K861n460j959M381N9k872J865J529l664p47N330L71o726
1985c586n1P478m28p136N04O446o17n366J321L893k363j944L218L08m113P38N293
$$ plain form
1877 -3164 -2371 2216 534 -1223 1512 535 -3527 -689 5318 726 -6718 -1137 7050 1607 -6921
1892 -6921 -2126 6138 2005 -4705 -1535 2822 547 -892 838 -530 -2524 1896 4403 -2577 -5707
1907 -5707 2809 6756 -2345 -7083 1698 6691 -1135 -5409 520 3485 -271 -1504 487 -833 -1348
1922 -1348 2901 2071 -4594 -3100 5331 4137 -5443 -4781 5100 4813 -4165 -4110 3000 3080 -1756 -1352 1007
1939 1007 -648 -336 2791 60 -4494 -206 5685 654 -6533 -1150 6497 1303 -5814 -1504 4458
1954 4458 1246 -3211 -501 1630 -814 -135 2103 -1075 -3350 1847 4663 -1917 -5335 2020 5632
1969 5632 -1836 -5111 1446 4307 -1153 -3112 1269 1328 -1544 321 1850 -1814 -2561 2769 3140 -3586
1985 -3586 -3637 3841 3413 -3723 -3219 3227 2610 -2756 -1435 2458 95 -1849 1369 1677 -2436 -1698 3595
2002C595j753o071K505O118k867n639K730N031k912l754L140J863l336M8L488
2017B186j482m035K910M636m029m753M572M522m541m032M218L257l915j660L385
2032A239k74k800K081K435l678k551N190K505o181k417O317K343n937k133N220
2047A359J444m123j61K718j317j238K726L75m408L73N973r14o828R83P000o62
2063C300o712M30N867o20m225Q04K179j236k78K088j473l345L029M484m041n257
2079e006M249N820l917n974L599N242k894l716J934J953j375Q8J345k366j452
2094b470M429J689n807k190O362K829o540l127O158K751m924k195L363J248j984
2109d08K90P57k212M22L953j051n369J134O414q78o888O68O599l73n551J34M123
$$ plain form
2002 3595 1842 -4229 -1724 4394 1527 -4112 -1382 3649 737 -3017 123 1986 -1350 -1302 2186
2017 2186 704 -3331 -421 4215 186 -4567 5 4527 -14 -4046 172 3429 -486 -2146 1239
2032 1239 965 -1835 246 2681 -997 -3548 1642 4147 -2034 -4451 1866 4209 -1728 -3861 1359
2047 1359 2803 -1320 -1481 1237 -80 -1318 1408 1783 -2625 -2252 3721 2807 -4021 -3038 3962 3300
2063 3300 -3412 -2982 2885 2265 -1960 -1156 1023 -213 -491 1597 124 -3221 -192 4292 251 -5006
2079 -5006 -757 5063 1146 -4828 -1229 4013 1119 -2597 -663 1290 -85 3 1348 -1018 -2470
2094 -2470 1959 3648 -2159 -4349 2013 4842 -1698 -4825 1333 4084 -840 -3035 328 1576 -408
2109 -408 -118 639 -1573 -1151 2802 1751 -3618 -2484 3930 3052 -3836 -3168 3431 3058 -2493 -2359 1764
2126A764k50k536R36N60j824J319K638k579l713L388M626l770n193L788N018l295
2142H77m384K590L465k168j886J940j07j584J864J533l223j908M428K322n225
2157a466k403N286K305m866k054M128J380l274k90K241j018j244K222O20l430
2172a863l13M549N4n186K28N129j89m711K35M124o61k971J270J602j954l74K673
2189A642m60l562J160M302j863m452K047M172j914l830J972K899k045j622K136
2204E82K10k229R98K597k026l053L061L272l521l219L451L058l168k664K962J643
2220A954k420l80J771r01j488K150J452l449j475M387J415m679j518M576J569
2235B964m150j288L411N74k252K95J181j240l65K470k85l724Q21M548j006m854
$$ plain form
2126 1764 1514 -1022 -86 474 -1350 -31 2607 28 -3685 -297 4329 559 -4634 -846 4172 877
2142 877 -3507 -917 2548 380 -1506 434 327 -1257 607 2140 -1083 -2991 1437 3759 -1466
2157 -1466 -3869 1417 3722 -1144 -3198 930 2310 -964 -1254 987 -31 -1275 947 1567 -1863
2172 -1863 -2176 2373 2427 -2759 -2531 2598 2409 -2302 -2067 2057 1396 -1575 -305 1297 -657 -1031 1642
2189 1642 1182 -2380 -1220 3082 1219 -3233 -1186 2986 1072 -2758 -786 2113 68 -1554 582
2204 582 792 -1437 -439 2158 132 -2921 140 3412 -109 -3328 123 3181 13 -2651 311 1954
2220 1954 -466 -846 925 24 -1464 686 2138 -1311 -2786 1601 3016 -1663 -3181 1395 2964
2235 2964 -1186 -2474 937 1511 -741 -446 735 -505 -870 1600 1315 -2409 -1588 2960 1954 -2900
2251b900P30N002n45m653N42L520n56k122O40P22j134O07J967k007k674K980L238
2268C357l338l685L266M093l096l748K589K975j835j868J115O28q75R12Q67k605
2284a248p49L655J055m384j524M584K014m687j890L900J678k904j111J860K51
2299E00q67J007q3k274Q05L298q56m156P28M805p14m757N22M207l48l212J97K179
2317I81o42p39J012n68j618J591K292k254l036K711L423k866l369K520L136k005
2333E69k564J737J567j409l12J115r76r20J974J202k885j534L590J540l739j541
2349b586L338J609k982j238K497L91j694M76Q28j259m71K190L42l119p9L648r2
2366A799l643R8L349L0k989L03K263q08j195J152L15j701L52K401j012k920J423
$$ plain form
2251 -2900 -2170 2832 2287 -2366 -1824 1696 1140 -982 -342 380 -754 -147 1820 -187 -2861 119 3357
2268 3357 19 -3666 -400 3693 597 -3151 -562 2413 578 -1290 -175 453 -422 490 1357 -1248
2284 -1248 -1997 1658 2713 -1671 -3195 1389 3403 -1284 -3174 726 2404 -500 -1611 249 500
2299 500 -367 640 557 -1717 -912 2386 1530 -2626 -1898 2907 2193 -2564 -2042 2165 1817 -1395 -1198 981
2317 981 339 -400 612 44 -1574 17 2309 55 -2981 -270 3153 287 -3082 -562 2574 569
2333 569 -1995 -258 1309 -100 -412 703 -273 -1193 781 1983 -902 -2436 1154 2694 -1045 -2586
2349 -2586 752 2361 -621 -1859 638 1029 -665 -189 639 -620 -1091 1099 1441 -1678 -1757 1891 1799
2366 1799 -1844 -1746 1603 1633 -1356 -1053 1210 402 -793 359 674 -1027 -675 1726 714 -2206 -783
2383g83L094j575l032J394K956j313k393J338J399j267l97J246n06j429J371J857
2399A960k160k153K673K128k572k225K413K134k195j550J718P19j243J70Q12j068
2415d39p79K101P40k905o87L213Q83l372j002L268R52k784n06J905J14r62K88
2432B8L66j170K23K183q29k782R99L183q73l525P07L445o81k775M81J915m12r10
2450d27M45j0r92J190J392j977j800K298K275k300k642K275K675j961k262J422
2466c99J683r74q74O88k05n10J358L36k228m36K716R09l260j146L347J076k813
2483g32j117K213R22j564l86Q74l93j10J267n60j842O87K584p08l147P63L216
2500A967n95k921L35K408k33j714L25P88o63K75Q56r45j342J403J924j792k261
$$ plain form
2383 -783 2311 736 -2296 -902 2054 741 -1652 -314 1085 -182 -579 667 161 -1268 103 1960
2399 1960 -200 -2353 320 2448 -124 -2349 64 2198 3 -1547 171 890 -353 -183 629 -439
2415 -439 -1218 883 1623 -1282 -1969 1244 2127 -1245 -2247 1021 1973 -811 -1317 588 702 -260 28
2432 28 394 -776 -553 1630 801 -1981 -982 2201 1328 -2197 -1490 1955 1274 -1501 -1020 895 483 -427
2450 -427 18 8 -984 206 1598 -379 -2179 119 2394 94 -2548 -273 2402 441 -1821 -399
2466 -399 1284 310 -564 124 -81 -591 767 1103 -1125 -1561 1155 2064 -1196 -2342 1005 2081 -732
2483 -732 -1849 364 1286 -278 -664 210 -183 -293 974 414 -1428 -741 1843 1135 -2012 -1249 1967
2500 1967 1372 -1549 -1214 1194 961 -753 -428 360 -303 -28 828 -117 -1459 -56 1868 76 -2185
2517b185K016K273j772k128J355J992j118j383R52M31p27M21N66j047p69J804
2533F81R14k359j050K572J016k342j110K015J016j845l65J156r1o43P21L16j375
2550g73r9K028j04k371J61K507k4k433n1K198j32j632L51P98m29k66Q25k09j404
2569a059O93J816j019k060J033K161r03k169P71J924q14j265P60M93n57J03P41
2586F49p21j039J431J161j793j288J843J527j831j497J594J208j300p04Q31J95
2602B66n08L93L87j163l23J866J47k136l59K360N74k346o03K086M75j477k89Q53
2620B03O4l69M98j63j108N86J607q37j902O76K321o09k410M64K058k87j513Q8
2638f33R75j43l99N23m52p48J145R50j452j278J598J660j631j789J619J434j038
$$ plain form
2517 -2185 -169 2104 332 -1796 -441 1551 433 -950 2 433 -294 127 693 -354 -1123 681
2533 681 1595 -764 -1814 758 1774 -568 -1678 337 1353 -492 -857 299 208 -435 286 602 -773
2550 -773 -872 1156 1052 -1319 -1158 1349 1325 -1108 -1159 1039 907 -725 -374 424 -5 -271 554 345 -1059
2569 -1059 -366 1450 431 -1629 -596 1565 662 -1507 -736 1188 374 -891 -131 362 -195 -92 649
2586 649 -72 -1111 320 1481 -312 -1600 243 1770 -61 -1558 36 1244 -56 -760 71 266
2602 266 -242 151 538 -625 -948 918 1065 -1071 -1430 930 1504 -842 -1445 641 1116 -361 -650 203
2620 203 267 -102 396 233 -875 -289 1318 481 -1421 -745 1576 967 -1443 -979 1079 792 -721 -633
2638 -633 342 199 -200 323 -129 -877 268 1218 -234 -1512 86 1746 115 -1674 -55 1379 341
2655C41j297P09Q68n31j31K60o56j38J288N9j592m52K121N66k270o21K038O75
2673A237j540p40J125N17p05R9J21n68L37R80m17j501M33J979n37k064L71J940
2691A067j34j761M0J327q9o80K19l7l61M88O02p79j081J165J338j293j467J223
2709b13J481r46j377Q20J001o22l86L22j43k04O37L80j177n81J601N95j704o58
2727a174J448Q11j321q12J141N11p63j03L61k41j17O98O6j283J75J520j36j652
2745h71J8J635J78j569q1J244n0p20J14K39l32Q3O73m24j106P79J248q32j357
2764a131O60J465n27j371N24R63l29n53K54R1k27L13N09q95o00J168P64j265r34
2783a121J233J025j147j000J008N88n52l46K42J0k06O06K9j018L1J344N2j433
$$ plain form
2655 341 -956 -247 621 90 -41 219 -437 -575 713 772 -820 -1272 849 1415 -855 -1476 562 1237
2673 1237 -303 -1043 82 599 -106 -7 114 -454 -117 863 446 -1055 -622 1357 820 -1244 -873 1067
2691 1067 933 -828 -788 539 450 -230 -11 -48 -409 79 681 -98 -1179 -14 1324 31 -1436 -213
2709 -213 1268 322 -1055 -235 766 144 -242 80 -63 -267 370 750 -427 -1008 593 1188 -516 -1174
2727 -1174 274 1085 -236 -1048 93 604 -159 -262 99 -142 -259 439 505 -778 -603 917 781 -871
2745 -871 -853 782 960 -609 -690 554 504 -216 -102 137 -195 -112 561 137 -969 -190 1058 226 -1131
2764 -1131 -471 994 467 -904 -380 583 254 -299 -45 46 -181 132 641 -254 -854 314 1078 -187 -1121
2783 -1121 112 1137 -10 -1010 -2 586 34 -312 -70 -60 -266 340 369 -649 -618 726 778 -655
2801f55l73J632L74j457l56J170L64p62k30L92r1m5N21l74p90N03J116n41j405
2820a007M79J498m79j380K79J131l8q39K5M67k42K09K45n73m34R36O86j101r39
2839a077J204J024j095r23O82R65n17p09L23K62q8J57j8o37J1R36J68j296l04
2858i32J441M13j347m33J068N26q23m19N23J32j14J90j95m98L59P93k55j295M18
2877d48J288k68j273J22J195l5r46n4N43j7q5P8k49k86M78O19p21q60Q92R47p77
2898A43r84O08R86m86p91L64M03j15J0m2k85o6N80K39r84k94J076L97j019n99
2918h59J005N74q52m31N26K19j54l7L9k61QP42k32r54K75J012m0j059r3J074J16
2939F18r23p1M92Q4j79No8k88L45N31n79o82N40R05m91r90M18R72l56p14J90M76
$$ plain form
2801 -655 -1028 604 978 -479 -835 335 699 -63 -293 99 8 -37 484 110 -680 -177 939 398 -1007
2820 -1007 -528 970 491 -889 -610 521 483 -356 -331 136 -106 103 348 -225 -659 277 963 -138 -1077
2839 -1077 127 1151 56 -867 -185 780 263 -446 -123 139 51 208 190 -447 -436 500 668 -628 -932
2858 -932 509 922 -425 -858 210 736 -87 -506 17 149 35 225 30 -468 -109 684 429 -866 -448
2877 -448 840 572 -701 -579 616 581 -365 -419 124 107 22 100 -149 -435 43 662 -59 -919 -27 920 143
2898 143 -841 -233 753 267 -524 -160 243 128 138 96 -189 -255 325 564 -420 -714 362 759 -260 -859
2918 -859 146 720 -132 -563 -37 182 28 -9 30 -231 -223 519 287 -667 -392 620 580 -479 -572 502 618
2939 618 -305 -376 116 200 21 26 -42 -330 15 546 -33 -715 -175 730 239 -751 -333 639 283 -431 -241 235
2961B35qk64J29j77j25M52K89p98l63Q10N47q00p33Q76O20o77n27L78M19k19k04
2982a40R0j32mN54j01p33PR31J48r97k25R92K01p61k88N15L16k60k18J34k57L09
3004H1L35m37n64M20Q16l34j036K90R73j77p93M7N92Q4l96kj1j6L11J73n37k95
3026d76O17N75p43o64P17O31m78o95L23N35j92k54J8K6j6L01j32m69J7O62K12
3047E15r57j66Q49K92o54l96N48L75l50j79Q9K3J85Q4j76m68K53O58k62q50K62
3068c25P94j05p22r0P16M7m76j6J17PJ76kj88l38N05M38n74n33N29O04l32o22
3090c90J96O24k22l30j1J85k2J04J4l95n5O05M6o13k14N65M36n80m76N34L66l66
3112Aj58Q0J05N1M0p3k96J25N34k02n57K3P65J8p44r2N64J34m20m6J04J33n2M7
$$ plain form
2961 235 227 -37 92 -85 -210 242 531 -267 -630 180 727 -73 -806 70 690 13 -514 -136 283 64 -140
2982 -140 -50 -182 -186 368 267 -466 -459 472 620 -377 -602 390 591 -170 -458 57 373 113 -105 29 -228 81
3004 81 416 -21 -585 -165 651 317 -719 -429 544 367 -426 -379 213 297 -99 -101 -112 -128 183 356 -181 -476
3026 -476 141 716 -27 -691 26 657 179 -516 -193 342 150 -104 -86 -60 -76 225 93 -376 -359 303 515
3047 515 -442 -608 241 533 -121 -517 31 406 56 -123 -34 -11 174 258 82 -386 -133 525 263 -587 -325
3068 -325 469 364 -358 -448 268 315 -161 -177 -60 -53 123 121 -67 -405 100 538 -36 -569 -40 564 232 -390
3090 -390 -194 430 208 -122 -133 52 30 134 148 -247 -302 303 349 -264 -478 87 523 -57 -533 1 367 1
3112 1 -157 -77 28 79 119 46 -250 -125 409 207 -350 -327 438 456 -288 -380 184 318 -102 -148 -44 89 37 84
3136H4j98k39L87L16l65m36K95O10k16p29K49N96q4l34r2J72J13j8%k81o6M55
3158B19J72m93l32N40M16n88l93M20L68k61l38P1K72ql3m2k64J70L82p2n29NN99
3181B81J50p10o9N14K00l68k69K11K09q4oj77j38L17K69l03m00K22N49k78n06
3202c86J27M54R2m30j10K95P2m0m0k16J20K93j7k49l66M95L96m98l72K78M43k07
3224A34m23J31K40J0p8q8j54K00J77l7l48n5N35R8n27j97N10K30k71l88K76J79
3246A54n8l6p4j04J50K30k25l53K10M33j50m83K0M78R4m32p4K68L9k1j20j20J44
3269c0J14J16k62k75L90K81l16l53K94M10k15l67J19K44K3k06l5j7P6J11ll15
3291b16J1L53N2l50j89L77K79l16k68K26J89l8j37p7O6J14J79k30k79J96L14l0
$$ plain form
3136 84 -114 -353 34 350 -15 -451 -156 454 238 -491 -242 354 270 -64 -156 16 129 111 111 -170 -236 219
3158 219 391 -102 -434 106 522 -66 -459 -39 329 68 -270 -199 73 65 32 -10 -274 -104 278 206 -323 -318 281
3181 281 431 -279 -348 166 366 -2 -271 -60 149 65 59 -118 -256 61 330 27 -373 -151 398 120 -386
3202 -386 -259 195 287 -143 -253 42 114 74 34 -182 -62 231 214 -35 -401 94 490 -8 -380 -102 341 134
3224 134 -289 -158 82 92 14 -74 -228 -28 149 112 -236 -291 244 342 -185 -382 128 358 87 -301 -25 154
3246 154 96 60 -14 -118 32 262 37 -316 -106 327 177 -306 -286 192 286 -146 -220 48 87 66 -54 -174 -30
3269 -30 84 200 -62 -337 53 334 18 -335 -41 369 154 -213 -94 150 173 -33 -68 -85 -9 102 99 -216
3291 -216 -205 148 200 -150 -339 38 317 1 -267 -41 148 110 -27 -104 -38 76 255 25 -254 -58 256 226
3313B26m79L7M48J12m51j59K85J58j46j86M0Q6R2O4k63j28K42K51j83l48K03M26
3335C27j81l02k4L14P9k01r1P7N3J31q0k21K1K64Q4l32k51L33L14l00k45J20L08
3358A97p8k06L6M9L5J30j36j58M7L25m1l97k9L85R9k86k13K93J77q9k75K6R9J22
3382A12m5k07l9J95J50j17l26J44L31o9k74q0L41P8j84o0O5pJ39j35q3k5J95J84
3406B83l13k48L16J84j63k30O2K68n0k38k9P9J53K3j19j51P9K39Ql34K4K77J22
3429B42k74k06K83J65j14k11J6R9J02q0p8o1J20K17k19k87J50L03l4k73o2K17
3451A5J06j75r6Q5J77m6n1j55O6J45J22k58j25K63J91j54k76Q0K65o7j89n5Q7
3474d5J94m2j33o9L0K39j06k52J0K44P4k22j74K41J57q0k36Q7J60J8p7n5n5J22
$$ plain form
3313 226 -253 -216 232 344 -107 -266 19 177 31 -155 -115 -29 63 127 -136 -264 -22 229 46 -302 -99 327
3335 327 146 -156 -180 134 213 12 -79 -2 51 182 102 -119 -98 166 250 -82 -333 0 314 14 -231 -111 197
3358 197 119 -87 -51 -2 33 163 27 -131 -84 241 200 -197 -226 159 258 -28 -241 52 229 140 -135 -109 -10 112
3382 112 67 -140 -179 16 166 49 -277 -133 198 129 -145 -225 116 194 10 -50 15 8 147 12 -71 -96 99 283
3406 283 -30 -278 38 222 59 -171 -109 159 109 -129 -158 -79 74 97 -22 -173 -94 145 153 -181 -157 120 242
3429 242 -32 -238 45 210 96 -115 -99 0 102 22 -56 -117 3 220 1 -286 -136 167 133 -140 -202 15
3451 15 121 -54 -150 -65 112 66 15 -140 -74 71 193 -65 -190 73 264 110 -166 -86 179 112 -77 -132 -45
3474 -45 149 107 -26 -95 -65 174 68 -184 -174 70 144 -78 -252 -11 146 66 -170 -83 77 95 18 -37 -92 30
3498C0J39j83j46O4K80l0k58j07K85R8j60k14J10J88o9p5r2R3J28lk12k6J84J97
3522B21j47k59J28J87k8j62r8J47J27r1o9p9N5K20q0k17J9J59J17j80j76J78J74
3545A46o3k46P0J68o5nq4K9J31Q5j71n4QK74n6k52PJ61P4j41j55R0J29j4p5j39
3571a48J14Q9j5j08q4J80J57j89j31Q1J21P6j96p1J47P3l3r8p2J39R1k8j32r2
3595a29K24M7k22o3J46J31l3k33Q7J36qq9j10j9J92Lq6o5J5K42o1j81k6J68R3
3620A59j24j64J67P3j1j11m7O6Q2m1j24k0Q7J30j18j71J01Q9P8j87k8Q5J30l4
3644F7j26l3J27N7p8j01K0J36Q4k20m8R1J39l4j80J1J27M5q3p0j2J24j1p0r5O4
3670f9J59o6r2p0K08R6j84r6O0R5R4k10l6Q2J20m8j36J1J42N6j26n3k3J73kr7
$$ plain form
3498 30 169 -14 -160 -96 184 154 -104 -211 74 172 12 -202 -92 96 27 -48 -140 -47 81 78 -134 -160 24 221
3522 221 74 -185 -57 130 102 -60 -158 -11 116 25 -44 -123 -68 152 72 -145 -126 33 150 -30 -206 -28 146
3545 146 83 -163 -93 75 10 5 -79 -50 81 166 -5 -59 -51 223 167 -85 -78 83 157 16 -139 -49 80 66 -9 -148
3571 -148 -34 55 40 -68 -152 28 185 -4 -135 -54 67 143 -53 -124 23 96 63 -35 -107 32 123 95 -37 -129
3595 -129 95 142 -80 -143 3 134 101 -132 -45 91 83 -6 -116 -135 57 60 -26 -91 -76 166 105 -76 -102 66 159
3620 159 35 -129 38 111 100 -11 -58 8 90 49 -75 -95 -8 122 4 -167 -66 23 101 -86 -114 -29 101 67
3644 67 -59 -92 35 92 14 -87 -67 69 153 -67 -115 -24 115 81 -99 -88 39 84 1 -69 -81 43 32 -38 -133 -69
3670 -69 90 24 -68 -138 70 166 -18 -114 -54 41 135 -75 -111 -29 91 43 -93 -82 60 116 -10 -63 -86 87 85 -12
3696a2q9J08N6k4j46R9K2J5q1o7R8J44J8k03n9O8K27o7j81O2O7R2j46j19M2J01
3722B5M9j33r9J52R0j5j61L6P3J36j60q7L7J33k9j45j1J01J14n5j42N2J08l9L0
3747F0j71N8J98o1j15m9J06P7r2j16KJ24R1j19r8O9P7N5p4j10N9J32p6j09L7J11
3773F6om7o4N0J15j1j46l0R5M0m6j40M5J02N0q6p6oK06r2j04j1P8J05j05j5k8
3800f1R0J1k3r4M2R1J0n4r8J00J35j01j29N5K8J23j48l7O5M1J0j49K9Q4O0n8j18
3827i6kJ51O0j23o2M8J08N3j87ML4J47q5j22J4J18Rp3m3lJ74p9m7r3K7J16o0o7
3855g9MJ07P9j09j28Q0J03J8j33j9Q3Q8n5o7o1J69j4l3q9O3P0n0q7k2Q1P0K7j95
3883i9j2J56Qo0q8J4J57j08n1l3J17J17r8r2kJ58j4j8p3K5N0Pq3n6J05N6p0r0
$$ plain form
3696 -12 -101 7 63 39 -107 -8 14 29 -52 -119 -21 123 141 -62 -121 -53 174 107 -74 -12 55 147 1 -118 -76 25
3722 25 74 -59 -158 -6 84 69 -92 -56 17 153 -7 -94 -57 76 47 -98 -109 -8 106 51 -91 -39 69 30 60
3747 60 -111 -53 145 84 -31 -80 26 103 11 -105 -103 21 112 -7 -105 -36 41 96 22 -88 -29 103 27 -82 -45 66
3773 66 60 13 -51 -1 114 103 -43 -73 22 62 16 -124 -79 23 73 -13 -89 -95 111 19 -85 -96 -18 87 -18 -33 -61
3800 -61 29 40 17 -77 -35 56 66 12 -86 14 149 48 -81 -26 2 125 -23 -60 5 46 56 -93 -64 20 80 22 -96
3827 -96 -98 53 113 -10 -72 -24 84 137 -50 -46 -12 135 50 -72 -58 60 69 -4 -47 -50 124 45 -2 -95 -68 48 -12 -79
3855 -79 -75 32 111 2 -126 -46 57 75 -58 -77 6 94 39 -28 -89 80 66 33 -56 7 77 27 -60 -82 -1 69 96 -99
3883 -99 -111 45 53 -7 -95 -81 76 -32 -83 -116 1 118 20 -72 -74 84 70 52 -21 4 54 61 -22 -78 27 83 13 -77
3911g7MJ17K0j02q6J22K4M6j37lJ34Pm5j02K9J14J1j1j27M5J19m7o8j9M7Q0k4
3938G1j10K6M8L0o6m2JQ0j4kj02Q1Q0p3q3jQ8L7n9m7O5M0Rr4j9J01O1m9p7k3R6
3969E3K8m0q3L5L0Q0j45j6L2P9n0p7n1J56k3N5j07L2L3Jp7j3O0P3j2n5J1L3J7
3998E9o0o5L3K9N0o6n3J37m4or0N4N5N7j70MR6k1O7j36LQ7K2j0j26L3J03l1k7
4027a6rJ6J14o6o1J4R2j3q4o2M3K7M7m5j45J31Q5l6p4k6J28K4j37j3N3R9n0q1
4055d5k2P1Q2j5q0l3J29L4j38o6P8O5k3m6q2Q2J9l1l4M6mO2l0j23O2Q5Pp5o9O6
4085b8J33l6o6l8N7M3r2K9j8N6O1j48k8N4P7Mr9l7K1P0k7rj4O8Kp8J0k3J12j8
4115C8j01K0R5PLj70P1J09n6l1l4P9M2q2j6RJ3P5p9n0L6N2K5r1p0P0O0L3q0m6
$$ plain form
3911 -77 -73 44 64 -38 -124 -2 22 68 -69 -72 62 69 24 -78 -49 65 76 65 -62 -17 102 55 -13 -32 15 95 71
3938 71 -39 -13 35 65 -1 -43 -42 38 24 22 -80 1 81 8 -75 -76 12 49 -10 -57 8 48 57 -37 -56 45 106 57 -20 -43 53
3969 53 81 41 -42 -7 23 103 -42 -58 -26 53 3 -74 -125 31 8 63 -44 -12 21 22 -55 -68 -8 65 53 -2 9 42 59
3998 59 -1 -66 -33 -4 46 -20 -73 64 20 14 -76 -22 33 90 -80 -76 20 -1 66 -70 -67 20 42 32 -94 -61 42 11 -16
4027 -16 -25 -9 105 39 -22 -8 84 71 -13 -75 -32 -5 42 -3 -148 -17 68 32 -42 -68 60 84 -53 -66 -13 86 36 -45
4055 -45 -67 4 86 71 -9 -42 87 121 -17 -83 -5 60 37 -9 -91 -9 10 -21 -55 -9 -13 49 19 -104 -42 43 50 -25 -94 -28
4085 -28 105 69 3 -35 22 65 -27 2 -16 40 101 -47 -75 -21 56 60 -39 -76 -55 15 -12 -21 -35 33 35 -43 -33 -56 56 38
4115 38 -63 -43 52 59 62 -108 -37 72 16 -15 -49 30 72 -10 -26 -17 -4 71 -8 -58 -22 30 55 -36 -106 -36 24 57 -23 -69
4145f9J06O1n6Qj03N7J05p0%k3M4j2q3PQ0p6po8R1k5O3nq8M9P0p3l8NK6R2o0p4
4177f6Q3M3n7O0j12J05j9q6N3P1o1O8r3j0j8K0O9p7qQ9j3m9j0q3J61k8q1P0n7
4206c6K9j5J8j6J1M4L5r6qO1K1k3n0L3R0k8p8l9K9Q2j11P9p5PQ1n1m5PR5K5j00
4237b4k2Q4K7o3K5j02J36n6M3k9n7L6N8n9n2P5k5nl7J4M2Nm1k1L8M3j9j0n8J0
4267d4J15p0Ol1J02l5k8n0L8P6o9J5mN1J3l5n0Kk1J6m9RoP4J9j03L5P8n1J8n5
4298c4oOL2K1k0n9P7j9K4q4Q9L3j6j05O4K2J8m5k2L2N5o6on6RL5K6l0j8J00J8
4329G5p8o7O6N9m0r4L2M2%L9m1k8M6nL7l7m3J19nj52N1N0M1j11KL5J2J8l9J9k
4360AJ7K2l9n0Q9N3p8j5MN0k2n9%pQ8q1K0Ql2P0k3J2p6J23q5j2k0K9P1n9o5L5
$$ plain form
4145 -69 37 98 42 50 -53 4 109 39 39 16 60 48 -35 -28 52 -24 -31 -99 -8 -33 30 25 -63 -14 56 -17 -55 -50 -24 68 8 -66
4177 -66 17 60 3 63 -49 56 37 -49 4 75 14 82 -11 -21 -39 -19 50 -27 -35 54 41 -8 -18 -101 60 32 -49 21 -36
4206 -36 -7 -22 -4 -20 -9 35 70 -26 -34 27 48 25 -25 8 98 70 -8 -47 -18 64 -47 32 -43 -36 45 -6 -51 -44 51 76 -24
4237 -24 -46 38 65 2 27 -75 61 5 48 19 -38 -2 56 -3 -55 20 -5 -10 -47 -33 9 14 -27 -48 -10 33 14 4 -54 -44
4267 -44 71 1 7 -24 78 43 15 -35 3 79 10 25 21 72 85 50 0 2 -19 -3 -52 -43 -49 25 44 -59 -24 54 3 21 -34
4298 -34 -40 -34 -2 19 -1 -60 17 -2 22 -62 27 60 44 -61 3 25 43 -2 -24 8 63 -3 -9 -65 -56 -21 5 -25 -43 57 75
4329 75 -3 -70 -4 55 15 -79 -47 -5 -5 34 -7 -35 11 6 43 6 -37 82 77 -75 -24 26 67 -44 -42 -7 5 23 -16 3 1
4360 1 18 40 1 -49 40 93 15 0 4 54 32 -27 -27 -34 54 -27 -7 1 -31 39 16 28 -48 75 -10 -22 -42 -13 58 -1 -66 -31
4392c1mR3j9p2J3K6Q2j16K4lQ6k8q7K4M7O5j38J6k9M1J2k7L0N0Ql5o4j1kJ07m7
4423A1q7K7R4n6j2k4M9O3n7j4J9k7O5k9p0K1J8K3J4p4N6L0l4n2KL8KK9qm5J5M0
4455B7J4p5L3P0j4q9QR5k3l3l0L9M5o7k8J8k3R2p5k4K7K5Mmp2j9J34Ll5q2O8L6
4487D5j9Jl2K5K9j1l2lN0n5P8j35J08qk6n6O1jk2k6L0m9oP3kp8QN6L7k4q1P1L1
4520C7n9N6kM3k8n4Qj8J5L7o7J4N2oJ9q4OQ2l8k5j0J2N1j0k1L2j7K8n8m0M5O6
4552F6m0o5K8J1M6k1q8JJ29M2r7K8l7l0N6l9k6L6J7L3p0l0P1%l6o9J11J8m9l6
4582d0j9O6M4k6J4J2n3O0j6j00L9M7j5rj5PO8n1m8PK4Pn0L2j7L5nj5KK0m5L1k4
4615c3oP5J1l5j3K7L5o1l9P4l7K7n9K2om8J42p4m3J3J2O7l9p0M0L7n0qM7roJm3
$$ plain form
4392 -31 -35 58 39 -33 -20 6 88 -28 -4 -7 79 51 -36 -12 35 100 -38 -22 -51 -10 2 -25 5 55 63 28 -36 -47 -49 58 11
4423 11 -76 -49 45 -11 -23 -47 2 65 8 -6 13 -14 51 22 -48 -27 -9 14 28 -46 10 40 6 -46 -44 -6 -4 25 17 -28 -13 27
4455 27 41 -34 -1 69 55 -34 -26 69 46 13 -17 22 67 0 -28 -10 -33 59 -16 -40 -13 12 16 12 -60 -79 55 58 23 -59 9 45
4487 45 26 27 -5 20 49 38 6 3 53 -2 76 -59 49 41 15 -41 20 19 -3 -29 1 -48 -54 19 17 -61 -53 3 40 16 -65 6 37
4520 37 -22 34 32 75 47 -7 1 -17 -2 35 -32 -18 34 28 47 -37 -31 51 13 -12 -22 -10 41 31 10 42 25 53 -5 -45 0 66
4552 66 26 -39 -11 0 46 25 -63 -62 67 109 12 40 3 -27 29 -10 -36 0 17 50 -20 -50 21 21 -15 -84 27 45 -4 -40
4582 -40 -59 7 51 25 39 51 -2 58 42 -58 -19 28 13 4 -11 -4 64 13 -35 -28 -4 3 -47 -15 -32 3 -2 -17 -15 5 -40 -9 -33
4615 -33 -39 36 47 12 -1 26 61 0 -39 35 -2 25 -34 -12 -18 -66 76 2 -41 -28 -16 51 12 -58 -18 19 -31 -39 8 -1 -7 -6 -49
4648d9P7m9L4m6j0O7K1r3O9k9K2j4Ql0K2J2rj4n6mR7k2j8MK6ln4M0J5K4k4L6n9
4681iL5k2K6n9J6j8N1m1j5KP2j2j9K1moj0j5nl7Q1k9km0M1L3l5J0J2N1n0j1q1
4714f9J20J0l1j0k2O3Jk9n0J5n9O4Nm7L1Qn9J0O0l5L8J7l8M7j9J8o7M6n1Q6r5
4745d2K5J1K6K5o4K9O1o7L1p9M7j8N3m3l8n0J07Nn8J3j4J08o6o9P8M8rk4j4K5
4775C7l3KK2n8NQ0l9k2m5P0j3P6n8Km9N0m0m2P4j4j4k5j2M3J8o3M9m8J04nj15
4806f3L2M0O7o6l8Q8K6p0jl3m4J05m4j8Pj5N5k7l6pN3pol7J8K6k1j9j5M3JqR6
4839H2k5p5R2q1M7l4P6n7r3R7m1m1N8Pj4KkK0p1O2p2J15k0m4l9J65q2J2j4j6J0
4870B4j3l2K0j8N5m3l0R8k5Rl2l0L4K5o2M9o2K5jl9L0l7J10Ko6M1k5K7p0J6j5
$$ plain form
4648 -49 28 -21 13 -33 -43 24 45 -48 21 -8 14 0 8 -22 0 12 3 -11 -67 -71 26 4 -14 -10 16 13 -41 -1 14 38 14 50 -9
4681 -9 26 4 30 -29 -13 -31 20 -21 -36 -34 38 26 7 28 24 18 8 -7 -12 -49 32 3 1 -39 2 35 0 10 22 73 23 12 -69
4714 -69 51 61 30 20 -2 61 62 33 -17 -2 -61 3 8 -39 -8 0 -59 -49 11 -24 14 31 -7 40 21 39 -28 18 -33 53 -42
4745 -42 -17 -6 20 45 -19 10 71 4 35 -44 3 -15 38 -5 -43 -93 14 19 -39 -26 -40 68 2 -67 11 59 50 26 12 37
4775 37 4 6 28 -30 -25 55 16 -6 -51 19 6 82 24 26 -23 27 -13 -55 19 5 -9 -34 -46 -3 15 -48 1 -47 57 52 -63
4806 -63 -31 9 76 10 -28 60 86 16 15 -18 -62 43 -1 -19 -12 -27 28 1 -35 -42 11 4 -2 -39 -21 5 -16 -35 -50 -7 -6 -14 82
4839 82 57 -18 74 -7 40 6 82 25 -68 29 -12 -53 5 12 -2 0 -2 18 -53 9 -63 52 32 -12 -51 114 32 44 30 14 24
4870 24 11 -21 -1 -19 36 -7 -37 61 36 45 13 -17 17 42 -20 29 -33 -8 -9 -48 -18 -55 55 57 -9 32 7 34 -36 -20 -35
4901c5M4M9r8Q7j5Rl3Ol3RL0k9LL3Rn2m1M0j5K2n4J1M7K8j6o7R0k4%N4j7p4M4
4934A2O7l7j0j0M1k4l3M3k8m4lk4J2J7O1ll9rj1J3jj8Q6o0lL4k7J8l4j1PL3j4
4967ANL3n6nK2L0p2OK0K8m8RM0K5l7LrqL1Pj7KMl4M0j0%M1l4m2K9J8J1l0Qk0r
5004a8jj3RJ2J4j7O1q5K5J6j2j9L6o7N8m7P3k4j1QL8l5J6k1N3p9L5L1k6qk1k0
5036c9P7p7J1K3j9K1km4j1K6k1L7k7N9L6L0p1j6P7j9n1NK6l7L3k5Qn6M5L0m5n6
5068g2L8L6k6O9m7Lk4k6L9JO1m3l4N9o2P3K6j13L5N0n0K2l9J1O7j2k0l2j0J1o0
5099f9Q8nOll2%j8N6LM4j27O3L2n1M0j6K4J4m2N5o3j4P8k5k0JL0k6kj5ml4M3j0
5133AOqJnj9k0NL7j6L8l0N2o6j4L7K7j0nK7k6M0n1J5k5Rj6O8p7L3rK0o2P2m7L4
$$ plain form
4901 -35 9 58 -40 47 32 41 8 14 -19 -10 20 -9 -6 27 36 -16 -57 -17 -32 -10 -64 -53 -6 22 6 -61 29 5 5 59 42 -32 12
4934 12 79 42 32 22 63 39 6 49 21 -23 -26 -50 -38 -21 40 37 -2 -11 -22 -9 -10 -28 58 -2 -5 29 2 20 -14 -25 -18 15 1
4967 1 6 39 -17 -22 0 30 -42 -36 -16 12 -36 -27 13 38 1 4 -5 -13 18 25 8 10 14 -20 20 10 10 51 17 -25 4 22 33 3 11 -9 -18
5004 -18 -19 -32 -23 -11 3 -14 47 -38 -13 3 -9 -28 8 -59 -1 -48 25 1 -10 -2 36 1 17 -4 49 -30 5 36 10 2 -19 -39
5036 -39 38 -39 -28 -5 -24 -3 -5 -49 -60 -34 -55 -18 -45 14 50 80 9 -7 70 51 0 5 31 -6 27 2 10 -46 -1 29 -16 -72
5068 -72 -34 2 -24 45 -2 1 -23 -49 -10 -9 52 9 -25 34 -28 45 71 -42 -7 43 -7 15 -24 -13 54 42 22 -10 -20 -9 -69
5099 -69 19 14 20 17 -15 -15 -33 23 26 70 -57 6 38 -13 27 11 35 49 7 62 -1 -15 63 38 18 19 49 23 21 6 2 -32 11 1
5133 1 7 -1 0 -5 -24 -44 -39 -2 -18 20 -10 42 -24 -38 -1 26 16 11 38 12 52 1 16 -9 0 -16 52 -25 8 -1 19 -43 29 -18 16
$$ [...]
8191D0
##END NTUPLES=NMR FID
##END=
