##TITLE=1H_LY-DMAA.Per.1.13
 CDCl3
 8 sc, 
 18.02.2022
##JCAMPDX= 6.0         $$ Bruker NMR JCAMP-DX V2.0
##DATA TYPE= NMR FID
##DATA CLASS= NTUPLES
##ORIGIN= UXNMR, Bruker Analytische Messtechnik GmbH
##OWNER= root
$$ XWIN-NMR		Version 3.5
$$ Fri Feb 18 11:59:33 2022 Russian Standard Time (UT+4h)  she@DPX200
##.OBSERVE FREQUENCY= 200.131346
##.OBSERVE NUCLEUS= ^1H
##.DELAY= (6, 6)
##.ACQUISITION MODE= SIMULTANEOUS
##.ACQUISITION SCHEME= undefined
##.AVERAGES= 8
##.DIGITISER RES= 18
##SPECTROMETER/DATA SYSTEM= spect
##.PULSE SEQUENCE= zg30
##.SOLVENT NAME= CDCl3
##.SHIFT REFERENCE= (INTERNAL, CDCl3, 0, 15.7039)
##AUDIT TRAIL= $$ (NUMBER, WHEN, WHO, WHERE, WHAT)
$$ ##TITLE= Audit trail, XWIN-NMR		Version 3.5
$$ ##JCAMPDX= 5.01
$$ ##ORIGIN= Bruker BioSpin GmbH
$$ ##OWNER= she
$$ F:/spectra/data/she/nmr/H-F/1/audita.txt
$$ ##AUDIT TRAIL=  $$ (NUMBER, WHEN, WHO, WHERE, WHAT)
(   1,<2022-02-18 11:58:15.59 +0400>,<she>,<DPX200>,
      <created by zg, POWCHK disabled, PULCHK disabled
       configuration hash MD5:
       00 E9 B6 7A A2 85 ED C7 34 08 36 98 17 FE 4E 26
       data hash MD5: 16K
       07 DE 1B 97 60 2C F4 74 59 3B 18 0B C1 8B 47 CB>)
$$ ##END=
$$ 
$$ hash MD5
$$ 43 42 D2 7D 99 66 A0 07 56 26 28 6C 1B 24 40 E0
##$RELAX= 
##$RELAX= 
##$RELAX= 
##$RELAX= 
##$RELAX= 
##$RELAX= 
$$ Bruker specific parameters
$$ --------------------------
##$DU= <F:/spectra>
##$EXPNO= 1
##$NAME= <H-F>
##$PROCNO= 1
##$TYPE= <nmr>
##$USER= <she>
##$AMP= (0..31)
100 100 100 100 100 100 100 100 100 100 100 100 100 100 100 100 100 100 
100 100 100 100 100 100 100 100 100 100 100 100 100 100 
##$AQSEQ= 0
##$AQ_mod= 1
##$AUNM= <au_zg>
##$AUTOPOS= <>
##$BF1= 200.13
##$BF2= 200.13
##$BF3= 200.13
##$BF4= 200.13
##$BF5= 200.13
##$BF6= 200.13
##$BF7= 200.13
##$BF8= 200.13
##$BYTORDA= 1
##$CFDGTYP= 0
##$CFRGTYP= 5
##$CHEMSTR= <none>
##$CNST= (0..31)
1 1 145 1 1 1 1 1 1 1 1 1 1 1 1 1 1 1 1 1 1 1 1 1 1 1 1 1 1 1 1 1 
##$CPDPRG= <>
##$CPDPRG1= <>
##$CPDPRG2= <>
##$CPDPRG3= <>
##$CPDPRG4= <mlev>
##$CPDPRG5= <mlev>
##$CPDPRG6= <mlev>
##$CPDPRG7= <mlev>
##$CPDPRG8= <mlev>
##$CPDPRGB= <>
##$CPDPRGT= <>
##$D= (0..31)
0 1.2 0 0 0 0 0 0 0 0.06 0 0.03 0 0 0 0 0.0002 0 0 0 0 0 0 0 0 0 0 0 0 
0 0 0 
##$DATE= 1645171094
##$DBL= (0..7)
120 120 120 120 120 120 120 120 
##$DBP= (0..7)
150 150 150 150 150 150 150 150 
##$DBP07= 0
##$DBPNAM0= <>
##$DBPNAM1= <>
##$DBPNAM2= <>
##$DBPNAM3= <>
##$DBPNAM4= <>
##$DBPNAM5= <>
##$DBPNAM6= <>
##$DBPNAM7= <>
##$DBPOAL= (0..7)
0.5 0.5 0.5 0.5 0.5 0.5 0.5 0.5 
##$DBPOFFS= (0..7)
0 0 0 0 0 0 0 0 
##$DE= 6
##$DECBNUC= <off>
##$DECIM= 32
##$DECNUC= <off>
##$DECSTAT= 4
##$DIGMOD= 1
##$DIGTYP= 9
##$DL= (0..7)
0 120 120 120 120 120 120 120 
##$DP= (0..7)
150 150 150 150 150 150 150 150 
##$DP07= 0
##$DPNAME0= <>
##$DPNAME1= <>
##$DPNAME2= <>
##$DPNAME3= <>
##$DPNAME4= <>
##$DPNAME5= <>
##$DPNAME6= <>
##$DPNAME7= <>
##$DPOAL= (0..7)
0.5 0.5 0.5 0.5 0.5 0.5 0.5 0.5 
##$DPOFFS= (0..7)
0 0 0 0 0 0 0 0 
##$DQDMODE= 0
##$DR= 18
##$DS= 0
$$ [...]
##$SUBNAM2= <"">
##$SUBNAM3= <"">
##$SUBNAM4= <"">
##$SUBNAM5= <"">
##$SUBNAM6= <"">
##$SUBNAM7= <"">
##$SUBNAM8= <"">
##$SUBNAM9= <"">
##$SW= 18.0517287032376
##$SWIBOX= (0..15)
0 0 2 0 0 0 0 0 0 0 0 0 0 0 0 0 
##$SW_h= 3612.71676300578
##$TD= 16384
##$TD0= 1
##$TE= 0
##$TE2= 300
##$TE3= 300
##$TEG= 300
##$TL= (0..7)
0 120 120 120 120 120 120 120 
##$TP= (0..7)
150 150 150 150 150 150 150 150 
##$TP07= 0
##$TPNAME0= <>
##$TPNAME1= <>
##$TPNAME2= <>
##$TPNAME3= <>
##$TPNAME4= <>
##$TPNAME5= <>
##$TPNAME6= <>
##$TPNAME7= <>
##$TPOAL= (0..7)
0.5 0.5 0.5 0.5 0.5 0.5 0.5 0.5 
##$TPOFFS= (0..7)
0 0 0 0 0 0 0 0 
##$TUNHIN= 0
##$TUNHOUT= 0
##$TUNXOUT= 0
##$USERA1= <user>
##$USERA2= <user>
##$USERA3= <user>
##$USERA4= <user>
##$USERA5= <user>
##$V9= 5
##$VALIST= <valist>
##$VCLIST= <CCCCCCCCCCCCCCC>
##$VD= 0
##$VDLIST= <DDDDDDDDDDDDDDD>
##$VPLIST= <PPPPPPPPPPPPPPP>
##$VTLIST= <TTTTTTTTTTTTTTT>
##$WBST= 1024
##$WBSW= 4
##$XGAIN= (0..3)
0 0 0 0 
##$XL= 0
##$YL= 0
##$YMAX_a= 484916
##$YMIN_a= -421457
##$ZGOPTNS= <>
##$ZL1= 120
##$ZL2= 120
##$ZL3= 120
##$ZL4= 120
##$ABSF1= 10
##$ABSF2= 0
##$ABSG= 5
##$ABSL= 3
##$ALPHA= 0
##$AQORDER= 0
##$ASSFAC= 0
##$ASSFACI= 0
##$ASSFACX= 0
##$ASSWID= 0
##$AUNMP= <proc_1d>
##$AZFE= 0.1
##$AZFW= 0.1
##$BCFW= 1
##$BC_mod= 2
##$BYTORDP= 1
##$COROFFS= 0
##$CY= 11.3945322036743
##$DATMOD= 1
##$DC= 2
##$DFILT= <>
##$DTYPP= 0
##$F1P= 2.36226072786647
##$F2P= -0.459571619588291
##$FCOR= 0.5
##$FTSIZE= 0
##$FT_mod= 4
##$GAMMA= 1
##$GB= 0.15
##$INTBC= 1
##$INTSCL= 1
##$ISEN= 128
##$LB= 0.24
##$LEV0= 0
##$LPBIN= 0
##$MAXI= 10000
##$MC2= 0
##$MEAN= 0
##$ME_mod= 0
##$MI= 1.114404
##$NCOEF= 0
##$NC_proc= 0
##$NLEV= 6
##$NOISF1= 3.799351
##$NOISF2= 2.8
##$NSP= 1
##$NTH_PI= 0
##$NZP= 0
##$OFFSET= 15.70392
##$PC= 1
##$PHC0= -16749.21
##$PHC1= 11.60078
##$PH_mod= 1
##$PKNL= yes
##$PPARMOD= 0
##$PSCAL= 0
##$PSIGN= 0
##$REVERSE= no
##$SF= 200.130013532006
##$SI= 16384
##$SIGF1= 3
##$SIGF2= 2
##$SINO= 400
##$SIOLD= 16384
##$SREGLST= <1H.CDCl3>
##$SSB= 0
##$STSI= 0
##$STSR= 0
##$SW_p= 3612.71676300578
##$SYMM= 0
##$S_DEV= 0
##$TDeff= 0
##$TDoff= 0
##$TI= <>
##$TILT= no
##$TM1= 0
##$TM2= 0
##$TOPLEV= 0
##$USERP1= <user>
##$USERP2= <user>
##$USERP3= <user>
##$USERP4= <user>
##$USERP5= <user>
##$WDW= 1
##$XDIM= 8192
##$YMAX_p= 0
##$YMIN_p= 0
$$ End of Bruker specific parameters
$$ ---------------------------------
##NTUPLES= NMR FID
##VAR_NAME=  TIME,          FID/REAL,        FID/IMAG
##SYMBOL=    X,             R,               I
##VAR_TYPE=  INDEPENDENT,   DEPENDENT,       DEPENDENT
##VAR_FORM=  AFFN,          ASDF,            ASDF
##VAR_DIM=   8192,          8192,            8192
##UNITS=     SECONDS,       ARBITRARY UNITS, ARBITRARY UNITS
##FACTOR=    0.0002768,     1,               1
##FIRST=     0,             0,               0
##LAST=      2.2672688,     0,               0
##MIN=       0,             -421457,         0
##MAX=       2.2672688,     484916,          0
$$ Real data points
##PAGE= N=1
##DATA TABLE= (X++(R..R)), XYDATA
0@%%%%%%%%%%Qj6J6k4L2l4M2n6P2q6J02j21J39j63J95k30K69l12L61m14M71n39
32b88O16o98P88q89R99j120J255j401J560j735J925k135K362k609K883l178L500
49A835l858M253m686N163n695O289o956P715q582R582j0757J2155j3853J5973
63H578j8700K2355k7539L5522m9502Q0880k73552R7850O09024l59247m78350J50214
75b02467M52931n8685k74917r3654J21275J53369R9454k10706k71485J88437M42869
86C46421j54635n37213P0955N87292K457n53983q3417M74314J28820l35907j51779
97b06675J78209J28277o944p7582j45066m538K71746R5776l51504j87319L87210
108H1590K57887l74826l00241L26777L02835k50256k65445J62873J91127p6065
$$ y = [0, 0, 0, 0, 0, 0, 0, 0, 0, 0, 0, 8, -8, 8, -16, 16, -18, 24, -32, 40, -46, 56, -65, 74, -89, 106, -124, 145, -167, 194, -220, 251, -288, 328, -370, 418, -471, 528, -592, 663, -738, 822, -913, 1012, -1123, 1239, -1370, 1513, -1665, 1835, -2023, 2230, -2456, 2707, -2988, 3301, -3655, 4060, -4522, 5060, -5697, 6458, -7395, 8578, -10122, 12233, -15306, 20216, -29286, 51594, -221958, -124108, 484916, 125669, -352681, -202467, 250464, 191779, -83138, -176792, -55517, 97852, 197306, -13400, -284885, -96448, 346421, 191786, -345427, -274472, 312820, 315277, -238706, -322123, 152191, 281011, -54896, -206675, -28466, 99811, 92867, 15285, -129781, -134319, 137427, 233203, -118301, -305620, 81590, 339477, -35349, -335590, -8813, 294022, 43766, -221679, -58806, 132321, 56256]
118E6256r1101K020k3036N2298J35265q3860k32199R4415L01473q9362l36845
129b14676P5301L35220o0209k99909M9915K37869m8153j58367N6434P2278p2476
140b6773J0547R2436q1663j10160J36905J21054j73580j19932J92389J04580j96354
151e0551p5364J89222L4840j75260J2000J56988n9925j36755J01669J14636j32646
162b1146q9837J48913O0426j49427k5143J35727j6512j10856O4063Q0440j14458
173c7810m9207J63737K2140k04803k437K32470q960k41140J3244K27035j3154
184A01115j89973J3034J31738j7199n8947K8679k1218m9451R8859P8390j65127
195e0100j12205K11616J45419k33010j71353K27616J83591j96173j76670J44648
$$ y = [56256, -34845, -32825, -55861, -3563, 131702, 47842, -184357, -89942, 211531, 122169, -214676, -139375, 195845, 135636, -164273, -114358, 123511, 75358, -83009, -26575, 45703, -26773, -16226, 76210, -5453, -115613, 21292, 142346, -31234, -151166, 41223, 145803, -50551, -125915, 63307, 98147, -77113, -65113, 91875, 31950, -104805, -3136, 111500, -21146, -110983, 37930, 98356, -51071, -76214, 59513, 43001, -67855, -3792, 76648, -37810, -87017, 76720, 98860, -105943, -108380, 124090, 115130, -126010, -112766, 114269, 101115, -88858, -75824, 55914, 38715, -20232, 8447, -12771, -62222, 36637, 115027, -50100, -162305, 49311, 194730, -38280, -209633, 17983, 201574, 5401, -171269, -26621]
205b6621J47673q0368r5943J3417K5408M6728N7533r1858j43535J16367K21634
216A90435j18428k81314R9275L13018o4770l11463K2195K74633J8979k05859n0358
227a13657J12594O4883o031n8696j00674L2415J94686J0412k64247o1965L01847
238A11567J13374l03425j54266K70798J76265k09743j73570J29732J43877m2388
248F2221q9490m0823J5991J08834O7033j54565j49060J73823K18692j67367k66006
259b20717J38761K84185r5490k69509M6265K23575N4j51036l5245O1325N3917
270C6085L5118n3565j26073L6041K00690n631k50836l0669K71429O4622k61928
281h4717q9194K25287R7829j68323q8123R9419O0034k8144j7429l6838l3969Q8826
$$ y = [-26621, 121052, 40684, -55259, -41842, -16434, 30294, 87827, -4031, -147566, -31199, 190435, 72007, -209307, -110032, 202986, 138216, -173247, -151052, 123581, 142560, -63299, -113657, -1063, 63820, 57789, -907, -101581, -69166, 125520, 135932, -128315, -190280, 111567, 224941, -78484, -232750, 38048, 214313, 4570, -169000, -39268, 104609, 62221, -27269, -68092, -52101, 56733, 123766, -30799, -179859, -6036, 212656, 45289, -220717, -81956, 202229, 106739, -162770, -116505, 107070, 107124, -43912, -79157, -17832, 36085, 71203, 17638, -108435, -72394, 128296, 122665, -128171, -158840, 112589, 177211, -84717, -173911, 51376, 149205, -19118, -107241, -7822, 52212, 24068, 6639, -30199, -64168, 24658]
293B4658Q6758j23421j32664J39716J65326j39024j79329J25298J73188j03413
303C7093j46939P8677J04327n5604n0972L7078o616k4772O1551J8067j08140j5587
315g1837J41332J4356j59266j1658J61233N327j49445O116J26881k2657r7268
326e6886M2840O5092o3735l3362Q2594M635r5481K0267J00116m0923r4970N8379
338a1434P9840p3583n6769Q7299K8250r9754J428J10139k9144j17039N1127J18130
350H8490o5400j11714P1352R5745o9563o9765O2333L4690n1942P219M2019n2128
362a8664l4658R5662L1687j32269l2971J57398L7371j67340m2755J60316M5622
373I9399j36529m2977R8234L1854n0393j1512j208j7982N0025N3802q9924r2153
$$ y = [24658, 111416, -12005, -144669, -4953, 160373, 21349, -157980, -32682, 140506, 37093, -109846, -31169, 73158, 17554, -33418, 3660, -2956, -27728, 33823, 51890, -56250, -71837, 69495, 83851, -75415, -87073, 74160, 79487, -69958, -63842, 63039, 40382, -56886, -14046, 51046, -12689, -46051, 36543, 41178, -54303, -34036, 66080, 25157, -69813, -11434, 68406, -5177, -61946, 25353, 53603, -46151, -44723, 65416, 36272, -80767, -29640, 88490, 23090, -88624, -17272, 78473, 8910, -60855, 1478, 36168, -15774, -8555, 33464, -18664, -53322, 42340, 74027, -58242, -91213, 66185, 103556, -63784, -106539, 53777, 99399, -37130, -80107, 18127, 49981, -412, -11924, -13132, -31114, 18911, 72713, -17211, -109364]
385a09364J16132J27541j25946j53677J19368J65813r8514j59872O8037J34791
395H4309l3269r1717O42L4901K4727K9468l9193r3721M0696J49906l0458j90879
407a14588J0732K11335J3255k08771l6365J83031N3220j37939n9170P8857N1725
418D5322j3191l0451n0484k331J04844M2659j43312q4252J62332J20885j60834
429h813j45872J40720J54499j06406j44025O3921J14230k0273o8238j8313J0898
440b7672M6479N0244o1587j07693O2895J54031n2445j83480L3979J92379j2028
451I5102j79982p693J48363K1246j01855k5199M6861J8789J0164k899o2230j9721
463e9054J03907M4805j31351o8046J42836Q4686j38987r1546J21842Q6294r5589
$$ y = [-109364, 6768, 134309, 8363, -145314, -25946, 139867, 41353, -118519, -50482, 84309, 51040, -40677, -40035, -5134, 19593, 49061, 9868, -83853, -43157, 106749, 76291, -114588, -103856, 107479, 120734, -88037, -124402, 58629, 111849, -26090, -85260, -6403, 45322, 32131, 1680, -48804, -51135, 53709, 96368, -46944, -131196, 31136, 152021, -8813, -154685, -13965, 140534, 34128, -109897, -45976, 68254, 47981, -20257, -38570, -27672, 18807, 69051, 7464, -100229, -37334, 116697, 64252, -119228, -85249, 107130, 95102, -84880, -92573, 55790, 77036, -24819, -50018, -3157, 15632, 25796, 22897, -39333, -59054, 44853, 89658, -41693, -109739, 33097, 117783, -21204, -112750, 9092, 95386, -203]
474b03o9048O4570M1295l3392o344N709l1324J5808O7389l0127r6764L7674J16209
487H1452l9543j23444L8455J18079l6261j01222L5177P5485l6330m4659L9791
498F980J2132m4836J8263M9611m4100n2423O3513N0990p6152m4193Q2057L1851
510E3693q2498j4573P9013n874p2717K7386O4937m7137n5832O2782M5632p2147
522a7335l3634P4427J9372o9513k414N8358j7326m2995L8811K5862o0966r659
534c7012Q1366l810r7789J2954J07487j7664j08194J8437R8770j6762p9114J4960
546b6371N0585j4564j5867J7698k1256k4740N6720L5527q6120m8247J05868O0672
558H9905j13947o9809J09323P2601r3256o6943O7902N1614l7364k7117N661m959
$$ y = [-203, -69251, -4681, 36614, 3222, -3122, 2587, -28737, -12929, 54460, 24333, -72431, -34757, 81452, 41909, -81535, -43080, 74999, 38738, -62484, -27307, 48178, 11848, -32811, 6980, 19112, -25724, -7461, 42150, -1950, -54373, 9140, 60130, -16022, -60215, 21842, 53693, -28805, -43378, 35635, 29761, -42956, -15570, 49367, 2230, -53602, 9180, 54812, -17335, -50969, 23458, 42830, -26683, -29097, 29261, 11935, -31060, 7751, 33613, -27353, -37012, 44354, 40544, -57245, -44291, 63196, 45532, -62662, -44225, 54545, 37783, -41331, -26371, 24214, 9650, -6217, 11481, -9775, -34515, 22205, 57732, -28388, -76635, 29233, 89905, -24042, -93851, 15472, 88073, -5183, -72126, -4224, 47390, 10026, -17091, -11430, -16389]
570a6389K2901M1129m4567p7353N7138J08881n9529j31050N2678J40538l8428
581E5949j35108K0628J14623k856q0625j1062L7001J8159J1283j7061n8740P683
593d0126R9266Q142j28235k7780J42365M6801j40351o1335J22889O7836r3184
604c712o3827N5527M8688j5089k3385k2582r065N3486M4621p3966p8257Q2948
616d613J05159q0411j21332O8574J23946n0415j12369K9747Q7391j0489n2185
627a6997m412J0518J2771L2289j4008p1418Q788J02224R36j21247j2637J27086
639E3893K2960j19359k9164J00229K9291p2279k2449L9840R048o838R414k2796
651h210l0244M6139N0335o1745o6644O9077P6060o8912p7424O3064O9704n3708
$$ y = [-16389, 6512, 47641, 3074, -74279, -17141, 91740, 32211, -98839, -46161, 94377, 55949, -79159, -58531, 56092, 53236, -27389, -38451, -1450, 16709, 27992, 10931, -47809, -40126, 59140, 67282, -60953, -88733, 53632, 100433, -39918, -101253, 21636, 89472, -3712, -67539, -12012, 36676, 21587, -1798, -24380, -33445, 20041, 64662, -9304, -87561, -4613, 100546, 20135, -101197, -32623, 91323, 40908, -71461, -41714, 45677, 35188, -16997, -21409, -10891, 1880, 34169, 20161, -51257, -42469, 59755, 60691, -60556, -73193, 53893, 76853, -42506, -71670, 28559, 57850, -14429, -36878, 2962, 12010, 5172, 14586, -8210, -38454, 7685, 58020, -3725, -70369, -1292, 74768, 5856, -71568, -8504, 61200, 7492]
663G492n3951M2961L1914l2608o476K4063j9368j7519M2933J2649o1324q679P3426
676C5513M470p7904Q59P5452p807o7084J6739N4112k6992l8724L7279K2673m6586
689a8000p412N3065o397n5533J7833N3062k7223m5450L4948L3210m1365j7700
701b6962M7141O75n1978J5937N5828l0000n7676M0228N6622m5330n1709M5636
713a588M2051m1593k7727L4453R082k6079J2443J7908l5269j1437N6485P431p3930
726c7770n977Q5103O537q8166q168Q2602R178o8289q105M7099L809k1008M373
739A218o615j6204L2865L0714n4461m5949O8837N9571p4726o9154P1601P2341
751G0038o0752o7704M4104N4348k4588l3258N270O241J0814K3828k1612n3419
$$ y = [7492, -46459, -3498, 28416, -4192, -10668, 13395, -5973, -23492, 19441, 32090, -29234, -37913, 35513, 39983, -37921, -37062, 38390, 30583, -36501, -19762, 34350, 7358, -31366, 5913, 28586, -18000, -25412, 27653, 21256, -34277, -16444, 36618, 9395, -36055, -1107, 32103, -9262, -26962, 20179, 20854, -31124, -15187, 40641, 10641, -47035, -6807, 49815, 4485, -47224, -1588, 40463, -1130, -28857, 5596, 14678, -11401, 1042, 18950, -16319, -27756, 28729, 36160, -37770, -43747, 41356, 47893, -40273, -48441, 34161, 43339, -24950, -33055, 14044, 17853, -3155, 1218, -5397, -21601, 11264, 41978, -12483, -58432, 10405, 69976, -4750, -73904, -2303, 70038, 9286, -58418, -14314, 40034, 15446, -17812, -12542, -6301, 4513, 28341, 6729, -46690]
763d6690K6142P8774k4091r6605J7273J04311p222j00806l148Q6432J1385o2788
775a7033j5200L2697J3531j17o023l1385o440N7992K1840p7020l7926Q6528N1489
788G2933q6040n9943P6301O1310n9356n4483L8002L9666j5223j8152n640p538
800a8163K2213L4552l2827n9176L6998P8202l5043q9073K8591R0284j9800q1786
812d5028J0844O4368l872m0588K68J3217q94J4363N120l8905j2099N8064K0015
825D4873o9941k7076P4112L1474p0738l1533O1289K6799m7409j7297L1460L939
837I952j5202J1389O65k7205J1214M1147j9842n1439K5116N6645k7951n6074K8731
850a2854M9867k8714l8815K8429K4309k8305q123K8483p785k8521K1981K7807
$$ y = [-46690, -20548, 58226, 34135, -62470, -45197, 59114, 51892, -48914, -52062, 34370, 45755, -17033, -32233, 464, 13995, 13878, 7855, -23530, -29970, 28022, 49862, -27158, -65084, 21444, 72933, -13107, -73050, 3251, 64561, 5205, -49278, -11276, 28390, 13167, -4985, -10625, -18163, 4050, 38602, 5775, -53401, -16403, 61799, 26756, -62317, -33726, 56558, 36758, -45028, -34184, 30184, 26312, -14276, -14008, -791, -1685, 12678, 17798, -21107, -33206, 24858, 44873, -25068, -52144, 21968, 53442, -17296, -48829, 12460, 39259, -8150, -25447, 6013, 9952, -5250, 6139, 6804, -20401, -9187, 31960, 12118, -39321, -14205, 42440, 14489, -41585, -12854, 37013, 8299, -30516, -2087, 22222, -6083, -14206, 14277, 6492, -22029, -48, 27759]
862B7759l2877k5554M0199K1170m3469j4456M3388N467m0666N283L6180j6780
874E644l0923K7741K5196l6848j9611M2754J3842m4704p923M2467J158l6252O591
887a0868K6924j5426j5546K5037L902l4709O913M3625j5513n0310K1192N3701
899C8922k3663n2563K3163M6347k0558l5119J6927J9327j3365q28J0973j8752
911i189j0616L7261J2098n2504j5130O2441J8822o5919k1771O2526K2702n2565
923a1844k0444L7703J4381j9686m333J001q787J6112K3745k9550l8743L7904N1568
936D9027m0736o0242L8147O3107l1422n9290K1839M8567j1610l1773K351J0676
948a359M293J2424p249l4805O413N3909k133o7363m136P3560J1108p1828j6624
$$ y = [27759, -5118, -30672, 9527, 30697, -12772, -27228, 16160, 21627, -19039, -13756, 22424, 5644, -25279, 2462, 27658, -9190, -28801, 13953, 27795, -16909, -24832, 17635, 18793, -17459, -10868, 16056, 630, -14916, 10121, 14023, -20686, -13773, 29852, 14339, -35971, -14779, 38922, 15259, -37304, -14141, 32206, 11648, -23471, -6544, 12783, -582, -1410, 9563, -9189, -19805, 17456, 29554, -22950, -38080, 24361, 43183, -22736, -44507, 18019, 40721, -11844, -32288, 5415, 19796, 110, -4223, -3222, -12009, 4103, 27848, -1702, -40445, -2541, 49027, 8291, -51951, -13804, 49303, 17881, -41409, -19570, 28997, 17387, -14386, -12035, -1359, 2934, 15358, 8109, -26696, -20283, 33626, 31493, -35870, -40006, 33554, 44662, -27166, -43790]
961d3790O2509J9306m6975j7876K7167J1919n901j924j4384j0956L1256K4795
973C5146m3010l7863M8759M7771m8496n2840M2979N1977l3831m4762K2805L2082
985B0717j1771j5082K561m200M034K3521p359m0500P658N3181n437o0397K125
998c0949O1160J015n5797k960M5159K546l0695K20J4203n387K163J2347j6890
1011c865j9759K8448K6580l6170l1250L9788L2780l9348l0531L6050K4547l0677
1023c407j5285K4410L763j8075Q574J2343k0322p575L0130L384l6849J51L9796
1036B1038l748l8985P522L4809j1866k7873J6522J9472k1383j0405K5764J976
1048A2843k9168N645L0692j1681k9755J6238K6135j9306j9869K1382J1316k2755
$$ y = [-43790, 18719, 38025, -8950, -26826, 341, 12260, 6359, 4435, -9949, -20905, 10351, 35146, -7864, -45727, 3032, 50803, 2307, -50533, -7554, 44423, 10592, -34170, -11365, 20717, 8946, -6136, -3575, -7775, -3741, 19780, 12421, -28079, -20421, 32760, 27323, -33074, -30949, 30211, 31226, -24571, -27531, 17628, 20174, -10521, -10301, 3902, -1485, 678, 13025, -3865, -23624, 4824, 31404, -4766, -36016, 3772, 36552, -2796, -33327, 2723, 27270, -3407, -18692, 5718, 9481, -8594, -20, 12323, -7999, -15574, 14556, 17940, -18909, -18758, 21038, 17290, -21695, -14173, 20636, 8770, -19103, -2581, 16891, -4492, -14897, 10867, 12843, -16325, -10680, 20012, 8331, -21424, -5186, 20949, 1643, -18226, 3156, 14472, -8283]
1060h283j404K3668q817k4570J8344K4947k6062k4740L0928K3334l2631k0307
1072b5593L1080J5242k6678p888K0192j387j2594J1952N272k2867J042L3153n564
1085A5362m1147P985M5881q493m6329P518M2224o093l3719M805K1483m609o998
1098b130N923q347q972K2682J3347l4236j8629M1984K3568m4958k7081M3133K8076
1111C4360l6728k5648K6998J9695j5405j0021L416k185P099J5942j5072k9512
1123b7061J9682M0950k0789m8785J8704N1560j4395m8880Q966M0687l899k7908
1135a1168K41J1990J384N047j86k1401l256L5161Q306m4677j3688M9127J8350
1148C5230m8128k1112M2268K0977l2508j7515K0381J0732p570j350m359r839J4145
$$ y = [-8283, -9687, 13981, 5164, -19406, -1062, 23885, -2177, -26917, 4011, 27345, -5286, -25593, 5487, 20729, -5949, -13837, 6355, 4968, -7626, 4326, 9598, -13269, -12227, 20926, 15362, -25785, -17800, 28081, 19588, -26741, -19223, 23001, 16908, -16811, -12006, 9477, 4868, -2130, 3793, -4554, -13526, 9156, 22503, -11733, -30362, 11622, 35190, -9768, -36849, 6284, 34360, -2368, -28016, -1018, 18677, 3272, -6749, -3333, -5518, 1581, 17523, 2451, -27061, -7379, 33571, 12782, -36003, -17299, 34261, 19866, -29014, -20048, 20639, 16740, -11168, -10927, 1063, 2447, 7494, 7308, -14093, -17349, 17812, 26118, -18559, -32247, 16880, 35230, -12898, -34010, 8258, 29235, -3273, -20788, -407, 10325, 2755, 1405, -2954, -12793, 1352]
1161A352K1051k0847l1140K4108L8465k4046m2044K1416M1093j7154l5472J2350
1173a0868K5989p889j3651M835n8l420J3606L702k5460n139L4327P023l9273q685
1187b4961M0076R122l7055p908L0861M583k2464L36J3166o617m110J3480m008
1200D501j9776J0420K4757j4873k7493J7608K7612j8774k4862J8920J9609j8376
1212g27j2321J7478M139j6791M301J5994j2086j4977J8115J3636k2321j1460K4257
1225G237Q082k4038l654K2021j845j8893Q206J5009j4531j1008K0309P386k4680
1238a0399m018K6990J223k6953J631K4188m417j9069P557J2173j1157m392J5060
1251H417l569j9041J0491K2666j5969k5223J9141K6089k0108k4693J8897K0881
$$ y = [1352, 22403, 1556, -29584, -5476, 32989, 8943, -33101, -11685, 29408, 12254, -23218, -10868, 15121, 7232, -6419, -1584, -1642, -5062, 8544, 12246, -13214, -18353, 15974, 22997, -16276, -24961, 15115, 24237, -12818, -20726, 10135, 14718, -7746, -7410, 5756, -861, -4971, 8509, 4501, -15275, -4855, 19902, 5029, -22464, -4856, 22756, 3982, -20880, -1960, 17649, -727, -13048, 4430, 8569, -8222, -3921, 12073, -13, -14990, 3125, 16761, -5560, -17020, 7237, 15319, -8719, -12373, 9648, 7803, -11090, -2884, 12125, -2406, -13414, 6895, 14281, -10399, -14417, 12573, 13796, -13157, -11526, 12662, 8245, -10824, -3267, 8906, -2251, -6643, 8417, 4848, -14193, -3702, 18964, 2995, -22228, -3087, 23002, 2894, -21799, -2902, 17979]
1263A7979j5956j4665J2180O355q175L424M773j3546k306K2999J267l0653j438
1276a7762L5494K502l6814l955L4363M794k8398m588J9627K664r081R05j960o111
1290h320J2098J2359k0340j8585K5650K4063k7639k7566K6371K8379k2470k5718
1302b1718J6576J9973r847j1314L433O00J891J0835n445k1734O851L0777o367
1315A4511l6787M304L9003j578l7198j034L1405K814k2506l119J1533J577K70
1328C195J740j1135o554K0289J1982k6608j7013K9550K0884k9226k2411K5799
1340D92K1311k0328j7309J3641J0682o833k219Q06p222L787J6230o598k4025P725
1354i860K9331p503l1505O407L0530n165k6282M337J9549m116j1128M957K021
$$ y = [17979, 2023, -12642, -462, 5893, -2282, 1142, 5915, -7631, -9937, 13062, 14329, -16324, -17762, 17732, 20234, -16580, -20535, 13828, 18622, -9776, -14364, 5263, 7927, -1154, -249, -2209, -8320, 3778, 16137, -4203, -22788, 2862, 26925, -714, -28280, -1909, 26470, 4000, -21718, -5142, 14831, 4984, -6330, -2897, -2297, -406, 10429, 4984, -16750, -9899, 20878, 14511, -22276, -17972, 21031, 19453, -17745, -18779, 12626, 15440, -7066, -10185, 1348, 2925, 3195, 4935, -6200, -12754, 7535, 19517, -7091, -24104, 5446, 26330, -2896, -25307, 492, 21803, 1475, -15834, -2193, 8489, 1656, -563, 243, -6979, -3192, 13038, 6440, -17585, -9860, 19471, 11968, -19537, -13130, 17400, 12235, -14047, -9710, 9839, 5723, -5405, -448, 1573]
1367A573o574O564Q913j3934j1281J9372J3122k2552j3934K3422J3155k2162j0856
1380a5172J9326O791j5450j639J1311m335p314J0295L856j5549r10J9332j282
1393I260k1214L110K1115m880j8876O711J5083q796j0118J1067M687j3412O28
1406e635J5408n300j6750Q854J6908j1325j5554J2456J2635j2685q238J2300K602
1419E676j1490L436J0944r575j0261J4930R766j8862r169K0977Q442k1050o935
1432a3171J8936M674j5197j351J0120k835m736P850o62j2961N094J7692q171k1590
1446a6308R694K3690r780k3637Q826K0990o964j6109N149R306l706j147L116p261
1460d141l351J4969M681k1280o598K5362Q456k6618r918K5044J0239k0926r151
$$ y = [1573, -5001, 1563, 10476, -3458, -14739, 4633, 17755, -4797, -18731, 4691, 17846, -4316, -15172, 4154, 10945, -4505, -6144, 5167, 832, -6482, 3813, 7669, -7880, -8790, 10542, 9260, -11954, -8844, 12271, 7391, -11485, -4774, 10309, 1513, -8605, 2462, 7149, -6263, -5635, 9773, 4473, -12277, -3423, 13485, 2160, -13394, -938, 11697, -988, -9226, 3074, 5676, -5814, -2378, 8566, -1009, -11270, 3660, 13426, -5436, -14605, 6372, 14814, -6236, -13171, 5765, 10439, -4758, -6109, 4011, 1176, -3560, 4290, 3628, -9333, -4239, 13453, 5282, -16308, -6614, 17076, 7296, -16341, -7515, 13475, 6511, -9598, -4449, 4857, 1151, 4, 3120, -4141, -7492, 7477, 12158, -9122, -15720, 9642, 18098, -8520, -18438, 6606, 16845, -4081, -13232]
1473a3232J4866O254p691j965M66l755O190J0002j1322j6142J4544K1143j5423
1486C935k4367J4531K5136j1922k3174Q483J8538m920j1513J689L256K31N638
1499E541q95j4031J51K0868J523k5375l732K7064N727k5881o957K2027O908j6197
1513c259n223R148K146j825K225m899p210J0369J2150j4039j6340J5786J9092
1526A8121j5587j9909J3961J8448j1389j4704Q184R287n269k730K980m461j417
1539d485J1084P77j6582p70K0223J154k1686j521K0973J558j8265p35J3990q75
1553D840q813L251L490o184J555R215n744j1745Q693J3483j0517j3975J1200J2866
1567A1615j1014j0501J0421O730r516k176Q540k621p732P169O991j0821o364J3524
$$ y = [-13232, 1634, 7888, 197, -1768, -1302, -5057, 1133, 11135, -187, -16329, -1785, 19358, 3935, -20432, -5901, 19235, 7313, -15861, -7378, 11160, 6240, -5273, -3584, -328, -97, 5541, 4646, -9385, -9234, 11634, 13157, -12218, -15950, 11114, 16841, -9040, -15997, 6030, 12938, -3259, -8482, 666, 2812, 987, 3212, -1687, -8897, 1472, 13622, -417, -16757, -971, 18121, 2534, -17375, -3414, 15034, 3645, -11059, -2875, 6412, 1143, -1587, 1393, -3068, -4485, 6599, 7376, -9206, -9976, 10247, 11401, -10285, -11806, 9167, 10725, -7540, -8275, 5715, 4840, -3973, -722, 2768, -3416, -1861, 7354, 1610, -10135, -1442, 12041, 1524, -12451, -1251, 11615, 601, -9900, 521, 7251, -2265, -4441, 4099, 1478, -6254, 915, 7906, -2915, -9279, 4245]
1581D245N339j4607m030J4402K158j2761L65J0313l471p206O756M061j0030j311
1595e777J2934j133j4907K720J5723l793j5038M368J2787m813r190N246M662n928
1609b139M46O923n373q159R562R557j2583j0601J4113J1190j4166j0548J2645
1622H67Q697r936n795O694J703l343L173K81q351J965J3166l333j6984L590J9372
1637A1766l195j9726K261J7995j097j4450N04R237m01l045J116l291k684R196
1651D186M963j3937p364J6773R662j7789j1222J6756J1524j3991j0387R971P695
1664F840n487l622J028j484K768O876n269j2109O603J6327o573j8893N564J9625
1678A2194l972j8111K173J4681p15r644o4L667j25K561J137q345k882J3012M829
$$ y = [4245, 9584, -5023, -9053, 5349, 7507, -5254, -4889, 5424, 1953, -5253, 1503, 5564, -4466, -5777, 7157, 6024, -8883, -6163, 9560, 5767, -9271, -4903, 7884, 3071, -6119, -873, 3789, -2139, -1693, 5230, -143, -8302, 1260, 10817, -1766, -12367, 1746, 12936, -1230, -11778, 867, 9564, -372, -6167, 527, 2230, -1113, 2060, 2341, -6010, -4045, 9121, 5788, -11196, -7606, 11766, 8571, -11155, -8894, 9101, 8004, -6446, -5942, 3295, 2894, -151, 965, -2326, -5010, 4186, 9149, -4788, -12152, 4621, 14283, -3506, -14728, 2028, 13552, -439, -10826, -855, 6840, 1353, -2269, -1241, -2725, 43, 6919, 1650, -10459, -3856, 12471, 5898, -12995, -7431, 12194, 8222, -9889, -7716, 6965, 6250, -3394, -3458, 209, 84, 2645, 3782, -4563, -7445, 5567, 10396]
1693A0396j6003o919J7202Q283j6464q753J4189P935j0670n742O495K564k345
1706A68J632j388n911M146J0056n928j3248O525J5245o345j5515N518J4089m445
1720D599j1291L580P192l048k660L134k199l582O497M296r769n184J2018N631
1734I214j2799n623J2462M813j0873l286Q705R67o125J865L560m894j208P717
1748D495p17r903K017J1282l007j1451L572J0459m087q395M554N485n188k103
1762b987N929j353o676M325P404o596p857Q063P832q547o945Q256N255p176k892
1777c965N855j61m441L461L221o843k202R528J722j1571j422J2380J191j1919
1791e166j040J0351N47p698L80M362j844o66L789k901n770N820P837p804r618
$$ y = [10396, -5607, -12526, 4676, 12959, -3505, -12258, 1931, 9866, -804, -6546, -51, 2513, 168, 1800, 412, -5499, -1353, 8703, 2775, -10473, -3948, 11297, 4952, -10563, -5045, 9044, 4599, -6692, -3112, 4080, 1032, -1628, 1506, -693, -4275, 2222, 6518, -3251, -8435, 3583, 9214, -3585, -9208, 3254, 8067, -2806, -6092, 2613, 3580, -2545, -680, 2880, -2014, -3222, 4495, 3778, -6125, -4108, 7174, 4167, -7284, -3712, 6747, 2660, -5735, -1181, 4304, -884, -2987, 2942, 1589, -5087, -762, 6642, 46, -7811, 252, 8084, -463, -7408, 848, 6103, -1073, -3965, 1890, 1729, -2712, 749, 3970, -2873, -5075, 4453, 6175, -5396, -6818, 5562, 6753, -5166, -6206, 4145, 4692, -3006, -2626, 1736, -108, -774, 3015, 114, -5656, 164, 8001, 197, -9421]
1806i421Q798J0582q613j0580P568R301n852o859L798L395j866O91L60n082N61
1821c219R048p41j2258L16J4226M18j4582j383J3477K106j0918k193P278J668
1835C243l055k28j299j844N237M293q234o842J0032Q999j0562j0449R852J0711
1849I854q137r729N805P453l241m172Q22N7J096M258k147q239K374J1555j980
1864E629j3541J185J4019q1j2992p64J0524J154p036r04L071j70J133J641m773
1879a905l706P633N661r351p328R860Q273r373q237P975P239o026n186L938K365
1894A832j895R22L36m269P00P230j143r488J223J0727j005j0924Q48R821p59p777
1910c621Q58N155j585k114K515q48l729L414M975n415n901O563O473o979o243
$$ y = [-9421, -623, 9959, 1346, -9234, -1666, 7635, 1783, -5076, -1278, 2117, 251, 942, 1302, -3780, -3219, 5829, 5088, -7170, -6854, 7372, 7790, -6792, -8175, 5302, 7408, -3510, -5703, 1575, 3243, 188, -40, -1339, -3183, 2054, 6347, -1887, -8729, 1303, 10302, -260, -10709, -857, 9854, 1717, -8012, -2207, 5246, 2005, -2167, -1345, -1288, -192, 4066, 1919, -6320, -3946, 7609, 5629, -7912, -6727, 7292, 7211, -5781, -6545, 3979, 5133, -1903, -2807, 264, 94, 1227, 2868, -1905, -5611, 2022, 7683, -1668, -8996, 864, 9137, -236, -8473, -498, 6741, 715, -4471, -533, 1832, -63, 859, 1195, -3074, -2374, 4856, 3713, -5775, -4552, 6175, 5170, -5754, -4906, 4915, 4156, -3621, -2763, 2392, 807, -1307, 1208, 360, -3369, 45, 5020, -395, -6296, 267, 6740, -239, -6482]
1925f482O683N319n888l614M901J372l912J262K941l835k207O066J760p701j442
1940d777Q479J120q432p24P401J14n859R16L782k258j536L776n40n277K292O596
1956E073l468p440M018P840m104p300L764N967l201l937K646J326k204J529K095
1971B604m390k267O706K641q385l041Q970L411q648l475P604K804n512j794L145
1986C73J35o61K012j625m236L355O436m460q121M689R176m296r276L463Q312k355
2002B921o498J332L744m40o11M4k753j47N775P52q179j630R718K527j0039l400
2018f884R371L767p594l543N242K629k471r95l42j141K737L590m586n738N335
2033f23P700n545q778M970Q875l940p946K572O118j365l423L05L11K63K870l11
$$ y = [-6482, 201, 5520, -368, -3982, 919, 2291, -1621, -359, 2582, -1253, -3460, 2606, 4366, -3335, -4777, 3702, 4822, -3610, -4334, 3067, 3181, -2678, -1762, 2020, -238, -1774, 2002, 1462, -3815, -1523, 5073, 1605, -5835, -1817, 6023, 1919, -5381, -1617, 4350, 1149, -2788, -142, 1184, -1020, 509, 2604, -1786, -4053, 2653, 5294, -3091, -6132, 2838, 6249, -2399, -5874, 1730, 4534, -978, -2772, 373, 508, -153, 1859, 234, -4002, -647, 5789, 1329, -6792, -2103, 7073, 2777, -6499, -3036, 5276, 2921, -3577, -2245, 1499, 1059, 448, 492, -2261, -2408, 3367, 4119, -4060, -5690, 4028, 6555, -3484, -6884, 2487, 6254, -1340, -4883, 359, 2988, 517, -478, -820, -1961, 776, 4366, -220, -5958, -623, 7077, 1532, -7246, -2276, 6599, 2659, -5287, -2715, 3403, 2038, -1385, -1080, -769, -506, 2364, 2053]
2049B053n558k19P811R01r054j667R347K267q434k706O964K337m731j521K304
2064I4J28J52J507k232l440L746N168m633o381M729P134m421o979L680O014k804
2080A462m242J933J990j289N04J084k919j137N057J237o433j540P042J816o949
2095b384j807O166J344m816n92L222o81j446K089k34l449J442M731k287n581K756
2111a527N893k786n618K634M759k336l331K118J492k066O07K119k519k417M149
2126A171K658n137l050N622L082n469k775M659K118l601j004K337m79j063K255
2141A324j28l927R88N337j318o238J293O653j081o305Q64N217o05l579O03J407
2157E05p48P19J369k985k039M470K918n615l541N951M071n657m200M757L783l488
$$ y = [2053, -3505, -3724, 4087, 4988, -4066, -5733, 3614, 5881, -2553, -5259, 1705, 4042, -689, -2210, 94, 222, 374, 1881, -351, -3791, -45, 5123, 490, -5891, -1162, 5972, 1551, -5428, -1748, 4266, 1462, -2780, -847, 1143, -146, 358, 1442, -1477, -2614, 2443, 3680, -2753, -4293, 2749, 4565, -2384, -4191, 1975, 3319, -1497, -2089, 1133, 452, -994, 1095, 861, -2588, -1146, 3585, 1298, -4283, -1527, 4366, 1580, -4038, -1404, 3355, 1019, -2312, -194, 1298, -768, -161, 1958, -561, -2978, 1171, 3829, -1308, -4358, 1264, 4346, -1123, -3898, 761, 2879, -722, -1726, 611, 132, -931, 1324, 1196, -2731, -1743, 3594, 2276, -3962, -2669, 3984, 2903, -3402, -2538, 2679, 2074, -1505, -902, 505, -243, 476, 1845, -1140, -3179, 1291, 4209, -1406, -4947, 1004, 5075, -582, -4782, -25, 3758, 270]
2173B70k681J893J236l75O58q40k673J590M664j952o177J886P058j423p238Q04
2189c300O549j68n122k95L131L64p62j75j577n55L735J435n296k407O134L337
2205E028o218l915N691M058m564l661L111K573j379j083j51p46J342K752k138
2220G00m568K502N784k319o544J847O551j180n865N00M505j08k615o5M68n0J614
2237A157N79l349j382M717K173n339k859N443L213m941l147L845K627k622j502
2252a387J243J56j14J435q21k975J364M205j582n029J510N313j216n010Q85M133
2268B110o25k795N92J250p21L55J197j949j676L057K281l873k637M172K743l926
2284d45k670L408K109k583j244J731r2q66J317K93k594J27L688k76m456K75M677
$$ y = [270, -2411, -518, 718, 343, 1001, 161, -2512, -922, 3742, 1790, -4387, -2501, 4557, 3134, -4104, -3300, 3249, 3081, -2041, -2336, 795, 1159, 397, 222, -1355, -1910, 1825, 3260, -2036, -4443, 1691, 5028, -1190, -5105, 586, 4644, 80, -3581, -470, 2103, 724, -359, -510, -1256, 86, 2838, 700, -3868, -1366, 4418, 2099, -4445, -2598, 3953, 2773, -3092, -2592, 1913, 1805, -810, -875, -407, -457, 1157, 1736, -1613, -2995, 1722, 3895, -1444, -4303, 1140, 4353, -588, -3735, 110, 2737, 115, -1387, -144, 12, -102, 1333, 512, -2463, -1099, 3106, 1524, -3505, -1995, 3318, 2102, -2908, -2023, 2110, 1485, -1310, -718, 532, -189, 166, 1363, -586, -2262, 795, 3076, -797, -3434, 738, 3481, -445, -3115, 293, 2402, -181, -1425, 306, 214, -652, 665, 958, -1636, -1509, 2179, 1903, -2553, -2278, 2399]
2301B399r5m348N6L521j19k389L76J085q58M42J382j576k217K550K828l125l298
2318c386L190L515l011l217K400K597j707j583R93J96l71J325Pk750J88L871k5
2335B232m601k92M948N81m690p50L831R22k714o27J141J45L29P22j740j668K640
2352D09K655l255l466L359L962l009m026K355L639j565k707P32J360Q7J71n05
2368A96j803O19L313n67m336J61N033K62n094p30M553J094l620j086K113Q65n75
2385C98l34q30n45K125J583l118k410L414L308l428l762L008L742k186l278J360
2401i53K292n06r63k19m77N67J948o80l265N84M099j74m546k86M442O46l834q66
2419b191K901O82j545m04K31j88J020R40j962j752K673K444k954k845K765L100
$$ y = [2399, 2304, -2044, -1988, 1533, 1414, -975, -599, 486, -372, 70, 1452, -124, -2341, 209, 3037, -88, -3386, -196, 3319, 308, -2909, -509, 2088, 381, -1202, -209, -13, -384, 941, 948, -1802, -1614, 2257, 2232, -2369, -2661, 2287, 2868, -1822, -2572, 1259, 2181, -533, -1160, -19, 126, 455, 1177, -563, -2231, 409, 3064, -191, -3657, -298, 3664, 655, -3371, -1016, 2623, 1058, -1649, -917, 443, 530, 701, 196, -1607, -988, 2325, 1758, -2578, -2417, 2616, 2878, -2216, -2946, 1607, 2701, -919, -2005, 108, 973, 398, 64, -766, -1311, 814, 2397, -721, -3131, 283, 3591, 163, -3599, -591, 3151, 965, -2313, -953, 1339, 833, -130, -349, -826, -259, 1689, 1009, -2256, -1672, 2427, 2253, -2293, -2579, 1863, 2509, -1325, -2191, 710, 1392, -153, -557, -326, -514, 506, 1446, -516, -2268, 405, 2849, -105, -2950, -185, 2915]
2435B915k404k859J776K199j104j259N03J41p5J042j72k225K17L091q6l518k56
2452b074L693M49l343n48K652L76j646r0O32l66L25J053j163j699J737K314k003
2469B99k784K041K851j844k521J305K012r11j158N72P5k78R46K56j933l87K759
2486A300N13l162p44L254R48k994r29K379P40j522l19N20k04L51R68j105j713
2503a719J516K388j697k887J655L023j338k915R57K299m12j500J40L59M6P93j8
2520F90j848j51K667N20l200q85L335J248l073j445K488J358j614j076O83M98
2536A95J87K99j060j139J551K025j822k694J777L056j433l118R55K868n22k144
2552a019M3J183K83J4l03j167J47K174J39k944m63L244R08l205j283K815J389
$$ y = [2915, 511, -2348, -572, 1627, 523, -736, -233, -92, -167, 875, 703, -1522, -1305, 1786, 1700, -1818, -2074, 1619, 2068, -1275, -1823, 829, 1205, -441, -531, 101, -265, 60, 1113, -50, -1749, -12, 2302, 299, -2485, -444, 2407, 563, -1958, -653, 1359, 448, -710, -138, -63, -341, 605, 861, -1072, -1459, 1300, 1813, -1349, -2093, 1161, 2109, -885, -1814, 565, 1305, -217, -536, -16, -220, 131, 1099, -6, -1719, -203, 2185, 488, -2399, -744, 2279, 941, -1974, -1017, 1282, 870, -630, -490, -131, -85, 708, 690, -1158, -1309, 1358, 1878, -1322, -2207, 1128, 2376, -697, -2142, 346, 1704, 90, -986, -303, 195, 382, 681, -379, -1518, 33, 2058, 236, -2458, -681, 2375, 942, -2176, -1221, 1647, 1125, -1019, -976, 207, 490, 504, 201, -966, -819, 1355, 1494, -1450, -1913, 1331, 2239, -966, -2249, 566, 1955]
2569A955k125j277J239R37k84l64n88m45J235J287j609k041J697K643j553k886
2585b179J194K848p63k388L32J611Q2p41j98m15K74J304l6k110k85K696N85k803
2603i92j012K761J050k172j154J523R42p88m14k8j78O35R59j167j584J383K154
2620A918j290k477J102K445p46k144L29J629j32q17k1k5J0P81J30j516m76K150
2638H50O51k299r50K213J171j914j098J400Q93p81m85K71j39L44O96o74j367Q67
2656c51J860q98k110O28K273m59j974J46J470L4q18j24N1OP09K78j414n45J896
2675F58Q38k048j111K035J286j727j302J207J146o75o46Q9J05L00O48p21j280
2692a198Q52J778p60k164N43K269k41k194k7J788K45j109l19K91L12M76j01j159
$$ y = [1955, -170, -1447, -208, 729, 445, 81, -507, -952, 283, 1570, -39, -2080, -383, 2260, 707, -2179, -985, 1863, 1100, -1288, -956, 655, 737, -4, -202, -617, -343, 961, 925, -1185, -1470, 1226, 1811, -992, -2004, 757, 1807, -365, -1519, 4, 946, 158, -256, -284, -462, 173, 1132, -35, -1619, -236, 1918, 628, -1849, -747, 1698, 952, -1192, -863, 766, 634, -183, -204, -229, -219, 562, 692, -824, -1300, 850, 1501, -798, -1748, 465, 1636, -278, -1376, 24, 917, 136, -349, -78, -217, 127, 823, 149, -1218, -351, 1509, 611, -1499, -871, 1402, 943, -1031, -885, 585, 619, -199, -323, -272, -266, 443, 721, -693, -1238, 658, 1496, -552, -1663, 372, 1658, -69, -1371, -164, 982, 307, -339, -250, -145, 155, 803, 82, -1198, -346, 1432, 672, -1492, -949, 1320, 1079, -1115, -1142, 646, 891, -218, -537, -246, 66, 542, 441, -718]
2710g18k29J634P66k037j035J982J347j744j509J318J422p81j020J32N07L18J74
2727E27p04r23R18J543q15k071P15K210m26k136J8J911K53j377m20P09M53N2k99
2746A38p74K2J298M18j695q18J839J135j766j351J403J407r56j193M16Q00R8k79
2764A42l99m48O97J025p31j617O87J927m71j921J83J783J76j504k78Q85M06k86
2782B56l06l66M4R61K54j410n83J515R58j559j143J255J330r46j184N41Q57j67
2800C07l26k86o7M51O59n43j111M65J495k92j704R0J688J27j419k86R29L25l63
2819A39l75r7N1O51L26j142n22J177R14j245j083J036J259q53j127N12Q75j00
2837C96l99j94j17L72O24m33j104L34J453j99j553l6J517K43j272m56R42M57m58
$$ y = [-718, -947, 687, 1453, -584, -1619, 363, 1710, -34, -1543, -225, 1197, 416, -604, -472, 35, 353, 527, -177, -1100, -182, 1361, 546, -1525, -810, 1400, 974, -1162, -1144, 767, 1020, -357, -777, -68, 385, 437, 138, -636, -614, 684, 1102, -593, -1411, 428, 1563, -203, -1554, -151, 1256, 300, -893, -477, 323, 421, 142, -257, -705, -8, 1017, 286, -1331, -644, 1283, 812, -1109, -926, 857, 1033, -471, -749, 136, 542, 256, -50, -416, -372, 589, 843, -567, -1150, 365, 1323, -236, -1379, -124, 1206, 260, -924, -383, 474, 307, -19, -305, -372, 79, 738, 195, -916, -451, 1044, 752, -952, -862, 826, 953, -466, -752, 177, 502, 139, -236, -333, -282, 369, 695, -447, -969, 208, 1122, -123, -1206, -170, 1089, 236, -891, -379, 496, 396, -3, -197, -314, 58, 682, 249, -855, -521, 932, 733, -820, -856, 661, 904, -368, -824, 118, 575, 117]
2856A17l97p0J57N31J76r01n33J168Q16j116j085J016J224p70j194M28R81l5o15
2875a02k62J41L84M11m09r45M25J249k10j540l4J603K62j398n17J067N88n87n40
2894d14R3L22M67o7p96l16J043O65j116r75J012J185p71j245M37J185k06q28j09
2913d34L74L55J27n14o04M27J012k47j300J0J454J90j310m26J098N85q00n34K77
2932b60M78J62j47n95j67Q45N70j057p93R54J053p69j218N14J118k25r12MM66
2951B1L21j04m29l60M33P55k85j113J75J239J04j160l99J052M86p44n41L29M88
2970B68O0k84l76k6O39L81q54o42Q28Q24o06j068M33J083k08r15LN95K05k58k65
2991a83k25L60N64j63r21N1J085J55j104l04Q99N00p48n14M17M17Nl26l13K4N73
$$ y = [117, -280, -350, -193, 338, 514, -387, -920, 248, 1064, -52, -1137, -121, 1103, 333, -861, -433, 548, 513, -102, -364, -223, 161, 572, 163, -782, -357, 892, 682, -858, -892, 711, 973, -425, -942, 125, 713, 126, -414, -321, 1, 468, 401, -395, -711, 332, 997, -119, -1094, -82, 1103, 332, -913, -476, 709, 503, -325, -434, -60, 295, 422, -92, -696, -269, 743, 496, -804, -794, 660, 850, -460, -886, 212, 797, -3, -537, -260, 218, 380, 233, -362, -529, 316, 886, -171, -964, -10, 1043, 274, -944, -430, 688, 463, -449, -445, 21, 342, 238, -191, -551, -118, 637, 352, -761, -586, 653, 757, -403, -802, 250, 736, -8, -549, -220, 268, 328, 44, -332, -358, 281, 662, -192, -834, -6, 818, 212, -856, -423, 660, 452, -463, -460, 135, 340, 82, -183, -408, -48, 516, 353, -568, -517, 568, 723, -381, -685, 214, 714, -34, -548, -131, 286, 291, -35, -348, -324, 249]
3012B49J96o51n20P21P56n87r76M84J019k46q53j11P26J07k55k87p4L09M84k23
3032B68p98P9R58J36j028l46R41M68p05o52N32N14r7m13k26J88M92J19o75l61
3052f06O10P26o13q37M45R84k46q99j6P20J95m05l57N4L64K83k79o64J72Q48N8
3073E37r35k83R13M64q17n40N01O22k18m74p8K68L22J3n62k49O63N14n88p67M14
3094b80R25k60q42m6Q34J59n28l13K11L22J67k97m42J20O91l5q27j73Q10M32p58
3115a30m90N45N93l45m58JL60K50j78m49p9N10M21n00o77M33P69k17q75Q1P43
3136C08O1m46l04K59L42N7l28l42K07O23m9p38j53P46L51p18m38N11N65k67n60
3157c13P2L47J61j13m10p0M50M13n41n65M03O46k00q12J66O55P0m92k48L23L07
$$ y = [249, 445, -206, -726, -5, 751, 164, -812, -328, 691, 445, -408, -519, 207, 314, 59, -228, -302, 7, 491, 268, -530, -451, 507, 643, -385, -731, 210, 678, -27, -679, -147, 367, 270, -143, -369, -181, 311, 430, -245, -606, 4, 730, 117, -720, -275, 709, 463, -436, -452, 268, 463, 58, -299, -245, 119, 402, 123, -541, -369, 479, 537, -398, -681, 232, 696, -121, -661, -160, 462, 244, -230, -308, -40, 282, 295, -267, -516, 147, 661, 73, -694, -280, 645, 385, -457, -503, 331, 490, -38, -351, -140, 182, 349, 52, -390, -270, 421, 386, -441, -614, 196, 628, -130, -620, -75, 518, 173, -285, -284, 76, 326, 148, -301, -380, 130, 551, 51, -626, -193, 576, 359, -516, -435, 308, 369, -77, -381, -122, 220, 277, -51, -393, -186, 437, 388, -350, -503, 243, 594, -124, -562, -51, 514, 247, -313, -241, 106, 267, 154, -256, -326, 124, 537, -4, -569, -166, 480, 280, -532, -366, 289, 359, -133, -381, -58, 249]
3178B49k2l26k23K26M70q1o44m5O49K78o27m60N98M47k79n69J09L97J42k64l01
3199b76M3L99K21m68m30L67O02k12o94J09O89Q4n35k87M09K67j04l25j65L12L44
3220C50j37n73L9O31J64o38l45N13M72l58n07J89L34J02k65k73J44L80L8m26k38
3241d04L79M37k49o04J54O30O9n82j98L58L64k29l27o1L05K59k12l98O0M93J16
3262C60n41k89M47M35l01n15K43M15ml62k05K63K75J6l63j96L29L75k32n10J48
3283b12N61J9n91k00M62K55k33l12K1L14J81k17l52Q3M95K7n08k17M34L76k95
3304I1m67K20L61M1l67q0J35L66m7m03j80L99K95l16l42N9N83o5m98j11L74K54
3326C02k59k91O6K83J04j50l90J08M96om30j41M41K36l45l40K20L70o8l34p7K44
$$ y = [249, 227, -99, -322, -96, 374, 293, -351, -396, 253, 531, -96, -556, 42, 489, 210, -359, -250, 147, 289, 25, -276, -233, 166, 387, -81, -511, -144, 458, 246, -448, -339, 350, 434, -101, -388, 21, 288, 184, -141, -306, 6, 350, 213, -360, -321, 310, 474, -164, -509, 4, 476, 118, -389, -200, 134, 236, -29, -302, -158, 222, 260, -166, -404, -25, 412, 163, -441, -287, 343, 412, -170, -368, -10, 354, 125, -202, -263, 42, 301, 89, -309, -249, 244, 360, -181, -470, -23, 412, 111, -404, -161, 254, 250, -112, -317, -54, 221, 237, -126, -322, 7, 382, 150, -360, -212, 349, 368, -223, -423, 39, 294, 61, -251, -230, 84, 265, 48, -304, -221, 274, 301, -207, -424, 10, 386, 91, -376, -156, 205, 246, -121, -201, -66, 300, 253, -150, -330, 69, 364, 48, -294, -235, 348, 283, -215, -326, 48, 302, 43, -248, -182, 101, 205, 55, -335, -227, 269, 263, -167, -308, 133, 369, 24, -316, -96, 274, 206, -128, -205, 39]
3348C9K10q2l50p3L48K44l36l67K51M15q2m89j22M60K36l05k37L6L33J16l16k40
3370c11J80L87J3m50j02L94K94l72m26K72L44k3l80k0K50J68j24k96J9K76J78
3391B71k38l07J43L76q7l90k4L75J70k58l14K05K54O0l13j98K45K82n0m03q2M70
3413A87R1l06k93K00L64j10l51n9L25J81j71k61O2K89J01l16k18K21L58j11m03
3434b20n8M57J24l37k05K42J96n7k39j01J95K21q0l61l0L79J12l58j41J47L59
3455B45j49k96oK97J00j44k13M7K78M3l58p6K24K90j39m04N4L52J12l77r3J55
3477e8K53m4k53r3K36J36o8l28K4L02J34k92j87J79L39j57l11j3K89J32k37j60
3499a77J15K37L4k63j90K09K81k16k21kL38P1k74j73J36K25%k56j31K60J39q1
$$ y = [39, 249, 167, -183, -256, 92, 336, 0, -367, -116, 299, 217, -272, -394, 66, 302, -3, -240, -204, 129, 245, -71, -311, -131, 256, 269, -181, -283, 111, 405, 33, -393, -121, 223, 200, -180, -200, 50, 218, 94, -202, -183, 93, 271, 33, -274, -131, 245, 158, -232, -256, 119, 289, 31, -283, -78, 176, 236, -77, -275, -30, 252, 202, -201, -283, 187, 278, -28, -321, -121, 243, 133, -218, -277, 48, 229, 58, -203, -141, 148, 249, -67, -285, -64, 294, 183, -220, -278, 179, 303, -34, -239, 3, 199, 142, -97, -198, -3, 218, 138, -223, -253, 126, 238, -120, -261, -114, 245, 96, -200, -206, 91, 191, 47, -166, -119, 159, 202, -156, -232, -8, 282, 143, -261, -207, 145, 257, -120, -213, -58, 195, 151, -102, -195, 41, 177, 109, -219, -195, 107, 241, -51, -238, -59, 280, 123, -188, -201, 88, 220, -17, -177, -62, 175, 209, -54, -244, -35, 246, 30, -191, -193, 145, 216, -58, -231, -95, 130, 130, -126, -257, 3, 142, 61]
3521F1l09J01L02N6l06j65K65K45j22l53J18K33Q4k31j97J32K16M8k91j62K30
3542d5K73j76l13J00L41ll06j28K35K38j03l01M8J87J61j67k57Q7L19ok80j20
3564b16K29K17j98k24R3K33R3k94j55J62J68O1l40l5J98K06j33k50O3K33Lk01
3586h7j62L06J25j37k12L8K12J05j81j69R2J80P3l59m7L08J11j81k63J48K13O7
3608A80k47j36J33K18o5k06j00K33J08r5k20J35K72q1k60n2K37J63j44k27J6J94
3630E6J42k18j78J51K33n9k91kK26J09k21j79J58K06K8k32n0J18J39k4k60n4K52
3653E0O8j47j08J36J98r1j57q8K17N9o7k20P9J47M6j61j73J74K01o0k09q1L01
3676A14Q0j93k04K23J15j4k20o3K26O6l4k34j9J90J38k10j51J90J81n5j98q1K17
$$ y = [61, -248, -147, 155, 211, -95, -260, 5, 250, 128, -225, -107, 126, 210, -21, -218, -86, 130, 178, -113, -275, -45, 228, 52, -261, -161, 180, 177, -129, -257, -22, 216, 113, -188, -140, 47, 208, 41, -216, -129, 190, 184, -96, -216, 13, 230, 32, -192, -99, 134, 227, -67, -222, -60, 108, 169, -171, -206, -8, 198, 65, -185, -122, 111, 114, -87, -249, 57, 182, 45, -167, -129, 83, 188, 7, -162, -70, 110, 183, -176, -223, 85, 196, 15, -248, -100, 113, 180, -67, -203, -70, 148, 83, -123, -223, 10, 118, 23, -197, -62, 210, 129, -131, -183, 54, 217, 73, -154, -138, 56, 198, -20, -198, -47, 186, 127, -164, -166, 60, 169, -52, -231, -73, 133, 161, -71, -121, -3, 136, 112, -148, -202, 50, 118, -29, -137, -1, 197, 106, -51, -139, 78, 137, 70, -150, -71, 76, 122, -39, -212, -38, 163, 103, -106, -187, 114, 194, 1, -203, 20, 135, 121, -99, -162, 64, 130, 96, -138, -157, 33, 171, -39, -190, 0, 181, 126, -72, -153, 64]
3699F4Q3j56j80R1J81O0j99j07J85J12q6k27K8K91L9k56m7Q8K00p9j80o1K05J49
3723A98j12j78k3K44L6k17j10J91J64j40k45K4K11Q1j79o9N1K18l7j46j01J50
3745A1J73j15j72M2J69N4k27q6J04J95j12j38rJ83O1j61r3QK97j03j20r9J34J62
3769A58j38j67M5J92l7j30q5J78P0lj46p0J72P8q9j57N3J67J7j84p7J57J55j42
3793A7j22L4J82K3j35p8M2J41Mj94n0J79J12j25j79Q7J80l3j00n7P8J20m8j71
3817i3K9J64Mr2j26L8J79j3j97l7J30J46p4j84R5J12J5j22n2O2J08j5j49p4J93
3842D7J59k03j90J26J97m1j55n7J51R6j07j10j6J22R6r5j20M7J62o1j77%J45J23
3866A39j87p9P5J41J3j08j07J49Q1k6k03L9J45N7q6k18J34J89j10j62NJ45N0n5
$$ y = [64, 147, -9, -189, -98, 83, 143, -56, -163, 22, 134, 48, -179, -151, 140, 179, -77, -124, -36, 164, 85, -95, -156, 49, 198, 86, -92, -115, 129, 165, -52, -162, 29, 193, 53, -192, -168, 43, 124, -55, -124, -73, 145, 108, -38, -139, 11, 184, 69, -103, -61, 108, 162, -65, -151, -47, 148, 36, -102, -111, 72, 133, -28, -121, -113, 184, 81, -39, -138, -4, 158, 20, -147, -102, 90, 53, -77, -162, 16, 86, 83, -63, -133, 39, 117, 28, -129, -76, 91, 108, -76, -153, 4, 159, 17, -105, -71, 111, 134, -1, -79, -37, 104, 108, -86, -136, 43, 155, 30, -149, -62, 118, 85, -15, -72, 6, 126, 78, -93, -64, 100, 104, 12, -114, -76, 103, 90, -107, -144, -14, 132, 58, -126, -31, 81, 96, -26, -78, -16, 92, 77, -72, -146, 47, 206, 3, -187, -61, 136, 95, -60, -117, 34, 130, 23, -87, -103, 19, 115, 20, -100, -53, 109, 48, -129, -129, 16, 139, -48, -127, -52, 89, 102, -6, -113, 36, 117, 91, -112, -73, 72, 129, 43, -175, -41, 148, 38, -124, -119, 26, 76, 21]
3890B1j40J04RJ12o0k22J72P1K0j91J1J81N8j53p9K0J63o0p5o8J19R7p9r4m1J58
3916E4Q0j62p6Q6J13k3k19M1J34O4p3q2k4J32L0j60K1J6J36o5j63O3J32K8p1j29
3942a17Q2J57j29n6nJ01K2o2r4RJ68N1j81j18J40J82j27j10J3Q3J09j70o7J34
3966A5M4Qj39j1P5J35q5j45M5J44M3j44q5R0P9p3j4p0J41K7q1j57P5J51Mj43n7
3993a28J36J18r7j17J3J36Rm2p5K8O4J3j01n3J28J11p3j63k0J49P4j64q7J61J03
4018A23j28p3oJ05O0p4j00K0J79l7j31n1J02J01m6j87O5J65J5j30m1P0M8k2j07
4043h0K1L8J30j08r6J6J47pj16j34K12N1p9r7N2N1J02j03q4P1Q0j3k4p1J15K8
4069A02o3j61M7J60J6j60m0R9K9L0j51L9N9Nmr9L4J39J6j82k5J19J19j68m9J18
$$ y = [21, -119, -15, -6, 106, 46, -176, -4, 67, 87, -104, -93, 88, 146, -7, -86, -66, 97, 37, -38, -106, 13, 110, 31, -63, -104, 54, 134, -28, -104, -18, 95, 72, -147, -106, 28, 92, 19, -63, -87, 45, 75, -85, -64, -48, 88, 23, -140, -77, 55, 83, 12, -117, -35, 122, -7, -63, -68, 33, 55, -7, -101, -92, 76, 127, -54, -172, -32, 150, 23, -87, -74, 9, 118, -52, -119, 15, 59, 67, -72, -83, -8, 127, 42, -103, -58, 86, 129, -15, -100, -10, 69, -4, -18, -88, 53, 80, -1, -158, -83, 68, 72, -71, -128, 8, 126, 29, -88, -75, 61, 70, 28, -47, -19, 45, 58, -43, -96, 32, 143, 70, -93, -113, 36, 110, -54, -141, 20, 123, -5, -78, -84, 21, 81, 7, -93, -73, 106, 69, -62, -113, -11, 90, 44, -143, -78, 87, 102, -28, -69, 1, 49, 27, -80, -59, -21, 109, 1, -95, -79, 68, 61, -55, -189, 23, 74, -5, -102, -50, 1, 103, 0, -84, -13, 67, 54, 30, -41, 74, 102, 39, -122, -75, 85, 101, -59, -99, 0, 29, 59, -92, -53, 6, 11, 7, -92, -58, 81, 97, -85, -110, 9, 128, -40, -89, 29]
4095B9M5J6j03p0Q9J03q8m1n3Q0Q4r4j34Q7J33rj31m7J43l7Mq2L1J08j1m9o8K0
4123d5J11k9q7l3J49kl3p5M7R4Rj70K0Q3K7lr6m2J32mp0j11Q6J35k7j24n4J58
4151D6Pn3n2M9N9K1j36LN4R1Lj02k7J68q8p3p8P6N9J1p9j0JR0k1j12Q4K3Q0p0
4181B4q5O4J21m9j73P7P7Om4j0m4R2M2j21m5J05K7k7j02l6J22N4j26o3R4J15p5
4208B0p9m1J38O8j57k0Q9K8L5j41m5R8P4k6j01L5P4N2m3q5k2J56q2k6r5O6Q3j06
4236e3k3mJ65m3j06r1Q8J84o1j65L2P9M6pn7j4J00k4n4o8J26P6p5j45L2J06j7
4263B7q2n9J12M4m5r3O6j1J20p0j07M6J20l4j02l2J45L7j13l8M2P5L9j08rM2n
4290Gk8Kk4K1J24n4j30L0J66p2p1p0P8Q4l1j12K2Q9O0n1p4lQ3M0j16j08J64N6
$$ y = [29, 74, 90, -13, -83, 6, 109, 21, -20, -73, 7, 91, -3, -137, -50, 83, 74, -57, -104, 39, 2, 6, -76, -45, 63, 52, 3, -65, -45, 66, 37, -50, -83, 66, 64, 31, -44, 3, 97, 106, -64, -44, 39, 66, 63, -33, -75, 57, 53, -17, -128, -42, 93, 66, -58, -112, 46, 53, 0, -52, -3, 56, 77, -59, -56, -2, 89, 92, -10, -37, 131, 43, -30, -108, -32, 27, 38, -41, -51, -50, 40, 19, -93, -9, 14, 94, 24, -61, 3, 124, 75, -98, -21, 56, 62, 18, 8, -36, 56, 98, -23, -68, 37, 64, 37, -65, -101, 21, 75, -51, -114, -20, 95, 20, -59, -100, 38, 106, -51, -71, 18, 46, 81, -60, -105, -7, 67, 41, -60, -25, 49, 101, 58, -27, -49, 107, 25, -1, -96, -30, 53, -53, -76, -80, 85, 42, -64, -155, -67, 117, 56, -109, -77, 2, 48, 41, -16, -30, 70, 46, -8, -76, 50, 126, 51, -94, -62, 44, 27, -55, -114, -2, 42, -3, -96, -30, -41, 79, 9, -98, -52, 68, 34, -68, -100, 45, 82, -31, -69, -27, 48, 87, -21, -30, 12, 7, -21, -19, -43, -22, 102, 48, -82, -52, 114, 42, -29, -99, -21, 63, 32, -80, -58, 31, 91, 40, -34, -37, 46, 86, -30, -138, 26, 82]
4318H2l5p9n9J65j5n4l8N1L3J6n5p5M6L7j6j07K2J83j8j36LO8k4J3l4KK0L6J2
4347D4p4j6J08K4j06o7P7Q2j08k9M7L6qon6j5L8L3l7n7O3O5m3j22N8J88p8n2k9
4376d0K9P1m3o8L4Q3l3k9oj6J13k0j45M5nQ6l6p4J9O3%o0m0R0Jj3l4k4M8P9p8
4407cp3M5P0K1j50L0O0M2rp4N1L1l1K6p8M7rO9j15LM5R2p1j05J04L8m3o0k3R9
4437B9N7j10M4k6J7K6K5j15L7O0J2j28J2J26lp0k8kR1k9m9J1m6J25j21J5k1Q9
4465B8O7j12r4J27L3m2j8RK4K9k4o7K2N2J5l9r1R5J8k8q8P0J06p1r8P4mO6pl9
4495A3o1P7K1l9J3m6P8k3k3n7P0N1l4n8rP1L7q9j7J6K1K2o9m9L1R9j6q2NO4Q3
4526A00j30m8Q1L5k7l8l3O9J9Nq6P9J6P6j55k1P0Q0p9n8k8N4Q3j15J2L0O1n9k0
$$ y = [82, 47, -32, -91, 74, 59, 5, -33, 18, 51, 67, 12, -63, -17, 20, 4, -103, -81, 102, 84, -52, -49, 19, -5, 8, -26, -24, -4, 32, 44, -30, -46, 62, 86, -20, -87, -10, 72, -36, -65, -18, 18, 10, 4, -52, -67, -29, 4, -33, -90, -27, 38, -5, -127, -69, 119, 41, -11, -40, -11, 60, 17, -51, -17, 66, 33, 4, -2, -18, 95, 75, -70, -25, -30, 56, 20, -54, -35, 28, 28, -32, -72, 18, 19, 6, -28, -52, -4, 75, -3, -76, -31, 39, 60, -90, -60, 0, 42, 33, -41, 10, 41, 10, 36, -42, 5, -4, 65, -50, -47, -2, 90, 19, -86, 18, 56, 13, -47, -70, 29, 86, -24, 20, -6, 11, 37, 62, -53, -16, 44, 56, -72, -60, 66, 63, -7, -35, -37, 54, 25, -24, -13, -59, 66, -55, -40, -61, 28, 95, -17, -111, 16, 49, 7, -11, -2, 22, 51, 27, -40, -18, 34, 49, 10, -81, 14, 32, 4, -84, -14, 92, 21, -77, -3, -7, 59, 52, 13, -48, 29, 50, 11, 24, -22, 56, 33, 10, -47, 23, 74, 40, -18, -27, 44, 81, -8, -25, -9, 12, 34, -35, -84, -53, 46, 30, -52, -47, 17, 100, -30, -78, 3, 38, 11, -27, -60, 9, 28, 33, -53, 26, 42, 118, -37, -58, 12, 92, 13, -45, -73, -19, 64, -51, -39, -9, 52, -7, -27]
4555b7k2J6R6r1Mo2J32Qj21K0M8K3jp6J6K7O6j16K6K4K3L2r9L5N9l8j3l3j3J28
4585G1Rr9k4L3L5k7n5N6j0N8k6o4K5J18q6j5p7P1N8n9m0j5L3K7n1J8NL2Pm0j4
4616d6O8J7k5q1K7O1qo9J7N0L1Rp6J7K1P3j10m0N6R8j01l3j0R0l3Pm1J7jP2q1
4647b4k7L2M4L1m6j3PK2p9LKR7n9o1M6O7n2P5j05L9JL0n0k4P5J6l4n8OL4jRPl5
4681b5M1j5o6K5L0NO6q5j8lQ1j4o7RO4L9j08KN6k4K0ol5K9L6l8rK0K7l3l5J5P0
4714E4j7m7l8KK6M7p8k9J07j6N1j27K7O2O1o6o8L7N8o1k7K7L0J2n7rK1Pk0qO7
4745B8o9Q1o0n0K2R2nl8o6L4oM4J7j04R4n9R4r7M2K0K1q6l6L4J01j1j19L3N0j6
4775a5m5L3k4mN6k0J0K9N1j2j16lQ2m0rOL4K8o0qkL7m9N1n7K3M5nq9M1K3Oj5O
$$ y = [-27, -49, -33, 63, -28, -24, -86, 46, 54, -67, -47, 1, 24, 23, -53, -37, -10, 56, -60, -34, -10, 13, 45, -54, -19, 40, 2, -11, -44, -57, 71, 80, -19, -43, -10, 25, -2, -57, -1, -11, 47, 21, -43, -18, 100, 14, -1, -78, -7, 51, -8, -48, -63, -30, -3, -54, -36, -31, 1, 8, -32, -46, 22, 39, 14, -67, -40, 21, 13, -56, -39, 11, 42, 51, -25, -8, 13, 86, -24, -64, -8, 90, -11, -44, -54, 36, 3, 10, -31, -14, -15, 57, -24, -51, -19, 25, 56, 10, -3, 4, 26, -53, -50, -48, 49, -10, -71, -25, 42, -10, 65, -40, -1, 0, 30, -20, -44, 31, 47, 13, -45, -39, -5, -6, 3, 10, -25, 16, 1, -65, -40, -10, -5, 61, -24, -42, -45, 36, 22, -45, -36, 28, 67, -41, -39, 17, -7, 13, 7, -28, 1, 37, -1, -10, 10, 37, 4, -31, -16, 54, 37, -10, -48, -46, -20, 27, -51, -80, 27, 11, 62, -65, -38, 24, 85, 19, -49, -12, 46, -15, -42, -15, 15, 27, -30, -39, -18, -11, -31, -39, 28, -41, 40, -20, -70, -48, 44, 39, 1, -65, -31, -37, 7, 24, -80, 14, -45, 49, -48, -6, 14, 35, -51, -87, -53, 48, 37, -82, -49, 1, -15, -60, -27, -51, -55, 1, -19, -9, 20, 71, 59, -57, -60, 22, -18, -27, -21, 13, 41, -19, -27, -29, 8, -41, 10, -47, -24, 21, 16, -73, -32, -9, -3, -18, -12]
4809a2kJ9J5k0%pOj3j4OJ6O2n5k9m0N7N6p7j5ON2j9k5mN0oj6mJ0L4j9n4l2P1K9
4844B6k0k4k5Q0l4l5N4Qj6Rpk3pK9Rj00M6K9R7j73mJ21m2No3RQ7qj1k4m0M4Nj0
4878hK6J8m5j5M9l1N8l8Jpk9R8r1kj0J6Oj8j8k2M9Ml8K1J0J0K5l2K1m0M8o4kR6
4912D6n3P3l0m2L7m7Nl0LL2l0j9jQ1K0l1l4K3l1N0L0q5K6K2J1q7PO6L0k1l1M7
4944C7%po1QO7k1k9j8OL7Q0q4n6kL1K4k7J8K5ml8k6lJ03n6M4o6n8Q9N2q3m5R2
4977B9k1J6j00J08J3J3k3m8j2K0kpMPM5o9K6lk9O6j24L2O1j1l5j0K0M0K5p0M2
5008CL2j8Pr3M2P4l6k8l1O7J7J2j15N3Ok7K5k2j1J3L4j5l7K5M0j8jRPK5p1j6M2
5041fk1OK2n3O4M3r4L0mQ6j8o2m1K1K1J0m6K0L1L7o9J7l7J04m3j9l3lP6p7L6K
$$ y = [-12, -14, 5, 20, 0, 0, -7, -1, -14, -28, -22, -6, 56, 1, -28, -68, -11, 45, -32, -47, -41, 11, -8, -33, -37, 13, 7, -9, -13, -3, 31, 12, -42, -74, -3, 26, 6, -18, -43, 37, 3, -32, 22, 30, 14, 23, 16, -7, -14, 15, 24, -76, -30, -1, 96, -77, -81, 40, -2, 3, -60, -51, 36, 28, 17, -7, -47, -3, 2, -8, 18, 36, -9, -24, 25, -6, 52, 14, 15, 8, -21, 77, -14, -16, -26, -10, -4, -22, -40, -62, -13, -9, -47, -26, -16, -6, 19, -13, 8, -32, 16, -48, -50, 46, -7, 66, 36, -6, 31, -16, -11, -41, -38, -6, -36, -55, -56, 25, 45, 14, -20, 3, -28, 22, 52, -33, -7, 15, 26, -61, -54, 12, 42, 21, -10, 37, 37, 30, -31, -23, 44, 23, -6, -24, -18, 19, 99, 15, -41, -43, -12, 12, -15, 3, 28, 24, -14, -40, -43, 60, 4, 48, -18, -76, 13, 65, -18, -63, 29, 8, 24, -76, 32, 45, 58, 35, -13, -25, -5, -7, -14, -10, -3, 42, -27, -1, -4, -33, 33, -91, -59, 2, -9, -44, -54, -34, 6, 31, -39, 3, 35, 17, 24, -69, -27, 47, 11, -17, -48, 19, 36, 48, -67, -14, -8, -35, -10, -32, -43, -30, 4, -11, -48, -23, 17, -1, -2, 7, 14, 39, -32, -48, -6, -27, -21, 1, -52, 12, 55, -39, -9, -13, 73, 55, -7, -48, -27, -6, 4, -42, -22, 9, 46, -23, -6, -43, 61, 18, -1, -34, -37, 39, -38, -2, 0]
5073@j0L7k4k1O1p3L9m6K2K9M3j2q0K6O7j7p9K2jK9oJ8n2O7%p4M3K5J3n1L2mJ6
5106C9l4j5j3L7Nj6Kj8l9J16j4l7m8P5l6n6N1k1j3O6k8oJ2K5o0jM0J9k2L6m0p2
5138f6O2K8k8o1L9K0J3%o0J27j16n4Q5L5J7p1K4K3m2M8p5N9l9LR2r2k1O3M6r6
5168c7O3l0J0K4l1Jj5N3j4n6k7M2N1k1j5l0M9n0K6j8L0J5l3k1j9M0O3k4q5N2L9
5199C2n2j1R1n2j6j4k0K1NK1l3L3j0OrKoK1kq8N4R5k4m7Jl5N4N7j20P5o0J5J7
5232Aj6k1M6lOk9N0n2L6J0m3J7jO0q7P5l2J7j6j3n4K7M6K9k3on8P0o4J6J3L9o4
5265b4OqJ5jJ9Pn1M3j8l7N5K8l0l1JK9mK2q6L0J5P4J7o2J3o8R1l1o0N0K2%n9k4
5299e7J26rp8jK6JNr1O4L7Rj0o9O7j2L0p2n2J07j1j3k0N0l5K4K6m9J2M1p3lmL3
$$ y = [0, -10, 27, 3, -18, 43, -30, 9, -37, -15, 14, 57, 45, -35, -9, 58, 41, -38, -16, -17, 12, 6, 24, -28, 39, 39, -35, 8, 33, 46, -5, 27, 23, 39, 5, -10, -23, 14, 19, 3, 5, -13, -52, 64, 50, 13, -35, 40, 4, -52, -1, -22, -35, 31, 3, -3, 9, 34, -26, -27, 13, 32, 10, 46, 6, -66, -4, 24, -4, -65, -26, -6, 7, 7, -53, 74, -42, -96, -11, 24, 41, -30, -6, 17, -25, 23, -52, 7, -32, -29, 63, -29, -50, 13, 59, -37, 26, -4, 6, 30, -1, 0, -15, 38, 24, -32, -59, -17, 34, 13, -2, -32, 17, -33, -7, -25, 5, 20, -13, -34, -53, -13, 50, 26, -59, -7, 32, -20, -31, 60, 8, -8, -22, -42, -21, -16, 5, -28, 5, -5, 1, -8, -6, -12, 9, 7, -81, -27, 68, 44, -3, -2, -37, 17, 74, -46, 29, -31, -16, 1, -15, -36, 10, 7, 13, -16, 34, -18, 18, 28, -15, 2, 1, 61, -26, 49, 17, 34, 18, 5, -49, -22, 24, 53, 30, 24, -34, 36, -28, -12, 1, 40, -24, -18, -26, -11, -12, 7, 14, -37, 6, -12, -49, 6, 34, 4, -27, -26, 3, -1, 21, -65, -35, -20, 54, 71, 9, 22, -46, 45, 14, -46, 4, 26, 26, -33, -57, 69, 60, -18, -19, 7, 8, 13, -78, -14, 23, 32, 22, -47, 20, 8, 38, -34, -86, 21, 10, -3, -23, 27, -8, 16, 42, -7, 5, 46, -27, -30, -34, -1]
5332apK0pOM4l4m0l3P6q6j1N9J0MJ0J9o5%L2J4l2L1M5J1o4p3O3k9M7k9QjL1j3
5366Epo5P5nN4m5j1J9j1qj6K7Qk8j7lL1j%k8J1K2mK1l3oJ7K8n8N4m0mLM5n9nO4
5403C0o1P7r6P7j7qJ3l3O6o4N5j9j5J9m8JL2MM7r6QR2r7j5N2l4K9k9j1O5Kk9L
5436@m6M9N6j10N2k9J4J3L4p8J7N0mm7OL4K9n1pj5L1L2l2k4l3K6P6m1J4l6J0n
5468a5%N8k4m3J1j3n7J37k2Mjm2J1J1j0%l1J5j0k2P5L8r8N3lj9l7L6J6k2nNJ6
5501A2j4K3j6J7o1J3O3p9J6%P4j2l3j6k2NK1O4l6l4L3l7k3J1N1j9m3J03j8m9%
5532f%k9N7Mk7K5o2K9J3J3m1J7L5k5nO4l3l8l0K8M8q4R8r1k9Q2%m4k7%J08o4K
5565a2j7K4P9n2n9J3LJ3NkKNL6j3m7j1JM0j3Pl0j1K2k2j8K8M8l3m1O0n1J0J9l7
$$ y = [-1, -8, 12, 5, 11, 55, 21, -19, -52, 24, -62, -73, -14, -4, 0, 10, 29, -36, -36, -4, 10, -22, 9, 54, 65, 1, -72, -9, -38, 9, -20, -12, -13, 18, 5, -2, -67, 8, 3, 57, 12, 1, 20, 9, 1, -15, 12, 20, -8, -25, -28, 3, 2, 2, -26, -15, 7, 3, 24, -9, -15, 2, 30, -28, 26, -14, -18, -15, 30, -29, -34, 30, -31, 46, -50, 27, 10, 2, 15, -18, 48, -16, 39, 20, 5, 24, -24, -23, 9, 13, 60, -36, -28, 64, -33, -48, 4, -30, -1, -30, -41, 24, 26, -3, 0, -46, 3, 59, -51, 1, -28, -14, -1, 33, -45, -28, 22, 18, -29, -23, 11, 40, -11, -18, -33, -2, 30, -2, -26, -59, -33, 43, 2, 16, -20, -10, -15, -15, 43, 19, -24, -13, -26, -83, 54, 32, 36, 35, -7, 4, 15, 5, 5, -26, -11, -21, -43, 32, 70, -28, 25, 22, 3, -34, 2, 18, -4, -9, -4, 12, -2, 21, 5, 22, -39, -26, 37, -42, -26, -26, 48, 36, 3, -13, -35, -30, -9, 55, 19, -15, 18, -19, -42, -31, 20, 1, -42, 61, 43, -6, -6, -6, -35, 22, 26, -1, 24, -38, -9, 4, 17, -24, -7, 28, 3, -2, 62, 29, -9, -39, -11, 37, -47, 51, -40, -69, 13, 13, -31, -58, -58, 50, -14, -12, -29, -5, 74, 22, -37, -24, -21, -8, -3, -5, -3, 2, 38, 25, -22, -33, -32, 8, -5, 2, -28, -39, -17, -39, -57, -29, 19, -14, -55, 5, -46, -36, -17, -54]
5599e4J12p5%Rk5J1m1R4l1L3n0K6nk5J5J5q3L0N1l2mM9j6Lj0k2J8K0m3M2j8l1
5631c7N9K4n7jnL5K2n8O3r1P7n0pk0oN0j9K9j03P0O0r1K2K4N7j8j09O6KJ2L6o1
5663b5l8O8P1n3l9k9O1l5k6n6J23L1o7k4Q7l9n9J3lM7ko2P5m1Q3p9M9l9J0J8n0
5694c0K7J1K1j1j4j5j0Oo%M5Qk8j0rOK2km6N3m3K0ml9P2l2QJj0P4j16R0n2QRn
5730al3M8J2l5J5q4P5J8l4M6l9P6o9l0M6j4J3k4L7m0K0k3P5n2j7qQK9l2JM8l5
5762cJ2k6J3l0K6Rl0PL5m0kJ7L8J5m6M2No2K4J8k6k9L4j7K2nJ4l3pk9Q0l8K2k7
5796a7j5M1j7M0n4N6n4M7oo3o5J45l3l6nN4m9L7Jrl0P1p2lK3L2l6k1N0j8J0j8
5828a4l8N1K9k5M9r9Q3k6J8l5j3M2l8K0o0M0P1m9l2N0n0j0N1kl7J0K6l0N9r4Q4
$$ y = [-54, 58, -17, -17, -8, -33, -22, -63, 31, 0, 33, -17, 9, 4, -21, -6, 9, -74, -44, 7, -25, -29, 20, 4, 7, -3, -25, -7, 13, -30, 12, -6, -37, 22, 46, -11, -12, -17, 18, 40, -18, 45, -46, 31, -19, -26, -46, -52, -2, -21, 8, -95, -25, 35, -56, -34, -10, 47, 29, -80, -14, -12, 0, 36, -25, -63, 5, 76, 23, -16, -45, 16, -19, -45, -101, 22, 53, -14, -38, 49, 10, -49, -36, -39, 8, 6, -56, 19, -22, 61, -18, 31, -8, 2, 20, -30, -3, 8, 29, 18, 4, -11, -21, -15, -21, -21, 24, 32, 4, -6, -15, -9, 13, 11, -35, 18, -25, -5, -9, -48, 24, -8, 0, 1, -9, 65, -51, 39, -13, -5, 4, -1, -34, 14, 26, -9, 6, -78, -3, 15, -19, 27, -12, 64, -5, -35, 11, -3, 10, -14, 23, -17, 3, -20, 55, 3, -14, -22, -14, 15, -17, -16, 32, -3, 9, -17, -4, -34, -8, 1, -29, -22, 13, -27, -29, -12, 26, 41, -5, 37, 42, -20, 4, 22, -4, -33, 1, -16, 6, 1, 15, -18, -25, -54, 26, -12, 10, -17, -32, 9, -8, 32, -22, 34, -20, 27, 21, -42, -107, 38, 5, -31, -36, 18, -31, 6, 7, -2, -32, 39, -33, -36, -13, 19, -17, -38, 12, -6, 4, -14, -52, -1, 28, 3, 52, -47, 36, 10, 28, -7, -20, 22, -16, 4, -56, -16, 55, 6, -26, 24, -26, -36, 15, 13, -24, -14, 12, -18, 41, -53, 31]
5859C1J8p3n0N9R7j10K4J8l5j5mO2Jj1n9O0m5R4j08L9J5m5M5k5Rl4P7k2kK1l0
5890Bj1j2PO6On5L0q4J3N2l8N5n7K4qK0l2j0J06m7p0M0O2k0q3K4N0Mn8N4%k9j2
5923a1j5K4L5m2K8o5J7J6M3k5L0o0K8lK1J7j6L7p5oN3m3QK6J7k8Lm8L9Q%L3J0
5956E6p4j5JK6K7p7M7K3k3l9K5O3Po8Nj4L4j2J6m6pO1K6n5j4j5L5MQ8m5m4k8q
5989d0N9l3L1nJ4l6l8P9m6l2O5N6j12K3K0m1J0J1N3p4K6oL0J5r7N4N7n1J2K6L9
6020F9k4k9O4r6K2MRJ9MPq0J7J7L1r1J2Q7n6O6Jq1M4l7M4k5j4l5J5L3Pk1k9M8
6053BJ3rN7n2rn9P7o0M4j0L6l7M0Nm6jk9O5k5l9O4L1l4n6M1lN0m1p7P3r3J08r
6086A7l3m0P5L1m1m2OL5p2K7J0O8n8j9L6K0o6PM4k1J3k8P8k0K6j01K0OK2N3p1
$$ y = [31, 49, -24, -74, -15, 82, -28, -4, 14, -21, -36, -40, 22, 23, 12, -47, 13, -32, 62, -46, -7, 8, -37, 8, -17, -8, -42, 35, 13, 11, 32, 2, -9, -21, -14, 52, 58, 3, 33, -51, -38, 14, -24, 31, -26, -2, -10, 10, -22, -32, 74, 27, -43, -3, 59, 39, -44, -20, 30, 34, -24, 30, 30, 1, -11, -26, -2, 33, -9, 19, -46, -29, -13, 30, 5, 35, -25, 3, 0, 21, 38, 22, 59, -16, -22, 31, -12, -4, 22, 39, 11, 14, -34, 5, 13, 13, 46, 56, -18, -33, -32, -6, 21, -56, -9, 14, -9, -48, -23, 40, 47, -21, -16, -30, 4, -8, 8, -38, -45, 16, 42, -13, -27, -42, -7, -3, 85, 40, -4, -32, -40, 19, -14, 17, 12, 26, -10, -48, 31, -15, -47, 18, 74, -38, -15, 5, -36, -26, -15, 38, -36, -10, -16, 14, 29, -68, -14, 43, -8, 4, 30, 69, 45, 16, 80, -16, 6, 10, 19, 38, 42, 49, -31, -14, 3, 34, -57, -45, 42, -14, 52, 53, -28, 16, -21, 23, -2, -16, -51, -36, -3, 4, -17, -46, 2, 15, 6, 63, 11, 2, -57, 20, -40, 4, -6, 30, -7, 33, 38, -8, -9, -38, 27, 2, -37, 27, 58, 24, -32, 9, 6, 56, 15, -62, 11, -82, 26, 17, -16, -56, 19, 50, 9, -33, -27, 8, -64, -37, -27, 41, -17, -36, 0, 20, -46, -39, 5, -16, -3, -31, 47, 27, 53, -48, -28, -22, 0, 53, -18]
6117a8l9L1j7N9J6j8o0O1p4jN2J3%j4l6J9j6M4j1j6J7L0J7j6k6l4J7L3PJ1j6k7
6149a2L4mo0J0L5k2k0M0j2KPl1lM0L2l5o8N1J6P8p8K0j6N7m4JJ7k4J5k6j2l3P6
6182C1jm0pN7J1l9k6oL2k9J7rLl7N5J9l8l3R5n2J3k1J0oJ6j7J2m2j1K2l6M8m5
6215e4K8J4k7LK5J7k9M6j2Qm8L6k3nM7l3Q1o4j6M5p6K3K7L7o3LL0l4pJ2L4n2K2
6248eL3k6K1n7O5q2M7L1q1M5l0N8o3NK6M2k4Rl4M3l1M6p6K0Lj5M9k2m9M9k6LM4
6281A8l2N0r7J4Q1n8J1N1o5J4K5j0n1M1ML1nJ1p9M7m2P4k1Ll4j1lM8k0K4Km0k1
6314d0M3%M4p7M3l1Nk0L2j1J0j8M6K1j03P7n6lOK1K4m0NrP4m2Op2O7nlL9l0j1
6348hQK3o6O9k7Qm9Q5k8J1m1QRj6jLQj0M5r7O5mL1m4K5j6M2l9qQj6J4ml9M5j5
$$ y = [-18, -57, -26, -43, 16, 32, 14, -46, 15, -59, -60, -8, 5, 5, -9, -45, -26, -42, 2, -9, -25, -8, 22, 39, 23, -3, -37, -20, 13, 20, 31, 15, -12, 22, 18, -42, -32, 3, -19, -39, 1, -11, -9, -2, -33, -36, 4, 36, 1, -67, -16, 0, 78, 0, 20, 4, 61, 17, 18, 35, 11, 26, 0, -12, -45, 31, 30, -10, -17, 40, 51, 12, -14, -20, 12, -17, 0, -9, -6, -43, 12, 31, -7, -40, 55, 3, 16, -5, 5, -1, 15, -2, 10, -32, -43, -21, -57, -9, -54, -26, -12, -39, -36, -11, 6, -23, 23, 11, 19, -29, 7, -16, -21, 26, -7, 74, 10, -6, 39, -37, -14, 13, 50, -13, -10, 20, -14, -21, -9, 25, -27, -5, 28, 2, 23, -34, 31, -51, -4, 27, -54, -9, -39, 19, -44, -39, -13, 29, 5, 14, -20, 23, -8, 38, -38, -18, -15, -30, 19, -3, -52, -3, -29, -26, 18, -14, 36, -61, -47, 34, -24, -13, 38, -27, -13, 12, 2, -49, -8, -4, 27, 22, 33, -46, 1, -41, 33, 12, 15, -19, -30, -33, 15, -5, 19, 21, -19, -40, 3, 3, 47, -30, 13, -18, -13, -33, -1, -12, -2, -20, 26, 47, -56, 21, -35, -38, -32, -11, 13, -27, -22, -31, 43, 1, 7, -65, 2, -3, -6, 33, 3, -8, 0, 23, -43, 26, -1, 7, -42, 43, 15, 26, -15, -7, 2, -14, -15, -12, -4, -14, 31, -66, -1, -5, 26, -18, 7, -9, 33, -6, -14, -6, -22, -8, -12, -51, -6, -21]
6384b1K5K6J3r7O2K1n2K6l2k8L7L7k7O9q7K9kN2o5JL8K7l5Nl7K3pk4M6q6M1mP2
6417D6p5N0J4r0M5j8L3k2rj9kM2K1m9Q1p7J8K1kl9K1RJm1M5j5mK2j3J3k0L7rl3
6451a8J8l0k5k2K1RL8J7j9oL6l6k2L9K8j8j5m1P2k6J7j1j8J1j2m4NJ04j2rk8K7
6483C0k1nl2K8JQN3o7N7o1K6l6M3p2O4o1k4Q2J0oj8l0M8%q2Q3o8L9J9n2L0pM5
6516B4J5q8M6j3K1o2N6K1l4J6J9Kl2m6L4j9P2n7K4j7j2L7koM1l5K1j9m3N8M8j04
6548c4lN3J4n6N1q8P9m8MJ7nj0M4m7Nj9L1J4k7K0Kl7K8J7l1pL1p9P9pnN6n8l0
6582d6Q8m2m5L2j0l7R0m2L2k8k9N1l5M3ok4K1k3L0J5p9N7ML7o5M9j7m4J8k7L7
6613Ek9M1j5J1Jjj7K5m2N8m7MK8m3O2m3l1MO2k4L0o0K6K3n3J6k2J5J5jM6r0J07
$$ y = [-21, 4, 30, 43, -54, 8, 29, -23, 3, -29, -57, -20, 17, -10, 59, -28, 1, -1, 51, -14, -13, 25, 52, 17, 22, -15, 8, 1, -23, 23, -63, -22, -26, 46, -29, 21, 35, -55, -10, -28, 5, -17, -26, -45, -47, -5, 16, -33, 48, -29, -11, 10, 8, -31, -10, -1, 0, -41, 4, -11, -15, 7, -6, 7, -13, 24, 15, -18, 0, -30, -55, -77, -56, -47, -9, 8, -11, -17, 19, -17, -39, 0, 28, 10, -5, -46, 26, 0, 17, 6, -12, -1, -13, -57, -52, 52, 40, 31, 3, 30, 9, 4, -28, 0, 1, 9, 62, -5, 52, -9, 17, -19, 24, -48, 16, -45, -69, 13, 23, 17, -1, -31, 17, 17, -65, 18, -50, -11, 8, -44, -14, -21, 24, 39, -49, -3, -16, 5, -57, -1, 20, -14, 2, 21, 23, -9, -55, -21, -40, 32, -25, -1, -18, -30, 7, 5, -1, 40, 5, 26, 7, -36, 22, 70, -34, -37, 16, 30, -26, 25, -63, 16, -32, -28, -11, -16, -26, 18, -29, -24, -43, -12, 2, -25, -5, -3, -40, -12, 5, -26, -33, -2, -81, -2, -9, -14, 42, -16, -46, 42, 0, -45, -13, -23, -60, 30, -12, 20, -8, -37, 14, -21, 22, 16, -8, 13, -10, 20, 35, -44, 13, 17, 54, -11, 38, 21, -23, -5, -32, 5, -24, 17, 2, 13, 14, 13, -4, 21, -21, 37, -10, -6, 22, -21, 41, -2, -33, -29, 33, 9, 39, -21, 5, 28, -25, -9, -31, -16, -1, -2, 44, -46, 61]
6646F1o2M7o9L3L2rl5K4Kn6K5l1N1k1k0k6N5LO1q7M5m6JQM5k9k6qJ4j2OKj9M7
6680FkL7qp5J7N3j2l9K9k0J8n7J4L1J5m4K6K0l3O7n4L7p9L9O1J3p9LJ3pnoJ02
6713H1r7j3L4m3mJ3l0M4J0J8k0l6M3k2P1o8j2M0k3J7k3L8NMo0KL1o1M4M5p3O5
6745B0j7%lQJ6j8o4J9L1J0n0K6j7j0O4J1j8RM5m4m5lM7m3L0j5l9L2M0j1rJ9Km1
6779a8P9n5j7kK4k8o1J12l3K2J2rm6lM4k4K7p0J3M0o1M3J8j8K9l6K5l3K0M5l2
6810Gj5k8O9l3K2Mn2kK1QL4j6j6RJ9o2J9J9j6rK2l0K6l4j5Q7j4j7N5n9m1lK7N7
6844D3j32O6O3q7O7oK3k1j6MJ6k2k2M7k5N0m6M0k8m5J09j31O7kj4L8o2L3k3L3
6874A7o9J5L1j9m7R5o6L8J3Mknoj2j3j0LNk4O6j0j2l7J03q3K9L3k9j7J7MJ6k7
$$ y = [61, -1, 46, -23, 10, 42, 33, -2, 22, 24, -32, -7, -38, 13, -8, -28, -54, 1, 4, 65, -22, 23, -23, -22, -14, 31, 2, -24, -32, -18, -30, -24, -22, -41, 6, 4, 41, 33, -42, -25, 28, 16, -23, 6, -14, 4, -53, -39, -8, 7, -37, -11, 9, -24, 43, -11, 26, -53, -14, 47, 60, -19, -16, -3, -10, -15, -21, 81, -16, -29, 5, -38, -42, -29, -59, -15, -5, 13, -7, -43, 0, -22, 49, -19, -31, 9, -14, 3, -20, 18, 23, 27, -33, -31, 0, -61, -17, 28, -45, 20, 3, 3, 0, 8, 24, 6, -58, -39, -8, 2, -48, -22, -39, -49, 15, 26, 8, 17, 62, 18, -27, -30, 17, -26, 4, -11, -50, -18, 22, 11, 2, 21, 23, -18, 61, 6, -11, -13, 11, -17, -78, 34, 1, 23, 35, 26, -20, -23, 21, -3, 24, -46, -33, 7, -54, -11, 7, -11, 18, -18, 7, -26, -6, 39, 7, -8, -36, 33, 0, 22, 26, -26, -28, -7, 1, 35, 19, 3, 12, 31, -31, -12, 7, -9, -18, 4, -26, 0, -34, -49, 38, 24, 7, 62, 3, -38, -41, -14, 43, -89, -23, 40, -47, 20, 14, 37, 16, 0, 4, 20, -2, -24, 23, -2, 48, 2, 42, 14, -31, 78, -53, 14, 12, -2, 36, -26, 7, -16, 17, -52, -37, -6, -25, -72, 23, -43, -5, 8, 12, 10, 5, -1, -13, -26, -36, -33, -28, -52, 14, 4, -8, -45, 58, -25, 4, 37, 8, -9, 8, 12, 28, 1]
6907AQ%K9j8m6P5j00J1N7k9jo4P5k1L1j2k0Q9m2k5j1Oj5J02j1l9j8KpRnkjn6K3
6942b5P1l9jJ7l6N5l9Mk0L5j3j2j7K2J2j2j4K2J7pk6m4O1j2j6L4o5K7JM7j6l5
6974b4Njm0J01p4O8l4m5R1m4L1m7J5l6P7o1k2J7L2J0N1m2l4J4K1m0L7l4K2n7l
7005d6N1j7J3j6J6n0N0L9l8j3K4n1M4JKj7J9k4M4l4ML7p9J9P2j13M9O3l5M7k3
7036C8l4k9J1J8m9J01j0Oj17L6P0q8O3oJ1Jj8Ol3M0l4j8j9K8J7J3k9K2L8m6Ll2
7068d0Q6q9K2J5k0P5p5K7k2JK3N1m6J0j8lJ2J1k4Qj5m7N1L2l5K7k1k7lQ5r3J32
7100I0q9nK2l0M6K1j2o0K1m0P6o6J7O2j34R1M0o2N5l5n5O3J0K4o0j7J2l7J01q5
7130c6R0n0m8L5L1N8r7P2q7P5k4o5N5%l9j3mQ7n9J2J0J2j5Oj5lK3m0NpP1m5M2
$$ y = [1, 9, 9, 38, 20, -26, 49, -51, -40, 17, -12, -13, -77, -2, -23, 8, -4, -24, 65, 23, -2, -13, -7, -22, 80, 69, 30, 12, 14, 7, 16, 11, 9, 8, -48, -25, 46, 7, 6, 23, -13, 42, 3, 7, -13, 22, 9, -3, -20, 2, 14, 2, -12, 10, 27, 20, -6, -50, 11, -1, -17, 17, -48, -21, -20, 27, 11, -24, -19, -20, -60, 41, -33, 35, 1, -44, 47, 3, 34, -13, 2, -34, 43, -18, -40, -23, 9, 19, 70, 28, -6, 8, 29, -11, 26, -8, 14, -43, -46, 5, -12, 1, -15, 1, -49, 1, 40, 2, -11, 13, -38, 6, 7, 9, -8, 11, -13, 31, -3, 1, 38, -41, -22, 50, -63, -14, 49, 14, 61, 38, 4, -25, -14, 4, -45, 56, 46, 52, -65, -29, 41, -47, 16, 10, 21, 22, 4, 10, -23, 17, -17, -35, -54, -26, -9, 4, -25, -3, 35, -11, -8, -40, 46, -43, -21, -6, -26, 49, -26, 1, -21, -20, 3, 54, 8, 18, 0, -3, 9, 20, -4, 4, -11, -58, -7, 25, -10, 17, -4, -31, -34, 51, -42, 90, 1, -4, 18, -12, 34, 55, 43, -17, 4, -36, 40, -26, -9, 53, -81, 10, 50, -12, 43, 8, -47, 16, 26, 50, -10, -27, -15, -52, 49, -36, 54, 4, -44, -9, 22, 80, -17, 55, -32, 43, 19, -46, 9, 9, -30, -43, -47, 40, -19, -7, 3, 15, 0, 6, -9, -12, 11, -29, -24, -31, 40, -5, 37]
7163C7p8N7j8l0P3l2o2P1n0R1k1r3L0J8K1jL9n8L6o9lj5Q9o9O2J9o0M7j6n0N0
7194A5l6K1L6J1n4J7m4K4j6P3n4k5J5oKl5R9j22J15l8l3R1q6L2rm4j6O9OLql1
7226b8J5L5K3n8M3n7L3Pl2j1K6QJ0n7j1N0K9n6k1P4k7L6on3K6l4kK0L8r3R1Lj6
7259Ek3kJNoj6N0Qr2O0KJ9n1O8om5K5k9L9k0QqQl6M8K0m2M2r0K3N9l5Nj0P3r5
7295c8O1km3K3l9K6J2oJ6Pm9M4k7k8K3J4ml5L8k1N7o2J6j6k4M1j3M3j8l8J6J6
7327a0rL2j6M8r6L5J9j9Lrk7QJ4P5n4K0n2K7J2j8J1k1QN4o3QK6N5k1o8J1N4m8
7360a1J1j6J5Jm7J5N1n6RJ1ML1%k8L4l8Rj5K9j8qK3L7m6L3j3J6p1M7J9n4Q2j4
7393D2q6M5LmJ8j3pn2N7pkl2J02o2lJkO4o4m3N9Ll5j4mk1L3M2k9j8j2O6k5lj4
$$ y = [37, -41, 16, -2, -32, 41, 9, -53, 18, -32, 59, 38, -55, -25, -7, 14, 13, 52, -6, 30, -39, -42, -57, 32, -37, 25, 44, -16, 31, 15, -35, 15, -21, 0, 36, 47, -7, 10, -34, -10, -26, 47, -7, -32, -17, -23, -21, -56, 43, -79, 36, -2, -35, 56, -30, 2, -7, -51, -67, 2, 8, 11, 3, -28, -13, 22, 45, -13, 30, -27, 6, 13, -19, -30, -4, 4, 14, -43, -54, -4, 25, -31, -52, 22, -5, 31, 25, -28, -2, -36, -38, -18, 20, -73, 18, 21, 5, -18, -20, -19, -14, -20, -36, 14, 22, -70, -10, -8, 11, -40, 28, 22, -23, 2, -27, 12, -8, 0, -8, 0, -36, 12, 32, -10, 32, -58, -35, 24, -11, -6, -16, 57, -38, 23, 21, -22, 1, -38, -12, 0, -6, 10, 17, -32, 12, -15, -43, -20, -6, -10, -45, -7, -28, 29, -33, -17, -33, -57, -16, -29, 14, -4, -42, -26, -10, -19, 13, -3, 45, -51, -16, 3, -16, -13, -22, -49, -41, -27, 48, -6, 14, -38, -11, 1, -17, -6, -27, -19, 35, -28, -20, 6, 61, 40, -28, -17, 37, -11, 0, -16, -1, 0, -47, -32, 19, -37, -28, -17, -13, 18, 18, -10, 24, -14, -5, -20, 9, -9, -17, 6, 43, -3, 30, 17, 33, -38, 9, 28, -26, 56, 42, -44, 1, 4, 0, 18, 5, -2, -54, 3, -4, -6, -38, 64, 2, -1, 0, -2, 62, -2, -45, 14, 17, -18, -32, -36, -57, -24, 18, -11, -29, -41, 25, 0, -3, -17]
7428a7J0QJ2nJ4Nom4N9n2K6j0m1O0m3K9Nl6K8qp2O8O0j17Q6r8Q2m6J23l2J0n6
7460BK8o5L1KK4Koj5j3p1N7j4L8m3L5j1Q0p6k6L6l0k1Q5m0J1n6O7L1k4J8rk1j9
7493a3J7jj0j0N1m8QJ1K3l4l6J7Nl1nL4lO4p4L8J3m8jN5j6j5l1N4K2p1P0MM1j11
7527c1J1K0jm5P9o2K1qMrqL3j9K1L1m5L2o0J06q4L4J5o4N5r9P2mM3j11L9J2M1
7559A9kl9M1p3J28r7N2r2J7J7N2j5J5k3j4J4K3n0N5p2L1K6j6OQL1l5J3k7n9M9
7590a7RK2l0nL2j0L2n3O8j3M4m1k3L6l0m5k7M8mO4o3k5M0K2l0OL3o7K6J7Jkqk5
7624a8j9nJ5M4o0M7J3p4R7o6M7k9lM2J6j8l9L5K0k8J0j2L0Kl6K7o5J5K5j2p3N7
7656a5K8mK8l4pl2O9k5j3jJ1n0J7O6j9l5K1pP3r4L3Qj9J0l4K0l8RN7kn9K7pK1
$$ y = [-17, -7, 1, 13, 8, 22, 27, 21, -23, 36, -16, 10, 0, -41, 19, -24, 5, 10, -26, 2, -6, -78, -10, 50, -67, 19, -79, 3, -43, 80, 48, 58, 2, 30, -35, -4, -2, 22, 24, 18, 3, -10, -81, -24, -38, 0, -43, -8, -19, 61, -15, -41, -5, -35, -56, 29, -11, 0, -56, 11, 42, 18, 36, 27, 6, -13, 4, 3, -7, -17, 34, -14, -6, 5, 28, -6, -42, -25, -20, -51, -56, -22, -25, 39, -35, 3, 16, -32, -33, 22, 6, -9, -40, 14, 36, -35, 35, 39, 80, -31, -20, 0, -1, -46, 33, -29, -8, -16, -12, -21, -29, 4, -15, 6, 37, -8, 24, -36, 70, -14, 20, 35, -29, 26, -73, -1, -5, 38, -73, -34, -22, 19, 17, -22, 19, -54, 74, -23, 29, -63, -46, -29, 23, 8, 23, 0, -14, 0, 23, -27, 28, -44, -13, 13, -3, 3, 11, 42, 7, 20, -7, -66, -17, -8, 14, -16, -21, 11, 1, 33, -20, 48, 35, 79, 38, 15, 51, 21, -24, -51, -3, -7, 57, -6, -31, 9, 31, 1, 7, 40, -27, -1, 16, 17, 15, 7, -18, -37, -42, -27, 17, -43, 4, 17, -57, 40, -26, 21, -8, -11, 31, 47, 29, -10, 25, 45, 17, 27, 15, 45, 47, 11, 38, -27, -12, 13, 1, -72, -15, 13, 9, 37, 3, -4, -36, 33, 8, -5, -6, 5, -45, -28, 38, 19, -16, 5, -2, 71, -23, 10, 18, -1, 9, -25, -5, -43, -34, 23, 21, -38, -11, -18, 3]
7690Cnj8O5m9k7Oj8%R2p1R6q6nj1M9l5Kl3Q1k0n3O0o5Rl8R2k1nk0K7k6K2M3k3
7724A8m4M2POl9J2N4n6K3l9J5jj3k2RmQ4q3OK1j0k5K0Ll8P7K8l1kl0l2j3N0L2
7758B5m5M5m1N3l8k0J0L8m8nj5K6j1l5M6K1k8M2k2K6l1J6n8RN5m3nJ3L1n0M4K6
7790C1n4K4%k6K1J8p4Q5O1j04L3j0j5J5kN3p0O5k7k4N0n3J7j2q3M9P1j1Qr1N2
7821cj9J3N4k3j6jj4K2j0j4K6m6M0Jl7J9J5k1K2j7J4n4N5%k2k4L9N7m1j3j0N7
7853D9pm0j2PL0j8K2Qn6n3O9j0NJ8q0L3j5K1M0l1J4%J7k7LL7q3N7j6M4%j9J4j5
7887Fl9M0nO0k8Jp4j1pL3N1rRk3k9K2k8R3j0q2L0mJj2j2k0J10l1r6J6M3j3L3J6
7921C1Jro4L6K8r4Q1j7N5n0k5M1m3KJ2qJ3J0nL2rk8J6M4j4o5K2j4j5N2J2K1q5
$$ y = [3, -2, -20, 45, -4, -31, -25, -43, -43, 49, -22, 74, -12, -17, -28, 21, -14, -12, -45, 36, 16, -37, 23, -42, -33, -71, 21, 0, -5, -25, 2, -24, -2, 41, 18, -26, 16, 23, 29, -10, 2, 56, 0, 23, -16, -1, -2, -15, -37, -28, -32, 52, -31, -25, -4, -14, -39, -19, -16, -54, 23, 51, 20, 18, -12, -44, -57, -7, 25, -20, 25, -16, 37, -1, -21, -11, 27, -21, -26, -41, -15, -26, -61, -15, 6, -22, 20, -2, 24, -7, 9, -49, -40, 15, -28, -33, -20, 11, -39, 5, 31, -23, 1, 1, -25, -4, 14, -60, 25, 86, -18, 15, 5, -10, 5, 3, 56, -14, 51, 24, 0, 50, -3, 14, 2, -81, -32, 39, 28, 36, -55, -3, -22, -9, 45, 22, 6, 5, -9, 13, 3, -11, 15, -31, 9, 10, -27, -8, 7, -14, 8, -9, 5, -49, 6, 6, -16, -40, -1, 56, 15, 2, -8, 49, 42, 2, -10, -3, 27, 9, 31, 39, -17, -70, -1, -11, -6, 12, -68, -35, -50, -29, 11, -20, -6, -6, 11, -16, -13, 24, -59, -2, -18, 26, 26, 7, 21, 6, -33, 7, 2, 62, 34, 35, -39, -50, -57, -24, 27, 18, 27, 4, -25, -3, -31, 62, 52, -30, 0, -4, -3, -15, -27, -47, 63, 32, -64, -48, -5, -18, 15, 31, 32, 23, -41, -5, 23, -71, 10, -7, 48, -2, -27, 14, -29, -27, -15, -23, -10, 0, -5, 27, 18, -10, 6, 50, 36, -29, -7, -21, -36, 16, 28, 49, -36]
7954c6L5nlJ9m0RM4n4oN2ok9RJ0lPj2nNPL1Ml3M6m1k7N9p4J4K1MKJ6N3q3J7k0
7991a3m0M4l0L3k4j5N1M4n7j5M2n1K9j4O5o1J01r6J2pK7n4L8L1q6J20l0j8L4j14
8021e4K3OM3%lk8j1K9m5Q5o6OK0m1QP3j00L9J0l0L3M4m5j9rK2l5K9J3K1j2N3k0
8054C9m1j2l0R1l4L7j8m7J0k7L7nPNq0P4l1K6k9llK7L4p1RL3QMlk2J7K4o1Oj6
8089d5M6%m9O2o3O9l4Rm5P1M0k7n5P4l9p1jQ3n8K8J5Km2m4J32p8l2M5j8mO4m0
8121eL1l3K7j2k7J9qj2Pj8J8N7o1N1m7MJ1nk2j6O7m7J2j7k0Q1k3m0K5Klk1Pj2
8155c0P5m8k8JRRl4J6L8l5M8%L0o4L0JRn6N3k3LK3j3l7K8J8Kkjj7k1JM1pl7J9
$$ y = [-36, -1, -6, -9, 10, -30, -21, 23, -31, -37, 15, 9, -20, -11, -1, -4, 3, -9, -14, -9, -2, 29, 33, 0, 46, 5, -22, 37, -37, -23, -2, 2, 4, 20, 73, -10, 7, -13, -53, -9, -39, -6, -30, -45, 6, 50, -7, -22, 20, -31, -2, -16, 49, -12, 89, -7, 5, -2, 25, -29, 9, 40, -46, 74, 44, 26, 60, -54, -31, -25, 18, 18, 15, -13, -24, 5, -40, 45, -21, -15, 5, -36, -28, 45, -55, -16, -6, -36, -3, 41, -4, -23, -32, -10, -45, -16, -3, 18, 6, 59, 39, -2, -14, -44, 47, 13, 50, 32, -15, -5, -32, 5, 0, 7, 12, -68, 6, -25, 1, -28, -31, -34, -7, 27, -44, -35, -2, 6, 10, 7, -15, 2, 26, -35, -29, -45, 1, 1, -48, 14, -49, 20, -14, -5, -50, 21, 61, 34, -21, 53, 14, -57, -58, 25, -33, -5, 10, 12, -30, -74, 58, -20, -52, -7, -25, -29, 35, -5, 26, -7, 20, 8, -19, 0, -8, -20, -13, -31, -13, 44, -17, 34, -13, -9, 2, -3, -25, -41, 26, -21, -9, -26, -46, 35, 12, -28, -3, -1, -4, -25, -18, -30, 45, -3, -31, -30, -21, -12, -46, -30, 8, -27, 21, 21, 51, -13, 17, 18, 27, -29, 24, 1, 4, 27, 14, -23, 5, 23, 25, 23, 22, 5, -16, -15, 26, 19, -18, 1]
8191A
$$ Imaginary data points
##PAGE= N=2
##DATA TABLE= (X++(I..I)), XYDATA
0@%%%%%%%%%%%%%%%%%%%%%%%%%%%%%jKkLoQqRj1J2j5J9k0K2k8L3l5M0m7N2n7O5
51C5p3P6q0Q6r2R5r2Q7p2M6lp6K14m59R23j894M249j1951P6717M00915l49893
72A18758n40215K51388M76015j05247l69525k1688K02273J28717j0980j87851
82e8355j87665K04959L62618j75975m97489J15164N70967l3975n78590m4786N21033
93A97906J09496m10099j45026K59276J44638r2078j06892p2083L8910K12955M9293
104A86296l17488j42982L75328K25727l86443k83558L55004L06628k90802k88900
114b61190K07403K32389j18515j43642L6950L4930K8089Q0448p0756j86599R1411
125f9082K70669r3554l23741Q3026L40451o7452l21577N3934K71482m7906j99660
$$ y = [0, 0, 0, 0, 0, 0, 0, 0, 0, 0, 0, 0, 0, 0, 0, 0, 0, 0, 0, 0, 0, 0, 0, 0, 0, 0, 0, 0, 0, 0, -1, 1, -1, 2, -4, 4, -4, 5, -6, 6, -9, 10, -10, 12, -16, 17, -18, 22, -25, 27, -30, 35, -38, 38, -42, 44, -48, 47, -45, 42, -30, 16, 13, -63, 151, -308, 615, -1279, 2970, -8981, 67736, 468651, 118758, -421457, -170069, 305946, 200699, -168826, -190514, 11759, 140476, 129496, -58355, -246020, -41061, 321557, 145582, -351907, -236743, 334224, 300249, -278341, -323127, 197906, 307402, -102697, -247723, 11553, 156191, 64113, -42779, -114862, -75952, 137003, 186296, -131192, -274174, 101154, 326881, -59562, -343120, 11884, 318512, 27710, -261190, -53787, 178602, 60087, -83555, -46605, -11675, 16414, 96862, 26106, -160493, -69082, 201587, 108033, -215708, -132682, 207769, 140317, -181260, -127326, 144156, 96250, -103410]
136a03410N1046J15479o3664k9934Q2312m7981j01860J11697J17007j57529j22048
147a48885J85162J14118j95925r1551J93987N6434j82764j1840J66324l6318j47216
158i8474Q1810J26021j18857j02669J42664P5633j51419m3592J44043N144j24366
169f4062L9709R6060q9279o4521J39649L4935j85498j1138K20913m299k39404
180a26935J1921K37025j3368k11204J2897J63254j4350r6831K1780J9140l8017
191c4688O0906O3063j34110r5036J91133J29117k25852j59680K33706J79518k14786
202f709j82887J72525J65041j13494j24373M6770O2774J8143J5206p1601j00793
213a19398J06945J84340j20115k54315J11208L01087q3574l16789M3930K97314
$$ y = [-103410, -52364, 63115, -549, -30483, 51829, 3848, -98012, 13685, 130692, -26837, -148885, 36277, 150395, -45530, -137081, 56906, 113340, -69424, -81264, 85060, 48742, -98474, -16664, 109357, -9500, -112169, 30495, 106128, -45291, -88883, 55160, 60304, -64062, -24353, 71707, -17572, -82093, 57556, 92491, -93007, -104145, 116768, 112469, -126935, -115014, 122011, 108643, -102561, -89664, 73590, 59240, -37591, -15811, 3329, -34688, 26218, 89281, -44829, -139865, 51268, 180385, -45467, -205147, 28559, 208077, -6709, -189596, -17071, 147970, 34476, -89897, -43127, 19647, 37790, 52996, -18605, -119398, -12453, 171887, 51772, -202543, -91335, 209752, 126178, -190611, -146681, 150633]
223A50633r15k43899l6438J61490N9962o0345o4531m8148M7938J50090j2661k33169
235a29993l5633K87444Q8387l07046j35581K91268J68140k43264j78233J71467
245b3044J62144q6124j19457m30N4635P7118K4882j34832j08984J67527J86084
256A99519j73750k45781J55327K79023j18569k80964P0951K50346k2184j90192
266g6274j9428J07748M6813j3105n5900q1987M6879J66076k1917k29287j2288
277a42670K65094M8522k70310p8534K46664R5601j98949r5415J34811P6205o3536
288A7483m0385n730p622O4620O0648j08430j10990J33789J51093j41294j74824
299a61642J33505J78923j14987j62317R1146J27520o6644p8654M5664K2311k9984
$$ y = [150633, 149718, -94181, -130619, 30871, 90833, 30488, -34043, -82191, -34253, 115837, 103176, -129993, -165626, 121818, 210205, -96841, -232422, 58846, 226986, -16278, -194511, -23044, 139100, 52976, -66481, -66911, -12276, 64842, 89724, -45108, -154092, 13435, 199519, 25769, -220012, -64685, 214338, 95769, -185195, -114244, 136102, 113918, -76274, -95702, 12046, 58859, 45754, -10146, -92133, -45254, 120822, 98905, -130382, -142670, 122424, 170946, -99364, -177898, 68766, 164367, -34582, -129997, 4814, 81019, 17483, -22902, -28632, -36254, 28366, 89014, -19416, -130406, 3383, 154476, 13182, -161642, -28137, 150786, 35799, -126518, -35372, 92148, 25504, -53150, -7486, 14825, -15159]
310a5159L4839K0816q6187j6574J26460J4897j52300j3392J62178R032j57111
321g2501k70J39211j3981j12671L2431Q1369n3346m9050P3624J8584q9952Q436
333c8116R9091l0949r8754M9967Q8688o6238o9101Q0678M2947r3685j3362J05307
345E6473j5870j14115M0897J18388n9327j16103O9398J04914p1414q4089O6417
356d431N3281n7290j4379M6794k9628l7859P4473L2607j15047l1668J46565L4919
368I8337j64455m0109J66153M4649j50315m5143J18887L8641p5187k3034K4580
379f996k141K6265L5292p1494p3140J04956J10522j23267j42057J24643J61852
390A44435j10498j65264Q4104J49781n0731j15247J6411O4772J3313l142l3440
$$ y = [-15159, 19680, 40496, -45691, -62265, 64195, 79092, -73208, -86600, 75578, 84610, -72501, -72771, 66440, 52459, -60212, -27781, 53588, 242, -48808, 24816, 43400, -46552, -38116, 60975, 30026, -68728, -18761, 69927, 3689, -65412, 15266, 58213, -35472, -48834, 56473, 40603, -73512, -32615, 85773, 26446, -89657, -20259, 84655, 13241, -70848, -4431, 48850, -8440, -22819, 23975, -5653, -43512, 30961, 63568, -51479, -83147, 63418, 98337, -66118, -106227, 59926, 104575, -45740, -90883, 28004, 66645, -8542, -31576, -6996, -9137, 17128, 52420, -19074, -92214, 12742, 123264, -3, -142060, -17417, 144435, 33937, -131327, -47223, 102558, 51827, -63420, -47009, 17763, 31076, 27934, -5506]
401e506o2159M1538J23392l6814j72700K1449K03929R38k13005k5373J98666M5840
413A20195j62724n7755J09577N7116m6286m2865j9417J5362P9308K1911j26348
424e1926o3728J55429J03744j64062j35074J52952J52526j25044j51644Q5768
434d1059J31498m1753r3000o6M0577L3890J9547n5850p9919O3854J32689n9029
446E1379j71273M3850J90607k3085j88833J554J66465J5489j26651k4539P5126
457A0089K3267j8093j1845l7038p821Q4744L2285j19635n6941J39204P7479j42742
469b7047q9500J31765R0426j09648p9203Q0363N6383m8900k4543J8900j2492N908
481g588M9871k3951q3158L4717J07974l9143j21471L9241J22392l7287j10789
$$ y = [-5506, -67665, -26127, 97265, 60451, -112249, -90800, 113129, 114067, -98938, -124311, 74355, 120195, -42529, -100284, 9293, 66409, 20123, -22742, -42159, -26797, 52511, 74422, -51926, -115654, 39775, 143519, -20543, -155617, -2665, 149861, 24817, -126827, -41059, 90439, 48686, -44314, -44380, -3803, 30087, 49634, -6216, -86135, -22281, 110408, 51379, -119894, -76044, 114563, 91478, -97355, -95801, 70664, 86153, -40498, -65037, 10089, 33356, 15263, 3418, -33620, -41441, 43303, 75588, -44047, -100988, 38216, 115695, -27047, -116547, 15218, 105644, -4004, -83207, -2844, 53539, 4639, -19904, -1004, -13496, -7588, 42283, 18332, -64826, -30109, 77865, 38722, -82749, -43508, 78884, 41597, -69192]
492f9192L5578Q9247l5444o0463L7908K8258m2192L566M7404l1979n1429N4720
504E982N2164p0764m8335P9878L8692q3033k3776Q1131M629p6158J6698O9049
516D6157l7688o0523N5705N0852o8293l9849P4306K6911p2771j1201O4528p031
528B1103n1048K7887L4539m9954j7505P1537K405r0438R022J03614j5954j09076
540f3868J8424J04728j7765r0244J5758O5785j4481l3704J5670k661k0713L9540
552A6469K9798p2336m1785R7488N4747j11495o5847J13275P2119j02569p0968
563h1104Q1529O0513n3093m0517K1316J1869R225K2716l4813n9664N2165R3934
575H4076n9633j21345N7074J37649m6174j39801K9732J26717j1341r9114m746
$$ y = [-69192, -33614, 55633, 20189, -40274, -2366, 25892, -16300, -12734, 34670, 2691, -48738, 5982, 58146, -12618, -60953, 18925, 57617, -25416, -49192, 31939, 36568, -39590, -22892, 46157, 8469, -52054, 3651, 54503, -13790, -53639, 20667, 47578, -25193, -36394, 28134, 21103, -29945, -2058, 32481, -17473, -34978, 36559, 38964, -51474, -42452, 61162, 45208, -63868, -45444, 59284, 41519, -48725, -32967, 32818, 18337, -15367, 303, -2358, -23071, 16469, 46267, -26069, -67854, 29634, 84381, -27114, -92961, 20314, 92433, -10136, -81104, 425, 60938, 7845, -32672, -11356, 513, 9738, 32454, -2359, -62023, -9858, 84076, 24443, -96902, -39828, 97821, 51647, -88154, -58422, 68295, 56954, -42160, -46906]
586d6906N9748J5680j3032j8714l5414J3320Q0109l01j15521j7752J37291L7580
598I6088j43447n5018J33489O5759j09412o7306P5037N7607l5371l7165m413P877
610a6275L9134K6788o5099o2032P9988R2935q2980j14759P5481J24511n9979j19959
622h2246M0166J01439j9775p0761K322L1712R467J1039j4343n2650J2087Q7990
634E6447m286j13372o768J25820J8071j24855k6616J11095L0013q7038k6719N6371
646H163J6556k3135k55q511j9641L5368M0623n4985n9121O6409P2293o9724p7959
659g3919O6605P4583n8749o2792M8342M3617l7738j9516K8069o615k0570L1616
671A2933J4913n2835j0587O8217O679p6476k066P7581m042p1862J2095O1025k1705
$$ y = [-46906, 12842, 28522, 15490, -3224, -38638, -25318, 54791, 54490, -61031, -78783, 58508, 96088, -47359, -102377, 31112, 96871, -12541, -79847, -4810, 52797, 17426, -19739, -24152, -16275, 22859, 49647, -15452, -77484, 2504, 95439, 12459, -102300, -26819, 97692, 37713, -82246, -42080, 59359, 39584, -31177, -28855, 2857, 12324, 23363, 9020, -43630, -31543, 56447, 52161, -61211, -67979, 57841, 75912, -48943, -75559, 35536, 65549, -21489, -48208, 8163, 24719, 1584, 1329, -7182, -26823, 8545, 49168, -5817, -64938, 1471, 73764, 4040, -73919, -7314, 67269, 8520, -54272, -5930, 37687, -51, -19567, 8502, 1887, -18683, 12933, 27846, -24989, -35576, 32641, 39320, -37156, -39222, 38359, 34317, -37545, -25450, 35575, 13870]
684A3870m6575L2207L0689m2291j4762N0260K93n4912J2264N4975k2846m9914
696c6742L1213L9880l8401k5822M4399R197m9683P851N4083k3354n7001L5711
708h669N7485m3380n4612M6164M7534m4074l5495L8340J8912l0297J431K1824
720A5163k3865j4381M6162R008o5889o437Q0415O161q7791p400Q6416Q796p6399
733c0041r049N8491O425l4472j37P210r926K0202K3316m4395l8353O2676N3195
746F5142p2846o5077P4191P1784o7076p1105N2999O2055l4514m4706J4573K0295
758E715L296Q675j7049l9009K4755O6867k5948q8873K1285J01845j2416j04014
770e4871J968R4954P672p5607j3889M8441J5085j6472j0491j5992L27M5523J3924
$$ y = [13870, -32705, -498, 30191, -12100, -26862, 23398, 23691, -31221, -18957, 36018, 13172, -36742, -5529, 34351, -4050, -29872, 14527, 23724, -25959, -18108, 35975, 12621, -44380, -8669, 48816, 5436, -49176, -3012, 44522, 448, -35047, 3293, 22205, -8092, -6661, 15163, -8702, -23083, 23079, 32087, -33802, -40239, 40176, 46337, -41454, -48854, 37562, 46358, -30041, -39090, 19401, 25826, -8646, -8783, -1573, -11499, 8703, 32019, -12376, -50729, 11947, 65142, -7704, -72781, 1410, 73194, 6118, -64987, -11988, 50067, 15553, -29153, -14580, 5715, 9011, 17686, 637, -38372, -13617, 53250, 27302, -61571, -40286, 61559, 49143, -54871, -52903, 42051, 49723, -25884, -39773, 8668, 23753, 7281, -3210, -19202, -18875, 26648, 40572]
783D0572o8667l0007Q3003M5114q7473n6525Q2143O1629o8548n9048M8935M8134
795C9262k6594k9732M445N689J4635K1129k8387m7291L5702O9617l6746q4694
807f2965L2337R1011k4325q7300J5200P4118o992n3160J523K7187j00O64K552
820I750k7189q405M9285J6093o5012k3911P3048K9725p3350l2058O6721K9834
832D4531n4855k2538L9703J1001k3229L603P674j9366N675L4554j5943m6817K2871
845a3136N4735k6875n7071K8487N3685k8885m5000K8625L1832k8373j6348K8472
857A0148J4k8641J5147K8317k7792k6944L7040K3748m2312j8114M3896J0230m2340
870a7603j98L8660j0939l3727K2436K8109l2591k2430M0225J6751m4353j0897
$$ y = [40572, -28095, -58102, 24901, 70015, -17458, -73983, 8160, 69789, 1241, -57807, -8872, 39262, 12668, -17064, -12619, -6930, 7705, 28834, 447, -46844, -11142, 58475, 21729, -62965, -30628, 60383, 36058, -51242, -36042, 38076, 31084, -22076, -20553, 6634, 6534, 7198, 9750, -17439, -25844, 23441, 39534, -25478, -49389, 23659, 53384, -19966, -52024, 14697, 44531, -10324, -32862, 6841, 17842, -5387, -1784, 5890, -13476, -7801, 26753, 10810, -36007, -13136, 41599, 14724, -42347, -13860, 39825, 10940, -34060, -5435, 26397, -1976, -18324, 10148, 10162, -18479, -3332, 24985, -2807, -29751, 7289, 31037, -11275, -29389, 14507, 24737, -17603, -17801, 20859, 9920, -23807, -1371, 26738, -5853, -28283, 11942, 28693, -15660, -26557]
882b6557M4153M530l9863K534L1882j0858k1406K0089R672k9909J788L9380j1581
895A3854m7225J8719N2502k2799n3672K3811N0107k1990m1396J8811K7717j5073
907C366j0357J1961q935j0540K8256J1107m5409j3537N8179J7008o5164k0439
919d4504O5114K2482n8305k2067M5740J7933k9002r726J0254j811P872J6174k3349
932c195l1335L4451M5548m0062n6542M0105O2548l5253o2125K6881N4698j6729
944A8990m0800O689K1572J346P29o276k3836P315M4853m637o1440q31P1502P676
958D2852p3740j4079O8116J8372n5363j9062L7376J5554j6543p427m570m174K3420
971A0732J7833l7852l1641M6616M3345m9366n1076M6328N3118l8736m9200K8448
$$ y = [-26557, 17596, 22126, -17737, -15203, 16679, 5821, -15585, 4504, 14176, -15733, -13945, 25435, 13854, -33371, -14652, 37850, 15051, -38621, -14810, 35297, 13307, -28089, -9278, 18439, 3366, -6991, 4970, -3965, -14505, 13751, 24858, -20551, -34088, 24091, 41099, -24065, -44504, 20610, 43092, -15213, -37280, 8460, 26393, -2609, -12335, -2081, -3892, 3980, 20154, -3195, -34530, -79, 45469, 5407, -51135, -11030, 51518, 16265, -45860, -18979, 35719, 18990, -21810, -15121, 6451, 7797, 8526, 2250, -21586, -14271, 30582, 25945, -35495, -36326, 35176, 42852, -30888, -44967, 23149, 41521, -13842, -32904, 4472, 20026, 3483, -3944, -8514, -12688, 10732, 28565, -9287, -40928, 5688, 49033, -333, -51409, -5081, 48037, 9301, -39899, -11451]
983a1451L9080j7220k3964O812N649J137J3961o026l2459P815M7535o625n7649
996c3405L944O1629n25n9238k071N1038K976l8206j526K2491k588n942Q688r836
1010b571j6052K3136K3296l2804k9239L8381L2425l9924l2196L8082K8001l3576
1022c041k0235K7640R769k1229K479J5161j4610r869K5561N377l3866j544L8759
1035B0352j893l9933N542L7256r611l1647J4068K3840j8995j5016K3737O048k7688
1048a3940K041L0175q806l0577J4190K8266j7891k3276K0493J5825k2048o516
1060a2064K3255l661k4157J3757K4783k2513k4974K8861K4283l2298k2057L2265
1072E480J8004k9284j1834K3615L455j6472O573Q870j7520j874K8205l492l7449
$$ y = [-11451, 27629, 10409, -13555, -6743, -1094, 43, 14004, 7978, -24481, -16666, 30869, 24244, -33405, -29461, 32168, 31643, -27595, -29666, 21372, 24348, -13858, -15384, 7107, 4519, -1423, 7265, -2571, -18623, 4513, 27809, -4995, -34234, 4147, 36572, -3352, -35548, 2534, 30535, -3041, -23276, 4364, 14133, -7096, -4617, 10544, -4066, -13935, 11626, 17003, -16863, -18407, 20352, 18459, -21474, -15932, 21324, 11713, -19934, -5866, 17974, -1021, -16037, 7700, 13748, -13940, -11899, 18276, 9470, -21107, -6917, 21349, 3458, -19818, 675, 16500, -5548, -12064, 11191, 7530, -16627, -2870, 21913, -600, -25574, 3287, 27570, -4728, -26785, 5480, 23484, -5800, -17634, 5981, 9436, -7036, -463, 8407, -9113, -10987, 17218, 13726, -23723]
1085b3723P037M3984q418m6681Q245M4887o845l8453N285K7970m496j4404N006
1098f06p07p242J5706J0980k8906j6007L8748K1207m4171k5637M4662K7971m0473
1111d475k7298L2185K3220k1355j5252R425M180K030R102j1507k2876J7928L5547
1124C0854k0730m5324K0109N0786j6693n0980J1704M5466o285l4967J848K0215
1136F003Q26l521r88j3511j322K8712N597m0496j0934M7537J6207m9211k0117
1149c5218M5794K1513l7755j9675K6688J4552j4006o243J281m042R632J5488j7923
1162H6k6451K2879L5304k4525m0852K3015M2123j9438l8829J4637L1302j0005
1174I246k0144O191O937l991O972L438j9828m257L0316O088l7258p903M0142R172
$$ y = [-23723, -16686, 27298, 18880, -27801, -19556, 25331, 18486, -19967, -14682, 13288, 8792, -5612, -606, -1313, -8555, 7151, 18131, -10775, -26782, 11966, 33173, -10998, -36635, 8027, 35998, -4475, -31773, 412, 23632, 2277, -12975, -3550, 630, 2660, 11762, 255, -22621, -4693, 30854, 10124, -35200, -15091, 35695, 19002, -31978, -20274, 25192, 18907, -16060, -14212, 6003, 6829, 3308, 2320, -11191, -12513, 16199, 21796, -18700, -29634, 17903, 34110, -15101, -35218, 10576, 32089, -5666, -25341, 1347, 15899, 1893, -4350, -3069, -7111, 2521, 18009, 86, -26365, -3486, 31818, 7293, -33559, -10544, 31579, 12141, -26688, -12051, 19251, 9246, -10898, -4707, 2230, -1761, 5211, 8649, -11179, -15436, 14880, 20968, -16290, -24193, 15949, 25121]
1188B5121l9143q621L4176O552k6926k279J7855l432q576J0040j30j6755P389
1201d729K2496j2899k6416J6422K7904j8344k6614J9047K2499j8629j6202J7993
1213B528Q329j7154K07J6367q318j5512J5354J4397k0539j2737K3622R929k4430
1226g957o036K3200R85k0590M940J6979j1372j3022J7504R172k2712n669K6162
1239A1584K623k7341K69K5863k908k1858N845J5862r268q289J3034L60j7091P202
1253d113K0949j3494k4062J7862K5743j9904k5732J9785K3084j7632j8076J4160
1265a430J0702j0170j586O359q493l331J8448J667k7177j187L3563J869l6572
1278a7338l229L6069M434l1732m845K4246L869j4488j145L522l307P213R054j6489
$$ y = [25121, -14022, -22643, 11533, 18085, -8841, -11120, 6735, 3303, -5273, 4767, 4637, -12118, -4729, 17767, 4868, -21548, -5126, 22778, 4434, -22180, -3133, 19366, 737, -15465, 2528, 10857, -6297, -6090, 10277, 1959, -13553, 1801, 16198, -4341, -17078, 6544, 16473, -7957, -13993, 9207, 10192, -10398, -5458, 11521, 149, -12873, 4631, 13803, -8909, -14578, 11584, 14207, -13134, -12865, 12998, 10090, -11768, -5923, 9939, 671, -7618, 5416, 5776, -11315, -4113, 16836, 3342, -20720, -2858, 22885, 2981, -22751, -2966, 20118, 2486, -15590, -1430, 9272, -898, -2484, 3875, -4618, -7949, 10499, 12166, -15011, -16198, 17365, 19234, -17338, -20567, 15502, 19936, -11796, -16641, 7605, 11474, -3014, -4159, -637, -3944, 3269, 12323, -4166]
1292d166j5575K3331K1596k7155k6079K7351K8354k4740k7456J9696K3317j3243
1304E231j5954O538O174m97N001l852j6406O404K6576o809l4253N503L8407l010
1318A9053l8592J46L4732K100k7308l223J7175K564n715q9n821m052J6103R194
1332A6267k3888j4618K8586J9170k9746k1969K7807K2283k3208j9703J7065J4301
1344A2347j0128o690L717k441J650J1755n357k0409P374K7013p813l0835P006
1357a2811L1398n844k8711M652K3224m138j5456M463O670n771K387P725j0448
1370b660j0090J6993J2239k1199j3718K3306J3747k3007j2186K0889Q954j7511
1382d243m322J3391j335r265P311N465j3008k305J7550j67k0593K267K1402l942
$$ y = [-4166, -19741, 3590, 25186, -1969, -28048, -697, 27657, 2917, -24539, -4843, 18474, 5231, -10723, -4185, 1989, 1492, 6493, 2641, -13765, -7361, 19215, 12406, -21847, -16344, 22063, 19053, -19539, -19393, 15339, 17439, -9869, -13092, 4083, 6647, 932, 843, -4978, -9030, 7073, 16267, -7621, -22239, 6347, 25517, -4229, -26198, 1609, 23892, 684, -19019, -1954, 12347, 2219, -4471, -754, -3195, -1545, 10210, 4853, -15556, -8182, 18831, 11018, -19817, -12811, 18587, 12743, -15968, -11316, 11908, 7770, -7686, -3223, 3447, -2324, 63, 7788, -2660, -12750, 4243, 16482, -4717, -18435, 4871, 18618, -4389, -16575, 4314, 13268, -4243, -8565, 4826, 3491, -5774, 1537, 7002, -6006, -8311, 9239, 9072, -11521, -9254, 12148, 8206]
1396H206k0203N662J7278p739j2651R960P347j2255j864J4446l105j6157P258
1409c817J6934j0243j6350J1935J4258j2701j0611J2593N529j2001L43J1229o540
1422E58j0585J2342J0100j7180r547K0266Q913k1272p834K0292N928j7214l167
1435h400J2754n55p413N228J955j0359K925J5507o781j9948R132K2942j0005k3988
1449a7006R433K2638p944j8873O025J2914m305n348L182k947l065J1175L988j8310
1463h443n656K3633P626k6276r338K6202J0285k3364r857J8091P904j1359m261
1476d813L957q29L017O858q934j3209J3146J8868j5259k3111J5235K5093j3384
1489F635k4492J0323K1176o633j5298L254P533n96J244p36j0004P26J7629N73
$$ y = [8206, -11997, -6335, 10943, 3204, -9447, 513, 7860, -4395, -6259, 8187, 5082, -11075, -3817, 13117, 2874, -13476, -1541, 12717, 16, -10595, 1998, 7527, -4474, -4131, 7098, 558, -10027, 2315, 12415, -4765, -14312, 5954, 14867, -6405, -14239, 6053, 11981, -5233, -8400, 4354, 3799, -3614, 1614, 3569, -6790, -3865, 11642, 4861, -15087, -5955, 16987, 6982, -17006, -7573, 15065, 7121, -11752, -5727, 7187, 2882, -2466, 716, -2231, -5296, 5879, 9867, -8443, -14099, 9534, 17160, -9116, -18454, 7748, 18033, -5331, -15188, 2903, 10807, -552, -4813, -856, -1685, 1332, 8190, -744, -13953, -807, 18061, 2802, -20309, -5074, 20019, 6635, -17857, -7534, 13642, 7009, -8289, -5035, 2498, 1902, 3146, 2410, -7594, -6868, 10761, 11334]
1503A1334k3405k556K6535M706k6842o435K4278P105j9381o362J2832L870n435
1516B44j34j654m651P801R778j2443j4448J5180J8058j5959j9817J5023J9522
1529A6500j2795j6831R794J2234o715o120M086r41k034P856Q97j3951p08J8582
1543I854R89k1225j558K1678J639j9882j223J6290P6j1462J980O173m759p76P634
1558E428l746j0483P302J2858r760j3957J0998J3625j1221j1874J0758Q739r982
1571a315m525Q898j16q120M869P395r192o643J2272O005j4273m766J4595L202
1585H286j3648r90J1606j738q765N064N580q423k531J1575k2j4049J944J5564
1599I453l368j5564M117J4063m621j1092M955O942n485k081O293l012p419P506
$$ y = [11334, -12071, -14627, 11908, 16614, -10228, -16663, 7615, 14720, -4661, -11023, 1809, 5679, 244, 110, -1544, -6195, 1606, 11384, -1059, -15507, -327, 17731, 1772, -18045, -3022, 16500, 3705, -13126, -3332, 8902, 2187, -3933, 153, -788, -2822, 5034, 5931, -8020, -8728, 9854, 10843, -10382, -11940, 9738, 11377, -8505, -9728, 6562, 6638, -4824, -2844, 3329, -1430, -2206, 5428, 1682, -8801, -1499, 11359, 1599, -12358, -1360, 12265, 1044, -10830, -72, 8667, -1315, -5840, 3058, 2942, -5178, -309, 7086, -2106, -8749, 3523, 9528, -4745, -9511, 5084, 8286, -5362, -6352, 5254, 3516, -5249, -185, 5395, -3028, -5559, 6016, 5994, -8055, -6111, 9453, 6085, -9479, -5362, 8701, 4080, -7012, -2057, 4885, -600, -2681, 3612, 600, -6819, 687]
1613F87Q911j1376j0055J3600J1014j4337j0939J3494R861j1382p426Q427L817
1626D296m971P19J770n780Q54J0826k754j5316L592J8398l461j9763K668J9135
1640A0213j650j6497P62J1934k65o239O33j52j814O472L712j1691o202J5629Q611
1655A3456j7537j0542J7439J1623j5524j1213J1999R286p741n771L084J133J021
1668G13M242m240r673O195J4335o779j7848O255J9530m846j9088L034J6645j356
1682G119j2322K80O707J44n79N56n559j934J0872L883j4759n949J6828P684j7119
1697d148q714J5609Q507j2680o999Q644M328m469n07L65l735L004P967n132j1841
1712i801O421J4406o529j5509N939J5042m991j2882L988R374l303m947L064J77
$$ y = [687, 9598, -1778, -11833, 1767, 12781, -1556, -12495, 999, 10860, -522, -7948, 479, 4296, -675, 44, 1814, -3966, -3112, 7714, 4960, -10356, -6764, 11634, 8173, -11590, -8922, 10213, 8563, -7934, -7172, 4762, 4497, -1742, -1109, -1261, -3075, 3397, 7109, -4582, -10784, 4845, 13456, -4081, -14623, 2816, 14439, -1085, -12298, -299, 8987, 1246, -4525, -1441, -308, 713, 4955, 715, -8958, -2763, 11572, 4793, -13055, -6800, 12730, 7884, -11204, -8170, 8475, 7119, -5203, -4923, 1784, 1928, 1349, 1905, -3654, -5588, 5284, 9167, -5592, -11541, 5287, 12971, -4148, -12862, 2747, 11254, -1426, -8425, 219, 4547, 78, -429, -64, -3799, -795, 7172, 2040, -9801, -3380, 11026, 4497, -11012, -5073, 9969, 4978, -7904, -3916, 5458, 2155, -2792, 272, 449]
1726D49l329M467L798q211m727J1010N449j2581n730J2718N378j1732m241R919
1740B637K232p449L97M902l389k400O353L09q971J357J0882k550j1558L282J1128
1755G162l808r568M253P041m892l856N574L22o321K870P098n587p675P410P952
1770G975q458p426Q518O199p863m050O596J393n157J861L778n180k589Q184J887
1785E668j0596j534J2064J333j2405j154J1342Q45r179j03O032j030k574K800
1799A509j187m786M444O919o952q815Q443J0180q726j0746Q222J0104o839q153
1813f383M866N236k811j399J075k979J97P128p55j0767O08J3342L8j4611r74J4268
1829F079J791j2345k212R215J988n251j049R14o99L332K999o791n580R312P961
$$ y = [449, -2880, 1587, 5385, -2826, -7553, 3457, 8906, -3675, -9405, 3313, 8691, -3041, -7282, 2637, 4869, -2580, -2183, 2719, -670, -3070, 3283, 3592, -5379, -4022, 6860, 4310, -7248, -3966, 7162, 3354, -6214, -1961, 5080, 188, -3668, 1906, 2228, -4093, -1223, 5875, 288, -7387, 23, 7975, -483, -7909, 609, 6808, -1055, -5105, 1491, 2884, -2273, -412, 3366, -1814, -4403, 3781, 5668, -4928, -6462, 5602, 6935, -5470, -6624, 4718, 5563, -3616, -3719, 2313, 1283, -1291, 1509, 322, -4464, -20, 6899, -53, -8868, -425, 9755, 1029, -9717, -1495, 8609, 1770, -6383, -1517, 3719, 908, -491, 584, -2395, -2198, 4930, 4175, -6592, -5984, 7358, 7396, -7215, -8189, 6079, 7870, -4475, -6687, 2528, 4516, -735, -1784, -870, -1569, 1763, 4762, -2029, -7609, 1703, 9664]
1844I664j0382r859J0337J0724r190j0318P053Q702m508n913J946K171J71K135
1858B733j717o385K401J0040k321j2731J643J3984n55j3724m16J1990J018q867
1872b907j124N109M87r95R55l138k642O342M659q662o501R724P879r761q354Q776
1888a53P770o963o328M953L832k975o61J101k656K74N759r55q388J236J0222j161
1904D907j0898R61J0406o79q906P64O505j139l668J934O84l156K166M351m522
1919b90n484O094O216o800o481O851N883o328m507N426K524m330q9L366k564k498
1935c011N045J944o959j557Q187J270q518r82P983M84o745L74M811j483k758K965
1951A050M65m457J451N944k946p099L798P767m111p631L973O743l474n123L004
$$ y = [9664, -718, -10577, -240, 10484, 1294, -9024, -1971, 6731, 2223, -3690, -1744, 427, 598, 2733, 1016, -5369, -2968, 7072, 4751, -7980, -6337, 7647, 7092, -6632, -7048, 4942, 5960, -2907, -4031, 1078, 1565, 570, 1525, -1613, -4255, 2087, 6746, -1916, -8417, 1307, 9186, -575, -8929, -153, 7617, 654, -5674, -721, 3111, 136, -525, 576, -2080, -1806, 3953, 2998, -5390, -4154, 6068, 4907, -5991, -5030, 5376, 4697, -4209, -3445, 3060, 1921, -1747, 187, 871, -2285, -119, 4232, -290, -5774, 320, 6536, -264, -6745, 106, 5989, -339, -4846, 580, 3104, -1226, -1315, 2051, -513, -3011, 2034, 3978, -2981, -4538, 3649, 4919, -3599, -4581, 3402, 3886, -2859, -2485, 2326, 843, -1915, 1050, 1515, -2942, -1491, 4453, 1507, -5592, -1794, 5973, 1862, -5769, -1796, 4947, 1473, -3650, -646]
1966f46K674k385Q1K134l012k128N624K417p629k853Q760L284q957l492Q210L180
1982E262o653k366M416R88j940R64n65l146K534N452l952p420M705Q720m534r342
1998f877L910Q944k866p551J820N181p61k286K35j112n6M320M19p082j245R074
2014D067K155j0017l084R792L754q605l814O497L178l832j902J052l2J619K365
2029C193l737m676N088O805n530q380N409Q873m433q616L253P109j922m847P92
2044a619J889j8J325k98m354Q5O845N09q589j205R243K038q980k512P816K604
2060D779n975j914L508R19j093O69j223k453K952M383m233n863M702O876m657
2075A377p147M123O516l305n129K355L139j630p41J198j778r72M020J152n827
$$ y = [-646, 2028, -357, -276, 1858, -1154, -3282, 2342, 4759, -2870, -5723, 3037, 6321, -2636, -6128, 2082, 5262, -1391, -3757, 659, 1647, -293, 671, 106, -3040, -506, 4946, 994, -6426, -1721, 6999, 2465, -6877, -2967, 5977, 3111, -4440, -2620, 2561, 1800, -486, -251, -1363, -1419, 2901, 3320, -3762, -5007, 4067, 6222, -3795, -6879, 2913, 6667, -1938, -5752, 745, 3923, 91, -1811, -759, -791, 828, 3193, -544, -5220, -132, 6673, 1143, -7237, -1828, 7045, 2612, -6004, -2751, 4358, 2436, -2411, -1619, 270, 252, 1577, 1279, -3075, -2990, 3855, 4364, -4225, -5430, 3813, 5851, -3129, -5641, 2175, 4779, -1196, -3110, 398, 1317, 224, 893, -330, -2783, 169, 4552, 319, -5544, -842, 6034, 1377, -5770, -1647, 4869, 1564, -3565, -1210, 1929, 299, -442, 756, -1022, -1994, 2026, 3178, -2649]
2090b649j376O807J702p106j790O605J661n539j036M029L3k362J320O41k817Q69
2106a008M162j990n201K521N906k867n855K697N253k428m073K303K340k028m72
2121g40K129j539k290L381K499m670k837N393L102n566l015N141K538m302j568
2136b344K940K76j643J358L77l085O08M675j203n878J399O503j172o602R92N865
2152C066p12m416N50K493n93l13R79j845j637L740K447n143l211N854L834n889
2168g96m180N232M056m164l328K730J954j111l52k02j688J322L738j977n381K075
2184b072O609j723p165J135O991n05n941n7M178M43k042k74m20j56K643R81m594
2201a969j895N722K922o266l683O013M038n186l891L831L191k201j900O01J96
$$ y = [-2649, -4025, 2782, 4484, -2622, -4412, 2193, 3854, -1685, -2721, 1308, 1341, -1021, 299, 940, -1877, -1008, 3154, 1164, -4037, -1516, 4390, 1523, -4332, -1635, 3618, 1190, -2883, -580, 1760, -268, -740, 1389, -150, -2440, 941, 3440, -1230, -4067, 1326, 4428, -1138, -4153, 988, 3526, -776, -2344, 596, 872, -771, 587, 964, -2121, -1513, 3162, 1959, -3919, -2520, 3983, 2811, -3791, -2799, 3066, 2354, -2062, -1512, 981, 388, 75, 1054, -791, -2428, 1312, 3759, -1384, -4595, 1259, 5093, -796, -4976, 256, 4312, 148, -3180, -450, 1504, 393, 41, -161, -1849, -527, 3211, 1234, -4147, -2072, 4537, 2814, -4351, -3216, 3775, 3270, -2671, -2728, 1450, 1893, -149, -423, -843, -999, 1644, 2625, -1969, -3864, 1858, 4780, -1486, -5169, 844, 4882, -304, -4195, -364, 2827, 626, -1274, -673, -477]
2216d77Q57J760j885l620K353N238k428o234K078O667j522o234P50N247l02l608
2232a360j36J651L3O11L16k575r72M056J865n160k540N457L131n202l218M392
2248C49K941l267k119J954R32p05O55m07k188J148L617j595m708J590N277j351
2264B123n329J095M600p39l525N83K121q02l27R67j234j378K585J914l509k419
2280c274M054K713m016k817L733K433l044j588K073N60j231O79M71j933o0L190
2296A943k52m116K83M622k57m513P6L966p7k936J89J730n45k59J147j020j886
2313a905K163K544k956l123L300L468l171l487K699L037k142k107J421Q46o85
2328i8N35J24j974R5L337q1m383n5M876L93m830p43M330Q64l267p87J951L89m40
$$ y = [-477, 380, 2140, 255, -3365, -1012, 4226, 1798, -4436, -2358, 4309, 2787, -3447, -2697, 2550, 2248, -1360, -1496, 155, 188, 799, 1115, -1460, -2432, 1624, 3489, -1671, -4211, 1246, 4377, -825, -4043, 349, 3290, 23, -2096, -142, 790, 85, 740, 333, -1855, -707, 2910, 1315, -3393, -1803, 3474, 2123, -3206, -2111, 2489, 1750, -1775, -1192, 929, 127, -200, 767, -467, -1845, 740, 2654, -855, -3274, 780, 3493, -523, -3340, 393, 2826, -218, -1806, 267, 827, -404, 275, 746, -1187, -1247, 1943, 1691, -2425, -2142, 2480, 2223, -2290, -2214, 1752, 1675, -1261, -1072, 658, 113, -146, 1001, -19, -1905, 258, 2802, -154, -3277, 23, 3491, 320, -3167, -468, 2569, 427, -1680, -259, 587, -98, 437, 561, -1413, -1318, 2019, 1938, -2445, -2500, 2376, 2769, -2061, -2804, 1526, 2390, -877, -1664, 287, 676, 236]
2347B36L54j056j106K174K123l005l038L258L769l227m063K753L828j990l210
2362b200J170K060l27o43l15r38O01K566o36l885M37M750N6n116m68M842R17m087
2380a216j153K927J040j474n87j06k02J579J068k672k003L275K924l468l601L225
2396d44L824k597l550J732K831q46j679J51K39M36J219p01k570O49L677k91m383
2413b303q0M479N17m254p50L453P61k257o03R25J06M02N38j534j329K359K102
2430B532k790k725K886L081k637k993K101K599j453j790Q20O97k30M68o8j723
2446a225J55K769j30l400p8L703K90l561n37K957O26k230l00J138o6j43O81p80
$$ y = [236, 590, -466, -1572, 602, 2725, -280, -3318, -60, 3709, 482, -3581, -828, 3000, 1010, -2200, -1030, 1030, 703, 60, -255, -1193, -592, 1974, 1338, -2547, -2110, 2640, 2696, -2420, -2888, 1954, 2871, -1216, -2369, 558, 1598, 124, -463, -569, -771, 808, 1876, -796, -2799, 476, 3400, -68, -3669, -444, 3380, 783, -2767, -1035, 1796, 950, -729, -578, -339, 97, 1316, 615, -1955, -1306, 2371, 2080, -2303, -2383, 2096, 2613, -1641, -2391, 1062, 1823, -434, -1037, -112, -6, 396, 934, -600, -1929, 430, 2532, -258, -2983, -97, 2984, 347, -2646, -545, 2054, 601, -1189, -369, 328, 98, 566, 498, -1225, -1070, 1699, 1569, -1831, -1909, 1794, 2084, -1477, -2014, 943, 1569, -661, -961, 177, 111, -32, 649, -131]
$$ [...]
8191c9
##END NTUPLES=NMR FID
##END=
