##TITLE=1H_LY-DMAA.Per.1.12
 CDCl3
 8 sc, 
 17.02.2022
##JCAMPDX= 6.0         $$ Bruker NMR JCAMP-DX V2.0
##DATA TYPE= NMR FID
##DATA CLASS= NTUPLES
##ORIGIN= UXNMR, Bruker Analytische Messtechnik GmbH
##OWNER= root
$$ XWIN-NMR		Version 3.5
$$ Thu Feb 17 12:26:00 2022 Russian Standard Time (UT+4h)  she@DPX200
##.OBSERVE FREQUENCY= 200.131346
##.OBSERVE NUCLEUS= ^1H
##.DELAY= (6, 6)
##.ACQUISITION MODE= SIMULTANEOUS
##.ACQUISITION SCHEME= undefined
##.AVERAGES= 8
##.DIGITISER RES= 18
##SPECTROMETER/DATA SYSTEM= spect
##.PULSE SEQUENCE= zg30
##.SOLVENT NAME= D2O
##.SHIFT REFERENCE= (INTERNAL, D2O, 0, 15.7039)
##AUDIT TRAIL= $$ (NUMBER, WHEN, WHO, WHERE, WHAT)
$$ ##TITLE= Audit trail, XWIN-NMR		Version 3.5
$$ ##JCAMPDX= 5.01
$$ ##ORIGIN= Bruker BioSpin GmbH
$$ ##OWNER= she
$$ F:/spectra/data/she/nmr/H-F/1/audita.txt
$$ ##AUDIT TRAIL=  $$ (NUMBER, WHEN, WHO, WHERE, WHAT)
(   1,<2022-02-17 12:24:06.15 +0400>,<she>,<DPX200>,
      <created by zg, POWCHK disabled, PULCHK disabled
       configuration hash MD5:
       00 E9 B6 7A A2 85 ED C7 34 08 36 98 17 FE 4E 26
       data hash MD5: 16K
       25 66 EF C8 FB ED CE E1 DC 82 AA 69 DA 88 E3 83>)
$$ ##END=
$$ 
$$ hash MD5
$$ E7 CB DF 7B 87 A4 A6 E4 76 32 29 13 82 DA A1 E6
##$RELAX= 
##$RELAX= 
##$RELAX= 
##$RELAX= 
##$RELAX= 
##$RELAX= 
$$ Bruker specific parameters
$$ --------------------------
##$DU= <F:/spectra>
##$EXPNO= 1
##$NAME= <H-F>
##$PROCNO= 1
##$TYPE= <nmr>
##$USER= <she>
##$AMP= (0..31)
100 100 100 100 100 100 100 100 100 100 100 100 100 100 100 100 100 100 
100 100 100 100 100 100 100 100 100 100 100 100 100 100 
##$AQSEQ= 0
##$AQ_mod= 1
##$AUNM= <au_zg>
##$AUTOPOS= <>
##$BF1= 200.13
##$BF2= 200.13
##$BF3= 200.13
##$BF4= 200.13
##$BF5= 200.13
##$BF6= 200.13
##$BF7= 200.13
##$BF8= 200.13
##$BYTORDA= 1
##$CFDGTYP= 0
##$CFRGTYP= 5
##$CHEMSTR= <none>
##$CNST= (0..31)
1 1 145 1 1 1 1 1 1 1 1 1 1 1 1 1 1 1 1 1 1 1 1 1 1 1 1 1 1 1 1 1 
##$CPDPRG= <>
##$CPDPRG1= <>
##$CPDPRG2= <>
##$CPDPRG3= <>
##$CPDPRG4= <mlev>
##$CPDPRG5= <mlev>
##$CPDPRG6= <mlev>
##$CPDPRG7= <mlev>
##$CPDPRG8= <mlev>
##$CPDPRGB= <>
##$CPDPRGT= <>
##$D= (0..31)
0 1.2 0 0 0 0 0 0 0 0.06 0 0.03 0 0 0 0 0.0002 0 0 0 0 0 0 0 0 0 0 0 0 
0 0 0 
##$DATE= 1645086245
##$DBL= (0..7)
120 120 120 120 120 120 120 120 
##$DBP= (0..7)
150 150 150 150 150 150 150 150 
##$DBP07= 0
##$DBPNAM0= <>
##$DBPNAM1= <>
##$DBPNAM2= <>
##$DBPNAM3= <>
##$DBPNAM4= <>
##$DBPNAM5= <>
##$DBPNAM6= <>
##$DBPNAM7= <>
##$DBPOAL= (0..7)
0.5 0.5 0.5 0.5 0.5 0.5 0.5 0.5 
##$DBPOFFS= (0..7)
0 0 0 0 0 0 0 0 
##$DE= 6
##$DECBNUC= <off>
##$DECIM= 32
##$DECNUC= <off>
##$DECSTAT= 4
##$DIGMOD= 1
##$DIGTYP= 9
##$DL= (0..7)
0 120 120 120 120 120 120 120 
##$DP= (0..7)
150 150 150 150 150 150 150 150 
##$DP07= 0
##$DPNAME0= <>
##$DPNAME1= <>
##$DPNAME2= <>
##$DPNAME3= <>
##$DPNAME4= <>
##$DPNAME5= <>
##$DPNAME6= <>
##$DPNAME7= <>
##$DPOAL= (0..7)
0.5 0.5 0.5 0.5 0.5 0.5 0.5 0.5 
##$DPOFFS= (0..7)
0 0 0 0 0 0 0 0 
##$DQDMODE= 0
##$DR= 18
##$DS= 0
##$DSLIST= <SSSSSSSSSSSSSSS>
$$ [...]
##$SUBNAM2= <"">
##$SUBNAM3= <"">
##$SUBNAM4= <"">
##$SUBNAM5= <"">
##$SUBNAM6= <"">
##$SUBNAM7= <"">
##$SUBNAM8= <"">
##$SUBNAM9= <"">
##$SW= 18.0517287032376
##$SWIBOX= (0..15)
0 0 2 0 0 0 0 0 0 0 0 0 0 0 0 0 
##$SW_h= 3612.71676300578
##$TD= 16384
##$TD0= 1
##$TE= 0
##$TE2= 300
##$TE3= 300
##$TEG= 300
##$TL= (0..7)
0 120 120 120 120 120 120 120 
##$TP= (0..7)
150 150 150 150 150 150 150 150 
##$TP07= 0
##$TPNAME0= <>
##$TPNAME1= <>
##$TPNAME2= <>
##$TPNAME3= <>
##$TPNAME4= <>
##$TPNAME5= <>
##$TPNAME6= <>
##$TPNAME7= <>
##$TPOAL= (0..7)
0.5 0.5 0.5 0.5 0.5 0.5 0.5 0.5 
##$TPOFFS= (0..7)
0 0 0 0 0 0 0 0 
##$TUNHIN= 0
##$TUNHOUT= 0
##$TUNXOUT= 0
##$USERA1= <user>
##$USERA2= <user>
##$USERA3= <user>
##$USERA4= <user>
##$USERA5= <user>
##$V9= 5
##$VALIST= <valist>
##$VCLIST= <CCCCCCCCCCCCCCC>
##$VD= 0
##$VDLIST= <DDDDDDDDDDDDDDD>
##$VPLIST= <PPPPPPPPPPPPPPP>
##$VTLIST= <TTTTTTTTTTTTTTT>
##$WBST= 1024
##$WBSW= 4
##$XGAIN= (0..3)
0 0 0 0 
##$XL= 0
##$YL= 0
##$YMAX_a= 360834
##$YMIN_a= -308443
##$ZGOPTNS= <>
##$ZL1= 120
##$ZL2= 120
##$ZL3= 120
##$ZL4= 120
##$ABSF1= 10
##$ABSF2= 0
##$ABSG= 5
##$ABSL= 3
##$ALPHA= 0
##$AQORDER= 0
##$ASSFAC= 0
##$ASSFACI= 0
##$ASSFACX= 0
##$ASSWID= 0
##$AUNMP= <proc_1d>
##$AZFE= 0.1
##$AZFW= 0.1
##$BCFW= 1
##$BC_mod= 2
##$BYTORDP= 1
##$COROFFS= 0
##$CY= 11.3945322036743
##$DATMOD= 1
##$DC= 2
##$DFILT= <>
##$DTYPP= 0
##$F1P= 2.36226072786647
##$F2P= -0.459571619588291
##$FCOR= 0.5
##$FTSIZE= 0
##$FT_mod= 4
##$GAMMA= 1
##$GB= 0.15
##$INTBC= 1
##$INTSCL= 1
##$ISEN= 128
##$LB= 0.24
##$LEV0= 0
##$LPBIN= 0
##$MAXI= 10000
##$MC2= 0
##$MEAN= 0
##$ME_mod= 0
##$MI= 1.114404
##$NCOEF= 0
##$NC_proc= 0
##$NLEV= 6
##$NOISF1= 3.799351
##$NOISF2= 2.8
##$NSP= 1
##$NTH_PI= 0
##$NZP= 0
##$OFFSET= 15.70392
##$PC= 1
##$PHC0= -16395.17
##$PHC1= 20.20078
##$PH_mod= 1
##$PKNL= yes
##$PPARMOD= 0
##$PSCAL= 0
##$PSIGN= 0
##$REVERSE= no
##$SF= 200.130013532006
##$SI= 16384
##$SIGF1= 3
##$SIGF2= 2
##$SINO= 400
##$SIOLD= 16384
##$SREGLST= <1H.CDCl3>
##$SSB= 0
##$STSI= 0
##$STSR= 0
##$SW_p= 3612.71676300578
##$SYMM= 0
##$S_DEV= 0
##$TDeff= 0
##$TDoff= 0
##$TI= <>
##$TILT= no
##$TM1= 0
##$TM2= 0
##$TOPLEV= 0
##$USERP1= <user>
##$USERP2= <user>
##$USERP3= <user>
##$USERP4= <user>
##$USERP5= <user>
##$WDW= 1
##$XDIM= 8192
##$YMAX_p= 0
##$YMIN_p= 0
$$ End of Bruker specific parameters
$$ ---------------------------------
##NTUPLES= NMR FID
##VAR_NAME=  TIME,          FID/REAL,        FID/IMAG
##SYMBOL=    X,             R,               I
##VAR_TYPE=  INDEPENDENT,   DEPENDENT,       DEPENDENT
##VAR_FORM=  AFFN,          ASDF,            ASDF
##VAR_DIM=   8192,          8192,            8192
##UNITS=     SECONDS,       ARBITRARY UNITS, ARBITRARY UNITS
##FACTOR=    0.0002768,     1,               1
##FIRST=     0,             0,               0
##LAST=      2.2672688,     0,               0
##MIN=       0,             -308443,         0
##MAX=       2.2672688,     360834,          0
$$ Real data points
##PAGE= N=1
##DATA TABLE= (X++(R..R)), XYDATA
$$ [...]
927d961j66J0003j083q205K849O026n025l675P319J757r714m42J1450l87j2496
942f750O43J2440p51j1208P60R021j285n937K369K566m026P55O243l569q507N515
958a721J0736o297j2250O178J2735n261j1833L919R574k702o239J814K044j718
972a021K236K542o305m131R315O115j1117q102J1530R432j0425r756Q375Q803
986G491n603o545K992L196p71R53m19n271O93R069Q8j1995j542J3487L196j3571
1002d552m609J1915N315r262m986N820L480k233q87r89k438L338N999m473r214
1017g776M537J1637l476j2834K122J2430m96j0741n83P869J001m218n19L02q11
1032a556L018K777n625n102P063P197p482q690O842R238n574q679L982P066k462
$$ plain form
927 -4961 -5127 4876 3793 -4412 -1563 4463 -562 -4237 3082 4839 -4875 -5317 6133 5746 -6750
942 -6750 -6107 6333 5582 -5626 -4866 4155 2870 -3067 -698 1868 -2158 -1403 4840 1271 -7236 -1721
958 -1721 9015 2718 -9532 -3354 9381 4120 -7713 -3794 5780 3078 -3161 -1347 697 -1021
972 -1021 1215 3757 -2548 -6679 2636 8751 -2366 -10468 1062 10494 69 -9687 -1312 7491
986 7491 1888 -4657 -1665 1531 760 1713 1294 -3977 -3284 5785 5873 -6122 -7664 5823 9019 -4552
1002 -4552 -9161 2754 8069 -1193 -6179 -359 3121 888 1 -988 -3426 -88 5911 1438 -7776
1017 -7776 -3239 8398 4922 -7912 -5790 6640 6144 -4597 -5180 2689 3690 -528 -1047 -745 -1556
1032 -1556 1462 4239 -1386 -6488 575 7772 290 -8400 -1558 7680 2106 -6573 -2591 4475 2013
1047B013m489J359J523q64J772J083m619j753O756K842q039l857Q404M442p889
1062a316m498O599L883n135k657L502P10k086J498J026l776m19N587L07o810m01
1078c986P489N51p285m48O511J56n233N37L806j526k351K802R89l986j1M893o99
1095B209n561J105N705j450n368J655M548k062l440K560K127l205q43M040k55
1110A765m611J113N011j564n064J966M729k087l881K087K744k313j320K701j92
1125A084l267J546L749k588m371L258M687l533m673L233M306k868l319K363J920
1140A527j840l19J793j548j724L150K138m564k386N206K997n436l280N048L235
1155C997m145k882L023J880j827n14O37j217J22L001m86m607L25N812R4o367n76
$$ plain form
1047 2013 -2476 -1117 406 -458 1314 2397 -2222 -3975 2781 5623 -2416 -6273 2131 6573 -1316
1062 -1316 -5814 785 4668 -467 -3124 378 1088 -998 500 1526 -2250 -2669 2918 3225 -3585 -3986
1078 -3986 3503 4054 -3231 -3679 2832 2988 -2245 -1708 2098 572 -1779 1023 2012 -1974 -1985 2908 2209
1095 2209 -3352 -2247 3458 2008 -3360 -1705 2843 781 -2659 -99 2028 -1177 -2020 2020 1765
1110 1765 -2846 -1733 3278 1714 -3350 -1384 3345 1258 -2623 -536 2208 -105 -1425 1276 1084
1125 1084 -2183 -637 3112 524 -3847 -589 4098 565 -4108 -875 3431 563 -2756 -393 1527
1140 1527 -313 -632 1161 -387 -2111 1039 3177 -1387 -3773 1433 4430 -1006 -4286 762 3997
1155 3997 -148 -3030 -7 1873 46 -468 169 -1048 -926 2075 1589 -3018 -2693 3119 3213 -3154 -3730
1172c730O210J142n425j375M169J223k406o31O91l88Q92J753k020l245K652M509
1188D021k748n482K335N858j802n552J079M535m10l125O6J289j39N85O96k273
1204a067j391L529K358m280l140M418L853m051m018L314L725k362k906J378J578
1219I38o19m0J15j609m2L039K18m171o61M728J192m810j576M396J691l494j495
1236b200K507Q97j361RM73j181L43K340p62l232R17L818q09m153O49L950m95l506
1254a796M36K634n69j713R18N57j325L41J913j104k357J596K686j733k845J863
1270d98K692j715k273J684J670j624q39J580J6j657P27J742j340j933J777J841
1286A850j989j760K053J484k050r71J818M46j770L06J660j031j561J662J575k081
$$ plain form
1172 -3730 2480 3622 -1803 -3178 991 2214 -192 -823 -132 -520 372 2125 105 -3140 -488 4021
1188 4021 1273 -4209 -1874 3984 2182 -3370 -2291 2244 1834 -1291 -1225 64 -75 510 1206 -1067
1204 -1067 -2458 1071 3429 -851 -3991 427 4280 229 -3789 -475 3250 888 -2018 -640 938
1219 938 319 279 394 -1215 -1257 1782 2000 -2171 -2832 1896 3088 -1722 -3298 1098 2789 -705 -2200
1236 -2200 307 1204 -157 -148 325 -856 -513 1827 1065 -2167 -1250 2568 1759 -2394 -1745 2205 1710 -1796
1254 -1796 -1360 1274 705 -1008 -90 467 -858 -517 1396 292 -2065 -469 2217 484 -2361 -498
1270 -498 2194 479 -1794 -110 1560 -64 -903 677 693 -964 -237 1505 165 -1768 9 1850
1286 1850 -139 -1899 154 1638 -412 -1383 435 881 -889 -583 1077 46 -1515 147 1722 -359
1302c59j435K297J370k261j159K123P51j801k64J426l94j137J159P87j813o68
1318a378K279O45k708o53K789O37k692n07K262L99j708LJ013l77l67J057j68j719
1336a193N74K359p17k776P32K934o16k833L64K426k23j883K74R79m08j31O48p07
1354a97j091J352J621j823k064J977K394j817k495J633K241j067j841P90J081
1369F94m31k24K65o75k83J526L95k203q36K705J029k757j343K539J431k059j329
1386a556J485R71q62m28L56l84K02J161l58j910M19K456l00k641K9K685J58k378
1404h95l21J924K06j169j50N25k53J13O48o91j169R72J736j208j993J138K143
1421A556r50k074Q00J726n49j246N03O29m15O7N49o92p12J190Q71j450j155J624
$$ plain form
1302 -359 -1794 503 1873 -388 -1547 576 1327 -474 -738 688 294 -843 316 1103 -710 -1378
1318 -1378 901 1546 -1162 -1815 974 1611 -1081 -1588 674 1073 -635 -632 381 4 -363 694 526 -1193
1336 -1193 -619 1740 1023 -1753 -1021 1913 1297 -1536 -1172 1254 1031 -852 -578 401 -7 -138 510 -197
1354 -197 -1288 64 1685 -138 -2202 -225 2169 352 -2143 -510 1731 664 -1177 -387 694
1369 694 263 39 304 -371 -654 872 1267 -936 -1772 933 1962 -795 -2138 401 1832 -227 -1556
1386 -1556 -71 900 38 -390 -34 -418 -216 945 587 -1323 -904 1552 1252 -1389 -1360 1325 1483 -895
1404 -895 -1216 708 914 -255 -405 120 -133 -20 628 -63 -1232 -260 1476 268 -1725 -587 1556
1421 1556 606 -1468 -668 1058 509 -737 -234 395 -20 47 596 -96 -808 382 1253 -197 -1352 272
1439B72J206j603j193J345J099j147q25R33K44o54J92N37p25m38J159M42j404
1456e60m59J568M73j515m25J457K53j177j7R15k50o71N23M47q46l46J141J62j351
1475f78j05J374Kj329J27J120k54q78M09O23o54k19Q92N9j118J44J260j64j385
1494g74L16J295k33j209L11Q83m08m84M67J16o92K44P99o02r23O06J170o96j232
1513a046P59J165o83r27N26P21m17k91K96m5l31N21M14q55n00J101O27j207q05
1532i77J198Q03j122p30P61O45n31l76L08r7o2M66k6q74J02J175o6j336q6J447
1552F22K45j342k54J131K33p44j34L46l9N8K15k97o64O01P99n95j119O18J199
1571H79n67j167L33J048k15p19J47M34j29m4J05l35j96P14L56q78m99R91O90j000
$$ plain form
1439 272 1478 -125 -1318 27 1126 -21 -846 87 331 -323 -131 406 -319 -757 402 844 -560
1456 -560 -1019 549 1022 -493 -918 539 792 -385 -402 513 263 -408 115 562 -284 -630 511 673 -678
1475 -678 -783 591 593 -736 -609 511 257 -621 -212 411 -243 -462 430 489 -629 -485 775 611 -774
1494 -774 -458 837 604 -605 -294 589 181 -303 164 280 -412 -168 631 29 -894 -288 882 186 -1046
1513 -1046 -287 878 195 -732 -206 515 98 -193 103 58 -273 248 662 -193 -693 408 1035 -172 -977
1532 -977 221 1024 -98 -828 -67 578 47 -329 -21 -118 -180 286 260 -614 -512 663 597 -739 -825 622
1552 622 867 -475 -729 402 635 -109 -243 103 64 122 337 40 -624 -23 776 181 -938 -320 879
1571 879 312 -855 -522 526 311 -408 -261 173 44 0 105 -230 -426 288 644 -234 -733 258 948 -52
1591e2p49Q56O67o67n98M94L17k66k5J16l44r6O79l3p85k9R40J11j038j10R52
1612C40J68p56j22O07K5l40R6J95l18J2M98k04o05K27P63l15q35L14P79l42o77
1633d90L39M31l30k59L96Km56K65M11l17m31M59M91m88n01N79L90n08l09N55N8
1654B87m72O4M35k23m07L60L49m88l89N76L34o25k45N77J36n10jL65r7l41L98
1675H3K50m95k16P00J34o90j36P01J53o91o1N83m2m72J66K48k91j45M22p1n12
1696c82J38O97k99p03J79Q87l00p35K34O73k16m35K22K04k38L4L77l01l89M55
1716A02N83o68o12O84O03o63o50N94N52n09l78L18J41k36P1K46l59j72N84J85
1736D16q05j72R42K33r34k52R23K69p95k23O33L2l91J55J33l29N2M75j75p38K66
$$ plain form
1591 -52 -801 55 722 55 -543 -49 268 2 -23 93 -251 -347 332 299 -486 -515 425 536 -502 -612 340
1612 340 508 -248 -370 237 262 -78 18 213 -105 -93 405 201 -404 -177 586 271 -564 -250 529 187 -490
1633 -490 -151 280 -50 -309 87 89 -367 -102 309 -8 -439 20 511 23 -478 101 491 -17 -326 229 287
1654 287 -185 -121 314 91 -316 44 393 -95 -484 92 426 -199 -444 133 269 -241 -242 123 26 -315 83
1675 83 333 -162 -378 322 456 -234 -370 331 484 -207 -268 315 273 -199 -33 215 -76 -221 201 130 -382
1696 -382 -244 453 154 -549 -370 517 217 -518 -284 389 173 -262 -40 164 -74 -40 337 36 -353 102
1716 102 685 17 -595 89 692 29 -621 -27 525 16 -362 -44 97 -139 -68 178 -181 -353 231 416
1736 416 -389 -561 381 614 -320 -572 351 620 -175 -398 235 267 -124 31 164 -165 -113 362 187 -551 -285
1757b85Q77l24r69L28R57k63q65J90P42k26m63K11K42l00J02L69l00m88N66N88
1777F89o85o20O99O98p74o52O36N76n73m10M70J26m00J02L09l01l36N40L29p66
1797c43k73R30K67r35k12Q87J48p29j19O81qn00K05L41m14k13O36k0p36L3R20
1818E46j98r45J87R30k66p91K76O57l78m81M99K46n26j4O23j46n85K21P41l73
1838B23p60M72O37n30n54N78M44o36k99P45lo17J3O49k41o07L81N88n61n26O53
1859D9M04o75k22O99R2p16J04P10l19o29N01N65n34n21O60M33p52l27P15K35p74
1880c02k3O09j16o11M12N36o70m82Q32M08r15l33R25L11r39j26Q39M0p25J77N52
1901C99l47l28M98J67p10r0R71p3j063J01J087j61j063J66R41k49p65L00N07l55
$$ plain form
1757 -285 592 268 -701 -373 584 321 -544 -354 388 162 -301 -90 152 -148 -46 323 23 -465 101 689
1777 689 4 -616 83 781 7 -645 -9 567 -6 -416 54 180 -220 -118 191 -110 -446 94 423 -343
1797 -343 -616 314 581 -354 -566 321 469 -260 -379 302 294 -206 -1 340 -74 -287 349 329 -407 -374 546
1818 546 348 -597 -410 520 254 -537 -261 396 18 -463 36 282 -244 -258 365 219 -366 -145 596 223
1838 223 -537 -65 572 42 -512 66 510 -126 -425 320 317 -300 -287 362 121 -486 -105 483 -78 -604 49
1859 49 453 -222 -444 255 347 -369 -265 445 126 -503 -2 563 29 -492 168 601 -151 -478 237 472 -302
1880 -302 -325 284 168 -443 -31 505 -165 -647 185 593 -322 -655 270 581 -358 -484 355 395 -330 -153 399
1901 399 52 -276 222 389 -321 -411 560 487 -576 -475 612 451 -612 -446 495 246 -519 -219 288 -67
1921f7k77N84o4o49K77Q18m49r98P21J024p22r74O37R40o36p47N19N11m64j52
1941a68M18j03n63N18N11q22n78R45O91j105p10J122O94j101m95Q49M25o93j27
1960b92N04j92l15M95K60q40j62J082J64j258j56J267J75j240j23J059K6q22O1
1979c07M84j98k75N38m1p08J57R57k62j125L87J240m28j167M48R90l97p98L98
1998a07N54m34k72N17o2o54L74P62o19q43O85R38q29r36Q24Q31p42o09O63M05
2018D46p00p7O40j38o62N65N93p80n30Q76N91r20o38J034L59r24k47Q44M0p41
2038c69J77O19m28n60O57M75q79l83J002K21r59j65R97Q2q79N5Q46l73o20N20
2058C6N17o60l41Q52J93r82j36J002L6j000P4R14k40p63L29N79m71m04O23K09
$$ plain form
1921 -67 -344 240 176 -473 -196 622 173 -825 -104 920 198 -776 -139 801 165 -582 -63 448 -16 -168
1941 -168 250 147 -416 102 613 -209 -787 158 849 -256 -966 156 850 -251 -746 103 528 -165 -292
1960 -292 212 20 -295 200 460 -380 -542 540 704 -554 -710 557 732 -508 -631 428 454 -368 -307
1979 -307 177 -21 -296 242 201 -507 -350 607 345 -780 -393 847 419 -748 -300 690 293 -505 -107
1998 -107 447 13 -259 258 196 -458 -84 678 59 -784 -99 839 10 -926 -102 729 -13 -622 41 446
2018 446 -254 -331 309 171 -491 74 667 -113 -643 233 824 -96 -734 300 659 -265 -512 332 372 -369
2038 -369 -192 427 -1 -561 96 571 -308 -691 311 532 -427 -592 405 487 -392 -337 509 136 -484 36
2058 36 553 -107 -448 404 597 -385 -521 481 517 -483 -409 505 265 -498 -169 410 -61 -465 158 367
2078C67q23nR55p8j004J18J160l19r72L70P79l32o23M44L60n55r8O77j81p41L33
2099a68Q71n25j014O80R30o48r39O34P34n10n10N00K27m92J45N23m66n52O74O84
2119G78q84p55J007Q07j012o87Q49O69q17n13O60J69m31J08L10m75k43P90K31
2138E61j055k83J206L30j215l38J161L17r49j73O51J01m72K18K04n08L3P52j87
2157C54r60J89J174k45j236J59J219j93j032K05P67j96n28K34K32m24J21O70m17
2176I3q21N87R51o09r97O06J035n22j038M90Q39m77m96M19J81m59J85M78m68o23
2196f46O67O95q42o73Q82O47q75n86P55M84o41j92N01n9l95K78M19n66l36P46
2216B63L33r14k45R18L39r87k90R24Q5p34J7O18l21l86N00K02o30j91Q40J20q96
$$ plain form
2078 367 -456 -461 494 416 -588 -470 690 371 -601 -231 548 216 -407 37 397 -158 -256 421 240 -501 -168
2099 -168 703 178 -836 -156 774 126 -813 -179 555 45 -465 35 262 -230 -85 438 -28 -580 94 778
2119 778 -106 -861 146 953 -59 -746 103 772 -45 -558 102 271 -160 -52 258 -217 -460 330 561
2138 561 -494 -777 429 759 -456 -794 367 684 -265 -438 213 314 -158 60 264 -244 -211 541 354
2157 354 -606 -417 757 512 -724 -565 654 461 -571 -366 401 205 -323 -89 143 -281 -160 510 93
2176 93 -728 -141 810 201 -796 -190 845 323 -715 -225 614 137 -359 60 241 -218 -33 445 -23 -646
2196 -646 21 716 -126 -799 83 730 -145 -731 24 508 -133 -325 176 117 -278 0 419 -147 -483 263
2216 263 596 -318 -563 355 694 -293 -583 341 426 -308 -291 327 6 -380 120 322 -308 -499 341 461 -435
2237d35p2R93m6r49J11P40p7n72K15M21l86k27N45J17p47O0Q15j33q50J78Q58
2258E59k57q16K74O57l54m65M33K17n20M0O28k58p06M22P33l90q54M38Q56m35
2278B02p11M31N45m39j80L52j6m85K66N04m42o01N71O31o85o50O41O61o53n31
2298e89N89L92m29k60M19r3k76L81K60o38k48Q30L25r41l46R85K98q25l66P13
2318A81K96n51j68L66j23j71L44K2o08K9Q45l8j015R5R89K5r12j09Q73N8p19P9
2340b12L88j18j28L31j72m57K72O90m49p26L55Q13l18r15L94O74k03o25K13L87
2360A94k40m9K39j58l10L87L86m89n46O07O98o72o83O31N77m42n45L84L46l55
2380d0o5L17k96k36M54K54o47l00P42L37p75l43P20L57o15k58M83R8k89P8K33
$$ plain form
2237 -435 -507 486 440 -509 -398 342 265 -307 -92 329 -57 -284 261 378 -369 -309 506 373 -477 -299 559
2258 559 302 -514 -240 417 63 -402 31 248 -272 -232 396 138 -568 -146 587 197 -657 -219 637 202
2278 202 -509 -78 467 28 -152 200 184 -301 -35 469 27 -574 -3 628 -57 -707 -66 595 -58 -589
2298 -589 0 392 -37 -297 122 29 -247 134 394 -244 -492 338 663 -278 -624 361 659 -166 -532 181
2318 181 477 -74 -242 124 1 -170 174 196 -412 -383 462 424 -591 -496 493 518 -394 -503 370 428 -291 -212
2340 -212 176 58 -70 261 89 -368 -96 594 145 -581 -226 587 269 -646 -252 422 219 -406 -193 194
2360 194 -46 -95 144 -14 -324 63 449 -40 -586 21 719 47 -636 -5 572 130 -415 -31 315 -40
2380 -40 -105 212 -84 -320 134 388 -259 -559 183 520 -255 -598 122 479 -136 -394 89 187 -102 -24 209
2401B09k41j72N08J2n88o6P27M2p39q1P59N2p04M6L73ql24J51K24l67n0N63j62
2424A64n52J17O99j76o65J56O94k36n05K00L81k37j81K71Pm09J75M31k47n13K96
2445a30N89l42n86L78M62l21l97L12J97k35r7K74q1k68K85L26m12l09M10M04m18
2466D1m81M40M25l65l12K73J93k22l7J65j52j94L32J63m68k52O26K70p00k03N88
2487A30K13m98j78L48J32k26J01J03k61K0L94n7n51N7O32l7o50k7O22J6m71p7
2509b65L45lj65R3J3j83Q7L00j94m74L59N47l71n39K88N53j46n26J47M24j22k12
2531d4J02Lj23J10K20l20l42M40L56m40l79L62M83l73m49K96L15k01j48J05K6
2552aq3J73J10l52j07M91J14n52j80N47K66m99k44L75J86k70m6J13r9jJ75K3l48
$$ plain form
2401 209 -32 -204 304 316 -272 -338 389 431 -308 -389 370 422 -282 -236 137 129 -195 -44 180 -187 -237 326 164
2424 164 -388 -271 428 252 -413 -257 437 201 -304 -104 277 40 -141 130 137 -272 -97 334 87 -426 -130
2445 -130 459 117 -469 -91 371 50 -347 -35 162 -73 -170 104 23 -245 40 366 -46 -355 55 459 41
2466 41 -440 0 425 60 -252 21 214 -8 -45 120 -32 -226 106 269 -199 -451 175 445 -255 -458 130
2487 130 343 -155 -333 15 147 -79 22 125 -136 -116 278 221 -330 -273 359 322 -328 -355 267 283 -188 -265
2509 -265 80 77 -88 5 18 -165 -78 222 28 -446 -87 460 89 -450 -162 391 245 -281 -134 290 168 -44
2531 -44 58 61 -62 48 268 -52 -394 46 402 -38 -417 -55 428 55 -394 -98 217 16 -132 -27 -1
2552 -1 -84 89 199 -153 -260 231 345 -207 -387 160 426 -73 -317 58 244 -26 -72 41 -58 -59 116 139 -209
2575b09J3M38qn69L1N23K6m95qL97J9k45k7J80o0l8J30m2k23R0M61k59m67J41
2599b01N37j12m82Q4L40r6k72J67J01j57M5K04j70k42K42K84l06l21K89L94k31
2620I7l70J87K89j60j42R6R7j35O3J34k71j04L34J91l89k34L36K31k37l32K61
2641e8J72k01j9R1K3l9R6K7k12o4L40J00m50j8L68J18l78q6K99Q2k34J3K4J1n1
2666d6J34l7k91J02M15j96l97J18L91l1l64K0L36K0k57J7P7j8L1J47j59k22J83
2689b7L34k50l56K57L18k27k85J38K53j37r4kQ6l1O1K5j38j39K77J32k85j90L51
2712G1K18l31k31L10J95j80j26Q4J7j8J26o3k11K8K68M0l89j9L66J01l81j13L13
2735G5J15k13j31J56J9m9P5m4j15M7K25ml68J43L35j03l32M0L02p2j85o5K20K
$$ plain form
2575 -209 -196 242 234 -335 -304 219 245 -250 -258 139 158 -87 -114 66 6 -32 98 56 -167 -77 384 125 -342 -201
2599 -201 336 224 -258 -174 166 70 -202 -35 66 -91 -46 158 -12 -254 -12 272 -34 -355 -66 328 97
2620 97 -273 -86 203 43 -99 -3 94 -41 22 156 -115 -219 115 306 -83 -317 19 250 13 -319 -58
2641 -58 114 -87 -106 -15 8 -31 65 92 -120 -184 156 256 -194 -212 156 274 -104 -190 109 191 -43 -30 -6 5 -46
2666 -46 88 51 -240 -138 277 81 -316 -198 193 162 -202 -182 154 174 -83 -66 11 -7 24 171 12 -210 -27
2689 -27 307 57 -299 -42 276 49 -236 -98 155 18 -76 -78 8 -23 38 63 -75 -214 63 195 -90 -280 71
2712 71 289 -42 -273 37 232 52 -74 10 27 9 135 72 -139 -111 157 197 -192 -211 155 256 -125 -238 75
2735 75 190 -23 -154 2 21 -28 47 3 -112 -65 160 156 -212 -69 266 163 -169 -129 173 101 -84 -149 71 73
2759G3j19O1n3j00J27J28j49k49K13L10j88l24J57L40j30k28P5J35m2j9M8j24
2781e8l0K18P7k58k09L18K25k73k45K31J91k01j22J03J07q8J4K1j22k2K14j1k34
2804a54n0L28J10k93j55L36M5j93o8J02L3m8K8M8j64K0K33l1l34N8K97m2k52n6
2828b02K78L9k40k0K07m8n3M4J3j29Q8J72j00k70J74K98o9l92J10L19p2k09l0
2851i2J76r0o5J10j26n1J15K10k46j85K75J49j84k36J71K88j98j74J29O8J3n2
2873EK1m4k5J39O8k15j86L45J12l23r7K46K01l26j32J94Q3r5J6M7j04O2R5ok20
2898a39NL52j6l54p5L91Jk72K9J33N7j37J3M1q3M1P3j7k12R4K40j22k69J05L12
2923A91j32k54K3L05j28m2nJ8o1J33J23k44n8J53K05j81k52K20J90j93k59J88
$$ plain form
2759 73 -46 15 -38 -138 -11 117 -32 -281 -68 242 54 -270 -113 227 97 -131 -56 79 37 18 66 -58
2781 -58 -88 130 207 -51 -260 58 283 10 -235 -4 187 -14 -136 -33 74 -14 0 21 -101 -123 91 80 -154
2804 -154 -204 124 234 -59 -214 122 167 -26 -94 8 41 -7 21 69 -95 -75 158 127 -207 -149 148 106 -146 -202
2828 -202 76 115 -125 -145 62 14 -39 5 18 -111 -23 149 49 -221 -47 251 182 -210 -100 219 147 -62 -92
2851 -92 84 -6 -71 39 -87 -138 -23 187 -59 -244 31 180 -4 -240 -69 219 21 -153 -24 44 57 5
2873 5 26 -18 -43 96 164 -51 -237 108 220 -103 -200 46 247 -79 -211 -17 66 -29 -13 34 -70 -8 87 81 -139
2898 -139 -134 218 202 -152 -227 164 165 -107 -78 55 112 -25 -12 29 -54 -13 60 43 -169 -75 165 43 -226 -121 191
2923 191 59 -195 -172 133 5 -37 -42 -24 -85 48 171 -73 -131 22 227 46 -206 14 204 11 -248 -60
2945f0K02j40r3J17m2n3J21O4k01q4K21J10k70q6K32J49k20j28K01N6q9j01J37
2968D3j9k6Q4K2j63m5J77Q0k75p2L26J2k42j21K77j3j36k5R9Km5P3M5k00P9K21
2994A58q3k41O1L07o6k83K1K12mj75R8R8j73O5R9q6j40N0K73j59k67J70K21q0
3018G6k40P9K16p9j65J01L1o4O1N3l8j72J95J42k13j23J79J61j87j22O4J84j01
3041C8j59R7K5q7P3Q7j41m0J79O5k71p1K56J86k84j17J68J50k09m1J52m2oP5r4
3066a1m0QJ77m7k03o3K92N8l23rK37Q1k48o4J28O2j17J32n3r2N3J46k6l11K02
3091c1J82l5k55O2K78j06j49mJ51q3n1P0k4q9O8J41j46j89J78K62j70k59J71J80
3115A52j39j52J02Q1m9K4L3q6LL8J43k36o2K22Q9k03q9J53J29j08k03Q7Q1k7k9
$$ plain form
2945 -60 142 2 -91 26 -16 -69 52 116 -85 -169 52 162 -108 -194 38 187 -33 -161 40 96 7 -94 43
2968 43 24 -2 82 104 -59 -104 73 153 -122 -194 132 144 -98 -219 58 45 -91 -116 -17 -15 -60 13 58 -142 -63 158
2994 158 75 -166 -105 202 136 -147 -126 86 82 -93 5 103 -70 -5 94 8 -132 -82 191 32 -235 -65 156 76
3018 76 -164 -85 131 52 -113 -12 19 -45 16 69 31 -141 54 196 -17 -140 39 200 13 -109 -45 139 38
3041 38 -121 -24 1 -86 -13 74 -67 -107 72 137 -134 -205 51 237 -47 -164 4 154 -55 -96 56 14 8 83 -11
3066 -11 -51 -43 134 87 -116 -179 113 171 -152 -161 76 157 -91 -155 -27 35 -82 50 -3 -95 -42 104 78 -233 -31
3091 -31 151 116 -139 -77 201 95 -54 -58 93 10 -41 29 5 -84 -16 125 -21 -210 -32 230 60 -199 -28 152
3115 152 13 -139 -37 44 -5 19 52 -34 -31 7 150 -86 -148 74 163 -40 -129 24 153 45 -158 -71 10 -17 -46
3140d6P7r2nQ2Q1k14KJ96M9k36k1J87J04k18m4J47M9j69M9J9o8M9J49m6k15Q1
3166e3K37n1l24L7K79Kk51M7J07J2q5O7l2l3N0R6o6k06J74J69r4k27P4K52j48
3191C3j70L9J74n0o2oJ6KM3R9j66q8J27J60j91j27J17K49k15j11P2J06l8k4N3
3216D2r7M4J25m2o5j33J86J24k59j08K38J06k10q3J37M2l3n9P2p8L1J04o1k10
3240a87J08K12K9k85m6K48O1k04l6J89M6j37m1N0j3L0R5p0j98J31J35r0k36J43
3264f6J81p3j87L6J62J4j56J8M0J8%J02j33l4N0J98j47k00P3L01j06k51R6J55
3288I1m6p8J6N6k8k6P1j13q2J53J21j87j04J50J08j30j74J50J49o2r0P2rK9oK9
3314F0j17n2K77l8j68j29K35J03j94j35J86L0n3j41R6P6p3J2L1j14J6J99n2j38
$$ plain form
3140 -46 31 -61 -66 16 97 -117 -115 81 130 -106 -127 60 164 -54 -98 49 98 -71 -22 -3 -71 -22 127 81 -134 -53
3166 -53 184 133 -191 -154 125 127 -124 -77 30 42 -43 24 -8 -41 9 105 39 -167 7 176 82 -145 -71 181 33
3191 33 -137 -98 76 26 -36 -42 -26 -24 19 118 -48 -136 -9 151 -40 -167 -50 199 -16 -127 -55 51 13 -11 42
3216 42 -55 -11 114 72 7 -126 60 184 -75 -183 55 161 -49 -132 5 47 14 -45 27 -51 -20 84 23 -187
3240 -187 -79 133 162 -123 -169 79 140 -64 -100 89 135 -2 -43 7 -6 24 119 49 -149 -18 117 27 -209 -66
3264 -66 115 42 -145 -109 53 67 -89 -71 -31 -13 -13 89 -44 -78 -28 170 23 -177 -104 197 91 -160 -64 91
3288 91 45 -33 -17 39 11 -15 56 -57 -139 14 135 -52 -156 -6 102 -28 -202 -52 97 35 -55 17 8 37 31 60
3314 60 -57 -109 168 130 -38 -167 68 171 -23 -158 28 58 5 -136 -40 36 -37 -25 6 -108 -92 107 55 -83
3338h3M2J53j5k28nJ99M2j56L2L0Jk8K6k1r1J44P2r3j47P5J12Oj95j7K16K1j70
3365g8J7O4kj3j6k3J5M4J79k10j06J40R9l9k24J44R9n4j29P4R6r3j4J3m5jJ38
3392G5K2j50o6J17J42j45j13J08Q0l1j06K5P8l4j6M6m4KP4J3k34N2J46Q3j75j26
3418a77K61N2j97k7N6K0Mj4n9NQ0O9l6j84P1J47K0j55m4K20qj32q2R0N3J3lo2
3446a9m1O9P0q1j40P9J53l1k44P7J43J3j17m1J48K0k7oq0NJ9N1m0p3J21J38j41
3473B5j53J19R7m8j27O2J06q0j8J4j6L1j5M6q7o8J32J51k60J3P6J59j83q7J10
3498aM8o5J0Kj2L8M5lj09j2J35N3j88n4J87M2j40p9M9J79r0r0K1k1M7Q4j0j49
3526h3N4J47o3j63j6K02k1m4l7P6J9m8r3j3P6N4n7j2p2N0J09n1j89J24J75n6j65
$$ plain form
3338 -83 -41 112 97 -131 -136 63 105 -51 -19 11 12 -16 10 -11 -102 42 114 21 -126 -51 61 67 -128 -145 71 92 -78
3365 -78 -61 3 1 -12 -28 -51 -36 8 187 -23 -129 11 110 71 -153 -9 90 36 -93 -19 77 -16 -30 -17 -62 -63 75
3392 75 97 -53 -119 -2 140 -5 -118 -10 70 39 -67 -42 36 2 -14 32 -12 -10 64 77 -157 -105 41 124 -51 -177
3418 -177 84 136 -61 -88 -32 -12 -8 -22 -81 -76 4 73 37 -147 -76 71 91 -64 -108 112 104 -28 -110 -20 33 46 43 -19
3446 -19 -60 9 79 -2 -142 -63 90 59 -185 -108 35 48 -69 -110 38 58 31 25 -55 -50 -31 20 -20 -93 28 166 25
3473 25 -128 -9 88 40 -87 -25 81 1 -17 -3 -19 12 -3 43 -44 -112 20 171 -89 -76 0 159 -24 -111 -1
3498 -1 47 -18 -8 -6 -18 20 65 62 -47 -59 76 129 -59 -113 74 116 -24 -103 -54 125 35 -55 -34 -55 -8 76 66 -83
3526 -83 -29 118 55 -108 -124 78 57 13 -24 52 71 23 -70 -83 -7 47 -10 -22 -94 -44 65 14 -175 -51 124 68 -97
3553i7L6J33K5r7m7Q3k7pPln0O6P0j28j11J59Q9j17j30J05P8Jo6k9K2N1j4j5p6
3582h9N2Q4J6j12r6J50R5r6p7M4J49o2q9qM1N4j9m2n9LJ31Lj54jR4J01j63o3J02
3611a1P1o0q3P2J7J3k4o2K9PJ64j06j15K6J16L8j57J4O5P0r9k6N0J7mJ1r4M0J7
3640dM1k7p1L5J26j13n6L7J4J2n8l0J13OK7n0Rl5R7o8k5j14J82L5o5j14M7J59
3668A10o3r5K4MO3po3po4J20M8q5j25J39R6j30m5J24N7n2q5j1J6Q9l6Jr2O3O3
3697E7k3q7K9J37l0j42j4O8P7q2n3O1P5k9l6o5kQ9Ok4j04N1R1J0n3n5J02N6p0
3726D0p9J5J15j05j1ok4Q8l4j2q9Q8J00n9j47P6Q6M0j36j7M6R0m0p5K5J9N2Rq8
3755c3k4O0Q6r8p3P9J9jn9M8LL2k6j2l6L4O7l4j15N7P3qq3k3J08M8l7q6M4J5L
$$ plain form
3553 -97 -61 72 97 0 -47 36 9 2 9 6 -44 22 92 -36 -147 12 101 -16 -146 -41 37 38 -28 -57 -35 16 2 -13 -89
3582 -89 -37 47 63 -49 -145 5 100 4 -73 -29 120 58 -31 -39 2 56 37 -5 -64 -61 70 73 -81 -82 12 113 -50 -113 -11
3611 -11 60 0 -83 -11 6 19 -5 -67 -38 -31 133 27 -88 -62 54 92 -65 -51 14 84 -15 -41 9 26 22 33 -61 -21 -4
3640 -4 37 10 -61 -26 100 -13 -69 -32 -18 -6 -64 -94 19 25 52 2 11 -24 73 5 -20 -134 48 83 18 -96 -49 110
3668 110 47 -48 -24 -20 43 36 -27 -34 -98 22 70 -15 -140 -1 95 -35 -80 44 101 49 -36 -47 -31 58 22 23 -69 -6 57
3697 57 34 -53 -24 113 83 -59 -73 -5 72 -10 -63 -2 73 44 8 -57 -59 30 36 12 -92 -41 50 60 7 -48 54 110 40
3726 40 -39 -24 91 -14 -25 -31 -55 33 -1 -13 -102 -14 86 27 -120 -44 42 82 -54 -71 -25 65 25 -50 -25 -6 46 55 -33
3755 -33 -57 3 89 -9 -82 -3 16 15 -44 4 7 39 13 1 -35 -1 66 32 -83 -26 47 39 -44 -67 41 89 52 -34 10 25 28
3786B8Jm2m0R1ll2n5P4L8m4p6l3R0R4q0j06L5O0%j1J7q0J37l6q4K8PJ34m4j11
3816d3RR5K3k0j15M6N5r0KO4m4N7k4o3m0P4M8m8K0l8R7n0q2L9M2k0ll2L0M1JJ7
3848D8j02N5M9jm3j22J39N1o6r0N9J7N5j18L9J1j3N6o0Lj6M8J8m6k5J07J1m5l9
3877b0K6J3Rn8L0J2O4J7q7p4P6Lj6r7O0N9LL7j26J3J21nj10L2P8o3%j5QP0l1m6
3909a7j2K2O9k4n5m8J3J04j1j02L5N4j8J6r9O2M8Rj56N8N8N7p6l9L8N0n4J8j12
3938a12R6%M6J8q3K5M0l5J2n3N4O8o8r9N1P5jm1p2P7J6l4Jn6Q3J3K0j27O9Q3p4
3969hj4%L3K6k8N9q1P0J2Lj13K9N1m5k4m7O2K6M6o4m2N2Km0K7j3M3k8l3LL5O7
4001F6m0l7k5J13nj18mk2J46lp3NJ2N4j8l7p2M3M4K5q7m0L4M6o7M6l7P1M3n0p7
$$ plain form
3786 28 29 -13 -53 38 35 3 -52 22 60 16 -60 -93 -3 91 11 -95 -60 0 0 -11 6 -74 63 27 -57 -29 -22 112 68 -43
3816 -43 -34 61 84 64 -51 -5 50 -40 -38 26 -18 39 15 -48 -88 -14 34 -14 6 -32 65 15 -67 -28 14 -6 -9 -41 -11 30 31 48
3848 48 -54 1 50 49 6 -116 23 74 8 -82 -23 -6 49 -69 -30 -19 -32 24 -36 -33 -49 -1 17 -29 -54 53 64 19 -20
3877 -20 6 19 28 -30 0 12 76 93 6 -68 8 11 -5 -102 -42 17 20 57 -69 -56 65 60 -50 -18 60 -3 -3 -18 -10 60 29 -17
3909 -17 -29 -7 62 38 -17 -65 -52 52 41 -61 -26 28 10 26 -73 -11 37 46 -110 -52 6 63 -13 -52 -14 36 -18 0 -112
3938 -112 -16 -16 30 48 -35 -10 30 -5 7 -46 8 76 8 -91 -40 35 34 -7 -79 -2 14 -20 -19 -75 8 21 41 -86 -17 66 -8
3969 -8 -22 -22 11 37 9 68 -13 57 69 72 -41 -12 39 -6 -30 -77 -15 11 57 -7 -49 3 5 -35 -8 -21 22 -6 -39 -36 -1 66
4001 66 26 -11 -36 77 72 -46 -50 -72 74 71 -2 3 15 69 51 14 -58 -15 29 54 -33 -73 -39 7 -60 -14 -51 20 63 13 -64
4032f4R6jl5K9l2M6m4R4j08m9J02K5m6k9J1L7j5o4KM2K0L8j04P1m7M3m4kP7l6
4062A3M1j09mK0R2o1j9MnO6m2pj6N8J9j39Q2QL2j2l1J6K8J5l8j1J1rK3m7j7N5
4094A6L1L2j04J4O1j9j2k2qjL4n4j7L5K9L1r1M3k7P7o7K9n5L2L3m5j9J5M3j5k8
4125b9L0K7%m1k4oJ6P4k4ll1N8j5p3L6OM0Qp0K5rK0m2K0l1M7l0L4j4jPoLk9J5
4160a2M2nk0rN8k0Nl7J6M6m5n7kj8J05j9l4K9J0Rq9k3K9N4j7k5J1L9K7j1m7jJ3
4193BL5m8mmN2M5j18j4R0m0l1N8kj6K2qr4P6jJ5Qm0OlOj7PM4N3n7m8K5N4p6K8
4228Ej0M5J2l8n3LO2M9q1l4M2j5M5j3m5l7O2L4lp8K3J08o2r5P3qQ5m7om0N3m6
4260a0j8l3P8N0q8K7rK1n9Q6r3K7L3l2K2L9p8M9n3Mk5Q5m0j2N6n5Q5J9o6m6M9
$$ plain form
4032 -64 32 31 -4 25 -7 39 -5 89 -19 -68 34 59 13 -16 -5 32 17 -47 -45 -3 17 55 -49 22 -25 18 -26 -28 49 13
4062 13 54 -55 -59 -39 53 -8 -27 -23 -28 38 -4 -11 -27 31 50 -89 -7 1 33 21 -10 6 34 49 11 0 11 2 25 -22 -39 16
4094 16 47 79 -25 -11 50 31 19 -3 -11 -12 22 -32 -49 -14 15 46 -45 -2 -29 48 -19 10 -45 -13 20 -25 -44 -29 14 -1 -29
4125 -29 1 28 28 -13 -37 -43 -27 47 23 20 -11 47 32 -41 -5 1 41 49 -21 4 -5 15 -27 -7 -38 9 -21 13 -1 -2 5 -1 2 -27 -12
4160 -12 30 25 5 -4 54 34 39 2 18 64 19 -38 -40 -58 47 28 -6 23 33 42 -47 -70 -41 13 -4 -29 -18 21 48 37 -10 -11 2
4193 2 37 -11 -15 -19 33 78 -40 -54 36 -4 -35 23 21 5 27 19 -75 1 0 15 23 -17 -11 -14 -8 -25 -18 26 79 22 -26 -1 53 -23 5
4228 5 -5 40 52 14 -39 -36 26 75 -6 -40 2 -13 32 19 -26 -63 -1 33 30 -48 -25 83 21 -74 -1 -9 76 29 23 -17 36 -10
4260 -10 -28 -61 17 67 -21 6 -3 18 -41 45 -48 -21 12 -20 2 41 -37 12 -41 -37 -62 23 -17 -29 27 -28 57 76 10 -36 13
4291A3l6N4p5JQ0Qq1M2j0M1Km3nJN4k5p7K1J1k0M1l9j0O2k6j9J6jO7po8l9P3K8
4325C4l5l9j6Q9K1m6l2L3K0m3K7n0N0j9j9QL4M1m6Lm6J9M3K5p1PPJ6P9p4j0k5
4357a5Q3n6q0N1K8Jj6J9K5q3M2k2K4K2l2J4oQLl3k1K2k3P9J8q3qN8l0ok5nP7m9
4391a9oL3m9N7mJ9m9RJ9pQK5k2pJ6j2j2P4p1k2lM6rrJk6P6k7n9m6J02J1j5k6L3
4426B9l3L2rp4O9Qk3M1k3n4O8J2j4q8P8M6l8n8K5j5O8m3k4K9k2Kl7P8p2L6Pl7
4458c6lN4J0Mm0l6J02o9ol9J03l7k9j1J1k8L4L2m9K4jJ7K5p5N1k8L0Nj2J1k8P4
4490F0q2j4P2qn4OrO0J1l3m9N0k0OMl2Q1o2j2N2k4OrJ1K3j9J1k7l8k0P6qlp1L4
4525c1M7On8J8J1ML5k3J6j8l4L7m5NQ5l4nj0MlL0o3oJ7L3K1n3J7J8k0N%Lo5O6
$$ plain form
4291 13 -23 31 -44 -43 37 45 -36 6 -4 37 39 -4 -9 -8 46 21 -56 -35 -24 -44 -3 -42 -52 10 -16 -35 -19 -20 47 40 -28 -67 6 34
4325 34 -1 -40 -56 33 54 8 -24 9 29 -14 13 -37 13 -6 -25 -17 17 58 12 15 -31 -12 31 56 -15 -8 -1 15 94 20 10 -15
4357 -15 68 12 -68 -17 11 12 -4 15 40 -43 -1 -23 1 23 -9 5 -1 7 10 -23 -44 -22 -45 34 52 -31 -39 19 -11 -17 -42 -47 30 -19
4391 -19 -25 8 -41 16 12 31 -18 -9 10 3 11 36 14 7 23 11 -1 73 2 -20 -23 23 14 5 6 -20 56 29 -30 -76 26 37 22 -4 29
4426 29 -4 28 19 -55 14 22 -1 40 17 -37 31 43 29 -59 19 65 27 -31 -6 -21 47 4 -20 9 -13 -11 -48 30 -42 -6 1 -36
4458 -36 -39 15 25 29 -11 -47 55 -14 -20 -59 44 7 -22 -33 -22 -50 -16 16 -33 -9 -10 7 32 -43 8 -20 10 15 3 14 -14 60
4490 60 -22 -36 36 28 -26 -20 -29 31 42 9 -40 10 -10 -4 0 -32 49 -13 -25 27 3 9 0 11 34 15 26 -1 -39 -59 17 9 6 -65 -31
4525 -31 16 22 -36 -18 -7 -3 32 9 25 7 -27 10 -35 -30 55 21 16 6 10 7 37 -26 -32 -15 18 39 -14 3 21 1 6 6 9 -56 10
4560A0qo9jM6K0q7O1K5M2n6j1M8L9k9p7O4J7j9j1L1m8P1j3k5m3J8K9o%l7NO1m9
4593bk9NL4rK3n2L8K9l7K8l9pN3m7K1l7L4j1qK2k3N3q5M0k7L9K1k1m8M7M7q3N1
4626B0l0K1j5J3j9K2J9jk9K6j1mJ0m9J0L5Onj4m1L3j8KK0l3M9QPl3j0nj%k4O0
4661A9LMl0mnO7j06P8k5p0M9j7l0L0N9m7N0p1J09Rr8PQJ6j9K4o5Q7q2M6Om3O4
4694B3n5K3j6K3kL5kk6mk8J4L3rOl7K8l7K2kQM6Jo2M4n9K9M0n5N1l2Rp0N1PPJ5
4730A9o3L4Ln3R8j3l6J6l1j8lN6l7%L8rLJ1p2L5J2M0%n6oJ7J0M2%p1P3Qj19P4
4764BN1k1m5k2K2J4J0l2JL8n4j5L8j1K2omJ4Nk7k5P8p6j9O0nm0O4Pl8M4K9o9K1
4798A1K2m9K2KM8l2r5O6qK1J7o2P7p7L6k5J6M1n2J1j3J3K3m7L1mlL7m2J4Q2m9
$$ plain form
4560 10 2 -67 -68 -22 -2 -89 -28 -3 39 -17 -28 20 59 30 -47 17 34 15 4 35 -13 58 45 20 -23 -5 24 18 18 -19 -14 47 -2
4593 -2 -31 -26 8 -1 22 -30 8 37 0 28 -11 -18 35 -12 9 -28 6 -5 -13 9 -14 39 -46 -6 -33 6 27 6 -42 5 52 -31 20
4626 20 -10 11 -4 9 -10 12 31 30 1 27 16 12 22 -27 -17 18 24 19 5 -36 -3 -21 -19 1 -32 17 25 32 -1 -11 -16 -17 -17 -41 19
4661 19 22 26 -4 -8 -13 54 -52 26 1 -69 -20 -37 -67 -37 22 -25 25 -46 63 72 -26 -19 -11 5 -14 10 -55 32 -50 -4 2 -41 23
4694 23 -32 -9 -25 -2 -4 31 29 3 -1 -29 -15 18 9 15 -22 6 -31 -9 -11 -3 43 44 -18 26 -33 -4 36 -19 32 0 9 -61 -10 -3 4 19
4730 19 -44 -10 -7 -60 38 25 -11 5 -26 -44 -47 9 -28 -28 10 1 4 15 -57 -22 -10 30 30 -26 -32 -15 -5 37 37 -34 39 47 -72 2
4764 2 53 32 -13 -35 -13 1 11 -21 -20 18 -36 -51 -13 -24 -2 -8 -12 2 7 -20 -45 33 -43 -62 -2 -7 -47 17 24 -14 30 59 -10 11
4798 11 33 -16 6 8 56 24 -71 -5 -13 8 25 -37 40 -37 -1 -26 -10 31 -21 -10 -23 -10 13 -34 -3 -7 -10 27 -15 -1 81 32
4830C2n0k5K0L6nl9l3pK1P0mj6ll5M4o1O7l0N6o9K4OlL2n6N7m9K7l1j0K5J7j5
4863gmk5L3qR1m2q1N4Rjk2L1r4L7K4L0j0lk4M7j3K8j4l6%J2l5O8l4o7K3N4Np1
4897d5N8m1jM3jPl3LN8m8l4J6K0L5k9J5l7J7J9m8Q8m9l9%jJ3M7J1m6Oj1k1QqJ0
4932a8jL1m7KL5j7k6Q1n3k1L9k2PO4r0L3Pm1M1k7JJ1OLRKK8l1l5j9M8J0j2m5l9
4967h6M9j9L6OJ0Pk2J9j9K4mL4k6m5N2n9K6L0l2J8M9m9j5kl1J4k9N5NJ6Pn3lM5
5001Hl6K3N6o3OJ6KM8l9RlJ5q0J3M8l3J1j2J1l2K6Ln2O1m7MM9m4N4l1M7Qj2k7
5035Gn9J18n7N6kp6J2lJ9K6n6oJ3QpJ5J0J9l0n9O0l4K4Rm1J0J5n8R1m8K4m6K6
5068b0K2J8k1J5Qk9J6l8J23j10O7k9n1j2J1j3N0k9M6J8j2l4K5J0n3K4k4Pm5J4
$$ plain form
4830 32 -18 -43 -23 13 8 -31 -64 -71 -50 20 16 0 -3 -38 6 -55 12 -18 38 -31 -7 -1 -4 28 -28 29 -20 7 -24 -34 -9 8 -7
4863 -7 -11 -36 -3 -11 80 38 -43 11 20 19 -3 28 -66 -29 -5 25 15 12 -12 35 22 50 36 0 0 12 -23 45 11 -56 -33 21 26 -45
4897 -45 13 -28 -29 14 13 20 -13 -10 48 0 -34 -18 2 37 8 23 -14 3 22 -26 62 13 -26 -26 -27 -14 33 44 -2 4 -7 -28 -20 -28 -18
4932 -18 -19 12 -35 -33 2 -15 -41 40 -13 -34 5 -17 -10 54 -36 -3 4 -37 4 -23 -22 -11 -5 -2 7 9 37 6 -29 -48 0 10 -2 -47 -86
4967 -86 -37 -56 -20 -14 -4 3 -19 0 -19 5 1 35 9 -36 16 -43 -17 13 -19 -1 48 -1 -16 -18 -49 -35 -64 -9 -4 12 19 -34 -37 8
5001 8 -28 -5 51 -12 -6 10 12 60 21 30 27 42 -38 -25 23 -10 1 -11 0 -32 -6 -3 -55 6 -41 -37 12 -32 22 -9 38 46 34 7
5035 7 -52 66 9 65 63 -13 -1 -4 15 41 -15 -21 -8 0 -7 8 18 37 7 -52 8 -26 -2 7 -34 -24 -9 -67 24 -24 0 -46 -20
5068 -20 2 20 -1 14 22 -7 9 -29 94 -16 51 22 -29 -41 -30 -43 7 -22 24 42 30 -4 21 31 -22 2 -22 -15 -60 -46
5098d6Oj4R1k5k0k2oJM8J9m2O6j09N6O1j20O9mm5L7k0N5qo1N0k8J5k4N3p1M0K0
5130B2N1q1L7j3k0M5K0r6K6M8k3J1j6l9N1J9j5j6jJ7K6p9K0j0J9N4p0N6k1QL9
5161F9o3ml3oL9l9O9pmJ0n3J0K0l4J6kJ7J3l7L8k8K1k8RJ3KM0o4RL7o2K9M3J6
5195E6p0k5J0j5L6J0J4m0KL4J8rj20J40L0n2m5k1J06o0qJ3k1O1q4L3K6p4Q3o1
5225c3N7Kj2Rm5K6jJJ4Nl6M1n2M7kj9M2n7m1O0l1M6%o0j2K4Nj2N4k7N5r2J6M9
5259B1j6L0k7kN2n1n1N4Ml3L1M9q5QN7m2J6n0L9n9J2N8m0L0j8MJL8m6jM2j0K9
5292D4J2l0p6Q8j3m6N4l4j0lKL8m3jL2l5J5l3Q2k6n5K4LQ2l7jl3L3m0M3j09J17
5324D4k1Pk7j5N8k9nk8rJ3J8l5K9J2nm1L7npj1j2L1L0K7l5j8l5J9N9l5j2n2N7
$$ plain form
5098 -46 -40 -54 37 12 -8 -30 -36 -35 13 32 -10 56 -53 3 64 -56 13 9 -36 1 -19 36 28 -33 17 -11 4 -20 33 -38 2 22
5130 22 73 -8 29 16 -4 41 61 -35 -9 39 16 27 11 -28 23 42 27 11 10 27 53 -26 -6 -16 3 57 -13 43 22 30 69
5161 69 6 2 -31 -37 2 -37 32 25 21 31 -22 -12 8 -26 -10 -12 5 18 -19 19 -9 12 -16 -7 6 8 48 -16 -7 30 -32 -3 40 56
5195 56 -14 -39 -29 -44 -8 2 16 -24 -22 12 30 21 -99 41 71 19 -26 -47 59 -1 -9 4 -17 44 -40 -7 19 -55 28 -33
5225 -33 24 26 14 23 -22 4 3 4 18 23 -13 28 -24 23 21 2 44 -13 -54 6 -25 21 21 -39 -51 -27 -22 -34 20 -7 48 -44 -28 21
5259 21 5 35 8 6 58 7 -44 10 14 -19 12 61 -24 -16 41 -1 15 -35 4 -55 -43 15 -25 5 -13 -9 -8 30 -16 -17 25 15 44
5292 44 56 26 -50 38 25 -21 33 -1 -11 -14 -12 26 -17 -18 14 -21 -6 -39 43 17 -38 -14 -11 71 34 33 0 33 -7 36 -73 44
5324 44 23 30 3 -12 46 17 12 -16 -25 -12 6 -29 0 12 7 -34 3 -2 -9 -20 -32 -1 29 56 21 3 -32 -13 46 11 -1 -53 4
5357Dj3LJ0k2K0K5m5NK1l8K7l6J0Q3m5Rk1l3M1j9P1j5m6l0N1pJ1l6K4J4n4j1O5
5390B3K0p8L6j7qlP7l8p1Q1RJn9K2J9m2L7k8L4Nn6K0j3L6j5k7P6l3Jm2j3N9K2
5423C5Np9K4L2k3mNM1l9K7Kk5Pl2RO8r8J07r3K2%%K9l5J21q3jM2m5k8JM8%k7k6
5458a3K8o2M9L9l6L7l7K6l5jJ6j3j0K4o6M4PM9p5O4j0m8N7ql6oL5OQK1%rq1N7
5492B1k9MNn3N7k6%%J0n9N8PJ2L4l3qK4qlnl9L7L9r1M7M6J3j14O3qnk7J0N7p6
5527d0J4j0rL8K1k4J4n0MQ1q6K9O1k4j7qN4n2M7o9PK4l4K5n8L7j0M1qoj6K6Mo1
5561e5M6NpJ3m8O9l7O1m3N7p2RlK5m0J3K0%jLPkm9J7K0mk9L1j5k0M8K1q1O7N1
5596G7q3J5J5l0L8j6l2K9J6J9q4L6R4n7p7N4n3K8M6n7L0M9j03j3K5m3J01n0QK5
$$ plain form
5357 4 -9 -6 4 -18 2 27 -18 -13 8 -30 -3 -39 -29 54 9 18 -3 -36 5 -14 57 42 -4 -34 17 10 21 -15 9 23 -31 -42 23
5390 23 43 -35 1 -16 -24 -27 50 12 -59 22 31 32 -27 -5 14 -28 9 -19 15 20 -36 -16 -29 7 -8 -35 41 8 9 -33 -46 13 35
5423 35 40 -39 -15 17 -6 -10 -5 36 -3 24 26 1 8 -24 -15 53 -45 62 -31 -9 -9 -9 20 -15 106 23 22 64 19 -9 -8 40 40 13 -13
5458 -13 15 -47 2 41 5 42 5 31 -4 -5 11 -2 -12 12 -54 -10 -3 46 -29 35 25 -23 34 26 -10 -16 19 25 33 54 54 45 -36 21
5492 21 -8 -4 1 -52 5 -21 -21 -21 -11 -70 -12 -5 7 41 8 0 24 16 13 8 -31 6 45 -46 1 47 60 -54 9 1 -4 -31 -21 36 -40
5527 -40 -26 -36 -45 -7 14 -10 4 -46 -42 39 -47 -18 43 19 2 -6 48 -4 43 -26 -19 5 -29 -4 -62 -25 -35 6 -2 -8 -24 2 6 -55
5561 -55 -9 -4 -11 2 -46 23 -14 47 4 61 -11 -2 -5 20 -20 -7 13 13 12 15 22 20 -29 -12 8 4 -25 6 -9 -29 19 40 -41 26 77
5596 77 -6 9 24 -6 32 16 -16 13 29 48 -36 0 94 37 -40 14 -39 -11 35 -22 8 57 -46 -59 -34 -77 24 -26 -18 7
5626GJ7Op7O4jj2o5P0K3km2rP1m9j3k4rK9qjK8l8JJkK2K6Lj7j2M7k7MloJ6j8J6
5664A6J3k7kL9l8l2M4K8k4j13J12J2J1l8RMn0J3K2l6N0n6M1PJL5n2O6j05J17n2
5695A5j4K5%Pk8J5l4M2J5n1K6j1j9M1K4j02L5N1n3j4J2pNJJ6LJn0L4O1q0N1K3
5728D0r7P7J8m6K9l0JOk6K9Lm2K7NL6k6nL0q4Q0l6%QJ2k8J2K3m0MJ8j0m3N9l0
5762b6M3j0K1K8l5J3n8M4pPl9j9K6QK8l4j5%M4J2n9K9M4QK7l3q0P8k8k0rN7L4
5795G9q5O9o6J4k7L4n4KJ08q3l2N0l8M2K7p2M1K2p5PK1J7J2l4N2j9K7M5n1n6J6
5826gqM2n0M3l5k3P2o3j6n4R6K4m5J1P3m9Llk2jmk6K9K6l8O1pj2o3N1K3m9QJ2
5860al9mK3P2oOl1l7j2LJpjL8k5O2q2RN3n1%kO4n5O8o7N0n0%k5P0j2k3l7O2m6
$$ plain form
5626 7 24 30 -47 17 16 4 -61 9 32 30 -12 -21 50 1 -12 -36 -45 -16 -24 -25 3 -35 -34 -33 -35 -13 13 16 -1 -13 34 7 11 8 2 18 0 16
5664 16 29 2 0 39 1 -31 13 41 17 -96 16 28 39 1 10 14 -36 -23 -1 -37 13 -43 -2 5 6 41 -11 55 -50 67 15
5695 15 1 26 26 33 5 20 -14 28 43 -8 18 7 -12 29 53 -49 -14 37 -16 -30 -18 -25 -20 -19 -3 0 1 -49 -15 46 -34 17 40
5728 40 -57 20 38 -8 21 -9 -8 -2 -28 1 4 -38 -11 -6 30 4 -1 29 -55 25 -11 -11 -3 9 -19 -7 16 -24 -20 -2 -12 -55 4 -26
5762 -26 17 7 28 56 21 34 -24 20 13 20 -19 -38 -12 -4 24 -10 -25 -25 19 31 -28 1 45 53 80 47 -33 45 17 -3 -12 45 79
5795 79 -6 63 -3 11 -16 18 -36 -34 74 -9 -41 9 -29 13 40 -32 9 31 -44 -37 -16 1 13 -21 31 12 39 84 33 -23 -7
5826 -7 -15 27 -23 20 -15 -38 34 -29 -45 -99 -3 21 -24 -13 60 11 14 11 -11 -12 -16 -42 -13 13 -25 36 29 17 -46 5 28 -21 -13 -1
5860 -1 -40 -44 -21 51 45 51 20 -17 -29 -26 -25 -32 -33 5 -20 42 -40 -31 22 -29 -29 -31 33 -22 46 -21 29 -21 -21 -46 24 12 -11 -48 14 -32
5896c2M0Qk5n0Q1LK3m1j6jo1N2J6j6l7O0J1L6l9L5p8L6LL1l2k6Rj7j1L8L3l6%
5929cl8N5l9K5j0J0k7j1O7k2L8n4J2l5J5MN0m6K0m6M0KO1o9jj6nK2O1j0r7P2%
5962B5k3j4kK5K6k9nm7M8kk6J1Pj4L8nn5P5K4k5l2M5o4%Q4n1K8q7Q0o5P8m1K4
5995C1l2L3l9jJ1n7O7PJ5q8J5j3N2l1P7q2N9l9oj9O0J1o2P5l1n0P4k7j5k9O5k1
6027A0lJJ4l1L3m3N7qj2m0k1P2m2lL1j5oL0l8L0j5M4q3P4m8j5K5K8l5QM6m1J6
6060B0o0K8o1O0l9Q0L1m4Mk4N7r0pN2J2q4N8K0L2j3m8l1K9Jo8O2l9N7rJ9k0j6
6092c1QO1l9J2m4K7k8O4J3k6k3OLJ0j3M0m2m4Q4n7J5K0K6lk8l2J1N3j5j5m6P5
6124D2l1l6K5k0lL2k2ml6L8K7l3j1K9l6L1qm7M1O0l6L6r0O0L8l3ln3O5j0k7PJ3
$$ plain form
5896 -32 8 16 -9 -59 22 25 48 7 -9 -10 -71 -19 -3 -19 -56 4 15 51 12 47 -31 5 8 39 7 -19 -10 -27 -38 0 33 -3 -3
5929 -3 -41 14 -25 0 -10 0 -27 -38 29 7 45 -9 3 -32 -17 -13 37 -9 11 -35 5 7 68 -1 -2 -18 -23 -1 60 50 -47 25 25
5962 25 2 -12 -14 11 37 8 3 -44 4 2 -24 -13 -6 -20 18 13 -42 33 57 32 0 45 -19 -19 65 14 42 -45 35 -30 48 7 31
5995 31 -1 32 -7 -8 3 -54 13 20 35 -53 -38 -51 1 -30 47 -35 24 -15 -21 -40 20 31 -31 44 13 -37 37 10 -5 -34 31 10
6027 10 7 8 22 -9 24 -19 38 30 18 -22 -43 29 -13 -16 15 0 -6 24 -14 16 1 45 -38 36 -12 -27 -2 26 -9 -1 45 4 20
6060 20 -40 -12 -73 -13 -52 28 59 15 19 -5 52 -38 -45 7 19 -65 -7 13 45 32 -16 -47 -18 -17 -85 -23 -62 -5 -14 5 -15 -31
6092 -31 -23 38 -1 11 -33 -6 -34 30 43 17 -6 0 3 13 0 40 -2 -46 38 -19 -4 16 42 39 11 -21 -10 43 28 13 -33 42
6124 42 11 -25 0 -20 -23 9 -13 -17 -53 -15 12 -21 -32 -3 -39 -8 -16 -63 -22 38 2 38 -52 8 46 13 10 -43 22 12 -15 -8 5
6157Ej5K1j9L8NK0o9K9nK9k0l4J7k1M2j8J5p5M4m5J8Q1m2k4Q2n8K1o1P6pj7N6
6189F9j01L7%JlK7q9J25q5O4r9O7Ql8lj0L0j6j4N0nK2m3J4k5Q0r7J4N8l8k9P1
6221D2n8k6O4nl8L3K9ko8lJ%PPP7p6M1J1j6Jn7M9k4j9N9j0L0n3k9M9lK7l9J3m2
6256b8L6Ll0K8k3m2M3Pm4L8M2lJ4j3KJ0r5K9mM3pk3K2mN0o7j5O8j11O9Mj5Nj0
6290b1L8J1n6L6k4Pl3J3N3ol7k9Q0K7o4K2n8j0O0p3P1K4l3L5l3L1j3p0J13o2J
6321@J4j3K9j2Mk0J4J1l3lqk5J03j5mo8j9j4J03q1k5P7L0o0n9R6l2qL2l1j5j8
6353e0K3Q5o7L3On8K9J9j5K5k7MM3n1jL1J1l4LJ3on9K5O6o1mLnK2J0K8n4j1K2
6387bN5p7M1K0n3J6Nk1j4J5M4j9k0KM7m3l3PN0l4O7n0m4L5J6K8l0oK1k7rk1ON4
$$ plain form
6157 5 -10 11 -8 30 35 55 -14 15 10 39 19 -15 2 -19 23 5 20 -55 -11 -56 -38 43 1 -23 59 1 22 -39 37 30 13 69
6189 69 -32 5 5 6 3 30 -59 66 -19 45 -54 13 21 -17 -20 -30 0 -16 -30 20 15 37 -6 8 -17 63 -34 -20 38 0 -29 42
6221 42 -16 -42 22 17 -21 12 41 39 -29 -32 -31 -31 -24 -17 60 -16 25 36 20 21 -36 13 -11 -30 29 19 49 -4 -33 16 13 40 1 14 -28
6256 -28 8 11 -19 9 -14 -56 -13 -6 -50 -12 30 27 41 28 30 40 -55 -26 -30 13 6 -17 5 1 51 -16 -31 37 -74 -5 -1 -16 -11 -21
6290 -21 17 28 -28 8 -16 -9 -42 -29 24 18 -19 -48 32 59 -5 17 -41 -51 9 -64 7 31 -2 33 0 31 18 -52 61 -1 0
6321 0 14 1 30 18 22 2 16 27 -6 -9 -17 -42 61 46 42 -26 -45 -59 44 -37 -62 15 45 -15 -74 22 -10 -18 14 -17 -32 -50
6353 -50 -27 58 -9 24 30 -28 1 20 5 30 3 7 50 -1 -2 29 40 6 9 22 16 -43 -18 48 -13 -17 -14 -19 3 13 41 -13 -24 -2
6387 -2 53 -24 17 37 -16 0 5 -16 -30 -15 29 10 -10 -8 39 -4 -37 -30 20 -14 53 3 -41 -6 10 38 8 2 23 -4 -13 -34 -28 26
6421B6L0k1m6L3jp3O7m1J7M2j3qL4l6L0k5m9L8m6L2k7M3%RJ9m1NL0j2n7%K8J9
6454FMrL2jpNj3K1m6j1M5k0oL5n4k9R5o6N8n4J8l1N8o3qO3l1Nj6J3M3Ql1q%K5
6490C0k2krk3N9qL6q4K3N0q0R3m6n7O7J5p2RmJ3J8o2J6N2L7m9k5J5oqM5j7ooj7
6525b5J9J5k8RL4l6oL1n1J5M1Kn8K9K4l6L9l2N1o5M1K9m0L2l1%J9n5L8J7Lo0N
6558c0K7m5N8o7N4MRNj5K9n9L9mK2n8PP4mj7Qn7m4J19m5Qn1L9k6j1LM5Pll9K3
6593EJ0m9mM7K7n3M6j8l5Q2n9J1L5n0kK1j2ok9J11r1j3L1NL0n6J3%mRK0MJ4p7
6627c7Q4m8kk8K9j2j8j8Q4j0OJJ8m0k1J7J3j9O5j01K0J7k3L3j5O7r9Q9j2r8O8
6658A0j6k1n7J03k7M0r4Q0Pq0K1JL8J0k0QO8m6j5MoL3j9k2pm9O7p7L7J3K1Pj7
$$ plain form
6421 26 56 35 -11 22 21 -52 15 -26 -9 33 20 12 46 10 40 15 -34 4 -42 -10 -37 6 6 15 34 -7 -2 28 16 -41 -41 -13 6
6454 6 10 1 33 32 25 30 17 38 -8 -19 26 6 0 35 -19 -48 47 -19 39 -15 3 -28 30 -33 -41 22 -9 -4 -20 -7 36 44 13 5 5 30
6490 30 8 6 -3 -26 33 25 61 -23 0 50 -30 63 17 -40 27 42 -30 -21 -25 -12 6 -56 -40 12 49 0 -25 -10 -16 -24 21 4 -2 -8 -25
6525 -25 -6 9 -19 -10 24 -12 -18 13 -38 -23 18 20 -38 -9 15 -21 18 -14 37 -28 13 42 2 34 3 3 22 -33 5 22 25 -35 -30
6558 -30 -3 -48 10 -57 -3 1 10 15 0 29 -30 9 5 27 -31 -24 50 46 29 37 -20 -64 55 10 18 -33 6 -20 -31 -28 17 24 21 -18 5
6593 5 15 -34 -38 9 36 -17 29 11 -24 58 -1 10 45 -5 -7 14 2 -4 -33 78 -13 -26 5 10 40 -16 -3 -3 -7 2 22 26 40 -37
6627 -37 47 -1 -3 -31 -2 -14 -32 -50 34 24 30 31 49 9 -12 5 18 -1 64 -37 -17 0 -23 10 -5 62 -37 52 40 -58 10
6658 10 -6 -27 -84 19 -8 32 -62 18 25 -55 -34 -33 5 15 -5 3 71 25 10 14 8 41 22 0 -7 -56 11 -66 -29 -16 5 12 -5
6691eKjJ2l1QJ9Om7J4k9M2K9m1j2QJ3j8M3j5L1l0J2k9LK5nK9oq6L0%jN7l9m8O0
6727@J9o6N3J4k3l3j8N7NK4k5Rm3N3k6k6L5J5l7J0k7L8k1j8K1l3L0N0m6M2j7L9
6759E5k7Qo6M3j7LJJNK6k8K0l6j3PJ1J4nKK8k3j1j4mRJ9k0m1R3No0K5m3j3L8L0
6795B2m2pL6j3L8kq1M4L3p2L4M5l6j4Ok8OJ0jN0pm6Q3p8pK8J2k9OJ0roNK3nj3
6831eKJ7j5L2J6n3mN4k0Om9o6J42n4K3l0k8J06o6K9mLk6l8Nj1N2m5NpO2p5J2M6
6865A6k3j3L0%k5n2J10k2o0K0K1l4j9L9J4m9M4L6n9L7K1m9l6N9nn9Q9l6mO5p9
6896b3nK0l8P3p3K5NK9j2K8l4n7P9m7O5o4RK8K0o8O6q2O9j6K1Ol0%J0k6N4k0r
6929Cl8lJ5K6%J6n2J3J9J9Jm0jN0n2K4j4M6Rj6Pm5LQl0l1L1P8k6RmkK1n1L4m3
$$ plain form
6691 -5 -3 -4 8 -23 -15 4 10 -37 -23 -52 -10 19 -22 -34 -26 -13 -31 12 -3 28 -2 10 -19 -16 9 4 33 27 -59 -29 -29 -30 27 -12 -60 0
6727 0 19 -47 6 20 -3 -36 -54 3 8 32 7 16 -27 26 0 -26 9 24 -13 -3 -30 8 -13 -31 -10 -43 -13 37 -9 33 16 55
6759 55 28 36 -30 13 -4 -1 0 1 6 32 4 24 -12 -25 -18 -7 7 2 4 32 9 -2 -16 -20 -11 8 -12 -53 40 45 -15 10 -33 -46 -8 22
6795 22 -20 -27 9 -4 34 32 -49 -5 28 -44 -10 35 -1 -15 -9 -37 -31 -21 -22 28 21 -25 58 -20 -27 1 13 -16 -10 0 -9 -15 -10 13 8 -5
6831 -5 -3 14 -1 31 47 -6 -10 44 24 30 -19 -85 57 3 26 -4 -32 74 8 37 33 36 10 -28 -23 -34 18 -27 -22 -29 33 -42 -30 16
6865 16 -7 -20 10 10 -15 -67 43 21 -39 -19 2 -32 -51 -12 2 -47 -3 33 -26 11 32 -17 -53 6 1 -58 31 -5 -9 56 -23
6896 -23 -28 -8 -46 27 -46 -21 -16 13 1 29 -5 -62 17 -30 35 -29 -20 8 28 -40 26 -56 13 -3 18 24 -6 -6 4 -22 32 12 3
6929 3 -35 -38 -23 3 3 19 -33 -20 -1 18 19 -21 -22 28 -24 0 -14 32 41 25 32 -13 -10 -2 -32 -63 -32 46 20 29 25 23 44 -7 27 -16
6965a6L0o4O2%k3M8o1K4lj7Pk5kM7nnlr0J48j0k0n8K9L4j8k3RJ2OJ2m4L1o3J03
6999E2l4k1noj9lJ3j0J1N2o1l6O8K4Ql0n5J7R4n7k8jJ7L9LMnj4k1mJ0L0m1L7p1
7034d3O1q2P3j1m8O2jp1PM0oK7Ooo3N9j9nk4K4L0Jl2J3K4p7K7K9M3n0j8M3j7R
7068Ep3R5o9K5O2m5pJ0k4M1l4J1Jk3P3m3J6ql1Lj4LP5j14MN7L2m0Qm3L4k0K0K0
7102Glk1L6l4J6j2P6q3l5J10q7P4p2j2L5K9k8O0q4P7n1oj5M7k1Om1M5n9K1OJ3
7134fK1n4j1K7Rj7nK6j4J1J7j7L2j3K3p3mM5L7k6O0q6K9lN8r3J6K3l8L4n8J8K3
7167im5LO1LJ6K1l1J8l7rPj3kM5m8oL6pO5On2m6L2M9p3JK7l5J4NL7n0L3J7Jp0
7203c6nP3m9J9M7J3m2q7J15m0k4K9Rj0oj4j3O0m0rj0N4lL0m2mk2J6l4LN0m6OM7
$$ plain form
6965 -16 14 -50 12 12 -11 37 -24 0 -3 -20 -13 -38 -40 7 2 -3 -6 -96 52 42 22 -36 -7 27 9 -14 -5 7 13 25 -19 12 -51 52
6999 52 18 -3 -8 -14 -33 -36 -23 -33 -22 30 -31 -67 1 25 33 3 -52 -35 59 2 -26 -27 -10 29 32 36 31 17 -4 -8 2 32 -9 28 -43
7034 -43 18 -64 9 -2 -50 12 11 -60 -53 -13 -19 8 14 8 -55 4 -15 -20 -44 -20 10 11 -21 -8 16 -61 -34 -5 38 -12 -30 13 -4 5
7068 5 -68 27 -42 -17 45 0 -7 3 -21 20 -14 -3 -2 -25 48 5 21 13 -18 -15 -29 -26 49 -65 -61 -4 28 -12 -4 -47 -13 -33 -13 7
7102 7 4 -17 19 -15 1 -11 65 -18 -53 57 -30 44 -28 -40 -5 24 -4 56 -28 49 -2 -8 -23 24 3 9 -32 13 -46 -25 -19 -6
7134 -6 15 -39 -50 -23 -14 -31 -36 -10 -24 -13 4 -13 19 6 29 -44 -48 -3 34 8 68 -18 11 8 66 -27 -11 12 -26 8 -50 -32 -9
7167 -9 -54 -51 10 13 29 50 19 37 0 -9 -2 -15 -17 28 -20 -26 10 3 68 74 22 -24 8 57 -16 -15 12 -23 -9 -4 33 -17 16 33 34 -36
7203 -36 -41 32 -17 2 49 62 20 -67 48 8 -16 13 22 12 6 -8 -21 39 -1 -10 -20 34 31 61 19 15 -7 9 -25 -22 28 -18 -12 35
7237C5k5K4m2k8J01l2n0K7K8l3J7Kl8%%pK6mj2mpK6j1j0J3L1j2No4R9p6nM1%m
7272A1on3O1l3N5k5Oj5pK2Nql6K5nJ6p7J11p7PK6k9J7M4o2kR2o2Qk2O6m9OMm8
7307c4M6m9M3l7L8J1l3lj0k6Q7p0N1l9M0m3K5K2qJ7p6M2m0L2rk1K5j4QK1J6l1
7339a9J6K8Ln7J6O1l9J5Pl0n3N5O0j08M9n7O8J2n1L6k8nRj5M1l7Lk0jJ02r9K1
7371a7J3k2M2j7L1k6k0KL0o3K0O2k2jo7P8m9J7J8n9K7j6J4L6RQJ5o7P0j0m7k8
7403c9L0L9J6l9L8m2Ml1QJnOJl6L0m6P2K5Jl2J2J8o9MJ8j9M6k3L2k7n5Q9k6%M
7438Ej1j4L1k9J6J1l9K9PJ8o6J2N2n9J4l5P8m2l2M5K4J2Kl5M7m6rN7n6L2k5J5
7470IjJ3Kp4J5J5J0K5J3j6l4K9nj6oJ3K4l2n3P4k5m9O6N1o6L6m7RL3l7k8K1O7
$$ plain form
7237 35 10 34 -8 -36 65 33 -17 10 38 5 22 24 -14 -14 -14 -21 5 1 -11 -15 -22 4 -7 -17 -4 27 15 20 -44 55 -21 -26 15 15 11
7272 11 5 -48 13 -20 35 10 16 1 -6 16 21 13 -23 2 -3 13 -64 47 -30 -23 3 -26 -9 35 -27 -29 63 1 9 -13 53 4 10 14 -34
7307 -34 12 -37 6 -31 7 18 -15 -18 -28 -54 33 -37 14 -25 15 -28 -3 19 11 28 -48 -6 -46 -14 -23 -44 -19 -33 -25 -4 12 -19
7339 -19 -3 25 28 -29 -13 48 9 24 31 1 -52 3 63 -45 4 -53 15 27 -24 12 -16 -21 -12 -27 14 -23 -20 -40 -41 61 -38 -17
7371 -17 -4 -26 16 -1 30 4 -16 -14 16 -47 -27 35 13 12 -55 23 -26 -9 9 -50 -23 -39 -25 11 20 28 43 -24 46 36 -11 -39
7403 -39 -9 30 46 7 45 3 7 -24 -16 -15 -20 -14 -13 -49 -19 -65 7 32 33 1 13 31 -38 -34 -16 -35 11 -12 20 -7 -62 27 1 1 5
7438 5 -6 -20 11 -18 -2 9 -30 -1 6 24 -42 -30 22 -37 -23 -58 20 -22 -54 -9 15 27 29 -6 41 -5 -14 43 -13 19 -6 9
7470 9 8 21 23 -51 -36 -21 -11 14 27 11 -23 6 1 -15 -21 -8 16 -16 -69 5 -20 -69 -3 48 -18 18 -29 -20 13 -24 -52 -31 36
7503C6rn8N0m8M6m0R0o0J4k5k7L6Pj9J5j4k3K4J9J0Jo1K8l5N3L1k5o0N6L8l1R
7535B8p3L6K5p6K7mM0K5l9J5k8j8L5kJ0M1l6kJ0j7k9M2JKk2L6j3M3l0L8n0K8L
7568D6m1k8M4j5kjK1j5j0m5O1m9LN9no3j9O5k9OQk1J1K5k0k8PMJ11r9K3L5l7l7
7602c5N0Kj3MK6l1L9J0l2L1l5j7P9m7k7j2N1o7R0l8n4L1l0K6l3M1oJj9lK0m2J6
7635b4nQm0N9kJ3%MK1k5qNL3p0N5J0n0Jk3K4O9j1j6M5Jo2J3k5k3M0q1jJ10l4n0
7670c9k0N3J0J8k3j9rK5P1j02J2J2J9o2M2Lj1L0rJ1N5j01K1J5K1o9N3k2K2j7k3
7701c3K6l1O9p4J9P6q2M6Rl2K0j6J3j5kRRk8OK2m4Jk1M1K4M6p6j2K8J3J7k8N7
7734E7k7Rk8K4Kl8m4K3ONN8n6J2k1KJ6PM1nl3l5K3j6K5pMM8m0J5o8L9K9%k6o2
$$ plain form
7503 36 27 -31 19 -29 17 -23 67 7 21 -4 -31 5 12 -7 8 -6 -29 -5 14 24 25 -36 -8 -43 10 41 16 -44 12 50 19 28
7535 28 -45 -9 16 -60 -33 -37 3 28 -11 4 -24 -42 -7 -9 1 42 6 4 14 -3 -32 10 11 13 -9 27 14 57 27 65 15 43 46
7568 46 5 -23 21 6 4 3 24 9 -1 -46 15 -34 -31 28 23 -40 -59 6 -23 -17 -9 -30 -19 6 -14 -42 -35 -31 80 -19 4 39 2 -35
7602 -35 15 17 4 8 34 3 42 52 20 51 16 -1 78 31 4 -8 43 -24 66 28 -26 5 -25 1 -32 9 3 4 -15 -18 2 -40 -24
7635 -24 -29 -21 -61 -2 -4 9 9 13 34 9 1 6 39 -31 24 34 -16 -15 -38 -14 55 44 28 73 74 12 25 0 -23 17 -64 -65 45 11 -39
7670 -39 -59 -6 4 22 -1 -20 -29 -4 67 -35 -23 -11 8 -54 -12 -9 -20 10 1 12 67 -34 -13 2 23 -46 7 -15 7 -10 -33
7701 -33 -7 -38 31 -43 -24 52 -30 16 25 -7 13 -3 10 -5 -7 2 11 -17 -11 11 -33 -32 -53 -12 12 58 -18 -30 -2 11 28 0 57
7734 57 30 39 11 35 37 -1 -45 -22 -16 -11 47 -9 3 -18 -16 0 7 48 43 10 -25 -2 -18 7 0 4 52 12 27 -41 -2 27 27 1 -61
7769f1Q4n7J3R2o3jKrL0L5pm5qk0QN0n5J2K7k4kPm4M4l2J7m7O2q8M6L8l0M8k5
7803cj7L1qj9K6J3pj6j2Jl1M6l0R0o3m4J7ONK4m2J8J7q6K9P5k0n7J45p8k4L3j7
7836BN4l0l9J5J1p4L1mL3rK6ml6R2o7J6k3K0n2M6M4q7N3l9N2q6R5ln4K7Rl0LL1
7870B3rk1K2l7RlN9n9l2J18p9J5l6O5n5K3k2j6P5m0j1P3q9K0j6M1q6J00m1nm1
7901e5Q6j8j9N0m4M7o2oJ4n8O5m6M1l8O5Pm8P4j22O4n8R4n6k3K1MM3l7Q8p8qK5
7933A2l7M4K5k6m3N4l9K7k8L6n0LK7l8O7l2K0j3k1k1L8M8q8kK0qJ5rKN4ro7N1
7966A2j3J0j6%Nk5J2oO8q1O2k3k5L9j5J7j1K0j07O2L4K4mk3l0K1l4L2%n8N0L0
7998B7l7j8N5kl3KOnpj4O8m4L1L1o4j6Q5p6M5n3j0Pk5O9Okm3J6j6j6N6J5p5M1
$$ plain form
7769 -61 23 -34 -21 71 8 7 9 0 30 65 58 13 5 -15 -7 43 -12 0 27 3 1 8 -36 8 -24 -7 -54 8 -80 -34 4 -26 22 -3
7803 -3 -20 11 3 -16 10 23 16 0 -12 -11 -42 4 -26 64 1 -43 -26 -20 -15 9 -33 -15 2 -84 -55 20 0 -57 88 10 -14 19 2
7836 2 56 26 -13 2 13 -61 -30 -34 -1 -10 16 12 -24 68 1 17 -6 14 -38 8 52 -35 18 -21 31 -55 40 37 -17 10 19 -11 -8 23
7870 23 14 -7 15 -22 -13 -16 43 -16 -48 70 -9 6 -30 35 -20 3 -19 -35 40 0 -11 62 -27 -7 -23 18 -68 32 -9 -14 -55
7901 -55 31 13 -6 44 0 47 -15 -21 -7 -65 0 -46 -5 -43 22 29 -19 55 -67 -3 -61 33 -23 -46 -25 -21 22 -15 73 -5 -13 12
7933 12 -25 19 44 18 -25 29 -10 17 -11 25 -25 -22 5 -33 34 2 22 9 -12 -33 5 53 -35 -37 -17 -25 -10 -19 -17 37 28 -39 12
7966 12 -1 9 -7 -7 -2 -27 -15 -21 47 -34 28 5 -20 19 4 21 10 30 -77 -15 19 43 39 16 -14 7 -27 5 5 -53 -3 27
7998 27 -10 -28 27 25 -8 -6 0 -5 -12 -26 42 -2 29 60 -4 -20 65 -11 34 -19 -29 -22 -47 22 28 26 -17 -1 -17 -33 23 38 -37 4
8032DJ8l6J6J2n5M9l6K4OK1k5jj1l4j7kL7M2j9%km1NR2o2k2O6m8P4m0L4o2J1M9
8066D7n2pRJ5Rrj0Ol9J3j1M9No0M4L0j9J5J3j14L9nK9J2k8L4Pn9K4K1q0R7k2K6
8100B9rkk1J3L8mp2j2R5m6k6J1L4n1J3LJ3nKk2M0m9R3m1o5O8qJ1o4J03p0K7l8
8133a2L3m3M8j0on3N8lj4NqN5l4jl5Q1l2m5k2J8K2J8l7MmM2jk1K4k8RQl9L2l6
8168b7Kk1O0K6p3j2K0k6J3M2k2k6L5k8Q6l6M5l8k2O5r6M9k3
$$ plain form
8032 4 22 -14 2 14 -41 8 -28 -4 2 23 -2 -3 -14 -48 -65 -67 -30 12 -7 -7 -9 -50 -45 47 -15 -37 29 -19 55 15 49 -13 -2 47
8066 47 -5 -12 -3 12 21 12 2 8 -31 -18 -29 20 25 -35 9 39 20 35 48 -66 -27 -32 -3 9 -19 15 22 -37 -13 8 -72 25 3 29
8100 29 20 18 -3 10 48 44 -28 -40 55 9 -17 -6 28 -23 -10 -7 6 1 3 -19 21 -28 65 24 -41 27 19 30 -34 69 -1 26 -12
8133 -12 21 -22 26 16 10 -43 15 12 -2 3 -5 50 16 15 -20 61 29 -16 -38 -20 2 20 -17 -13 -17 25 24 3 27 -1 8 16 -23 9 -27
8168 -27 -25 -46 14 40 -33 -45 -25 -51 -38 4 -18 -44 -9 -37 49 13 58 20 -2 63 -33 16 -7
8191g
$$ Imaginary data points
##PAGE= N=2
##DATA TABLE= (X++(I..I)), XYDATA
0@%%%%%%%%%%%%%%%%%%%%%%%%%%%%%jKkLoQqQrJ1j4J9k2K4k8L2l5M2m9N0n4O2
51C3o7P3q1Q7r2R5r6R5q9P5m8mR6k62N86j270K952q525N5906L02670k45181m15396
73c08443J53295L64780l5755k73856n1416J36039J08546J7092j17951j71520Q6271
84i2918L00183j5504l87332p3155M17447J61910l91226k25641L17386K51836k15254
95D7732k32626J02802J71547q7p5793p9171m1232J22363J61604j26974k66063
106b15898R6465L37260m4249l64737j4010L47399O2501k91176q9912K08076R0671
117A22390j11161o2028J5605P884O5023O3676j19518j38475J43873K02177j41625
128D7821k42906J20623K54395r1288k37144O2048J94650m0628j34322L1171O4631
$$ plain form
0 0 0 0 0 0 0 0 0 0 0 0 0 0 0 0 0 0 0 0 0 0 0 0 0 0 0 0 0 0 0 -1 1 -1 2 -4 4 -4 4 -5 6 -8 11 -11 13 -15 17 -18 24 -25 25 -29 33
51 33 -34 39 -42 45 -47 48 -48 47 -42 33 -15 -19 77 -185 401 -869 2083 -6442 49464 352134 106953 -308443
73 -308443 -155148 209632 173877 -99979 -151395 -15356 93190 110282 -7669 -179189 -92918
84 -92918 207265 191761 -195571 -268726 148721 310631 -80595 -306236 11150 262986 47732
95 47732 -184894 -82092 89455 89368 13575 -65596 -106828 15535 177139 50165 -215898
106 -215898 -119433 217827 173578 -191159 -205169 142230 204731 -86445 -176357 31719 122390
117 122390 11229 -50799 -35194 -27310 37713 101389 -18129 -156604 -12731 189446 47821
128 47821 -195085 -74462 179933 88645 -148499 -86451 108199 67571 -66751 -35580 29051
139B9051l6414L908N4538o2315p9997J04774J05200j29458j22249J39296J27211
150A33545j37832j18025J30175R6169j19631o4049J09637K6128j02491J2430R8176
161F4232m6435r5081P2157Q8537q9212p6080R9110N5555j04978k8564J08794k832
173D5203j12298L5426J16228o4597j20417Q7021J23280r8564j21356R8816J11152
184I9894q8956q8887P3464N4614n7878j0244M6369l9450m2220Q8539M6267j31131
196d9619n8508J60613P4996j72358r1486J64313J01002j38304r7725R9135P8127
207G0186n4213m1423J1822q770K1235O7584l9632j26295M0863J76566k5646k09231
219a16954j164K18306L1928k01624n7798J61130P0277j03485o4660L7577L8485
$$ plain form
139 29051 -7363 -3455 51083 -11232 -91229 13545 118745 -10713 -132962 6334 133545
150 133545 -4287 -122312 7863 104032 -15599 -79648 29989 56117 -46374 -33944 64232
161 64232 17797 -77284 -5127 83410 -5802 -81882 17228 72783 -32195 -60759 48035 45203
173 45203 -67095 -31669 84559 19962 -100455 -13434 109846 11282 -110074 -11258 99894
184 99894 10938 -77949 -4485 50129 -7749 -17993 28376 -11074 -53294 35245 81512 -49619
196 -49619 -108127 52486 127482 -44876 -136362 27951 128953 -9351 -107076 -7941 70186
207 70186 15973 -25450 -13628 -22398 -1163 66421 26789 -99506 -58643 117923 92277 -116954
219 -116954 -118118 100188 132116 -69508 -127306 33824 104101 616 -64044 -26467 12018
230A2018K6266N272p8836o1064J12056J20045j22184j71246J09412K05264p8743
241G8260k14752L8948J97358P51j54229l0690R1820M4392j9146l7862n3285J1811
253d6624J14845K9108j56907p7281J73889J22348j65630j55275J35745J68074
263A42292r1804j57231M2905J22326J333o7613l2554R56M5630O8172l8967j28723
275i3278J5471J72417J8657j92634n4770J88355Q4226j61892r9618J19037R6388
286I2359o8230p3509J8103L3316K2830J7474m9310p1301N8600J19121n2439j53514
298a06500L4923J69740j2109j65825r360J43666K3860j06956k6866O2354J7271
309B4198j6645L878k3344l2562N3176O3641p0262r1633P4887J10831o9503j18311
$$ plain form
230 12018 38284 43556 -35280 -96344 15712 135757 13573 -157673 -48261 157003 78260
241 78260 -136492 -97544 99814 100565 -53664 -84354 7466 51858 32712 -5150 -58435 -46624
253 -46624 68221 97329 -59578 -136859 37030 159378 -6252 -161527 -25782 142292
263 142292 50488 -106743 -63838 58488 59821 -7792 -40346 -39390 6240 74412 35445 -93278
275 -93278 -77807 94610 113267 -79367 -134137 54218 138444 -23448 -123066 -4029 92359
286 92359 24129 -49380 -31277 2039 24869 42343 -6967 -78268 -19668 99453 47014 -106500
298 -106500 -71577 98163 86054 -79771 -89131 54535 78395 -28561 -55427 6927 24198
309 24198 7553 11431 -11913 -44475 8701 72342 2080 -89553 -14666 96165 26662 -91649
321i1649N7634J12193m4014r3848L2493O5666k6391l2223K6677j585l2725L1791
333D019M2247n5111n1771P0328N8816p7397o0191P8050N5082p4327m3122O8809
345A5432K5897o3542n688N9097j4455n5863L1959N2259m5554m7317N4345L9259
357D5829n8844k7790O0055J2517n9560N314N9090k4043n8940M1164N9933n4318
369D07o0487O1833N9396o2702n4412N7855M4178m8692k7968L7707N929k7624J9906
382E326K0881m7194j9070P1694K2203r0425k9118J00000L7039r8877m2871Q7299
394A6887M3361o7223l5839M2052J9872j5965M418o481l3912K1987O4895k8370
406B5682r2334K5572J11806j5333j19833J014J14191J2987r5824k2488O6557K3897
$$ plain form
321 -91649 -34015 78178 34164 -59684 -27191 38475 12084 -20139 6538 4953 -27772 4019
333 4019 46266 -8845 -60616 9712 68528 -8869 -69060 8990 64072 -10255 -53377 15432
345 15432 41329 -22213 -27901 31196 16741 -39122 -7163 45096 -458 -47775 6570 45829
357 45829 -13015 -40805 19250 31767 -27793 -22479 36611 12568 -46372 -5208 54725 407
369 407 -60080 1753 61149 -1553 -55965 1890 46068 -2624 -30592 7115 13044 -14580 5326
382 5326 26207 -20987 -40057 31637 53840 -36585 -65703 34297 71336 -27541 -70412 16887
394 16887 60248 -6975 -42814 -762 19110 3145 7563 1082 -32830 -10843 54052 25682
406 25682 -66652 -41080 70726 55393 -64440 -63426 50765 63752 -32072 -54560 11997 35894
418C5894l0940j5667n888k406L8237K7904o1529n6706P2988Q3697p1573j03531
430h9520N9152J12367l9121j07185J6864Q8045K892n7000j5384J8366J7673K2133
442B9282r181n8689q539Q5797L1344j00281n4676J00432P3223q8056q2528O6179
454a5693P9652l9727o4133J4138L7498O498l470j8228l2921K0324O6418j3090
466C7266r1712p17J05724J7313j06664l2468R5261M1811p4121m2657M6948L3710
478B9694j8906j5797o111q550K4113L5476l3694o0708L4547Q0135k8266r0522
490e8589J7783R0472o217q0106k616O1609O413l7738l661J2585n165J0507J8464
503B3741k8755l3509M0397M7204m5485n6947M4481O0514l9584n7420L2806M7639
$$ plain form
418 35894 4954 -10713 -16601 -19007 19230 47134 -14395 -71101 1887 85584 14011 -89520
430 -89520 -30368 81999 42878 -64307 -47443 40602 43494 -13506 -28890 -10524 7149 29282
442 29282 20101 -38588 -47127 38670 70014 -30267 -84943 15489 88712 656 -81872 -15693
454 -15693 63959 24232 -39901 -25763 11735 18233 14763 -3465 -36386 -16062 50356 37266
466 37266 -54446 -55163 50561 67874 -38790 -71258 24003 65814 -8307 -50964 -4016 29694
478 29694 10788 -5009 -11120 -19670 4443 39919 6225 -54483 -19936 60199 31933 -58589
490 -58589 -40806 49666 43449 -36657 -39273 22336 28749 -8989 -12650 -65 -5230 5277 23741
503 23741 -5014 -38523 1874 49078 3593 -53354 -8873 51641 12057 -45363 -12557 35082
515C5082k6483l2783K2108J5145k0575L117K1825j9652k4819L3055K8108m1811
527g683k9851M5991K9374m6292k5451M3851J8349m0214q672L6229k287l3019J3094
540f581L0278k2692k7879K9710K4752l3961k0304L5377J3846l4628n248L2649
552A5319m856l0463J5942K8957k6136k8250L4500K8178l9587k7610M0957K5615
564C2566l8608k0941L3014J3167k5803k249J7957j1002j1772K5393P652l9100
576a9726o602M9928Q235n6555j1352N7654J4597n2826j5999M2722J4356k8701
588d269q221J3205k047J619J5643j3144l0745J9935M5171k1411n6472J7981O2353
601C9598j1353o1693L392N3749L407l9928o820K1433N538j241N58j7570j0967
$$ plain form
515 35082 8599 -24184 -2076 13069 -7506 -4389 17436 -2216 -27035 6020 34128 -7683
527 -7683 -37534 8457 37831 -8461 -33912 9939 28288 -11926 -20598 15631 13344 -19675 -6581
540 -6581 23697 1005 -26874 2836 27588 -6373 -26677 8700 22546 -12082 -17330 15319
552 15319 10463 -20000 -4058 24899 -1237 -29487 5013 33191 -6396 -34006 6951 32566
564 32566 -6042 -26983 6031 19198 -6605 -8854 9103 -1899 -13671 11722 19374 -19726
576 -19726 -26328 23600 31835 -24720 -36072 21582 36179 -16647 -32646 10076 24432 -4269
588 -4269 -12490 715 -1332 287 15930 2786 -27959 -8024 37147 15736 -40736 -22755 39598
601 39598 28245 -33448 -30056 23693 27100 -12828 -19648 1785 7323 6082 6640 -10930 -21897
614b1897L2546K4014m1511l7110M3977M7785l9911n3524L1279N2767j9895m4996
626b6476Q660L0839J58j2192m882q555M482K8259O63m4338r537N4295J9830n7207
640a6001k9216N2986L5099m2986l5662K9262L0383j4536j9048J497L448Q013J4242
653A7481j2583l1196J2241M5001p525n3627M46N5782O960n1582j2681M1847J4706
666B5270k8621j2238J3616N413K75M739j1476j6687J8688K8405k1524l7790K0619
679a1311M3295j6696m3970J1648L9864o799l1327L849J9751l311o997N678n548
692a874j0070J5925J5552k3237k1193K6945K5168k7343k6799K5026K5346k1429
704B017k0727J7449J3538j4050m813J2029m159j1203J2503J1452j8978j1981K3282
$$ plain form
614 -21897 10649 34663 -6848 -43958 19 47804 7893 -45631 -14352 38415 18520 -26476
626 -26476 -17816 13023 13181 989 -3893 -12448 -7966 20293 20956 -23382 -32919 21376 41206 -16001
640 -16001 -45217 7769 42868 -118 -35780 -6518 23865 9329 -9719 -8222 -4774 3239 17481
653 17481 4898 -26298 -14057 30944 23419 -30208 -29762 26020 32980 -18602 -31283 10564 25270
666 25270 -3351 -15589 -1973 3440 3715 8454 -3022 -19709 -1021 27384 5860 -31930 -11311
679 -11311 31984 15288 -28682 -17034 22830 16031 -15296 -11447 8304 4993 -2004 3674 -1874
692 -1874 -11944 3981 19533 -3704 -24897 2048 27216 -127 -26926 -1900 23446 2017
704 2017 -18710 -1261 12277 -1773 -6586 5443 1284 -9919 2584 14036 -4942 -16923 6359
717F359J2244k5051j1331K4678R149k3119n249K0572J60j8018N426J5641j1080
730C81j3777J5868J1962j9127j0302K0735P846k0631m502J9092K22j6585M996
743c822J4063j0595j1802J6312J0184k0992r073K4004Q507k4951p753K3619O264
756A3965k0226l720J5258m10r633N639M312j2011j56J8407k291k4249L096K8205
770A6186k302k9534O42K8065J012k3490j693J6654J006q446J776J1o332P551J2187
785A3293j3154j8540J6088K4010j6283k7760J4042K8581j0305k6197N949K0493
797A0217k270j2187J83K237j52P766K609j6628o635K3031J1924k6197j6809K6052
811C141K0243k2680k1225J7060J9225j0488j4106M079O468P99K549l379j2070
$$ plain form
717 6359 18603 -6448 -17779 6899 16048 -7071 -12320 8252 8412 -9606 -4180 11461 381
730 381 -13396 2472 14434 -4693 -14995 5740 13586 -7045 -11547 7545 7767 -8818 -3822
743 -3822 10241 -354 -12156 4156 14340 -6652 -15725 8279 16786 -8165 -15918 7701 13965
756 13965 -6261 -9981 5277 4867 -4766 873 5185 -6826 -6982 11425 9134 -15115 -12019 16186
770 16186 13884 -15650 -15008 13057 14069 -9421 -11114 5540 6546 -1900 -124 -113 -6445 1106 13293
785 13293 139 -18401 -2313 21697 5414 -22346 -8304 20277 9972 -16225 -10276 10217
797 10217 7947 -4240 -4057 -1820 -1972 5794 8403 -8225 -14860 8171 20095 -6102 -22911 3141
811 3141 23384 704 -20521 -3461 15764 5276 -8830 -4751 1717 2516 5065 1686 -10384
824a0384L435K0326j498k6211k086K8929O114k8345r317K4605J0854j8270j0159
837a2007J0971O833l313j411k951n498P504J2830r626j9398R509K3979p482k6129
851a6189M381K5167j439k1364q83J5352J502q057m57O05k416O078O358j1033j0697
866a3092J3926J4706j4591j7152J3389J7918j0984j6440Q359J2912n815p918M130
879f52K143l633L740L974q838n264J2474O903j4783q177J5275Q513j4272p943
893a0540J2436O141j0153l183P847m43n869M432M466p929l637J0836L237j2597
907d956k848J3289K018j2636r84J1206p96r254K974P184n533n433P900L866r955
922c958k633J1180J691j1427p73J0749l60r092J879P092l828m796O186K707q502
$$ plain form
824 -10384 -6949 13377 11879 -14332 -16418 12511 18625 -9720 -19037 5568 16422 -1848 -12007
837 -12007 -1036 5797 2484 1073 -1878 -7376 128 12958 3332 -16066 -6557 17422 9940 -16189
851 -16189 -11808 13359 11920 -9444 -10327 5025 6527 -1530 -1987 -1382 -3798 2280 8638 -2395 -13092
866 -13092 834 15540 949 -16203 -2814 15104 4120 -12320 -3961 8951 3136 -4782 -652
879 -652 1491 -2142 1598 5572 -3266 -8530 3944 10847 -3936 -12113 3162 11675 -2597 -10540
893 -10540 1896 8037 -2116 -5299 2548 2105 -3764 668 5134 -2795 -6432 4404 7641 -4956
907 -4956 -7804 5485 7503 -5133 -6117 5089 4293 -4961 -1987 5197 -336 -5769 2131 5997 -3958
922 -3958 -6591 4589 6280 -5147 -5920 4829 4469 -4623 -2744 4348 520 -4276 1910 4617 -3885
937c885j005J0580J4j2040M69J2588o16j2091O99J0254j100p549J745M266l147
952h18q19N021k252p324M557R699n995j1575O391J2698n791j2439M590J0976l247
967C672q001K118M346j725N0K075m376l281P891N120j0488p079J1384Q770j1054
982e78r748R466R429p022p832M263M945j784j135Q6l120P91P248l60j0685o93
998f729J2958K338j3678l997J2959N013j0639n332P499M335l963k300N14p46K266
1013D98M155m036p722M601J0584m078j2402K849J2845j333j1761J9R373R06o003
1028a505q75K285j0J429J719m417l878O420O143p381q077P274R085o317r146M774
1044b477P948l208n858J864L074j105J15R70l273j315N805K290p516l331Q444
$$ plain form
937 -3885 -4890 5690 5704 -6336 -5867 6721 6105 -5986 -5287 4967 3867 -3682 -1937 2329 -818
952 -818 -1637 3384 1132 -6192 -1635 8064 2069 -9506 -3115 9583 3792 -8647 -4057 6919 3672
967 3672 -4329 -2211 2135 410 460 2535 -1841 -5122 2769 7889 -2599 -9678 1706 10476 -578
982 -578 -10326 -860 8569 1547 -6285 -2022 2923 1139 4 90 -3030 -2239 5009 4649 -6036 -6729
998 -6729 6229 8567 -5111 -9108 3851 8864 -1775 -7107 392 4727 764 -1536 -1022 -1768 498
1013 498 4653 617 -7105 -2504 8080 4002 -8400 -5551 7294 5961 -5800 -5781 3592 4498 -1505
1028 -1505 -2380 -95 -105 1324 3043 -1374 -5252 1168 7311 -70 -8147 -873 8212 1895 -7251 -2477
1044 -2477 5471 2263 -3595 -1731 1343 238 353 1323 -1950 -3265 2540 4830 -2686 -6017 2427
1059B427M142q223m497P279M419o017l324M238J744k792L81J483k594p65M714
1074B615L15o334l47P214M42p420n34O930L94n946K02M539r64l069K207J618l296
1091a434m53M491l40n314R34N701j303n590J519N017j951l982K341K709k948j476
1107b079L563K56m294O91M833j407n068J798M935j932m340K075L418k204k069
1122a824K518O47k959Q63L498k068m111L006M534l328m847L389M551l106l926
1137c163K639K612k105j099J708o71j700K429J930l918k303N010K772n439l084
1152d382N268L405m640l163L685K350k343j201J162l74k75K187l58l883M48N242
1168C128j99o183l25O378Q71n905j331M847J379l246j075J577K49Q9J070j482
$$ plain form
1059 2427 6569 -1654 -6151 1128 5547 -470 -3794 444 2188 -604 -223 1260 -1334 -2099 2615
1074 2615 2930 -3404 -3751 3463 3905 -3515 -4049 2881 3275 -2671 -2469 2070 1106 -1963 244 1862 -1434
1091 -1434 -1887 2604 2264 -3050 -2116 3585 2282 -3308 -1789 3228 1277 -2705 -364 2345 -603 -2079
1107 -2079 1484 1740 -2554 -1863 2970 1563 -3505 -1707 3228 1296 -3044 -969 2449 245 -1824
1122 -1824 694 1341 -1618 -755 2743 675 -3436 -430 4104 776 -4071 -682 3869 763 -3163
1137 -3163 -524 2088 -17 -1116 592 -79 -1779 650 2580 -1338 -3641 1369 4141 -1298 -4382
1152 -4382 886 4291 -349 -3512 173 2523 180 -1021 141 -233 -508 1679 1321 -2562 -2114 3128
1168 3128 2929 -3254 -3579 2799 3670 -2235 -3566 1281 2660 -586 -1661 -84 165 254 1324 -158
1184a58k465K462L895k749n094K606N777k128n775J418N114p57l866J35K254p1
1200E98l92L18j488r42K891J869l962k754M403L544m242l980L712L995k826l373
1216b629J880K318r87p99K98p36qK253J29l577n18M463R32m845j419M571J729
1233C055m057j639L043J199j938m70R51n83m3J735n20k780Q88L600q76m052Q22
1250a665M094n39l728L89L091n49k126P64J017j035j36J491o92k136J327K540
1266B107j786k738J850K731j797k519J712K065j640j220J620L97j557L94J651
1281A270j094j733J595J887j953j844K118J609k085j282J914P32j851o2J686o92
1297B15j536J280J533j842j496K168J413k270j208K215R84k010m96J712k9j345
$$ plain form
1184 -158 -2623 -161 3734 985 -4109 -1503 4274 2146 -3629 -2211 2903 2146 -1720 -1585 669 598
1200 598 206 524 -964 -1906 985 2854 -1108 -3862 541 4085 -157 -4137 -425 3570 744 -2629
1216 -2629 -749 1569 582 -217 81 -655 -663 1590 1719 -1858 -2376 2087 3019 -1826 -3245 1326 3055
1233 3055 -1002 -2641 402 1601 -337 -807 144 -439 -482 1253 733 -2047 -1159 2441 1565 -2487 -1665
1250 -1665 2429 1890 -1838 -1449 1642 1093 -1033 -269 748 -287 -423 1068 376 -1760 -433 2107
1266 2107 321 -2417 -567 2164 367 -2152 -440 1625 -15 -1235 385 782 -775 -381 1270
1281 1270 176 -1557 38 1925 -28 -1872 246 1855 -230 -1512 402 1134 -717 -779 907 215
1297 215 -1321 -41 1492 -350 -1846 322 1735 -535 -1743 472 1456 -554 -1050 662 633 -712
1313g12P84R71j474p45K067O47k549o26K760O14k796o09K450N20j954l49J446
1330D45k33p11P60M2j373L82K080n49k575O81K933o78k919N10K739k41k251J80
1348g78J460k96n30M56l66q26J065J261j601j866J945K203j940k487J790K381
1364A871j357k064R48J502o19o66L74j97l10J238L81j931n42K452R42k771j259
1381b008K758J307k363j368J746J174j168p37N30M8m5P37l56j501M73K123l76
1398I74k534J95K736L6k535k38K220K81j585j71Q97p8j75M54n11q67Q16J520j152
1417B83j920J195K111j156k101Q92J895o42j556N00R74m70k23N07m09n76R65Q32
1435A101j319j021J554J163j598j242J494J168j317q72J032M68q04q4N73l97n24
$$ plain form
1313 -712 72 1043 -431 -1176 891 1538 -1011 -1637 1123 1737 -1059 -1668 782 1302 -652 -1001 445
1330 445 212 -499 261 303 -1070 -688 1392 843 -1732 -1051 1882 1204 -1715 -1205 1534 1293 -958 -778
1348 -778 682 386 -144 312 -54 -880 185 1446 -155 -2021 -76 2127 187 -2300 -510 1871
1364 1871 514 -1550 -602 900 281 -385 -11 -208 -518 720 1101 -830 -1372 1080 2022 -749 -2008
1381 -2008 750 2057 -306 -1674 72 1246 78 -659 -129 -81 -126 611 255 -1246 -773 1350 974
1398 974 -1560 -1365 1371 1407 -1128 -1366 854 1135 -450 -621 276 198 23 477 -34 -901 -85 1435 283
1417 283 -1637 -442 1669 513 -1588 -696 1199 557 -999 -499 475 5 -218 289 -120 -696 269 1101
1435 1101 -218 -1239 315 1478 -120 -1362 132 1300 -17 -889 143 611 -193 -277 296 -101 -625
1452f25Q75L98j190m82J528M17j529m39J496L25j251j76J135j36q04M47N43o67
1470a35l61R96K52j259j17J386k3j372K9J241k13r90L20O52n31m41P94J52r82
1489f02JJ227j45j401L40J355l05j162K92J054l80o58M36K78n51J24O97l61r28
1508f89O15J052p43j248Q02J187p26j108N51Q63m92m90L24J06l13L63L76p68m10
1527g48J041O45j269p15J323P89j109q31R47P04o50n09M20J08j99L09o0p18J66
1546c56R57o8j364K9J409J76j461k17J273K68r27j75N66J34j77J38j78m49M18
1565dP54n98r73O54J150n86j272N01J113l25r66J74N99m9k62O7j86j83N69L05
1585D82q12m36R85N81r39o88Q91P39p10o44N15M92l66j97K26j58m0L98M8p55n4
$$ plain form
1452 -625 250 648 -542 -1024 504 921 -608 -1047 449 774 -477 -653 482 346 -458 -11 532 -135
1470 -135 -496 500 752 -507 -624 762 739 -633 -604 637 424 -566 -246 406 -125 -566 228 380 -602
1489 -602 -601 626 481 -920 -580 775 470 -692 -400 654 274 -384 52 330 -221 -97 600 239 -689
1508 -689 -74 978 235 -1013 -211 976 250 -858 -307 556 64 -426 -102 4 -309 54 430 -338 -748
1527 -748 293 938 -331 -1046 277 1066 -43 -874 73 777 127 -382 38 146 -53 256 196 -522 -356
1546 -356 601 533 -831 -802 607 783 -678 -895 378 646 -281 -456 110 244 67 205 27 -422 -4
1565 -4 750 152 -821 -167 983 397 -875 -374 739 414 -552 -378 221 172 -90 -23 -209 -392 177 482
1585 482 -330 -766 219 800 -139 -827 64 803 93 -551 -36 456 90 -107 119 -39 -79 319 367 -388 -442
1606d42Q91L2r93o6Q81J51q49j15O63K1l96N1K77k24j4L77q9n98L04P06l20p31
1628d83L56P50m10o67L07N60k90l89L36J07m05Q3L71k74m37M24M33n02m77N61
1648d6M41m70l73N51J96n24J3M68j63l76L08M06m26m21N68L22n49l27N88J98n82
1669a98k9M17q2l61K43K98m26k75N46K31o30j84P18J59p49k9O03O8n29O4L86j99
1691D2j73M23m3n73J30O23j96p40J83Q51k55q25K55P12l13n39L42K71k50j30L93
1712A88j82l35L19N30n55n34O63N99o39o46P03M82m69n69N04K29l37n3K54k42
1732i0k12M95J55p10k06Q86J57r44k31J003K45q89j63O95J65n06L6K55j39p8L82
1753C06r9o30K61Q07k96r66L36R28k94r13K45P73k53n73K03L08k69k8K84j07m59
$$ plain form
1606 -442 449 481 -512 -578 303 454 -395 -510 153 174 -222 -171 106 -118 -132 245 156 -442 -138 568 248 -483
1628 -483 -127 623 213 -454 -147 413 123 -266 70 177 -228 -145 226 -48 -485 -61 372 -130 -607 -46
1648 -46 395 -75 -448 103 299 -225 -212 256 93 -283 25 431 5 -416 152 474 -75 -402 186 384 -198
1669 -198 -227 190 108 -253 -10 288 -138 -413 133 364 -266 -450 268 427 -322 -351 252 320 -209 -145 241 42
1691 42 -131 292 249 -324 -194 429 233 -507 -324 527 272 -553 -298 414 101 -438 -96 175 -75 -205 188
1712 188 6 -329 -10 520 -35 -569 94 693 54 -592 111 593 124 -445 59 288 -49 -102 152 -90
1732 -90 -302 193 348 -362 -568 318 475 -469 -700 303 548 -341 -504 191 356 -150 -114 141 2 -76 306
1753 306 207 -423 -162 645 349 -617 -281 647 353 -560 -315 458 205 -368 -165 143 -126 -154 130 23 -436
1774d36L25O84o32o66P49O80p26o53O92O33o10m98N21K91m25m6L35k26l10N18
1794B00J66o32k67Q38K07q97k58R62J53p94j61O87M8n49J49L56l12j27M43J36
1814C48o91N7Q27j67r11J67R34j89q80L10P27m06o04M70L45n37j66O00m0o28J82
1835b52P31l30p79N30O56m58o72N90N16o42l18P04J43o59N7O17k09o67L55O36
1855E49n54n25N95M04o59l32O90K10p85oP46j84o67L58P00m74o65O41N74o46m46
1876d76O87K75o88j12O63r2o25L40N55n53n05P15M44r27l53R39K74r53k52R48
1896C04M6p19J3N92r8n50M96K76o49j44Q80L9r76K8J100q8j072R9R71j35r02K69
1918b20O81l67m23M79L0o05J83P68l74r60O15R62o45r62O52J011o66q49N93O51
$$ plain form
1774 -436 -111 573 -59 -725 24 704 -22 -675 17 650 40 -458 63 354 -71 -117 218 -8 -318 200
1794 200 366 -266 -533 305 512 -385 -643 319 472 -322 -483 204 252 -297 -148 208 -104 -231 212 348
1814 348 -343 -286 541 374 -537 -370 564 375 -505 -195 532 126 -478 -8 337 -200 -366 234 194 -434 -252
1835 -252 479 149 -630 -100 556 98 -574 16 532 -110 -428 276 419 -240 -183 434 225 -442 -87 549
1855 549 -5 -530 65 469 -190 -522 168 378 -407 -413 333 149 -518 -160 540 66 -599 42 616 -30 -476
1876 -476 211 486 -202 -314 349 257 -368 -28 527 -26 -531 184 628 -299 -652 287 561 -392 -644 304
1896 304 350 -369 -356 236 138 -412 84 360 -289 -433 447 486 -490 -462 638 550 -522 -423 548 413 -489 -220
1918 -220 461 94 -329 150 180 -425 -242 526 152 -808 -193 769 124 -838 -186 825 159 -690 -97 554
1938E54n40l37M93L5m90L34M96o21o04Q69O08j028o67J061P46j083o55R08N33
1957F12p49k83N34Mm00L41K84p23o9R31J77j236p0J247J55j272j54J149J51r14
1977b85p4O76j53m05L53J45o28P8Q35k43j099L44J190l98j238M53J151l60j003
1996f61L99P74m68l46M57R0n62K17P24n02q03O09Q95p38r10Q17P85p60p16P28
2016B9M92o95k08N51J2o26L67O05o46n84Q71N63r92n47J036M78r84l01R02J91
2036E14q19Q6O48k95n97N73M48p45l91Q44L13r76k06R57J22r43J5Q90k20p46M22
2057a06O27o83l76P10L82r59j67J077Q0j061L8R74j81p95K40O61m31m99N89L08
2077D28p59j12Q56M7j102J77J064k13j096L80R26l67o81L40N28n54j76O80j14
$$ plain form
1938 554 14 -323 170 205 -285 49 545 -76 -680 189 797 -231 -898 163 909 -174 -829 79 612
1957 612 -137 -420 114 118 -282 59 343 -380 -449 482 659 -577 -647 600 755 -517 -671 478 629 -285
1977 -285 -359 317 164 -241 112 257 -371 -293 542 299 -800 -456 734 336 -902 -449 702 342 -661
1996 -661 -262 512 44 -302 155 245 -317 -100 624 122 -681 -72 823 85 -825 -8 777 17 -699 29
2016 29 521 -174 -382 169 181 -445 -78 527 -119 -703 168 731 -261 -808 228 706 -278 -579 323 514
2036 514 -305 -219 429 134 -463 110 558 -187 -578 266 579 -397 -603 354 476 -467 -452 438 218 -528 -106
2057 -106 521 -162 -538 172 554 -405 -572 505 585 -476 -438 536 355 -440 -200 461 30 -469 120 428
2077 428 -331 -443 413 460 -642 -465 599 386 -710 -330 596 229 -452 -112 416 -138 -314 366 252
2096B52p36L34Q25m41r81N68J049o41j050O23Q61n27p37N89L64n04o5M44j95n46
2116e14N64N78p81p07R69P72r77p76R56P46q55o06P72L18n49k7L93l03k99O67
2136C41J80r02k95J133L41j254l76J205M01j194k86R33J45o29M7L58k94p9O30
2155D05q1q72J75J110k31j250K51J231j58j117J53Q76q6o80Q0M56l99L4M72k85
2175H4p07M72Q85o25r38O04J006n77r67N62P95m57n70M09L15m72J05M31l54m54
2195d53N89N24q34n79Q65O89q96o52Q15N33p09l37N36J61m88J82M32n49k91O97
2215B35L86r75k95J038K93j010k75R40K11q26m1O25j12n40L93K91n27k50P14J58
2235D33r18o0R56K5r49QR22j15p16J70N46l08l20M37J73o00j1P89r1q44J27R36
$$ plain form
2096 252 -484 -150 675 234 -747 -179 870 229 -821 -198 663 136 -601 -12 352 -152 -217 227 32 -514
2116 -514 50 628 -153 -860 109 881 -96 -872 84 830 -25 -631 141 459 -90 -117 276 -27 -326 341
2136 341 521 -381 -676 457 798 -456 -832 373 774 -420 -706 227 372 -257 -210 148 -146 -225 405
2155 405 324 -548 -373 737 506 -744 -493 738 580 -537 -384 492 406 -274 -194 262 -137 -103 369 84
2175 84 -623 -151 734 109 -829 -225 781 204 -763 -201 594 137 -433 -24 291 -181 -76 355 1 -453
2195 -453 136 660 -174 -753 112 801 -95 -747 68 601 -108 -445 91 252 -236 -54 378 -171 -462 235
2215 235 621 -354 -649 389 682 -328 -603 337 548 -278 -319 306 194 -346 47 338 -189 -439 275 433
2235 433 -485 -545 411 436 -513 -505 417 302 -414 -244 302 -6 -326 111 284 -316 -327 462 371 -473 -346 590
2257E90k14q90L03O97l10n52L20L20m56m8N20o0p12K56P73m17p46L74Q78n19p49
2278f42N00N84l32m47M14J71l84J03L98l72n02N80N37o26o26P41O50p23o10O24
2298C8M88n60l26L94N5k92J79L31m55k88O53K75p70l85R74L43q99l61P69L40o85
2319a82j46M37Lk40K54P3m97kP06n1r08J20Q80O0r79q3R87k9p32PM62l3k46K49
2343A10k3l78J85N77l16p69L94Q78l45r59M05P56k80o40K40M63k15k48J78M3l16
2364b60K68L98n13n44O25O68p05o19O39O33n11m89M20L21k92j78K42m6k43L46
2384A60J79n35k17O45L13q04k87P24L31o65l73O00J74m23J9L05k16j62L89L8n22
2405c27l3O70P2p34m1P58N9o47q7N37K3m13J12K54k92n8L60Nn70J01O29j36p16
$$ plain form
2257 590 376 -514 -211 486 176 -376 -56 264 -192 -240 280 220 -492 -236 537 120 -626 -252 626 107 -642
2278 -642 -142 442 110 -337 77 248 -136 -33 365 -7 -509 71 608 -18 -644 97 747 24 -586 38
2298 38 526 -34 -360 34 89 -203 -24 307 -148 -436 217 492 -278 -663 311 654 -245 -606 163 503 -182
2319 -182 -328 109 112 -128 126 199 -298 -300 406 355 -553 -433 447 507 -472 -555 432 403 -329 -322 140 107 -139 110
2343 110 87 -291 -106 471 155 -614 -220 658 313 -646 -241 515 235 -405 -165 298 83 -165 13 56 -260
2364 -260 8 406 -107 -651 -26 642 -63 -682 -43 590 79 -410 10 331 39 -139 103 57 -186 160
2384 160 339 -196 -413 232 545 -259 -546 178 509 -156 -529 71 245 -178 -159 146 -70 -232 157 195 -327
2405 -327 -360 310 382 -352 -393 365 424 -223 -310 227 250 -163 -51 203 -89 -147 213 218 -352 -251 378 242 -474
2428d74J67O43j38o11K06M50j68l34K56J40l58R0M76k14n02K66N85l49n21L07
2448h3N16l42m25K55L09k43j80K51l5k46K32L00l86l83M84L93n11l89M74M06l56
2469D1m08L90K22k72o7K09q9k09L00J75m65j73M90L18o33k78O08K33n05k67L95
2490A5J76k24r9J87j49l6L04K9m87M8O02p5o29J2O79K2n68o4M38O3l58O6N2j14
2514a10O7K84k11l88K20N42l14n67K97N56k01n31J51M32p4l36J25Q7q6J59M5j97
2536e0k79M26K46l82m09M62M50m36m06L33L81k53k71J43J00j22J37J3k33r6L56
2557A10J96n07j97N57K29n09k20L95K59l32j61K27M6j19J40mk92N7L58j6m88n
2579b76N42M5n42m8L82R6l48k6K15k9q9J78o1j46L9L51j35m85J98M64j44m39Q9
$$ plain form
2428 -474 -307 336 198 -413 -207 243 75 -259 -3 137 -221 -131 345 131 -371 -105 480 131 -390 -83
2448 -83 433 91 -334 -79 230 -13 -193 58 23 -223 9 309 -77 -460 24 417 -94 -483 -9 397 41
2469 41 -367 23 245 -27 -94 115 26 -183 117 292 -173 -346 144 462 -171 -449 159 392 -113 -380 15
2490 15 191 -33 -132 55 -94 -130 174 203 -284 -236 366 291 -338 -326 353 375 -193 -257 181 244 -114 -48 4 -110
2514 -110 -43 241 30 -358 -138 404 90 -477 -180 376 175 -356 -205 227 153 -183 -58 29 -57 102 147 -50
2536 -50 -329 97 343 -39 -448 14 464 28 -378 -45 336 83 -188 -45 55 -67 70 83 -150 -246 110
2557 110 306 -201 -398 159 388 -121 -341 54 313 -19 -180 47 93 -26 114 110 -182 -125 233 217 -271 -276
2579 -276 266 311 -231 -279 103 199 -149 -175 40 11 -78 100 39 -107 -68 283 148 -337 -139 325 181 -258 -169
2602a69M12p3l89J53J60q5m9J33j40j72K12K17k70l07K87L92k13m45K88K90j91
2623D1k50J74J04j08J6J84k21p1K02K55l99j81L41K59l83k37L06J82k18k37K27
2644a4J0r5O4R0j81n1K82Q2l75j11M37J28m26j07L66J35k98l4K16q1j1Q8m2k11
2668a39O7K89l2m92J38M32q7m22jL69N6l54Q8J17m7L8Q7j72r2K11K23k22l75K87
2692c3L30k72k28R0L51j15k94J06J75j06nN6j41K9R1J70l24j62L75K02l72j97
2714b74K36K77k43j96J63J34o7l1L1r7l0K40L9l46j3L09R9l95r7L93Q7l26p8J94
2738IL6o0rK4q2M9J83j00k81O1L85j7m18P1L80p2k78jK04Or1L8nj06Q5J64j96
2765b1k69K67K65j50l69J40L46j83k00J30J20n3r3Q4m5m5N3K09k37j88K79J77
$$ plain form
2602 -169 243 170 -219 -66 94 9 -40 93 -47 -219 -7 210 -60 -367 -80 312 99 -346 -58 232 41
2623 41 -209 -35 69 -39 -23 161 -60 -131 71 326 -73 -254 87 346 -37 -274 32 214 -4 -241 -14
2644 -14 -4 -99 -35 55 -126 -177 105 187 -188 -299 138 266 -160 -267 99 234 -64 -98 118 37 26 114 72 -139
2668 -139 -72 217 185 -307 -169 263 176 -246 -247 122 178 -176 -88 29 -18 20 107 -65 -157 54 277 55 -320 -33
2692 -33 297 25 -203 -113 238 123 -171 -65 110 4 -1 55 -86 -57 34 204 -120 -282 93 295 -77 -274
2714 -274 -38 239 -4 -200 -37 97 30 -1 30 -67 -97 143 182 -164 -177 132 231 -164 -261 132 219 -107 -185 9
2738 9 45 -15 -24 0 -82 -33 150 50 -231 -170 215 198 -220 -149 231 159 -119 -120 84 90 -1 37 32 -74 11 175 -21
2765 -21 -290 -23 242 92 -277 -137 209 26 -174 -44 76 23 -70 14 -31 -76 -23 186 -51 -239 40 217
2787B17k42k12L25J46j55k10J55J14j76K5O2j15m1J90P4k70p9L15L5k59j39K76
2809C6J62k34j36K01J02j81M3P0p3l6J68m3k32JL12j1k80m3L25J6k76k1K26n3
2833D3j32O6kq5R6J29j23k86J93K81m5m03J45K86o3k23L2J77o0n8M0kr4J15J20
2858A47j83j97K04K59k63k47K56K01j33k43J32J42m1j36P8j8j5J14Q2k43n0K53
2880I9J20l28p3K77J38k25j81K11P3j64o6J66j35M0O1L9k26K6K37M1l56K4L26
2903A24J6k78m8K85J1p1q6R1m5L0J53j24j85J42K35j68l34J49K85j2l13ML24r8
2927H7j16o6J20j11J01M0r5j52J13K19k15j71K39K60k26k21J32J74j00r6J03P0
2949H9j05j5J76j42j30J99J21k51j02K54J22l20j17K56J03j77n6J27qn0LJ13j79
$$ plain form
2787 217 -25 -237 88 234 79 -131 24 138 -38 -13 49 -66 -107 83 157 -113 -192 123 158 -101 -240 36
2809 36 198 -36 -172 29 131 -50 -7 63 -10 -46 122 79 -153 -152 160 149 -131 -174 151 167 -109 -130 96 43
2833 43 -89 -23 -25 -110 -14 115 -8 -294 -101 180 135 -268 -123 163 100 -123 -91 86 26 -32 8 6 -88 27 147
2858 147 -36 -233 -29 230 -33 -280 -24 177 44 -199 -67 75 34 -102 -24 -42 -57 57 139 -104 -154 99
2880 99 219 -109 -182 95 233 8 -173 38 111 -53 -119 47 -88 -48 13 52 -174 -148 89 130 -226 -202 124
2903 124 140 -138 -186 99 110 39 -47 44 -1 29 182 58 -127 15 250 82 -252 -103 182 170 -143 -139 185 87
2927 87 -29 -95 25 -86 15 55 -40 -192 -79 140 -75 -246 -7 253 27 -194 -62 112 12 -84 19 89
2949 89 -16 -31 145 3 -127 72 193 -58 -160 94 216 -104 -221 35 138 -39 -95 32 24 -26 -23 90 -89
2972h9j2K33k4j81r0K74R0l90OK39O0j64j0J07j6l0L4L0k20K7K32Kk70N7K50p5
2998G0k75R4K27k8k19P3J36m5p2J25o2r7R2J54j73k71K15K47q5l57J72K34j29
3021B6j33L9L6K3l4N9pj38J18J89j86j88K13K36k00k55K15K05j83j22J18N0j07
3044b6kO4m4j09K07M9k44n2K38P7k09j38J94J53k00r6J23J4n6L6Prl0J92j4k88
3070a63O0K07M6l11M4J79J05k05l9J27O5j50N3k4j28J01J87j44k48J74K13q6k67
3093b04J10K08j6k22O1J17k4p3L0J4j23J72J02j90j56J85J89k12j90J48J99q7
3115C8k07J13J79r1j07J07m7k6J17L8j57r7J93J75l16r7K50J25j82j48J42M7j
3138D8r3Q4j22L1J22l7j77n5L18rk54j4K56oj63r2J72O8q0o2Q5j3m9J45j6j63
$$ plain form
2972 -89 -101 132 108 -73 -163 111 201 -189 -183 56 116 -48 -58 49 33 3 37 67 -153 -126 106 108 -162 -105 145 70
2998 70 -205 -111 116 88 -131 -58 78 33 -39 86 24 -73 19 173 0 -271 -56 191 106 -251 -79 155 26
3021 26 -107 -68 -32 -9 -43 16 9 -129 -11 178 -8 -196 17 253 53 -202 13 218 35 -87 31 81 -26
3044 -26 -28 36 -8 -117 90 139 -105 -157 81 158 -51 -189 5 158 -42 -138 -15 -1 -57 -21 -14 -23 -53 139 125 -163
3070 -163 -103 104 150 -161 -117 62 167 -38 -77 50 115 -35 18 -6 -134 -33 154 10 -238 -64 149 63 -204
3093 -204 -94 114 98 -124 -63 54 30 -43 -13 1 -122 50 152 -38 -194 -9 180 -32 -222 -74 125 38
3115 38 -169 -56 123 32 -75 32 -15 -41 76 114 -43 -140 53 228 -88 -185 65 190 8 -140 2 49 48
3138 48 -45 39 -83 -52 70 33 -144 -199 119 110 -144 -158 98 92 -71 -163 9 77 -3 -65 20 7 -42 103 87 -76
3164g6K8J88n8k10J03J78Jk39k7J96Oj80P7%n4K9J43q6j66Q0K07j14k18R7K37
3189A42j17j82R5J97n6j13kpK3K0J22j16j53J68J45j48j66J64J71j92j55J63J23
3212A26j17p8Q4j9m2O7O8j75qR4K07k99o6K39J13k51r4J43J42q1k00J25M9o8P1
3237C0l5p9K6J58M4k66j9K33M3k07m5J94Q1k18p4J35pM7Q4j43r8M7K28l0l12J35
3263d8J94q8j89%K39ok11L6Q0nn2Q1j09q5J72J15j43j66J06K52q9k55R8J42k0
3288D9j49J15M0p2L6J1%j39J40J42j56j82J35K06j58j24L9J88j17j02Q5L6p0K1
3312b6j5l4N8O7N2j49o5J89Q8j91j27K52N2j69o3R0O7k2m8j7n9N0Q8J2j95M9J60
3339I4k5j47m6J93M7j67j3M8O4r2N8m7o3O3J41o0j50L1K27q1j69m2K50k0j42m2
$$ plain form
3164 -76 -48 140 82 -128 -25 153 154 -85 -112 84 90 -90 -13 -13 -67 -38 105 19 -147 -67 140 26 -192 -95 142
3189 142 25 -157 -62 135 79 -34 -36 -43 -20 0 122 6 -147 21 166 18 -148 16 187 -5 -160 3 126
3212 126 9 -69 15 -4 -46 21 89 -86 -94 0 207 -92 -158 81 194 -57 -151 -8 134 53 -147 -22 27 -41 30
3237 30 -5 -84 -58 100 144 -122 -141 92 135 -72 -117 77 158 -60 -134 1 -6 41 125 -18 -116 -69 159 129 -183 -48
3263 -48 146 58 -131 -131 108 102 -109 -73 7 2 -50 31 -78 -163 9 124 -19 -185 -79 173 84 -171 -73 69 49
3288 49 -100 15 55 -17 19 30 30 -109 31 173 17 -165 -30 176 18 -106 -67 121 4 -98 -13 23 -47 -26
3312 -26 -41 -75 -17 50 102 -47 -112 77 165 -26 -153 99 151 -18 -81 9 76 54 6 -11 -70 -20 68 80 -115 -66 94
3339 94 69 -78 -124 69 116 -51 -64 -16 48 -44 14 -33 -96 -33 108 48 -102 -71 156 75 -94 -136 114 94 -48 -90
3365i0J18K8q1M8n6J8M7R9q8j94J40J48j34j30K3K86j45j43L8J54o6m0JK5p7J08
3391C7M1j50l7J47J18j69j33J16J79j21j23O0J19o8j9k3l4k0K07q0r2l8J77O2
3415A56k07l0J33J06j44r6Q5P1p9m5K2kj1P2l6r9j8J62%j03j10K41Lj18l8N2J11
3442G8m8j8k4j9L2N4l4q1O7J56r5j77P9J45q8o4m6J60j4r2N5k5l8J16p4l4n4J23
3470D0Q4j71j01J39J77j65j52N0J47no3qM9m2P6mj31j9J33J08j87j07J94P6q8
3495C0j32Q8N4j6j6jO0j5pL7j35k0J76k2j33nJ18K1j30l8O2O2n2l5NN5J4j0p2
3524e7l4O2R0j2j78K0J71L7j13k2O6Q1q0o1N6K4qJ4n6n0R4P7q5j40J9K09r5j31
3552a02O7N1M0j49J0Q8JJ0j0l3j07J46Q5j44j5M5J10n6j09kJ27L1j36M6L3L5n
$$ plain form
3365 -90 28 56 -25 23 -33 -15 32 131 43 -151 -11 137 3 -127 -104 182 37 -106 -68 86 20 -20 -19 6 -71 37
3391 37 78 -72 -109 38 156 -13 -146 -30 149 28 -95 -35 84 16 -3 -26 -60 -80 127 47 -45 -83 94 156
3415 156 -51 -81 52 158 14 -82 3 74 -5 -50 -28 -30 -41 31 -5 -104 -122 40 40 -63 -173 68 71 -47 -85 -33 78
3442 78 30 12 -12 -31 1 55 21 -60 7 163 68 -109 -30 115 27 -37 -83 77 63 -29 26 1 -37 79 5 -29 -83 40
3470 40 124 -47 -148 -9 168 3 -149 -99 48 43 -20 -28 21 -21 55 51 -80 -99 34 142 -45 -152 42 118 30
3495 30 -102 -14 40 24 8 7 67 52 45 82 -53 -73 103 81 -52 -57 61 82 -48 -86 -24 38 -14 -49 -44 11 25 15 -57
3524 -57 -91 -29 61 49 -129 -109 62 99 -14 -36 30 111 31 -30 26 50 42 56 0 -50 44 121 36 -104 -85 124 29 -102
3552 -102 -35 16 56 -93 -83 5 6 16 6 -27 -134 12 97 -47 -62 -17 93 37 -72 -74 53 84 -52 -6 27 62 57
3579E7l3l5m3J05K0l6j18J59No5j57J70K5l3k8m8Q5o7K9o6K4N2N3m1r1N8O1P9
3607A21j59o2J22K7l9p6N9L4j3l1K9m4N8K1m2j16J23J15p5j52J7J39N1j33n1M5
3633c2J05Lj13J8k0M1P2j02p7N2J17k3j45OR8L6r6l6O2L7N2o9j8J5Q7l3p6KO7
3662C0N2k5j44Q8M6k6%n8J08k5n6l3KN1Q5p2q3k4J07J7r4p7N4J12j1j11O8mK7
3691Dk1k8LN4M8mj00K8Q4L8j12q8J16M1p5n5M2N2ok8K2p0N0O7q6l2P1Q0p2q2j4
3722g3Q4O7j06qL7%L0m0j07M1J09jq5m5J28L5o5o7N4Q8k0j31K3K1O5j9o4M4M1
3751C6pp3l6J4P2M5q6m3P0J10j02n0L9N6m4m3K1l8R8L4j31l6M8Q2K3o1m8N1J04
3780A05j20m9N5M2j3jq1L8R4m8k7J8p3J33oj01j5J06mq7J3rM5Qk5l9J8L2j9n6
$$ plain form
3579 57 24 -11 -54 51 71 35 -83 76 81 16 -141 29 54 21 -7 -55 30 -37 -8 -74 -50 2 55 14 -77 -19 42 121
3607 121 -38 -100 22 49 10 -66 -7 27 14 -17 12 -32 26 47 5 -111 12 127 52 -100 -83 56 107 -26 -77 -32
3633 -32 73 76 -37 -19 -39 2 74 -28 -105 -53 64 41 -104 -98 0 36 -60 -96 -34 3 55 -14 -32 -17 70 37 -39 -37 30
3662 30 82 57 -87 1 47 21 21 -37 71 46 -10 -43 -41 10 95 23 -60 -84 23 40 -54 -131 -77 35 24 -87 -19 -23 4
3691 4 -17 -45 -42 12 60 56 -44 -16 68 106 -6 -94 22 63 -12 -67 -25 27 21 -7 15 -55 -5 62 -24 -56 15 95 23 -59 -73
3722 -73 11 78 -28 -36 1 1 31 -9 -116 -75 34 33 -52 -97 31 66 1 -66 -12 76 56 -75 -52 -31 34 15 -49 -5 36
3751 36 29 -44 -80 -66 6 51 -35 -78 -8 102 0 -50 -11 45 1 -42 -21 -59 39 73 -58 -94 -46 36 59 -2 -50 1 105
3780 105 -15 -64 -9 33 20 19 -62 -24 70 22 -5 13 -60 73 67 -34 -49 57 53 -34 -21 -30 15 23 -2 -41 -23 9 -10 -66
3810f6RkO8l6l7J2J12k5k1j00R3P0l4j03M9j6K9O1j01J8L4L2m8n5Q6K5o3m6J3
3839d2Q3Or2m3O5Q8o4j1p0O0P7n9m6l9O2P7o7j8J5M4K1m9o6P3j3l6M3m1R2j1p
3870C2q1L4O5Rl1q6K6P8O6j10p7L8P9j3o6n8J04K4jo5l5J30qj18j3L4O6q7L6R
3900a9L9Klj18K0J01Jl2m9P8JK4q6m3J42j3q3J2kJ6N0%j06L2P2l1l7k9mJ92j16
3931A1j01K5M3Q4p9m4R6l1k0L5q4N9O2k7p9J0M9J03j19J2oL7Kq2J2K5O1np2LK1
3962AP5p6k5l9R4j4p5K4OQ6j2q5j4Q6K0l6m0oK8O3q4jK2N0n4l1j8P5j0k8L9j3
3994HQ5o7l1rJ1N6m0m9k7J18k0k6k4J1%J3j0m1N9j9rK6p9M0J41j07j9J1M3Mm2
4025Gp1P7J5nl2k2M8N2j17M1k6P0Rk5mk3K1m0L1m0M9k0L9j08M5J4O6p4l7J3M3
$$ plain form
3810 -66 -57 -59 9 -27 -64 -52 60 35 14 -86 7 77 43 -60 -11 -27 2 63 -38 -20 14 46 -2 -57 29 54 -9 -55 -42
3839 -42 41 47 -45 -88 -23 65 1 -10 -80 -20 57 -2 -48 -87 -25 52 -15 -33 -18 26 47 -2 -68 5 -8 -44 -1 -42 50 39 32
3870 32 -49 -15 50 59 28 -58 -32 46 112 2 -75 -37 42 29 -37 -95 9 33 32 -33 -68 62 54 -64 -77 -43 23 -64 -28 -19
3900 -19 20 22 19 -99 -79 22 23 -9 -58 20 21 45 -41 -84 58 45 -38 -26 -28 -12 38 38 -68 -36 36 5 -32 -61 -65 127 11
3931 11 -90 -65 -22 62 -17 -61 35 4 -16 19 -65 -6 56 29 -50 -40 9 112 -7 5 -1 36 38 -44 -32 -7 54 49 -23 -20 1
3962 1 76 0 -25 -64 30 16 -59 -35 -29 57 45 -40 -54 32 52 16 -24 -30 -2 61 -23 -24 -2 48 -6 -37 -55 20 10 -18 21 8
3994 8 93 26 -5 -14 -3 53 13 -36 -63 55 35 9 -15 -4 -4 9 -1 -42 17 -2 -11 15 -64 -24 117 10 -9 2 45 49 7
4025 7 -64 13 28 23 -9 -31 17 69 -48 -7 -33 37 46 21 17 -6 15 -25 6 -34 15 -5 34 -74 -29 -15 51 -23 -60 -47 -4
4056dRK2p4L4j3J7j1j3K4O4n7o0L0M1L1lm8KL8J4j01J1R6jlp1J2j3J17r6j9L2
4088GJ0k1l2J3kM6j7l2J1J7k5L9l9rJ4M5k8n3L6O5j0j3j05R1N3m6m3K3O1kp8J6
4120hOJ1M8q2j7Q5k1kp6j3N7M7r3M7K1JJ8q6N4j2N0p0O0l6M3l2o2rPO2N6p3M%
4154a5L3M4p7j4J1M1l3j7N7K6m3l8J2j6O3pl9krPk4K1j7R2k2o1J8rJ1n8QLN5K4
4188B5Jm0N6m9N5n7lN9j7k4k1j1J9L9nn9M3K6l9N1p7Q5Ro0j7l8N5L4j5m0k1O3
4220B7o5lM1K4Ll5p6K4L9J5j5m4N2N3n4J3j4k8J10r5J5nJ9L9l5l3J2Rl9K5J2j3
4252b2kJ8l5n2R1lMLo4M5M9k7j9j7J5L8l3PK1p7M2KKl8L2PJ0j5K1L2p6M3%OM7
4287E5n3p9L1P7n3m8M0O7Qn3q6Q2K6J1m1m1L0L5k3K7n7K9N1q7M0k0R9l4n7l3K5
$$ plain form
4056 -4 5 27 -47 -13 -26 -9 -20 -33 -9 55 -2 -62 -32 9 40 37 -11 -9 29 43 -58 -47 49 48 45 -26 -14 -27 90 -6 -25 7
4088 7 17 -4 -36 -23 -25 21 4 -28 -17 0 -25 14 -25 -34 -20 25 -3 -56 -20 45 35 22 -83 8 61 15 -28 -5 56 54 -24 -8
4120 -8 -2 9 57 -25 -42 43 22 20 -56 -69 -12 35 -58 -11 10 11 29 -57 -3 -15 35 -35 25 -11 32 0 -62 -71 -64 -2 54 -19 -15 -15
4154 -15 18 62 -15 -29 -18 23 -10 -27 30 56 13 -25 -13 -29 34 27 -12 -14 -23 -16 -40 -19 -36 56 34 -27 -9 -18 -7 -65 -57 -54 1 25
4188 25 26 -14 42 -7 48 -9 -12 47 30 6 -15 -26 -7 32 27 -32 11 37 -2 49 -28 57 66 6 -11 -49 6 40 25 -15 -36 27
4220 27 -38 -41 0 24 27 -8 -84 -60 -21 -6 -21 -65 -13 40 -14 -1 -15 -43 67 -28 -13 -18 1 40 5 -28 -16 -7 -46 -21 -9 -22
4252 -22 -24 -6 -41 -93 -2 -5 -1 2 -62 -17 32 5 -14 -31 -16 22 -11 -4 17 -60 -18 -16 -14 -52 -20 -13 -3 -18 3 35 -41 2 2 8 55
4287 55 2 -77 -46 31 -22 -70 -30 37 45 -8 -94 -12 14 25 -16 -57 -27 8 -15 12 -45 -16 35 -52 -12 -32 67 33 -24 -57 -32
4318c2N6J2j06N7L7M8r4J2L8Lj8k8ONL5n1Jk4M3L5m6m3M7K4mm9K1L5j9Rj12J12
4350A0k4M8l0%l4K2M2J8o8nN0n6N5pmom8L9K7k7N6o3J8J2m5N5n4k4K2L3o0L6k1
4383c3K1j1J4j7M1KJLq6J09j0j1%m6O%L5np8K7O0m5Q%O2m9J0p4J07m3K0Kk2M5
4417D3K9m8rj0j7Ll7O1lL7o9L6l8M4l3m4N4J2l6L7m3PO5k4j3jm2N0k8N0k3N2J4
4450G6n7m8N1K5Lm9rK8K1Qn5qRRJN2o9lM8l9n9O7L2j1p3K0K4RJ1m1M4j8M6m8M9
4485D6n7K6K5m6K6k0O3n8mj4M7k6l0J6pK1K0nq3K3oN3n2J7J4L7k8p7K4R6l3l5
4517b7K9Pn5P5n2MN5k9M2l4MlK7l7qK6l9kL9l0O0n6k8L6l7J6M4No6L3l7M4mn9
4551e7N9lJ9K0p1N9j3m5QrN2k4K1l5k3QN6k3kQK4Kj4k9N9o2K1lj2J0j7k0J1KJ05
$$ plain form
4318 -32 24 36 -70 -13 24 72 -22 -10 28 31 13 -15 -9 -4 31 -20 -19 -43 0 35 -11 -54 -7 17 13 -36 -15 20 1 10 -102 10
4350 10 -14 34 4 4 -30 -8 34 52 -16 -21 29 -27 28 21 17 11 -37 2 29 2 58 -5 13 25 -20 35 -19 -43 -21 12 -48 -12 -33
4383 -33 -12 -23 -9 -26 15 17 18 21 -65 44 34 23 23 -23 -17 -17 18 13 -65 -38 22 -23 -15 -15 47 -2 8 -66 41 -2 18 20 -2 43
4417 43 72 24 15 5 -12 -9 -46 15 12 49 -20 16 -22 22 -11 -55 -1 11 -25 12 -31 -24 41 17 4 3 -39 11 -17 33 10 62 76
4450 76 19 -29 22 47 50 1 -8 20 41 49 -6 -14 -5 4 5 57 -12 -15 33 -6 -65 2 34 23 -50 -30 -6 3 14 -27 17 -1 45 -3 46
4485 46 -11 15 40 -6 20 0 63 5 1 -13 34 8 -22 -6 -13 8 28 23 -60 -37 -43 10 -42 -25 -11 26 -2 -79 -55 41 8 -27
4517 -27 2 9 -46 29 -23 -19 36 7 49 15 19 16 43 6 -2 24 -15 -17 22 -8 52 -4 -32 4 -33 -17 27 32 -34 -1 -38 6 2 -57
4551 -57 2 -1 18 38 -33 26 13 -32 -24 -33 19 -5 16 -19 -42 -34 22 -1 -3 5 29 31 17 -12 47 -15 6 3 -9 1 -16 -36 -25 -23 82
4586H2j11K3K4Rm1L9j5Kk1L5p4P5o7J8qn0Q1k5OJ3k5K4oJ9j1L7o6L5K0J3r3K8
4618c0L9kJ5k2K8Jl6k5O4o8K9l9M4ln2j8P4p4L1P2m8J0j8J4M3k1pmj4J2N4l9l7
4651b7j1N2J3l0J4k3K1M1o7N3o8O6o8MK5PNrJ6J9l9K2k9M2nj7J6n5N6n9J0M1J1
4684B7J2j8lj8k8LK3k3L5%Lj4K9n0N6l3%J7%K6l5M1k2n1JN4l3K7K5l9l5M9l2p
4718a3l7P0k8j9J0K3Lj6J4qk4jL6l0N1Ol3L0k0N7p2M5Rn7L7Opk9l1mO7p1L5nK4
4753A8m0k5N2j6rn1Q0p0J9K6N7j6q7N2M1j5J6l4oL2m1L9Rk1K1m1O3o4k2k2Q2k3
4785Dm8LQ0l6M3j14N4j1nk2J8M5j2L4q6L8PJ8j6M2k4j7kK2n0qL7j6J6l4L3L7l8
4818hJ0L5m0J4Pj3L8l0j3n0M7K6mk0j4KJ1k0k4O9m2L8p3K3N2oJ0l9K0J3o5N4o
$$ plain form
4586 82 -29 -6 18 27 -14 25 10 12 -9 26 -48 27 -40 -22 -30 -80 1 -24 -18 -5 -30 -6 -12 7 -4 33 -33 2 22 35 -58 -30
4618 -30 9 7 22 0 28 29 -7 -32 32 -36 -7 -46 -2 -5 -57 -75 -1 -75 -44 28 -20 -10 -28 -14 29 8 1 -3 -17 -5 49 10 -27
4651 -27 -38 14 27 -3 11 -12 9 50 -17 36 -32 34 -34 -30 -5 2 7 -2 14 33 -6 16 -13 29 24 7 23 -32 24 -35 -25 16 27
4684 27 39 21 18 0 -28 -25 -2 -25 10 10 13 -1 28 -22 34 1 1 18 18 44 9 50 28 -23 -22 32 -1 26 51 12 -23 26 -6 -13
4718 -13 -50 20 -8 -27 -17 6 9 -7 7 -1 -25 -26 10 -20 31 37 4 34 14 71 -1 44 53 -4 33 39 32 3 -28 -32 35 -36 -1 -6 18
4753 18 -22 -47 5 -11 -20 -71 9 -61 -42 -16 41 25 -62 -10 31 16 32 -2 -8 24 -17 22 31 10 31 -10 53 -11 -33 -55 27 4
4785 4 -44 -41 39 3 46 -68 -14 -25 -30 -52 -34 11 -1 33 -53 -15 -8 10 -6 36 12 -5 -7 15 -35 -43 -6 -22 -6 -40 -7 30 -8
4818 -8 2 37 -3 11 18 5 43 13 0 -50 -3 23 19 -1 -15 -13 -2 -22 -46 23 -19 19 -54 -31 21 15 25 -14 6 19 -46 8 2
4851BJ1Qk5J5qK9k0mJ3J4n4N5lm4J7N9o3P0r6L7Rn2RNJ1K2K2m7k5O8l2n3L4PK
4886gk3Pj5J0KM0o3M0k1%rK5J1pL1%QJ1m7%K6J1K%n1K2L6o9L9n8J9j8OM8J7j9
4922DK5j1n2k0P1On0l5P2J0%l5m0L2oQk9Q4n7k1N9k2j1N4j1j1J4pk0J2lNloLL5
4958D4m1k6QL1j5k5m4N0Lk4RO6n5j2K5J8l7J17j07j7L6N5rj16M1M8rJ2l3L1j6
4989Hj8M0Qn2J0Nk1lJ5P9p9jN8m1J6p9K1K4pNj9Nk6J6KJ0j4K9j7J3J0ol8N5l6
5024b8M7m8M3J0k6M7n5L0J5Nk3Qk5Qlk7K1k7L7l8K1J8l1jN4l2J7l3k8QJ0j9J2
5057c3J8M0j8n9K2N9m9K6k0m7M8K2m3ON0PLlj8l5kN6k1o3N8m8J5P8m7K8o4%L5
5090Ao1J28n8j0k1l9K9M3n4Qj1PL5K9l0k7O7J7q6M0J4j9J7k4k0L7N1j9j4k9K5
$$ plain form
4851 2 13 21 -4 11 3 32 12 8 21 35 -19 36 33 -11 6 65 2 72 -24 13 22 -30 -21 -16 -5 17 39 -8 -33 35 3 -50 -16 -9 -7
4886 -7 -30 -23 -38 -28 -26 14 -49 -9 -30 -30 -39 -14 -3 -10 21 21 29 40 -7 -7 19 30 32 32 -19 3 39 -30 9 -49 -30 -48 -42 6 23 4
4922 4 29 18 -34 -54 17 23 -27 -62 10 20 20 -15 -55 -23 -29 -21 -50 34 -23 -44 15 -7 -18 36 25 14 28 21 1 13 10 15 12 6 9 44
4958 44 3 -23 -15 16 1 -24 -68 -18 -15 -39 -30 36 -19 -31 -6 12 -25 92 -15 -32 4 59 50 -66 -25 23 14 26 -7 24 8
4989 8 -10 30 38 -14 -4 1 -20 -23 -8 71 -8 -9 49 8 24 -55 -34 -10 -17 -12 -31 -26 -52 -36 -34 -24 -38 -9 -26 -13 -3 -9 -47 8 -28
5024 -28 19 -29 14 24 -2 45 -10 20 35 40 17 25 0 8 5 -22 -1 -28 9 -29 -8 10 -21 -22 32 0 17 -16 -44 -36 -26 -45 -33
5057 -33 -15 25 7 -52 -30 29 -20 6 -14 -61 -13 9 -34 -28 22 29 32 29 11 -24 -26 30 9 -54 4 -44 -29 49 2 30 -34 -34 1
5090 1 -60 68 10 0 -21 -60 -31 12 -42 -34 -45 -38 -3 26 -4 -31 36 53 -33 7 21 2 19 -5 -25 12 63 44 30 1 26
5121B6q5Q3p6M9K5j7LQlNK1n1m6K1K1j9J9k3KmJ4M0QK6l5%NKJ9J4l8m8Q4p1L1
5156A0k9j2k0N3j2rK6J4k0k0K1l5M4m4M9N4p3JMJ0klj1L6k5J0j8oomj8Q5m4qk3
5191b5O8n2jM2m0M9l9jNJ6m2L2j9jj7M1m0O5k1l7Oj7K0rJ5k7K7l3M5j3Kl0K6m
5225iJ9j5M7o7K3Qm4L1L0J8l5j1pM3J3k4m1O4k8M1m7k6N3j1m8J4j3L6l3k8M6l
5257dj0k9K0j2oO2j0%n3L1L2Pk8M1n2J2M1m5M8j1m1J5k9P5m4k3K0olO2m5o4K7
5290b2K4kj0k3L6K0l0J1nk2K2nL4Jj8K2n7kK8J2l1J2J1nJ4j6OJQJ5k6Rl1M7m7
5325a9LK3Nk1j0N1JPp9M4l3j2L8j8K3K7l5J0m9L8LK0l7J0l5M8j7m7K2M8%o4N2
5358cmN8Po8M9m0M1M0r1M3Rj8J2l0kl6M4j8K1j9RjnPmk9M6n1j2LL4n2L9j0K0K9
$$ plain form
5121 26 -59 24 -52 -3 22 5 8 16 13 18 39 -12 -58 -37 -16 -35 -16 -39 -37 -41 -27 13 21 47 12 12 17 19 38 52 14 -34 50 -21 10
5156 10 -19 -31 -51 2 -10 -19 7 21 1 -19 2 -33 11 -33 16 70 -3 -2 2 12 10 7 -4 32 7 17 -1 -7 -13 -17 -35 50 6 -2 -25
5191 -25 43 -9 -10 32 -8 41 2 1 6 22 -20 12 -7 -8 -25 16 -24 41 20 -17 -11 -28 -8 -17 -2 -29 -2 -35 10 -3 -1 -31 -5 -9
5225 -9 10 -5 42 -25 -2 6 -38 -7 23 41 6 -5 -12 31 44 20 -21 43 15 56 9 -17 36 25 -23 -9 -22 14 -19 -47 -1 -4
5257 -4 -14 -43 -23 -35 -41 21 11 11 -42 -11 21 28 0 41 -11 1 42 -3 45 34 -7 8 -21 54 10 -13 7 1 -2 60 15 -49 -22
5290 -22 2 0 -10 -33 3 23 -7 4 -1 -23 -1 -6 28 29 11 33 -24 -26 2 14 -17 -5 6 1 15 -1 5 6 14 29 3 12 -19 28 -19
5325 -19 -16 7 12 -9 -19 32 33 40 -39 5 -28 -40 -2 -20 3 30 -5 5 -44 -6 -3 17 -20 -10 -45 3 -14 -61 -39 9 9 -55 -3
5358 -3 -7 51 58 -10 39 -1 40 80 -11 32 41 23 35 5 3 -33 11 -7 14 -5 4 3 -2 5 1 -28 18 -33 -45 -42 -8 -60 -21 -31 -11 18
5394A8qoK8j7qJ6k9M2n1P1m9Qn2pP8r7M8qJ7J8j2l7P3q5Q5n2K8k4LJ1Jl6J5qn
5429c1L0j9M6o9O8lK8n9J9l4M8o1O3mk7qL2J9q6L8qN0j6K3n7M2m6QrL3m9K6j9
5462c2O2p9K2kL8rn2L4m4L6NM3lM6j41M7M2qqJ6PJ6l8L5j9m7R0on3K3K5l5j0k
5496aK7o8K8Lk6J2%l7N2m4O5o8N4o4N7J0j3K8k2J4m8K5lM2Ol4N8p0M2k0J0qN4
5529F1k2k7J8j1p1M5Q4j40N8MN1o3J1L2p3M4L3q2M4j6M0rl8L8j4J6JJ0L2o0k0
5560b4N1l3m1Q0K1n5K9Kk6K2n0M8l6J8Lj9L3m7RN0n1nL1m1O9n0J3j0M3k0rJ1j2
5593Dn3kROj5L4Km7J04r3M7jo3O9PL5p2L7OpK7m6J0MK3no4KK1l9N6j3J8Kl8jL1
5630ej5Kj6m2J00n0J9L0k2QqM3o4K2J4K6Rl6J9j9rLoL5K9o2l0K5j8M7o4L0N7o4
$$ plain form
5394 18 10 4 32 15 7 23 -6 36 -15 56 7 15 -37 -44 34 -63 -15 -23 -6 12 0 -37 36 -49 36 -16 12 -12 -9 2 3 -33 -18 -26 -31
5429 -31 -1 -20 26 -43 25 22 50 -9 10 -24 24 -37 26 22 -5 -13 19 38 -48 -10 -18 32 16 39 -18 24 -22 -14 -23 10 -39 -13 -32
5462 -32 30 -49 -27 -29 9 0 -52 -18 -62 -26 -21 22 19 65 -76 -29 13 5 -3 13 20 36 -2 33 14 -33 57 51 -2 21 46 11 1 -1
5496 -1 26 -42 -14 -11 -37 -25 -25 -62 -10 -54 11 -57 -3 -67 -10 0 -13 15 -7 7 -41 -16 -19 23 29 -5 53 -17 25 5 15 7 61
5529 61 39 12 30 19 -52 -7 77 -63 -5 -1 50 -13 -2 30 -43 1 34 -48 -4 -20 20 11 -27 11 -3 13 14 24 56 -4 -24
5560 -24 27 -6 -47 33 54 -1 28 30 4 26 -24 24 -12 6 9 -10 23 -24 -15 35 -16 -21 10 -31 38 -12 1 -9 34 14 5 16 4
5593 4 -49 -51 -42 -36 -51 -17 -15 -62 42 -51 -4 -5 -68 1 8 43 -29 8 14 7 34 -12 -2 2 25 20 -44 -42 -21 -60 -4 -17 1 3 -35 -36 -5
5630 -5 -20 -18 -34 -76 24 -26 -7 23 1 9 1 44 -20 2 16 42 51 15 34 15 6 9 3 38 67 5 -25 0 -18 29 -35 -5 52 -12
5664a2Ql4L2J7rl4P2m0lNJ7L0p9K7j5L1K0r8N9M2l4l7M7j9j5L0Pr4J29m3J2j7
5696BJ5K2mOj6q0L2M0J5Jo1j0J0O6m9O2n6l3l3N2J3m1O4J2m0k4NP3n7J0n3M4J3
5729@o0Q9m8N4K7m0l8L3m8K7l1K8L3l6L8k0nJ0j1m7M8j2j3M6m2k8O8l8Qql5P1
5761B0k2k6JM7n7O0m7K4L2Oo5M7Ol8L5L3o7KKl0Q7r3M2oqj0l0Q2m2mk7O8o1O1
5795B2n1J6K5k0j7j4N8K3k0Jlo2M3m6M8L4j2m8J8J5m5N7lj9jM4J3j3J5m9k4jm
5828b0L7rJ0n6M6j2l4M0Km2K5J6qJ5lNk2m0K7M1p4O9j5rJK5k3l1O9mk8P4j34N1
5862a1mLj6K4qM5k2l0JK2rk7M2Ln2K4J4j7Rmj8k5J6QoK6J5L7j8k6K4Mo3J04m0
5897B5M2m7j3k1lM6J1%q6M3K8k0o3R5K3j15O1l5L6j2k0J7oMk0L1qj0kJ7k4Pn6
$$ plain form
5664 -12 -4 -38 -6 11 2 -32 40 0 -3 2 19 49 -30 -3 -18 13 33 -65 -6 36 2 -35 12 -7 -22 8 15 -79 50 7 19 2
5696 2 17 39 35 41 25 -55 -23 17 32 33 -28 -38 -28 38 -11 51 -5 -38 -71 -19 -6 -47 17 29 -11 -35 -30 43 -14 -4 -57 -13 0
5729 0 -60 29 -19 35 62 22 -16 17 -31 -4 -35 -7 26 -10 28 8 3 13 2 -45 3 -9 -22 24 -18 -46 22 -16 -8 -16 -51 20
5761 20 -2 -28 -27 20 -37 23 -24 0 32 38 -27 20 26 -12 23 56 -11 -9 -7 -37 50 -43 -1 -7 -15 -25 -55 27 -15 -19 -46 22 -39 22
5795 22 -29 -13 12 -8 -25 -39 19 42 22 23 20 -42 1 -45 3 37 25 -23 -5 10 -35 22 19 0 -1 43 56 43 58 9 -15 -16 -20
5828 -20 17 8 18 -38 8 -4 -38 2 4 -38 -13 3 -5 10 7 12 -10 -50 -23 18 -56 13 -2 -11 -10 15 -8 -39 30 26 -2 72 -62 -11
5862 -11 -15 -12 -28 -4 -12 33 11 -19 -18 4 -5 -32 10 13 -39 -15 -1 -18 -9 -13 -31 -56 -40 -32 -38 -12 3 40 22 -4 20 24 -39 65 25
5897 25 67 20 7 -14 -17 29 40 40 -46 -3 25 5 -58 37 60 -55 6 -29 7 -5 -25 -8 -14 -10 -30 1 -7 -17 -19 -2 -26 -19 -75
5930g5Q5j8M0l9K2LJ9mJo2O0mp2K3M1j6Ok1J6m6M7rqJ0o1N5L8n9PJ2l9j2R6n7
5964b1L4k0k7mK0R3r6pJ0j5J4K4j2m0P9j3p0mR0l8%kNpL5Jj1Rl7J2M7k9k2L0k1
5999Gl4l4N4j4M2qM2p5J2o8Q3J6kN5o9n1N6M8l8j8l3K9pJ2onm8J10J1k6k0j8j0
6032gK7k8j8J6Lk3lL4J0l6L6m0L0L4m0P0q0K3j5PP%nl2N1j1n6L6N9k0n0j5O1j2
6066A3j6L5j1l4pL6Rm7k0L0j7K8kRk2l1N1j4K4k3k0nKK7l4L6j4LmO1o7mN6j0j7
6101AOM3qLK2n2k0Mk2O5j2M0p7MJ6Pj6j4L2k8k2J2m9O4Mj0l8J9J7l6R1k1K8p5
6135b2K2J9n3J5l3K9O4J2o7J2L0KmQm6J6M0m2K3Ljo0L9n9M3Lj9K4qk7N6Kj0l1
$$ plain form
5930 -75 10 -8 32 -7 15 18 37 33 34 -28 32 28 -44 -21 20 4 10 -11 5 -41 6 -3 -11 -1 -62 -7 31 -28 -21 -9 -48 -60 36 -21
5964 -21 13 -7 -34 -38 -18 75 -21 -28 -18 -33 -19 5 -7 -47 32 19 -51 -55 35 -3 -3 -5 0 -7 28 29 18 27 -10 2 49 20 -2 28 7
5999 7 -27 -61 -7 -21 21 13 55 -20 -8 -76 7 23 21 76 7 -44 12 60 22 4 -29 0 -7 5 -1 -6 -54 56 67 41 21 3 -7
6032 -7 20 -8 -26 -10 -7 -30 -33 1 11 -25 11 -29 1 35 -5 65 -15 8 -7 0 7 7 2 -30 21 10 -46 -10 49 29 -21 -36 25 13
6066 13 -3 32 21 -13 -20 16 25 -22 -42 -12 -29 -1 -3 6 -16 -47 4 -10 14 -9 -29 -34 -32 -5 -39 -3 -17 -14 -18 43 -24 -28 28 18 1
6101 1 7 50 42 45 67 15 -5 -1 -23 42 30 70 -7 -3 13 20 4 -10 22 -6 -28 -16 -65 -1 3 -7 -45 -26 -9 -45 46 25 53 -22
6135 -22 0 19 -34 -19 -52 -23 41 53 -14 -2 28 30 26 34 -12 4 44 2 25 28 27 -33 6 -53 -10 -7 -26 -2 -10 -37 19 21 11 -20
$$ [...]
8191d5
##END NTUPLES=NMR FID
##END=
