##TITLE=1H_LY-DMAA.Per.1.11
 CDCl3
 8 sc, 
 17.02.2022
##JCAMPDX= 6.0         $$ Bruker NMR JCAMP-DX V2.0
##DATA TYPE= NMR FID
##DATA CLASS= NTUPLES
##ORIGIN= UXNMR, Bruker Analytische Messtechnik GmbH
##OWNER= root
$$ XWIN-NMR		Version 3.5
$$ Thu Feb 17 09:35:06 2022 Russian Standard Time (UT+4h)  she@DPX200
##.OBSERVE FREQUENCY= 200.131346
##.OBSERVE NUCLEUS= ^1H
##.DELAY= (6, 6)
##.ACQUISITION MODE= SIMULTANEOUS
##.ACQUISITION SCHEME= undefined
##.AVERAGES= 8
##.DIGITISER RES= 18
##SPECTROMETER/DATA SYSTEM= spect
##.PULSE SEQUENCE= zg30
##.SOLVENT NAME= CDCl3
##.SHIFT REFERENCE= (INTERNAL, CDCl3, 0, 15.7039)
##AUDIT TRAIL= $$ (NUMBER, WHEN, WHO, WHERE, WHAT)
$$ ##TITLE= Audit trail, XWIN-NMR		Version 3.5
$$ ##JCAMPDX= 5.01
$$ ##ORIGIN= Bruker BioSpin GmbH
$$ ##OWNER= she
$$ F:/spectra/data/she/nmr/H-F/1/audita.txt
$$ ##AUDIT TRAIL=  $$ (NUMBER, WHEN, WHO, WHERE, WHAT)
(   1,<2022-02-17 09:33:44.07 +0400>,<she>,<DPX200>,
      <created by zg, POWCHK disabled, PULCHK disabled
       configuration hash MD5:
       00 E9 B6 7A A2 85 ED C7 34 08 36 98 17 FE 4E 26
       data hash MD5: 16K
       07 5D 67 93 6B D0 80 DB 92 4B 26 B4 DA A5 25 F1>)
$$ ##END=
$$ 
$$ hash MD5
$$ C6 4B 21 C2 09 0A 06 ED AE E6 49 DC 79 DF 24 BD
##$RELAX= 
##$RELAX= 
##$RELAX= 
##$RELAX= 
##$RELAX= 
##$RELAX= 
$$ Bruker specific parameters
$$ --------------------------
##$DU= <F:/spectra>
##$EXPNO= 1
##$NAME= <H-F>
##$PROCNO= 1
##$TYPE= <nmr>
##$USER= <she>
##$AMP= (0..31)
100 100 100 100 100 100 100 100 100 100 100 100 100 100 100 100 100 100 
100 100 100 100 100 100 100 100 100 100 100 100 100 100 
##$AQSEQ= 0
##$AQ_mod= 1
##$AUNM= <au_zg>
##$AUTOPOS= <>
##$BF1= 200.13
##$BF2= 200.13
##$BF3= 200.13
##$BF4= 200.13
##$BF5= 200.13
##$BF6= 200.13
##$BF7= 200.13
##$BF8= 200.13
##$BYTORDA= 1
##$CFDGTYP= 0
##$CFRGTYP= 5
##$CHEMSTR= <none>
##$CNST= (0..31)
1 1 145 1 1 1 1 1 1 1 1 1 1 1 1 1 1 1 1 1 1 1 1 1 1 1 1 1 1 1 1 1 
##$CPDPRG= <>
##$CPDPRG1= <>
##$CPDPRG2= <>
##$CPDPRG3= <>
##$CPDPRG4= <mlev>
##$CPDPRG5= <mlev>
##$CPDPRG6= <mlev>
##$CPDPRG7= <mlev>
##$CPDPRG8= <mlev>
##$CPDPRGB= <>
##$CPDPRGT= <>
##$D= (0..31)
0 1.2 0 0 0 0 0 0 0 0.06 0 0.03 0 0 0 0 0.0002 0 0 0 0 0 0 0 0 0 0 0 0 
0 0 0 
##$DATE= 1645076023
##$DBL= (0..7)
120 120 120 120 120 120 120 120 
##$DBP= (0..7)
150 150 150 150 150 150 150 150 
##$DBP07= 0
##$DBPNAM0= <>
##$DBPNAM1= <>
##$DBPNAM2= <>
##$DBPNAM3= <>
##$DBPNAM4= <>
##$DBPNAM5= <>
##$DBPNAM6= <>
##$DBPNAM7= <>
##$DBPOAL= (0..7)
0.5 0.5 0.5 0.5 0.5 0.5 0.5 0.5 
##$DBPOFFS= (0..7)
0 0 0 0 0 0 0 0 
##$DE= 6
##$DECBNUC= <off>
##$DECIM= 32
##$DECNUC= <off>
##$DECSTAT= 4
##$DIGMOD= 1
##$DIGTYP= 9
##$DL= (0..7)
0 120 120 120 120 120 120 120 
##$DP= (0..7)
150 150 150 150 150 150 150 150 
##$DP07= 0
##$DPNAME0= <>
##$DPNAME1= <>
##$DPNAME2= <>
##$DPNAME3= <>
##$DPNAME4= <>
##$DPNAME5= <>
##$DPNAME6= <>
##$DPNAME7= <>
##$DPOAL= (0..7)
0.5 0.5 0.5 0.5 0.5 0.5 0.5 0.5 
##$DPOFFS= (0..7)
0 0 0 0 0 0 0 0 
##$DQDMODE= 0
##$DR= 18
##$DS= 0
$$ [...]
##$SUBNAM2= <"">
##$SUBNAM3= <"">
##$SUBNAM4= <"">
##$SUBNAM5= <"">
##$SUBNAM6= <"">
##$SUBNAM7= <"">
##$SUBNAM8= <"">
##$SUBNAM9= <"">
##$SW= 18.0517287032376
##$SWIBOX= (0..15)
0 0 2 0 0 0 0 0 0 0 0 0 0 0 0 0 
##$SW_h= 3612.71676300578
##$TD= 16384
##$TD0= 1
##$TE= 0
##$TE2= 300
##$TE3= 300
##$TEG= 300
##$TL= (0..7)
0 120 120 120 120 120 120 120 
##$TP= (0..7)
150 150 150 150 150 150 150 150 
##$TP07= 0
##$TPNAME0= <>
##$TPNAME1= <>
##$TPNAME2= <>
##$TPNAME3= <>
##$TPNAME4= <>
##$TPNAME5= <>
##$TPNAME6= <>
##$TPNAME7= <>
##$TPOAL= (0..7)
0.5 0.5 0.5 0.5 0.5 0.5 0.5 0.5 
##$TPOFFS= (0..7)
0 0 0 0 0 0 0 0 
##$TUNHIN= 0
##$TUNHOUT= 0
##$TUNXOUT= 0
##$USERA1= <user>
##$USERA2= <user>
##$USERA3= <user>
##$USERA4= <user>
##$USERA5= <user>
##$V9= 5
##$VALIST= <valist>
##$VCLIST= <CCCCCCCCCCCCCCC>
##$VD= 0
##$VDLIST= <DDDDDDDDDDDDDDD>
##$VPLIST= <PPPPPPPPPPPPPPP>
##$VTLIST= <TTTTTTTTTTTTTTT>
##$WBST= 1024
##$WBSW= 4
##$XGAIN= (0..3)
0 0 0 0 
##$XL= 0
##$YL= 0
##$YMAX_a= 396830
##$YMIN_a= -340421
##$ZGOPTNS= <>
##$ZL1= 120
##$ZL2= 120
##$ZL3= 120
##$ZL4= 120
##$ABSF1= 10
##$ABSF2= 0
##$ABSG= 5
##$ABSL= 3
##$ALPHA= 0
##$AQORDER= 0
##$ASSFAC= 0
##$ASSFACI= 0
##$ASSFACX= 0
##$ASSWID= 0
##$AUNMP= <proc_1d>
##$AZFE= 0.1
##$AZFW= 0.1
##$BCFW= 1
##$BC_mod= 2
##$BYTORDP= 1
##$COROFFS= 0
##$CY= 11.3945322036743
##$DATMOD= 1
##$DC= 2
##$DFILT= <>
##$DTYPP= 0
##$F1P= 2.36226072786647
##$F2P= -0.459571619588291
##$FCOR= 0.5
##$FTSIZE= 0
##$FT_mod= 4
##$GAMMA= 1
##$GB= 0.15
##$INTBC= 1
##$INTSCL= 1
##$ISEN= 128
##$LB= 0.24
##$LEV0= 0
##$LPBIN= 0
##$MAXI= 10000
##$MC2= 0
##$MEAN= 0
##$ME_mod= 0
##$MI= 1.114404
##$NCOEF= 0
##$NC_proc= 0
##$NLEV= 6
##$NOISF1= 3.799351
##$NOISF2= 2.8
##$NSP= 1
##$NTH_PI= 0
##$NZP= 0
##$OFFSET= 15.70392
##$PC= 1
##$PHC0= -16393.9
##$PHC1= 18.40078
##$PH_mod= 1
##$PKNL= yes
##$PPARMOD= 0
##$PSCAL= 0
##$PSIGN= 0
##$REVERSE= no
##$SF= 200.130013532006
##$SI= 16384
##$SIGF1= 3
##$SIGF2= 2
##$SINO= 400
##$SIOLD= 16384
##$SREGLST= <1H.CDCl3>
##$SSB= 0
##$STSI= 0
##$STSR= 0
##$SW_p= 3612.71676300578
##$SYMM= 0
##$S_DEV= 0
##$TDeff= 0
##$TDoff= 0
##$TI= <>
##$TILT= no
##$TM1= 0
##$TM2= 0
##$TOPLEV= 0
##$USERP1= <user>
##$USERP2= <user>
##$USERP3= <user>
##$USERP4= <user>
##$USERP5= <user>
##$WDW= 1
##$XDIM= 8192
##$YMAX_p= 0
##$YMIN_p= 0
$$ End of Bruker specific parameters
$$ ---------------------------------
##NTUPLES= NMR FID
##VAR_NAME=  TIME,          FID/REAL,        FID/IMAG
##SYMBOL=    X,             R,               I
##VAR_TYPE=  INDEPENDENT,   DEPENDENT,       DEPENDENT
##VAR_FORM=  AFFN,          ASDF,            ASDF
##VAR_DIM=   8192,          8192,            8192
##UNITS=     SECONDS,       ARBITRARY UNITS, ARBITRARY UNITS
##FACTOR=    0.0002768,     1,               1
##FIRST=     0,             0,               0
##LAST=      2.2672688,     0,               0
##MIN=       0,             -340421,         0
##MAX=       2.2672688,     396830,          0
$$ Real data points
##PAGE= N=1
##DATA TABLE= (X++(R..R)), XYDATA
$$ [...]
1189H106l1141J3240L1686j1555k9145R392K3437p574j5392O680O032p271L756
$$ 8106 -23035 -9795 21891 10336 -18809 -9417 14020 6446 -8946 -2266 3766 -3505 251
1202B51R093j2569j1898J9672J5064k4174j7745K6137J9139k5367j8618K2539
$$ 251 9344 -3225 -15123 4549 19613 -4561 -22306 3831 22970 -2397 -21015 1524
1214A524J5876j8320j1018J3702M248r435L521O024j1547l966J8827K971k4573
$$ 1524 17400 -920 -11938 1764 6012 -3423 98 6122 -5425 -9391 9436 12407 -12166
1227a2166k816K7860L078k8614k992K6788K186k2894j28J7599l102j1445P235
$$ -12166 -14982 12878 15956 -12658 -15650 11138 13324 -9570 -9698 7901 4799 -6646 589
1240E89N563j2024j41J6579m023k0345P105K2611r061k3085J0227K1549j1033
$$ 589 6152 -5872 -6013 10566 6543 -13802 -6697 15914 6853 -16232 -6005 15544 4511
1253D511j8278J1642J3480j2451p873J3380J980j4501L602J5443q393j5931J2115
$$ 4511 -13767 -2125 11355 -1096 -8969 4411 6391 -8110 -4508 10935 2542 -13389 -1274
1266a274J5702j4587j4276J5984J1879j6527q287J6493L966j6140R08J5506n620
$$ -1274 14428 -159 -14435 1549 13428 -3099 -11386 5107 9073 -7067 -6159 9347 3727
1279C727j4786R855J3811j3232j2508J5510J0430j6630p655J6537L993j5687L41
$$ 3727 -11059 -1204 12607 -625 -13133 2377 12807 -3823 -11478 5059 9052 -6635 -6294
1292f294J4321n100j2783R872J1278j4240r720J7688Q266j9684o664K0234M663
$$ -6294 8027 2927 -9856 16 11294 -2946 -12666 5022 13288 -6396 -13060 7174 11837
1305A1837j9073k104J6624j186j3065N086R085r480n135J3841J718j8021R76K1082
$$ 11837 -7236 -9340 7284 6098 -6967 -1881 7204 -2276 -7411 6430 8148 -9873 -8897 12185
1319A2185k758k2752L683K2690m188k0661M522J6886n260j1548O411N494q203
$$ 12185 9427 -13325 -9642 13048 8860 -11801 -7279 9607 4347 -7201 -790 4704 -3499
1332c499P73J0774o425j3606J0966J6295j3928j8224J5160J8880j4926j7769J3310
$$ -3499 -2726 8048 1623 -11983 -1017 15278 1350 -16874 -1714 17166 2240 -15529 -2219
1345b219J4856j1102j0191Q886L977p115K850O067r700n995J5751O710k0358p637
$$ -2219 12637 1535 -8656 230 4207 -2908 -58 6009 -3691 -9686 6065 12775 -7583 -15220
1359a5220K2802Q505k3008q605K1150P686j7518n274J2798J637p835L298L137
$$ -15220 7582 16087 -6921 -15526 5624 13310 -4208 -9482 3316 4953 -2882 416 3553
1372C553q808O80J4226l276j8950M543K2204m753k3594M173K2678l442j9718L063
$$ 3553 -5255 -4575 9651 6375 -12575 -8032 14172 9419 -14175 -10002 12676 9234 -10484 -7421
1386g421J4875l411q869M664K531o749L415R674q441j2600J2043J5169j3980j6638
$$ -7421 7454 4043 -4826 -162 2369 -4380 -965 8709 268 -12332 -289 14880 900 -15738
1400a5738J4419J6615j3582j4865J1943J1489j0125o728Q371J073p128M711O537
$$ -15738 -1319 15296 1714 -13151 -1208 10281 156 -6572 1799 2872 -4256 455 6992
1413F992j0207o414J4555O593j7565o645J8829O357j8576n199J6908L189j4087
$$ 6992 -3215 -9629 4926 11519 -6046 -12691 6138 12495 -6081 -11280 5628 8817 -5270
1426e270m21J0883l120p407O922M410j0704j842J3918j53j6158J688J7111k847
$$ -5270 -5691 5192 2072 -5335 1587 5997 -4707 -6549 7369 7216 -8942 -7254 9857 7010
1440G010j6758L974J4946n160j2292O620Q743q235n056J0024J389j1610J792J2950
$$ 7010 -9748 -5774 9172 4012 -8280 -1660 7083 -1152 -6208 3816 5205 -6405 -4613 8337
1454H337m585j3315O562J2949q004j1617R222R208r901o246J0706K755j1269Q19
$$ 8337 3752 -9563 -3001 9948 1944 -9673 -451 8757 -1144 -7390 3316 6071 -5198 -4379
1468d379J1677m165j1984O967J1691r075j0780J0281R111j0840o658J0771L657
$$ -4379 7298 3133 -8851 -1884 9807 732 -10048 233 9344 -1496 -8154 2617 6274
1481F274j0430m9R908l746r440P401R008j0439q498J2702P822j3743o764J3770
$$ 6274 -4156 -4205 5703 1957 -7483 -82 8926 -1513 -10011 2691 10513 -3230 -9994 3776
1495C776N164j2738k926J0831J58q627L216O219o829m268J0404K579j3490j353
$$ 3776 8940 -3798 -6724 4107 4265 -4362 -1146 5073 -1756 -6024 4380 6959 -6531 -7884
1509g884J5518P00j6552j00J5986m09j4091J254J1080k551p274M482L128o727
$$ -7884 7634 8334 -8218 -8318 7668 7259 -6832 -5578 5502 2951 -4323 159 3287 -3440
1523c440P68R438m162j1893O584J3839p955j4972Q444J4836q161j3266P293J0231
$$ -3440 -2672 6766 2604 -9289 -2705 11134 3179 -11793 -3349 11487 3326 -9940 -2647 7584
1537G584o259o282N567J610n465L371N678p806o558J1499P517j3815q348J4742
$$ 7584 1325 -4957 610 2220 -3245 126 5804 -2002 -8560 2939 10456 -3359 -11707 3035
1551C035Q759j4260q200J2644O605j0156l964P385M30m735L714K538p924j082
$$ 3035 11794 -2466 -10666 1978 8583 -1573 -5537 1848 2278 -2457 1257 3795 -4129 -5211
1565e211J1667K73j4526j54J6115K37j6208l08J4776Q3j2158P28Q659k177m777
$$ -5211 6456 6729 -7797 -7951 8164 8401 -7807 -8115 6661 6744 -5414 -4686 3973 1796 -2981
1580b981M333Q65o707K526R235n076j1416O840J2834p593j3248P611J2391p067
$$ -2981 1352 2217 -4490 -1964 7271 2195 -9221 -2381 10453 2860 -10388 -2777 9614 2547
1594B547j0450O502P335o058l608N876n10n974M303O360p551o928R918P300j1226
$$ 2547 -7903 -1401 5934 -124 -3732 2144 1634 -4340 -37 6323 -1228 -8156 1762 9062 -2164
1609b164p187J1539O530j1025n093R897K944q378j73O804k778n368N813M161q530
$$ -2164 -9351 2188 8718 -2307 -7400 2497 5441 -2937 -3110 3694 916 -4452 1361 5522 -3008
1624c008l047J0394K233j1619j349J1698M12j1119R28R727k514p862M260N687
$$ -3008 -6055 4339 6572 -5047 -6396 5302 5714 -5405 -4477 5250 2736 -5126 -866 4821
1638D821o187l461P950J461r374L13J0277j745j0533L140R890m113q557N095O666
$$ 4821 -1366 -4827 3123 4584 -4790 -4477 5800 4055 -6478 -3338 6552 2439 -6118 -1023 5643
1653E643o093m364P145J936q200N25Q881k540r417M038R455n283q777N946P413
$$ 5643 -450 -4814 2331 4267 -3933 -3408 5473 2933 -6484 -2446 7009 1726 -7051 -1105 6308
1668F308o304n419O477L021o645l07O911k478p068M976P336o945p412Q230P117
$$ 6308 4 -5415 1062 4083 -2562 -2869 4042 1564 -5504 -528 6808 -137 -7549 681 7798
1683G798q734o278Q566M900p863k919O808M61n653K299M567n327l615P831L015
$$ 7798 -936 -7214 1352 6252 -1611 -4530 2278 2739 -2914 -615 3952 -1375 -4990 2841 5856
1698E856r964k591J1222K265j1458j916J0871J195r254j07P080j487m483L498
$$ 5856 -4108 -6699 4523 6788 -4670 -6586 4285 5480 -3774 -3881 3199 1712 -2771 727
1712G27J917n628L54P759k053r594L107J0920l664j1342L669J0729l474r218L305
$$ 727 2644 -2984 -2630 5129 3076 -6518 -3411 7509 3845 -7497 -3828 6901 3427 -5791 -2486
1727b486O665l218l707L570N05m404K797N266n390o393P389P329q444p865Q719
$$ -2486 4179 961 -2746 824 1329 -3075 -278 4988 -402 -6795 594 7923 -521 -8386 333
1742C33P711q107o772P058M952n685k573M494n14l302L603K556o625k156Q923
$$ 333 8044 -63 -6835 223 5175 -510 -3083 1411 897 -2405 1198 3754 -2871 -5027 3896
1757C896K077j0433k222J1060K147j0586j871R291J089p358K34N015j919k631
$$ 3896 5973 -4460 -6682 4378 6525 -4061 -5932 3359 4448 -2910 -2676 2339 420 -2211
1771b211M040N26o089J124P923k246r213K893R813l162r585L194Q502l176o723
$$ -2211 1829 2355 -3734 -2610 5313 3067 -6146 -3253 6560 3398 -6187 -2993 5509 2333 -4390
1786d390L355M322l770j800M371p56n165L067N894m793o486N985O636o539o366
$$ -4390 -1035 3287 -483 -2283 2088 1332 -3833 -766 5128 335 -6151 -166 6470 -69 -6435
1801f435O710N388o316l899N802K040n288K45M778k529m362M675L909o329l540
$$ -6435 275 5663 -653 -4552 1250 3290 -1998 -1753 3025 496 -3866 809 4718 -1611 -5151
1816e151P381L054p820k467P754J386p083j56O215j437n052K985L920m651k783
$$ -5151 2230 5284 -2536 -5003 2751 4137 -2946 -3102 3113 1676 -3376 -391 3529 -1122 -3905
1831c905O114J744p017r15P585J05p422O24O900j547n852K579M486l704k945M849
$$ -3905 2209 3953 -3064 -3979 3606 3711 -3711 -3087 3813 2266 -3586 -1007 3479 -225 -3170 1679
1847A679J430n962n4O717j026p232J860P219k549o648K989N652l485m035L911
$$ 1679 3109 -2853 -2907 3810 2784 -4448 -2588 4631 2082 -4566 -1577 4075 590 -3445 466
1862D66K193m410j66N003j691n562L337N901m456o083N189N837n339n169N197
$$ 466 2659 -1751 -1917 3086 1395 -4167 -830 5071 615 -5468 -279 5558 219 -4950 247
1877B47L860m811k204M240K40l853K003L415m044l196N683L141o873l123P534
$$ 247 4107 -704 -2908 1332 1572 -2281 -278 3137 -907 -4103 1580 4721 -2152 -5275 2259
1892B259K937p416k551O768J787n597o73M191o99k803K571J362m344k78N997m56
$$ 2259 5196 -2220 -4771 1997 3784 -1813 -2486 1705 1006 -1797 774 2136 -2208 -2486 3511 3055
1908C055p266Q54P969j124p926J111P266j202n986J451M149j997k079K846j46
$$ 3055 -4211 -3357 4612 3488 -4438 -3327 3939 2737 -3249 -1798 2351 354 -1725 1121 975
1923I75l727J990M819l498n667M481O200m795o344M776N848m358m717L733L175
$$ 975 -2752 -762 4057 559 -5108 -627 5573 778 -5566 -790 5058 700 -4017 -284 2891
1938B891l248j207K926j081k683L122K695m896k776O070L003o786l064O868K732
$$ 2891 -357 -1564 1362 281 -2402 720 3415 -1481 -4257 1813 4816 -1970 -5034 1834 4566
1953D566o262k218N452J214m199J11K906j645j769L372P53m762k00O063k95o729
$$ 4566 -1696 -3914 1538 2752 -1447 -1336 1570 -75 -1844 1528 2281 -2481 -2681 3382 3087 -3642
1969c642N39O875p68o454R97N453j457m016J964K467k738q26L617p59m374J922
$$ -3642 -3103 3772 3004 -3450 -2453 3000 1543 -2473 -509 1958 -780 -1606 2011 1252 -3122 -1200
1985a200N041k799n351L326N292l600m625L546L826l595k465L540R20l428O25
$$ -1200 3841 1042 -4309 -983 4309 709 -3916 -370 3456 -139 -2604 936 1856 -1572 -947
2000i47L444k059l557L270L521m166l357M565L056m818k360M540J535m217l72
$$ -947 2497 438 -3119 151 3672 -494 -3851 714 3770 -1048 -3408 1132 2667 -1550 -1922
2015a922L733r03l228K260K682l389k220M381J826m992j364N160R06n024k26M476
$$ -1922 1811 908 -2320 -60 2622 -767 -2987 1394 3220 -1772 -3136 2024 2930 -2094 -2320 2156
2031B156m62l799J548K691k516j848L571R60m451k55N022l06n355Q17N189j179
$$ 2156 1694 -2105 -557 2134 -382 -2230 1341 2301 -2150 -2405 2617 2311 -3044 -2227 2962 1783
2047A783m650J571L681j927k492K453J217l047O2L694j277m095K090M570k691
$$ 1783 -2867 -1296 2385 458 -2034 419 1636 -1411 -1349 2345 1068 -3027 -937 3633 942
2062I42m663K993M375l009l786K846K819k681j625K676L1k524J431K486k716k683
$$ 942 -3721 -728 3647 638 -3148 -302 2517 -164 -1789 887 918 -1606 -175 2311 -405 -3088
2078c088L794K884m552k797M715K676m570k240M092J434l291m12K544q84j735
$$ -3088 706 3590 -962 -3759 956 3632 -938 -3178 914 2348 -943 -1355 1189 305 -1430
2093a430K241J046l477n96M519L55n304j59N432J22n286O3M623l04l663P94K353
$$ -1430 811 1857 -1620 -2216 2303 2658 -2646 -2805 2627 2749 -2537 -2474 2149 1845 -1818 -1024 1329
2110A329j466r55K257k91l011J252L824j931m390K277M714k408m540K299M018
$$ 1329 -137 -1092 1165 874 -2137 -885 2939 1008 -3382 -1105 3609 1201 -3339 -1040 2978
2125B978k148l059J953J854j938m95K036r29k278K234K480l226k762L874K866
$$ 2978 830 -2229 -276 1578 -360 -855 1181 252 -2026 208 2688 -538 -3300 574 3440
2140C440m088k777L970K397l556j793L067P82k367M08J853j609j373K788R96l709
$$ 3440 -648 -3425 545 2942 -614 -2407 660 1442 -925 -517 1336 -273 -1646 1142 2138 -1571
2156a571p32M277O00m611m10M461R9l897J89L232p99k257J329J408k172n25K912
$$ -1571 -2303 1974 2574 -2037 -2447 2014 2113 -1784 -1595 1637 838 -1419 -90 1318 -854 -1379 1533
2173A533k87l388P97L835j214l979J518L736j585l264J750K473j863j526K150
$$ 1533 1246 -2142 -1345 2490 1276 -2703 -1185 2551 966 -2298 -548 1925 62 -1464 686
2188F86M17k375N44K613j377k880K029K967k510k788K649K483k741j826K572J082
$$ 686 1103 -1272 -728 1885 508 -2372 -343 2624 114 -2674 -25 2458 -283 -2109 463 1545
2204A545k458j45K321p79k190J772J987k489j889L035J780l368j440L335J130
$$ 1545 -913 -1058 1263 484 -1706 66 2053 -436 -2325 710 2490 -878 -2318 1017 2147
2219B147l185n12K728j80k244R46J721j822j194K477Q85l149n55L534L08l630
$$ 2147 -1038 -1550 1178 998 -1246 -300 1421 -401 -1595 882 1767 -1382 -1937 1597 1905 -1725
2235a725q5L490k52k953N06K388r82j589J540P92k135m4K767o39l100R84L406
$$ -1725 -1810 1680 1428 -1525 -1019 1369 387 -1202 338 1130 -1005 -1049 1718 1079 -2021 -1037 2369
2252B369j291l384J439L086j508k620J550J800j571q72J648j72j800J099K039
$$ 2369 1078 -2306 -867 2219 711 -1909 -359 1441 -130 -1002 646 474 -1326 -227 1812
2267A812j925k187K414K428k755k387K822K088k574j662K308J029j932j79J558
$$ 1812 -113 -2300 114 2542 -213 -2600 222 2310 -264 -1926 382 1411 -521 -700 858
2282H58p50j171J613R63k484q60L073Q36l473p66L443P10l172n64K718J85k117
$$ 858 108 -1063 550 1513 -971 -1831 1242 2078 -1395 -2161 1282 1992 -1180 -1744 974 1159 -958
2299i58M52J292j068n52J706J0k353M28K982q00l198Q84L320r89l012Q52K583
$$ -958 -506 786 -282 -834 872 882 -1471 -1043 1939 1139 -2059 -1175 2145 1156 -1856 -1004 1579
2316A579j001j772J132R08j411J10J561r19j796J542K068k025k233K244K274k228
$$ 1579 578 -1194 -62 846 -565 -455 1106 187 -1609 -67 2001 -24 -2257 -13 2261 33
2332C3k155K144J712j903j033J578L63j383M79J229j307j106J982J112k534j077
$$ 33 -2122 22 1734 -169 -1202 376 739 -644 -165 1064 -243 -1349 633 1745 -789 -1866
2348a866K815R59k810q24K528O16k237k16J838m56j271J054Q26j628m04K091J15
$$ -1866 949 1908 -902 -1726 802 1418 -819 -1035 803 347 -924 130 956 -672 -1076 1015 1130
2365A130k503R2K765l05k636M20K478o40k024Q93J449j214p49J424J54j766M07
$$ 1130 -1373 -1281 1484 1179 -1457 -1037 1441 801 -1223 -330 1119 -95 -844 580 734 -1032 -625
2382f25K015q44k191J124K238j347k151J467J758j413j350J524O22j392j3J480
$$ -625 1390 546 -1645 -521 1717 370 -1781 -314 1444 31 -1319 205 827 -565 -578 902
2398I02o30j498J177J600j619j657J960J526k008j301J935J024j822n11J559p9
$$ 902 272 -1226 -49 1551 -68 -1725 235 1761 -247 -1548 387 1411 -411 -922 637 558
2414E58j331O37J076j244r50J806P89k175o82K355N63k361l94K182J61j768J74
$$ 558 -773 -136 940 -304 -1254 552 1341 -834 -1516 839 1402 -959 -1353 829 990 -778 -604
2431f04J346n99q92J110L69j487j2J892k73k183M56K350n96k301O36K080p41j616
$$ -604 742 143 -749 361 730 -757 -769 1123 850 -1333 -877 1473 877 -1424 -788 1292 551 -1065
2449a065Q13R96q81m02J086j41j443P84J571j134j759J408J844j502j822J557
$$ -1065 -252 744 -137 -539 547 406 -1037 -253 1318 184 -1575 -167 1677 175 -1647 -90
2465i0J552j343j194J124P25r82j22R72o09r17J222Q57j731r05J992R45k158q81
$$ -90 1462 119 -1075 49 774 -208 -330 642 33 -884 338 1195 -536 -1441 551 1496 -662 -1543
2483a543K084P14j794m90J500J43j118L63O69p98l36J354M8j745P2K051j87k139
$$ -1543 541 1255 -539 -1029 471 614 -504 -141 528 -270 -606 748 796 -949 -877 1174 987 -1152
2501a152K05K113k70j902L48J494m87r29N71N06r70K2J307n80j444Q26J650j063
$$ -1152 -947 1166 896 -1006 -658 836 349 -580 -9 497 -473 -451 856 276 -1168 -342 1308 245
2519B45j695J097J674j091j399J018J017q88n86R20P5r24N04Q89r48r85J360R59
$$ 245 -1450 -353 1321 230 -1169 -151 866 -22 -608 312 387 -537 -33 856 -92 -1077 283 1242
2537A242j544r87J638R23j604p64J413M43j200j0R14m13o76Q09M82j198l44J580
$$ 1242 -302 -1289 349 1272 -332 -1096 317 760 -440 -450 464 51 -625 184 666 -532 -876 704
2555G04K26j671k03J763R4j689R1J399k31j108M86P26p32l30R73O0j302J98J511
$$ 704 930 -741 -944 819 913 -776 -685 714 483 -625 -139 587 -145 -475 498 558 -744 -546 965
2574I65m48j573N43J565o06j421O47J137p25p15P42L80q91O0R63m40j014P49J164
$$ 965 517 -1056 -513 1052 446 -975 -328 809 84 -631 111 491 -400 -340 623 183 -831 -82 1082
2593A082r23j199J041J064j043r37J026O64r04m27Q51m2p55M88O86r06o44J170
$$ 1082 159 -1040 1 1065 22 -915 111 775 -129 -556 295 253 -502 -14 672 -234 -878 292
2611B92O58j331o90J456N43j365l43J254J90r88J2P06l19n13P56K77j117m6J282
$$ 292 950 -381 -1071 385 928 -437 -780 474 664 -324 -312 394 75 -438 318 595 -522 -568 714
2630G14j3j454L9J517j34j424J86J151j99r80M09N52m88j82P35j82r21M10J124
$$ 714 701 -753 -714 803 669 -755 -569 582 383 -597 -188 364 -124 -306 429 247 -674 -264 860
2649H60n94j312Q03J244p22j174O98J073o65p70O36K94n84J00O23n40o81Q68P19
$$ 860 266 -1046 -243 1001 279 -895 -197 876 211 -559 77 371 -213 -113 510 -30 -711 157 876
2668H76j079p88J229P79j229p46J112N58r75l05P36R6n91L12M19o50k84R44K10
$$ 876 -203 -991 238 1017 -212 -958 154 712 -263 -568 168 264 -327 -15 404 -246 -530 414 624
2687F24j162j67J357J32j359j22J220P6j030Q4P35k52m14L88K14o86O5Q62l22
$$ 624 -538 -705 652 784 -575 -697 523 599 -431 -347 388 136 -278 110 324 -362 -297 565 243
2706B43j043M76J182m70j222M88J072m77q50M94N76m48k85N12o5n53L31P05o47
$$ 243 -800 -324 858 388 -834 -346 726 249 -601 -107 469 21 -264 248 183 -370 -39 666 19
2725A9q17Q11Q62q94q25R03O61q10n06O84K11m76k4M67k66m37N83L95p88l97R38
$$ 19 -798 13 875 -19 -844 59 720 -90 -596 88 299 -177 -201 266 0 -437 146 541 -247 -644 294
2746B94M17j056k59R41L11r55j40P95l2o18K37M21n20j84O56N1q61MJ078j19j088
$$ 294 711 -345 -604 337 648 -307 -447 348 316 -302 -65 356 -164 -348 308 359 -502 -498 580 461 -627
2767f27J29J000j83q22K16O51k54m18L95J50n52J03P23l17p81M56Q13m60r00N05
$$ -627 -498 502 319 -503 -287 364 110 -308 87 237 -315 -212 511 194 -587 -131 682 222 -678 -173
2787a73Q37n25o60M91M16m18k41M33p7m30L54M91n91n91P50N69q02n31Q30M85
$$ -173 664 139 -521 -30 386 -32 -273 160 83 -347 7 498 -93 -684 66 635 -167 -698 132 617
2807F17p70l46O44K43n47l1L94j74l05M89J92o83j70Q13J08r55r1R23J37q63k2
$$ 617 -153 -499 145 388 -159 -190 204 30 -275 214 406 -277 -447 366 474 -481 -572 351 488 -375 -397
2828c97O85o8m52J55K34l24m3N06j13o28K37Q03l21q16K96Q31k90p70L04N49k78
$$ -397 288 220 -232 -77 157 -167 -210 296 183 -445 -208 595 274 -542 -246 585 295 -475 -171 378 100
2849A00l33L29K4k70O3L91l38m40M64N16n59n75O05O09o65m72N42M22n16j12L00
$$ 100 -233 96 120 -150 -87 304 -34 -474 -10 506 -53 -628 -23 586 -79 -551 -9 413 -103 -215 85
2870H5K1k73K13K63m54k11O51J74p37j37P30K35q05j56N96J39n27LL16j48j69
$$ 85 106 -167 46 309 -145 -356 295 469 -268 -405 325 560 -245 -401 195 334 -193 -190 126 -22 -191
2891a91L26k4m34J23N72j40o60Q9P47j22p08J58N90j18m90K44K62k29q1K99r1
$$ -191 135 111 -323 -200 372 232 -428 -339 408 286 -422 -264 326 208 -282 -38 224 -5 -86 213 122
2912A22m24K46M66l27o43N09N25m17n41M13M33l30k61K31J54k30p3L97k66l16
$$ 122 -302 -56 410 83 -560 -51 474 57 -484 -71 362 32 -229 2 156 -74 -147 250 -16 -332
2932c32M47K40m75l28N76K94n41l08N37J87m31r3L13m0j77K08J15l43r4M73J7
$$ -332 115 355 -120 -448 128 422 -119 -427 110 297 -134 -227 86 46 -131 77 192 -151 -245 228 245
2953B45n47j01O73L2n98k2N44J5m39Q4L19j49k39K91J0l02Q7M68j72o03K68N34
$$ 245 -302 -403 270 302 -296 -318 226 241 -198 -114 205 56 -183 108 118 -184 -97 371 199 -404 -136 398
2975C98k05n76J75N07j51m28K02K18j95q4K44j55j93K18L15l39l68M39L61m17
$$ 398 193 -383 -208 299 148 -280 -78 140 -55 -139 105 -50 -243 -25 290 -49 -417 22 383 -34
2995c4l17L75L37l43k70K73J78k10OJ49j89j54L25J70m90j49N52J72n64j70N21
$$ -34 -351 24 361 18 -252 21 199 -11 -5 144 -45 -199 126 296 -194 -343 209 381 -183 -353 168
3016A68J36m41o5L20l5j96P1J10k43N0L16k5m29O2N25j42m66O0N24o0m49J12K44
$$ 168 304 -137 -202 118 83 -113 -42 68 -175 -125 191 166 -263 -201 324 182 -284 -224 300 240 -209 -97 147
3039A47k7k32J41%j61P7L05k95k85L13L10k68m34L36L85k69k87J87K35j74p7J03
$$ 147 120 -112 29 29 -132 -55 250 -45 -330 -17 293 25 -409 -73 312 43 -244 -57 178 4 -73 30
3061C0%j21J74J62l24j36K82K09l83k14M00K02l45k00L44P6k61MJ47m5j14K15
$$ 30 30 -91 83 245 -79 -215 67 276 -107 -321 79 281 -64 -264 80 156 -105 -101 46 1 -113 102
3083A02P1l46K1L91j1m09m9M50Pl56n0L67p8k07R4N3q9L1J85j23k81J80K91j96
$$ 102 173 -173 -152 239 228 -181 -230 220 227 -129 -179 188 110 -97 -3 50 -39 -8 177 54 -227 -47 244 48
3107D8k89J12L46j93k66J55J92n6j58J30J4j56J57J48j86j85K42K14k81k40L01
$$ 48 -241 -129 217 24 -242 -87 105 49 -109 21 35 -121 36 184 -2 -187 55 269 -12 -252 49
3128D9K52l01j61K13J02j48q8J44n4o6P1J02k64r6L43K2k70l1K87Q6l02j02K39
$$ 49 301 0 -161 52 154 6 -82 62 8 -58 13 115 -149 -245 98 120 -150 -181 106 192 -110 -212 27
3151B7P3j84L7J04o1j9J25L1k91J34K42p9l14M3L31q4k69P2K33j27j20J1Q9o1
$$ 27 100 -84 -47 57 -4 -23 102 133 -158 -24 218 139 -175 -132 199 115 -154 -82 151 24 -96 -85 4 -57
3175e7M3N3n2j85J56K33k07j97J70K31j60k45J29K58j61r9R3Jj4K8N8j79l9K13
$$ -57 -14 39 -13 -198 -42 191 -16 -213 -43 188 28 -217 -88 170 9 -90 3 4 -10 18 76 -103 -142 71
3199G1R7k49j55K84J50k83j06K39O8j59p2J83l2p0P4K4j37K3J90o3k27O2K50j2
$$ 71 168 -81 -236 48 198 -85 -191 48 116 -43 -115 68 36 -34 40 64 -73 -50 140 77 -150 -88 162 150
3223A50l24O6K07k5j40M2OJ2m4J20o2j29J30J47j19k52J36K58j82k11J44J62o
$$ 150 -174 -108 99 74 -66 -24 -18 -6 -50 70 8 -121 9 156 37 -215 -79 179 -3 -214 -70 92 86
3246H6k06R0J04j9m0O9l4j42J96R6k34j34K23J92l16j28J59J85j09j67J26L2p9
$$ 86 -120 -30 74 55 15 84 50 -92 104 200 -34 -168 55 247 -69 -197 -38 147 38 -129 -3 29 -50
3269e0L1Q4j06n5J27Oj31m8J98M6k03j7K02N0k12j3J31k7ML2j2j19Q5Q7m1k05
$$ -50 -19 65 -41 -96 31 37 -94 -142 56 102 -101 -118 84 134 -78 -91 40 13 17 49 37 -82 3 90 49 -156
3295a56M6K85j38j62J6J90L0j90m4J54m0o3N1lm2P3J03j33o5N8J66j37j37R7K02
$$ -156 -110 175 37 -125 -109 81 111 -79 -123 31 -9 -72 -21 -24 -66 7 110 -23 -88 -30 136 -1 -138 -41 161
3320A61j41p9R0L5o8m6L8l5kO5%p4k3J37P6j99o9J64R3j69n5J17P2j55R4j4m1
$$ 161 20 -59 31 66 -2 -48 -10 -45 -47 18 18 -56 -79 58 134 -65 -134 30 123 -46 -101 16 88 -67 27 13 -28
3347b8k6J80q7j34K5J76Nj95J7J33Kk11O3J28k8nn8j3m1Q7L5rj33N6J55n3j83
$$ -28 -54 126 39 -95 -70 106 111 -84 -67 66 68 -143 -80 48 20 15 -43 -56 -97 -10 25 16 -117 -61 94 41 -142
3374a42J22J81j03p9NJ24q3j06O3j5KP2M2j58j9J08J05j81p2K02K5j20o8N3Q3
$$ -142 -20 161 58 -21 -16 108 25 -81 -18 -33 -31 41 83 -75 -94 14 119 -62 -134 68 93 -27 -95 -42 41
3399D1m2k0l5m1O7N6j7n4j2J80qj31l4J29L0j69j2J02K5n0K4j0n9pP7o1n1L8J42
$$ 41 -1 -21 -56 -97 -30 26 9 -45 -57 123 115 -16 -50 79 109 -60 -72 30 55 5 29 19 -40 -47 30 -31 -82 -44 98
3428I8p7j33Q6J12k9j61N0J02l1K1o6P7m3j2K7po9R2K8r4j31J47J14j07o6M9P5
$$ 98 21 -112 -26 86 57 -104 -54 48 17 38 -28 49 6 -6 21 14 -55 37 65 -29 -160 -13 101 -6 -72 -23 52
3455E2q0kL6JRJ8M3j13K1R2j5r0k1J40J4j40L4K6K4q1RK4n1L2Qk7oM8M2k0j29
$$ 52 -28 -30 6 7 16 34 77 -36 -15 77 62 -28 -49 91 105 -35 -1 25 49 -32 -23 1 -50 -18 -10 -37 -43 5 47 27 -102
3486a02P4J15l5j55K1J45k8r5K5j5P4K1l0j7l8N3P1l9j02R2Q5j25p4P2O8m7k7
$$ -102 -28 87 52 -103 -82 63 35 -60 -35 -50 24 45 15 -2 -40 13 84 45 -57 35 120 -5 -79 -7 61 14 -13
3513a3m4P3rrk2j0p9J39N5j78L1J21l7q1J5O1j5j1r6Q5j2M0j1k5j8M1J01r0r9
$$ -13 -57 16 7 -2 -24 -34 -113 26 81 -97 -66 55 18 -63 -48 13 -2 -13 -109 -24 -36 4 -7 -32 -50 -9 92 2 -97
3542i7J36M1%j20K1P8j8k6k5Q3o6Jn5M4n5M9mNp0%J47l7j02L7R8o9%KJL7k7Kk6
$$ -97 39 80 80 -40 -19 59 41 15 -10 73 7 8 -47 -3 -58 -9 -13 -8 -78 -78 69 32 -70 -33 65 -4 -4 -2 -1 36 9 11 -15
3575a5j5L5K6j05N8L2M8m4m7N8M6o3p8N3L3j9j4M5p1J2P1p4KpJ14l1j08N0L2k
$$ -15 -30 5 31 -74 -16 16 64 20 -27 31 77 14 -64 -11 22 3 -11 34 -37 -25 46 -28 -26 -33 81 50 -58 -8 24 22
3605B2n0l1L4M7k4kOm4K6N6q8pJ0J08j25m4R3R6p9o7Q2j2K3J6%r1M1O2j4q2L1
$$ 22 -28 -59 -25 22 -2 -4 2 -42 -16 40 -48 -55 -45 63 -62 -106 -13 83 4 -63 19 7 30 46 46 -45 -4 58 44 -38 -7
3636gP6l3p3kL8J4KKl5lJ4j9l7KN9j3k8o3R2L0j0q7J4J45k3p6lP9j7J3Lo6%J2
$$ -7 69 36 -37 -39 -1 13 15 17 -18 -21 -7 -26 -63 -61 -2 -15 -43 -106 -14 16 6 -81 -67 78 55 -21 -24 55 38 51 54 -12 -12 0
3670@P4n6n2K4R1n2j04O4L7M4q6Pj6N2j0n2q1J13LN0r6k8P1lkn1N4K7Kk2l6Q1
$$ 0 74 18 -34 -10 81 29 -75 -11 26 70 -16 -9 -25 27 17 -35 -116 -3 0 50 -46 -74 -3 -6 -8 -59 -5 22 24 2 -34 47
3702D7m8Rj4J2mK5kn2RM5m8l9K4R5l2p6K1M7J6n4K5jl6P3K0p6m9K1J50j24k0l9
$$ 47 -1 8 -6 6 2 27 25 -27 -18 27 -21 -60 -36 59 27 -49 -28 19 35 -19 6 5 -31 42 62 -14 -63 -42 108 -16 -36 -75
3734g5Q0j3m9R4l9j4j9Jj5nO6J7q0M7K8L5k8p6J15J0p8j0M5Jk4pj7K2n%lo7M7
$$ -75 5 -8 -57 37 -2 -16 -35 -34 -49 -54 12 29 -51 -4 24 59 31 -45 70 80 2 -8 37 38 14 7 -10 12 7 7 4 -63 -16
3767a6O0p9K0K3J8k8l2j8K1N6m5J5K6n2K9M8j03K5P6k8qo8L6O1Mo0PKJ6m7L8K5
$$ -16 44 -35 -15 8 26 -2 -34 -52 -31 25 -20 -5 21 -31 -2 46 -57 -32 44 16 8 -60 -24 37 41 -19 -12 -10 6 -41 -3 22
3799B2Ok7j5J0n6R6K3o2qj9Q4n9l9K6P9m6k0N7p2M5Ql5L4lK4mp5mJ10n5o7l9O9
$$ 22 28 1 -14 -4 -60 36 59 -3 -11 -30 54 -5 -44 -18 61 15 -5 52 -20 25 33 -2 32 29 53 49 -26 -30 80 25 -42 -81 -12
3832a2M2m8l0O5n7L7joK3RLl6j1M9N4o9J9q3O1n2L8PK9n4M8Pp4j4M6L3Rj03M2
$$ -12 30 -18 -48 17 -40 -3 -4 -10 13 22 25 -11 -22 27 81 12 31 -52 9 -43 -5 2 31 -23 25 32 -42 -56 -10 23 32 -71 -29
3865b9P1l2m6Q8p1J4jk2J3MNM0q9J0J03%l6l8N3J1k0k7K5l8K6mn8O0M0oq0j1Q4
$$ -29 42 10 -36 52 -19 -5 -6 -28 -15 -11 -6 34 -55 -45 58 58 22 -16 37 48 28 1 26 -12 14 10 -48 12 52 46 -34 -45 39
3898C9l3k1l8J3P9J7j03N3lJrl4K5L4k0K1j8RRkm5m3P0J13j06JpL6k6J6%j0J6
$$ 39 6 -15 -53 -40 39 56 -47 6 3 4 -5 -39 -14 20 0 21 3 12 21 19 -26 -69 1 114 8 9 2 38 12 28 28 18 34
3931C4pj9m0j4O6k5k9K2NN0n5jK3j1pk3N5J8o2L9k2k0l4L9L4n7M8K4N5p7mL3J
$$ 34 27 8 -32 -46 20 -5 -34 -12 -7 43 -12 -13 10 -1 -8 -31 24 42 -20 19 -3 -23 -57 -18 16 -41 7 31 86 9 5 38 39
3964C9q0lQ7r6Q2j0oK2p1J18o9n0O3j5qo8M0K5l1L5K4J5m9rM6m1K9J9p6OL4J5
$$ 39 -41 -44 43 -53 29 19 13 35 -36 82 13 -37 26 11 3 -65 -25 0 -31 4 28 43 -6 -15 31 -10 19 38 -38 -32 2 17
3996A7J8q0L7J6Pkl4K8pL7l2l7P8pJ7l7j5k5P6m9m7L4J7j0q3P2kK9m0Kj6O5o6
$$ 17 35 -45 -8 8 15 13 -21 7 0 37 5 -32 46 39 56 19 4 -21 55 6 -41 -7 10 0 -83 -11 -13 16 -24 -22 -38 27 -39
4029c9M2Qn8O1l2M3j03N0O3k6K0Rl8N0kk4kj4K3j9m3L3RQ0j03l7O1mo7O6j5M7
$$ -39 3 11 -47 14 -18 25 -78 -28 35 9 29 38 0 50 48 24 22 8 31 12 -31 2 11 91 -12 -49 12 8 -59 7 -8 39
4061C9j5r7Q4l7K8j4j3J3j9L5J4m1jL8Ql4n3R2j4l1m1M7l4O0Kll9QJ1O9n2p3L3
$$ 39 24 -73 11 -26 2 -12 -25 -12 -31 4 18 -23 -24 14 22 -12 -65 27 13 -18 -59 -12 -46 14 16 13 -26 -18 -7 62 10 -63 -30
4094c0P6l2l6N6k5L0k6R1j11K0Q8r1q9N6M5rl4Q2Jp2j6J5J3jk8N9m0PMo1M1%J4
$$ -30 46 14 -22 34 9 39 13 104 -7 13 101 10 -79 -23 22 13 -21 61 62 -10 -26 -11 2 1 -27 32 -8 -1 3 -58 -17 -17 -3
4127cP0p3J6K2J1n5MN3l1Oj2nK9J4K1m8n6lM6pl1k2K8K9m5oL1l4P1n3lQK0J0l
$$ -3 67 -6 10 32 43 -12 -8 45 14 20 8 3 32 46 67 19 -37 -40 6 -1 -32 -54 -26 3 -42 -48 -17 -51 20 -33 -36 -28 -8 2 -1
4162alPkkq2N2O0m0L0Mp1Q5q6Q3j5Pk1N2n3m4Q1Mj07J9O4J0l8k8O7m8jK4k5L3
$$ -1 -4 3 1 -1 -83 -31 29 -11 19 23 -48 37 -49 34 19 26 5 57 4 -40 41 45 -62 -43 21 31 -7 -35 32 -16 -17 7 -18 15
4196A5m8M9L0p4L1L2k3o5lO4Qj2k7j2R4n4j8N9p2Q1m7m8O3%j6l5KK2J4po5P1l2
$$ 15 -33 16 46 -28 3 35 12 -53 -56 8 16 4 -23 -35 59 5 -13 46 -26 55 8 -40 23 23 7 -28 -26 -4 10 3 -62 9 -23
4229b3RkjNL6k0J6k6l4rK3l8O5m3O5n9l2J02o8O1p2O1L0p4l3R2q4J6L3O2q6lJ41
$$ -23 -14 -16 -17 -12 24 4 20 -6 -40 -49 -26 -64 1 -42 23 -36 -68 34 -34 27 -45 16 46 -28 -61 31 -53 -37 -4 58 -28 -31 110
4262A10j14Ol5J39n4k2o5K9M7n6Rm4K6l1J9K5k4ql1Q3o5J2K8J6p7N7K4L0K0o9
$$ 110 -4 2 -33 106 52 30 -35 -6 41 -15 -6 -50 -24 -55 -36 -11 -35 -43 -74 9 -56 -44 -16 0 -77 -20 4 34 54 -15
4292a5M4Ml4M4k7o3J8Q0o9K7k1L1K9n9j3j8P8l7j4kp1J17m1m6J9%PM6l3M6Jm2
$$ -15 29 33 -1 43 16 -47 -29 51 -18 9 -12 19 48 -11 -24 -42 36 -1 -15 -17 -88 29 -12 -58 -39 -39 -32 14 -19 27 28 -14
4324a4J0m9K5J7K3k8k3J8M5k4q0O9J5j8l0N3L6m2j9L9pJJ0q0M2%L4k7K2l2N9k1
$$ -14 -4 -53 -28 -11 12 -16 -39 -21 24 0 -80 -11 4 -14 -44 9 45 3 -16 23 16 17 27 -53 -11 -11 23 -4 18 -14 45 24
4356B4Ok1j9J9j0j8L5k6l2PM4o2L7n7P8j13J04n4Q0m7J7J5L6p9J0j3M1L5K1q0
$$ 24 30 9 -10 9 -1 -19 16 -10 -42 -35 9 -53 -16 -73 5 -108 -4 -58 22 -25 -8 7 43 -36 -26 -39 2 37 58 -22
4386b2N1On4R0q8R1q3L3n1o1J14pj6Mn1Mj3J04l5op1L9Lj2O8l8j1rl7Q4k3K2j4
$$ -22 29 35 -19 71 -17 74 -9 24 -27 -88 26 19 3 7 -44 -40 -53 51 16 10 -61 -22 -19 -31 37 -1 -12 -21 -58 26 3 25 11
4419A1KJ6n5PL4p2R5j3j4Ol1kK0Q4o1m7L1l7K7Ml2nM0l4J1K2j1K4m5M1k4J8l0
$$ 11 13 29 -26 -19 15 -57 38 25 11 17 -14 -16 4 88 27 -20 11 -26 1 5 -27 -32 8 -26 -15 7 -4 20 -25 16 -8 10 -20
4452b0K7K1j9l6M4Ln8Qpk2P1Nj1n2J6J9KkL1j3L7j2l1k1O2k6kk1J8J4Nn4MJ2k5
$$ -20 7 28 9 -27 17 20 -38 -30 -37 -59 12 17 6 -46 -30 -11 -9 -11 20 7 44 32 1 -20 42 16 14 -7 11 25 30 -24 -20 -8 -33
4487c3M6n1M2n8M4m7R2m2k3K0L3l0L8q2L3qn0M6L7nk6P5j3jj4J9Pm1L8n0K0Mq
$$ -33 13 -38 4 -54 -10 -57 35 -7 -30 -10 23 -7 31 -51 -18 -26 -76 -30 7 2 -24 51 38 37 23 42 49 8 46 -4 16 20 12
4520A2j6n8P4k1m2L3k0lQl4M9K7m5K0j7N8m3Oj4qO6j1K3n9M9k1Ll4J6M1n3N9l5
$$ 12 -4 -62 12 -9 -51 -18 -38 -41 -33 -67 -18 9 -36 -16 -33 25 -18 -12 -26 -34 32 21 44 -15 34 13 16 -18 -2 39 -14 45 10
4553A0K6m3K5J5k3K1l1rP8q9O9p2l0j6P9m6pM4J5j7QLl1L5J2m4Pm3L5j4N6j8q5
$$ 10 36 -7 18 33 10 31 0 -9 69 -20 49 -23 -53 -69 10 -36 -43 1 16 -1 7 10 -21 14 26 -18 -11 -54 -19 -33 23 5 -80
4586h0P8Ql2L7lp8J05m9j7lN7j6Nk8l2P2o3J8L1J2j8j1Rk9L5JKlq0O5Jpn9L6L6
$$ -80 -2 6 -26 11 8 -70 35 -14 -31 -34 23 7 12 -16 -48 24 -39 -21 10 22 4 -7 2 -27 8 9 11 8 -72 -7 -6 -13 -72 -36 0
4621@J8q2N2K2L7l6l9K1n0J10p6N7k4K9l5P2q5M7j0k0j0j5%L6l4n1O1k4Q2p6J6
$$ 0 18 -64 -12 10 47 11 -28 -7 -57 53 -23 34 10 39 4 76 -9 38 28 8 -2 -17 -17 19 -15 -66 -5 -29 53 -23 -7
4652gkPL2p3O6l8J6J7p9N5j6M5m5M4m5K1l6K8P4j6m4M8j5o3mL7l8J4P5p7L6Mj7
$$ -7 -9 -2 30 -43 23 -15 1 18 -61 -6 -22 23 -22 22 -23 -2 -38 -10 64 48 4 52 37 -26 -30 7 -31 -17 58 -19 17 21 4
4685DN3n2l2O0m9ORM%j1L2l6Qk9L9lj5nlj0J1j2J0M6n2L4kk5n4J01k3n8L8J3O9
$$ 4 57 5 -27 33 -16 -10 -1 3 3 -8 24 -12 -4 -33 6 3 -12 -17 -20 -30 -19 -31 -21 25 -27 7 5 -20 -74 27 4 -54 -16 -3 66
4720F6p6L9L8k0l0qk9M0K5o4k5L6J5%MNj5lJJj0mk9J2k1L6mL7p3R1q4N3mn5L9
$$ 66 -10 29 67 47 17 9 -20 20 45 -19 -44 -8 7 7 11 16 1 -2 -1 0 -10 -14 -43 -31 -52 -16 -20 17 -56 35 -49 4 0 -55 -16
4755a6K9j9oL9oL6k0m0J1J3NL4m8mJ2k9N0m9mj3K0K0l5nl5N9k5l4M0j2N2n3P0
$$ -16 13 -6 -12 27 21 57 37 -3 8 21 26 60 12 8 20 -9 41 -8 -12 -25 -5 15 -20 -25 -60 -1 -26 -60 -20 -32 20 -33 37
4788C7j08R2o1J4L1p5P5m5j6R5j2Rq7O5NJ4k6J2j1J2J4j02jP2L3k5ml8K2K8J1
$$ 37 -71 21 -40 -26 5 -70 5 -40 -56 39 27 36 -51 14 19 33 7 19 8 20 34 -68 -69 3 36 11 7 -31 -9 19 30
4819C0m7l3R0q6N8rm4N0N5n3m2M1lJ6q7Q2m2L0k0jKP1j09K6J2M5l9j5j8K1O2l3
$$ 30 -17 -50 40 -46 12 3 -41 9 64 11 -31 10 7 23 -64 18 -24 6 -14 -15 -13 58 -51 -25 -13 32 -7 -22 -40 -19 43 10
4851A0k0J1k1QJ5knj4l4RLM8j0J6j4q0L9J7J6j0L9jm5J5jr%O1l0J6k3oK6p6O4
$$ 10 -10 1 -20 -12 3 1 -4 -18 -52 -43 -40 8 -2 14 0 -80 -41 -24 -8 -18 21 20 -25 -10 -11 -20 -20 41 11 27 4 -2 24 -52 12
4886A2k7J2qJL3l0JOl0M4kJ3j09Q6k8kK0j9P7q2JO8m1k6k0L0l5N7n9O5J8o3L2
$$ 12 -15 -3 -11 -10 23 -7 -6 0 -30 14 12 25 -84 2 -26 -28 -8 -27 50 -32 -31 37 -4 -30 -50 -20 -55 2 -57 8 26 -37 -5
4919eK3K8k7J4M0p0j7K5LK7l0MJ0mJ7n6Q2n5JK2p5j3Q0p2N6n1Q5l2k3j1K1lm1
$$ -5 18 46 19 33 73 3 -14 11 14 41 11 15 25 21 38 -18 64 9 10 32 -43 -56 24 -48 8 -43 42 10 -13 -24 -3 -6 -47
4952d7N6j9J5mk5j6J5J4J7kJ4m4L8j5J5p1M0L3k1L9o0lM4K2m2j0LJ1l1KM1J7L
$$ -47 9 -10 5 1 -24 -40 -25 -11 6 4 18 -26 12 -3 12 -59 -19 14 -7 32 -28 -31 13 35 -7 -17 -14 -3 -34 -32 9 26 29
4985B9m7J8j0M4n3j9M6j6J4m8P4pp1P1n3P0j20O8J0l1m1Q2l3N0q1O3kK4l0%j4
$$ 29 -18 0 -10 34 -19 -38 8 -8 6 -42 32 25 -46 25 -28 42 -78 -10 0 -31 -72 10 -23 27 -54 9 7 31 1 1 -13
5016a3jk5O1j8J0m0ON8l0mj2j9lK6k1Q7q8l2K4J1K8n1QJ7N2o5l7J6N8kJ0J5o5
$$ -13 -14 -39 22 4 14 -26 -20 38 8 4 -8 -27 -30 -4 -25 62 -26 -58 -34 -23 5 -46 -38 -21 31 -34 -71 -55 3 1 11 26 -39
5049c9O6qK5o6PK5k4PK3lll4Q2p0jj6L0J6j0l5K5J1%k7rL9p2N1L6j1l1j9N9p2
$$ -39 27 19 44 -22 -15 10 -14 -7 16 13 10 -24 58 -12 -13 -29 1 17 7 -28 -3 8 8 -19 -28 11 -61 -10 26 15 -16 -35 24 -48
5083d8M3M2l9l7j0P0m7OlM9p7N9J6l6N8q7M6j5L8o3MP1Ln8m3O3j5J6PQl3PNk4
$$ -48 -5 37 -2 -39 -49 21 -26 -20 -23 26 -51 8 24 -12 46 -41 5 -10 28 -35 -31 40 43 -15 -58 5 -10 6 13 21 -12 -5 0 -24
5117b4M2q5J8M4m4P7k8l2J7M4l7K8K2o0qJ7K2rm0j1K6O3pk6J8k4k9P3l7%pJ3l8
$$ -24 18 -67 -49 -5 -49 28 0 -32 -15 29 -8 20 42 -18 -26 -9 13 4 -36 -47 -21 42 35 9 27 3 -26 47 10 10 3 16 -22
5150b2J6Mj8j1l0R3n5j8J3LJ0M0n3M3j3l0L0l6Rm2L4O4n0K8l4qJ2L5K5o6P8m1
$$ -22 -6 -2 -20 -31 -61 32 -23 -41 -28 -25 -15 25 -28 15 2 -28 2 -34 -25 -67 -33 31 -19 9 -25 -33 -21 14 39 -27 51 10
5182A0K3l8J7Mom0j6O4m4L6l2N2j0n8l1P2l1J9L9j00O8k5L8RqmL3o4M3r2O5n4
$$ 10 33 -5 12 16 10 -30 -46 18 -26 10 -22 30 20 -38 -69 3 -28 -9 30 -70 -2 -27 11 20 12 8 41 -23 20 -72 -7 -61
5214f1N2m%j6L7k9l5M3NJ2j4J0k8J6j9O3j1QK3o2L1m1k0K5k5N0k7l2K2k0K1J06
$$ -61 -9 -13 -13 -29 8 -21 -56 -13 -8 4 -10 0 -28 -12 -31 32 21 29 52 -10 21 -20 -40 -15 -40 10 -17 -49 -27 -47 -26 80
5246H0j00J2m4mL8kJN1n4Qm2K7J8L3l7o5P0k5L7k1J8K1Jm0M7k4L6oo1L1K3p0M0
$$ 80 -20 -8 -52 -56 -18 -20 -19 32 -22 -14 -56 -29 -11 22 -15 -80 -10 -35 2 -19 -1 20 21 -19 28 4 40 34 -27 4 27 -43 -3
5279cQn2N1p6O0N2k3j9K3j5j5k1K3mj4QKJ3m6N1l0K5J9rk5Rj7P2q9L2MJ9l5K0
$$ -3 5 -47 4 -72 -12 40 17 -2 21 6 -9 -30 -7 -11 -25 -17 -15 -2 -48 3 -27 -2 17 8 -17 -8 -25 47 -42 -10 -6 13 -22 -2
5313bMm3L9M5n1j4o2R2K4k3ok5J5LrJ8n0k1N8M4n8lQJ1rk6M2l5J4N7n3k0LM2p1
$$ -2 2 -41 -2 43 -8 -22 -84 8 32 9 3 -22 -7 -4 -13 5 -45 -66 -8 36 -22 -25 -17 -6 -15 -41 1 -34 -20 37 -16 -36 -33 9 -62
5348f2L3K8jnJ2K9p0P2j9k3K0J9o4M5jK8o8O1j24M9N3k5L8n2J5J0J1n6NNL3j4
$$ -62 -29 -1 -2 -7 5 34 -36 36 17 -6 14 33 -31 14 13 41 -27 34 -90 -41 12 -13 25 -27 -12 -2 9 -47 -42 -37 -4 -18
5380a8QL5m5j9N9rnkkOK1l8o%M5J1k8qj7K0K7m0kqkJ6o0P2j7mk2jl1N6j8QjK4
$$ -18 -10 25 -20 -39 20 11 6 4 2 8 29 -9 -15 -15 30 41 13 5 -12 8 35 -5 -7 -15 -17 -1 -61 11 -6 -10 -32 -33 -64 -8 -26 -18 -19 5
5418EPl0L2nj8J2QjL9o5K1mK3oOJ1j4Oj2k5N1rk3L1m4j6N7qJ3o2N2p4P8l3o5N3
$$ 5 12 -18 14 9 -9 3 11 10 49 -16 5 1 24 18 24 35 21 27 15 -10 41 32 9 40 -4 -20 37 29 42 -20 32 -42 36 3 -62 -9
5454ipol4P0o5J17n9l9K2J8J5o7J0l2O0km0O6m8L6J0k6J2k4L9n0N6l0j2K2RJ8
$$ -9 -16 -22 -56 14 -51 66 7 -32 -10 8 23 -44 -34 -66 -6 -8 -48 18 -30 6 16 -10 2 -22 17 -33 23 -7 -19 3 12 30
5486C0n5N9q6Q7n9L8k1O2k6m2j8N3o6K1K1k5R0j15L8rJN1l9J0%J8k8K5k3k1M5
$$ 30 -25 34 -52 35 -24 14 -7 55 29 -13 -31 22 -44 -23 -2 -27 63 -52 -14 -23 -22 29 -10 0 0 18 -10 15 -8 -29 16
5517A6j9K0J8j2K6k0Nm8J5JK6q0K7R5m8j7j0Rj4m7N1pnrMM4p1K3J3qj8P9p0O5
$$ 16 -3 17 35 23 49 29 34 -14 1 2 28 -52 -25 70 22 5 -5 4 -10 -57 -6 -13 -18 -27 -23 21 -50 -27 -14 -22 -40 39 -31 34
5551C4p7R3j0m3j6K1KJ3K8j7Ln5M5jn4J7R2k2o7lO4m9jk9K6j4j5J6L1k0KrL4m5
$$ 34 -43 50 40 -3 -19 2 4 17 45 28 31 -24 21 20 -34 -17 75 53 -14 -17 47 -2 -3 -32 -6 -20 -35 -19 12 -8 -6 -15 19 -26
5585b6k4Q4k7l9k4L6K2j9pK9k8J6kj4L4j9oJ5jl3N0j8M1nl8PL6o0loP2k8Rk3L6
$$ -26 -50 34 7 -32 -56 -20 2 -17 -24 5 -23 -7 -9 -23 11 -8 -14 1 0 -33 17 -1 40 35 -3 4 40 -20 -23 -29 43 15 24 1 37
5620C7q2J05p3oN1l4l3j0l0N7K5n2L8J0n5N0Oqj6k1K5j3L4j6k4N4l6L2jk1j6M2
$$ 37 -45 60 -13 -19 32 -2 -35 -45 -75 -18 7 -45 -7 3 -52 -2 4 -4 -20 -41 -16 -29 5 -11 -35 19 -17 15 14 -7 -23 19
5652A9pj5P9r3M8m1r%O5o8P3m5k1L6p2M2qn1N3m6M3L5k7J8M2n7Mrnk9L7pK6J8
$$ 19 12 -3 76 -17 31 -10 -19 -19 46 -22 51 6 -15 21 -51 -9 -17 -68 -15 -61 -18 17 -10 8 50 -7 -3 -12 -17 -46 -9 -16 10 28
5686B8n1K3j0L4n5L7j0J4J7m4J8rl7Q2n6jLrL5K6j6J6j3J4k1n2K7l2L5L4J6m6
$$ 28 -23 0 -10 24 -31 6 -4 10 27 -17 1 -8 -45 37 -19 -20 -17 -26 9 35 19 35 22 36 15 -37 -10 -42 -7 27 43 -3
5718cKnl8K2N0k9mK1m6N4k5L0o9M9J1O2j23O0m3J11p9Pj9j7QOM5o2L0j1J6j7l7
$$ -3 -1 -6 -44 -22 28 -1 -5 16 -30 24 -1 29 -40 9 20 82 -41 19 -24 87 8 15 -4 -21 -13 -7 38 -24 6 -5 11 -6 -43
5751d3K4j0qM4j3QmM8q6J0M5rn0oN3KM7l6k1O5q2JMO8n9J6Mjn1N9j4m0Q0o0j7
$$ -43 -19 -29 -37 7 -6 2 -2 46 -40 -30 15 6 -44 -50 3 5 52 16 -5 60 -22 -21 -17 51 -8 8 12 11 -40 19 5 -35 45 -15 -32
5786c2K0Mj0J6j6R%o1J8M2J7m3O1q8N3j4J0K2n3M3K7m2K4l4L0K9j9Km3K7K4j0
$$ -32 -12 -8 -18 -2 -18 -9 -9 -70 -52 -10 7 -36 25 -63 -10 -24 -14 8 -45 -2 25 -17 7 -27 3 32 13 15 -28 -1 23 13
5818A3OLk2J8j3o4N0k0M0l4rMJ1J1K8j8J4k9J6o1M0K2o7L8j1O6k2mm9K3K1n3O9
$$ 13 19 22 0 18 5 -59 -9 -29 11 -23 -32 -28 -17 -6 22 4 18 -11 5 -56 -16 6 -61 -23 -34 32 10 6 -43 -20 1 -52 17
5851A7k5J7L0q3L7M2j1nOK1pk1j0pM4m6Mkk8L6l2nJ3k5L8j7k2J5K9j0Jj7N4lq3
$$ 17 -8 9 39 -44 -7 35 24 19 25 46 39 18 8 1 45 -1 3 1 -27 9 -23 -28 -15 -40 -2 -19 -41 -26 3 -7 -6 -23 31 28 -55
5886e5LL6ONKN3Qq3N5M6o4j0ppmLjjk2K3L1l5J1kn5J1Q3k8o3%O0j3K3k3q7N3M8
$$ -55 -52 -16 -10 -5 -3 50 58 -25 30 76 12 2 -5 -12 -16 -13 -14 -15 -37 -14 17 -18 -7 -9 -64 -53 30 2 -61 -61 -1 -14 9 -14 -101 -48 0
5923@M2k9L9p6P9m2l6PJ8J0k1L9j0j8M5mo1KmN0n5J7M9n7K7qm7N9m1kJ8M7o2O
$$ 0 42 13 52 -24 55 13 -23 -16 2 12 -9 30 20 2 47 43 -18 -16 -20 30 -25 -8 41 -16 11 3 -44 15 -26 -28 -10 37 -25 -19
5957a9j4K0pJ0J6m5rN3j3K2Ql1J4m0L3Pl8OJ9j8L1m0j6N2J4m9J03n2Ml4J7J5k5
$$ -19 -33 -13 -20 -10 6 -39 -48 5 -8 14 22 -9 5 -35 -2 5 -33 -27 -8 -26 5 -35 -51 1 15 -34 69 17 21 -13 4 19 -6
5990fPQ9p2lk6k3MO1qmm8l6M2OJ1j8j9nO2n5j3Q1l0N3on6L3L1mol3k6LK2k3J4
$$ -6 1 90 18 15 -11 -34 -30 31 23 19 -29 -65 -23 -17 -6 -24 -43 -48 14 -41 -54 27 -3 50 44 -12 21 52 48 42 9 -17 -14 8 -15 -1
6026aM5p0N4j2qM5m8J7j9Jj1Qj6lK7n9L5k1N8n7Rj2K6j6K4L8o2K4J3k7k4MJ6j8
$$ -1 44 -26 28 16 8 53 5 22 3 4 -7 1 -15 -18 9 -50 -15 -36 22 -35 -26 -38 -12 -28 -4 34 -28 -4 9 -18 -42 -38 -22 -40
6060d0N8pQm9M4l2L7n8R5o4j5J0L8m1p4R8K0k2k4P4q6rL1j8J3j4mM5J2m1k4L6
$$ -40 18 11 19 -30 14 -18 19 -39 56 -8 -23 -13 25 -16 -90 8 28 6 -18 56 -30 -39 -8 -26 -13 -27 -31 14 26 -15 -39 -3
6092cj8J0L8l7k5J4jJ3j3j5J0K7k1n7L6j3j6O5LpRJ2On2P6n0O8p7L2j6K5k5m5
$$ -3 -21 -11 27 -10 -35 -21 -22 -9 -22 -37 -27 0 -21 -78 -42 -55 -71 -6 -3 -10 -1 11 17 -35 41 -9 59 -18 14 -2 23 -2 -47
6125d7RM0k0rJ4l9O7o0j1M7M3p9M9knlM9j3l3J5M7r2J8K4K2J2k1k3Mk5L3J4j7
$$ -47 -38 2 -18 -27 -13 -52 15 -45 -56 -9 34 -45 4 2 -3 -6 43 30 -3 12 59 -33 -15 9 31 43 22 -1 3 -22 11 25 8
6158Hkl9Q8l6Qn5M9j4K9k7po0J2M7NL7j29R6l1MRjL0n2L9J3o6P7j4J7j3J4np0
$$ 8 6 -33 55 19 27 -28 21 7 36 9 2 -58 -46 1 6 43 -86 10 -21 -17 -8 -9 21 -31 8 21 -45 32 18 35 22 36 31 -39
6192c9K9j8Q8p1J3L6L2o9K6p8K6j1j9J0L1L2K8k7j8k9J0J3J8k7Ol1M0M3o3L9P
$$ -39 -10 -28 60 -11 2 38 70 1 27 -51 -25 -36 -55 -45 -14 18 46 19 1 -28 -18 -5 13 -14 -8 -39 1 44 -19 20 27
6223B7m2PL0l0k0N2j6pK1N9j01k7Q1k1l4M8m8J8oM7l1j9J1M4n3l6M4j6N9j02K9
$$ 27 -15 -8 22 -8 -28 24 8 1 22 81 -20 -47 34 13 -21 27 -21 -3 -9 38 7 -12 -1 43 -10 -46 -2 -18 41 -61 -32
6254c2L3nPmjm2M3mK8p0N1j0kl3Q2k3Pk5K6k8pl1N3J1p3N5j1J0Rpl6JNN1J1m9
$$ -32 1 -4 3 -1 -2 -44 -1 -5 23 -47 4 -6 -8 -41 41 18 25 0 26 -2 -9 -40 13 24 -49 6 -5 5 14 7 -29 -28 -23 28 39 -10
6290a0N7o8K2oMql8K1K0kN9k9J9j4m4kK2q4O6Q3o5Ko0Q9l6N3l5p3N4L6k5j6J2
$$ -10 47 -21 1 -5 -1 -9 -47 -26 -6 -8 51 22 41 27 -17 -19 3 -81 -15 68 3 5 -55 34 -2 51 16 -57 -3 33 8 -8 4
6323DJ1K5k1L4l9qJ8nj9k0M6p8M0LJ1kJ0Ol1k2J9K4j3nK0om2L3K1j5Qjj9L5LP
$$ 4 15 40 19 53 14 6 24 19 0 -20 26 -52 -12 -9 2 0 10 16 -15 -37 -18 6 -7 -12 8 2 -40 -7 14 -1 7 6 -13 22 25 32
6359C2j6Mj5j2L8N0p5K0k1k5j1P0n8M1m9k2J3nnM3l8N5j8k5K2j4J2l8O0k3R9r5
$$ 32 16 20 5 -7 31 81 6 26 5 -20 -31 39 -19 22 -27 -49 -36 -41 -46 -3 -41 14 -4 -29 -7 -21 -9 -47 13 -10 89 -6
6391fqJ1NNQN6J9n1m8j1M6m3K1K4n5L0K5j6m1J9M3l4o3R0n9j9N3J5o8k3M1L3R
$$ -6 -14 -3 2 7 15 71 90 39 -9 -20 26 -17 4 28 -27 3 28 12 -29 -10 33 -1 -64 26 -33 -52 1 16 -52 -75 -34 -1 8
6424HLpRl2mK7j4JoM3J4l2j7M2m0k4P2j5mo6P2ol1Qm4J9pL4ql6J3M0K2m4k1K0
$$ 8 11 4 13 -19 -23 4 -10 -9 -15 28 42 10 -7 35 -5 -29 43 28 24 -42 30 24 -7 1 -43 -24 -31 3 -5 -41 -28 12 34 -10 -31 -11
6460a1j1NM7m2L9Rj11P8k8k1J8J5NOm0J7L3nK6k4PJ2J3J3l0k5K6k7M7pk4QK1j1
$$ -11 -22 -17 30 -12 27 36 -75 3 -25 -46 -28 -13 -8 -2 -42 -25 8 3 29 5 12 24 37 50 20 -5 21 -6 41 34 10 18 39 28
6494B8j2l5K8M0p3M8p6N8J3l4pOk0L7o1LN1k5P1n2l8M1k5N7Pq1J00q7K3L0o2K4
$$ 28 16 -19 9 49 -24 24 -52 6 19 -15 -22 -16 -36 1 -60 -57 -6 -31 40 -12 -50 -9 -34 23 30 -51 49 -38 -15 15 -47 -23
6526b3O3j8n0R1r2M4k8pL9k4mk0N6o4N1l1mj2L1K5k3Mj9j2K1j3J5j1NQn4L4j3
$$ -23 40 22 -28 63 -29 15 -13 -20 19 -5 -9 -29 27 -37 14 -17 -21 -33 -2 23 0 4 -15 -27 -6 -19 -4 -15 -10 -2 -56 -22 -35
6559c5J2j6LJ07l8k7Po0K9J7Lk1K6L6k7L9m2pk4N4lj6j2k5R6p1k8J6N0l5j2k7
$$ -35 -23 -39 -36 71 33 6 13 -47 -18 -1 2 -19 7 43 16 55 13 6 -18 36 33 17 5 -20 76 5 -23 -7 43 8 -4 -31
6591c1M8o1L8l3K2L3j7jpqM5m5L5o2O2Qp9O0K5m9M1k9k2N1m4jO1m8P0k1n0QpJ4
$$ -31 17 -44 -6 -39 -17 16 -1 -2 -9 -17 28 -17 18 -44 18 26 -53 7 32 -17 24 -5 -27 24 -20 -21 40 -8 62 41 -9 -1 -8 6
6625Fk0N7j10O7K3k9K7n0J5m0O8j0k8JL5l6L2LOj4pL8j6jo0J03r8O3k4PRk1Lj5
$$ 6 -14 43 -67 0 23 -6 21 -29 -14 -54 14 4 -24 -23 12 -24 8 11 17 3 -4 34 18 17 -43 60 -38 25 1 8 17 -4 -1 -16
6659a6NJK2L3k8n8J2L7j7JL9p3K4N6o5J7J2K1k1l4k6J4N7m3M8l2l7K1J7mK6Oj6
$$ -16 -11 -10 12 45 17 -41 -29 8 -9 -8 31 -42 -18 38 -27 -10 2 23 2 -32 -58 -44 13 -30 18 -14 -51 -30 -13 -17 9 15 -1
6692aJK9m2LNM8j0o2%K7l0M2j2L6l2k3j1ORj3L6j0j04P5K7l3P6k8l5J4j3l6O2
$$ -1 0 29 -13 -10 -5 43 33 -29 -29 -2 -32 10 -2 34 2 -21 -32 -26 -17 -30 6 -4 -108 -33 -6 -39 37 9 -26 -12 -25 -61 1
6725An1M9L0n5KJ2N2o4M3j5J3m0k4L8K5%oJl6k2L6k6J5QojkK6KK9n4%K2K0n5L1
$$ 1 -50 -1 29 -26 -24 -12 40 -24 19 4 17 -23 -47 -9 16 16 10 11 -25 -47 -11 -37 -22 -14 -20 -21 -23 3 5 34 -20 -20 2 22 -33 -2
6761bm1K4M4l3k9O2l4k0J8PN2n8nJ8rJ9N4k8j4K0j9M6m1Rl3k4J1m2Q3k4p3J18
$$ -2 -43 -19 25 -8 -37 25 -9 -29 -11 -4 48 -10 -15 3 -6 13 67 39 25 45 26 72 31 40 7 -17 -6 -48 35 11 -62 56
6793E6l6o3MmK9j4k2j7Q0m3J6k4O0k2m7N4k1M2m3k5P8K7m2m0L0l1J9Lj7l0M5j2
$$ 56 20 -43 -39 -43 -14 -28 -50 -67 13 -30 -14 -38 22 0 -47 7 -14 28 -15 -40 38 65 23 -17 13 -18 1 4 -13 -43 2 -10
6825a0K5K8p2J3j5pM3J4m4L0p4P6k1jL5p5J6P2mm0J7j1l8L6ON2k5q5O9L0p0O0
$$ -10 15 43 -29 -16 -31 -38 5 19 -25 5 -69 7 -14 -15 20 -55 -39 33 29 -11 6 -5 -43 -7 -1 51 26 -59 10 40 -30 30
6857C0n6J5L8N9n3k5Nj0J6l0k0j4R1J0m0n2M4L9n5j3m0O3lJ3o6K4mOn2Q4j5J1
$$ 30 -26 -11 27 86 33 8 13 3 19 -11 -31 -45 46 56 16 -36 8 47 -8 -21 -61 2 -1 12 -54 -30 -34 -28 -80 4 -11 0
6889@mqk8OK8k0J1j6J4%L3m3O1qj6j0K8o2NQM9Jm0M1J9m2Kn8J4O8o5P6n7J2%J3
$$ 0 -4 -12 -40 -34 -6 -26 -15 -31 -17 -17 16 -27 34 26 10 0 28 -34 -29 -21 28 29 -11 30 49 7 9 -49 -35 33 -32 44 -13 -1 -1 12
6925A2j8Rj5P3k2m4K6k6L3n5K2l4O7j8l3L1M3l9Ll5K3L1n9K6O2j04N2rJ0k3K7
$$ 12 -6 3 -12 61 39 -5 21 -5 28 -27 -5 -39 28 10 -23 8 51 12 15 -20 3 34 -25 1 63 -41 11 2 12 -11 16
6956A6o5M1L3j7l6oM1l0lO1M9q1n7N1m5J1j3R0k6k5m5N7j6n7J01Kj01M3J1J1P
$$ 16 -49 -8 25 8 -28 -34 7 -23 -26 35 84 3 -54 -3 -48 -37 -50 40 14 -11 -56 1 -15 -72 29 31 -70 -27 -16 -5 2
6987BN8o8K9J7m7qP2o8LRpJL0k6J5j2M3o0rK9k8j0J7m1L6Rj9O3j8m0M8k2l7L2
$$ 2 60 -8 21 38 -9 -17 55 -13 -10 -1 -8 -7 23 -3 12 0 43 -17 -26 3 -25 -35 -18 -59 -23 -14 -33 30 12 -28 20 -2 -39 -7
7021grK3l2L5n3J8lM6m3L7k2L3j9J6m5L8l1j4NQN1j9j4oLn6O5K3j5K1o5K7M3j3
$$ -7 -16 7 -25 10 -43 -25 -28 18 -25 12 -10 23 4 20 -25 13 -18 -32 -27 -19 32 13 -1 -7 -4 -60 5 28 13 34 -31 -4 39 26
7055B6kk2k0J0Ln8jL3j5L5M4m6NO2j00O0k3OM8j3o5M5Lo%rj5M5j9j8NQl8l4J0
$$ 26 24 2 -18 -8 -5 -63 -64 -31 -46 -11 33 -13 -8 54 -46 14 -9 -3 45 32 -33 12 15 9 9 0 -15 30 11 -7 -2 6 -32 -66 -56
7090e6K6M2L3j05M8n7M0LmK0ml0J4N9n7L0L2l9j7JM2qjrO2n9K2kk2P7n2l2L3j7
$$ -56 -30 12 45 -60 -12 -69 -29 -26 -30 -10 -14 -44 -30 29 -28 2 34 -5 -22 -21 21 13 12 3 65 6 28 26 4 81 29 -3 30 13
7124A3J9l3kJ2k7lK7j4J1%J6n9M0Pj3Lm2N4l0J0M0jo4L2kj5oJ9NOk4l7N7M7p6
$$ 13 32 -1 -3 9 -18 -21 6 -8 3 3 19 -40 0 7 -6 -3 -45 9 -21 -11 29 28 -36 -4 -6 -21 -27 -8 -3 3 -21 -58 -1 46 -30
7159c0LQ6j9q9P4K1p3K0j5K1ll0j9K2jK0j5ORLK6k4k7N4Mj8PmN3q7L2M4k2j02
$$ -30 -27 59 40 -49 25 46 -27 -7 -22 -1 -4 -34 -53 -31 -32 -12 -27 -21 -12 -9 17 -7 -34 20 24 6 13 9 62 -25 7 51 29 -73
7193g3M8j4KK8jO2mq7O3k0rL4k9L9K3n8J6p3P8m5j9N2o4N7j5M6m1l9j5K6Qk6L3
$$ -73 -25 -39 -37 -9 -10 52 48 -39 24 4 -5 29 0 39 62 4 20 -53 25 -20 -39 13 -51 6 -9 37 -4 -43 -58 -32 -24 -50 -17
7226a7J5%j5k1QLQ4m4jk0pJ1%L0o8L8KN8k5k4l4K2O8r3N7j9J7p4O6rj9J2p0K7
$$ -17 -2 -2 -17 -38 -30 -27 57 13 12 -8 -15 -4 -4 26 -42 -4 -2 56 31 7 -27 -5 63 -30 27 8 25 -49 17 8 -11 1 -69 -42
7260d2rN2O6p1o2R6o4j6O2l0O5p7J5K6kr2L0N9m0O5m9J4K1J7l3%o1M7N0k5j8L9
$$ -42 -51 1 67 -4 -66 30 -34 -50 12 -18 47 -30 -15 11 9 -83 -53 6 -34 31 -18 -4 17 34 1 1 -60 -13 37 12 -6 33
7292C3l5m2KN3j2lK7oK3q0L3J0j1j4J8kLJm6J15m7l2J4m5kL6JJ9j0l1K9N3n2J3
$$ 33 -2 -44 -42 11 -1 -4 23 17 40 -40 -7 3 -8 -22 -4 -6 -3 -2 -48 67 20 -12 2 -43 -45 -9 -8 11 1 -30 -1 52 0 13
7326A3k9O0n5l6L9j8M3k5J7n5N7rJ4J4lr4N6J8ok7oJ5j3j5K9K8rJ9q3P6m7M5j2
$$ 13 -16 44 -11 -47 -8 -26 17 -8 9 -46 11 2 16 30 27 -67 -11 7 1 -26 -32 -17 -30 -45 -16 12 3 22 -61 15 -32 13 1
7359Am2R1q0%N3o1j7O0j8N0j8mK9m6L8k3m2N0l7m3N8j5J6J6rRLq3L7j8O5j3m8
$$ 1 -41 50 -30 -30 23 -38 -55 5 -13 37 19 15 44 -2 36 13 -29 21 -16 -59 -1 -16 0 16 7 16 19 -64 -27 -45 20 7 -41
7392d1OK2J2m0K8j2M8k8kJ6L8m5o1J0P4J8n4k3O2m6K3M8k2mj2j%J3n4K8k3lK1
$$ -41 -35 -13 -1 -41 -13 -25 23 -5 -7 9 47 2 -59 -49 25 43 -11 -34 28 -18 5 53 31 27 15 14 14 27 -27 1 -22 -25 -4
7425dj0m1L2Rnl4kO7nJ8o0M0J5n9L4K3RO%kl1lkJ3Pn0L8J4j1l6j8P2J0p1R8n4
$$ -4 -14 -55 -23 -14 -19 -53 -55 12 7 25 -35 5 20 -39 -5 18 27 33 33 31 0 -3 -5 8 15 -35 3 17 6 -30 -48 24 34 -37 61 7
7461Gj3k9O0nm7j2K8m0L0m3M3j7K0%%m0Q8m9qK6%n5J0N2j5J2L8j03Q1j9Mk1L1
$$ 7 -6 -35 25 20 -27 -39 -11 -51 -21 -64 -21 -38 -18 -18 -18 -58 30 -19 -27 -1 -1 -56 -46 6 -9 3 41 -62 19 0 4 -17 14
7494A4k5L3RMOlj3p1O7k1K6j8m2L8Po7L3J5J0j5LK9km8K9L8r4O7o8K7k2NO5m4
$$ 14 -11 22 31 35 41 38 25 -46 21 0 26 8 -34 4 11 -56 -23 -8 2 -13 -10 19 17 -31 -2 36 -58 9 -59 -32 -54 -49 16 -28
7528b8L2J0rM4o2M8p5Q7n7LLK2l6M8m9L3pj4rL1Nm9K7j9J3M2o4J7J5j2k7nN5J2
$$ -28 4 14 5 49 -13 35 -40 47 -10 -7 -4 18 -18 30 -19 14 7 -7 -16 15 20 -29 -2 -21 -8 34 -30 -13 2 -10 -37 -42 13 25
7562B5j6j5l3K3J8%K3o3L6K7l4k3K8oK6j7k5Q1n2N6n3o5J06K2m6j7OK1j2mj8q
$$ 25 9 -6 -39 -16 2 2 25 -38 -2 25 -9 -32 -4 -10 16 -1 -26 55 3 59 6 -59 47 69 23 6 12 33 21 17 -1 -9
7594im4O4jRl7J0k5K9K0l3J6Ln0j1K1j7O7l1O9Nj6p2O2m1p3J06m9L1%L2m7QK1
$$ -9 -53 11 10 19 -18 -8 -33 -4 16 -17 -1 2 -48 -59 -38 -55 12 -19 50 55 39 -33 29 -12 -85 21 -28 3 3 35 -12 -4 17
7627A7Rk8pl2J09n7j8j3J0m8R8q6%k5M8Kk3M8q7P1j2k9N5n0L3l9J15q0k8J35q0
$$ 17 26 -2 -9 -41 68 11 -7 -20 -10 -58 40 -46 -46 -71 -23 -21 -44 4 -83 -12 -24 -53 2 -48 -15 -54 61 -19 -47 88 8
7658HL1m4K7k0l6M6K5Pl4k8LK8l0L5pl6K3mL0n3K1rN7j11O6l6L2K3j8m6O2j8m
$$ 8 39 -5 22 2 -34 12 37 44 10 -18 -15 13 -17 18 11 -25 -2 -6 24 -29 -8 -17 40 -71 -5 -41 -9 14 -4 -50 12 -6 -10
7691a0j1j1K4j7K6ML1p1O4J5qm2l9O1pM4n6K2Lk4k4O7ol4Ml8KJ4M9p4K7RJ6K6
$$ -10 -21 -32 -8 -25 1 5 36 -35 29 44 36 -6 -45 16 9 53 -3 19 22 -2 -26 41 35 1 5 -33 -31 -17 32 -42 -15 -6 10 36
7725C6r6K8j1L4l8L8K0k9K8l0O1m8J9qrjk8j1Q9Ro6j0N4m4j6L6J4k0J6m4lN3m9
$$ 36 -60 -32 -43 -9 -47 -9 11 -18 10 -20 41 -7 12 4 -5 -6 -34 -45 44 53 -13 -23 31 -13 -29 7 21 1 17 -27 -30 23 -26
7758b6JN2n7LJ2m3L2KPJ8l0pJ7P0m5pj1MolN8n5K4k4M0Jk2J8l8k1J0M9m7J2J8
$$ -26 -25 27 -30 -27 -15 -58 -26 -24 -17 1 -29 -36 -19 51 6 -1 -12 -8 -14 -17 41 -14 10 -14 26 27 5 23 -15 -36 -26 23 -24 -12 6
7793FkK9k9np8J8O4%pk4K4k6J3%K7k8no0N9k7L3jQn5M3L7j6J0j0k4L3rMJ3l6M2
$$ 6 4 33 4 -1 -79 -61 3 3 -4 -28 -4 -30 -17 -17 10 -18 -23 -83 -24 -51 -18 -19 -11 -66 -23 14 -2 8 -2 -26 7 -2 2 15 -21 21
7829B1J2J8n6J2l6P3k2K9m9o4N5ml7J4J0m4P8k8M9o8k9M2QRk3k1J1L8j7pk3K1
$$ 21 33 51 -5 7 -29 44 22 51 2 -62 -7 -11 -48 -34 -24 -68 10 -18 31 -37 -66 -24 -16 -7 -30 -51 -40 -2 -19 -26 -49 -28
7861b8O2k1Mk6k9J1P8n3o8Q1mjK3Nk4pRro9Q4Mp6N4jn4N4N4p7K7j1OQq1M4jJ5
$$ -28 34 13 17 -9 -38 -27 51 -2 -70 11 7 6 29 34 10 3 12 3 -66 18 22 -54 0 -1 -55 -1 53 -24 3 -8 -2 6 -75 -31 -32 -17
7897a7K2l8PjL0j6k8R3n1m4L2QQmj1N0p1MP2l2pJ9K9r6L5l1N9n7O0k2P5j26P6
$$ -17 5 -33 -26 -27 3 -13 -41 52 1 -43 -11 -3 5 1 -10 40 -31 -27 45 13 6 25 54 -42 -7 -38 21 -36 24 2 77 -49 27
7930B7j9k4k2O6j2l9MJ2lnk6O0n2K3J5m5n6Q4O6n3K4k8J4j4K2j9J5k6J6M2m5J9
$$ 27 8 -16 -38 28 16 -23 -19 -7 -10 -15 -41 19 -33 -10 5 -40 -96 -12 54 1 25 -3 11 -3 19 0 15 -11 5 47 2 21
7962B1j7J6L1j08K1N2K5l1k2N0k2qL2o6J5l3L0l6l0Q0K2l4l1N9o3j5L4M2J9pk8
$$ 21 4 20 51 -57 -36 16 41 10 -12 38 16 8 40 -26 -11 -44 -14 -50 -80 0 22 -12 -43 16 -47 -62 -28 14 33 26 -2
7993bk8O1lj7j0K0ok2l2O0kok5L8n8P3n2K9p6M6K5J1Rn0L0m2M1rk3Mj4M9k1Jk9
$$ -2 -30 31 28 11 1 21 15 -7 -39 21 19 13 -12 26 -32 41 -11 18 -58 -12 13 24 33 -17 13 -29 12 3 -20 -16 -30 19 -2 -1 -30
8028c0OK7jl8N1K4l1L7n1J9o7Q8q8P4j0p1K6oL7o0J7P4rl6n4Q1k5M0k2mk8J7j2
$$ -30 -24 3 2 -36 15 39 8 45 -6 13 -54 34 -54 20 10 -61 -35 -41 -4 -64 -47 27 18 -18 -72 9 -16 24 2 -2 -30 -13 -25
8061b5j4N1l8j7L1l4O5m3J9j3%j8L5l2L8j0L6n0NJ5m7M5j9K9n8N5j1M7nK0r7L0
$$ -25 -39 12 -26 -43 -12 -46 19 -24 -5 -18 -18 -36 -1 -33 5 -5 31 -19 -14 1 -46 -1 -20 9 -49 6 -5 42 37 57 -40 -10
8093a0N3n1Oj1%j1M6m6mJ8L4pk8N1p6K3L1p9O9q2Q3Q%K3l9O0j8k4k9LL5k0QJ0
$$ -10 43 -8 -2 -13 -13 -24 22 -24 -28 -10 24 17 -11 40 -36 -13 18 -61 8 -74 9 17 17 40 1 61 43 19 -10 -7 28 8 16 26
8127B6n4L4o2K7N2o0mML2lj7j5j5L8k6L1Pj8nO1k3J2p9M2K1l3RQj7L4l5K7Jn5
$$ 26 -28 6 -56 -29 23 -37 -41 -37 -5 -8 -25 -40 -55 -17 -43 -12 -5 -23 -28 33 10 22 -57 -15 6 -27 -18 -10 -27 7 -28 -1 0 -55
8161e5Q8n5J6RJ6kl1%L4n0K7j7K3l4N8nl4QL8l3j9Rpmm9P7J1m4rm3
$$ -55 33 -22 -6 3 19 17 -14 -14 20 -30 -3 -20 3 -31 27 22 -12 -4 34 1 -18 -9 -16 -20 -69 8 19 -25 -34 -77
8191g7
$$ Imaginary data points
##PAGE= N=2
##DATA TABLE= (X++(I..I)), XYDATA
0@%%%%%%%%%%%%%%%%%%%%%%%%%%%%%kMmOqQqJ0j2J3j7K4k8L1l5L7m2N1n8O2o8
$$ 0 0 0 0 0 0 0 0 0 0 0 0 0 0 0 0 0 0 0 0 0 0 0 0 0 0 0 0 0 0 -2 2 -2 4 -4 4 -4 6 -6 7 -10 14 -14 17 -18 19 -23 28 -30 32 -36
50c6P5q3R0r7J06j12J18j21J20j17J04p6K2P5k52O00j344L184r284O0925L32710
$$ -36 39 -44 46 -51 55 -57 61 -60 60 -57 47 -29 -7 68 -184 416 -928 2256 -7028 53897 386607
71C86607k72768m54260J77715L98685n2370l03122m5062J56459J16525J0488j38281
$$ 386607 113839 -340421 -162706 235979 183609 -119513 -164575 -8116 108409 118897 -19384
82a9384j82344J14445L25497m8308m22748l5657M61702J21838m45047j90117L76728
$$ -19384 -201728 -87283 238214 189906 -232842 -268499 193203 315041 -130006 -320123 56605
93E6605K28844k70505k23871J43734J73872k1663q5487p9705k5518J47795J42862
$$ 56605 285449 14944 -208927 -65193 108679 87016 1529 -78176 -103694 44101 186963
104A86963j79547k50300J73318L31470j36529l72382Q1926L67562k6156l19636
$$ 186963 7416 -242884 -69566 261904 125375 -247007 -165081 202481 176325 -143311
114a43311j7766K38758M1744j36142m0228K6739J3003P4569L4980j53610r2066
$$ -143311 -161077 77681 119425 -16717 -56945 -30206 -17203 57366 92346 -61264 -153330
125a53330K03580J45771k23858j85914K17520K04632j90722j98112J51786J64715
$$ -153330 50250 196021 -27837 -213751 3769 208401 17679 -180433 -28647 136068
135A36068j11101j10266P6817M2994n3383K6660M1153r1016l8022J43030M1020
$$ 136068 24967 -85299 -8482 34512 -18871 7789 48942 -42074 -80096 62934 103954
146A03954j77136m4617J92355M3578j89746l3674J74676J4878j51657J1686J24884
$$ 103954 -73182 -117799 74556 118134 -71612 -105286 69390 84268 -67389 -55703 69181
157F9181m2898r8084P4725P3423j02337n1856J20882L1029j28557r097J25478
$$ 69181 26283 -71801 2924 76347 -25990 -77846 43036 74065 -54492 -63589 61889
168F1889j6548j13711M5478R5967p7452p6319J10695N8390j40866m4434J63343
$$ 61889 45341 -68370 -22892 73075 -4377 -80696 29999 88389 -52477 -96911 66432
179F6432L5253j72842k8683J67749K2103j46915j2064J12370m386o7988K9444
$$ 66432 101685 -71157 -99840 67909 90012 -56903 -68967 43403 39017 -28971 473
190D73J9992o3025K4235J02106n9004j42085P9879J75898q5398j98116P6156K02466
$$ 473 20465 -42560 -18325 83781 24777 -117308 -37429 138469 53071 -145045 -68889 133577
202A33577n6371j85554L2109J46943j0411q9736k076K0893J301N1719J4920j18097
$$ 133577 77206 -108348 -76239 70704 60293 -29443 -31519 -10626 -9325 42394 57314 -60783
214f0783m4517J69675Q2673j98691j21524K02136J52252j80811j66773J39240
$$ -60783 -105300 64375 147048 -51643 -173167 28969 181221 410 -166363 -27123
224b7123J58908q5574j26728K9337P1358J8847O03n1477p9868O3443J54864n4334
$$ -27123 131785 46211 -80517 -51180 20178 39025 39628 -11849 -91717 -28274 126590 72256
236G2256k14889K7955K50926Q913k57204m6680K33240P6189j82635q8887J13789
$$ 72256 -142633 -114678 136248 145161 -112043 -158723 74517 150706 -31929 -120816 -7027
247g027Q0465l6774m9718l6786K55R6636O0861j34988j24442J48086J79066j37016
$$ -7027 73438 36664 -13054 -49840 -49585 47051 107912 -27076 -151518 -3432 175634 38618
259C8618k15887J06465K27261o4469k10764K0495J67021J6168j02000l7724K4798
$$ 38618 -177269 -70804 156457 91988 -118776 -98281 68740 84908 -17092 -54816 -30018
270c0018L9974N4111k2634j23619r905J74597N1684k01224r2863K01728J24919
$$ -30018 9956 64067 41433 -82186 -92091 82506 134190 -67034 -159897 41831 166750
281A66750j78454j40028J37556J33714q7538j05561L7169N8376N026Q89l3675
$$ 166750 -11704 -151732 -14176 119538 32000 -73561 -36392 21984 27010 27899 -5776
292e776o4009M5721J21577m2501j65717K7593J90610o746j93773j3397J76213
$$ -5776 -69785 -24064 97513 55012 -110705 -83112 107498 100752 -93021 -106418 69795
303F9795K7165j41358k9966R5804K0336m5795R47j066l0492L9742O3417o6662
$$ 69795 96960 -44398 -74364 21440 41776 -4019 -3072 -4138 -34630 5112 68529 1867
315A867r4276Q0893J17235q3625j28898P7711J26708o7642j10924N6716Q3818
$$ 1867 -92409 -11516 105719 22094 -106804 -29093 97615 29973 -80951 -24235 59583
326E9583m8736m9280M4944J1824m5780K4012M9837n4120n4558P6725N7417r0619
$$ 59583 10847 -38433 6511 18335 -27445 -3433 46404 -7716 -62274 14451 71868 -18751
338a8751n5416R6771M7596r6462l3614R2481J4434q6294P451P9327k9488p2052
$$ -18751 -74167 22604 70200 -26262 -59876 32605 47039 -39255 -31804 47523 18035 -54017
350e4017M8504O3921o3043n3996P1389M0706p4001k3657P1721K407o6521K1807
$$ -54017 -5513 58408 -4635 -58631 12758 53464 -20537 -44194 27527 29934 -36587 -14780
362a4780O0585m7083n5238P0789N1731q9706m9447J01390M7827j03863m4167R6540
$$ -14780 45805 -1278 -56516 14273 66004 -23702 -73149 28241 76068 -27795 -71962 24578
374B4578L6864q0475k3717N8234L895l3297K1877R530n2116R198Q3112k0817j10852
$$ 24578 61442 -19033 -42750 15484 19379 -13918 7959 17489 -34627 -25429 57683 36866 -73986
387g3986K3878J30671j9897j38688J0787J32920o02j12782o634Q0515P587l9813
$$ -73986 -50108 80563 60666 -78022 -67235 65685 65083 -47699 -54333 26182 33769 -6044
399f044L04l634j7084M4322M1422p6698o9274R6832R6039j02679j16517R4795
$$ -6044 -5740 -9374 -26458 17864 59286 -17412 -86686 10146 106185 3506 -113011 -18216
411a8216J25688p6043j20537N0555R9715k4330o4858K135J9635J1232L0296j3559
$$ -18216 107472 31429 -89108 -38553 61162 36832 -28026 -25891 -6256 4976 35272 21713
423B1713p8415M750J18144J3063j43840l5544J52576N7291j43205p2501J18296
$$ 21713 -56702 -51952 66192 79255 -64585 -100129 52447 109738 -33467 -105968 12328
434A2328P6708q1935o6821M0463M2874l93p174l2310l5717N3164P9279o0547j17168
$$ 12328 89036 7101 -59720 -19257 23617 23224 16050 -16260 -51977 1187 80466 19919 -97249
447i7249N4841J42991l9431j53063J8989J45163J017j20693j5543Q3194K0695
$$ -97249 -42408 100583 61152 -91911 -72922 72241 73258 -47435 -62978 20216 40911
458D0911l7837j4578q705j783N0476K6146q2105n3782J00713P9736j05009r8729
$$ 40911 3074 -11504 -20209 -21992 28484 54630 -27475 -81257 19456 99192 -5817 -104546
470a04546R6526J06772p8474j01648N5180Q2898l1784n2906J2307J5188k46K5147
$$ -104546 -8020 98752 20278 -81370 -26190 56708 24924 -27982 -15675 -487 -733 24414
482B4414l653o2797m01R2918J0047j12112k1714J18501L1954j12466l6826R6234
$$ 24414 20761 -42036 -42437 50481 60528 -51584 -73298 45203 77157 -35309 -72135 24099
494B4099L4576p3143k3877M7238O061k2220J6827J381m1599J3961O4213k3318
$$ 24099 58675 -14468 -38345 8893 14954 -7266 9561 10942 -30657 -16696 47517 24199
506B4199q1522K7238R1194k8054r2077K7265Q4171k7172o9386K9022M9655l3303
$$ 24199 -57323 -30085 61109 33055 -59022 -31757 52414 25242 -44144 -15122 34533 1230
518A230k7668L9508O121m6351J3126N2432k8574n5822M0249N5321m8025n0104
$$ 1230 -26438 13070 19191 -27160 -14034 38398 9824 -45998 -5749 49572 1547 -48557
530d8557N3008M0574n6169k7488N8381J2127n9791L163O0398j7121n9687K8185
$$ -48557 4451 45025 -11144 -38632 19749 31876 -27915 -24752 35646 18525 -41162 -12977
542a2977N6408l6073m9879M0648L9107m2767k4399M3552O601m3942J2798M5136
$$ -12977 43431 7358 -42521 -1873 37234 -5533 -29932 13620 20221 -23721 -10923 34213
554C4213l1790m7001M8223M9411n9833n0933O5601N0290o4898m5652N8381L5906
$$ 34213 2423 -44578 3645 53056 -6777 -57710 7891 58181 -6717 -52369 6012 41918
566D1918m7572k0711L4574M80k2101K2995J2018m7683o019P0121M343q7419o593
$$ 41918 -5654 -26365 8209 8689 -13412 9583 21601 -26082 -32101 38020 42363 -45056 -51649
579e1649R6765J1332r6889j5859Q7198J8068o8692j5518M4182P036j6816P847
$$ -51649 45116 56448 -40441 -56300 30898 48966 -19726 -35244 8938 15974 -842 7005
591G005r542k7404L1330M9636m5878p0904N1697Q7648m9219r6700M0054R5425
$$ 7005 -2537 -29941 1389 51025 5147 -65757 -14060 73588 24369 -72331 -32277 63148
603F3148k7211q3434J3886O1202l724l1497q47k099j318L4942J0303o3119k4010
$$ 63148 35937 -47497 -33611 27591 23867 -7630 -8477 -10576 -11894 23048 33351 -29768 -53778
616e3778Q2937L9897r2195n3893R0513O3053p8899o4236O0184N6059l7756l8460
$$ -53778 29159 69056 -23139 -77032 13481 76534 -2365 -66601 -6417 49642 11886 -26574
628b6574J5488J3186K771J6771j4932m7485J9316P4755j6698r4687Q484J04393
$$ -26574 -11086 2100 4871 21642 6710 -40775 -21459 53296 36598 -58089 -49605 54788
640E4788K179j02770j2266R0019J8736o8433j8847M1242J1913j2264J731j4025
$$ 54788 56967 -45803 -58069 31950 50686 -17747 -36594 4648 16561 4297 6028 -7997
652g997k0310L5009M0976m8248n9996N3246P4136n0788q0865M2888P8512l2371
$$ -7997 -28307 6702 47678 -570 -60566 -7320 66816 16028 -64837 -21949 56563 24192
664B4192o7145K1825M8010j4060k3734J0268k646j1255K7743J6126m8764k3219
$$ 24192 -42953 -21128 26882 12822 -10912 -644 -3290 -14545 13198 29324 -19440 -42659
676d2659O3314L0839p0626l6154P0735L7624o4472l3960N4138K4966m1485j1280
$$ -42659 20655 51494 -19132 -55286 15449 53073 -11399 -45359 8779 33745 -7740 -19020
688a9020K8841n585j7760K3466R192m0105l501N3377j60o1810K267O4624m499
$$ -19020 9821 4236 -13524 9942 19134 -20971 -24472 28905 28745 -33065 -30798 33826 29327
701B9327o2020P632N4515j2269m3724J8421L1442k5786j8768L3408P173l9891
$$ 29327 -32693 -25061 29454 17185 -26539 -8118 23324 -2462 -21230 12178 19351 -20540
713b0540K879M4386j1235m5548J8177M3321k4008l7839K9599K9643l5023j9795
$$ -20540 -17661 26725 15490 -30058 -11881 31440 7432 -30407 -808 28835 -6188 -25983
725b5983M0062R483m4657R5M7646q366m8531J4820M6166j9695m0334K3238L1062
$$ -25983 14079 23562 -21095 -21000 26646 18280 -30251 -15431 30735 11040 -29294 -6056 25006
738B5006k6242j8751K9291M890l2870R555L6946k2628m0836L2797M4270l9165
$$ 25006 -1236 -19987 9304 14194 -18676 -9121 27825 5197 -35639 -2842 41428 2263
750B263m5598M1371M3820l9494l8191L4546K8167k8034j4079K1211k924j5974
$$ 2263 -43335 -1964 41856 2362 -35829 -1283 26884 -1150 -15229 5982 3058 -12916
762a2916K0997J3101l8426j2922N2656J4983o1977j8257O5282K1111o2010k1763
$$ -12916 8081 21182 -17244 -30166 22490 37473 -24504 -42761 22521 43632 -18378 -40141
774d0141N2819J9158l9133j2130K3206Q10p207J4165o636l0749J6457M7039k1545
$$ -40141 12678 31836 -7297 -19427 3779 4589 -2618 11547 4911 -25838 -9381 37658 16113
787A6113o0592K1814O8863j8239p0641J2347O4937o372n2300K209L3910j322j2421
$$ 16113 -44479 -22665 46198 27959 -42682 -30335 34602 28230 -24070 -21861 12049 10727 -1694
800a694M712r597j2122K9322K2595m4188l4119N2828M4527n4435n1248M9904N2635
$$ -1694 3018 -6579 -18701 10621 33216 -10972 -45091 7737 52264 -2171 -53419 -3515 49120
813D9120m0564m7494K8735L5877j6935j8863P189j548j334K2654k57m1952k218
$$ 49120 8556 -38938 -10203 25674 8739 -10124 -2935 -4483 -5817 16837 16580 -25372 -27590
826b7590N6547P485o5226j3531O6660J8619o1314k0738N0397J8704l5644j1867
$$ -27590 28957 36442 -28784 -42315 24345 42964 -18350 -39088 11309 30013 -5631 -17498
838a7498J9451J057m129J2932q347k8051J7132M1956k1399n2898K1885N8782j9388
$$ -17498 1953 3010 -1119 11813 3466 -24585 -7453 34503 13104 -39794 -17909 40873 21485
851B1485n8864J5558N2697j1940m1493R831K6337j0189r485J3050o953j8165K1276
$$ 21485 -37379 -21821 30876 18936 -22557 -12726 13611 3422 -6063 6987 34 -18131 3145
864C145K4254l2004k9841L8437L3785m0603l4563L9265L1797l5368k5176L0202
$$ 3145 27399 -4605 -34446 3991 37776 -2827 -37390 1875 33672 -1696 -26872 3330
876C330J5506k4952l582K0310q918j6944K0656J4621l0577j2982L7457J1278m1163
$$ 3330 18836 -6116 -9698 10612 1694 -15250 5406 20027 -10550 -23532 13925 25203 -15960
889a5960q868M1459N139l8929q7L4326o265k8506J3478K2324k0755j5956K7188
$$ -15960 -24828 16631 21770 -17159 -17246 17080 10815 -17691 -4213 18111 -2644 -18600 8588
902H588J0120l1895m623L4524o66l4490O092L1980j1803k7503J7699K1704k3892
$$ 8588 18708 -13187 -17810 16714 16048 -18442 -12350 19630 7827 -19676 -1977 19727 -4165
915d165j5340K9600R074l4343l497L7132j121l7774N025L5471q453l0388J1956
$$ -4165 -19505 10095 19169 -15174 -18671 18461 17340 -20434 -15409 20062 11609 -18779 -6823
928f823K2942j5644j3901K0114M178k4874M922K9972j2555l4252J7910L7271k0899
$$ -6823 16119 475 -13426 6688 10866 -14008 -9086 20886 8331 -25921 -8011 29260 8361
941H361l7702K1438L5106k0244k9290J8035K0064j5801q561J4300m348j4283J7153
$$ 8361 -29341 -7903 27203 6959 -22331 -4296 15768 -33 -8594 5706 1358 -12925 4228
954D228J5765k8422j8407L6820K1447m1405k3653M1644K4300l7919k2017L1100
$$ 4228 19993 -8429 -26836 9984 31431 -9974 -33627 8017 32317 -5602 -27619 3481
966C481J6490k2310p594J3194l712n107J6438p81k9139L922L9931m509m7408K924
$$ 3481 19971 -2339 -9933 3261 -451 -5558 10880 10099 -19040 -15118 24813 20304 -27104 -24180
980b4180N0221k26m8270k102M1337K976l0656j494J7492k645l808R326q616j7788
$$ -24180 26041 25815 -22455 -24557 16780 19756 -10900 -12394 5098 2453 -1355 7971 -645 -18433
994a8433J8723K6780k5222l4673K7901M0116k6865m1873K3215L9125j7966l1940
$$ -18433 290 27070 1848 -32825 -4924 35192 8327 -33546 -10331 28794 10828 -21112
1006b1112J2611K0984q558p374O341p151o707K0867R142l2205j3026L9670J7102
$$ -21112 -8501 12483 3925 -3449 2892 -4259 -10966 9901 19043 -13162 -26188 13482 30584
1019C0584m2819k0005M1476K0824l6354j8548K8633J3138j9674m665J0986n694
$$ 30584 -12235 -32240 9236 30060 -6294 -24842 3791 16929 -2745 -7410 3576 -2118
1031b118l655J6827j495k7275M349L5623n251m0591M570M1813l665l9101L035
$$ -2118 -5773 11054 9559 -17716 -13367 22256 17005 -23586 -19016 22797 19132 -19969 -16934
1044a6934L2928l781k4176N896J4136r630m012J4455n005j9796J2362K4567j7342
$$ -16934 15994 12213 -11963 -6067 8069 -1561 -5573 8882 3877 -15919 -3557 21010 3668
1057C668k7875K0221K9144k1186k7523K0653K3531j9644j7004J8350Q971j7429
$$ 3668 -24207 -3986 25158 3972 -23551 -2898 20633 989 -16015 2335 11306 -6123
1069f123k40J6964q304j6891J5729J6646k1573j5920K5178J4264k6899j1265K6782
$$ -6123 -6363 10601 2297 -14594 1135 17781 -3792 -19712 5466 19730 -7169 -18434 8348
1082H348O919k5279j484K3027m627k0374J0997J7510j6572j4574K1144J1465k3894
$$ 8348 15267 -10012 -11496 11531 6904 -13470 -2473 15037 -1535 -16109 5035 16500 -7394
1095g394q019K4922M064k4189M50K2117n724j9123J1187J5727j6840j2248K1684
$$ -7394 -15413 9509 13573 -10616 -10166 11951 6227 -12896 -1709 14018 -2822 -15070 6614
1108F614R079k5543o200K7564L569k7594r13K5517j968k1565N617J6097r778r804
$$ 6614 15693 -9850 -16050 11514 15083 -12511 -13424 12093 10125 -11440 -5823 10274 496 -9308
1122i308J4662L481j9587K102K4315o508k7959R425K9861j0952k9443J1252K6394
$$ -9308 5354 8835 -10752 -8650 15665 9157 -18802 -9377 20484 9532 -19911 -8659 17735
1135A7735j0976k0882J0632J3157j0825m311J1898m909j3883J3455J6438k0263
$$ 17735 6759 -14123 -3491 9666 -1159 -5470 6428 1519 -12364 1091 17529 -2734
1147b734j9101K4731K1160k6342k1907K5468K0667k2282j7110J7834J1204j2878
$$ -2734 -21835 2896 24056 -2286 -24193 1275 21942 -340 -17450 384 11588 -1290
1159a290l222Q335n874n124J5334L180k3831k882L0323L675l4006n190L4337O326
$$ -1290 -4512 3823 -2051 -7175 8159 11339 -12492 -15374 14949 18624 -15382 -20572 13765 20091
1173B0091l1432o315K5706M570j7935r56R471m513j174J1296n717j8393J0643
$$ 20091 -11341 -17656 8050 12620 -5315 -6271 3200 -1313 -2487 8809 3092 -15301 -4658
1186d658K4905j3217k9658J3696L1864j2625l0832J0504K6636q401j9707O946
$$ -4658 20247 7030 -22628 -8932 22932 10307 -20525 -10021 16615 8214 -11493 -4547
1198d547J0825o819j142Q034q335j0494J6371J3519k2245j6483K5449J8716k6023
$$ -4547 6278 -541 -1683 6351 -1984 -12478 3893 17412 -4833 -21316 4133 22849 -3174
1211c174j9134K4178J7628k0588j3682J6054P805j1467n50P771p593m862J5373
$$ -3174 -22308 1870 19498 -1090 -14772 1282 9087 -2380 -2930 4841 -2752 -7614 7759
1224G759L287k1919k830K6446K899k8547l103K7981K654k5108j282K0333j326
$$ 7759 11046 -10873 -13703 12743 15642 -12905 -16008 11973 14627 -10481 -11763 8570 7244
1237G244j4571N149Q403r588k766J4349k028j8574N685K1690q125k3104R693K2678
$$ 7244 -7327 -2178 6225 -3363 -6129 8220 6192 -12382 -6697 14993 6868 -16236 -6543 16135
1251A6135j0634k0126J1310J5987j2006j0751J2871M868j3926Q52J4988o118j5764
$$ 16135 5501 -14625 -3315 12672 666 -10085 2786 7654 -6272 -5420 9568 3450 -12314
1264a2314J0349J5990j3578j5119J5398J3239j6394j0131J6559O223j6389j480
$$ -12314 -1965 14025 447 -14672 726 13965 -2429 -12560 3999 10222 -6167 -7647
1276g647J5833l214j5183P838J4357j1686j3116J4429J1516j6130r168J6683N933
$$ -7647 8186 4972 -10211 -2373 11984 298 -12818 1611 13127 -3003 -12171 4512 10445
1289A0445j6245k007J5112k683j3602P553J1953j2138j0563J6180Q930j8837p513
$$ 10445 -5800 -7807 7305 4622 -8980 -1427 10526 -1612 -12175 4005 12935 -5902 -13415
1302a3415K0176N710j9825l359J7973N59j4894L025J1113p147p087J1695L333
$$ -13415 6761 12471 -7354 -10713 7260 7819 -7075 -4050 7063 -84 -7171 4524 7857
1315G857j6015k64J9645j971k2089L232K3023m006k1961M355J8971m822j4411
$$ 7857 -8158 -8422 11223 9252 -12837 -9605 13418 9412 -12549 -8194 10777 5955 -8456
1328h456N677Q590p249k289R411l726j2184Q945J5036j2694j7317J4792J8763
$$ -8456 -2779 5811 -1438 -3727 5684 1958 -10226 -1281 13755 1061 -16256 -1464 17299
1341A7299j5237j8549J4190J6646j2290j2685R972P199p917n94O485o390n923
$$ 17299 2062 -16487 -2297 14349 2059 -10626 -654 6545 -1372 -1966 4519 -1871 -7794
1354g794J2850O199j8265p096K1768Q088k3243q601K2294Q341j9523o696J5346
$$ -7794 5056 11255 -7010 -14106 7662 15750 -7493 -16094 6200 14541 -4982 -11678 3668
1367C668L590j0284P46N345n931j123J1616k121j6739M070K0840m746k3182M448
$$ 3668 7258 -3026 -2280 3065 -2866 -3989 7627 5506 -11233 -7163 13677 8931 -14251 -9803
1381i803K3453l800k1415L170J7349l087j1956L805N785n727O21Q167o165j1137
$$ -9803 13650 9850 -11565 -8395 8954 5867 -6089 -2284 3501 -2226 -1605 6562 397 -10740
1395a0740J0449J3980j3117j6085J4370J6849j4156j5908J2797J3401j0954r271
$$ -10740 -291 13689 572 -15513 -1143 15706 1550 -14358 -1561 11840 886 -8385
1407h385R207M009p753J829O796p558o401J2462O504j6292o666J8409O488j8853
$$ -8385 822 4831 -2922 -1093 5703 -1855 -8256 4206 10710 -5582 -12248 6161 12649 -6204
1421f204n930J7882M349j5582j971J2598j330r114N054N827q890k947J2439O96
$$ -6204 -12134 5748 10097 -5485 -7456 5142 3812 -5302 -248 5579 -3311 -6258 6181 6877
1435F877j5113J038J6738k277j7093L465J6017m582j3722N849J0598p440o991
$$ 6877 -8236 -7198 9540 7263 -9830 -6365 9652 5070 -8652 -2803 7795 355 -6636
1448f636R077L260j0842K03J2352l275j3235N556J3319p402j2412Q782J0442r569
$$ -6636 2441 5701 -5141 -4938 7414 4139 -9096 -3540 9779 2377 -10035 -1253 9189 -380
1462c80p812J0359M573j1049q86J1554k536j1872N647J1886q089j1341R714J0173
$$ -380 -8192 2167 6740 -4309 -5195 6359 3823 -8049 -2402 9484 1395 -9946 -232 9941
1476I941j0685q078J0911N219j0725j839J0217j923r773N713R152r004q714J1670
$$ 9941 -744 -8822 2089 7308 -3417 -5256 4961 3038 -6735 -1022 8130 -874 -9588 2082
1490B082Q169j3348p317J3923O024j3288m180J1897J648r803J494P510n044n232
$$ 2082 10251 -3097 -10414 3509 9533 -3755 -7935 3962 5610 -4193 -2699 4811 -233 -5465
1504e465Q695L336j1988k005J4709R92j6254l95J6409j91j5181P69J2660j840
$$ -5465 3230 6566 -5422 -7427 7282 8274 -7980 -8375 8034 7843 -7338 -6569 6091 4251
1518D251r242L397N286n637j071Q149k590j0683N522J3005p422j4551Q372J5007
$$ 4251 -4991 -1594 3692 -1945 -3016 5133 2543 -8140 -2618 10387 2965 -11586 -3214 11793
1532A1793q263j4261P670J2008o821q420N919M008n461R01N442n692o027R762
$$ 11793 3530 -10731 -3061 8947 2126 -6294 -375 3633 -1828 -927 4515 -1177 -7204 2558
1546B558O964j2865p982J4496Q615j4615q595J3500P604j1419n433Q725K328n954
$$ 2558 9522 -3343 -11325 3171 11786 -2829 -11424 2076 9680 -1739 -7172 1553 3881 -2073
1560b073J622L563n795j717R906N46j3176j88J5507J00j6311k91J5654K39j3665
$$ -2073 -451 3112 -2683 -4400 5506 6052 -7124 -7312 8195 8295 -8016 -8307 7347 7586 -6079
1575f079K76J0430j340o807L197K873n598R44P946l811j0471O098J2255p357j3122
$$ -6079 -5803 4627 3287 -3520 -323 2550 -3048 -2104 5842 2031 -8440 -2342 9913 2556 -10566
1590a0566P699J3000p379j1562O861Q980o286n494N890J589n863K495O033n964
$$ -10566 -2867 10133 2754 -8808 -1947 7033 747 -4747 1143 2732 -3131 -636 5397 -567
1604e67o717Q902P076j0732p269J1468P003j1471n942J0516M113r107j635P610
$$ -567 -7284 1618 8694 -2038 -9307 2161 9164 -2307 -8249 2267 6380 -2727 -4362 3248
1618C248j330o030M313M697p070l562R458K717j1071j862J1793Q49j1484J97J0498
$$ 3248 1918 -4112 201 4898 -2172 -5734 3724 6441 -4630 -6492 5301 6150 -5334 -5137 5361
1633E361j649q846L332O747n135m623P031K470q700n53R880j117j0439K417J0330
$$ 5361 3712 -5134 -1802 4945 -190 -4813 2218 4688 -4012 -4565 5315 4198 -6241 -3824 6506
1648F506l598r296M583P649n565n520O664L134p704o64Q596j562r206L380R506
$$ 6506 2908 -6388 -1805 5844 279 -5241 1423 4557 -3147 -3811 4785 3223 -5983 -2603 6903
1663F903m746r200N619Q164o142o539O401M333o608j697O793j182o969L783P183
$$ 6903 2157 -7043 -1424 6740 598 -5941 460 4793 -1815 -3512 3281 2099 -4870 -1087 6096
1678F096n958p417P669P280q517o744Q776N638q293l925P324J794o224R52N065
$$ 6096 138 -7279 390 7670 -847 -7591 1185 6823 -1470 -5395 1929 3723 -2501 -1549 3516
1693C516l872m043O620L280q994k790J0676K415j1577k042J1306J513j0104p29
$$ 3516 -356 -4399 2221 5501 -3493 -6283 4393 6808 -4769 -6811 4495 6008 -4096 -4825
1707d825Q190n73n802K353L256m507p32O694j222q762K708J0331l381j1268L646
$$ -4825 3365 2792 -3010 -657 2599 -1908 -2640 4054 2832 -5930 -3222 7109 3728 -7540 -3894
1722c894J1253l603j0093L351Q089l286n290L439K065l914J123M808m203n826
$$ -3894 7359 3756 -6337 -2986 5103 1817 -3473 -34 2031 -1883 -760 4048 -155 -5981
1736e981O475O883q024p653Q701P868q510p304P597O026o419l822N084J058l829
$$ -5981 494 7377 -647 -8300 401 8269 -241 -7545 52 6078 -341 -4163 921 1979 -1850
1751a850K084K892n154k258P797K108r804k186J0902K180j0958k030J0048J452
$$ -1850 234 3126 -2028 -4286 3511 5619 -4185 -6371 4531 6711 -4247 -6277 3771 5223
1765E223q363n36O216r44m016L034J604n062L68P010j796q546K552R702l001r821
$$ 5223 -3140 -3676 2540 1596 -2420 614 2218 -2844 -2476 4534 2738 -5808 -3256 6446 3445 -6376
1781f376L103R249l205p702L290N547l472l148M008N20m787J977N436l991o168
$$ -6376 -3273 5976 2771 -4931 -1641 3906 434 -2714 1294 1814 -2973 -996 4440 449 -5719
1796e719N473O596o391o527O660N893o506m735O124K983n518q74N034j398m510
$$ -5719 -246 6350 -41 -6568 92 5985 -521 -5256 868 3851 -1667 -2541 2493 1095 -3415
1811c415L694M039n519l709O957L293p709k750P861J953p454q85O675o24n610
$$ -3415 279 4318 -1201 -4910 2047 5340 -2369 -5119 2742 4695 -2759 -3644 3031 2407 -3203
1826c203K172M437l861l239N288K281o596j382P403N47p614K63P307j115o430
$$ -3203 -1031 3406 -455 -3694 1594 3875 -2721 -4103 3300 3847 -3767 -3504 3803 2688 -3742
1841c742K089N208l122l756M300K235n453o99O372n43p061J546P301k284o983
$$ -3742 -1653 3555 433 -3323 977 3212 -2241 -2940 3432 2889 -4172 -2626 4675 2391 -4592
1856d592K757O197l276m902L718L052m113j210M770q63n235K596N690l945o023
$$ -4592 -1835 4362 1086 -3816 -98 2954 -1159 -2369 2401 1538 -3697 -1101 4589 644 -5379
1871e379M885O021n284n556N327M560m968l048M498J251m062R04L579l058l283
$$ -5379 -494 5527 243 -5313 14 4574 -394 -3442 1056 2307 -1755 -851 2728 -330 -3613
1886c613M944L152o427l148P301L046p564k761P178K167o207j304M971k1l531
$$ -3613 1331 4483 -1944 -5092 2209 5255 -2309 -5070 2108 4275 -1932 -3236 1735 1714 -1817
1901a817J698K103l461q28N207j36o685P35P752j013q064J066P706j113o676J254
$$ -1817 -119 1984 -1477 -2305 2902 2766 -3919 -3184 4568 3555 -4509 -3443 4263 3150 -3526 -2272
1917b272N058j682l117K304R62l140J030M261k853n241M114N910m659o357M852
$$ -2272 2786 1104 -2013 291 1253 -1887 -857 3404 551 -4690 -576 5334 675 -5682 -830
1932h30O185m607n404M097M046l455k200L067N1k789K151K608m009k662N529K861
$$ -830 5355 748 -4656 -559 3487 32 -2168 899 950 -1839 312 2920 -1089 -3751 1778 4639
1948D639o614k965O855K949o672k503N868J781m881n79L544q68k271K496J238
$$ 4639 -1975 -4940 1915 4864 -1808 -4311 1557 3338 -1543 -2122 1422 554 -1717 779 2017
1963B017m135m01N538j61o441N47O823o41o755R15O023j196m820J649L330k389
$$ 2017 -2118 -2519 3019 2858 -3583 -3036 3787 3146 -3609 -2694 3329 2133 -2687 -1038 2292 -97
1979i7j634L203l5m021J382M706k401n232L087N245l395m990L561M265l553l154
$$ -97 -1731 1472 1437 -2584 -1202 3504 1103 -4129 -1042 4203 808 -4182 -621 3644 91 -3063
1995c063L548J727l523j33L538j339l573K795L488l769l465M471L208m737k733
$$ -3063 485 2212 -1311 -1444 2094 755 -2818 -23 3465 -304 -3769 702 3910 -827 -3560
2010c560M659K057m422j030L963j93l528J503K971k813k524L969K063m735j642
$$ -3560 1099 3156 -1266 -2296 1667 1474 -2054 -551 2420 -393 -2917 1052 3115 -1620 -3262
2025c262N184J147n136n82M797j57m112J036L239k003k269L050J302l940n47M710
$$ -3262 1922 3069 -2067 -2649 2148 1991 -2121 -1085 2154 151 -2118 932 2234 -1706 -2253 2457
2041B457l3n309O22N304j058m923J334M213j801l107K213J889k777n50L327o37
$$ 2457 2424 -2885 -2263 3041 1983 -2940 -1606 2607 806 -2301 -88 1801 -976 -1526 1801 1164
2057A164l939J707M449k449m618K862M558l056m019K918L359k813k194K647Q20
$$ 1164 -2775 -1068 3381 932 -3686 -824 3734 678 -3341 -423 2936 123 -2071 576 1396
2072A396k637P07K613k251k560L293K764m212k853M700K776m726k511M363J871
$$ 1396 -1241 -534 2079 -172 -2732 561 3325 -887 -3740 960 3736 -990 -3501 862 2733
2087B733l718q96K898k19k103J545J390k829q00M036M65m989k06N479P5n395q0
$$ 2733 -985 -1881 1017 798 -1305 240 1630 -1199 -1999 2037 2502 -2487 -2693 2786 2861 -2534 -2614
2104b614M949j48m052M58K895j039j635J783L11k612P70L464j587m203K156M604
$$ -2614 2335 2187 -1865 -1407 1488 449 -1186 597 908 -1704 -934 2530 943 -3260 -1104 3500
2120C500k393m674K407M341k181l612K043K490j888j195J964k29k103J604K276
$$ 3500 1107 -3567 -1160 3181 1000 -2612 -569 1921 33 -1162 802 573 -1530 74 2350
2135B350k710k601L578K786l972k865M023K624l807k110L303J219k638k29K115
$$ 2350 -360 -2961 617 3403 -569 -3434 589 3213 -594 -2704 599 1818 -820 -1049 1066
2150A066j054j533K290J132l237r47M120O86m451n42M518L53m247QL588m42k796
$$ 1066 12 -1521 769 1901 -1336 -2283 1837 2523 -1928 -2470 2048 2401 -1846 -1838 1750 1308 -1488
2167a488J015J813j726q93K506K6l136M76L721j067l903J365L888j548l542J704
$$ -1488 -473 1340 -386 -1279 1227 1253 -1883 -1407 2314 1247 -2656 -1291 2597 1049 -2493 -789
2183g89K899j829k004K043R64k195j9K563r81k774J754K915k298k896K575K698
$$ -789 2110 281 -1723 320 1284 -911 -930 1633 652 -2122 -368 2547 249 -2647 -72 2626
2199B626k654k281K674J496k540o89K484m07k278J298K130k113k022K789J830
$$ 2626 -28 -2309 365 1861 -679 -1368 1116 709 -1569 -271 1859 -254 -2276 513 2343
2214B343l185j616L354J290l177q44K934J99k486O05J981j382j459K126J055k834
$$ 2343 -842 -2458 896 2186 -991 -1835 1099 1298 -1188 -583 1398 16 -1443 683 1738 -1096
2230a096p35L389L66l569k27L513j1l235L36K695p98j943J251J149j830l27K342
$$ -1096 -1831 1558 1924 -1645 -1872 1641 1630 -1605 -1269 1426 628 -1315 -64 1085 -745 -1072 1270
2247A270k60k918Q48L287j188l388J386L325j479k889J463K215j550j288J565
$$ 1270 1010 -1908 -1060 2227 1039 -2349 -963 2362 883 -2006 -543 1672 122 -1166 399
2262C99L62j733O03J991j567k186K223K348k662k414K863K281k814j885K458J405
$$ 399 761 -972 -369 1622 55 -2131 92 2440 -222 -2636 227 2508 -306 -2191 267 1672
2278A672k072p18J742k27j311J221J022k099r05K830Q44l302q36L504P55l352
$$ 1672 -400 -1118 624 397 -914 307 1329 -770 -1675 1155 1999 -1303 -2139 1365 2120 -1232
2294a232o83L037K99k399J70J541o35r12J387K38k130L94K682o66l143Q44L338
$$ -1232 -1915 1122 1421 -978 -808 733 98 -814 573 811 -1319 -925 1757 1091 -2052 -1208 2130
2311B130r28l181R30K822q92k217J045J358j230m84J463m26j687J165J987j783
$$ 2130 1202 -1979 -1049 1773 881 -1336 -291 1067 -163 -647 816 390 -1297 -132 1855 72
2327G2k253K157K343k364k169K210J895k029j392J763P28j479L7J307q94j133
$$ 72 -2181 -24 2319 -45 -2214 -4 1891 -138 -1530 233 961 -518 -481 826 -68 -1201
2343a201J654J111k243j144K743J024k823r15K752O53k390m07K045j01j570P16
$$ -1201 453 1564 -679 -1823 920 1944 -879 -1794 958 1611 -779 -1186 859 758 -812 -96
2359i6J030j373n97J927K07k349RK663k33k712L65K620n87k193P17J700r40j114
$$ -96 934 -439 -1036 891 1098 -1251 -1242 1421 1188 -1524 -1159 1461 874 -1319 -602 1098 158 -956
2377i56J266N24j638J51J884o43k093R85K253j282k157J322K012j422j542J442
$$ -956 310 834 -804 -653 1231 588 -1505 -520 1733 451 -1706 -384 1628 206 -1336 106
2393A06J005j506l55J484k80j556R47J536j374j655J814J587j979j434J950J223
$$ 106 1111 -395 -750 734 454 -1102 -155 1381 7 -1648 166 1753 -226 -1660 290 1513
2409A513j855p84J670K52j441L39J233q88j083J492Q46k014o88K257N86k361m95
$$ 1513 -342 -1126 544 796 -645 -306 927 39 -1044 448 1294 -720 -1408 849 1435 -926 -1421
2426a421K304K98k085J8J629l59j150Q00O70j254k05J682j07k032M02K246n21
$$ -1421 883 1181 -904 -886 743 384 -766 34 704 -550 -755 927 820 -1212 -810 1436 915
2443I15k304N43K235o39j867P17J332p93p77J000L2j180M71J491j019j671J315
$$ 915 -1389 -846 1389 750 -1117 -400 932 139 -638 362 394 -786 -315 1176 157 -1514 -199
2460a99J820j478j879J529J755j434j375J261R07j069m52J084l61q21Q46R23j394
$$ -199 1621 143 -1736 -207 1548 114 -1261 0 907 -162 -614 470 109 -712 134 1057 -337
2477c37r52J928Q27k057r05K097P88j921o15J661K72j286J30Q73o48m47J099J80
$$ -337 -1289 639 1466 -591 -1496 601 1389 -532 -1147 514 786 -500 -370 503 -145 -592 507 687
2495F87j580O4J938j70k154J83K202k39k007L10J658l85j241N84P05q31p6J064
$$ 687 -893 -829 1109 939 -1215 -1032 1170 931 -1076 -766 892 507 -734 -150 555 -276 -352 712
2513G12l82j314O94J553r30j723J072J682j072j603J042J309r81q73R42L58r14
$$ 712 330 -984 -290 1263 333 -1390 -318 1364 292 -1311 -269 1040 59 -814 128 486 -428
2530d28K21R09p53q92J164R44j432r77J579R64j620r03J581O15j375k76J126j31
$$ -428 -207 702 -51 -943 221 1165 -267 -1244 335 1299 -321 -1224 357 972 -403 -679 447 316
2548C16r07N94O61j070m02J395K37j618k02J705K05j787R5J502j56j218L74R00
$$ 316 -591 3 664 -406 -808 587 824 -794 -996 709 914 -873 -778 724 568 -650 -276 624
2566F24o00n35Q49K31j109M3J363k62j603N00J547n43j520O21J273o27r98O97
$$ 624 24 -511 338 569 -540 -497 866 604 -999 -499 1048 505 -1015 -394 879 252 -746 -49
2584d9N81q31j21R19k64j057O42J137r04j158J084J149j079j072J031R07j023
$$ -49 532 -299 -420 499 235 -822 -180 957 53 -1105 -21 1128 49 -1023 8 915 -108
2601a08m80Q58R0o74K27O96o85o30J039N95j321n84J379N85j415n70J395L38j109
$$ -108 -588 270 360 -314 -87 609 -76 -706 333 928 -393 -977 402 987 -428 -998 397 735 -374
2620c74r5Q76k17o21N67L17q81j85J248Q4j482M5J533l4j539J34J391k23j083
$$ -374 -469 407 190 -431 136 453 -428 -613 635 719 -763 -718 815 781 -758 -624 767 544 -539
2639e39K13P99m56l17N11N2q14K42J077n40j176O64J373q35j236P29J087o40q72
$$ -539 -326 473 17 -300 211 263 -551 -309 768 228 -948 -284 1089 254 -982 -253 834 194 -678
2658f78O21N41o11p4O13m18m65O38N83r09p62J151P89j180q41J180O93j060m44
$$ -678 -57 484 -127 -201 412 -6 -471 167 750 -159 -921 230 1019 -161 -1002 178 871 -189 -633
2677f33P91K54p00Q1N37m90l49Q66J68j053j10J257J65j348j41J364R3j207m6
$$ -633 158 412 -288 -207 330 -160 -509 357 525 -528 -638 619 784 -564 -705 659 752 -455 -501
2696e01R94j70n91K62K93n08q8Q51k19r87L01J133m26j169M15J208n27j015N07
$$ -501 493 323 -268 -6 287 -221 -309 542 323 -664 -363 770 344 -825 -410 798 271 -744 -237
2715b37P14m23m58N61Q2n68K16O42n10o96P24P51q38p13Q58P34q47o64Q06L62
$$ -237 477 54 -404 157 239 -329 -113 529 19 -677 47 798 -40 -753 105 839 -8 -672 134 496
2735D96n83k29N77j31n14M40M40o90m11Q66M12j074k85J027L02r45k47Q71R6p00
$$ 496 -87 -316 261 130 -384 56 496 -194 -605 261 673 -401 -686 341 643 -302 -549 322 418 -282
2755b82Q9M84l67k67N87J36p74J5R13j34r63J43R84j46r30J99P03k46n09L18L24
$$ -282 -193 291 -76 -343 244 380 -394 -379 534 400 -563 -420 564 418 -512 -313 390 144 -365 -47 277
2776B77m72J1N63j78p34L41Q88n24p99N33P90n30o96M87N20m26k97M10Pm34K60
$$ 277 -195 -184 379 201 -533 -192 696 172 -627 -94 696 166 -530 -43 477 51 -246 164 171 -263 -3
2797cM62n39m77O48N30p79n29P45N63p78m30O73K66n18q1M42j23l62L78K89n91
$$ -3 459 -80 -557 91 621 -158 -687 58 621 -157 -587 86 352 -166 -247 195 72 -290 88 377 -214
2818b14j49P42J28q89j07R49O5q52n3P29p2n11J19L29k35k00M73m1o42J97P00
$$ -214 -363 379 507 -382 -489 460 525 -327 -380 349 277 -234 -115 214 -21 -221 252 211 -431 -234 466
2839D66j92r07L58Q45l48p11K02P42l11m72L07J78k23kL80k18n16M66M51m93n46
$$ 466 274 -633 -275 570 222 -489 -287 455 144 -328 -21 157 -66 -68 312 94 -422 44 495 2 -544
2860e44O06N61o63n72O42L77m17l17L93J07k77Q8K57l64k08N34K27p30k00Q06
$$ -544 62 623 -40 -612 30 407 -10 -327 66 173 -104 -16 241 -123 -331 203 430 -300 -500 306
2880C06K17q04k08P45J67n67o5M08j14k40K63R0m29L8N49j07o82J52P10j80p01
$$ 306 523 -281 -489 256 423 -144 -209 199 85 -155 108 198 -231 -193 356 249 -433 -281 429 249 -452
2901d52J09P66j41n97J88L31j67j86K51J1l06J41M05k97m88M46N43m58n33L59
$$ -452 -343 423 282 -315 -127 204 37 -149 102 113 -193 -52 353 56 -432 14 557 99 -434 -75
2921g5N45m05l71K64K36k42o6K54j91k48L25L27m53l36N18M25o52k45M72L38n20
$$ -75 470 65 -306 -42 194 -48 -114 140 -51 -299 26 353 -100 -436 82 507 -145 -390 82 420 -100
2942a00j57L83O2l61J73J94k44j19L57J14n49rN82m7n29o7N54K2m75j0M04j31
$$ -100 -257 126 188 -173 0 194 -50 -169 188 302 -247 -256 326 279 -250 -317 237 259 -216 -226 178 47
2964D7k14K03O9l26R9L97j85m44J84N50j48n84J46O08k14m67K46K69j64j58J73
$$ 47 -167 36 105 -221 -122 275 90 -354 -170 380 232 -352 -206 402 188 -279 -33 236 72 -86 87
2985H7L0k97K53K13l18l21M07L39l86m48M08L58l68k52L20J29k31k5J68j49r2
$$ 87 117 -180 73 286 -32 -353 54 393 7 -441 -33 325 -43 -295 25 154 -77 -102 66 -83 -175
3006a75K91J27m23j13M78J45m73j88M96J24l94j88M20M2k27J9J54k24qK72j7l84
$$ -175 116 243 -180 -293 185 330 -143 -331 165 289 -105 -293 127 169 -58 -39 115 -109 -117 155 138 -246
3028b46J07M43j56m80J62M69p9m18L3L87p9k26J00J28k51J13K08j86k86K23L63
$$ -246 -139 304 148 -332 -170 299 220 -198 -165 222 143 -83 17 145 -106 7 215 29 -257 -34 329
3049C29l19l71L28L31k46l74K10L10j54k00J52J7j03Q8J10k66o4L24K13m00k09
$$ 329 10 -361 -33 298 52 -322 -112 198 44 -156 -4 13 -90 -2 108 -158 -222 102 315 -85 -294
3070b94M53J66m13j35L22J48k52q1J36l3m7J45l2j67p7L67J2m58k1M55M8m34k3
$$ -294 159 325 -88 -223 99 247 -5 -86 50 17 -30 115 83 -84 -161 206 218 -240 -261 194 242 -192 -215
3093b15L08j7k51R1J17l9j9J84p4j79P3K93j99k86J75L19j70l63J70K48j01j77
$$ -215 93 76 -175 -84 33 -6 -25 159 85 -94 -21 272 73 -213 -38 281 111 -252 -82 166 65 -112
3115a12J01Q9r4pJ32j42j51K13J94k32k89L19J96k30k52K73J48j75j09J67K8p4
$$ -112 -11 78 -16 -23 109 -33 -184 29 223 -9 -298 21 217 -13 -265 8 156 -19 -128 39 67 -7
3137gN7L9j42q2K70J5k82p5L26Q1l47k7L06K8k63M9J15j5j26J18M9k69J45K19
$$ -7 50 89 -53 -135 135 150 -132 -207 119 200 -147 -174 132 160 -103 -54 61 46 -80 38 87 -182 -37 182
3161A82o3k88M4L50j10k77O7L26j61j48j1J55k4q9J50o8k18K10J23k35j33J66
$$ 182 119 -169 -125 225 115 -162 -95 231 70 -78 -89 66 42 -47 103 35 -183 27 150 -85 -218 -52
3183e2K10j67j99J34K52j77j03O3J36q2j8Q7j34k5J70J68l33j21L24J22l23j23
$$ -52 158 -9 -208 -74 178 1 -102 -39 97 15 -3 84 -50 -75 95 263 -70 -191 133 255 -68 -191
3205a91K88M9j53l6Q6M5r6J7Lr8J2K18n2k89N8K44K0k59l8K82L3j57n8J24K9j38
$$ -191 97 146 -7 -43 43 88 -8 9 12 -86 -74 144 92 -197 -139 105 125 -134 -172 110 143 -14 -72 52 81 -57
3231e7J03l9l6P7J23j04k13J25J84j37j53J05K24j35j69L3J76j17n3J59r5r9P0
$$ -57 46 7 -29 48 171 67 -146 -21 163 26 -127 -22 202 67 -102 -69 107 -10 -63 96 1 -98 -28
3254b8J63j34j66J89J34j52j25J82J26k10j13J92L8q0o5O3n0mJ34j6k04K2K38
$$ -28 135 1 -165 24 158 6 -119 63 189 -21 -134 58 96 16 -49 14 -36 -40 94 78 -126 -104 134
3277A34J5k26o9K40l4j05l2J12Q9r6l8J6l3j0J60p7j15J3K23l3k51K6K29n8j64
$$ 134 149 -77 -146 94 60 -45 -77 35 124 28 -10 6 -27 -37 123 46 -69 -56 167 134 -117 -91 138 80 -84
3302h4KJ41n6QL5m5r6P8Q1j05l8Q5J55k13n6J83J35j35j67J09R9j01oM8n2l2J53
$$ -84 -82 59 3 11 46 1 -95 -17 64 -41 -79 6 161 -52 -108 75 210 75 -92 17 116 15 9 57 5 -27 126
3329A26l6r5n4J70J4k26PR0J04j47r9J39rQn8O7%m0J22m8j18J4J45m9j63P5J34
$$ 126 90 -5 -59 111 125 -101 -94 -4 100 -47 -146 -7 -16 -8 -66 1 1 -39 83 35 -83 -69 76 27 -136 -61 73
3356G3Qj26K2J30j7j07pJ0OJ7Nmj49J29J81j89r6J06J05o8j58J30J15j22m1j2
$$ 73 81 -45 -23 107 90 -17 -24 -14 -8 9 14 10 -139 -10 171 -18 -114 -8 97 29 -129 1 116 -6 -47 -59
3382e9O1N3l5J1p1k7J11P2j40j7R0N8j05n9O4L1q1%N1M7n2pJ5r7LJ63k6j74M5
$$ -59 2 55 20 31 -40 -67 44 116 -24 -41 49 107 2 -57 7 38 -43 -43 8 55 3 -4 11 -86 -83 80 54 -120 -75
3411g5J82l9p6k5J01mp6j6J2L3Oj2oq8M1J36k1k04R5J39q2j21J2J30n9ql2P2l9
$$ -75 107 68 -8 -33 68 64 -12 -28 -16 17 23 11 5 -83 -42 94 73 -131 -36 103 21 -100 -88 42 -17 -25 -57 15 -24
3440b4N4J2m6l3Q3L5r0m3J12J2p5q3Q0J20m7n6qL4Nl4Jn3L3N6j7r3J6Q5Pj58P4
$$ -24 30 42 -4 -37 46 81 -9 -52 60 72 -3 -86 -6 114 67 11 3 37 42 8 9 -44 -11 45 28 -65 -49 36 43 -115 -41
3471d1J5J25p8k9N3k6j7L0j1j01J01P5q9o5L7R9m8j9m3R9pk6m7J6K9l3M6l9m9
$$ -41 -26 99 21 -8 45 19 2 32 21 -80 21 96 7 -58 -21 78 30 11 -32 67 60 34 -13 3 32 -1 45 6 -43
3500d3L3R3j26k8Q9O3j41k1R5M9j3j06KN3K4L2Jl9qN9l0p8l6J25on2k6O0On0j4
$$ -43 -10 83 -43 -71 18 81 -60 -81 14 63 50 -56 -54 -1 23 55 56 17 9 68 38 -40 -76 49 43 -9 -35 25 31 -19 -33
3531c3j2Q0J6r1N1j8J0P1m8q0K6J46j2j58%R6L9r2j5J7L1p2L3o4M2l1J17o3j8
$$ -33 -45 35 51 -40 11 -7 3 74 26 -54 -28 118 106 -52 -52 44 83 -9 -24 -7 24 -48 -15 -79 -37 -68 49 -14 -32
3560c2P0J3q7n8O4O9l0pK9j2J9pl6k0K0M4rj07L1J26m3j7p4O4M4k9n5K2J7okk9
$$ -32 38 51 -36 -94 -30 39 9 2 31 19 38 31 -5 -25 -5 39 30 -77 -46 80 37 20 -54 10 54 25 -30 -8 9 3 1 -28
3592b8RP6n6ol0lQ8o5r5P1K7J00q0j2M7r5N4k9Q3p7O4L1j15l4J32Mm2m1K6Lm7
$$ -28 -19 57 1 -5 -35 -38 50 -15 -110 -39 -12 88 8 -4 43 -52 2 -27 56 -21 43 74 -41 -75 57 61 19 -22 4 7 -40
3623d0L6j8K0l7M9q2M9mK9M6r4J4M6K8o9PP0k9J1o1K6J5L6n9K0L5q2P3k6n6N0
$$ -40 -4 -22 -2 -39 10 -72 -23 -27 2 48 -46 -32 14 42 -27 -20 50 21 32 -29 -3 12 48 -11 9 44 -38 35 9 -47 3
3654CNK8r0j9J21m9J1j5L5K4o1K6L9o4j6Q0l5q1Q5K5j1m5j9Q8q3k6J0O9lo8P3
$$ 3 8 36 -54 -73 48 -1 10 -5 30 54 -7 19 58 -6 -22 58 23 -58 27 52 41 -4 -23 65 -18 -44 -34 35 32 -36 37
3685C7q6N2L2n1l3%J6O0j8m8M4K0J7m3m5Q4l2K2l6L9m7M7j1r2O4J10p5j07L6N8
$$ 37 -49 3 35 -16 -49 -49 -33 27 9 -39 5 25 42 -1 -46 38 6 28 -8 31 -16 31 20 -72 -8 102 27 -80 -44 14
3715A4L7j09L5R9o4k5K5p3k9J20q3M1K7K3jn0Kl3J00n9m1Q0Mo0M8j6k7M7m5M3
$$ 14 51 -58 -23 76 12 -13 12 -61 -90 30 -53 -12 15 38 37 -13 -11 -44 56 -3 -44 36 40 -20 28 12 -15 32 -13 30
3745C0p3O9k5pkq3J04M2o5LlNL9n1j6K5J8K7Kn4J3J3O4o9m3P2m8K1m2R4m8l5%
$$ 30 -43 26 1 -6 -8 -91 13 55 -10 -7 -10 -5 34 -17 -33 -8 10 37 39 -15 -2 11 75 6 -37 35 -13 8 -34 60 12 -23 -23
3778b3l9P2j4O8m0l3RK7j5p2MR0j4m4N9L8j05K8j0lK1J3k0J9o1O8K9n6j2k6N1
$$ -23 -62 10 -4 64 24 -9 0 27 12 -60 -56 34 20 -24 35 73 -32 -4 -14 -17 4 17 -3 16 -45 23 52 -4 -16 -42 9
3809IL3q7L0QL4r8K0L4J8L9m3jj2O7L2j02RQ5j5l8n1O9jK2m2J0k1m1P2j00J3N7
$$ 9 42 -45 -15 -7 27 -71 -51 -17 1 40 -3 -4 -16 51 83 -19 -10 75 60 22 -29 40 39 61 19 29 8 -33 39 -61 -48 9
3841IJ1o1n2P9O1l0k8m4J26q3O2p7K5j4M3k3p1J5P6N1j19L2J4O3q3L9mJ2K1o7
$$ 9 20 -41 -93 -14 47 17 -11 -55 71 -12 50 -27 -2 -16 27 4 -67 -52 24 75 -44 -12 2 65 -18 21 17 29 50 -17
3871a7rN7LNk9m6l7Q8kp3L7N4J4q7l5N5jJ9n1N9QQn1M3m7L7K5l0n7O3M8j6j09
$$ -17 -26 31 34 39 10 -36 -73 15 13 -60 -23 31 45 -42 -77 -22 -23 -4 -55 4 12 20 -31 12 -35 2 27 -3 -60 3 51 35 -74
3904g4P1J3rn6O3J1j1l0L4j4m4L1O4j0l8O5n8j2q5O8J22m1p5klM2oj8ql6L8J5
$$ -74 -3 10 1 -55 8 19 8 -22 12 -2 -46 -15 49 39 1 66 8 -4 -89 -21 101 60 -15 -17 -20 22 16 -2 -10 -46 -8 7
3936Gm1%J6P2q4K0L5j4L6j2K1p7M8J8l6K0n2L5k5J5n0J03k5rK2Mk1n5RkM4j5l6
$$ 7 -34 -34 -18 54 -30 -10 25 11 47 35 56 -21 27 45 9 29 -23 12 -13 2 -48 55 30 21 43 47 26 -29 -20 -22 22 7 -29
3969b9j3Q3l4J3Qo0K2Nl1nJ7P9l7n0KO8l9L4k7nj7L6J4j5j6J0J9m1o6J00k7J9
$$ -29 -42 41 7 20 28 -32 -10 -5 -36 -41 -24 55 18 -32 -30 38 -1 33 6 1 -16 20 34 19 3 13 32 -9 -75 25 -2 17
4001A7pl4N3J5o6M8o3kN6ok9m3J12n8MJ3m3O1k6l2K9LMQPj6l8M9K0o4JN9p0QL2
$$ 17 10 -24 29 44 -22 26 -37 -39 17 11 -18 -61 51 -7 -3 10 -33 28 2 -30 -1 2 6 14 21 5 -33 16 36 -28 -27 32 -38 -30 2
4036BJ0K4m7pRM3j7j3j5j4N4k9J5m9M5O8r6m4P6L1pq2N8m2KJ9n1N0k9P7r6j5M5
$$ 2 12 36 -11 -18 -9 34 17 4 -11 -25 29 0 15 -34 11 79 -17 -61 15 46 39 -43 15 -27 -25 -6 -57 -7 -36 41 -55 -70 -25
4069b5k9M7J2m9N4R1j25L6j2M8l1NN4o6RK0l0r0O6K1j9J8m1O3k0l0kL6m1l2L3
$$ -25 -54 -7 5 -44 10 101 -24 12 0 48 17 22 76 10 19 39 9 -81 -15 6 -13 5 -36 27 7 -23 -25 11 -30 -62 -29
4100b9k5M3K0M8p2rJ9P0o7rj9J28lj40P9n2R6j6p3J3PJ5pOoJ5l7J5M3n7K3j6L6
$$ -29 -54 -11 9 57 -15 -24 -5 65 -2 -11 -30 98 95 -45 34 -18 78 62 -11 2 9 24 17 23 17 32 -5 10 53 -4 19 3 39
4133C9n3L1o4K2j2l1O0M9m5k3Q1k6m0l0n4J08j0l0pJ2K0M0k0n8K3K2n0j6Q0lM9
$$ 39 -14 17 -47 -25 -37 -68 -8 41 -4 -27 54 28 -12 -42 -96 12 2 -28 -35 -23 -3 37 17 -41 -18 4 -46 -62 18 15 64
4164F4j9l7j5M0q3N3j6M9n0J3LRqJ3j7o6M7L2L5j16L3j7P5l0j1nL2m0O3Nm3M8
$$ 64 45 8 -7 33 -50 3 -13 36 -14 -1 2 11 3 16 -1 -67 -20 12 47 -69 -36 -53 22 -8 -19 -24 8 -32 31 36 -7 41
4196D1k6l4K9k2jP7m6J7J6l7k5J7J6j7l0K3J8j3J8n4J6k3J01o0jml0J02n3k5R
$$ 41 15 -19 10 -12 -13 64 18 35 51 14 -11 6 22 5 -25 -2 16 3 21 -33 -17 -40 61 1 0 -4 -34 68 15 -10 -1
4227aj2L4k9M3j9j5P5j16%P2l9K2j1RJ5M8q4K5KL2n4j6L1j7M2m6ppl3Q7k5m2J3
$$ -1 -13 21 -8 35 16 1 76 -40 -40 32 -7 15 4 13 28 76 -8 17 19 51 -3 -19 12 -5 37 -9 -16 -23 -56 31 6 -36 -23
4260b3J1L0o7M5m4R6q4N6k2L2j8pJ6m6K2K0k0qK3K5j0l7K5j5k0j0K4N5l3k5j1
$$ -23 -12 18 -49 -4 -48 48 -36 20 -2 30 12 5 21 -25 -3 17 -3 -11 12 37 27 -10 15 0 -20 -30 -6 49 16 -9 -20
4291b0L6Mn2Q1Ro4N0l6j4K9n8P1k3K2n2j8L7K2j5K7n0J1M9o0J5pM1n6RMjRl9K6
$$ -20 16 20 -32 49 58 -6 44 8 -6 23 -35 36 13 35 -17 -35 2 24 9 36 -14 -3 46 -14 1 -6 35 -21 -12 -8 -9 0 -39 -13
4325a3N4n0N7n3N2q1P4j7pOL3q1K5j5N2J5j02k0P5J3po7N6mK3Pl8j8lL9Ko3K9
$$ -13 41 -9 48 -5 47 -34 40 23 16 22 55 -26 -1 -16 36 51 -51 -71 4 17 10 -57 -1 -5 18 25 -13 -31 -34 5 7 -56 -27
4358b7LO5k4m2rPL5N2n5n3Q7k2J8j00J32p4l6M1j8L3m7L6JQj5o2J9N2j7M6Kp8
$$ -27 -24 41 17 -25 -34 -27 8 60 5 -48 39 17 35 -65 67 -7 -43 -2 -20 13 -34 2 3 11 -4 -66 -47 5 -12 34 36 -42
4390d2L1N3k5o1N2N0k0l5OJ3l2m7N1j7nj1M6j4j2K8K0j9k5j2O5M0k5p1L4L6n5
$$ -42 -11 42 17 -44 8 58 38 3 9 22 -10 -57 -6 -23 -28 -39 7 -7 -19 9 29 10 -15 -27 38 78 53 -18 16 52 -3
4421cM0k8k2L4k2%J3jL3J4q9N8k3jl7M2J2m2L4Ml3qmnM0L7k5m5J0M8K6o2N0o4
$$ -3 37 9 -13 21 -1 -1 12 11 44 58 -31 27 4 3 -34 8 20 -22 12 16 -17 -25 -29 -34 6 43 18 -27 -17 31 57 -5 45 -19
4455a9M1%jQk4LQl3l0NM5ML5k7Jn3M7j0JL4p4J8PL1m0M0K3o1k3L6J7k4K8l3N5
$$ -19 22 22 21 29 5 8 16 -17 -47 -42 3 7 42 15 16 -37 10 0 1 35 -39 -21 -14 17 -23 17 40 -21 -44 -8 9 -15 13 -20 35
4490C5l6j8K9j5OnK4n3k3L9qQ5o7MJ5n4k1K6K7Lj3M8j9k2J6NJ9m9M9l1jK0L4p9
$$ 35 -1 -19 10 -5 1 -4 20 -33 -56 -17 -25 60 -7 -3 12 -42 -63 -37 -10 -7 -20 28 9 -13 3 8 27 -22 27 -4 -5 15 49 -30
4524c0L7qL3m4j9J9O8k4l1jrM8l7j7n2K9K5O4k9j4K5j6jqK5j02P7p4L3J06j29
$$ -30 7 -1 32 -12 -31 -12 56 32 1 0 -9 39 2 -15 -67 -38 -13 51 22 8 33 17 16 8 33 -69 8 -66 -33 73 -56
4555e6N7K4l2J2j5j4O6o0L5j3n0M9jN0n4l6oRK8j5qN4M6q5K6m6J2O2o6M1j0pR
$$ -56 1 25 -7 5 -10 -24 42 -18 17 4 -46 3 2 52 -2 -38 -44 -35 -7 -22 -30 24 70 -15 11 -35 -23 39 -27 14 4 -3 6
4588F%J1K9k3n1M6j2j3ON4j9j38J50m4m5K9j4M2Rk9k9J4J9k6K4k1R0o3l2O4pk7
$$ 6 6 17 46 23 -28 18 6 -7 -1 53 34 -104 46 2 -43 -14 -28 14 23 -6 -35 -21 -2 -28 -4 -25 65 2 -30 34 27 0
4620@kM5p4N0j5M4n8Q2q2J6k8M7j4l8qL5j1j6mL5j0N5k8M4k7l3j7M4l4M3Ll6O
$$ 0 -2 43 -31 19 4 48 -10 72 -10 6 -22 25 11 -27 -35 0 -11 -27 -31 4 -6 49 21 65 38 5 -12 32 -2 41 44 8 14
4653A4j3J7l6J5J8k4j9L8L3l4qK3Rl6M9k0n7N8k1J0l5J0K1L4k2p3Q7j5k1L3j00
$$ 14 1 18 -18 -3 15 -9 -28 10 43 9 1 24 33 -3 46 26 -31 27 6 16 -19 -9 12 46 24 -49 38 23 2 35 -65
4684f5K5O1j5J6m8J1RKJ7o9N1nl0L7j6K0k7K9j3j0j5O0p4O1l5M2m1K1KO7j5j12
$$ -65 -40 21 6 22 -26 -15 -6 -4 13 -56 -5 -10 -40 -3 -19 1 -26 3 -10 -20 -35 25 -49 12 -23 19 -22 -1 1 68 53 -59
4716e9P7Rj6j9pj1O7p8jK4poj7K6K4Pl4mLj6N0k3RM7l2O7m5n7RpJ8Nk1RNPL6n4
$$ -59 18 27 11 -8 -15 -26 41 -37 -38 -14 -21 -27 -44 -18 6 13 -21 -25 -22 -38 12 -11 -2 45 13 80 35 -22 -13 -20 -2 3 -18 -9 -4 3 39 -15
4754a5M3J1l9l4L6Om3J6Mk2m1P2k2K3J3k1M2k7J9n9k2N9j9O3k0k9%k1J2mK7l3
$$ -15 28 39 0 -34 2 8 -35 -19 -15 -37 -78 -6 -28 -5 8 -13 29 2 21 -38 -60 -1 -20 43 23 -6 -6 -27 -15 -19 8 -25
4786b5mM3qm2k0P2m1O5m5k3K6NL8m6M6o5J9mkN5n2%pP2j6n9K0m7J2j2O1l6pJ4
$$ -25 -29 14 6 -36 -56 16 -25 40 -5 -28 -2 3 41 -5 41 -24 -5 -9 -11 44 -8 -8 -15 57 41 -18 2 -45 -33 -45 16 -20 -27 -13
4820a3J3k0K2J0j3m7M5k0L3kKJ7J8Jm6M2k0j5M6o8N2jl6L6k8k8NJ6n2Q4m0k7Q4
$$ -13 0 -20 2 12 -1 -48 -3 -23 10 8 10 27 45 46 0 42 22 7 53 -15 37 36 0 36 8 -20 -15 1 -51 33 -7 -34 50
4853E0n9k7J4lk3L4j3rJ7P3o9mJ6Oj6k0K8l3P6n8J3J8l8K9J7k6O4n6J4l4nJ0K7
$$ 50 -9 -36 -22 -25 -48 -14 -27 -36 -19 54 -15 -19 -3 3 -13 -33 -5 -38 38 -20 -7 11 -27 2 19 -7 57 1 15 -19 -24 -14 13
4886A3J5j9n4N8m7j9N9jj7JL5l0k0K3l1L7ml7L2K0Jj4j3nLm5M9N6m5j0K0J3m9
$$ 13 28 9 -45 13 -34 -53 6 5 -12 -11 24 -6 -26 -3 -34 3 -1 -38 -6 14 15 1 -12 -17 -14 -59 -10 46 1 -9 11 24 -25
4919b5M2J7o4J6K9n2J8L4m5jM6ml5O7q2K5M1p7k1Q7m2OL7l9j4kK6k5N1n8RRRl2
$$ -25 17 34 -30 -14 15 -37 -19 15 -30 -31 15 11 -24 43 -39 -14 27 -50 -71 16 -26 -20 17 -22 -36 -38 -12 -37 14 -44 -35 -26 -17 -49
4953d9K9m0M8K8rk1M1LjNr4Q1l5N0k1qJ1l8RM6k4j3kkOm9M5oj1K7l5J5k7M6l2
$$ -49 -20 -60 -12 16 7 -14 27 30 29 34 -60 21 -14 36 15 7 18 -20 -11 35 11 -2 -4 -6 0 -49 -4 -10 -21 6 -29 -14 -41 5 -27
4988b7l6M6j1K7nK3k1lL8o0P0k7l3N2k8n4K5K3k5L3RK6n3%LQj5J1M7l0n2PO6q4
$$ -27 -63 -17 -28 -1 -6 17 -4 -7 31 -29 41 14 -19 33 5 -49 -24 -1 -26 7 16 42 -11 -11 -8 0 -15 -4 43 13 -39 -32 34 -50
5022e0JL1M8k1Pmj8k9R4nr0P8m3Nk0j0jN9o0M6k3L3J1k3j6PKn1O3Oojk8J1M9j9
$$ -50 -49 -18 30 9 16 12 -6 -35 59 54 -36 42 -1 4 -16 -26 -27 32 -28 18 -5 28 39 16 0 7 9 -42 21 27 21 20 -8 3 52 33
5058C3p1L9LPj6m2J9L4k3J2Rj6j9P3o6J6K1j6L1l2mJ5oM1k2j0%k3P6q0RK9L6n6
$$ 33 -38 1 4 11 -5 -47 -28 6 -17 -5 4 -12 -31 42 -24 -8 13 -3 28 -4 -8 7 1 42 20 10 10 -13 63 -17 -8 21 57 1
5092APn6O4k3N6m4K8l8rkK5rl9J9l2O6p0J10n2m3J00n6J3l5L7q2M3J3Rj0nN1m
$$ 1 8 -48 16 -7 49 5 33 -5 -14 -16 9 0 -39 -20 -52 14 -56 54 2 -41 59 3 16 -19 18 -64 -21 -8 1 -9 -14 37 33
5125C3j3m2K3K6k1j2pNk0J6oL7N9q1NoK8K5n3K1n6j1M5N0n0K4m2k1N4J2m4J2k9
$$ 33 20 -22 1 27 6 -6 -13 -8 -28 -12 -18 19 78 -3 2 -4 24 49 -4 17 -39 -50 -5 45 -5 19 -23 -44 10 22 -22 -10 -39
5158c9O0j8M9r1M4J6lk5J0L5ol7k2jJ5J2RK4p0L6k5J0L4j9L9Kn7P7o0k9L3m2P6
$$ -39 21 3 52 -39 5 21 18 -7 3 38 32 -5 -27 -28 -13 -1 8 32 -38 -2 -27 -17 17 -2 37 39 -18 59 -1 -30 3 -39 37
5191C7m9K7m8nQ9q4L7n2OO3Jp4N1Nj8k3P2K5r1L9q1R4nk4j4L0lj8J7m4MLM4Rj1
$$ 37 -12 15 -33 -38 51 -33 4 -48 -42 21 22 -52 -1 4 -14 -37 35 60 -31 8 -73 21 16 -8 -22 8 5 -13 4 -40 -36 -33 11 20 9
5226IoL6l8k3j9L9k6ON9p2K0K3m5P7q0N0Lm3OQ9p1j5K7j1RM9om8k4M5m2L3K9k9
$$ 9 3 39 1 -22 -41 -2 -28 -22 37 -35 -15 8 -37 40 -40 10 13 -30 -24 65 -6 -21 6 -5 4 53 47 -1 -25 20 -22 11 40 11
5260A1L4o8L2MqL3k5Oo0O3j3%o3Q6j6k5LlN8n7%J5ML2n5k7Q1m4n0K7M2Nr3Q3J3
$$ 11 45 -23 9 13 5 38 13 19 -41 22 9 9 -54 32 16 -9 -6 -9 49 -8 -8 7 11 43 -12 -39 42 -2 -52 -25 17 22 -71 12 25
5295B5m3P6l9K8p9K9qP8p7J1rN3o7k5J6K1%J2j1P4r3K5k5L6n9J9P6m3j7K7k1L0
$$ 25 -18 58 19 47 -32 -3 -11 67 -10 1 -8 45 -22 -47 -31 -10 -10 2 -9 65 -28 -3 -28 8 -51 -32 44 1 -16 11 -10 20
$$ [...]
8191A8
##END NTUPLES=NMR FID
##END=
