##TITLE=1H_LY-DMAA.Per.1.10
 CDCl3
 8 sc, 
 14.02.2022
##JCAMPDX= 6.0         $$ Bruker NMR JCAMP-DX V2.0
##DATA TYPE= NMR FID
##DATA CLASS= NTUPLES
##ORIGIN= UXNMR, Bruker Analytische Messtechnik GmbH
##OWNER= root
$$ XWIN-NMR		Version 3.5
$$ Mon Feb 14 13:10:19 2022 Russian Standard Time (UT+4h)  she@DPX200
##.OBSERVE FREQUENCY= 200.131346
##.OBSERVE NUCLEUS= ^1H
##.DELAY= (6, 6)
##.ACQUISITION MODE= SIMULTANEOUS
##.ACQUISITION SCHEME= undefined
##.AVERAGES= 24
##.DIGITISER RES= 18
##SPECTROMETER/DATA SYSTEM= spect
##.PULSE SEQUENCE= zg30
##.SOLVENT NAME= CDCl3
##.SHIFT REFERENCE= (INTERNAL, CDCl3, 0, 15.7039)
##AUDIT TRAIL= $$ (NUMBER, WHEN, WHO, WHERE, WHAT)
$$ ##TITLE= Audit trail, XWIN-NMR		Version 3.5
$$ ##JCAMPDX= 5.01
$$ ##ORIGIN= Bruker BioSpin GmbH
$$ ##OWNER= she
$$ F:/spectra/data/she/nmr/H-F/1/audita.txt
$$ ##AUDIT TRAIL=  $$ (NUMBER, WHEN, WHO, WHERE, WHAT)
(   1,<2022-02-14 13:08:23.01 +0400>,<she>,<DPX200>,
      <created by zg, POWCHK disabled, PULCHK disabled
       configuration hash MD5:
       00 E9 B6 7A A2 85 ED C7 34 08 36 98 17 FE 4E 26
       data hash MD5: 16K
       8C DC A0 60 92 48 46 62 48 AE D4 73 B6 E6 D1 79>)
$$ ##END=
$$ 
$$ hash MD5
$$ 8E 9D C8 FA E7 C9 72 B4 D8 6D F4 05 6B 1E EF 25
##$RELAX= 
##$RELAX= 
##$RELAX= 
##$RELAX= 
##$RELAX= 
##$RELAX= 
$$ Bruker specific parameters
$$ --------------------------
##$DU= <F:/spectra>
##$EXPNO= 1
##$NAME= <H-F>
##$PROCNO= 1
##$TYPE= <nmr>
##$USER= <she>
##$AMP= (0..31)
100 100 100 100 100 100 100 100 100 100 100 100 100 100 100 100 100 100 
100 100 100 100 100 100 100 100 100 100 100 100 100 100 
##$AQSEQ= 0
##$AQ_mod= 1
##$AUNM= <au_zg>
##$AUTOPOS= <>
##$BF1= 200.13
##$BF2= 200.13
##$BF3= 200.13
##$BF4= 200.13
##$BF5= 200.13
##$BF6= 200.13
##$BF7= 200.13
##$BF8= 200.13
##$BYTORDA= 1
##$CFDGTYP= 0
##$CFRGTYP= 5
##$CHEMSTR= <none>
##$CNST= (0..31)
1 1 145 1 1 1 1 1 1 1 1 1 1 1 1 1 1 1 1 1 1 1 1 1 1 1 1 1 1 1 1 1 
##$CPDPRG= <>
##$CPDPRG1= <>
##$CPDPRG2= <>
##$CPDPRG3= <>
##$CPDPRG4= <mlev>
##$CPDPRG5= <mlev>
##$CPDPRG6= <mlev>
##$CPDPRG7= <mlev>
##$CPDPRG8= <mlev>
##$CPDPRGB= <>
##$CPDPRGT= <>
##$D= (0..31)
0 1.2 0 0 0 0 0 0 0 0.06 0 0.03 0 0 0 0 0.0002 0 0 0 0 0 0 0 0 0 0 0 0 
0 0 0 
##$DATE= 1644829702
##$DBL= (0..7)
120 120 120 120 120 120 120 120 
##$DBP= (0..7)
150 150 150 150 150 150 150 150 
##$DBP07= 0
##$DBPNAM0= <>
##$DBPNAM1= <>
##$DBPNAM2= <>
##$DBPNAM3= <>
##$DBPNAM4= <>
##$DBPNAM5= <>
##$DBPNAM6= <>
##$DBPNAM7= <>
##$DBPOAL= (0..7)
0.5 0.5 0.5 0.5 0.5 0.5 0.5 0.5 
##$DBPOFFS= (0..7)
0 0 0 0 0 0 0 0 
##$DE= 6
##$DECBNUC= <off>
##$DECIM= 32
##$DECNUC= <off>
##$DECSTAT= 4
##$DIGMOD= 1
##$DIGTYP= 9
##$DL= (0..7)
0 120 120 120 120 120 120 120 
##$DP= (0..7)
150 150 150 150 150 150 150 150 
##$DP07= 0
##$DPNAME0= <>
##$DPNAME1= <>
##$DPNAME2= <>
##$DPNAME3= <>
##$DPNAME4= <>
##$DPNAME5= <>
##$DPNAME6= <>
##$DPNAME7= <>
##$DPOAL= (0..7)
0.5 0.5 0.5 0.5 0.5 0.5 0.5 0.5 
##$DPOFFS= (0..7)
0 0 0 0 0 0 0 0 
##$DQDMODE= 0
##$DR= 18
##$DS= 0
$$ [...]
##$SUBNAM2= <"">
##$SUBNAM3= <"">
##$SUBNAM4= <"">
##$SUBNAM5= <"">
##$SUBNAM6= <"">
##$SUBNAM7= <"">
##$SUBNAM8= <"">
##$SUBNAM9= <"">
##$SW= 18.0517287032376
##$SWIBOX= (0..15)
0 0 2 0 0 0 0 0 0 0 0 0 0 0 0 0 
##$SW_h= 3612.71676300578
##$TD= 16384
##$TD0= 1
##$TE= 0
##$TE2= 300
##$TE3= 300
##$TEG= 300
##$TL= (0..7)
0 120 120 120 120 120 120 120 
##$TP= (0..7)
150 150 150 150 150 150 150 150 
##$TP07= 0
##$TPNAME0= <>
##$TPNAME1= <>
##$TPNAME2= <>
##$TPNAME3= <>
##$TPNAME4= <>
##$TPNAME5= <>
##$TPNAME6= <>
##$TPNAME7= <>
##$TPOAL= (0..7)
0.5 0.5 0.5 0.5 0.5 0.5 0.5 0.5 
##$TPOFFS= (0..7)
0 0 0 0 0 0 0 0 
##$TUNHIN= 0
##$TUNHOUT= 0
##$TUNXOUT= 0
##$USERA1= <user>
##$USERA2= <user>
##$USERA3= <user>
##$USERA4= <user>
##$USERA5= <user>
##$V9= 5
##$VALIST= <valist>
##$VCLIST= <CCCCCCCCCCCCCCC>
##$VD= 0
##$VDLIST= <DDDDDDDDDDDDDDD>
##$VPLIST= <PPPPPPPPPPPPPPP>
##$VTLIST= <TTTTTTTTTTTTTTT>
##$WBST= 1024
##$WBSW= 4
##$XGAIN= (0..3)
0 0 0 0 
##$XL= 0
##$YL= 0
##$YMAX_a= 256676
##$YMIN_a= -247434
##$ZGOPTNS= <>
##$ZL1= 120
##$ZL2= 120
##$ZL3= 120
##$ZL4= 120
##$ABSF1= 10
##$ABSF2= 0
##$ABSG= 5
##$ABSL= 3
##$ALPHA= 0
##$AQORDER= 0
##$ASSFAC= 0
##$ASSFACI= 0
##$ASSFACX= 0
##$ASSWID= 0
##$AUNMP= <proc_1d>
##$AZFE= 0.1
##$AZFW= 0.1
##$BCFW= 1
##$BC_mod= 2
##$BYTORDP= 1
##$COROFFS= 0
##$CY= 11.3945322036743
##$DATMOD= 1
##$DC= 2
##$DFILT= <>
##$DTYPP= 0
##$F1P= 2.36226072786647
##$F2P= -0.459571619588291
##$FCOR= 0.5
##$FTSIZE= 0
##$FT_mod= 4
##$GAMMA= 1
##$GB= 0.15
##$INTBC= 1
##$INTSCL= 1
##$ISEN= 128
##$LB= 0.24
##$LEV0= 0
##$LPBIN= 0
##$MAXI= 10000
##$MC2= 0
##$MEAN= 0
##$ME_mod= 0
##$MI= 1.114404
##$NCOEF= 0
##$NC_proc= 0
##$NLEV= 6
##$NOISF1= 3.799351
##$NOISF2= 2.8
##$NSP= 1
##$NTH_PI= 0
##$NZP= 0
##$OFFSET= 15.70392
##$PC= 1
##$PHC0= -16330.6
##$PHC1= 38.40078
##$PH_mod= 1
##$PKNL= yes
##$PPARMOD= 0
##$PSCAL= 0
##$PSIGN= 0
##$REVERSE= no
##$SF= 200.130013532006
##$SI= 16384
##$SIGF1= 3
##$SIGF2= 2
##$SINO= 400
##$SIOLD= 16384
##$SREGLST= <1H.CDCl3>
##$SSB= 0
##$STSI= 0
##$STSR= 0
##$SW_p= 3612.71676300578
##$SYMM= 0
##$S_DEV= 0
##$TDeff= 0
##$TDoff= 0
##$TI= <>
##$TILT= no
##$TM1= 0
##$TM2= 0
##$TOPLEV= 0
##$USERP1= <user>
##$USERP2= <user>
##$USERP3= <user>
##$USERP4= <user>
##$USERP5= <user>
##$WDW= 1
##$XDIM= 8192
##$YMAX_p= 0
##$YMIN_p= 0
$$ End of Bruker specific parameters
$$ ---------------------------------
##NTUPLES= NMR FID
##VAR_NAME=  TIME,          FID/REAL,        FID/IMAG
##SYMBOL=    X,             R,               I
##VAR_TYPE=  INDEPENDENT,   DEPENDENT,       DEPENDENT
##VAR_FORM=  AFFN,          ASDF,            ASDF
##VAR_DIM=   8192,          8192,            8192
##UNITS=     SECONDS,       ARBITRARY UNITS, ARBITRARY UNITS
##FACTOR=    0.0002768,     1,               1
##FIRST=     0,             0,               0
##LAST=      2.2672688,     0,               0
##MIN=       0,             -247434,         0
##MAX=       2.2672688,     256676,          0
$$ Real data points
##PAGE= N=1
##DATA TABLE= (X++(R..R)), XYDATA
0 0 0 0 0 0 0 0 0 0 0 0 0 0 0 0 0 0 0 0 0 0 0 0 0 0 13 -24 24 -24 24 -24 24 -24 24 -38 48 -48 48 -53 71 -72 74 -87
42 -87 96 -109 120 -132 143 -157 174 -191 206 -229 254 -280 317 -350 393 -442 495 -567 652 -768
62 -768 915 -1124 1425 -1910 2771 -4613 10094 -58150 -247434 17882 227069 -259 -184626
75 -184626 -19694 127308 45241 -62930 -71567 -3702 99173 65242 -121333 -116203 137200
86 137200 150746 -143181 -167980 138931 167283 -123183 -152494 95620 125256 -58122 -90846
97 -90846 13596 52425 32893 -16114 -77266 -14640 115480 37013 -143620 -49966 159281
108 159281 54524 -159283 -50811 144678 41664 -116237 -28863 78417 16203 -34755
118 -34755 -6234 -9788 477 50381 -92 -83441 3940 104259 -12181 -112167 22209 106093
130 106093 -32915 -88766 41341 62592 -45672 -31414 44912 -202 -38470 28640 27714 -49228
142 -49228 -12577 60517 -4217 -60498 21554 50536 -36604 -31859 47811 7333 -54210 19178
154 19178 54867 -44465 -50917 63917 42276 -75432 -31179 76299 18539 -66755 -6832 47157
166 47157 -2579 -19614 8706 -12387 -10838 45827 10026 -75795 -6134 99422 1397 -113096
178 -113096 3349 115698 -5780 -106417 4836 86242 190 -57553 -9566 23055 21945
189 21945 12736 -36725 -47123 51128 75950 -63365 -97141 70833 108845 -71638 -110371 64887
201 64887 102576 -49842 -86481 27871 64804 3 -39605 -30710 13942 61589 10184 -89147
213 -89147 -30769 110056 46324 -122038 -56631 122837 61248 -112380 -61440 90715 57734
224 57734 -60157 -51854 23244 44758 16161 -37503 -54063 31089 87020 -25125 -111121 20211
236 20211 124786 -15048 -126126 9625 115922 -2913 -95310 -5355 66911 15125 -34261
247 -34261 -26435 441 37906 30418 -49150 -56144 57917 73735 -63557 -82706 64372 82444
259 82444 -59909 -73984 50054 59354 -34982 -40360 16352 20253 4891 -951 -25833 -14709
271 -14709 45200 25779 -60389 -30977 69933 30435 -72750 -25043 68263 15857 -57526 -5268
283 -5268 41120 -5329 -21663 13513 923 -18438 18206 18932 -33898 -15016 44261 7326 -48056
296 -48056 3193 45454 -14570 -36621 25632 23641 -34171 -7965 39445 -7675 -40379 21194
308 21194 36889 -30602 -29511 34201 18855 -31807 -6643 23141 -6141 -9812 17685 -6800
320 -6800 -27212 24294 33723 -40289 -36738 52575 36518 -58933 -33291 58531 28153 -50562 -21697
333 -21697 35948 15243 -15746 -9497 -7701 5070 31699 -2277 -54047 728 71539 -433
345 -433 -82716 101 85635 587 -80355 -2726 67095 6712 -47357 -12526 23423 20266 2509
358 2509 -28778 -27435 37466 49506 -44363 -66112 48637 76355 -48741 -79334 44037 75277
370 75277 -34359 -65257 19800 50321 -1881 -32791 -18465 14002 38640 3611 -57160 -19108
382 -19108 71418 30909 -79982 -38594 81606 42203 -75560 -41751 62638 38626 -43344
393 -43344 -33244 20149 27330 5231 -21287 -29842 16226 51470 -12285 -67891 9407 77378
405 77378 -7508 -79368 5689 73497 -3795 -61165 701 43424 3351 -22806 -8908 1539
417 1539 15371 18183 -22203 -34250 28778 45372 -33722 -50346 36680 49515 -36473 -43100 33140
430 33140 32653 -26509 -19698 17086 6105 -5973 6208 -6087 -15845 17497 21555 -27362 -23018
443 -23018 34228 20075 -37506 -13549 36837 4594 -32248 5428 24534 -14648 -14482 21970
455 21970 3732 -25898 6615 26045 -14950 -22116 20335 14599 -22086 -4585 19848 -6910
467 -6910 -14355 18080 6140 -28019 3108 35067 -12312 -38722 19644 38494 -23920 -34459
479 -34459 24316 27331 -20316 -17664 12441 7106 -1076 3855 -11864 -13511 25355 21595 -37219
492 -37219 -27086 45986 29923 -50298 -30260 49117 28126 -42563 -24668 30593 19908 -14802
504 -14802 -15295 -3724 10895 22602 -7295 -40267 4552 54581 -2446 -63799 869 67241
516 67241 1049 -64027 -3334 54981 6856 -40558 -11269 22716 16834 -3127 -22914 -16240
528 -16240 28838 33472 -33820 -47087 36688 55642 -36997 -59013 33714 56788 -27153 -49871
540 -49871 17096 39164 -4509 -26063 -9573 12268 23977 1119 -37052 -12531 47656 21380
552 21380 -54243 -26819 56189 29034 -53022 -28209 44886 25031 -32622 -20484 17164 15313
564 15313 -355 -10697 -16368 6844 31229 -4424 -42734 3270 49737 -3204 -51549 3784
576 3784 48264 -4240 -40194 4318 28687 -3214 -14932 1038 887 2443 12111 -6764 -22477
589 -22477 11407 29186 -15960 -31868 19405 30080 -21601 -24808 21682 16588 -19845 -7006
601 -7006 15982 -2703 -10548 11140 4157 -17053 2664 19974 -8816 -19117 13971 15153 -17098
614 -17098 -8189 18249 -399 -17079 9605 13962 -18117 -9424 24570 4018 -28374 1025 28395
627 28395 -5379 -25144 7790 18332 -8305 -9313 6495 -1299 -2636 12193 -2593 -21907 8446
640 8446 29815 -13750 -34585 17816 36247 -19418 -34274 18395 29368 -14175 -21877 7288
652 7288 12884 1780 -3412 -12031 -5899 22156 13859 -31184 -20129 37562 24001 -40690 -25692
665 -25692 39659 25177 -34484 -22983 25469 19611 -13260 -15613 -750 11752 15397 -8044 -29073
678 -29073 5092 40402 -2635 -48086 678 51303 1164 -49717 -3181 43386 5614 -33183
690 -33183 -8669 19982 12291 -5453 -16276 -9146 20189 22322 -23497 -32724 25653 39599 -25927
703 -25927 -42221 24218 40924 -20047 -35808 13812 27989 -5741 -18363 -3533 8242 12985
715 12985 1368 -22026 -9577 29372 15423 -34525 -18885 36485 19646 -35296 -18245 30700
727 30700 15124 -23221 -10984 13631 6842 -2764 -3009 -8086 348 17960 1129 -25560 -1062
740 -1062 30448 1 -31810 1899 29761 -4010 -24620 5716 17015 -6804 -8302 6601
752 6601 -904 -5386 9028 2751 -15258 532 18831 -4324 -19529 7959 17310 -10998 -12542
765 -12542 13132 6209 -13807 1062 13264 -7857 -11208 13586 8319 -17059 -4629 18080 841
778 841 -16255 2599 11811 -5351 -5386 6888 -2554 -7283 10577 6347 -17969 -4694 23651 2467
792 2467 -26957 -261 27305 -1415 -24553 2170 19109 -1596 -11450 -208 2470 3210 7058
805 7058 -6814 -15719 10636 22932 -13973 -27898 16082 30073 -16526 -29497 14842 26176
817 26176 -11088 -20752 5340 13834 1846 -6245 -9791 -1295 17595 8094 -24351 -13469 29416
830 29416 17313 -31782 -19214 31289 19505 -27575 -18323 20986 16070 -12110 -13336 1599 10389
843 10389 9289 -7657 -19693 5152 28325 -3295 -34490 1647 37337 -263 -36618 -1133
855 -1133 32511 2839 -25309 -4767 16092 7294 -5641 -9956 -4779 12686 14203 -15036 -21624
868 -21624 16814 26500 -17525 -28398 16852 27285 -14801 -23732 11087 18028 -6284 -11423 389
881 389 4321 5785 2164 -11835 -7514 16931 11140 -20720 -12850 22694 12738 -22447 -10876 20123
895 20123 7982 -15761 -4405 10102 969 -3327 2057 -3575 -4002 9807 4659 -14662 -4045
908 -4045 17567 2273 -18435 180 16899 -3053 -13530 5743 8645 -7897 -2927 9032 -2796
921 -2796 -8978 7742 7735 -11154 -5461 12743 2511 -12226 870 9800 -4151 -5661 7028 446
935 446 -9112 5079 10088 -10171 -10183 14042 9227 -16258 -7588 16324 5489 -14195 -3280 10140
949 10140 1298 -4245 341 -2558 -1251 9654 1644 -15890 -1381 20858 867 -23836 -319
962 -319 24349 -27 -22395 -288 17955 1094 -11872 -2851 4326 5022 3502 -7692 -10971 10145
976 10145 17179 -12294 -21681 13525 24009 -13459 -24001 11974 21910 -8807 -17852 4437 12734
989 12734 1165 -6826 -7240 903 13224 4564 -18430 -9065 22345 12235 -24450 -14133 24195
1002 24195 14557 -21756 -13947 16978 12303 -10574 -10328 2854 8074 5264 -5886 -12935 3980
1015 3980 19478 -2445 -24105 1381 26459 -410 -26088 -254 23301 1120 -18276 -2115
1027 -2115 11809 3490 -4466 -5093 -2995 6829 9570 -8556 -14620 9990 17822 -10930 -18944 11042
1041 11042 17943 -10259 -15165 8461 11084 -5768 -6304 2348 1347 1628 3183 -5545 -6623 9021
1055 9021 8665 -11704 -9293 13236 8446 -13528 -6472 12357 3583 -10040 -469 6589 -2689 -2541
1069 -2541 5158 -1651 -6661 5392 6981 -8233 -6064 9904 4162 -10082 -1370 8897 -1739
1082 -1739 -6394 4858 3063 -7450 662 9238 -4249 -10025 7066 9501 -8873 -8191 9171 5892
1096 5892 -8120 -3183 5463 53 -1883 2756 -2487 -5205 6904 6941 -10730 -7844 13596 8153
1110 8153 -14958 -7637 14736 6761 -12564 -5491 9021 4269 -3992 -2997 -1784 2016 7670 -1318
1124 -1318 -12966 841 17049 -629 -19707 293 20229 -22 -18904 -706 15536 1699
1136 1699 -10860 -3225 4986 5005 1280 -6948 -7216 8781 12256 -10200 -15946 11064 18103 -10872
1150 -10872 -18400 9710 17112 -7331 -14373 3977 10694 160 -6363 -4792 1848 9312 2269 -13264
1164 -13264 -5708 16246 8209 -17921 -9711 17939 10145 -16280 -9679 13023 8556 -8522 -7061
1177 -7061 3099 5313 2697 -3679 -8238 2259 12769 -1245 -16055 548 17678 -237 -17554
1190 -17554 26 15610 97 -12251 -408 7829 954 -2818 -1747 -2175 2866 6613 -4005
1203 -4005 -9868 5209 11791 -6094 -12179 6653 11242 -6621 -9093 5944 5999 -4631 -2543 2712
1217 2712 -1037 -565 3997 -1872 -6271 3957 7253 -5759 -7260 6794 6004 -7143 -3946 6607
1231 6607 1279 -5320 1669 3484 -4324 -1178 6494 -993 -7654 3055 7901 -4424 -6963 5114
1245 5114 5167 -4878 -2536 3762 -458 -1957 3440 -394 -6145 2764 8084 -5028 -9294 6559 9427
1260 9427 -7342 -8761 6976 7225 -5624 -5116 3235 2666 -84 -103 -3430 -2214 6939 4176 -9912
1275 -9912 -5523 11997 6326 -12909 -6585 12517 6374 -10753 -5799 7724 5029 -3732 -4140 -932
1289 -932 3251 5618 -2471 -9906 1822 13167 -1274 -15266 742 15883 -155 -14964 -603
1302 -603 12596 1563 -9129 -2819 4753 4205 -80 -5734 -4518 7012 8388 -8137 -11326 8641
1316 8641 13033 -8567 -13518 7642 12712 -5956 -10879 3532 8284 -489 -5109 -2826 1890 6186
1330 6186 1243 -9079 -3697 11284 5537 -12467 -6594 12575 6846 -11487 -6476 9288 5530
1343 5530 -6258 -4369 2439 2905 1420 -1745 -5237 651 8301 -45 -10540 -278 11578 238
1357 238 -11418 -14 10086 -197 -7693 481 4714 -376 -1258 176 -2017 396 4886 -1075
1371 -1075 -6906 1904 7963 -2686 -7993 3272 6927 -3648 -5126 3514 2623 -3131 -7 2267
1385 2267 -2576 -1230 4624 -3 -6001 1126 6453 -2090 -5988 2730 4639 -2929 -2586 2699 131
1400 131 -2055 2469 1143 -4804 -16 6623 -1079 -7692 1934 7852 -2466 -7100 2440 5504 -1952
1415 -1952 -3293 874 678 567 2015 -2246 -4474 3909 6472 -5278 -7800 6160 8339 -6331 -8138
1430 -8138 5698 7166 -4300 -5714 2110 3766 490 -1761 -3426 -348 6121 2110 -8463 -3658
1444 -3658 10030 4652 -10670 -5240 10289 5436 -8790 -5210 6386 4820 -3193 -4085 -328 3449
1458 3449 4022 -2665 -7275 2024 9928 -1417 -11598 786 12079 -212 -11608 -547 9888
1471 9888 1276 -7401 -2300 4127 3243 -720 -4341 -2751 5223 5693 -5955 -7975 6302 9384 -6159
1486 -6159 -9744 5548 9266 -4292 -7866 2649 5954 -513 -3571 -1697 1148 3922 1111 -5878
1500 -5878 -2998 7318 4281 -8142 -4969 8152 4975 -7462 -4528 5949 3559 -4004 -2467 1524
1514 1524 1229 964 -171 -3371 -653 5323 1133 -6660 -1218 7253 1015 -7008 -567 6013 43
1529 43 -4334 487 2259 -864 5 1067 -2164 -1064 3931 771 -5121 -334 5581 -186 -5256 765
1545 765 4220 -1192 -2604 1507 642 -1611 1458 1555 -3339 -1287 4776 874 -5641 -509 5731 92
1561 92 -5122 125 3729 -318 -1949 168 -302 -17 2469 -394 -4537 785 6083 -1113 -7043 1345
1577 1345 7244 -1287 -6664 1013 5458 -284 -3593 -602 1448 1755 871 -2969 -3050 4036 4865 -4908
1593 -4908 -6213 5273 6880 -5207 -7021 4409 6385 -3177 -5395 1356 3886 698 -2275 -2943
1607 -2943 499 4996 1095 -6686 -2421 7863 3496 -8244 -4089 7919 4431 -6729 -4346 4957
1621 4957 4093 -2594 -3606 -45 3048 2735 -2420 -5173 1801 7099 -1231 -8397 667 8822 -163
1636 -163 -8491 -437 7287 994 -5505 -1685 3174 2317 -696 -2993 -1756 3562 3904 -3993 -5511 4163
1652 4163 6497 -4020 -6731 3534 6297 -2740 -5277 1645 3813 -333 -2094 -1076 343 2436
1666 2436 1267 -3604 -2515 4460 3347 -4875 -3637 4876 3494 -4362 -2955 3441 2102 -2176 -1115
1681 -1115 650 85 844 755 -2299 -1443 3379 1722 -4131 -1795 4275 1469 -3988 -996 3150 374
1697 374 -1956 280 518 -885 1012 1361 -2328 -1568 3397 1692 -3917 -1475 3996 1225 -3429 -755
1713 -755 2442 346 -1029 99 -542 -531 2087 768 -3526 -1030 4452 1054 -5039 -1176 4875 1088
1729 1088 -4285 -1116 3070 1093 -1522 -1156 -288 1195 2117 -1279 -3764 1347 5103 -1277 -5872 1163
1745 1163 6133 -802 -5738 330 4803 334 -3435 -1164 1678 2017 117 -2927 -1912 3594 3420
1760 3420 -4120 -4650 4216 5286 -4011 -5527 3291 5164 -2249 -4478 854 3400 698 -2155 -2350
1775 -2350 808 3811 441 -5022 -1555 5782 2354 -6066 -2971 5771 3246 -4949 -3285 3639 3113
1790 3113 -1982 -2804 99 2359 1791 -1877 -3492 1387 4891 -932 -5762 465 6072 -44 -5789
1805 -5789 -383 4959 769 -3689 -1194 2054 1531 -368 -1944 -1398 2160 2756 -2388 -3858 2374 4390
1821 4390 -2266 -4490 1949 4054 -1431 -3228 823 2157 -23 -870 -710 -311 1492 1439 -2066 -2203
1837 -2203 2536 2692 -2676 -2765 2568 2502 -2230 -1980 1552 1183 -824 -395 -119 -560 910 1204 -1765 -1821
1855 -1821 2237 2034 -2547 -2069 2451 1795 -2045 -1317 1354 714 -426 17 -542 -675 1542 1266 -2343
1872 -2343 -1671 2894 1936 -3072 -1966 2860 1823 -2273 -1533 1340 1144 -207 -676 -1055 177 2227
1888 2227 221 -3231 -637 3922 936 -4223 -1210 4066 1388 -3503 -1544 2530 1591 -1274 -1645
1903 -1645 -170 1621 1587 -1584 -2918 1442 3954 -1238 -4608 918 4828 -498 -4562 14 3888
1918 3888 626 -2844 -1252 1549 1924 -121 -2474 -1252 2915 2463 -3147 -3386 3155 3962 -2867 -4167
1934 -4167 2240 3927 -1484 -3460 418 2636 622 -1736 -1805 679 2757 215 -3581 -1092 4058
1949 4058 1739 -4203 -2193 3969 2421 -3326 -2426 2431 2305 -1235 -1968 -17 1617 1343 -1138 -2442
1965 -2442 746 3332 -338 -3902 -49 4001 312 -3793 -621 3082 748 -2211 -970 1007 1025
1980 1025 145 -1142 -1276 1160 2153 -1179 -2805 1083 3073 -952 -2980 753 2589 -431 -1860 130
1996 130 1032 277 -94 -602 -795 941 1529 -1181 -2058 1318 2295 -1296 -2278 1125 1937 -829 -1428 372
2014 372 721 100 24 -622 -798 1050 1396 -1455 -1901 1587 2085 -1608 -2134 1328 1860 -914 -1445 283
2032 283 833 378 -180 -1107 -476 1716 1052 -2211 -1542 2454 1849 -2422 -1985 2129 1952 -1534 -1746 767
2050 767 1457 171 -1024 -1104 581 1988 -194 -2746 -278 3209 620 -3432 -1025 3191 1214 -2798
2066 -2798 -1460 1964 1525 -1054 -1658 -111 1574 1153 -1488 -2172 1326 2961 -1060 -3433 742 3610
2082 3610 -298 -3408 -117 2945 650 -2146 -1111 1218 1575 -171 -1965 -820 2215 1687 -2347
2097 -2347 -2384 2243 2774 -2039 -2957 1529 2767 -994 -2477 227 1867 519 -1255 -1307 509 1951
2113 1951 164 -2465 -761 2762 1235 -2803 -1541 2618 1716 -2111 -1703 1458 1569 -621 -1293 -237
2129 -237 973 1051 -622 -1767 268 2293 40 -2568 -318 2571 499 -2309 -657 1760 686 -1091
2145 -1091 -753 273 695 479 -631 -1210 555 1711 -467 -2076 331 2135 -206 -1984 30 1611
2161 1611 129 -1027 -337 345 488 349 -611 -978 714 1506 -735 -1818 701 1940 -531 -1810 325
2178 325 1558 -24 -1057 -287 450 618 180 -901 -819 1084 1311 -1260 -1750 1193 1893 -1072 -1947 696
2196 696 1687 -326 -1379 -225 865 754 -326 -1229 -244 1665 764 -1927 -1167 2070 1529 -1936 -1649
2213 -1649 1653 1730 -1120 -1618 514 1392 245 -1110 -979 719 1619 -370 -2183 -34 2486 360
2229 360 -2627 -743 2433 968 -2092 -1219 1470 1314 -749 -1396 -76 1374 870 -1240 -1570 1076
2245 1076 2159 -818 -2475 548 2597 -179 -2426 -157 2085 548 -1550 -919 832 1214 -138
2260 -138 -1460 -571 1594 1165 -1656 -1637 1576 1915 -1356 -2006 985 1915 -560 -1662 36 1241 476
2277 476 -798 -1017 255 1372 208 -1696 -639 1815 943 -1796 -1173 1572 1223 -1202 -1201 712 1064
2294 1064 -130 -804 -406 553 966 -190 -1343 -16 1636 321 -1693 -486 1603 620 -1324 -694
2310 -694 899 668 -436 -655 -169 480 633 -426 -1154 229 1404 -140 -1616 -67 1558 163 -1364
2327 -1364 -355 997 471 -534 -557 38 626 531 -613 -960 644 1357 -517 -1536 405 1595 -147
2344 -147 -1480 -77 1181 342 -795 -618 306 791 178 -1022 -724 1045 1077 -1109 -1477 926 1563 -782
2362 -782 -1622 425 1449 -61 -1184 -380 823 780 -383 -1120 -44 1430 477 -1599 -817 1649 1111
2379 1111 -1500 -1260 1228 1351 -797 -1305 292 1182 256 -948 -781 677 1251 -381 -1625 73 1844
2396 1844 236 -1902 -546 1727 744 -1447 -953 974 1044 -469 -1124 -140 1040 653 -969 -1182 802
2413 802 1495 -596 -1730 371 1782 -95 -1649 -185 1411 484 -981 -699 544 940 -22 -1032
2429 -1032 -425 1104 849 -1071 -1161 983 1328 -787 -1394 475 1269 -220 -1105 -200 743 498 -441 -831
2447 -831 19 1019 303 -1180 -627 1160 804 -1057 -949 848 949 -553 -869 203 739 218 -503 -538
2465 -538 274 874 1 -1032 -221 1166 422 -1152 -576 992 647 -767 -706 387 629 -52 -612 -387
2483 -387 432 691 -333 -1026 105 1165 34 -1254 -233 1153 381 -943 -519 641 615 -255 -662
2500 -662 -152 689 539 -619 -888 531 1159 -357 -1286 204 1320 49 -1163 -280 933 497 -607
2517 -607 -692 221 813 176 -946 -565 929 861 -874 -1125 713 1205 -546 -1278 219 1135 64 -988
2535 -988 -424 668 692 -357 -962 8 1135 313 -1211 -573 1211 846 -1051 -965 837 1057 -489 -1004
2553 -1004 117 938 312 -725 -657 525 979 -298 -1218 5 1315 225 -1321 -473 1148 594 -974
2570 -974 -783 582 799 -260 -847 -197 745 541 -675 -880 526 1078 -349 -1200 169 1199 96
2587 96 -1071 -236 883 475 -575 -602 259 735 116 -775 -402 771 694 -709 -903 539 948 -383 -981
2606 -981 117 855 77 -715 -355 433 504 -176 -722 -134 769 368 -829 -578 739 710 -613 -787 406
2625 406 771 -151 -682 -107 537 385 -344 -575 144 766 84 -852 -265 880 454 -798 -560 639 665
2644 665 -409 -655 123 610 143 -540 -460 388 668 -266 -893 38 923 109 -964 -326 825 409 -685
2663 -685 -578 391 623 -108 -660 -213 617 501 -568 -723 434 935 -273 -971 128 1003 134 -868
2681 -868 -303 724 516 -441 -637 170 721 117 -793 -412 729 633 -696 -841 522 887 -370 -935 88
2700 88 824 103 -735 -380 505 580 -286 -758 44 873 218 -880 -409 827 604 -691 -665 530 783 -238
2720 -238 -725 -13 673 303 -548 -519 360 726 -205 -872 3 885 179 -873 -379 731 475 -584 -601 311
2740 311 609 -66 -624 -220 528 446 -475 -645 331 763 -171 -830 12 803 157 -680 -291 530 440 -304 -513
2761 -513 85 593 188 -567 -383 511 573 -417 -690 282 736 -122 -696 -67 595 232 -466 -432 237 498 -61
2782 -61 -637 -195 604 330 -635 -531 481 579 -380 -643 155 592 17 -542 -212 430 407 -261 -561 112 664
2803 664 77 -707 -221 670 394 -578 -496 425 562 -247 -575 -7 543 211 -493 -454 337 590 -238 -729 28
2824 28 717 101 -741 -283 606 390 -482 -520 240 561 -33 -576 -167 553 418 -462 -560 372 713 -206 -695
2845 -695 73 729 114 -616 -261 513 433 -325 -518 116 608 69 -623 -274 578 431 -510 -585 350 622 -216
2866 -216 -662 11 601 164 -503 -368 344 488 -188 -588 20 631 180 -629 -321 564 454 -418 -513 277
2886 277 572 -81 -539 -87 488 312 -360 -418 255 572 -87 -618 -44 642 184 -566 -308 442 372 -330 -469
2907 -469 119 453 26 -502 -256 391 373 -345 -538 186 574 -71 -582 -81 542 215 -442 -326 317 414 -108
2928 -108 -452 -28 484 230 -417 -339 372 480 -261 -544 130 535 10 -526 -168 415 282 -312 -410 123 461
2949 461 -16 -544 -195 470 293 -459 -443 319 461 -206 -524 54 504 112 -418 -228 348 406 -188 -478 95
2970 95 532 96 -526 -200 514 354 -390 -441 258 462 -89 -484 -84 429 225 -404 -390 281 484 -181 -563
2991 -563 12 542 93 -540 -259 421 310 -328 -436 140 455 4 -472 -166 429 300 -380 -432 277 495
3011 495 -152 -511 41 507 118 -418 -226 333 368 -201 -426 47 469 96 -451 -230 423 322 -350 -432 219
3032 219 446 -102 -483 -72 393 170 -335 -335 216 389 -120 -469 -50 452 158 -439 -265 356 348 -237 -364
3053 -364 139 416 22 -384 -148 372 286 -245 -366 175 439 -41 -448 -53 435 170 -376 -289 263 313 -166
3074 -166 -393 -17 364 123 -373 -268 266 339 -217 -426 115 456 19 -425 -131 389 255 -268 -312 191 383
3095 383 -20 -389 -86 406 246 -314 -298 273 400 -163 -414 41 433 66 -360 -192 287 281 -213 -375 75
3116 75 408 13 -429 -160 367 229 -348 -329 223 363 -121 -395 -24 371 144 -319 -254 244 345 -151 -387
3137 -387 64 440 86 -410 -166 362 282 -260 -333 155 372 -26 -372 -104 341 214 -299 -328 204 362 -124
3158 -124 -426 14 381 57 -371 -199 263 249 -200 -338 61 347 5 -351 -154 311 251 -264 -296 200 375
3179 375 -47 -352 -8 342 128 -265 -203 225 294 -99 -313 0 353 91 -339 -205 271 259 -210 -338 95
3200 95 305 -8 -329 -131 252 186 -215 -294 104 308 -42 -358 -53 327 138 -290 -193 210 265 -121 -279 36
3222 36 301 99 -277 -148 223 266 -142 -298 96 362 3 -346 -79 312 161 -251 -245 148 274 -73 -320
3243 -320 -73 295 149 -295 -250 194 278 -151 -353 45 325 49 -318 -142 262 225 -170 -286 78 336 -1
3264 -1 -311 -116 311 204 -259 -258 215 324 -110 -273 22 300 83 -267 -165 208 239 -142 -311 45 312 34
3286 34 -347 -125 285 174 -272 -263 137 257 -69 -298 -67 266 136 -249 -223 177 289 -111 -302 39 326
3307 326 89 -264 -119 262 207 -169 -228 97 280 12 -261 -89 246 183 -225 -247 136 257 -104 -303 -5
3328 -5 257 35 -269 -150 149 174 -105 -252 3 245 37 -263 -129 242 205 -182 -231 131 288 -28 -213 -55
3350 -55 234 128 -153 -182 130 261 -40 -246 -26 287 122 -226 -163 194 201 -143 -245 47 222 30 -239 -130
3372 -130 171 167 -134 -248 46 251 -5 -259 -63 237 119 -201 -182 126 225 -51 -215 -16 243 114 -183
3393 -183 -170 169 263 -97 -246 61 285 32 -245 -80 228 190 -157 -204 73 226 0 -256 -91 232 140 -212
3415 -212 -249 144 228 -116 -269 8 246 31 -250 -124 191 180 -108 -210 74 256 41 -246 -83 263 170
3436 170 -189 -181 157 242 -52 -224 16 219 90 -184 -132 146 207 -108 -271 6 241 21 -272 -116 214 125
3458 125 -199 -218 95 204 -35 -236 -66 200 133 -163 -176 131 225 -55 -228 17 241 70 -197 -69 185
3479 185 168 -80 -158 48 200 33 -174 -58 175 150 -145 -190 91 198 -59 -225 -29 173 49 -179 -144 99
3501 99 141 -70 -190 -39 182 43 -201 -148 152 165 -115 -188 65 202 -17 -160 -51 156 134 -105 -148 82
3523 82 200 -2 -195 -37 201 99 -184 -127 130 155 -89 -192 -6 152 16 -187 -133 97 152 -116 -221 15
3545 15 202 -11 -230 -79 168 94 -158 -135 97 152 -33 -170 -30 196 105 -136 -112 148 220 -61 -217 46
3567 46 232 35 -190 -62 173 135 -111 -175 54 185 -12 -224 -91 181 98 -184 -192 113 172 -113 -245 17
3589 17 175 33 -181 -98 128 149 -115 -168 33 197 28 -202 -59 193 128 -150 -151 110 167 -62 -164 6 175
3612 175 69 -124 -111 110 159 -64 -192 4 182 15 -206 -99 149 82 -145 -170 31 144 -26 -172 -53
3633 -53 121 61 -131 -140 86 164 -39 -195 16 194 49 -157 -71 137 117 -61 -99 32 175 22 -148 -72 140
3656 140 137 -113 -159 57 145 -45 -186 -26 129 34 -151 -117 56 103 -46 -178 -38 145 55 -176 -112 115 121 -95
3680 -95 -150 39 158 -2 -145 -46 121 123 -48 -115 50 177 26 -166 -26 177 84 -133 -95 100 114 -79 -148
3703 -148 -18 115 33 -147 -119 76 117 -96 -185 17 152 -2 -176 -55 151 85 -120 -124 74 152 -23 -149 -28
3726 -28 152 107 -111 -96 124 160 -65 -181 37 186 37 -165 -56 146 99 -93 -132 39 155 10 -162 -55
3748 -55 137 78 -133 -138 94 119 -67 -168 -14 129 -4 -126 -88 101 91 -75 -142 40 171 25 -155 -56 159
3771 159 110 -121 -113 110 153 -19 -126 11 113 54 -105 -84 76 135 -58 -143 -4 134 8 -152 -63 116 60
3794 60 -125 -110 32 98 -46 -139 -45 107 48 -100 -116 60 128 -22 -131 20 140 39 -101 -18 113 107 -41 -97
3818 -97 36 135 69 -79 -70 116 98 -76 -111 49 117 -26 -131 -25 98 36 -103 -117 49 101 -48 -131 -23 93
3842 93 23 -138 -93 87 98 -63 -122 26 122 -4 -105 -45 98 79 -61 -99 32 131 3 -143 -31 151 74 -111
3866 -111 -80 85 87 -60 -131 -14 99 6 -127 -89 39 100 -72 -145 -1 122 -28 -160 -67 107 53 -114 -116 60
3890 60 104 -43 -110 -9 131 60 -100 -95 100 130 -54 -121 38 151 26 -112 -41 105 60 -95 -91 32 121 -1
3914 -1 -134 -40 105 41 -129 -131 65 76 -94 -141 -4 96 -3 -115 -74 64 96 -65 -103 24 123 30 -123 -31 119
3939 119 80 -86 -69 77 112 -11 -100 -11 103 44 -88 -68 71 120 -49 -121 5 101 2 -141 -60 76 39 -90
3963 -90 -89 11 64 -33 -119 -57 54 53 -88 -108 44 88 -36 -117 15 113 28 -90 -47 89 94 -27 -60 28 124 19 -88
3990 -88 -48 106 94 -63 -88 40 99 -20 -111 -30 87 42 -82 -78 41 72 -27 -123 -24 89 33 -125 -88 73 70 -75
4016 -75 -93 27 99 9 -95 -39 81 63 -45 -84 43 110 3 -85 3 126 53 -91 -59 71 102 -25 -94 13 92
4041 92 24 -102 -66 59 81 -70 -125 9 93 -16 -131 -43 81 35 -91 -85 42 79 -31 -115 -4 109 65 -81
4065 -81 -66 82 97 -36 -114 33 141 13 -89 -13 89 74 -68 -82 30 83 -1 -112 -46 74 48 -106 -96 48
4089 48 65 -68 -107 -30 65 -6 -99 -50 63 56 -54 -97 27 106 -6 -97 -37 113 64 -58 -59 67 98 -21 -76 11 104
4116 104 56 -37 -64 61 96 -40 -96 7 81 -9 -111 -35 82 40 -68 -83 8 54 -19 -91 -29 74 45 -68 -92 46
4142 46 90 -33 -87 1 91 35 -68 -27 74 88 -24 -64 29 93 37 -86 -21 83 86 -48 -93 39 99 -33 -97 -25
4168 -25 71 25 -67 -60 30 80 -31 -109 -31 80 10 -109 -58 71 58 -64 -100 18 75 -2 -90 -4 99 64 -48 -38 62
4195 62 109 -6 -79 -7 98 55 -96 -42 84 79 -34 -100 10 95 11 -87 -57 69 51 -78 -108 15 80 -26 -100 0
4221 0 84 33 -77 -63 32 58 -34 -81 8 83 22 -67 -39 82 76 -58 -75 51 110 3 -80 5 81 53 -58 -68 54 102
4249 102 8 -93 -17 84 41 -104 -70 43 28 -49 -110 3 78 -12 -95 -58 37 42 -49 -86 22 69 -13 -74 3 100 48
4276 48 -69 -40 42 80 -39 -57 19 96 46 -59 -39 67 77 -15 -88 5 78 8 -99 -35 50 34 -72 -83 19 50 -23
4303 -23 -98 -51 64 33 -77 -84 25 73 -47 -91 11 72 36 -71 -14 75 70 -27 -54 26 88 13 -61 -18 69 79 -75 -54
4331 -54 32 81 -31 -79 -8 54 35 -86 -50 24 67 -40 -112 -32 82 15 -110 -62 63 46 -72 -87 12 73 7 -82 -35
4358 -35 74 58 -59 -57 43 85 -13 -71 17 101 32 -78 -34 70 67 -47 -76 19 75 -9 -99 -47 31 24 -60 -108 18 62
4386 62 -38 -91 -35 50 -8 -83 -64 39 51 -35 -78 -17 67 17 -80 -52 81 73 -29 -50 25 97 -6 -59 5 77 63 -47
4414 -47 -52 37 98 -7 -58 -26 70 26 -71 -62 27 54 -70 -96 -8 34 -7 -79 -35 37 33 -24 -84 21 66 -12 -92 -24 82 39
4444 39 -42 -38 58 83 -7 -46 8 86 38 -58 -42 58 61 -32 -61 13 77 -2 -77 -34 55 42 -51 -82 -19 41 -7 -97 -32 21 14
4475 14 -79 -82 23 65 -42 -89 -7 86 6 -58 -25 49 54 -26 -54 41 99 32 -61 -28 77 51 -67 -66 49 57 -27 -74 -14 70
4505 70 41 -69 -78 38 40 -53 -111 -17 67 -9 -96 -76 34 24 -80 -87 28 64 -13 -73 -25 65 56 -67 -72 52 100 3 -65
4534 -65 13 90 32 -51 -29 81 63 -40 -69 15 80 3 -72 -46 48 70 -46 -88 15 57 -40 -98 -38 54 14 -81 -57 33
4562 33 51 -19 -67 -10 70 9 -62 -28 64 70 -42 -48 34 84 17 -49 0 79 59 -41 -42 23 73 -10 -79 -10 56 25 -74 -67 11
4593 11 25 -56 -75 -19 31 -13 -91 -74 27 39 -48 -83 -11 56 3 -60 -15 56 44 -41 -43 56 79 -4 -48 -9 69 32 -41 -31
4623 -31 47 52 -21 -65 2 83 8 -80 -55 42 46 -46 -64 5 44 -23 -98 -45 40 19 -80 -82 10 38 -26 -72 7 83 14 -51 -43 54
4655 54 66 -23 -61 12 89 31 -56 -28 77 76 -28 -45 34 78 -12 -57 -13 59 27 -76 -58 40 50 -44 -86 -15 61 -7 -97
4684 -97 -46 52 21 -59 -79 2 40 5 -64 -16 78 39 -34 -33 54 68 10 -57 16 74 43 -29 -18 42 50 -12 -48 14 58 18 -57
4715 -57 -48 47 21 -44 -83 2 54 -38 -70 -22 40 24 -62 -52 16 57 -23 -66 -5 55 15 -62 -57 71 56 -20 -45 23 37 8 -43
4746 -43 -23 72 61 -33 -39 12 55 -3 -71 -29 44 36 -64 -49 -3 40 -37 -72 -28 36 2 -86 -69 22 37 -35 -71 -19 51 5 -76
4777 -76 -14 48 64 -31 -27 33 63 15 -36 22 76 76 -26 -44 65 96 -16 -52 10 71 18 -48 -44 12 36 -44 -63 -21 67 -10
4807 -10 -81 -59 46 29 -68 -62 18 55 -26 -65 -2 51 16 -45 -40 44 48 2 -55 16 84 31 -61 -24 75 48 -34 -36 41 67 -15 -41
4839 -41 1 45 37 -54 -65 10 35 -22 -71 -22 47 8 -77 -43 40 29 -51 -62 5 41 2 -56 -18 34 42 -24 -49 28 68 -9 -61
4870 -61 17 70 41 -27 -9 35 51 -8 -37 -8 57 45 -41 -32 45 31 -48 -71 -14 27 -21 -62 -19 30 11 -51 -55 16 47 -4 -45
4901 -45 -29 43 40 -64 -43 44 57 -3 -15 29 61 19 -21 -8 47 57 -5 -35 16 72 3 -55 -4 57 37 -53 -54 15 57 -11 -55
4932 -55 -36 50 15 -62 -42 18 42 -21 -55 -5 53 21 -62 -31 52 47 -12 -30 39 71 18 -42 -11 57 47 -13 -45 44 63 1 -70
4963 -70 25 72 31 -31 -34 11 46 -8 -49 1 39 -1 -72 -51 40 19 -50 -69 28 59 -28 -67 -39 42 16 -46 -36 34 53 -8 -61
4994 -61 26 79 43 -60 -6 55 48 -21 -35 34 54 7 -43 -13 48 25 -23 -44 15 41 -15 -76 -40 33 13 -75 -40 29 24 -37 -41
5025 -41 -8 26 -9 -55 -26 22 16 -31 -56 14 61 1 -39 12 55 27 -19 -7 29 49 -10 -33 9 37 22 -34 -28 39 35 -36 -56 -17
5057 -17 29 -32 -54 -45 6 1 -44 -56 -20 20 3 -59 -44 34 25 -45 -42 24 35 -9 -26 12 42 44 -6 -17 31 43 -12 -43 4 56 32
5090 32 -47 -19 55 43 -40 -53 2 42 -12 -34 -28 30 17 -56 -51 8 39 -37 -62 -12 46 -6 -53 -40 35 28 -30 -50 25 69 32 -19
5122 -19 -15 52 42 -15 -38 39 70 8 -47 -6 67 47 -25 -37 23 21 -11 -62 -10 44 12 -48 -35 25 38 -59 -72 -1 17 -26 -60
5153 -60 -21 35 22 -42 -34 8 48 7 -41 11 56 47 -35 -8 56 37 -23 -30 29 41 12 -31 -10 13 21 -32 -31 -10 36 -6 -88 -16 47
5186 47 3 -57 -36 8 20 -9 -49 -22 25 13 -37 -40 10 30 -38 -39 -3 31 6 -18 5 49 42 -27 -3 51 59 14 -26 -2 21 31
5218 31 -34 -34 15 35 -14 -51 -13 24 -9 -35 -24 -2 10 -29 -51 -30 4 27 -39 -43 31 16 -54 -49 20 32 0 -33 -4 41 40 -14
5250 -14 -20 40 73 29 -3 -6 77 48 -34 -17 50 53 -6 -37 4 28 6 -44 -36 27 21 -38 -53 -18 43 -20 -54 -26 28 28 -60 -41 20
5283 20 40 -13 -36 -1 53 31 -28 -15 37 50 -23 -36 23 72 -14 -53 11 53 21 -22 -21 25 21 -14 -29 5 22 14 -44 -43 17 28
5315 28 -47 -60 0 26 -40 -55 -15 19 -1 -27 -21 -3 25 -9 -38 1 46 37 -23 -7 51 21 -13 -27 21 32 2 -19 -21 35 28 -23
5347 -23 -30 -6 21 -24 -25 -47 19 4 -40 -47 4 -15 -21 -24 -38 -15 -6 -33 -44 5 9 -25 -42 -2 37 18 -17 -7 38 24 -2 1 11 32
5381 32 25 -8 -3 33 35 -10 -29 22 33 -16 -33 -12 9 1 -17 -31 -3 9 -14 -46 -40 7 -8 -51 -56 14 29 -38 -49 9 26 -5 -30
5414 -30 1 32 24 -8 0 14 54 29 -49 8 65 22 -28 -29 25 38 -17 -50 11 21 -12 -56 -31 -2 27 -32 -68 -19 37 -11 -64 -45
5446 -45 36 -5 -56 -19 28 8 -20 -34 -2 31 16 -27 -5 40 41 -10 -22 30 64 8 -38 7 49 18 -15 -2 24 18 1 -30 -15
5477 -15 39 11 -28 -55 20 22 -26 -55 2 -1 -29 -42 -16 1 -5 -24 -19 -18 15 10 -31 -4 31 40 -15 3 11 32 -8 -6 24 28 28 -3 -14 19
5513 19 22 16 -26 0 20 -8 -35 -1 21 3 -45 -25 -19 6 -10 -22 -36 -9 6 -11 -28 -15 24 8 -29 -11 31 8 -7 8 37 38
5545 38 2 8 17 33 25 5 -7 15 58 2 -28 18 58 5 -31 -8 26 10 -31 -28 0 13 -14 -40 -20 16 18 -26 -36 10 17 -20 -51
5578 -51 22 41 -1 -33 -24 26 27 2 -10 3 64 31 -25 21 66 38 -21 -16 50 54 -17 -23 8 7 -7 -28 -36 20 15 -27 -64 -11 34 4
5612 4 -64 -15 27 -6 -37 -26 32 35 -18 -13 12 30 13 -16 -18 35 34 -15 -8 47 60 16 -17 11 42 18 -6 8 17 9 15 -15 -2 15 19
5647 19 -35 -34 7 3 -27 -26 -1 15 -3 -39 -24 -13 -24 -8 3 -9 20 12 -24 -8 47 12 -14 -6 31 18 6 -4 15 18 25 6 -7 -11
5681 -11 16 17 -17 -16 1 18 -27 -32 2 4 -28 -37 -10 -31 -5 -12 -25 -17 -7 3 -49 -18 10 11 -39 -16 25 12 -27 -21 9 25 8 -21 -13
5716 -13 47 31 16 -11 32 35 -4 -32 0 43 6 -42 -6 32 -11 -9 -29 -19 5 0 -44 -25 2 20 -33 -55 17 22 -43 -47 -7 19 -1
5749 -1 -35 -12 27 28 -18 -14 -2 53 35 -8 18 42 37 -31 -2 36 36 -16 -11 13 30 6 -33 -7 16 1 -10 -49 14 21 -18 -46 -14 34
5783 34 -15 -55 -34 17 14 -10 -10 4 33 13 -11 -19 34 29 -10 -15 26 38 15 5 -9 26 26 4 16 28 19 -7 -8 -8 5 20 -21 -17 12
5818 12 12 -17 -22 -1 -4 -14 -24 -5 -30 1 15 -12 -16 -2 17 -18 -7 21 27 -2 12 21 23 21 13 4 8 13 16 9 5 24 27 -12 -9 26 31 -14 -24
5857 -24 4 5 -7 -15 -11 7 -7 -7 -22 -26 17 -18 -40 -38 23 15 -28 -23 37 32 -10 1 9 28 17 0 -7 21 35 19 -14 23 48 2 -18 1
5893 1 55 -1 -24 -4 18 10 -29 -20 -12 -1 2 -24 -22 4 9 -35 -65 31 23 -25 -25 6 27 8 -25 -8 13 22 9 -20 21 22 24 -24 -2 54
5929 54 46 -8 -8 19 35 -9 -22 1 31 1 -31 -12 18 16 0 -19 -7 17 -22 -43 -4 23 5 -36 2 26 11 -13 -10 3 -5 9 4
5962 4 -16 20 27 -4 -11 12 27 -3 -6 10 21 5 -3 23 12 9 1 7 7 22 5 -10 -23 -5 2 -19 -19 -18 -18 -20 -15 7 -22 -20 1 -12 -22 -21 18
6001 18 -17 -41 -17 14 -11 -8 -10 38 12 10 14 -2 13 31 11 -6 18 35 -8 -5 20 31 -14 -17 13 10 -20 -35 -33 13 -6 -11 -44 -24 14
6036 14 -3 -44 -26 26 11 -28 -26 13 4 -2 -5 9 10 23 2 4 14 49 5 -20 19 45 -7 -25 11 46 9 -32 -1 10 16 -25 -21 -15 13
6071 13 -22 -11 -33 0 1 -46 -52 -4 22 -37 -49 -1 22 -27 -41 -16 23 -21 -17 -11 8 38 16 -23 8 55 40 -14 19 28 17 -8 -3
6104 -3 42 21 -11 -3 2 -15 -3 -18 -36 -19 15 -31 -54 -11 -3 -11 -46 -18 -13 -26 -13 -7 -14 -2 -22 7 -10 -2 44 -12 -13 27 23 -3 8 23
6140 23 21 6 16 14 2 4 5 16 -2 6 15 0 -23 -29 -8 0 -33 -21 -7 -13 -7 -5 -38 2 11 -12 -35 0 3 -8 -46 -9 23 1 -14 7 36
6177 36 29 15 5 7 10 29 -19 5 37 22 -6 -8 11 19 -5 -5 12 3 -18 -33 -22 -1 15 -8 -30 -17 8 -17 -58 -38 19 14 -31 -18
6211 -18 16 16 -14 6 3 19 15 8 -20 21 39 2 -19 29 45 -5 -37 13 49 -3 -24 4 24 -8 -21 -16 -5 9 1 -54 -28 4 4 -30
6245 -30 -52 2 7 -37 -36 12 11 -25 -14 -1 14 3 13 7 -6 12 17 3 13 41 33 -11 -4 30 26 9 13 12 25 -16 -3 -10 -3 6 -20 -3 -16
6282 -16 -3 -7 -31 -17 -1 -18 -57 -7 6 -20 -24 1 9 0 -3 22 -3 -4 27 11 8 19 31 19 23 6 9 3 14 25 13 -3 33 27 -7 -4
6318 -4 12 -2 -22 -16 1 -19 -22 -26 -29 -13 -3 -4 -23 -18 1 -23 -46 0 21 -4 -18 -6 27 -7 0 14 11 20 15 -4 2 23 15 -6 -17 33 50
6355 50 9 -8 38 37 3 -26 11 27 -1 -13 -11 12 10 -6 -27 6 28 -3 -34 -23 16 10 -38 -18 19 21 -19 -2 21 21 -1 -28 5
6388 5 39 25 11 5 12 47 -6 -15 21 34 9 -22 -8 18 2 -26 4 2 12 15 0 -25 4 17 -54 -41 12 9 -42 -27 11 6 -17 -32
6422 -32 17 -1 16 10 10 2 33 22 -6 6 30 22 -3 10 25 37 1 22 26 25 -11 15 10 -10 -4 11 -6 -23 8 -15 -22 -5 -5 -18 -23 7
6458 7 -14 -26 -1 -11 -20 -6 -1 18 -2 -4 20 7 8 13 15 15 5 23 8 13 14 28 3 15 15 11 -7 -8 33 -2 -5 -13 11 5 -20 -19 7 -4 3
6497 3 -26 -15 3 -2 -18 -44 -14 20 -17 -35 -1 10 -9 -15 20 26 18 -5 -13 0 40 25 -11 7 41 33 -14 -13 38 38 -32 -14 17 -1 -5
6532 -5 -24 -4 10 32 -13 -20 -2 15 0 -60 -20 20 13 -19 -11 21 16 -20 -9 11 3 2 -3 -1 28 16 7 -7 50 27 0 6 15 30 -4 2 24
6569 24 22 -5 -17 14 25 -12 -16 -13 -16 -4 -1 -23 -31 13 -4 -43 -7 5 1 -18 -15 -10 2 10 4 -6 4 0 13 -2 23 32 9 9 23 31 35 29 22
6608 22 22 -14 11 33 21 0 -4 9 -2 4 12 11 -19 -16 -10 -17 -19 -5 -10 -6 -12 17 -18 -25 16 6 -22 -25 9 15 -11 -2 7 2 24 19 6 -6 41 7
6648 7 5 2 37 17 -14 -13 21 20 -5 -9 4 10 -21 -25 2 4 13 -24 -21 -1 4 -22 -30 14 22 -19 -18 1 22 -14 -19 5 13 1 6 -2 22 21 23 3 -10
6689 -10 25 23 -25 -8 17 21 -22 -24 5 28 -19 -7 -14 -5 6 -5 -22 -10 11 -19 -46 -11 12 -30 -41 -5 19 3 -17 -14 6 -11 -3 -11
6723 -11 9 31 21 14 10 23 31 3 -5 42 25 -4 21 18 24 -3 -15 29 11 -17 19 -6 -5 -7 -11 -18 -11 9 3 -25 -5 10 -4 -18 5 16
6759 16 -10 -22 -5 15 -7 -4 5 14 4 18 -13 1 29 22 -1 7 17 35 -9 19 21 17 -26 -4 22 -7 -24 -17 -18 -5 -24 3 -11 8 -1
6794 -1 -6 -6 -20 14 -9 -35 24 34 -18 -9 14 19 -9 -21 -11 26 2 9 2 15 34 18 3 10 50 28 -9 2 40 8 2 0 26 17 -4 -4
6830 -4 7 15 -8 -17 -20 -6 7 -16 -37 -14 26 -30 -42 -1 25 -6 -7 26 25 24 -4 0 3 27 24 3 14 27 30 -9 -15 38 17 -9 2 -8
6866 -8 17 -8 4 2 7 1 -20 -19 -8 12 7 -38 -24 5 -16 -36 -14 0 -20 -27 0 30 -1 -2 5 11 18 -3 14 13 32 11 2 6 26 34 4 7
6904 7 32 17 -13 -2 19 -9 -18 -14 -6 -16 -16 -6 -16 -22 -21 -3 -17 -9 -12 -31 -22 13 2 -13 -4 11 20 -8 1 23 18 22 14 25 9 11 33 5 1
6943 1 40 31 -6 9 39 14 -13 0 7 -4 -14 -13 12 -11 -10 9 -18 -22 -4 -32 -25 10 0 -26 -33 8 6 -19 -22 10 19 -16 -10 5 9 1 15
6980 15 27 13 29 13 -6 26 40 20 -15 0 38 11 -18 10 27 5 -12 -9 3 -2 -27 -9 -17 -7 15 -30 -28 -9 -9 -31 -34 9 6 -14
7014 -14 -32 -15 26 9 -5 -12 17 12 18 9 -5 13 20 -10 6 20 -4 -21 9 24 5 -12 10 8 3 -9 -12 6 -13 -13 -2 -22 9 -7 -18
7049 -18 -20 -1 6 -25 -31 8 13 -9 -4 -8 5 6 1 -3 18 10 8 10 3 29 11 -2 -3 24 22 -14 17 23 -2 -13 -9 -3 -16 -11 -12 -8 -10 -17 -6 -22 -10 7
7091 7 -7 -40 -3 5 -26 -28 10 3 -26 -1 2 11 1 7 15 9 7 -2 5 15 27 18 -6 3 33 5 -1 9 23 0 -50 -2 12 -15 -19 -21 -6 -6 -24
7130 -24 -24 -12 8 -2 -26 -26 9 10 -26 -15 26 1 -6 -10 19 17 5 23 17 16 24 -5 -4 22 28 7 -19 -1 40 2 -17 20 6 4 -17 -6
7166 -6 11 8 -6 -19 -16 3 -4 -30 -28 -5 -6 -21 -25 12 2 -12 -8 2 17 0 15 -7 25 11 15 12 6 13 10 10 3 26 -4 -11 11 33 -2 -5 7
7205 7 14 -1 -11 7 -4 -11 -2 -27 -19 -13 -1 -20 -36 13 -14 -18 -11 -3 -5 -24 -17 15 2 -1 16 12 22 3 16 26 22 9 14 10 19 24 6 -6 17
7244 17 13 -10 -12 3 6 -13 -19 23 4 -16 -14 -22 -18 -13 2 -16 -28 1 11 -40 -21 18 7 -19 -28 10 13 -10 -7 17 28 22 23 -2 14 31 8
7281 8 -26 19 25 12 -7 20 29 -14 -25 -6 18 0 -25 -17 -16 -10 -15 -33 -14 12 -8 -28 -19 7 2 -23 -15 20 12 -2 -14 -2 6 -14 6 5 7
7318 7 12 2 -5 29 27 14 -3 16 18 7 -15 4 29 -7 -19 3 4 10 -16 -7 -22 -4 -18 -31 5 -20 -15 -35 -32 13 28 -15 -3 5 15 -1
7354 -1 -14 5 -5 -10 10 7 12 12 14 5 3 33 24 2 19 30 -5 0 11 7 4 -5 0 2 -9 -2 -3 -4 -4 9 -26 -17 0 -9 -13 -29 2 -7 -27 -14 -3 -1
7396 -1 -10 10 -18 -2 4 12 8 20 20 17 29 37 21 18 3 20 32 -4 -9 3 11 0 -15 -2 26 -1 -8 -3 -13 -1 7 -10 -19 10 -21 -22 -16 4 12
7435 12 -34 6 25 26 -16 14 18 17 10 16 10 24 35 17 -11 20 28 3 4 13 30 5 -2 16 27 -12 -17 -14 0 -4 21 -14 -12 1 -16 -24 -17 8
7473 8 4 4 -1 24 17 0 -20 2 27 -2 -1 12 22 16 -13 14 26 33 13 8 27 25 23 -8 0 17 11 -2 1 4 3 -1 -8 -23 -2 -5 -13 -18 -2 -14 -28
7514 -28 -12 17 -5 -8 -8 -5 10 -4 0 39 14 8 19 7 5 20 43 3 16 28 -8 9 42 23 4 4 18 31 -1 6 13 -6 -11 -11 3 -10
7550 -10 -11 -8 -2 -6 -19 -11 -20 -15 0 -2 -28 -24 9 -33 -19 15 14 -1 -3 -11 14 17 6 5 16 27 34 4 0 3 19 6 -20 10 13 4 2 12 11 -3 -15
7591 -15 -4 0 10 -17 -14 -9 12 -2 -24 -13 -2 -8 -19 -8 18 7 -18 2 11 -2 0 19 -1 26 19 9 12 18 20 12 1 41 40 8 -3 11
7627 11 14 -1 -4 -8 -2 -25 -19 -4 -19 13 9 -16 5 17 -8 -11 1 19 18 -19 -3 -11 8 5 -1 26 16 9 20 2 -1 7 6 0 28 11 10 -12 14
7666 14 16 -1 -3 -3 6 -14 -10 -17 -5 -21 -2 3 -7 -16 -10 -9 -18 2 -6 -10 4 34 4 7 -5 12 4 5 19 -2 8 16 15 17 23 7 11 2 20 23 18 19 13
7709 13 30 -8 -14 12 23 -14 -5 -9 -10 -19 -9 -9 -3 -5 -18 -15 -4 -1 -6 -15 7 14 16 -23 19 32 9 -8 -2 21 15 23 18 12 23 27 10 0 22 15 -2
7750 -2 1 21 38 -5 -8 17 11 -19 -6 -3 29 -37 -16 -3 -4 10 -4 -18 -9 -3 -22 -25 -9 30 -4 -17 -3 20 6 -14 9 21 25 22 14 15 30
7787 30 33 3 11 16 33 7 11 17 31 -8 9 11 9 4 3 4 -1 12 2 -17 -4 26 -14 -27 -14 12 10 -9 -3 7 17 -7 -1 13 11 9 21 -12
7825 -12 18 29 10 13 30 27 15 4 8 39 19 -2 7 20 14 -5 1 4 0 -1 8 -6 -8 -7 -12 -17 -11 -3 -20 2 26 -22 -12 -3 14 -3 4 28 20 10
7865 10 9 18 20 15 17 23 22 25 37 14 -9 24 24 9 13 16 -4 -23 -4 3 -3 -13 -11 2 -10 2 -17 -7 -4 4 -19 -14 6 -5 -1 11 10 16 19 -12 25
7906 25 30 19 24 23 28 12 0 11 2 19 30 -3 6 34 21 -10 -16 -2 -4 4 -3 2 3 -7 -27 -15 -9 -16 -36 -14 -5 3 -16 -3 -14 -12 17 0 4
7945 4 30 -6 -3 12 18 9 33 14 8 11 14 22 18 33 23 17 12 22 -3 -6 -9 9 7 -1 -29 -13 1 4 -8 -15 4 -3 1 -15 -23 0 -4 -6 -13 13 6 -18
7987 -18 3 1 7 4 13 5 2 5 22 4 29 27 30 8 23 -1 13 17 17 22 5 -10 14 19 -6 9 8 6 -4 -19 -13 -19 0 -8 -13 -6 0 -18 -2 2 2 16
8029 16 9 8 9 -1 15 22 2 16 9 29 21 22 4 -3 20 34 26 8 16 7 17 -24 -11 19 9 -4 -1 9 0 -5 -10 -27 -9 7 -16 -22 -8 -9 -5
8068 -5 -16 3 12 10 -4 -6 32 35 4 20 8 13 12 7 12 -2 25 -14 4 34 21 18 12 3 11 -4 1 8 11 -16 -8 -1 6 -11 1 -22 -3 -18 -6 -19
8108 -19 -8 23 2 0 -2 16 -2 -8 28 27 -3 -4 21 21 23 34 18 15 1 12 4 9 15 5 19 7 2 5 -21 -14 -5 -5 -8 -11 -17 6 7 -29 -21 -1 -13
8149 -13 -14 -24 -7 0 4 -19 -2 -3 9 -19 8 26 13 -1 14 1 11 10 28 8 15 1 15 20 27 38 8 8 18 7 8 -16 6 4 -16 2
8185 2 -17 -12 -11 -22 -12 -9
8191i
$$ Imaginary data points
##PAGE= N=2
##DATA TABLE= (X++(I..I)), XYDATA
0 0 0 0 0 0 0 0 0 0 0 0 0 0 0 0 0 0 24 -24 24 -24 24 -24 48 -48 48 -72 72 -96 96 -120 122 -145 168 -192 217
35 217 -241 266 -313 337 -385 433 -480 529 -579 648 -711 786 -866 954 -1050 1156 -1275
52 -1275 1408 -1552 1716 -1894 2107 -2346 2624 -2950 3344 -3828 4432 -5221 6293 -7844 10288
67 10288 -14764 25473 -104900 -944 256676 -20573 -199998 -15825 162521 27466 -91896
78 -91896 -61572 32466 83145 37963 -112934 -90378 128799 137432 -142643 -160178 141448 170850
90 170850 -133387 -160604 110086 140827 -78649 -108230 35823 72104 9103 -33521 -56152
101 -56152 -58 96901 27023 -131376 -44596 152920 53366 -161391 -53421 153740 46969
112 46969 -131921 -35277 98392 22579 -56846 -10509 12449 2937 30898 469 -68069 1561
124 1561 95504 -7632 -109980 16974 110642 -27810 -98861 37393 76361 -44273 -47503
135 -47503 45824 15304 -42462 15038 33582 -40073 -20528 56215 4387 -61763 13105 56833
147 56833 -29340 -41971 42904 20254 -51544 5984 55251 -32213 -53464 55066 47037 -70917
159 -70917 -37069 77104 24756 -72951 -12600 57978 1623 -34330 6007 3904 -10288 29173
171 29173 10805 -61441 -8292 88725 3886 -107514 1247 115993 -4770 -112368 5910
182 5910 97673 -2756 -72701 -4344 40774 15415 -5179 -29311 -30483 43962 62242 -57812
194 -57812 -87777 67662 104086 -72269 -110956 69178 107525 -58372 -95416 39702 76229
205 76229 -14441 -52394 -15049 26799 46456 -1445 -75869 -20904 100708 39303 -117244 -52091
217 -52091 123915 59576 -119043 -61876 102772 59894 -76495 -55124 42142 48249 -3756
228 -3756 -41193 -35630 34110 71323 -28078 -100354 22604 119400 -17623 -126902 12510 122505
240 122505 -6347 -106656 -876 82010 10151 -50813 -20561 17272 32225 15529 -43695
251 -43695 -44142 53867 65974 -61294 -79443 64517 83552 -62946 -79244 55574 67247 -43168
263 -43168 -50256 25992 30316 -5918 -10324 -15375 -7309 35975 21020 -53330 -29019 66029 31480
276 31480 -72142 -28214 71436 20822 -63633 -10648 49858 -233 -31720 9737 11199 -16553
288 -16553 8853 19164 -26710 -17597 39762 11518 -47045 -2342 47561 -8846 -41675 20302
300 20302 30640 -30198 -15870 37406 88 -40370 14949 39248 -26467 -33603 33206 24517
312 24517 -33805 -12899 28147 133 -17076 12033 1678 -22863 15459 30789 -32715 -35717
324 -35717 46979 36966 -56607 -35235 59665 30935 -55416 -24935 44099 18495 -26300 -12144
336 -12144 4477 7275 19799 -3402 -43216 1399 63579 -479 -78058 273 85195 64
348 64 -84087 -1539 74537 4346 -58014 -9459 35715 16155 -10589 -24494 -15238 33212 38995
361 38995 -41166 -58532 46993 72179 -49188 -78661 47102 78222 -39736 -70871 27698
372 27698 58332 -11155 -41769 -8121 23399 28624 -5007 -48300 -11801 64837 25406 -76596
384 -76596 -35361 81641 40818 -79563 -42437 69895 40478 -53650 -36109 32160 30350 -7458
396 -7458 -24150 -17672 18700 41243 -14021 -60401 10749 73599 -8359 -79316 6612 77347
408 77347 -4838 -68120 2358 52772 1105 -33426 -6031 12052 11893 8593 -18854 -26804 25560
421 25560 40471 -31480 -48605 35590 50700 -36912 -46854 35279 38375 -30140 -26287 22166 12932
434 12932 -11702 318 -74 -11493 11924 19161 -22757 -22903 31135 21996 -36431 -17290 37597
447 37597 9201 -35048 335 28687 -10282 -19712 18622 9142 -24347 1630 26547 -11036
459 -11036 -24490 18161 18840 -21605 -9755 21496 -1043 -17432 12643 10527 -23325 -1616 31920
472 31920 -7857 -37421 16200 39024 -22316 -36989 24584 31166 -22932 -22781 16764 12430 -7181
485 -7181 -1619 -5292 -8907 18710 17853 -31520 -24626 42170 28906 -48727 -30348 50476 29492
498 29492 -46469 -26546 37190 22362 -23116 -17642 5764 12952 13106 -9027 -31836 5728 47876
511 47876 -3501 -59973 1600 66292 42 -66458 -2085 60231 4991 -48295 -8886 32032
523 32032 13982 -12992 -19754 -6663 25973 25254 -31489 -40790 35571 52015 -37232 -58058 35761
536 35761 58475 -30945 -53931 22422 44822 -11142 -32886 -2461 19124 16803 -5421 -30769
548 -30769 -7084 42806 17384 -51435 -24456 55898 28396 -55188 -28890 49633 26912 -39195
560 -39195 -22843 25214 17928 -8890 -12880 -8183 8560 24074 -5544 -37571 3630 46790 -3200
573 -3200 -51375 3382 50483 -4088 -44778 4376 34801 -3891 -21937 2348 8025 643 5979
586 5979 -4455 -17583 9149 26398 -13686 -30999 17874 31516 -20711 -27879 21871 20931 -21081
599 -21081 -11939 18094 2022 -13497 7092 7377 -14513 -759 18881 -5899 -20005 11574 17530
612 17530 -15780 -11950 18006 4097 -17880 5081 15807 -13968 -11768 21714 6843 -26843
624 -26843 -1409 28857 -3356 -27228 6812 22057 -8360 -14098 7664 4100 -4850 6785 106
637 106 -17260 5462 26139 -11230 -32588 16003 35865 -18931 -35649 19300 32205 -16623
649 -16623 -25829 11089 17566 -2973 -8187 -6828 -1356 17132 10032 -26925 -17278 34719 22297
662 22297 -39657 -25176 40646 25633 -37642 -24294 30395 21368 -19681 -17639 6478 13629 8119
675 8119 -9767 -22398 6556 35167 -3727 -44695 1659 50345 304 -51063 -2116 47127
687 47127 4350 -38728 -7095 26856 10356 -12829 -14293 -2021 18204 15899 -22027 -27997 24730
700 24730 36587 -26079 -41453 25348 42064 -22405 -38746 17245 32222 -9895 -23263 1285
712 1285 13317 8329 -3203 -17606 -5646 25989 12840 -32286 -17461 35893 19585 -36334
724 -36334 -19220 33344 16795 -27327 -13171 18578 8827 -8391 -4887 -2779 1518 13197 551
737 551 -22024 -1228 28460 681 -31526 921 31242 -2922 -27476 4996 21080 -6346
749 -6346 -12726 6894 3705 -6148 5167 4165 -12430 -1193 17376 -2442 -19603 6152 18723
762 18723 -9607 -15208 12191 9521 -13640 -2599 13715 -4550 -12378 10966 9908 -15593 -6476
775 -6476 17958 2750 -17462 982 14359 -4075 -8847 6246 1507 -7282 6593 6934 -14474
788 -14474 -5644 21011 3574 -25687 -1346 27471 -691 -26314 1911 22153 -2045 -15471
800 -15471 893 7135 1633 2377 -4939 -11483 8821 19613 -12363 -25696 15250 29368 -16539
813 -16539 -30131 15958 28131 -13250 -23733 8375 17386 -1977 -10182 -5869 2368 13685 4778
826 4778 -21189 -11006 27152 15602 -30953 -18476 31955 19599 -29754 -19027 24673 17335
838 17335 -16712 -14686 7037 11858 3876 -8948 -14593 6360 24283 -4182 -31809 2400 36310
851 36310 -991 -37467 -486 34929 1889 -29292 -3819 20883 5940 -10961 -8588 376
863 376 11334 9678 -13875 -18200 16070 24467 -17299 -27795 17425 28226 -15999 -25798 13146
876 13146 21076 -8816 -14809 3436 7891 2673 -976 -8949 -5087 14471 9516 -19053 -12265 21925
890 21925 12993 -22845 -11977 21534 9548 -18153 -6185 13075 2654 -6747 685 -125 -3183
903 -3183 6869 4502 -12383 -4467 16379 3265 -18308 -1151 17904 -1637 -15491 4400 11156
916 11156 -6972 -5892 8573 3 -9188 5427 8524 -9655 -6684 12208 4060 -12714 -805
929 -805 11325 -2485 -7881 5720 3207 -8160 2373 9803 -7733 -10248 12271 9776 -15458
942 -15458 -8530 16528 6546 -15589 -4409 12312 2176 -7407 -476 909 -895 6108 1490 -12891
956 -12891 -1533 18604 1180 -22613 -546 24447 145 -23616 -10 20488 627 -15035
968 -15035 -1852 8255 3888 -399 -6349 -7390 8927 14218 -11322 -19704 13023 23077 -13720
981 -13720 -24347 12863 23169 -10617 -20095 6774 15394 -1756 -9859 -4171 3830 10343 1996
994 1996 -15922 -6938 20626 10838 -23630 -13353 24636 14528 -23251 -14385 19618 13197 -13956
1007 -13956 -11381 6835 9225 1158 -6963 -9294 4862 16354 -3190 -22062 1885 25590 -862
1020 -862 -26593 125 25014 712 -20997 -1565 15216 2774 -8196 -4247 692 5940 6412
1033 6412 -7709 -12291 9294 16463 -10556 -18695 11060 18648 -10812 -16804 9443 13220 -7268
1046 -7268 -8785 4124 3792 -365 1046 -3577 -5016 7398 7902 -10443 -9102 12687 9071 -13514
1060 -13514 -7549 13121 5136 -11352 -2042 8411 -1177 -4639 3987 382 -6082 3547 6916 -6990
1074 -6990 -6720 9213 5199 -10209 -2866 9651 -166 -7800 3312 4834 -6213 -1199 8496 -2487
1088 -2487 -9729 5811 9924 -8069 -8929 9228 7136 -8800 -4564 6956 1628 -3812 1355 -289
1102 -289 -4083 4712 6150 -8946 -7502 12285 8055 -14522 -7995 15054 7236 -13877 -6155 10997
1116 10997 4890 -6607 -3597 1199 2508 4765 -1581 -10454 1036 15202 -723 -18597 473
1129 473 20197 -211 -19830 -329 17411 1117 -13323 -2423 7997 4068 -1898 -5980 -4321
1142 -4321 7926 9848 -9534 -14279 10762 17261 -11076 -18427 10455 17967 -8633 -15870 5782
1155 5782 12621 -1985 -8582 -2484 4065 7089 254 -11426 -4110 14862 7050 -17301 -9110 18113
1169 18113 10005 -17333 -10054 14826 9176 -10911 -7831 5919 6237 -194 -4414 -5503 2951 10724
1183 10724 -1628 -14567 888 17114 -343 -17844 119 16788 -2 -14104 -232 10156
1195 10156 617 -5400 -1351 237 2241 4444 -3448 -8411 4605 10969 -5717 -12176 6447 11886
1209 11886 -6683 -10269 6381 7662 -5348 -4260 3784 743 -1638 2634 -627 -5219 2953 6921
1223 6921 -4915 -7404 6362 6756 -7093 -5101 6947 2633 -6098 170 4406 -3069 -2384 5473
1237 5473 65 -7199 2077 7908 -3803 -7547 4873 6171 -5094 -3903 4435 1104 -2925 1970
1251 1970 831 -4842 1580 7184 -3954 -8831 5875 9468 -7084 -9210 7276 8085 -6449 -6246
1265 -6246 4530 3922 -1734 -1368 -1669 -1087 5237 3266 -8503 -4913 11084 6006 -12571 -6514 12903
1280 12903 6524 -11789 -6122 9374 5446 -5837 -4592 1417 3661 3276 -2895 -7866 2103 11642
1294 11642 -1586 -14397 1006 15762 -474 -15627 -200 13954 1082 -11029 -2150 7059
1306 7059 3518 -2410 -4929 -2243 6431 6583 -7601 -9957 8440 12327 -8694 -13459 8195 13236
1320 13236 -6932 -11922 4805 9649 -2109 -6777 -1193 3450 4524 -307 -7727 -2582 10303 4744
1334 4744 -12003 -6141 12676 6836 -12130 -6708 10527 6069 -7844 -4947 4431 3639 -516 -2294
1348 -2294 -3377 1159 6862 -306 -9550 -179 11193 245 -11659 -176 10869 -107 -9018
1361 -9018 350 6260 -474 -3037 310 -410 77 3549 -683 -5990 1513 7590 -2304 -8118 3028
1376 3028 7584 -3491 -6121 3631 3918 -3366 -1346 2712 -1334 -1779 3684 600 -5441 552 6343
1391 6343 -1640 -6338 2442 5402 -2860 -3700 2896 1406 -2410 1212 1633 -3687 -544 5811 -542
1406 -542 -7257 1561 7882 -2248 -7590 2505 6382 -2304 -4509 1421 1983 -224 656 -1432 -3334
1421 -3334 3065 5539 -4659 -7257 5799 8192 -6326 -8324 6130 7756 -5061 -6486 3307 4822
1435 4822 -855 -2756 -1918 712 4821 1278 -7368 -2923 9343 4200 -10518 -5043 10560 5336
1449 5336 -9696 -5409 7661 4999 -4879 -4498 1433 3765 2184 -3069 -5710 2342 8703 -1687
1463 -1687 -10879 1112 11995 -488 -11951 -130 10905 929 -8723 -1765 5819 2767 -2435
1476 -2435 -3781 -1069 4796 4287 -5638 -6968 6157 8777 -6330 -9708 5913 9609 -4992 -8669
1490 -8669 3498 6969 -1617 -4799 -588 2369 2858 12 -4948 -2108 6653 3688 -7831 -4702 8244
1505 8244 5037 -7922 -4817 6774 4050 -5047 -3060 2780 1829 -304 -665 -2182 -280 4403 936
1520 936 -6071 -1202 7063 1171 -7224 -805 6619 344 -5241 235 3366 -697 -1142 1024 -1112
1535 -1112 -1125 3103 920 -4641 -612 5401 30 -5541 445 4782 -1025 -3493 1353 1625 -1614 403
1551 403 1604 -2423 -1418 4134 1125 -5273 -684 5801 319 -5472 85 4528 -205 -2882 263
1566 263 856 -104 1372 -179 -3568 553 5323 -997 -6677 1229 7222 -1382 -7098 1166 6121 -712
1582 -712 -4620 -148 2551 1147 -287 -2360 -1988 3531 4011 -4501 -5604 5155 6653 -5302 -7038
1597 -7038 4881 6784 -3863 -5957 2324 4684 -373 -3123 -1835 1368 3982 300 -5917 -1807
1611 -1807 7339 2992 -8147 -3854 8177 4305 -7424 -4426 5937 4240 -3839 -3869 1297 3336
1625 3336 1397 -2729 -4006 2102 6195 -1535 -7873 954 8695 -448 -8804 -163 7968 683 -6478
1640 -6478 -1342 4378 2009 -1959 -2687 -552 3311 2890 -3777 -4784 4103 6097 -4132 -6692 3849
1655 3849 6615 -3175 -5842 2224 4564 -1049 -2990 -374 1145 1737 464 -3098 -1976 4021 2944
1670 2944 -4757 -3581 4911 3627 -4675 -3280 3947 2535 -2850 -1624 1423 611 115 397 -1582 -1102
1686 -1102 2913 1632 -3800 -1776 4283 1672 -4216 -1273 3628 679 -2599 -63 1237 -610 203
1701 203 1113 -1713 -1528 2882 1643 -3733 -1649 3994 1371 -3785 -1009 2989 568 -1765 -104 254
1717 254 -326 1342 688 -2849 -921 4039 1061 -4805 -1133 5013 1127 -4653 -1118 3724 1107 -2337
1733 -2337 -1138 613 1134 1179 -1245 -2967 1295 4486 -1321 -5546 1243 6065 -1008 -5989 601 5345
1749 5345 -23 -4179 -737 2590 1594 -813 -2506 -1048 3271 2714 -3908 -4114 4204 5007 -4171 -5480
1765 -5480 3675 5388 -2827 -4877 1583 3974 -75 -2755 -1494 1487 3115 -157 -4452 -1003 5479
1780 5479 2009 -6001 -2706 6003 3143 -5439 -3313 4349 3229 -2870 -3008 1014 2564 831 -2146
1795 -2146 -2716 1612 4209 -1185 -5402 670 5996 -268 -6016 -156 5451 571 -4356 -980 2922
1810 2922 1398 -1155 -1718 -506 2097 2126 -2272 -3338 2420 4189 -2359 -4528 2104 4301 -1735 -3708
1826 -3708 1118 2702 -435 -1556 -365 247 1083 890 -1832 -1857 2314 2479 -2634 -2777 2672 2693 -2417
1843 -2417 -2272 1933 1614 -1211 -780 362 -81 525 920 -1380 -1560 2009 1945 -2449 -2101 2547 1953 -2282
1861 -2282 -1596 1723 1025 -918 -354 -57 -351 1050 999 -1973 -1502 2662 1836 -3028 -1986 3011 1915
1878 1915 -2631 -1721 1822 1324 -812 -933 -451 406 1630 0 -2786 -453 3601 777 -4132 -1099
1894 -1099 4192 1292 -3838 -1459 3064 1590 -1897 -1602 582 1642 910 -1600 -2281 1529 3457 -1358
1910 -1358 -4319 1074 4755 -745 -4776 239 4270 278 -3414 -952 2195 1576 -856 -2231 -615
1925 -615 2699 1864 -3071 -2984 3193 3721 -3039 -4085 2620 4113 -1886 -3720 1008 3091 102 -2189
1941 -2189 -1230 1213 2315 -229 -3205 -682 3826 1440 -4206 -2025 4110 2319 -3702 -2485 2913
1956 2913 2368 -1872 -2173 590 1791 681 -1415 -1916 944 2934 -540 -3669 124 3981 178 -3939
1972 -3939 -476 3476 687 -2681 -879 1606 996 -449 -1102 -727 1161 1744 -1179 -2521 1150 2997
1988 2997 -1017 -3072 851 2833 -603 -2242 288 1484 85 -573 -445 -371 789 1160 -1074 -1822
2004 -1822 1266 2168 -1341 -2311 1219 2119 -1002 -1726 576 1053 -164 -343 -388 -443 839 1092 -1271 -1664
2022 -1664 1525 2032 -1619 -2124 1525 2019 -1138 -1669 626 1153 54 -523 -728 -146 1417 785 -2013
2039 -2013 -1343 2343 1695 -2505 -1979 2267 1954 -1908 -1895 1154 1591 -335 -1274 -640 813 1560 -390
2056 -390 -2395 -58 3026 489 -3358 -810 3380 1118 -3044 -1358 2411 1523 -1509 -1616 479 1624
2072 1624 631 -1557 -1694 1425 2587 -1212 -3241 902 3571 -539 -3581 89 3192 372 -2577
2087 -2577 -878 1683 1345 -700 -1779 -346 2102 1272 -2298 -2069 2305 2593 -2158 -2898 1810 2880
2103 2880 -1276 -2646 608 2190 158 -1574 -915 887 1641 -183 -2252 -478 2631 998 -2814
2118 -2814 -1402 2729 1623 -2367 -1710 1813 1650 -1051 -1449 173 1123 638 -802 -1457 440 2042
2134 2042 -130 -2496 -182 2559 386 -2480 -614 2021 650 -1465 -742 707 723 119 -664 -860
2150 -860 602 1501 -498 -1915 415 2154 -274 -2075 125 1823 40 -1321 -230 682 386 -10
2166 -10 -561 -695 652 1217 -772 -1702 697 1876 -660 -1940 415 1680 -206 -1310 -128 736 451
2183 451 -131 -747 -515 1001 1083 -1185 -1543 1247 1841 -1150 -1938 918 1835 -548 -1563 50 1115
2200 1115 468 -599 -1007 14 1455 493 -1830 -983 2007 1331 -2040 -1603 1801 1694 -1420 -1685 805
2217 805 1502 -145 -1264 -625 907 1294 -559 -1929 148 2365 200 -2590 -567 2565 860 -2307
2233 -2307 -1101 1811 1267 -1119 -1379 331 1375 481 -1305 -1260 1181 1885 -941 -2345 695 2557
2249 2557 -381 -2546 10 2286 351 -1831 -732 1171 1049 -509 -1362 -266 1505 851 -1679 -1440
2265 -1440 1595 1778 -1492 -1999 1157 1960 -804 -1806 310 1463 239 -1011 -726 545 1218 -11
2281 -11 -1536 -411 1792 804 -1814 -1059 1692 1200 -1397 -1246 961 1134 -442 -952 -172 658 681 -404
2299 -404 -1168 67 1480 150 -1700 -401 1665 556 -1488 -639 1132 688 -652 -647 150 587 418
2316 418 -457 -898 354 1305 -177 -1505 55 1621 123 -1488 -282 1181 388 -797 -525 271 600
2333 600 256 -632 -764 631 1161 -586 -1484 441 1607 -295 -1586 42 1345 196 -1036 -485 561
2350 561 710 -50 -917 -477 1031 910 -1100 -1287 1027 1511 -876 -1603 598 1546 -239 -1343 -137
2367 -137 1021 583 -614 -959 183 1293 245 -1538 -646 1623 963 -1567 -1215 1366 1312 -1056 -1342
2384 -1342 555 1233 -55 -1094 -551 793 1019 -555 -1477 212 1761 89 -1907 -388 1844 646
2400 646 -1616 -856 1246 1035 -727 -1074 193 1092 411 -996 -921 894 1363 -708 -1644 472 1766
2417 1766 -248 -1759 -94 1522 326 -1213 -619 732 798 -299 -1006 -233 1078 635 -1137 -1042 1050
2434 1050 1254 -904 -1373 646 1352 -348 -1189 11 939 349 -589 -673 233 932 149 -1112 -466 1188
2452 1188 717 -1136 -911 969 945 -721 -964 347 801 -11 -639 -399 385 697 -156 -987 -112 1122
2470 1122 309 -1184 -530 1086 607 -892 -706 595 674 -221 -638 -172 515 559 -379 -898 206 1098 -38
2489 -38 -1235 -131 1221 307 -1056 -468 819 590 -451 -655 54 678 365 -658 -747 554 1028 -460
2507 -460 -1248 271 1281 -91 -1269 -183 1051 373 -804 -605 402 758 -52 -902 -365 932 719
2524 719 -894 -1012 822 1196 -622 -1244 388 1212 -67 -1064 -233 856 535 -517 -838 180 1043
2541 1043 145 -1198 -458 1208 708 -1162 -910 954 984 -678 -1051 284 955 64 -854 -496 627 809
2559 809 -411 -1112 152 1278 115 -1327 -336 1261 535 -1063 -702 772 795 -409 -823 18 802
2576 802 359 -732 -709 607 980 -465 -1172 236 1207 -53 -1149 -187 977 351 -754 -551 410 667
2594 667 -96 -742 -275 769 552 -749 -795 622 932 -478 -1012 237 921 -23 -796 -222 576 462 -294
2613 -294 -640 24 770 253 -802 -472 801 658 -689 -756 517 802 -277 -729 28 610 231 -482 -496
2632 -496 247 672 -45 -833 -190 860 341 -861 -537 706 589 -544 -680 269 642 -15 -614 -312 479
2651 479 578 -305 -774 166 956 47 -957 -186 928 382 -757 -510 562 611 -257 -662 -58 646 355
2670 355 -608 -653 480 831 -378 -998 146 1009 -7 -970 -218 801 406 -590 -577 317 685 -41 -771
2689 -771 -254 779 509 -735 -735 605 865 -448 -908 240 910 10 -796 -254 630 476 -411 -672 167
2708 167 825 91 -886 -295 878 514 -782 -659 601 728 -409 -776 110 700 144 -628 -440 456 639
2727 639 -312 -819 91 888 73 -911 -285 811 412 -674 -544 450 589 -211 -608 -62 605 321 -521
2746 -521 -524 426 696 -249 -785 127 833 61 -746 -245 622 366 -436 -490 177 534 31 -605 -312 544 460
2767 460 -512 -654 337 709 -230 -728 26 664 141 -537 -337 354 469 -144 -568 -43 635 288 -607 -425
2787 -425 578 551 -427 -611 264 633 -82 -591 -123 478 319 -363 -499 171 600 -15 -699 -173 667 317
2807 317 -641 -445 502 530 -329 -598 106 555 79 -520 -333 410 497 -298 -657 142 721 29 -739 -197 685
2828 685 357 -574 -449 384 538 -155 -585 -83 567 306 -528 -488 437 637 -296 -720 144 743 19 -702
2848 -702 -199 571 328 -433 -493 210 548 -28 -620 -171 600 353 -548 -525 419 609 -281 -679 118 644 84
2869 84 -536 -245 465 444 -278 -523 109 633 89 -636 -244 603 386 -507 -494 353 550 -207 -568 -26 497
2890 497 183 -461 -398 291 492 -188 -612 0 610 113 -605 -275 513 353 -370 -436 225 460 -38 -477 -133
2911 -133 438 342 -343 -451 260 558 -122 -574 -15 564 143 -505 -295 347 364 -257 -448 31 472 137 -482
2932 -482 -301 383 426 -341 -546 160 539 -60 -541 -86 490 245 -352 -362 218 441 -68 -502 -90 523 244
2953 244 -464 -380 407 453 -269 -490 132 484 40 -453 -192 389 323 -271 -443 147 532 17 -544 -149 528
2974 528 269 -453 -398 309 426 -200 -491 -11 456 146 -427 -318 344 437 -224 -499 105 570 45 -540 -161
2995 -161 490 302 -352 -353 243 459 -71 -447 -80 477 244 -399 -370 328 454 -218 -503 73 522 50 -483
3016 -483 -197 373 289 -293 -410 120 424 13 -454 -144 419 277 -380 -376 291 458 -143 -440 29 450 130
3037 130 -380 -261 288 375 -153 -426 40 480 92 -458 -212 399 284 -323 -384 180 382 -61 -405 -98 361
3058 361 198 -320 -339 197 407 -110 -456 -23 438 113 -406 -221 318 321 -214 -345 88 376 63 -371 -175
3079 -175 337 310 -250 -386 159 433 -35 -418 -73 413 201 -327 -271 223 343 -120 -391 -47 396 153 -386
3100 -386 -277 296 347 -224 -429 86 392 -3 -414 -164 318 217 -250 -351 147 390 -23 -436 -79 423
3120 423 190 -362 -267 308 351 -177 -359 40 390 79 -354 -198 299 299 -212 -400 82 434 15 -419 -140
3141 -140 368 218 -328 -314 191 342 -102 -402 -41 358 144 -334 -263 261 361 -161 -374 75 428 46 -387
3162 -387 -139 343 239 -244 -272 156 355 -8 -348 -96 341 222 -303 -281 225 325 -131 -368 19 349 69
3183 69 -335 -192 241 249 -174 -328 38 336 51 -334 -159 315 223 -257 -300 164 324 -63 -323 -56 305 166
3205 166 -235 -230 178 313 -60 -328 -16 380 103 -319 -158 285 242 -177 -279 79 313 15 -298 -130 238
3226 238 199 -220 -317 126 323 -59 -374 -62 309 128 -285 -208 184 251 -100 -314 -3 313 114 -284 -199 262
3248 262 299 -171 -313 82 331 -7 -314 -94 310 193 -214 -270 145 297 -44 -318 -84 304 135 -284 -250
3269 -250 219 267 -188 -322 36 298 15 -301 -144 240 219 -171 -271 91 320 -10 -315 -73 336 161 -249
3290 -249 -230 213 292 -105 -277 24 285 97 -256 -201 201 249 -169 -319 76 328 14 -317 -103 258 154
3311 154 -231 -246 127 245 -53 -285 -56 269 130 -231 -215 172 254 -122 -288 45 283 29 -236 -114 224
3332 224 187 -136 -218 72 253 23 -268 -101 250 171 -206 -215 138 250 -81 -250 -23 224 88 -205 -153 118
3354 118 196 -96 -271 -30 251 59 -257 -156 214 173 -177 -227 78 233 1 -231 -82 185 157 -152 -196 105
3376 105 252 -30 -255 -19 253 117 -217 -154 186 192 -104 -226 17 236 48 -239 -152 178 169 -157 -256 46
3398 46 252 -21 -280 -76 229 112 -198 -185 103 208 -47 -247 -40 232 118 -216 -182 201 253 -128 -253
3419 -253 63 283 23 -234 -75 223 158 -146 -211 54 234 -17 -271 -81 258 110 -245 -189 144 209 -122
3440 -122 -263 21 208 11 -237 -141 175 178 -127 -239 38 245 -1 -281 -70 243 117 -176 -187 153 212 -59
3462 -59 -202 -9 229 93 -203 -146 141 214 -116 -243 37 234 9 -233 -73 171 120 -163 -188 59 177 -32
3484 -32 -208 -87 150 103 -166 -170 118 171 -97 -216 30 206 33 -165 -91 128 131 -80 -192 11 205 34 -199
3507 -199 -84 182 140 -133 -190 96 195 -35 -213 -59 160 59 -151 -170 76 147 -62 -234 -24 196 70 -206
3529 -206 -139 136 144 -124 -196 52 179 5 -162 -81 142 127 -109 -175 76 210 -7 -202 -29 235 90 -165
3551 -165 -123 128 135 -65 -193 -2 170 67 -198 -144 149 177 -131 -239 35 207 -40 -234 -56 176 86 -172
3573 -172 -159 72 177 -41 -196 -45 197 78 -199 -144 134 158 -94 -219 37 194 -6 -188 -65 162 126
3594 126 -118 -157 70 194 -10 -199 -49 181 82 -195 -144 99 142 -96 -198 9 152 16 -185 -117 95 143
3616 143 -94 -185 29 195 1 -204 -48 183 98 -161 -125 94 158 -27 -162 1 147 93 -138 -128 118 153
3638 153 -78 -165 25 169 -5 -197 -79 121 86 -111 -124 18 127 -13 -157 -81 126 80 -132 -159 74 138
3660 138 -59 -169 15 158 41 -133 -73 111 109 -68 -135 29 154 57 -158 -90 134 125 -102 -137 62 160 -29
3683 -29 -154 -35 112 81 -116 -122 48 131 -21 -165 -22 164 54 -162 -96 122 111 -87 -155 30 135 31 -141
3706 -141 -56 124 109 -84 -134 82 171 -7 -177 -28 176 71 -139 -100 111 136 -51 -146 8 154 58 -145 -108
3729 -108 122 133 -116 -180 43 148 -2 -195 -61 141 67 -125 -126 49 133 -35 -170 -27 156 79 -135 -117 122
3752 122 139 -78 -124 59 163 -5 -139 -41 117 94 -72 -106 69 157 5 -161 -41 154 64 -159 -117 100 122
3775 122 -83 -145 11 97 25 -136 -90 88 99 -64 -129 24 144 15 -150 -28 148 64 -109 -91 80 130 -3
3798 -3 -102 -8 121 65 -77 -74 77 106 -47 -135 45 144 17 -127 -60 94 82 -87 -103 23 96 -2 -150 -61 109
3823 109 69 -93 -126 57 136 -42 -129 5 102 46 -108 -76 61 98 -24 -116 7 134 39 -119 -53 113 106 -76
3847 -76 -108 43 108 -10 -111 -28 98 57 -80 -99 31 109 -35 -145 -26 129 52 -133 -98 92 85 -76 -119 27
3871 27 110 6 -99 -64 117 103 -73 -125 75 153 8 -109 5 139 63 -90 -76 85 123 -40 -104 24 124
3894 124 30 -111 -65 99 107 -89 -142 29 128 -26 -134 -23 115 56 -94 -86 65 103 -12 -123 -21 114 48 -121
3918 -121 -85 111 104 -75 -123 40 144 12 -110 -33 120 81 -53 -111 33 121 -16 -126 -36 117 55 -107 -71 76
3942 76 89 -45 -105 5 77 18 -99 -71 47 75 -58 -110 32 99 4 -119 -25 122 55 -87 -98 52 90 -25 -86
3967 -86 -10 110 65 -88 -51 66 101 -37 -109 6 116 8 -103 -46 92 66 -66 -87 4 82 9 -119 -55 84
3991 84 55 -93 -108 62 107 -33 -114 -21 93 21 -80 -64 72 80 -29 -95 21 117 25 -99 -46 106 89 -61 -72
4016 -72 56 101 -20 -72 -22 87 46 -64 -82 49 91 -33 -109 -3 117 25 -101 -70 80 83 -70 -111 15 111 23
4041 23 -92 -53 104 68 -77 -101 44 121 -21 -111 -5 117 49 -77 -63 77 88 -37 -98 5 93 21 -101 -55
4065 -55 75 81 -68 -103 28 95 -10 -107 -12 76 29 -78 -83 42 87 -34 -109 -23 100 40 -100 -59 95 77 -70 -95
4091 -95 18 114 -1 -91 -36 80 78 -43 -62 42 95 -6 -80 -26 97 40 -101 -52 53 73 -70 -77 -9 57 11 -90
4117 -90 -61 41 54 -64 -110 20 67 -22 -93 -23 82 28 -55 -43 61 76 -16 -87 -7 61 54 -72 -65 85 95 -34 -88
4144 -88 14 87 19 -109 -43 56 56 -67 -89 24 84 -11 -108 -62 73 48 -83 -84 42 68 -38 -107 -5 85 18 -71 -41
4171 -41 59 79 -23 -81 10 94 37 -101 -37 95 68 -69 -69 51 99 -4 -65 -1 84 51 -94 -89 49 83 -26 -112
4197 -112 -2 100 -9 -100 -54 80 65 -73 -96 23 64 -11 -87 -33 71 65 -62 -74 60 103 -26 -93 -10 112 28
4222 28 -65 -41 81 81 -47 -74 34 108 28 -86 -46 72 71 -83 -95 26 62 -23 -114 -17 60 24 -77 -61 25 37 -51
4249 -51 -106 -4 79 12 -102 -45 77 69 -54 -64 41 89 6 -70 -17 79 54 -51 -50 31 113 -2 -59 5 87 22 -76 -57
4277 -57 60 59 -45 -83 7 74 10 -71 -40 58 56 -45 -86 18 80 -16 -89 -13 85 44 -52 -51 52 76 -2 -62 -7 82 33
4306 33 -53 -49 67 78 -13 -95 39 92 18 -73 -27 73 61 -43 -78 16 63 -9 -97 -25 63 49 -67 -76 53 58 -56 -90
4334 -90 -6 72 15 -71 -43 62 59 -21 -70 11 95 22 -73 -2 100 46 -60 -59 61 81 -11 -69 -5 81 45 -54 -63 58 72
4363 72 -42 -105 -18 64 -19 -111 -33 71 36 -61 -78 -2 73 -6 -74 -30 61 45 -62 -70 43 84 -19 -70 -10 86 21 -60
4391 -60 -26 81 72 -39 -70 6 80 5 -77 -40 56 47 -59 -69 34 64 -40 -91 -35 63 19 -75 -66 29 56 -36 -90 9 72
4420 72 22 -73 -60 56 45 -43 -59 29 66 -13 -53 -16 67 44 -56 -71 39 82 -10 -70 -8 63 7 -74 -48 57 53 -34 -76
4449 -76 -4 38 19 -88 -60 49 27 -66 -90 7 80 -12 -87 -24 49 48 -58 -60 27 80 0 -80 -12 75 42 -48 -29 65 83 -9
4479 -9 -89 38 90 28 -49 -28 56 42 -48 -61 14 82 -7 -92 -38 52 29 -93 -85 24 57 -33 -96 -11 59 -1 -74 -47 46 65
4509 65 -31 -58 18 79 7 -88 -23 69 61 -43 -53 46 70 -8 -89 -7 58 8 -82 -73 54 73 -20 -101 1 69 15 -81 -63 35
4539 35 23 -59 -82 18 43 -16 -65 -33 67 56 -50 -56 38 52 -19 -73 0 94 42 -54 -29 55 63 -27 -63 35 71 18 -97
4568 -97 -33 56 40 -53 -84 45 66 -38 -84 -34 49 10 -71 -58 18 48 -49 -73 -19 65 33 -87 -32 56 48 -37 -68 18 58
4597 58 -4 -41 -23 49 42 -29 -30 48 79 6 -45 10 71 21 -58 -52 29 57 -15 -66 -14 73 27 -65 -48 52 57 -46 -97 -10 75
4628 75 -24 -80 -20 70 52 -33 -62 27 76 -6 -65 -1 78 53 -44 -33 51 75 -23 -66 28 82 7 -49 -26 47 58 -39 -75 33
4658 33 76 3 -68 -25 75 40 -57 -79 35 60 -11 -85 -12 72 12 -66 -36 26 64 -13 -73 20 76 9 -74 -11 64 50 -39
4687 -39 -54 42 77 7 -55 -14 58 24 -51 -48 36 54 -37 -74 9 66 16 -62 -35 56 45 -31 -52 10 58 -10 -68 -33 67 55
4717 55 -49 -60 29 58 -10 -74 17 78 37 -32 -22 53 71 -24 -50 26 65 28 -49 -24 75 60 -18 -46 18 55 -12 -77 -19 31
4747 31 24 -50 -58 28 54 -27 -60 -14 58 16 -66 -38 50 53 -26 -36 12 53 25 -44 -25 60 70 -21 -57 16 73 18 -46 -3 59 34
4779 34 -38 -34 26 37 -5 -76 -13 57 18 -65 -54 32 53 -32 -83 3 51 6 -53 -27 48 22 -52 -55 21 77 8 -55 -12 85 57
4810 57 -46 -42 51 65 -37 -55 17 72 26 -44 -37 36 67 -18 -68 -8 50 9 -74 -31 44 33 -68 -62 38 69 -30 -57 -7 52
4840 52 18 -48 -53 22 49 -26 -68 2 66 13 -63 -16 64 47 -47 -45 29 58 -5 -49 -10 68 27 -48 -42 23 42 -11 -65 -17 45 -6
4872 -6 -78 -51 36 22 -49 -58 5 50 3 -65 -45 40 40 -45 -60 9 59 -14 -67 -7 61 40 -20 -15 34 38 4 -51 -6 47 16 -52 -36
4905 -36 33 41 -33 -52 1 27 -21 -59 -33 24 14 -30 -54 -9 65 -10 -69 -28 49 31 -61 -57 11 42 -42 -56 6 27 13 -48 -37
4936 -37 22 52 -39 -56 22 73 28 -67 -21 49 43 -32 -49 27 51 1 -42 -24 41 15 -64 -46 11 42 -41 -74 -23 58 4 -79 -42
4967 -42 31 18 -35 -57 4 56 -1 -42 -6 52 51 -35 -14 29 64 -10 -46 14 74 20 -48 -34 39 60 -30 -53 -6 50 23 -64 -27
4998 -27 37 27 -69 -62 20 31 -29 -77 -26 23 20 -45 -41 18 46 -22 -57 -5 44 20 -43 -28 51 33 -32 -24 24 58 7 -39 -33 40 32
5031 32 -45 -47 9 37 -28 -57 -19 46 0 -57 -62 -3 1 -31 -48 -19 19 7 -62 -44 28 37 -19 -57 11 56 -13 -42 -3 15 20 -21 -36
5064 -36 28 40 -4 -30 1 46 23 -35 -43 20 32 -24 -64 -5 40 4 -50 -30 14 34 -14 -62 -17 38 7 -73 -55 16 36 -54 -46
5095 -46 29 47 -11 -58 -25 30 13 -42 -47 22 53 -14 -42 13 57 38 -48 -3 61 42 -41 -42 -5 33 5 -52 -28 31 25 -49 -45 12
5127 12 47 -28 -82 -9 41 -2 -79 -27 30 30 -34 -49 14 49 8 -54 -23 57 48 -32 -43 22 54 -8 -23 10 59 21 -25 -6 26
5158 26 37 -21 -47 -18 37 -1 -56 -32 40 27 -41 -31 21 24 -46 -38 -13 24 3 -38 -29 32 49 -25 -49 6 55 14 -47 -5 30 26
5190 26 -11 -28 17 33 5 -23 -24 26 35 -30 -48 0 42 -21 -57 -2 18 -4 -25 -20 5 13 -23 -32 -25 13 3 -47 -56 -1 24 -26 -50 -4
5224 -4 27 5 -26 1 21 36 -5 -33 1 52 17 -38 -16 58 35 -25 -26 19 44 -22 -70 -9 41 17 -31 -27 -2 7 -18 -55 -22 26
5256 26 15 -59 -40 22 4 -40 -33 -8 20 -8 -44 -14 9 28 -13 -45 14 57 1 -45 -27 48 -2 -40 -19 45 41 -21 -4 17 23 -15
5288 -15 -45 -23 16 45 -40 -57 18 57 -34 -73 -11 38 11 -65 -35 32 23 -43 -49 -4 28 17 -39 -33 31 45 -19 -29 4 35 -16 -53
5320 -53 -27 38 17 -32 -10 28 26 -3 -35 -16 35 6 -59 -44 22 9 -41 -40 2 1 -32 -51 -18 -8 -5 -34 -43 -25 19 -15 -66 -31 23
5353 23 14 -36 -23 27 5 -22 -5 7 6 23 -17 -33 8 33 -10 -16 3 40 -4 -45 -9 22 7 -33 -16 -12 0 -14 -23 -27 15 16 -30 -57
5387 -57 17 22 -26 -45 -15 28 -3 -31 -32 22 36 2 -20 -13 52 19 -34 -25 14 43 -16 -30 20 42 -9 -34 -12 29 15 -9 -33 -9
5419 -9 32 -1 -55 -37 29 0 -38 -43 26 12 -38 -41 -4 24 -1 -64 -17 10 16 -19 -21 11 40 -10 -21 8 53 31 -20 -5 49 14 -19
5452 -19 -14 10 38 -7 -21 -27 22 22 -26 -59 -6 25 -40 -73 -32 18 -22 -43 -31 23 18 -21 -36 -12 40 -4 -36 -21 31 25 -31 -41 28
5485 28 44 -13 -26 9 18 17 -8 10 7 17 10 -8 2 27 -1 -20 -20 22 -5 -34 -39 -2 1 -30 -29 -19 12 -17 -32 -35 -23 30 8 -42 -28
5520 -28 4 12 -32 -21 33 28 -10 6 18 16 35 -7 -19 -11 25 10 -40 -3 19 7 -29 -18 33 10 -20 -29 -12 3 15 -42 -32 7 10
5553 10 -37 -37 -18 15 -4 -41 -10 22 5 -40 -15 12 25 1 -17 -1 31 37 -19 -4 48 35 1 -31 14 37 7 -29 -11 28 10
5584 10 -8 -10 -5 33 -1 -57 -24 38 -8 -60 -43 12 20 -41 -37 7 35 -20 -49 -5 9 20 -27 -45 16 35 1 -44 -4 46 32 -21
5616 -21 -25 39 36 -3 -14 23 21 -2 -28 -21 16 34 -8 -30 19 17 -13 -38 4 39 7 -26 -21 -2 9 -10 -32 -6 29 11 -25 -13 27
5649 27 25 -22 -17 23 31 -6 -20 23 11 19 1 10 3 21 10 6 -10 20 6 -19 -36 18 -16 -5 0 -11 0 -21 -17 -18 -20 -1 -37 -39 -14 -3
5685 -3 -9 -16 -5 7 16 -13 -5 18 12 2 -6 5 17 23 -9 -16 9 50 22 -13 -3 43 20 -19 -26 14 8 -13 -12 -3 4 12 -30 -47 5 21 -16 -59
5723 -59 -6 18 -11 -44 -24 16 12 -26 -36 13 25 10 -16 11 21 23 -21 -23 32 50 1 -49 25 53 1 -28 -15 36 26 1 -28 -1
5755 -1 37 -5 -41 -14 37 1 -47 -43 37 38 -32 -46 -3 18 -10 -33 -7 22 18 -5 -17 29 38 -8 -22 -6 47 -4 -46 14 52 10 -14
5788 -14 -11 21 26 18 -6 -13 23 14 -14 -29 8 20 -27 -27 0 32 -3 -33 4 -15 11 4 -25 -16 -8 -4 -6 -34 5 13 -10 -6 12 24 7 0 4 2
5826 2 22 21 9 6 9 31 -5 4 23 17 -27 10 24 11 -15 -10 8 -15 -2 -6 -25 -23 -7 2 -22 -9 18 19 -26 -35 12 33 1 -12 10 29
5862 29 26 19 14 32 29 -1 -16 2 43 18 -11 -18 56 17 -16 -15 27 17 10 -40 -23 1 -1 -9 -39 -8 6 -4 -38 -14 32 -15 -50 -24 -3
5897 -3 0 -4 -42 6 8 19 -16 11 40 26 -7 -7 34 44 -15 -28 19 60 -15 -36 25 27 20 -4 -20 -4 28 -7 -39 -10 15 10 -39 -11
5931 -11 18 13 -38 -10 6 20 -8 -25 -23 11 11 -4 -2 30 28 15 -17 8 29 5 -13 9 21 17 -12 6 31 26 1 12 6 23 23 -7 -12
5966 -12 -2 21 -29 -32 -6 6 -34 -22 4 -4 3 -6 4 -12 15 25 -15 -26 8 22 -8 -31 18 13 -8 14 2 14 -7 19 19 0 12
5999 12 21 -8 -6 30 29 3 -23 -1 6 -12 -3 -13 -15 0 -3 -19 -30 19 -7 -9 -25 1 20 -11 -14 8 29 -22 -4 -4 7 16 0 12 3 26
6035 26 14 -32 -3 30 30 -38 -25 11 10 -18 -18 39 30 -11 3 -16 21 6 -15 -43 9 24 -31 -53 -4 19 -1 -42 -9 29 2 -27
6067 -27 -21 10 14 7 -29 -12 22 31 -8 -9 45 35 -4 -8 33 44 0 -19 1 14 5 -1 -13 -3 30 3 -50 -3 5 11 -42 -41 3 -3 -33 -23
6103 -23 5 -5 -25 -7 -1 6 4 -8 -13 11 32 7 1 10 55 4 -4 9 38 -9 21 16 4 10 -5 1 -20 11 21 19 -1 -3 27 -4 -4 -6 -5 -21
6141 -21 -15 -8 -7 -23 -5 0 -13 7 3 14 3 12 31 10 7 -3 12 15 20 5 4 8 17 -3 1 18 29 18 -31 11 50 -6 -8 9 22 23 5 2
6179 2 5 13 28 -30 -10 18 12 -28 -49 12 21 -21 -45 15 34 1 -12 -24 9 -5 -13 6 9 28 20 -19 4 45 29 -4 4 42 17 -24 -18
6214 -18 5 24 10 -13 -12 11 30 -10 -35 -2 29 -18 -44 -5 20 -11 -52 -13 27 -24 -13 -4 8 15 -4 -8 -13 23 15 -16 -13 25 40 7
6248 7 -17 28 49 8 -2 17 25 1 -20 0 3 16 -14 -18 -15 12 0 -45 3 8 2 -29 -10 11 -3 -21 4 -9 -18 2 19 -10 4 30
6282 30 -6 -15 -7 -6 -13 -19 20 17 2 14 17 16 14 33 24 -1 6 22 1 -31 1 4 -13 2 12 1 -9 11 9 -1 -18 16 4 -23 -10 11 -4
6319 -4 -18 -18 26 -1 -9 8 -2 13 16 6 10 27 17 2 -11 22 26 8 -10 32 26 12 -30 5 22 9 -6 -35 0 10 -3 -19 -32 7
6353 7 20 -40 -42 6 15 -38 -33 -1 14 -14 -26 -10 4 -2 5 -17 13 35 0 -21 3 30 20 -14 -9 34 22 -15 -10 27 26 -10 -10 -7 14 5
6389 5 -5 -13 -10 0 -15 -29 -5 24 -8 -48 -10 32 -11 -15 -2 7 17 -2 -10 0 27 2 -16 -11 33 34 -22 -12 12 18 2 -4 4 17 13 -6
6425 -6 9 2 5 3 -9 7 9 -5 -33 -4 14 -6 -24 -3 -1 -16 -22 -12 -5 -25 -12 5 -20 -16 -10 7 -1 11 23 1 8 12 17 8 -8 27 11 9
6463 9 -1 35 -4 1 9 10 -1 -15 24 -1 -17 -11 -5 -2 -12 -14 -21 -29 -1 15 -18 -36 5 2 -22 -2 7 2 -14 -16 -1 16 24 -10 -3 35 22 -8
6501 -8 8 6 28 5 -37 19 46 7 -12 1 24 11 -1 0 8 4 2 -19 -19 7 11 -34 -27 29 4 -30 -41 18 8 -16 -11 -17 3 9 -1 9
6537 9 10 15 26 -3 0 38 11 -20 7 36 6 -10 -2 17 12 -18 12 6 15 28 4 -13 10 15 -22 -22 -9 9 -37 -29 11 6 -10 -37 11 7 -20
6574 -20 -15 -15 -2 0 18 0 1 42 29 -3 1 29 10 -7 21 26 4 -5 9 26 17 7 25 12 -2 -3 10 -10 -1 15 -7 -19 -4 -3 -28 -19
6610 -19 -6 -2 -31 -22 21 -11 -31 1 5 3 -7 2 -8 -19 24 -2 -2 12 29 18 -6 28 3 -5 -22 10 22 -6 -26 -7 -8 -9 -17 -9 -12 -5 -5
6647 -5 -27 -24 -2 -16 -38 -24 11 4 -40 -17 8 8 -9 -4 18 -5 26 -8 -22 24 17 -13 -10 33 34 17 -27 21 44 2 -22 15 19 19 -15
6682 -15 -5 18 7 5 -9 -21 15 -4 -26 -21 2 14 -42 -34 10 10 -16 -21 -7 22 -1 -6 -4 6 24 -15 -23 6 39 27 -9 -6 43 20 -12
6717 -12 9 24 11 -10 -3 -7 5 11 2 -5 7 18 -15 -34 12 11 -42 -37 -6 23 -31 -24 -10 -20 5 -2 -2 -7 -8 16 -6 -11 21 7 -29 9 41
6754 41 5 -8 10 33 12 8 27 32 2 0 9 0 0 -2 -11 -10 -1 -11 -18 -6 7 -13 -42 -26 -5 -11 -35 -21 10 3 -25 -25 4 -14 9 2 -2 -2 9
6793 9 10 -7 33 34 3 -9 17 31 5 -21 21 32 -15 -16 12 15 -7 -10 13 -8 13 4 -29 -26 21 3 -24 -6 4 -8 -41 -26 18 10 -34
6828 -34 -3 25 20 19 -34 -10 4 11 -9 -29 27 26 17 -16 26 43 1 1 11 36 -2 -15 5 4 14 7 -30 -10 28 -8 -31 -7 21 12 -31
6863 -31 -24 18 6 -29 -21 9 11 -6 -11 -17 13 17 -3 3 21 28 -12 -10 5 43 12 -15 21 35 23 -17 18 8 -7 -10 -2 -6 0 12 -11 -5 15
6900 15 4 -20 11 6 13 -19 3 -13 11 -26 -14 13 -11 7 12 15 -13 14 17 -11 -4 17 3 6 16 41 11 -6 33 9 12 26 18 23 -12
6935 -12 -1 19 -2 1 -16 -27 -6 8 -19 -28 -6 22 -7 -12 -5 -23 -8 -14 -4 3 16 -9 -4 8 27 7 -4 15 37 19 -21 -14 33 29 4
6970 4 2 11 11 5 4 25 15 1 -11 9 20 -1 -25 -6 -17 28 13 -30 2 20 5 -33 -10 16 9 -15 -17 2 6 -21 -20 1 0 27 18 -26
7006 -26 7 21 -13 -10 9 44 -4 -15 34 12 -6 5 6 21 23 -3 -27 1 12 13 -10 -18 6 -3 -21 -11 12 -2 -25 -18 4 -5 -25 -14
7040 -14 9 6 16 9 -5 13 27 1 -10 0 16 19 -2 25 40 10 3 -8 6 -10 25 24 0 13 15 9 1 6 2 -5 6 20 -9 3 -6 22
7076 22 16 -27 16 5 -5 -10 -8 6 0 24 17 -4 15 39 14 23 37 18 15 10 45 18 9 5 25 25 9 22 19 15 20 2 3 2 9 -15 -2 -1 9
7115 9 -9 -9 9 36 -14 -10 19 21 1 0 13 0 2 8 2 12 35 28 4 2 43 44 9 -10 28 16 -5 -9 18 23 -3 -5 14 20 14 7 4 22 28 -7
7155 -7 -28 14 14 -2 -28 10 17 -9 -23 5 9 15 -10 -25 6 18 17 -3 -4 29 32 -6 8 25 36 8 9 30 23 -2 22 16 13 7 14 -2 10
7192 10 6 14 -16 -4 14 -1 -5 -20 21 6 -14 -2 24 5 -5 8 -3 8 7 -9 -11 15 30 11 2 18 39 25 2 45 32 0 8 38
7226 38 27 -12 2 27 14 -18 11 1 11 22 4 -13 0 11 0 -13 -7 13 0 -14 -1 22 -5 -12 1 10 19 3 -6 22 26 25 5 11
7260 11 26 22 -2 14 16 12 1 9 16 26 -15 -11 20 16 -3 14 30 0 19 -24 -28 -1 6 -15 -27 -2 -3 -2 -24 -17 18 0 -18 -8 15 17 17
7297 17 -3 14 7 30 1 4 27 21 13 4 21 20 -10 -5 27 16 -6 -1 12 2 7 5 -2 2 7 -11 -7 -4 -9 6 -30 -12 -16 -16 -23 -6 26 27 3 6 1
7338 1 19 32 -3 -2 32 21 10 -6 18 33 5 6 25 19 -12 10 14 13 6 4 -15 4 1 -9 -8 -8 -9 -5 -29 -16 4 3 -9 -12 1 -16 -11 -3 11
7377 11 -1 -3 10 7 1 4 10 -26 9 15 -18 17 24 11 -7 -10 22 17 -7 9 27 19 5 12 -2 -10 -7 -3 1 21 32 -6 -20 13 3 -5 -13 9 -12
7416 -12 -21 -20 2 18 7 -20 11 21 3 28 -5 15 21 22 -6 24 40 22 7 17 39 14 2 -3 27 28 11 8 0 -3 15 -3 11 2 24
7451 24 18 -15 9 36 -5 -28 2 -6 1 -19 13 13 19 4 -1 22 28 13 -7 6 26 1 0 -4 35 29 2 6 39 34 22 8 7 -5 6 5 -19
7488 -19 10 12 -22 -25 -4 14 7 -7 -3 10 0 -21 2 -7 6 -7 14 8 1 21 20 8 17 12 1 5 14 12 -21 -1 19 6 3 -1 32 4 14 17
7526 17 16 25 -4 -19 -17 -4 0 8 -14 -15 8 2 -35 4 8 -15 -11 -4 3 -15 -7 -3 5 2 12 7 2 10 18 7 -8 26 11 -1 13 16 14 -6 12 28 4
7567 4 11 9 -2 3 -1 -3 -9 -8 4 -1 -18 13 12 -1 -10 18 18 -32 -28 -4 7 -5 -2 12 19 8 -1 8 29 38 14 -1 -16 45 19 8 -17 36 19
7606 19 -29 10 17 17 7 14 3 -7 -2 -14 -23 6 5 -7 -13 2 34 8 -13 8 11 -19 -19 -5 11 14 8 8 7 -1 17 8 12 35 13 -21 -3 21
7644 21 19 6 -1 20 21 -3 2 4 21 -1 7 4 11 9 -9 -11 6 4 -5 -28 -17 6 -41 -21 -9 2 -9 -31 -9 6 -12 4 -7 3 6 -4 4
7681 4 6 20 15 -1 10 25 12 -3 -6 29 -6 10 2 4 13 -12 4 -10 4 -1 14 -24 5 -1 -15 -20 -13 9 -18 -18 -11 5 -15 -3 5 -14 -13 -14
7719 -14 -3 -1 10 -10 -15 27 13 -8 -21 3 14 22 -10 0 12 -5 -24 22 14 2 -12 -7 8 -1 10 -14 -18 -5 -14 -29 -23 -1 -4 -27 -9
7754 -9 5 20 -14 -3 1 10 -8 -5 -1 11 4 16 19 4 32 6 -5 2 22 24 -13 0 3 7 -1 8 10 5 -1 -3 1 -8 5 -18 -26 1 12 -11 -24 4
7794 4 8 -25 -29 7 8 -12 -18 1 -3 7 -1 -3 6 28 10 2 -7 24 29 8 15 18 11 -1 -6 8 -1 -4 10 4 23 8 -5 -15 10 7 -22 -13 3 9 -13
7835 -13 -10 -20 8 -14 -16 -13 -2 -12 -3 -2 3 8 12 4 12 16 14 0 21 5 18 12 18 46 14 -8 2 25 -3 18 -3 -8 17 8 -15 12 10 0 2
7874 2 -7 -10 -6 -13 -17 4 -8 -21 -7 3 11 -7 -2 24 12 -2 -14 -16 12 16 14 -1 11 42 12 9 18 32 9 13 2 17 6 -7 17 19 19 10 -7
7913 -7 27 -8 -8 -3 -6 5 8 -15 -7 3 10 -24 -19 19 6 -7 5 1 8 25 14 4 6 19 1 5 14 19 17 2 -5 24 9 -18 -4 4 -4 -16 -5
7952 -5 -7 16 -8 -6 -22 -3 -1 -26 -13 -4 -8 -20 -14 -5 3 -6 7 1 13 11 -2 3 -10 5 0 -7 15 7 20 -5 3 23 30 10 17 12 2 -5 -4 9 -11
7993 -11 5 0 -5 19 -5 -20 1 3 -1 5 -25 15 -4 -8 -3 10 -1 -1 -9 -5 15 1 6 -8 7 -1 -2 -9 4 10 13 14 4 20 26 17 24 18 13 14 5 18
8035 18 14 -21 7 -1 7 -9 -23 -13 23 -22 -22 -24 -2 -13 -21 -12 10 -14 2 -8 1 8 21 12 14 13 11 12 -2 7 3 5 1 26 10 10 -1 17 18 -7
8075 -7 -13 16 10 -9 -12 -18 -18 -3 -15 -3 -10 3 -4 -16 -10 5 -6 -21 12 -5 4 5 -10 8 6 1 17 2 8 9 8 10 9 10 2 -12 -2 25 21 10 4
8116 4 16 2 0 5 3 -14 -15 -7 -19 0 -1 -19 -30 4 6 -26 -24 5 2 -2 -12 -3 -30 -5 14 1 16 2 -10 -3 13 1 4 6 18 7 9 17 13
8155 13 13 15 2 22 15 10 7 -14 7 -8 -7 -11 -11 3 -20 -18 -5 -10 -12 -12 23 5 -9 -2 -18 12 18 6 6 9 -5 2 10 3 9 8
8191H
##END NTUPLES=NMR FID
##END=
