##TITLE=1H_LY-DMAA.PER.2
 CDCl3
 8 sc, 
 20.1.2022
##JCAMPDX= 6.0         $$ Bruker NMR JCAMP-DX V2.0
##DATA TYPE= NMR FID
##DATA CLASS= NTUPLES
##ORIGIN= UXNMR, Bruker Analytische Messtechnik GmbH
##OWNER= root
$$ XWIN-NMR		Version 3.5
$$ Thu Jan 20 11:29:07 2022 Russian Standard Time (UT+4h)  she@DPX200
##.OBSERVE FREQUENCY= 200.131346
##.OBSERVE NUCLEUS= ^1H
##.DELAY= (6, 6)
##.ACQUISITION MODE= SIMULTANEOUS
##.ACQUISITION SCHEME= undefined
##.AVERAGES= 8
##.DIGITISER RES= 18
##SPECTROMETER/DATA SYSTEM= spect
##.PULSE SEQUENCE= zg30
##.SOLVENT NAME= CDCl3
##.SHIFT REFERENCE= (INTERNAL, CDCl3, 0, 15.7039)
##AUDIT TRAIL= $$ (NUMBER, WHEN, WHO, WHERE, WHAT)
$$ ##TITLE= Audit trail, XWIN-NMR		Version 3.5
$$ ##JCAMPDX= 5.01
$$ ##ORIGIN= Bruker BioSpin GmbH
$$ ##OWNER= she
$$ F:/spectra/data/she/nmr/H-F/1/audita.txt
$$ ##AUDIT TRAIL=  $$ (NUMBER, WHEN, WHO, WHERE, WHAT)
(   1,<2022-01-20 11:28:10.23 +0400>,<she>,<DPX200>,
      <created by zg, POWCHK disabled, PULCHK disabled
       configuration hash MD5:
       00 E9 B6 7A A2 85 ED C7 34 08 36 98 17 FE 4E 26
       data hash MD5: 16K
       AB 92 3E 0C B5 00 97 24 5F 57 77 70 48 28 0A D9>)
$$ ##END=
$$ 
$$ hash MD5
$$ 6D 3F FA AE BA FF CE 92 D2 1B 0F 24 E9 25 A6 E5
##$RELAX= 
##$RELAX= 
##$RELAX= 
##$RELAX= 
##$RELAX= 
##$RELAX= 
$$ Bruker specific parameters
$$ --------------------------
##$DU= <F:/spectra>
##$EXPNO= 1
##$NAME= <H-F>
##$PROCNO= 1
##$TYPE= <nmr>
##$USER= <she>
##$AMP= (0..31)
100 100 100 100 100 100 100 100 100 100 100 100 100 100 100 100 100 100 
100 100 100 100 100 100 100 100 100 100 100 100 100 100 
##$AQSEQ= 0
##$AQ_mod= 1
##$AUNM= <au_zg>
##$AUTOPOS= <>
##$BF1= 200.13
##$BF2= 200.13
##$BF3= 200.13
##$BF4= 200.13
##$BF5= 200.13
##$BF6= 200.13
##$BF7= 200.13
##$BF8= 200.13
##$BYTORDA= 1
##$CFDGTYP= 0
##$CFRGTYP= 5
##$CHEMSTR= <none>
##$CNST= (0..31)
1 1 145 1 1 1 1 1 1 1 1 1 1 1 1 1 1 1 1 1 1 1 1 1 1 1 1 1 1 1 1 1 
##$CPDPRG= <>
##$CPDPRG1= <>
##$CPDPRG2= <>
##$CPDPRG3= <>
##$CPDPRG4= <mlev>
##$CPDPRG5= <mlev>
##$CPDPRG6= <mlev>
##$CPDPRG7= <mlev>
##$CPDPRG8= <mlev>
##$CPDPRGB= <>
##$CPDPRGT= <>
##$D= (0..31)
0 1.2 0 0 0 0 0 0 0 0.06 0 0.03 0 0 0 0 0.0002 0 0 0 0 0 0 0 0 0 0 0 0 
0 0 0 
##$DATE= 1642663689
##$DBL= (0..7)
120 120 120 120 120 120 120 120 
##$DBP= (0..7)
150 150 150 150 150 150 150 150 
##$DBP07= 0
##$DBPNAM0= <>
##$DBPNAM1= <>
##$DBPNAM2= <>
##$DBPNAM3= <>
##$DBPNAM4= <>
##$DBPNAM5= <>
##$DBPNAM6= <>
##$DBPNAM7= <>
##$DBPOAL= (0..7)
0.5 0.5 0.5 0.5 0.5 0.5 0.5 0.5 
##$DBPOFFS= (0..7)
0 0 0 0 0 0 0 0 
##$DE= 6
##$DECBNUC= <off>
##$DECIM= 32
##$DECNUC= <off>
##$DECSTAT= 4
##$DIGMOD= 1
##$DIGTYP= 9
##$DL= (0..7)
0 120 120 120 120 120 120 120 
##$DP= (0..7)
150 150 150 150 150 150 150 150 
##$DP07= 0
##$DPNAME0= <>
##$DPNAME1= <>
##$DPNAME2= <>
##$DPNAME3= <>
##$DPNAME4= <>
##$DPNAME5= <>
##$DPNAME6= <>
##$DPNAME7= <>
##$DPOAL= (0..7)
0.5 0.5 0.5 0.5 0.5 0.5 0.5 0.5 
##$DPOFFS= (0..7)
0 0 0 0 0 0 0 0 
##$DQDMODE= 0
##$DR= 18
##$DS= 0
##$DSLIST= <SSSSSSSSSSSSSSS>
$$ [...]
##$SUBNAM2= <"">
##$SUBNAM3= <"">
##$SUBNAM4= <"">
##$SUBNAM5= <"">
##$SUBNAM6= <"">
##$SUBNAM7= <"">
##$SUBNAM8= <"">
##$SUBNAM9= <"">
##$SW= 18.0517287032376
##$SWIBOX= (0..15)
0 0 2 0 0 0 0 0 0 0 0 0 0 0 0 0 
##$SW_h= 3612.71676300578
##$TD= 16384
##$TD0= 1
##$TE= 0
##$TE2= 300
##$TE3= 300
##$TEG= 300
##$TL= (0..7)
0 120 120 120 120 120 120 120 
##$TP= (0..7)
150 150 150 150 150 150 150 150 
##$TP07= 0
##$TPNAME0= <>
##$TPNAME1= <>
##$TPNAME2= <>
##$TPNAME3= <>
##$TPNAME4= <>
##$TPNAME5= <>
##$TPNAME6= <>
##$TPNAME7= <>
##$TPOAL= (0..7)
0.5 0.5 0.5 0.5 0.5 0.5 0.5 0.5 
##$TPOFFS= (0..7)
0 0 0 0 0 0 0 0 
##$TUNHIN= 0
##$TUNHOUT= 0
##$TUNXOUT= 0
##$USERA1= <user>
##$USERA2= <user>
##$USERA3= <user>
##$USERA4= <user>
##$USERA5= <user>
##$V9= 5
##$VALIST= <valist>
##$VCLIST= <CCCCCCCCCCCCCCC>
##$VD= 0
##$VDLIST= <DDDDDDDDDDDDDDD>
##$VPLIST= <PPPPPPPPPPPPPPP>
##$VTLIST= <TTTTTTTTTTTTTTT>
##$WBST= 1024
##$WBSW= 4
##$XGAIN= (0..3)
0 0 0 0 
##$XL= 0
##$YL= 0
##$YMAX_a= 51457
##$YMIN_a= -49930
##$ZGOPTNS= <>
##$ZL1= 120
##$ZL2= 120
##$ZL3= 120
##$ZL4= 120
##$ABSF1= 10
##$ABSF2= 0
##$ABSG= 5
##$ABSL= 3
##$ALPHA= 0
##$AQORDER= 0
##$ASSFAC= 0
##$ASSFACI= 0
##$ASSFACX= 0
##$ASSWID= 0
##$AUNMP= <proc_1d>
##$AZFE= 0.1
##$AZFW= 0.1
##$BCFW= 1
##$BC_mod= 2
##$BYTORDP= 1
##$COROFFS= 0
##$CY= 11.3945322036743
##$DATMOD= 1
##$DC= 2
##$DFILT= <>
##$DTYPP= 0
##$F1P= 2.36226072786647
##$F2P= -0.459571619588291
##$FCOR= 0.5
##$FTSIZE= 0
##$FT_mod= 4
##$GAMMA= 1
##$GB= 0.15
##$INTBC= 1
##$INTSCL= 1
##$ISEN= 128
##$LB= 0.24
##$LEV0= 0
##$LPBIN= 0
##$MAXI= 10000
##$MC2= 0
##$MEAN= 0
##$ME_mod= 0
##$MI= 1.114404
##$NCOEF= 0
##$NC_proc= 0
##$NLEV= 6
##$NOISF1= 3.799351
##$NOISF2= 2.8
##$NSP= 1
##$NTH_PI= 0
##$NZP= 0
##$OFFSET= 15.70392
##$PC= 1
##$PHC0= -15956.29
##$PHC1= 21.20078
##$PH_mod= 1
##$PKNL= yes
##$PPARMOD= 0
##$PSCAL= 0
##$PSIGN= 0
##$REVERSE= no
##$SF= 200.130013532006
##$SI= 16384
##$SIGF1= 3
##$SIGF2= 2
##$SINO= 400
##$SIOLD= 16384
##$SREGLST= <1H.CDCl3>
##$SSB= 0
##$STSI= 0
##$STSR= 0
##$SW_p= 3612.71676300578
##$SYMM= 0
##$S_DEV= 0
##$TDeff= 0
##$TDoff= 0
##$TI= <>
##$TILT= no
##$TM1= 0
##$TM2= 0
##$TOPLEV= 0
##$USERP1= <user>
##$USERP2= <user>
##$USERP3= <user>
##$USERP4= <user>
##$USERP5= <user>
##$WDW= 1
##$XDIM= 8192
##$YMAX_p= 0
##$YMIN_p= 0
$$ End of Bruker specific parameters
$$ ---------------------------------
##NTUPLES= NMR FID
##VAR_NAME=  TIME,          FID/REAL,        FID/IMAG
##SYMBOL=    X,             R,               I
##VAR_TYPE=  INDEPENDENT,   DEPENDENT,       DEPENDENT
##VAR_FORM=  AFFN,          ASDF,            ASDF
##VAR_DIM=   8192,          8192,            8192
##UNITS=     SECONDS,       ARBITRARY UNITS, ARBITRARY UNITS
##FACTOR=    0.0002768,     1,               1
##FIRST=     0,             0,               0
##LAST=      2.2672688,     0,               0
##MIN=       0,             -49930,          0
##MAX=       2.2672688,     51457,           0
$$ Real data points
##PAGE= N=1
##DATA TABLE= (X++(R..R)), XYDATA
$$ [...]
83B5327k3432l5990K1283N0346j4676n8751N810N9883L436n4286j1001M2708J5471
$$ 25327 1895 -34095 -12812 37534 22858 -35893 -30083 29800 33236 -21050 -32051 10657 26128
96B6128k6997j5670R340J1477P747l430k2091o886L2208J7801l7281k7362L7380
$$ 26128 -869 -16539 -7199 4278 12025 8595 -13496 -20382 11826 29627 -7654 -35016 2364
109B364L4035l3190l6494K5902L4168j7179k7298Q680J6716j768m060k825q993
$$ 2364 36399 3209 -33285 -7383 26785 9606 -17692 -9012 7704 5936 1876 -949 -9942
122i942M662K0849m201l0039K073L5551P45l7018l121L4675M267k9243l604K1850
$$ -9942 -5280 15569 11368 -18671 -16598 18953 19698 -17320 -20441 14234 18501 -10742 -14346 7504
136G504J129j3529K848N513p680J482J2553o958j6642J0763J9189j3127j9819
$$ 7504 8633 -4896 -2048 3465 -4215 -2733 9820 2862 -13780 -3017 16172 3045 -16774
149a6774J4340J8388j4938j5151J5201J0606j5478n439J5782K42j5856M307J5506
$$ -16774 -2434 15954 1016 -14135 1066 11672 -3806 -9245 6537 6779 -9077 -4770 10736
162A0736p907j4261J0422J1915j1845q298J2546L557j2822J941J3110p644j3534
$$ 10736 2829 -11432 -1010 10905 -940 -9238 3308 6865 -5957 -4016 9094 1450 -12084
175a2084J2876J4034j6877j4525J9141J4486j9342j3621J7483J1374j3929p605
$$ -12084 792 14826 -2051 -16576 2565 17051 -2291 -15912 1571 12945 -984 -8589
187h589R336K250m477M366J15j1561L021J8631m519k4520M336K8388k712k9461
$$ -8589 747 2997 -1480 2886 3001 -8560 -5539 13092 8573 -15947 -11611 16777 14065 -15396
201a5396K44K7489K265k2411m055J4830M347n627k829m019p11J2898N860j9916
$$ -15396 -15152 12337 14602 -7809 -11864 2966 7313 1686 -1143 -5162 -5873 7025 12885 -7031
215g031j1927K4113J7834k5048k2534K2786K4952j7827k4377J1195K0490m007
$$ -7031 -18958 5155 22989 -2059 -24593 -1807 23145 5318 -19059 -7864 12626 8619
227H619j3457k465M089P244O504r544j6963R184K5878o447l1930J995L4326L044
$$ 8619 -4838 -7303 -3214 4030 10534 990 -15973 -6789 19089 12642 -19288 -17293 17033 20077
241B0077l2704p611K7305J0580j8973j1209Q852R118J597m513j1025k028J8269
$$ 20077 -12627 -20238 7067 17647 -1326 -12535 -3683 5435 7032 2519 -8506 -10534 7735
254G735R546k2500j6815K3401K2683k1158k6042J6475K6246j0299k3025L860J6686
$$ 7735 17281 -5219 -22034 1367 24050 2892 -23150 -6675 19571 9272 -13753 -9893 6793
267F793J775q028n675j859P303J1688o632k0176L950K6174k7k9046m203K8473
$$ 6793 8568 540 -5135 -6994 309 11997 5365 -14811 -10861 15313 15286 -13760 -17963 10510
281A0510P758k4785r767J8666R682j1098p327L183L108L973K499r558q567J3127
$$ 10510 18268 -6517 -16284 2382 12064 966 -6361 -3178 -70 3903 6402 -3156 -11723 1404
295A404J4154j4482j8352J3891K0496j1849k0273R007J7679o144j3087L723P165
$$ 1404 15558 1076 -17276 -3385 17111 5262 -15011 -6004 11675 5531 -7556 -3833 3332
308C332k229o65J758n654k146J0947L166j4837m291J6945N153j7313n277J6179
$$ 3332 1103 438 2196 -3458 -5604 5343 8509 -6328 -10619 6326 11479 -5834 -11111 5068
322E068M492j3895k676J0962P8p846L026M908o190k301Q885J39j0826J634J1743
$$ 5068 9560 -4335 -7011 3951 4029 -3817 -791 4117 -2073 -4374 4511 4650 -6176 -4542 7201
337G201l250j1532M776J0296o386q341Q070N947r728l492J1145J238j2049O66
$$ 7201 3951 -7581 -2805 7491 1105 -7236 834 6781 -2947 -6439 4706 5944 -6105 -5439
351e439J2170k082j1299L220R358m142o471N125K903o284J018P630m741r198P826
$$ -5439 6731 4649 -6650 -3430 5928 1786 -4685 440 3343 -2941 -1923 5707 966 -8232 -406
366d06J0752r940j1962J0775J2428j0305j1917Q721J0083o376o921L754K583j373
$$ -406 10346 406 -11556 -781 11647 1342 -10575 -1854 8229 1853 -5068 -1314 1269 -104
380a04K619l50q009J078J3037p46j6958m82J9240K244j9443m034J7536N259j3683
$$ -104 2515 2165 -5844 -4766 8271 7525 -9433 -9915 9325 11569 -7874 -11908 5628 10887 -2796
395b796n493Q440M327k440j840l432j897Q398O412j1938j1016J3574J4976j3264
$$ -2796 -8289 151 4478 2038 198 -3234 -5131 3267 9679 -2259 -13275 299 15275 2011
409B011j7590J1217J8297p907j6814M073J3164l54p706k490J040M039N981l981
$$ 2011 -15579 -4362 13935 6028 -10786 -6713 6451 6097 -1609 -4099 -3059 980 6961 2980
423B980j2487K465J7599K06k0666l433K1270O473j9428q667J5441R379r942q324
$$ 2980 -9507 -7042 10557 10763 -9903 -13336 7934 14407 -5021 -13688 1753 11132 1190 -7134
437g134L745N509K201j182p160m076J0575R438j2039j4103J1645J7343r696j8558
$$ -7134 -3389 2120 4321 3139 -4021 -8097 2478 11916 -123 -14226 -2581 14762 5066 -13492
451a3492O736J7561l439j4387M87R480J571l482k471k811K016Q635m78j3292j793
$$ -13492 -6756 10805 7366 -7021 -6534 2946 4517 1035 -1436 -4247 -2231 6404 5926 -7366 -9159
466i159J6232M259j7235o375J6314P603j3737p654J0074O329n848l790J768K47
$$ -9159 7073 11332 -5903 -12278 4036 11639 -2098 -9752 322 6651 803 -2987 -1219 -972
480i72J800L741m325p623N746J0896o129j3021N654J3749m714j2988L632J0866
$$ -972 828 4569 244 -7379 -1633 9263 3134 -9887 -4233 9516 4802 -8186 -4554 6312
494F312k800p739K407M023k579j81L200l380m007O190M836q162n350R241N347
$$ 6312 3512 -4227 -1820 2203 -376 -557 2643 -737 -4744 1446 6282 -1880 -7230 2011 7358
509G358r469m661R065L328q231j438P194p47o118L000N040n012l929O464K823
$$ 7358 -2111 -6772 2293 5621 -2610 -4048 3146 2399 -3719 -719 4321 -691 -4620 1844 4667
524D667p322j605P504J35p082J551O198l435n077N376L903p168k851Q600K010
$$ 4667 -2655 -4260 3244 3379 -3703 -2152 4046 611 -4466 910 4813 -2355 -5206 3394 5404
539E404r426j336R479P79q630j65O980o41m668J824J903l358R15N132l382p043
$$ 5404 -4022 -5358 4121 4900 -3730 -3895 3085 2444 -2224 -400 1503 -1855 -940 4192 810 -6233
555f233N226Q773o250j0057O383J0513n732r944M487Q230k963n505J557J914n25
$$ -6233 -1007 7766 1516 -8541 -2158 8355 2623 -7321 -2834 5396 2433 -3072 -1515 399 -126
570a26K209J07o226m11R728J378j2286k716J3492M165j3203n286J1466N703q521
$$ -126 2083 2190 -4036 -4447 5281 6659 -5627 -8343 5149 9314 -3889 -9175 2291 7994 -527
585e27n187M787L625q49j040k819k296N625N967p312r444P701J2167o874j3649
$$ -527 -5714 -927 2698 1849 809 -2010 -4306 1319 7286 -26 -9470 -1769 10398 3524 -10125
600a0125N117J3612k852j1947O03Q823J191m582k166k05K112M952j031r021q26
$$ -10125 -5008 8604 5752 -6195 -5592 3231 4422 -160 -2326 -2531 -419 4533 3502 -5519 -6345
615f345J1944L079j3419n257J3244O893j1609p608Q799P123n300n451J663K672
$$ -6345 5599 8678 -4741 -9998 3246 10139 -1470 -9078 -279 6844 1544 -3907 -2244 428
629D28J631Q89m145m696N596Q291n938j1121N307J2763l908j2970K206J1686n65
$$ 428 2059 2948 -1197 -5893 -297 7994 2056 -9065 -3758 9005 5097 -7873 -5667 6019 5454
644E454r102o42N578J145j576q11k469k41N893J820q401l619R805N186j0023o207
$$ 5454 -3648 -4290 1288 2433 857 46 -2423 -2664 3229 5049 -3352 -6971 2834 8020 -2003 -8210
660h210R187O417p569n692N516M117l377j787J433r35Q7L737j093o138J567P922
$$ -8210 977 7394 -175 -5867 -351 3766 389 -1398 35 -900 -813 2924 1831 -4307 -2740 5182
676E182j649q926J541Q978j399q194J393O697j645m745K163K548k928l56L721
$$ 5182 3533 -5393 -3852 5126 3727 -4467 -3074 3623 1978 -2767 -604 1944 -984 -1340 2381
691B381j551m436L075M873m126m895M761M498n088l576N187K295n151p71N074
$$ 2381 830 -3606 -531 4342 216 -4679 82 4580 -508 -4084 1103 3398 -1753 -2524 2550
706B550q32m920K273M686l405m318M137L661m449k717M389J414m090J89L645j978
$$ 2550 1718 -3202 -929 3757 352 -3966 171 3832 -617 -3334 1055 2469 -1621 -1432 2213 235
722B35l199L755K859n327k609O477K486p063k334O971K100o218j590M873P18l086
$$ 235 -2964 791 3650 -1677 -4286 2191 4677 -2386 -4720 2251 4351 -1867 -3457 1416 2134 -952
738i52N48J111k152P58L963k308n718L277P230l670q240L455Q502k794p879J855
$$ -952 -404 707 -1445 -687 3276 968 -4750 -1473 5757 2087 -6153 -2698 5804 3010 -4869 -3014
754c014O403r29m142K65J298k2J785L13m638j093O951K226q432l487Q948M562
$$ -3014 3389 2460 -1682 -1417 -119 -141 1644 1957 -2681 -3774 3177 5403 -3029 -6516 2432 6994
770F994q411n201O985N116m895m270K481K600r9k50j932k479L295N191l877p549
$$ 6994 -1417 -6618 367 5483 588 -3682 -1201 1399 1300 1050 -882 -3361 -66 5125 1248 -6301
786f301L706R223k914r902J713R503m15p976o83N572J336k557j317p31O44L810
$$ -6301 -2595 6628 3714 -6188 -4475 5028 4613 -3363 -4046 1526 2862 305 -1012 -1743 -1099 2711
802B711N98o279k185P854L818q451n195Q032N974o752o000M882N162k760l509
$$ 2711 3309 -2970 -5155 2699 6517 -1934 -7129 903 6877 125 -5875 -993 4169 1409 -2100
817b100P26J175R75J474k055m107K497O345k329p878J705Q600q67q348L8P231
$$ -2100 -1374 -199 776 2250 195 -3912 -1415 4930 2601 -5277 -3572 5028 4161 -4187 -4149 3082
833C082N33n406p09L121L78o53L82j687j482L598K695m926l782N555M588n572
$$ 3082 3615 -1791 -2500 621 999 346 728 -959 -2441 1157 3852 -1074 -4856 699 5287 -285
849b85m908N076M633m245l755L255K387k271o34J448j230q69L005N17m427l57
$$ -285 -5193 -117 4516 271 -3484 -229 2158 -113 -747 701 -529 -1398 1607 2124 -2303 -2660
865b660N376K68n755j90N614o6m996M80M042j098k898J825J735k596o75L301k49
$$ -2660 2716 2984 -2771 -2961 2653 2587 -2409 -1929 2113 1015 -1883 -58 1677 -919 -1594 1707 1458
882A458l776J001L945j574l763K062L239k478k413K900J394l302l29L678o70l968
$$ 1458 -2318 -1317 2628 1054 -2709 -647 2592 114 -2299 601 1995 -1307 -1636 2042 1372 -2596
898b596J475M090k062l950K358L502k463k691K377J557k248j73K137j321k107
$$ -2596 -1121 2969 907 -3043 -685 2817 354 -2337 40 1597 -651 -824 1313 -8 -2115
913b115K758K212l961k379M785K544n088k604M893K454m205j994L144J167j876
$$ -2115 643 2855 -1106 -3485 1300 3844 -1244 -3848 1045 3499 -706 -2700 444 1611 -265
928b65ON83j438N30K956j322m404J718N535j737o175J377O260q46n687K86M472
$$ -265 -259 324 -1114 -584 2372 1050 -3354 -1636 3899 2162 -4013 -2636 3624 2778 -2909 -2623 1849
945A849J39k736k50O82J5J442N93l326j490M769K504n564l500N716M204n215m441
$$ 1849 1988 -748 -998 -316 -301 1141 1734 -1592 -3082 1687 4191 -1373 -4873 843 5047 -168 -4609
962d609M148M145k769l208J249J700J23K17j185k283J763M224j844n743J461O679
$$ -4609 -461 3684 915 -2293 -1044 656 779 996 -189 -2472 -709 3515 1671 -4072 -2611 4068
978D068p96o872K6O336O53n091j063L337J068j285o21p85k30K591J370l956k584
$$ 4068 3272 -3600 -3574 2762 3415 -1676 -2739 598 1666 381 -240 -1025 -1255 1336 2706 -1250 -3834
995c834M722L634m857m385M433M663l601m367K503L483j352k080L43L54L64J506
$$ -3834 888 4522 -335 -4720 -287 4376 775 -3592 -1089 2394 1042 -1038 -695 -341 23 1529
1011A529p05l232P13M617m19n488k1N751M63n414p46M523P77l255m92J783j10
$$ 1529 824 -2408 -1695 2922 2503 -2985 -3006 2745 3208 -2206 -2952 1571 2348 -907 -1399 384 274
1028B74l34R52r80j869J965K742k593l397K845L739k825l669K588L198k228k384
$$ 274 -60 892 -88 -1957 8 2750 157 -3240 -395 3344 519 -3150 -562 2636 408 -1976
1044a976J893J308j596j22J434j064j328K073J291k838j241L274J122l425q72
$$ -1976 -83 1225 -371 -493 941 -123 -1451 622 1913 -925 -2166 1108 2230 -1195 -2067
1059b067L296M37k935J06K463q03j922J525J399k193r10K700M93k973r1K969k80
$$ -2067 1229 1666 -1269 -1163 1300 497 -1425 100 1499 -694 -1604 1096 1589 -1384 -1475 1494 1214
1076A214k710P12K213j189j560J726Q44k288j45K798m36l197Q43L389j084l304
$$ 1214 -1496 -784 1429 240 -1320 406 1250 -1038 -1183 1615 1179 -2018 -1175 2214 1130 -2174
1092b174J159K924j174k233J135J308j170j84J264r52j474J993J768k792k083
$$ -2174 -1015 1909 735 -1498 -363 945 -225 -409 855 -97 -1571 422 2190 -602 -2685
1107b685L286K359l412k469L159K371k613j956J864J214j019k04K18r97L98K205
$$ -2685 601 2960 -452 -2921 238 2609 -4 -1960 -96 1118 99 -105 113 -884 -486 1719
1123A719p46l334Q47M147o68m596L35M565L7m022l30L036M56j729l08K71j01J127
$$ 1719 973 -2361 -1514 2633 1965 -2631 -2296 2269 2306 -1716 -2046 990 1446 -283 -591 -320 -421 706
1141G06P71k310j582L140K410l537l091L502L455l039l463K286L027j408k174
$$ 706 1477 -833 -2415 725 3135 -402 -3493 9 3464 425 -3038 -752 2275 867 -1307
1156a307N36R86J63M40o43j860P83L137o15m096K36M601K58m609p16M121J015
$$ -1307 -771 215 378 818 175 -1685 -902 2235 1620 -2476 -2240 2361 2619 -1990 -2706 1415 2430
1173B430l183j066J990Q01o58k33o25n68J681J477k416k359K754L034k713l421
$$ 2430 -753 -1819 171 972 314 81 -544 -1112 569 2046 -370 -2729 25 3059 346 -3075
1189c075K383L400j850k975J257K166p14j084L24j57r3J366R1k387k56L151M98
$$ -3075 -692 2708 858 -2117 -860 1306 592 -492 -168 -325 -418 948 1039 -1348 -1604 1547 2045
1206B045l554p27L555Q96l247q73K649O53j876k39J032l44k51J004m00j664Q82
$$ 2045 -1509 -2236 1319 2215 -1032 -1905 744 1397 -479 -718 314 -30 -281 723 323 -1341 -459
1223d59K198j152k566J267K683j277k504J223K084j163j435J142O97j187O6J282
$$ -459 1739 587 -1979 -712 1971 694 -1810 -587 1497 334 -1101 41 738 -449 -383 899
1239H99p54j395J333J432j714j419J931J231j950r25J871M67j720R3J524o99j331
$$ 899 145 -1250 83 1515 -199 -1618 313 1544 -406 -1331 540 1007 -713 -620 904 205 -1126
1256a126J259J160j716j012K035Q27k111o29K018L45j737L5J355n01r06J034M51
$$ -1126 133 1293 -423 -1435 600 1427 -684 -1313 705 1050 -687 -652 703 202 -704 330 781
1273G81j572q0K050j78k425L32K585l67k536L52K225l40j682L63R76m96j48P26
$$ 781 -791 -871 1179 1001 -1424 -1092 1493 1126 -1410 -1058 1167 827 -855 -492 484 -12 -160 566
1291E66o64j038J364J426j879j771K141K034k141k116J896J987j505j580R93R48
$$ 566 -98 -1136 228 1654 -225 -1996 145 2179 38 -2078 -182 1805 300 -1280 -287 661
1307F61n00j22P6q14J79J727k86k471J94L003K1l240k85L109N25k636o55J927
$$ 661 161 39 115 -699 -520 1207 921 -1550 -1356 1647 1668 -1572 -1857 1252 1777 -859 -1514 413
1325D13O15j031l54O6r3Q13P11j520j362J955J974k087k443J951K654j604k562
$$ 413 1028 -3 -357 -291 -384 429 1140 -380 -1742 213 2187 100 -2343 -392 2262 658 -1904
1342a904J100K148o01j444J60N18J53M82k54j431J39K260R9k799m15L011P26k888
$$ -1904 -804 1344 743 -701 -541 -23 130 612 358 -1073 -934 1326 1425 -1374 -1789 1222 1948 -940
1360i40r41K488R83j833q28J061M62k72R0m55p39J002J368j312j955J436K331
$$ -940 -1881 607 1590 -243 -1071 -10 452 180 270 -185 -924 78 1446 134 -1821 -385 1946
1377A946j340k475J117K337q25j940N45J330l43n60K29k31k67R78M14j579o05
$$ 1946 606 -1869 -752 1585 760 -1180 -635 695 352 -208 21 -210 -477 501 915 -664 -1269
1394a269J976Q08k150r24K080R34j828q03J461M87j036o2O06m39k30R27m0j356
$$ -1269 707 1515 -635 -1559 521 1455 -373 -1176 285 772 -264 -326 280 -159 -389 538 498 -858
1412h58K15J680l38j831L96J793m36j588N25J240o24p97P74L24r44J13J118m92
$$ -858 -643 1037 699 -1132 -736 1057 621 -967 -442 798 174 -623 151 475 -469 -356 762 270
1430B70j245P67J281r19j234R83J069j006p63R71L65r38Q3R18n37r07R17R40j202
$$ 270 -975 -208 1073 154 -1080 -97 972 -34 -797 174 539 -399 -316 602 65 -842 75 1015 -187
1449a87r45J361R04j367p75J237N75j027k46P70j91m73O34K48j109q6J513Nj791
$$ -187 -1132 229 1133 -234 -1009 228 803 -224 -470 300 109 -364 270 518 -591 -677 836 841 -950
1468i50j6J913L4j834p2J562P2j130mO06j81j2M43n26p73R74J110j255j412J363
$$ -950 -966 947 981 -853 -925 637 709 -421 -425 181 0 -12 431 -95 -868 106 1216 -39 -1451 -88
1488h8J615j290j670J070J547p75j216M53P14j72q7l9n77J00J211j9j733j46K047
$$ -88 1527 237 -1433 -363 1184 409 -807 -354 360 188 101 62 -515 -415 796 777 -956 -1102 945
1507I45L45k110n66J977P12j639p05J108N73n19k71o4j66N71O72r32j168J129
$$ 945 1290 -820 -1386 591 1303 -336 -1041 67 640 121 -150 -214 -380 191 863 -69 -1237 -108
1525a08J571j125j864R96J915p27j786M45J419j81q83%K27P7M47k7j049j39J528
$$ -108 1463 338 -1526 -530 1385 658 -1128 -683 736 555 -328 -328 -101 -24 423 396 -653 -792 736
1544G36L81j812o07J871Q04j740q79J423Q27r93o23N22K68r0J71k48o74M90J112
$$ 736 1117 -695 -1302 569 1373 -367 -1246 177 1004 11 -612 -90 178 88 259 11 -663 -173 939
1563I39n95j458N75J644m69j668L49J492k29j166J61P27j52k37K56k54l90O76
$$ 939 344 -1114 -539 1105 636 -1032 -683 809 580 -586 -425 302 150 -87 169 -85 -475 201
1581B01N49r81p03J142Q38j201q57J125P82r78n76P51L01n61M2L88m18k46P40
$$ 201 750 -231 -934 208 1046 -155 -1012 113 895 -83 -659 92 393 -168 -126 262 -156 -402 338
1600C38J74j009j21J155J07j203n9J121j3r37J45O81k86m23N01J59p00M3Q78j93
$$ 338 512 -497 -618 537 644 -559 -618 503 490 -447 -302 379 93 -330 171 330 -370 -327 551 358
1620C58j000K87J040l38r79L62P92l73n35L95K43m78R5N66m15o61O39P81p96q42
$$ 358 -642 -355 685 347 -632 -270 522 149 -386 9 252 -226 -131 435 20 -641 -2 779 -17 -859
1640h59Q42Q56q11p43O95N51n23k85L56o5k09M25J22p77r0J057J28j256j90J291
$$ -859 -17 839 28 -715 -20 531 8 -277 79 14 -195 230 352 -425 -515 542 670 -586 -776 515
1660E15K67j220k90J007K69o82j85L32j5N4K69l75n64O03Q56p18j087P14J232
$$ 515 782 -438 -728 279 548 -134 -319 13 -2 52 321 -54 -618 -15 841 123 -964 -250 982
1679I82o09j246M37J122k57q58Q9M66J8j1n0m54JQ52J34j162l04J326M78j326
$$ 982 373 -873 -436 686 429 -429 -340 126 144 133 83 -371 -370 482 616 -546 -850 476 954 -372
1699c72o21J194O64r06o25N86M45k14j58j25j91L81N60n20r04N46J178n03j301
$$ -372 -993 201 865 -41 -666 -80 365 151 -7 -132 -323 58 618 98 -806 -260 918 415 -886
1718h86L54J288j91j146M9Q52N6m71p5L4J8L67J20p00l00R51M86j055o40J019
$$ -886 -532 756 565 -581 -532 320 376 -95 -170 -136 -118 249 369 -331 -631 320 806 -249 -889 130
1738A30P46r12p16O97O23m57m10K13J12j5K24j39n29J84Q19j89j006J37J086p5
$$ 130 876 -36 -752 -55 568 111 -299 -86 26 11 235 96 -433 -249 570 381 -625 -488 598 523
1758E23j042J5Q79J8o46QL60q7o6K26k09l75L99N39n24o43N68O89n45o72M87N69
$$ 523 -519 -504 375 393 -253 -245 115 28 -38 188 -21 -396 3 542 18 -625 -57 632 87 -585 -98 471
1780D71m19l80L27J61k91R8K67l36k65N28K74o43k86P08K80o88k39O07J48m76
$$ 471 52 -328 -1 160 -131 -33 234 -102 -367 161 435 -208 -494 214 494 -194 -433 174 322 -154
1800a54rL28j56j94L35Q6n20OO54n2p27M4P47m8o73N0N24r9l19J50J17k63J15
$$ -154 -163 165 9 -185 150 236 -284 -278 376 324 -403 -359 388 340 -333 -283 241 142 -177 -27 90 -173 -58
1823e8L71k93m94M22O00m70o52M58O71l97n91L01M36k08k17J01j0p9K88P1n29
$$ -58 313 20 -474 -52 548 78 -574 -116 555 158 -433 -132 304 96 -121 -20 -30 -109 179 250 -279
1844b79j21P19J78q09k77Q27L25p42l48N84L12l73j95J29N0P9J76k57l99L64O07
$$ -279 -400 319 497 -312 -589 238 563 -179 -527 57 369 -4 -199 -70 -20 59 235 -22 -421 -57 550
1865E50l85p79L68Q43k62q32J45P14l6n12m2K38P0N1l0l37o4N67J90p18l17P80
$$ 550 165 -614 -246 597 335 -497 -352 362 326 -186 -228 10 80 131 101 -236 -300 267 457 -261 -578 202
1887B02M33p40n31O37N24m60m34K48K83m6o9j19j51K02M12k56o20K21P71j58q32
$$ 202 635 -105 -636 1 525 65 -369 -121 162 116 47 -72 -223 -21 391 135 -485 -264 507 349 -483
1908d83O1P91L1o49r7M56J09k12o4l0k6K60J43m25k99N28M30n59n07N21N33m18
$$ -483 -422 369 400 -249 -346 110 219 7 -57 -87 -113 147 290 -135 -434 94 524 -35 -542 -21 512 94
1930I4m80K91L67j68k21P0MoK12j8m06ON43K8o11q2O27J28n85j15M53J06l09k9
$$ 94 -386 -95 272 104 -117 -47 -43 -49 163 145 -261 -255 288 316 -295 -377 250 378 -207 -322 131 237 -72 -101
1954a01J42o5kJ84j03l11J92M12k29m80K24M88j94m48J66L30j31k02J30M2j50
$$ -101 41 -24 -26 158 55 -256 -64 348 119 -361 -137 351 157 -291 -125 205 74 -128 2 44 -106
1975a06J10J78k46k27L44K61l90k77L80K91l35k54K72J70k07k4J22j03o6K44M2
$$ -106 4 182 -64 -291 53 314 -76 -353 27 318 -17 -271 1 171 -36 -60 62 -41 -107 137 179
1996A79l66l8M42O7n03o0M54R9l91r3K89M1j58K2J4j03J00K22j93l31K36M31k58
$$ 179 -187 -225 217 284 -219 -279 175 274 -117 -210 79 120 -38 -16 -2 -105 -5 217 24 -307 -71 360 102
2019A02m59K15M72j64m03Q9K99l8j52J5l7rK02M2l51j08M63J73m97k44M81K84
$$ 102 -357 -142 330 166 -237 -148 151 113 -39 -24 -61 -70 132 174 -177 -285 178 351 -146 -390 91 375
2041C75m09k86L00K38j59j38K6J6P4J48j73k93J95M30j75n21J32N44n3n23k0M32
$$ 375 -34 -320 -20 218 59 -79 -53 -37 37 185 12 -281 -86 344 169 -352 -220 324 271 -252 -272 160
2063A60M7k72r0J16O6M9Nk29o8L54J64m07k79M38L29l73l66K88L56j70k81P3J47
$$ 160 207 -65 -155 -39 27 76 81 -148 -216 138 302 -105 -384 54 383 10 -356 -68 288 118 -163 -90 57
2086E7K4pq1j56J11K93r5m04L2M81Km81o5M30R9l23j09K03Q2o5k2p5m7J65J49
$$ 57 81 74 -7 -163 -52 241 146 -258 -226 255 257 -224 -289 141 240 -83 -192 11 93 28 6 -69 -116 49 198
2111A98k28k47K62L11k41l53K12L47j44l02J03J95m2r0J2m8%J56L6k62p1L13J12
$$ 198 -30 -277 -15 296 55 -298 -86 261 117 -185 -82 113 71 -19 -7 -55 -55 101 137 -125 -196 117 229
2134B29l41j38L33J37k72j30J90R2j04j6L5q2L0J76p4k36P8K91o8l26O0K96k7
$$ 229 -112 -250 83 220 -52 -182 8 100 -4 -20 15 -67 -37 139 65 -171 -93 198 130 -196 -136 160 133
2157A33k56J1J81k3p6M3l4o3R9J25j63j79K07K15j98k34J85K23j46j77R3J19o9
$$ 133 -123 -112 69 46 -30 13 -21 -84 15 140 -23 -202 5 220 22 -212 -27 196 50 -127 -34 85 16
2180A6qJ3o7k4J67K0k38m7K79Q3k89j18K76J12k16r7J32N6l3j7l0n5P4J58j10
$$ 16 8 21 -46 -70 97 117 -121 -168 111 194 -95 -213 63 175 -41 -138 -6 50 17 0 -30 -85 -11 147 37
2205C7k31J27K92j14l00O7K94l7k46KJ62K9p6j8m1JJ42K0k15q4K62J40k69j94
$$ 37 -194 -67 225 111 -189 -122 172 135 -111 -109 53 82 6 -12 -53 -52 90 110 -105 -189 73 213 -56 -250
2229b50K49K12j92k08J30J59l4r5l3J2O5R9q6j87P7K66m0l18PL18M1k82p1K05
$$ -250 -1 211 19 -189 -59 100 66 -29 -62 -50 15 114 28 -159 -82 184 144 -174 -167 151 192 -90 -161 44
2253D4R1j30q0K1N1O8K1j47r4J99J46k10k07K05K36j53k45R8K26n0j47kO7K6K0
$$ 44 135 5 -75 -54 -3 65 86 -61 -155 44 190 -20 -227 -22 214 61 -184 -86 140 90 -57 -59 8 34 54
2278E4l8j19L6J94k2k36k8K60P6k45r8J91J17j50p6N4O6mj1n2m8Q4J23j02j84
$$ 54 16 -103 -67 127 105 -131 -159 101 177 -68 -166 25 142 -8 -84 -30 36 32 21 -31 -79 5 128 26 -158
2303a58J11K13q3k14N4J87j6j53nP6K1j6j4n5j0J21M3j65o6J68J08j86r9J31J25
$$ -158 -47 166 83 -131 -77 110 94 -59 -64 12 33 17 3 -52 -62 59 102 -63 -129 39 147 -39 -138 -7 118
2328A18r9r7M9N7j4Rj4n6K3J34l4j71K4J70Rj92j5J54L0j13m0P2K6j8%k9n2O7
$$ 118 19 -78 -29 28 14 23 9 -47 -24 110 76 -95 -71 99 108 -84 -99 55 85 -28 -68 4 30 12 12 -17 -69 -2
2356bQ5q9j25J04J50q3j59P6J40l6j02%N7J0Mj0n7jJ00K4j37n1J64P0j61q5J22
$$ -2 83 -6 -131 -27 123 40 -119 -43 97 61 -41 -41 16 26 30 20 -37 -38 62 86 -51 -102 62 132 -29 -114 8
2383HR4r0q1N1N1nj1l1l9N9Q3n5j46N7J62l7j57NJ49J8j17m4P1N9k7l5k8nQ4L0
$$ 8 102 12 -69 -18 33 28 17 -14 -53 6 89 34 -112 -55 107 70 -87 -82 67 85 -32 -76 -5 54 27 -8 -36 -41 43 73
2413G3j03p1J27J03j30j22R5J48p2j29L6Q0J4n0l3KM0O2m3j06K1J54rj56l0J42
$$ 73 -30 -101 26 129 -1 -123 -28 120 48 -81 -45 35 49 -1 -34 -32 8 70 27 -79 -58 96 87 -69 -99 43
2439D3N9j35p1J00N4k5o6NK5L6L3q5o1R6R5q2j28P7J27l1j29J3J05Ro8k5K4K5
$$ 43 102 -33 -104 -4 50 25 -41 -36 -11 25 58 -27 -88 8 103 21 -107 -30 97 66 -63 -50 55 64 -4 -29 -5 20
2467B0J6nq4J0J04J7j30m1J16O1j00p1P5O3m1n3kL8K1K0l7o5O5P5m5r6L5J04o
$$ 20 36 31 -53 -43 61 78 -52 -93 23 84 -16 -87 -12 51 10 -43 -45 -7 14 34 -3 -68 -3 72 27 -69 -34 70 64
2496F4j04j1R4J9o1k3J6L1J9j4n9j0P7K8p1p7Q3P7n9q4M2P7k4n0kJ6K3J1k7k8
$$ 64 -40 -51 43 62 1 -22 -6 25 44 30 -29 -39 38 66 -5 -82 1 78 19 -65 -23 54 30 -20 -22 -6 17 28 1 -27
2526b7K2N0j1p7rR8K1p7n1P3M5l9l9PK9J5pl3k8N3N1n4p2M2R0l0q7J0O4K3n7k0
$$ -27 -5 45 34 -43 -52 46 67 -10 -61 12 57 18 -21 -14 15 30 23 -10 -38 15 66 12 -60 -18 72 42 -45 -35 29 52 -5 -25
2558b5J6L1J1k4l8JN7K5q4l1O1N4o2n5M6O2j9o2J4L5Pqk9j7L0O1k4q1J9R5j3q1
$$ -25 -9 22 33 9 -29 -28 29 54 -30 -61 0 54 -8 -63 -17 45 26 -36 -22 13 20 12 -17 -34 -4 57 33 -48 -29 66 53 -28
2590b8k8Q0K8n2m2L2M1j0k1k5lN0K0o0m6O2N5n8n7M1N5j2n1nM7J9j3l4oJ2M9j9
$$ -28 -56 24 52 0 -42 -10 31 21 0 -25 -28 22 42 -18 -64 -2 53 -5 -62 -21 34 22 -29 -34 13 32 19 -15 -21 -9 40 21
2622B1n4NO4J8p0l3O0L6l3n8K6L8Nk7j7oM0K1m6m1M2N4k9p2K2O6km8k1M3K8j8
$$ 21 -33 -28 36 54 -16 -49 11 47 14 -44 -18 20 25 -2 -19 -25 15 36 -10 -51 -9 45 16 -56 -34 32 30 -18 -39 4 32 14
2654A4l9OK4K1j5l2kL4K6m9l7M4N7l8m0J3K3J6j5k4kL0J4l0k2K4L0Ln1j8N7K3
$$ 14 -25 -19 5 26 11 -21 -23 11 37 -12 -49 -5 52 14 -26 -13 10 26 11 -13 -15 15 29 -1 -23 1 31 34 -17 -35 22 45
2686D5m7k5K3K7pl8jK1OJ0l8%K7L4l6l4J5N8k0l9LK6K6k6k2J2J4J1j7k7PL3Ll6
$$ 45 -2 -27 -4 23 16 -22 -23 -2 4 14 -24 -24 3 37 1 -33 -18 40 20 -19 -16 10 36 10 -12 0 14 25 8 -19 -12 21 24 -12
2720a2j9L3L1k7m0K1K4Rl3k4J8K1Mk1j9K7L3l5k3J5L8Ol6j4K9K0j6k4LL4Lj3j7
$$ -12 -31 2 33 6 -34 -13 11 20 -13 -37 -19 2 6 -15 -34 -7 26 -9 -32 -17 21 27 -9 -23 6 26 10 -14 -11 23 26 13 -4
2753dJK2J1l2k4L0K7k3k5MK5kj2j8J5K0j3j6rL4J7j4l4MK5Pk4j6K0K2Kl3jJ7J6
$$ -4 -3 19 30 -2 -26 4 31 8 -17 -13 12 10 -2 -20 -5 15 2 -14 -23 11 28 14 -20 -16 9 16 -8 -24 -4 18 20 -13 -14 3 19
2788A9j5k2J7RJ2j8j6J3K5rk7MK0J7l5j6K2J9qj4qJ4LnpkJ1J7k9nnL2mk3JJ2J8
$$ 19 4 -18 -1 8 20 2 -14 -1 24 15 -12 -8 12 29 -6 -22 0 19 11 -3 -11 3 6 1 -6 -8 3 20 -9 -14 -19 13 9 -14 -13 -1 17
2825A7rj5JJ1Npj1J8QNl2QJ1J7j3j3J1NMj9r%K3rj8ORlqrlK3Lj7j4J0K6j5j3J0
$$ 17 8 -7 -6 5 10 3 -8 10 18 23 -9 -1 10 27 14 1 12 17 21 2 -7 -7 16 7 -11 -5 4 1 -7 -16 -19 4 7 -10 -24 -14 12 -3 -16 -6
2865fJ4Rj7pMJ5j0kqJ9J0mj5j0K1J0j1k3J5J1pj3j8K9Ljk3JJ2Npj8K0J4Ll3KP
$$ -6 8 17 0 -7 -3 12 2 0 -8 11 21 17 2 -8 13 23 12 -11 4 15 8 -5 -23 6 9 8 -15 -14 -2 3 -4 -22 -2 12 15 -18 -16 -9
2903iJ9j7mKK2pj2KJ1Qkk4LJ0Qlk6J8J0Mk0OQjNnlQ%nk0J3J0lj4j5K1J0j3l%J4
$$ -9 10 -7 -11 -9 13 6 -6 -4 7 15 13 -11 -8 2 10 7 -19 -1 9 13 -7 -1 7 6 11 6 3 11 11 6 -14 -1 9 6 -8 -23 -2 8 -5 -8 -8 6
2945FlrnKPQnj0J0KNrNK1j1j8QJ1Rk2KOj3J6prOlLj1nLK4k0j0PPJmJ1qjqRrOJ3
$$ 6 3 -6 -11 -9 -2 6 1 -9 1 3 8 -1 4 25 14 -4 4 15 24 2 4 10 -3 13 6 -3 3 0 3 -8 -13 -10 14 -6 -16 -9 -2 -1 -5 6 -2 -3 -11 -2 -11 -5 8
2992HOj5jK2nj6NkNLqNmkqNjJ0Kj0j0OJ4pMj4Rj0%RmJKLlj5J3J3j4RkJ4qj3MQ
$$ 8 14 -1 -2 20 15 -1 4 2 7 10 2 7 3 1 -7 -2 -3 7 9 -1 -11 -5 9 2 6 -8 1 -9 -9 0 -4 -3 -1 2 -1 -16 -3 10 -4 5 3 17 9 -4 0 8
3038Hj7J4KjnJ1j1nMJRj0j0J4Pk0%J4Jj1qMOJLpqJ6Koj1MJ9qqj1K5j0JKRj3KJ
$$ 8 -9 5 7 6 1 12 1 -4 0 1 10 0 -10 4 11 -9 -9 5 6 -5 -13 -9 -3 -2 1 -6 -14 2 4 -2 -13 -9 10 2 -6 -17 8 -2 -1 1 10 -3 -1 0
3082@J5nqRj1RQpojJ1prPMkj1LnPj2J3%j4J0MrJJ0Mj7%J2J6k1LkQlJOmoMRpkK
$$ 0 15 10 2 11 0 9 17 10 4 3 14 7 -2 5 9 7 -4 -1 -6 1 -11 2 2 -12 -2 2 -7 -6 4 8 -9 -9 3 19 -2 1 -1 7 4 5 11 7 1 5 14 7 5 7
3130GMj3%R%k1KJ4Ok3JJ2lMKJj0jRoJnNmOkMJ%J0Jj1lMrJ3Qnj3%J2Nj8QJ1oj5
$$ 7 11 -2 -2 7 7 -14 -12 2 8 -15 -14 -2 -5 -1 1 2 -8 -9 0 -6 -5 -10 -5 -9 -3 -5 -1 0 0 10 11 0 -3 1 -8 5 13 8 -5 -5 7 12 -6 2 13 7 -8
3177h%J4joK%Lj1RqpJ3mj5%J9%pj3J9jj5MJ6joJO%oORj6MKJ1k1KJ8m%pR%j8RK
$$ -8 -8 6 5 -1 1 1 4 -7 2 -6 -13 0 -4 -19 -19 0 0 -7 -20 -1 -2 -17 -13 3 2 -4 -3 3 3 -3 3 12 -4 0 2 13 -8 -6 12 8 8 1 10 10 -8 1 3
3224Cpj1K9pk3LJ6jj4kJ3j0NKNmMJ%LnNpkJ1Qjj5QJLqONj1%%olN%qKNMj2j2K2
$$ 3 -4 -15 14 7 -16 -13 3 2 -12 -14 -1 -11 -6 -4 1 -3 1 2 2 5 0 5 -2 -4 7 15 14 -1 7 8 11 3 9 14 3 3 3 -3 -6 -1 -1 -9 -7 -2 2 -10 -22 0
3272@lr%JJ1OjqpKK2j0j7J6Rmj5J1J8rk0J0lQqKj1QNOj5%QJ0j6j7K3Mrk0J2Qr
$$ 0 -3 -12 -12 -11 0 6 5 -3 -10 -8 14 4 -13 3 12 8 -7 4 22 13 -7 3 0 8 0 2 -9 -1 4 10 -5 -5 3 13 -3 -20 3 7 -2 -22 -10 -2 -11
3315a1j3J6%RKj1KOOJl1K0K0pj4PJ2Lj3mkJ0jpMqJ1Lj1lLRqk5K6Lnj3%LJ4%j1
$$ -11 -24 -8 -8 1 3 -8 -6 0 6 7 -24 -4 16 9 -5 2 14 17 4 0 -2 8 7 0 4 -4 7 10 -1 -4 -1 8 0 -25 1 4 -1 -14 -14 -11 3 3 -8
3358hPj6J6Rk6mK9Nk2oL1plp%J6j2J0orJ8J2j6j5NJ8j5j0rL1rj8NOJmNj5MK2j7
$$ -8 -1 -17 -1 8 -18 -22 7 12 -10 -16 15 8 5 -2 -2 14 2 12 6 -3 15 27 11 -4 1 19 4 -6 -15 16 7 -11 -6 0 1 -3 2 -13 -9 13 -4
3399dloK0Mmj6QJ6k1mNJ6qLo%MJ4Pk3kK6j1k1JOQj0mMLJkkKKJ1j3nMpRk1J5J3
$$ -4 -7 -13 7 11 7 -9 -1 15 -6 -10 -5 11 3 6 0 0 4 18 25 2 0 26 15 -6 -5 1 9 -1 -5 -1 2 3 1 -1 1 3 14 1 -4 0 -7 2 -19 -4 9
3444Ioj0jJ0pOllJ2Mnnj0J4J3j2j1PRn%okJ0kmjnJ4qj4KK3qk9J3J4poj4K2Kjj
$$ 9 3 -7 -8 2 -5 1 -2 -5 7 11 6 1 -9 5 18 6 -5 2 11 6 6 0 -2 8 6 2 1 -4 10 2 -12 -10 13 5 -24 -11 3 -4 -10 -24 -2 0 -1 -2
3488bqNQjNk6L0Qj4j2K0J3j0j5KJ5%j5KjLRrj7JK3j1Lj4J2Lj4j1J5LJj2nOOJ2
$$ -2 -10 -5 3 2 7 -19 11 19 5 -7 13 26 16 1 3 18 18 3 5 4 7 16 7 -10 -9 14 3 6 -8 4 7 -7 -18 -3 0 1 -11 -16 -10 -4 8
3529Hj1j0J2J6j3qQJ7k1krK4Mj0%JkNjj6ONNk3kK3Oj9j3OOJ6k0QoJ0lj2nRK7p
$$ 8 -3 -13 -1 15 2 -6 2 19 -2 -4 -13 11 15 5 5 6 4 9 8 -8 -2 3 8 -15 -17 6 12 -7 -20 -14 -8 8 -12 -4 -10 0 -3 -15 -20 -11 16 9
3571Ij7PQNk1kK0%qrOJ8k2QqMJ6oj0j0J7J0rk1QK2qj8lJ1J0rlqPOqoqJ4Qj9%R
$$ 9 -8 -1 7 12 -9 -11 9 9 1 -8 -2 16 -6 2 -6 -2 14 8 -2 -12 5 15 6 -15 -7 15 7 -11 -14 -3 7 -2 -5 -13 -6 0 -8 -14 -22 -8 0 -19 -19 -10
3615a0J1%j1MJ3Nr%OmJ6j5kmJ9j1k1jK7n%qlJ8j0qn%LkKqJ7Rj9j3J4J1j6QmRj
$$ -10 1 1 -10 -6 7 12 3 3 9 5 21 6 4 0 19 8 -13 -14 13 8 8 0 -3 15 5 -3 -8 -8 -5 -7 -5 -13 4 13 -6 -19 -5 6 -10 -2 -6 3 2
3658BJ%nQmJ6k4PK0qj0lNKop%J2omroJ4J0k4JJ8Qj3j5LK2j2j3J9Qlj0qKRM%j5
$$ 2 3 3 -2 6 2 18 -6 1 21 13 3 0 5 7 1 -6 -6 6 0 -4 -13 -19 -5 5 -19 -18 0 8 -5 -20 -17 5 -7 -20 -1 7 4 -6 -14 -12 -3 1 1 -14
3702a4QLJ3qnkJ9qj7J3J2KrnrJ7qqmONlj8KK2rrnJ4QoqpNK0ooJJ1Nj7%LJ5nj3
$$ -14 -6 -3 10 2 -3 -5 14 6 -11 2 14 16 7 2 -7 10 2 -6 -10 -4 1 -2 -20 -18 4 -5 -14 -19 -5 3 -3 -11 -18 -13 7 1 -5 -4 7 12 -5 -5 -2 13 8 -5
3748eRQjKj9PRPj6kORj4kj0J1J5j6qQP%k5J1qK1qnqJ7J2j6j7K1J0Nk0OJ4Mj9l
$$ -5 4 12 11 13 -6 1 10 17 1 -1 5 14 0 -2 -12 -1 14 -2 -10 -2 5 5 -20 -9 -17 4 -4 -9 -17 0 12 -4 -21 0 10 15 -5 1 15 19 0 -3
3790cMROj1mPOkj8j0K7j8Oj0J7qQk4kJ0K0j2j1mRPMj0oL0j1noLJ3kj3OMLrj5K0
$$ -3 1 10 16 5 1 8 14 12 -6 -16 11 -7 -1 -11 6 -2 6 -18 -20 -10 10 -2 -13 -17 -8 -1 3 -7 -13 17 6 1 -5 -2 11 9 -4 2 6 9 0 -15 5
3833ELjj1mK2Loj9PLOj2j4K0Orj1jNQnrJJ4%j4lJ2J4j3rLQKrKoJ6J5k0%OJ0mL
$$ 5 8 7 -4 -8 14 17 11 -8 -1 2 8 -4 -18 2 8 -1 -12 -13 -8 0 -5 -14 -13 1 1 -13 -16 -4 10 -3 -12 -9 -1 1 -8 -6 -12 4 19 -1 -1 5 15 11 14
3878A4j3J9mj1LjJ5j6j2qJ1J1mj1pPMrKPOmj0JLJ2r%pJ1J4roNJ4j1rQJ0Jk1JM
$$ 14 1 20 16 5 8 7 22 6 -6 -14 -3 8 4 -7 -14 -7 -3 -12 -10 -3 3 -1 -11 -10 -7 5 -4 -4 -11 0 14 5 -1 4 18 7 -2 6 16 17 -4 -3 1
3921APQk1rPK%knJ4Oj5j0KPJ1j2KPLpnLOLpjJ1LnJmPJ9k7qJ6%nqONPkrMqJ5j4
$$ 1 8 16 -5 -14 -7 -5 -5 -7 -12 2 8 -7 -17 -15 -8 3 -9 -7 0 3 -4 -9 -6 0 3 -4 -5 6 9 4 5 1 8 27 0 -8 8 8 3 -5 1 6 13 11 2 6 -2 13 -1
3970aj1NJ0Qj6J2mKOk5%OJ4j9%J0k%olJ5J1nj5PJ2lmmQPMj3kRQj7jkQoJj7LJ2
$$ -1 -12 -7 3 11 -5 7 3 5 11 -14 -14 -8 6 -13 -13 -3 -5 -5 -11 -14 1 12 7 -8 -1 11 8 4 0 8 15 19 6 4 13 21 4 3 1 9 3 4 -13 -10 2
4015BPj6kNROj4J%P%j3LMMj5jOJ5j0QlJ1kmkJPoklPJ0j0j7%J2mpkJ2Nj3JmRkj8
$$ 2 9 -7 -9 -4 5 11 -3 -2 -2 5 5 -8 -5 -1 3 -12 -13 -7 8 -2 6 3 14 12 8 6 7 14 8 6 3 10 20 10 -7 -7 5 1 -6 -8 4 9 -4 -3 -7 2 0 -18
4063a8NOQljmJ1Qj2nmJ7OrmJ2kNpj2K0lj2nKK4j5nqPOJrj2J7jj1Oj3LJ3qj9J5
$$ -18 -13 -7 1 -2 -3 -7 4 12 0 -5 -9 8 14 5 1 13 11 16 9 -3 17 14 2 -3 -1 23 8 3 -5 2 8 9 0 -12 5 4 -7 -1 -14 -11 2 -6 -25 -10
4107a0J1mj2J2kMNj1J0KQj1j0J1Qoj2NJ3OopJJ8pqj0OJ4j3qJjQqJOMj7njK5j3
$$ -10 1 -3 -15 -3 -5 -1 4 -7 3 5 13 2 -8 3 11 5 -7 -2 11 17 11 4 5 23 16 8 -2 4 18 5 -3 -2 -3 5 -3 -2 4 8 -9 -14 -15 10 -3
4150cmmRP%lj9K0LOk0J0PRj7MjNNOj6%OJj2oK4Lj2j1KJ%qLpJ5mqjJ3Oj2pkJ1R
$$ -3 -7 -11 -2 5 5 2 -17 3 6 12 -8 2 9 18 1 5 4 9 14 20 4 4 10 11 -1 -7 17 20 8 -3 -1 0 0 -8 -5 -12 3 -1 -9 -10 3 9 -3 -10 -12 -1 8
4197Hj4OJ9lk1rJ7Rp%j3PNJkjJ1Kj8%lJ2Jj3MPjjpMNn%j2LKJ1j8qJ9PQk2jJ1Q
$$ 8 -6 0 19 16 -5 -14 3 12 5 5 -8 -1 4 5 3 2 13 15 -3 -3 -6 6 7 -6 -2 5 4 3 -4 0 5 0 0 -12 -9 -7 4 -14 -22 -3 4 12 -10 -11 0 8
4243H%j6J3J7j0j4jLJ3kj0PLJrlJjJ3j6JKMnroK0qj4%K2pjllRRJj4qK1PlpJ1n
$$ 8 8 -8 5 22 12 -2 -3 0 13 11 1 8 11 12 3 0 1 0 13 -3 -2 0 4 -1 -10 -16 4 -4 -18 -18 4 -3 -4 -7 -10 -1 8 9 -5 -13 8 15 12 5 16 11
4289A1NqnJ0Pj3lmJ2pj1JJ0Olj3OmOj2pK3qLj5J5oOomLJ6j5QkLMm%LOrNmNKml
$$ 11 16 8 3 13 20 7 4 0 12 5 -6 -5 5 11 8 -5 1 -3 3 -9 -16 7 -1 2 -13 2 -4 2 -4 -8 -5 11 -4 4 2 5 9 5 5 8 14 5 10 6 11 13 9 6
4337FKj0RPj4LRlkj2PKlj4J1mJ0mj1jJ4kllJ0qLpLRJOolJPj0KJ7qmMpPloJLKL
$$ 6 8 -2 7 14 0 3 12 9 7 -5 2 4 1 -13 -2 -6 4 0 -11 -12 2 0 -3 -6 4 -4 -1 -8 -5 4 5 11 5 2 3 10 0 2 19 11 7 11 4 11 8 2 3 6 8 11
4387A1j0lO%j2Oj4K1j2knJ1JJ2j5NKPpnJ0%Qj1%LQJqjMj7J3jLJoOk4J1RLj9jJ8
$$ 11 1 -2 4 4 -8 -2 -16 5 -7 -9 -14 -3 -2 10 -5 0 2 9 2 -3 7 7 15 4 4 7 15 16 8 7 11 -6 7 6 9 10 4 10 -14 -3 6 9 -10 -11 7
4432Gqj3J2%NpNmMRpmpJ1J1llnKLj0OM%RrkkJ3j6OnJ1jqoK1j2%j1JQm%pN%Lj4
$$ 7 -1 -14 -2 -2 3 -4 1 -3 1 10 3 -1 -8 3 14 11 8 3 5 8 -2 4 8 8 17 8 6 4 17 1 7 2 13 12 4 -2 19 7 7 -4 -3 5 1 1 -6 -1 -1 2 -12
4481a2OJ8j0jmRM%olQOj0JKJJ3qplJ4m%j1J2MnqljJ8j6JmJlm%LLjj3KKJ5mj3J0
$$ -12 -6 12 2 1 -3 6 10 10 4 1 9 15 5 6 8 9 22 14 7 4 18 14 14 3 15 19 14 6 3 2 20 4 5 1 2 -1 -5 -5 -2 1 0 -13 -11 -9 6 2 -11 -1
4529aQj5NjOJ1Jnj4K0loPoMkj1J5q%OpjMNj0j2RnM%kNPj8kOkRkKLRj4KMkJ8k0
$$ -1 7 -8 -3 -4 2 13 14 9 -5 15 12 6 13 7 11 9 -2 13 5 5 11 4 3 7 12 2 -10 -1 -6 -2 -2 -4 1 8 -10 -12 -6 -8 1 -1 1 4 13 -1 1 5 3 21 1
4578AMlJ5plo%J9j4MqMnOnj0MQomPmLkj8K2mprQLnRKqRKoNLJ0j6JKJ2j0jLQOj0
$$ 1 5 2 17 10 7 1 1 20 6 10 2 6 1 7 2 -8 -4 4 -2 -6 1 -3 0 -2 -20 2 -2 -9 -18 -10 -7 -12 -3 -1 -9 0 2 -4 1 4 14 -2 -1 1 13 3 2 5 13 19 9
4629ILnKmNj3J2pj%j3%QmqPNJqLoJ1OnqJ8jm%jPqkMMPonJ0JKqojJ2kooJJ1rj3
$$ 9 12 7 9 5 10 -3 9 2 1 1 -12 -12 -4 -8 -16 -9 -4 -3 -11 -8 -14 -3 3 -2 -10 8 7 3 3 2 9 1 -1 3 7 14 8 3 13 14 16 8 2 1 13 11 5 -1 0 11 2 -11
4681a1J1%nnmJ6omMkMjrRoJ1LjlmJ3Kq%J1Mmk0QNKjj6J6jorPkNj0Qj7J1Jj0QQ
$$ -11 0 0 -5 -10 -14 2 -4 -8 -4 -6 -2 -3 -12 -3 -9 2 5 4 1 -3 10 12 4 4 15 19 15 -5 3 8 10 9 -7 9 8 2 -7 0 -2 3 -7 1 -16 -5 -4 -14 -6 2
4729Bj1J6j3N%poRL%j0jJ8kJj0J3j1RlNj1J5lpkkJ2Jk1MKjQrOrQk0QoNRllMKk
$$ 2 -9 7 -6 -1 -1 -8 -14 -5 -2 -2 -12 -13 5 3 4 -6 7 -4 5 2 7 -4 11 8 1 -1 -3 9 10 -11 -7 -5 -6 2 -7 -1 -10 -2 -22 -14 -20 -15 -6 -9 -12 -8 -6 -8
4777hJQkLkLllJ0pOmNmKrK2mqnNmmkqLJ7nk2J0QjKj8RMrJJJ1rMkJRjLPj2PoQr
$$ -8 -7 1 -1 2 0 3 0 -3 7 0 6 2 7 3 5 -4 18 14 6 1 6 2 -2 -4 -12 -9 8 3 -19 -9 -1 -2 0 -18 -9 -5 -14 -13 -12 -1 -10 -6 -8 -7 2 1 4 11 -1 6 0 8 -1
4830aJ5%lNk0J1rLj3KJ5j1PnnPmpNKPk0PMkLqmOMjPpNJ%jNOj0NKRj6NkrJPOqL
$$ -1 14 14 11 16 -4 7 -2 1 -12 -10 5 -6 1 -4 -9 -2 -6 -13 -8 -6 1 -19 -12 -8 -10 -7 -15 -19 -13 -9 -10 -3 -10 -5 -4 -4 -5 0 6 -4 1 3 12 -4 1 -1 -10 -9 -2 4 -4 -1
4882aKlokQj1J2j3JPomKPLMj0JjJKKjLJ2k2J4%Qj0kRLNj3J0j0J0orOOj4JNj3J1
$$ -1 1 -2 -8 -10 -2 -13 -1 -14 -13 -6 -12 -16 -14 -7 -4 0 -10 -9 -10 -9 -7 -5 -6 -3 9 -13 1 1 9 -1 -3 6 9 14 1 11 1 11 5 -4 2 8 -6 -5 0 -13 -2
4929bnqQlLlqJ9krJj3OJ0%lJQPkjMmlKMLl%lJ%mmjLJQj3MnJ4k0J%mMJ3j0JPj8
$$ -2 -7 -15 -7 -10 -7 -10 -18 1 -1 -10 -9 -22 -16 -6 -6 -9 -8 0 7 5 4 8 4 1 3 7 10 7 7 4 5 5 1 -3 -4 -1 0 8 -5 -1 -6 8 -12 -11 -11 -15 -11 2 -8 -7 0 -18
4981a8PNqJ8j2KLj2J3JKmJ4Kq%Nj1J1qjQJpOj6J4qnrJ3KLk3LJ6j4J0oPJqJOkO
$$ -18 -11 -6 -14 4 -8 -6 -3 -15 -2 -1 1 -3 11 13 5 5 10 -1 10 2 1 9 10 3 9 -7 7 -1 -6 -15 -2 0 3 -20 -17 -1 -15 -5 -11 -4 -3 -11 -10 -4 -6 0
5027@j1%KJLJ0plLMnJ2LkLj%j1J2j0JNmoqJ0njnNqQJjj1J0KJmRLJ4k3KPMpMkO
$$ 0 -11 -11 -9 -8 -5 5 -2 -5 -2 2 -3 9 12 10 13 12 12 1 13 3 4 9 5 -1 -9 1 -4 -5 -10 -5 -13 -5 -4 -5 -16 -6 -4 -3 -7 2 5 19 -4 -2 5 9 2 6 4 10
5077A0%KLk%j9RmJ3olM%pjO%rMqlOqJ1mnOOj2%QoLR%rJ4llj0J5mmKPPmMj0mKL
$$ 10 10 12 15 13 13 -6 3 -1 12 6 3 7 7 0 -1 5 5 -4 0 -8 -11 -5 -13 -2 -6 -11 -5 1 -11 -11 -3 -9 -6 3 3 -6 8 5 2 -8 7 3 -1 1 8 15 11 15 5 1 3 6
5129FqJQJjpjkMkjrrPkJ5qOjJpPjJkLJ0moKLNrmRJmmML%NqjmPj0lPLNj1nLpJ5
$$ 6 -2 -1 7 8 7 0 -1 -3 1 -1 -2 -11 -20 -13 -15 0 -8 -2 -3 -2 -9 -2 -3 -2 -4 -1 9 5 -1 1 4 9 0 -4 5 6 2 -2 2 5 5 10 2 1 -3 4 -6 -9 -2 1 6 -5 -10 -7 -14 1
5185AojoqJ1nJ0kJJkQJ%Lj2OjPLj0J2%qj1K5j0Kj2oMJ0pMJpm%nPJ0nkmO%qLOj3
$$ 1 -5 -6 -12 -20 -9 -14 -4 -6 -5 -4 -6 2 3 3 6 -6 0 -1 6 9 -1 11 11 3 -8 17 7 9 -3 -9 -5 5 -2 2 3 -4 -8 -8 -13 -6 4 -1 -3 -7 -1 -1 -9 -6 0 -13
5235a3RQoJPpLqJ2N%pJ0pjLlQpKPk1J2Mj0NqlMkjqkJ1oJ1%j0LqmJ3KPj3jJ4kJ1
$$ -13 -4 4 -2 -1 6 -1 2 -6 6 11 11 4 14 7 6 9 6 14 7 9 16 -5 7 11 1 6 -2 -5 -1 -3 -4 -12 -14 -3 -9 2 2 -8 -5 -13 -17 -4 -2 5 -8 -9 5 3 14
5284A4Nj0j5J6loPpJ0%%qR%lmLpjQp%mj3J0PkpmJ4jj3kJ6LopJ6qOlkj0K1KlKm
$$ 14 19 9 -6 10 7 1 8 1 11 11 11 3 12 12 9 5 8 1 0 8 1 1 -3 -16 -6 1 -1 -8 -12 2 1 -12 -14 2 5 -1 -8 8 0 6 3 1 -9 12 14 11 13 9
5332IOj6PLQj1nKQj0Pj3Pj5PQrLLMlmlOKj2KOjPjmj1J5%OLnMnMj0NJ1Kj3Kq%k
$$ 9 15 -1 6 9 17 6 1 3 11 1 8 -5 2 -13 -6 2 -7 -4 -1 3 0 -4 -7 -1 1 -11 -9 -3 -4 3 2 -2 -13 2 2 8 11 6 10 5 9 -1 4 15 17 4 6 -2 -2 -4
5382dQ%mOorN%rQjJKl%J2kJ%pLPljNpJJPPqmOlJ5j1jKlq%qMKRj0%%Jj0mNPj1J
$$ -4 4 4 0 6 0 -9 -4 -4 -13 -5 -6 -5 -3 -6 -6 6 4 5 5 -2 1 8 5 4 9 2 3 4 11 18 10 6 12 9 24 13 12 14 11 3 3 -5 -1 1 10 0 0 0 1 -9 -13 -8 -1 -12 -11
5437a1kJ1Mj7J2lknJ9PrKoKKMLjnJ7qmLmnOokKjKj0mKQJ2j2j2NLrJ6j1%j1PKN
$$ -11 -13 -2 2 -15 -3 -6 -8 -13 6 13 4 6 0 2 4 8 11 10 5 22 14 10 13 9 4 10 4 2 4 3 5 -5 -9 -7 1 13 1 -11 -6 -3 -12 4 -7 -7 -18 -11 -9 -4
5485dRj0kJJ5j4JJ2J5k0MJNoOLqKj0oJ9oj0%J0prQklLkmJJOpNoJ6j7J4Jk%Qj1
$$ -4 5 -5 -7 -6 9 -5 -4 8 23 3 7 8 13 7 13 16 8 10 0 -6 13 7 -3 -3 7 0 -9 -1 -3 -6 -3 -5 -9 -8 -7 -1 -8 -3 -9 7 -10 4 5 3 3 11 0
5532@J0Qj7JJJ3j2J0j3MJJJ3pj2NnjoOMpNprOJJ3j7Oj3%J6qJ5mnjJ3j3OlK0j1
$$ 0 10 18 1 2 3 16 4 14 1 5 6 7 20 13 1 6 1 0 -6 0 4 -3 2 -5 -14 -8 -7 6 -11 -5 -18 -18 -2 -10 5 1 -4 -5 8 -5 1 -2 18 7
5576GrJ3nnKrJ6mmKklR%qOrMj0QLj5MoN%lLmPNj3J1kJQNj1LJ0%nKjlQKnkLj0K
$$ 7 -2 11 6 1 3 -6 10 6 2 4 2 -1 8 8 0 6 -3 1 -9 -1 2 -13 -9 -15 -10 -10 -13 -10 -14 -7 -2 -15 -4 -6 -5 3 8 -3 0 10 10 5 7 6 3 11 13 8 6 9 -1 1
5628AJnJ3rpNjklOo%pMjnJ1j3Q%%qJ3J1pknJ2rQj7QLOLKj0J4p%j2J2%jrkn%Qo
$$ 1 2 -3 10 1 -6 -1 -2 -4 -7 -1 -7 -7 -14 -10 -11 -16 -5 -18 -10 -10 -10 -18 -5 6 -1 -3 -8 4 -5 3 -14 -6 -3 3 6 8 -2 12 5 5 -7 5 5 4 -5 -7 -12 -12 -4 -10
5678a0QrqQpRnPJj2J3j6RJRj2RMj0J1nLQJJj0PJmqJ1j0R%rJ0PrrJ3j0j0M%jOM
$$ -10 -2 -11 -19 -11 -18 -9 -14 -7 -6 -18 -5 -21 -12 -11 -2 -14 -5 -1 -11 0 -5 -2 6 7 8 -2 5 6 2 -6 5 -5 4 4 -5 5 12 3 -6 7 -3 -13 -9 -9 -10 -4 0
5725@j8Qj5J4kJ5j0NKnKJQpOLkjlLmRqJ3qj1OkKkJ0j0kOl%j2KJ6rj2jM%lKlPN
$$ 0 -18 -10 -25 -11 -13 2 -8 -3 -1 -6 -4 -3 5 -2 4 7 5 4 1 4 0 9 1 14 6 -5 1 -1 1 -1 9 -1 -3 3 0 0 -12 -10 6 -3 -15 -16 -12 -12 -15 -13 -16 -9 -4
5774dpPoKKLJ%Mj0J3RmrJ1Nj6PLoNj2J1j5JLlrKMOJj1J0jlrNoLJ2qj%KJ4j7J5
$$ -4 -11 -4 -10 -8 -6 -3 -2 -2 2 -8 5 14 10 1 12 17 1 8 11 5 10 -2 9 -6 -5 -2 -5 -14 -12 -8 -2 -1 -12 -2 -3 -6 -15 -10 -16 -13 -1 -9 -10 -10 -8 6 -11 4
5822Dj0J6j0%OkpPLrJ8j0RmqMokPj1QLj7Qj1J1j2J4j1kJ3oNj6J3LJnJ0rQMpLm
$$ 4 -6 10 0 0 6 4 -3 4 7 -2 16 6 15 11 3 7 1 -1 6 -5 3 6 -11 -3 -14 -3 -15 -1 -12 -14 -1 -7 -2 -18 -5 -2 -1 -6 4 -5 3 7 0 3 -1
5867aNQnMonQJnNmlLnOnnllJ3j1mj0RrJ1KJJqPmLRqJ3qNJKJj0OKOj5KQLj8J0O
$$ -1 4 12 7 11 5 0 8 9 4 9 5 2 5 0 6 1 -4 -7 -10 3 -8 -12 -22 -13 -22 -11 -9 -8 -7 -15 -8 -12 -9 0 -8 5 -3 2 3 5 6 -4 2 4 10 -5 -3 5 8 -10 0 6
5919F%rPo%MpKpKrJKMKKno%P%onJ0OoNNJ0j2oJ2j1RKnPJmKmLRonJMj4%Or%LQl
$$ 6 6 -3 4 -2 -2 2 -5 -3 -10 -8 -17 -16 -14 -10 -8 -6 -11 -17 -17 -10 -10 -16 -21 -11 -5 -11 -6 -1 9 -3 -9 3 -8 1 3 -2 5 6 2 4 0 3 12 6 1 2 6 -8 -8 -2 -11 -11 -8 0 -3
5974c%o%LRpnLkpQmKPnJ4Kj0kMJ0lj4LMPrJ%MmKmj2NPj2nJ1Jn%lJjLmJ2J0j7l
$$ -3 -3 -9 -9 -6 3 -4 -9 -6 -8 -15 -7 -11 -9 -2 -7 7 9 -1 -3 1 11 8 -6 -3 1 8 -1 0 0 4 0 2 -2 -14 -9 -2 -14 -19 -8 -7 -12 -12 -15 -14 -15 -12 -16 -4 6 -11 -14
6025a4KjkJ4mJ3oLJ0j4PnljMj1MkMRPJk5kRMmlPk3QMkknLlOnJ3oqLP%nJ6rRpm
$$ -14 -12 -13 -15 -1 -5 8 2 5 15 1 8 3 0 -1 3 -8 -4 -6 -2 7 14 15 -10 -12 -3 1 -3 -6 1 -22 -14 -10 -12 -14 -19 -16 -19 -13 -18 -5 -11 -19 -16 -9 -9 -14 2 -7 2 -5 -9
6076iK0%j8J7lnpJ0J2k2J4qnJ2ojpj%%j2MoJ7jp%JRopRmKPMnJj0J3JRj0J2pOj2
$$ -9 11 11 -7 10 7 2 -5 5 17 -5 9 1 -4 8 2 1 -6 -7 -7 -7 -19 -15 -21 -4 -5 -12 -12 -11 -2 -8 -15 -6 -10 -8 -1 3 -2 -1 -11 2 3 12 2 14 7 13 1
6123AQmMnlPkj1LnNmpJ0pQj0RpPMj6MJNkoP%J3oJpRoOmPqJ3pOjoRqLqnN%j5RM
$$ 1 9 5 9 4 1 8 6 -5 -2 -7 -2 -6 -13 -3 -10 -2 -12 -3 -10 -3 1 -15 -11 -10 -5 -7 -13 -6 -6 7 1 2 -5 4 -2 4 0 7 -1 12 5 11 10 4 13 5 8 0 -5 0 0 -15 -6 -2
6177bMLnnkrJ0jj1NJJ0pLK%LoJJ3oJ0%rlRKMqPkkMkKm%Kj2oPm%LjqRllKnJ1j6
$$ -2 2 5 0 -5 -7 -16 -6 -7 -18 -13 -12 -2 -9 -6 -4 -4 -1 -7 -6 7 1 11 11 2 -1 8 10 14 6 13 11 9 13 11 13 9 9 11 -1 -7 0 -4 -4 -1 -2 -10 -1 -4 -7 -5 -10 1 -15
6230a5KNNlmkJ3qNLPj0pJ6nNlJ7j6J3j1lqRrKjPqRlnj1KlKJ3knRmKj2jJ5j2OJ0
$$ -15 -13 -8 -3 -6 -10 -12 1 -7 -2 1 8 -2 -9 7 2 7 4 21 5 18 7 4 -4 5 -4 -2 -3 4 -4 5 2 -3 -14 -12 -15 -13 0 -2 -7 2 -2 0 -12 -13 2 -10 -4 6
6278F%kLkOJlj1%J5r%NpJ2mnlOoj%rRj3LKlMJJJlKMj1RkoNJQNqj2K0j0NJ1j2%
$$ 6 6 4 7 5 11 12 9 -2 -2 13 4 4 9 2 14 10 5 2 8 2 1 1 -8 1 -12 -9 -7 -10 -6 -5 -4 -3 -6 -4 0 -11 -2 -4 -10 -5 -4 4 9 1 -11 9 -1 4 15 3 3
6329CRnpLQooQrNj0jQj2OJj1Jm%J4nOj1KoRqJ3oJ6j2KJ0j0N%R%Lj5J1jmpK1j9
$$ 3 12 7 0 3 11 5 -1 7 -2 3 -7 -8 0 -12 -6 -5 -16 -15 -19 -19 -5 -10 -4 -15 -13 -19 -10 -18 -5 -11 5 -7 -5 5 -5 0 0 9 9 12 -3 8 7 3 -4 17 -2
6376bmJRkrLkMMpj4RRrKj0PL%Km%jOnJ0rJ3rQJ3krjJ1%j1J2okJ0k2kJ1moPOo%
$$ -2 -6 -5 4 2 -7 -4 -6 -2 2 -5 -19 -10 -1 -10 -8 -18 -11 -8 -8 -6 -10 -10 -11 -5 -10 0 -9 4 -5 3 16 14 5 4 15 15 4 16 10 8 18 -4 -6 5 1 -5 2 8 2 2
6426Bjj0LJk1J3KNpJMoJ4j5K5j1knNKOMRj3lMQj0OpLMj4J1lmLln%OmommMlK0j7
$$ 2 1 -9 -6 -5 -26 -13 -11 -6 -13 -12 -8 -14 0 -15 10 -1 -3 -8 -3 -1 5 9 18 5 2 6 14 4 10 3 6 10 -4 7 4 0 3 0 -5 -5 1 -3 -9 -13 -17 -13 -16 4 -13
6475a3pRLLnK%MMMj7OMJkPkKPlj1RNNj3Qj6QmpJ2j1PqMnkOrJ1kj3J4j0J2qpRm
$$ -13 -20 -11 -8 -5 -10 -8 -8 -4 0 4 -13 -7 -3 -2 -4 3 1 3 10 7 -4 5 10 15 2 10 -6 2 -2 -9 3 -8 -1 -9 -5 -10 -12 -6 -15 -4 -6 -19 -5 -15 -3 -11 -18 -9 -13
6524a3lJ5%lMOnJ1mnjnjJ6qj1J5j2J5onOj0Nj2J0rOoklRMl%pNKkPj1JOQLkj0O
$$ -13 -16 -1 -1 -4 0 6 1 12 8 3 2 -3 -4 12 4 -7 8 -4 11 5 0 6 -4 1 -11 -1 -10 -4 -10 -12 -15 -6 -2 -5 -5 -12 -7 -5 -7 0 -11 -10 -4 4 7 5 -5 1
6572AMlJjLoPPpj7J0LKjkp%NKrKJLpmJ0oKLrQ%%jKnPm%NkJ2ojLjoJ0pMQj1QnO
$$ 1 5 2 3 2 5 -1 6 13 6 -11 -1 2 4 3 1 -6 -6 -1 1 -8 -6 -5 -2 -9 -13 -3 -9 -7 -4 -13 -5 -5 -5 -6 -4 -9 -2 -6 -6 -1 -3 9 3 2 5 4 -2 8 1 5 13 2 10 5 11
6627A1rOKj4Jlj1PJ0j4J1j0NOqOj1KJPJ2qOonRnJ8rNrJ0Oj0mj1PmJ2j3KRlLKr
$$ 11 2 8 10 -4 -3 -6 -17 -10 0 -14 -3 -13 -8 -2 -10 -4 -15 -13 -12 -5 7 -1 5 -1 -6 3 -2 16 7 12 3 13 19 9 5 -6 1 -3 9 -4 -2 7 4 7 9 0
6673@j1KJ2lj4lQjnOJo%J5jpklJ0ljM%mnK1%pJ3j0pJ6k1J0LMj0J3j4jNKmpNj5
$$ 0 -11 -9 3 0 -14 -17 -9 -10 -15 -9 -8 -14 -14 1 0 -7 -9 -12 -2 -5 -6 -2 -2 -6 -11 10 10 3 16 6 -1 15 -6 4 7 11 1 14 0 -1 4 6 2 -5 0 -15
6719a5NLMj2MpJ3nkQJ3j2KnmRJ3j5Pj0J1k%Rn%KQommpMPlj3QoOLoLloPnmMqP%
$$ -15 -10 -7 -3 -15 -11 -18 -5 -10 -12 -4 9 -3 -1 -6 -10 -1 12 -3 4 -6 5 3 3 12 7 7 9 17 11 7 3 -4 0 7 4 -9 -1 -7 -1 2 -4 -1 -4 -10 -3 -8 -12 -8 -16 -9 -9
6770iLjONNk0J9j0KJ9j5J1j2RpJ0lnPrLLpJK%j0jJOj3J3nmOoQj9J4mNLqlJ0kK
$$ -9 -6 -7 -1 4 9 -11 8 -2 0 19 4 15 3 12 5 15 12 7 14 5 8 11 4 5 7 7 -3 -4 -3 3 -10 3 -2 -6 0 -6 2 -17 -3 -7 -2 1 -7 -10 0 -2 0
6817@jMoLnNJ5j0NJmjLqLQmkLpmOqNpp%PkJmOmKLj2J0qj3J2J6%OpJMJkpjJ0nN
$$ 0 -1 3 -3 0 -5 0 15 5 10 11 7 6 9 1 4 12 8 6 9 2 -2 4 -4 1 -6 -13 -13 -6 -8 -7 -11 -5 -9 -7 -4 -16 -6 -14 -27 -15 1 1 7 0 1 5 6 4 -3 -4 6 1 6
6870FjOnQJpp%mJ0j5JPj1M%%lJ4k1J7mmqRL%pNJ2j1nLMJklQkJ3kKqmK2j3j0J0
$$ 6 5 11 6 14 15 8 1 1 -3 7 -8 -7 0 -11 -7 -7 -7 -10 4 -17 0 -4 -8 -16 -7 -4 -4 -11 -6 6 -5 -10 -7 -3 -2 -4 -7 1 -1 12 10 12 4 0 22 9 -1 9
6918IJj3OJnj2QojLMj4J3JNo%mKmJ0Llkj3QNNKj0PKJMqJ4mnMp%L%Oj0j0RrJ1r
$$ 9 10 -3 3 4 -1 -13 -5 -11 -12 -9 -5 -19 -6 -5 0 -6 -6 -10 -8 -12 -2 1 -2 -4 -17 -9 -4 1 3 -7 0 2 3 7 -1 13 9 4 8 1 1 4 4 10 0 -10 -1 -10 1 -8
6968hMlmPj0J4rKl%jkLMJj%J5rmKNMkLkOqJnjLKmLJlLJjj2rQLlmlPlRPj0j1K0
$$ -8 -4 -7 -11 -4 -14 0 -9 -7 -10 -10 -11 -13 -10 -6 -5 -6 -6 9 0 -4 -2 3 7 5 8 6 12 4 5 0 -1 2 4 0 3 4 1 4 5 4 -8 -17 -9 -6 -9 -13 -16 -9 -12 -3 4 -6 -17 3
7022CpkmQJ4kj2MRmnN%LlRj2nJ6kj5J1rQlk1J1JkMMk2JNJ2KNj5JlOQKrJ1mnJ2
$$ 3 -4 -6 -10 -2 12 10 -2 2 11 7 2 7 7 10 7 16 4 -1 15 13 -2 9 0 8 5 -16 -5 -4 -6 -2 2 -20 -19 -14 -2 0 5 -10 -9 -12 -6 2 4 -5 6 2 -3 9
7070IpKKLjJ2Lj3OlnjMKp%mjkJ1j6jJOj0J1j6PMj2LMP%lJ0qPlMrNNMKljPrlJ5
$$ 9 2 4 6 9 8 20 23 10 16 13 8 7 11 13 6 6 2 1 -1 10 -6 -7 -6 0 -10 1 -15 -8 -4 -16 -13 -9 -2 -2 -5 5 -3 4 1 5 -4 1 6 10 12 9 8 15 6 3 18
7121A8o%klKooOJjlLj4QpPklJmNK%LnK%J2llmpJ6rJ4oPpRnnJ2pKjj3NPj6PrPo
$$ 18 12 12 10 7 9 3 -3 3 4 3 0 3 -11 -3 -10 -3 -5 -8 -7 -11 -6 -4 -4 -1 -6 -4 -4 8 5 2 -2 -9 7 -2 12 6 13 6 15 10 5 17 10 12 11 -2 3 10 -6 1 -8 -1 -7
7174gjQj1%Qj0qJ5JqLNKQj3KkLMQoMoQnJ%QJoj%k%%jKj5J6j0Oj2NpQqMKkqJ9j1
$$ -7 -8 0 -11 -11 -3 -13 -21 -6 -5 -13 -10 -5 -3 5 -8 -6 -8 -5 -1 7 1 5 -1 7 2 3 3 11 12 6 5 5 3 3 3 2 4 -11 5 -5 1 -11 -6 -13 -5 -13 -9 -7 -9 -17 2 -9
7226i%LM%QnnRJlkj4J4QmnJ0j0J2%oj3K1Mj7MKmjqlJ2j2LlKoJ5j3M%ljoQkLJ2
$$ -9 -9 -6 -2 -2 6 1 -4 5 6 3 1 -13 1 9 5 0 10 0 12 12 6 -7 14 18 1 5 7 3 2 -6 -9 3 -9 -6 -9 -7 -13 2 -11 -7 -7 -10 -11 -17 -9 -11 -8 4
7274D%nj1J7j0RJ4j0LOj4LRj4NKJ1j0Lo%pJMojkmjjKKJLPj2PmKKj0NJ2PrNMj1
$$ 4 4 -1 -12 5 -5 4 18 8 11 17 3 6 15 1 6 8 19 9 12 6 6 -1 0 4 -2 -3 -5 -9 -10 -11 -9 -7 -6 -3 4 -8 -1 -5 -3 -1 -11 -6 6 13 4 9 13 2
7322BNjNpJ0KnLnPj3jJ3j1jjKj1PknoJ3rKKkknJ8nL%m%O%oNMj0K3j7NlQj3Rjq
$$ 2 7 6 11 4 14 16 11 14 9 16 3 2 15 4 3 2 4 -7 0 -2 -7 -13 0 -9 -7 -5 -7 -9 -14 4 -1 2 2 -2 -2 4 4 -2 3 7 -3 20 3 8 5 13 0 9 8 0
7372@OLjNj4qJ4Nnj6J0mjKJj7K2npKoJ4oLrJJ1Ml%J1qmJ5j6J7qK%J0roNoPjlk
$$ 0 6 9 8 13 -1 -9 5 10 5 -11 -1 -5 -6 -4 -3 -20 2 -3 -10 -8 -14 0 -6 -3 -12 -11 0 4 1 1 12 4 0 15 -1 16 8 10 10 20 11 5 10 4 11 10 7 5
7420Ej0kMKMrjMLoLnNnNJpJ0KmpPJ3j3KJJOj3%J6lkJ0ppJ1j0kmOKjk1NKOj0RO
$$ 5 -5 -7 -3 -1 3 -6 -7 -3 0 -6 -3 -8 -3 -8 -3 -2 -9 1 3 -1 -8 -1 12 -1 1 2 3 9 -4 -4 12 9 7 17 10 3 14 4 2 -2 4 6 5 -16 -11 -9 -3 -13 -4 2
7470Bk1RlpK0qjNMoklJ5qQkjnNPLOj8JJ2j0QmKl%qmJ1j3%QlmlNKj3OKnOqMjOk
$$ 2 -19 -10 -13 -20 0 -8 -9 -4 0 -6 -8 -11 4 -4 4 2 1 -4 1 8 11 17 -1 0 12 2 10 6 8 5 5 -3 -7 4 -9 -9 -1 -4 -8 -11 -6 -4 -17 -11 -9 -14 -8 -16 -12 -13 -7 -9
7522iKRLmJMqRqMjlQNlKmNopJLjOj4%PpJ0Jj0j2JJ4KroJ2nkkJ8j3Pj0OOklOLr
$$ -9 -7 2 5 1 2 6 -2 7 -1 3 2 -1 7 12 9 11 7 12 6 -1 0 3 2 8 -6 -6 1 -6 4 5 -5 -17 -16 -2 0 -9 -15 -3 -8 -10 -12 6 -7 0 -10 -4 2 0 -3 3 6 -3
7574cJ4j0J2jOj3jjkmR%mj2%JkNmLmJ1kknNJQlooQnjL%J1o%jLJ0j4RJKpMN%j2
$$ -3 11 1 13 12 18 5 4 3 1 -3 6 6 2 -10 -10 -9 -11 -6 -10 -7 -11 0 -2 -4 -9 -4 -3 5 2 -4 -10 -2 -7 -8 -5 -5 6 0 0 -1 2 12 -2 7 8 10 3 7 12 12 0
7625@Oj5ON%jmnNpK%jk%RnOqLRoLK%MmpJ2rJ6j3J0qLMQnj4Rlj2J9j0MRk0nJJ4
$$ 0 6 -9 -3 2 2 1 -3 -8 -3 -10 -8 -8 -9 -11 -11 -2 -7 -1 -9 -6 3 -3 0 2 2 6 2 -5 7 -2 14 1 11 3 6 10 18 13 -1 8 5 -7 12 2 6 15 -5 -10 -9 5
7675Ej2nnMNmlN%J2qnNnQKoQKlMPp%nJ4jqMn%qP%Nj2KMlLmMmqMnKlLKNqPpRk%
$$ 5 -7 -12 -17 -13 -8 -12 -15 -10 -10 2 -6 -11 -6 -11 -3 -1 -7 1 3 0 4 11 4 4 -1 13 12 4 8 3 3 -5 2 2 7 -5 -3 1 -2 1 -3 1 -3 -11 -7 -12 -10 -13 -10 -8 -3 -11 -4 -11 -2 -4 -4
7732d%MnOjjJ5LlpQmnN%jKj4kJ1j4QnJ%j4K1knNj6J1Kj4J0mLLoJJ4pj9K5j9J4
$$ -4 -4 0 -5 1 0 -1 14 17 14 7 15 11 6 11 11 10 12 -2 -4 7 -7 1 -4 -3 -3 -17 4 2 -3 2 -14 -3 -1 -15 -5 -9 -6 -3 -9 -8 6 -1 -20 5 -14 0
7778@%LJJ1JmjrRjPpj0kQoKJKnj0J5j2LnKmn%PJ2j0PjKJ2pomQQpjL%rRrJ5j1J0
$$ 0 0 3 4 15 16 12 11 2 11 10 17 10 0 -2 6 0 2 3 5 0 -10 5 -7 -4 -9 -7 -11 -16 -16 -9 3 -7 0 -1 1 13 6 0 -4 4 12 5 4 7 7 -2 7 -2 13 2 12
7829A2LpNoj0KL%rRpNjoJMmJj1J3rOj1J3nJ1LMqjOQj3mRMrRjKj2RmNLLj1j1Rp
$$ 12 15 8 13 7 -3 -1 2 2 -7 2 -5 0 -1 -7 -6 -2 -6 -5 -16 -3 -12 -6 -17 -4 -9 2 5 9 1 0 6 14 1 -3 6 10 1 10 9 11 -1 8 4 9 12 15 4 -7 2 -5
7879ejmkJ7lj8NJ3qoRoJ1Kj4KKKN%Rj9PkJ0Rj2MjkMnOpM%llOjjj5MjkJ6j4JmJ4
$$ -5 -6 -10 -12 5 2 -16 -11 2 -6 -12 -3 -9 2 4 -10 -8 -6 -4 1 1 10 -9 -2 -4 6 15 3 7 6 4 8 3 9 2 6 6 3 0 6 5 4 -11 -7 -8 -10 6 -8 -7 -11 3
7929CqjKNmjpOjNlQQrjNkMllOJrJ0j1JK2qj4NJpj5J0KJnNM%jpJ3j4jKoJ6qNJr
$$ 3 -5 -6 -4 1 -3 -4 -11 -5 -6 -1 -4 4 12 3 2 7 5 9 6 3 9 10 1 11 0 1 23 15 1 6 7 0 -15 -5 -3 -2 -7 -2 2 2 1 -6 7 -7 -8 -6 -12 4 -4 1 2 -7
7981gJ0jQj0J8pK%kRj3NmMjjjkjrJ5nj4J3nKmlkklKJkNNmjQq%NNP%KkLoRJmj5
$$ -7 3 2 10 0 18 11 13 13 11 20 7 12 8 12 11 10 9 7 6 -3 12 7 -7 6 1 3 -1 -4 -6 -8 -11 -9 -8 -10 -5 0 -4 -5 3 -5 -5 0 5 12 12 14 12 15 9 18 19 15 0
8034@J0j%MLj2njOLKj0pJ1%%Kj2nMNk%LkJOllJRoQnLLMpKJ5Kr%Jj4LjLkJMj0j
$$ 0 10 9 9 13 16 4 -1 -2 4 7 9 -1 -8 3 3 3 5 -7 -12 -8 -3 -5 -5 -2 -4 -3 3 0 -3 -2 7 1 9 4 7 10 14 7 9 24 26 17 17 18 4 7 6 9 7 8 12 2 1
8087APj2OqNlqJ3rmrJ2J3j4J6j5QrQJ3qMLkkJ%J0m%JKonLRk4J3oQpmJ1j4Oqjl
$$ 1 8 -4 2 -6 -1 -4 -12 1 -8 -12 -21 -9 4 -10 6 -9 -1 -10 -2 11 3 7 10 8 6 7 7 17 13 13 14 16 10 5 8 17 -7 6 0 8 1 -3 8 -6 0 -8 -9 -12
8135a2KRmmlJ5j2jLOMMMomLLj0J0%LJnNRqj1J3Mj6J2j1Pj2%%mjOoMmNoMNoMj2
$$ -12 -10 -1 -5 -9 -12 3 -9 -10 -7 -1 3 7 11 5 1 4 7 -3 7 7 10 11 6 11 20 12 1 14 18 2 14 3 10 -2 -2 -2 -6 -7 -1 -7 -3 -7 -2 -8 -4 1 -5 -1 -13
8184a3%QQpkQ%
$$ -13 -13 -5 3 -4 -6 2 2
8191B
$$ Imaginary data points
##PAGE= N=2
##DATA TABLE= (X++(I..I)), XYDATA
0@%%%%%%%%%%%%%%%%%%%qJ6j6J6j6J6k4L2l2L3m1M8n6O4p2Q1q9J04j17J26j38
$$ 0 0 0 0 0 0 0 0 0 0 0 0 0 0 0 0 0 0 0 0 -8 8 -8 8 -8 8 -16 16 -16 17 -24 24 -32 32 -40 41 -48 56 -61 65 -73
40g3J54j75J98k17K39k64K91l22L54l92M34m77N26n80O40p10P89q75R74j094J237
$$ -73 81 -94 104 -113 126 -138 153 -169 185 -207 227 -250 276 -304 336 -374 415 -460 514 -580 657
61F57j408J623j899K266k786L579m956Q008k6506J6913N5966m5245m4785K2177
$$ 657 -751 872 -1027 1239 -1547 2032 -2924 5084 -21422 -4509 51457 6212 -38573 -16396
75a6396M4598j0867k8205o994J3941J5497Q126k3467k6127K2275M4492j8986n4881
$$ -16396 28202 17335 -10870 -17864 -3923 11574 19700 -3767 -29894 -7619 36873 17887 -36994
88c6994R922O0636j508n7562p856M9418J3430l5029j6352J8436J3926m16q022
$$ -36994 -27072 33564 32056 -25506 -33362 16056 29486 -5543 -21895 -3459 10467 10051 2029
101B029j5245j647K7859J2313l5294k2913L8006L1116l5708l5858K9890L5912
$$ 2029 -13216 -14863 12996 25309 -9985 -32898 5108 36224 516 -35342 -5452 30460
113C0460k1587l1270J2838K2350m930j0591q63k484M061J5144m717k5866L281
$$ 30460 8873 -22397 -9559 12791 7861 -2730 -3593 -6077 -2016 13128 8411 -17455 -14174
126a4174L3275o93l6793k054L6263L887l2281m172K5726K600j7718P06R471n226
$$ -14174 19101 18408 -18385 -20439 15824 19711 -12570 -16742 8984 11584 -6134 -5428 4043 -1183
140a183j829J0182m416j4727R062J8163j2093j9768J3843J9346j4693j6971J5076
$$ -1183 -3012 7170 2754 -11973 -2911 15252 3159 -16609 -2766 16580 1887 -15084 -8
153hJ3001j5356q069J5622K790j5864K125J5760o267j5019R305J3237j1236j0261
$$ -8 12993 -2363 -10432 5190 7980 -7884 -5759 10001 3734 -11285 -1980 11257 21 -10240
167a0240J2265O064j2711q59J2975m812j3283J0377J3782j5060j4290J8248J4604
$$ -10240 2025 8089 -4622 -5481 7494 2682 -10601 -224 13558 -1502 -15792 2456 17060
180A7060j9511j4210J8651J2685j5894r687J1703N069o880R52K180p953J632J5160
$$ 17060 -2451 -16661 1990 14675 -1219 -10906 797 5866 -1014 -62 2118 -5835 -4203 10957
194A0957l975k1792M653K6752l671k9300J553K8873J071k5297l277J8869M448
$$ 10957 6982 -14810 -10157 16595 12924 -16376 -14823 14050 15121 -10176 -13453 5416 9864
207I864j0389l804P77J268Q662L111j6720q845K2397J4957k4997k0423K4288K4068
$$ 9864 -525 -4329 -3552 -2284 6378 9489 -7231 -16076 6321 21278 -3719 -24142 146 24214
221B4214k0593k5096J4662K2829p576j7333N98R037N119J134q702j1841R702K1714
$$ 24214 3621 -21475 -6813 16016 8440 -8893 -8295 742 5861 6995 -1707 -13548 -3846 17868
235A7868q071k9316M384L3633N17l4005n468L0448R340k3438j1217J4029J0486
$$ 17868 9797 -19519 -15135 18498 19015 -14990 -20458 9990 19330 -4108 -15325 -1296 9190
248I190l585p115o520J423J4968N726k0794j3295K3357J9993k2637k4728J9076
$$ 9190 5605 -1510 -8030 -6607 8361 14087 -6707 -20002 3355 23348 711 -24017 -4941
261d941K6575j3495k5068P070K0225q78j2571l969L154O789O883p238j6175N492
$$ -4941 21634 8139 -16929 -9859 10366 9488 -3083 -7052 -3898 2891 9774 2536 -13639 -8147
275h147K3532k078k8041k130K9185O125k7011q996K1981R970j4993q784P107N444
$$ -8147 15385 13307 -14734 -16864 12321 18446 -8565 -17561 4420 14390 -603 -9387 -2280 3164
289C164N50m10p035n530J1625J1479j4073j6452J4408J9720j3009k0683J0488
$$ 3164 3714 3304 -3731 -9261 2364 13843 -230 -16682 -2274 17446 4437 -16246 -5758
302e758J9270p542j5604M853J0231k850l952J876k586j836Q429K604j3094l765
$$ -5758 13512 5970 -9634 -4781 5450 2600 -1352 524 -2062 -3898 4531 7135 -5959 -9724
316i724J6105M815j7359n343J6942N001j5145l696J2487J455r396J462O346m626
$$ -9724 6381 11196 -6163 -11506 5436 10437 -4708 -8404 4083 5538 -3858 -2396 3950 -676
330f76l540P602J178r969P83J1427k464j1759M001J1025n584r395P213P165q926
$$ -676 -4216 3386 4564 -5405 -4622 6805 4341 -7418 -3417 7608 2024 -7371 -158 7007 -1919
345a919m700J0476K309j1680k44J2218j420j1857K688J0461l685q014M618M781
$$ -1919 -6619 3857 6166 -5514 -5758 6460 5040 -6817 -4129 6332 2647 -5367 -749 4032
359D032n689r50O949k937q377O379J0020r042j1423J0519J2319j0708j2323R628
$$ 4032 -1657 -2607 4342 1405 -6972 -593 9427 385 -11038 -519 11800 1092 -11231 -1603
373a603J1161p627q665N057M890k512p0L91n325Q49J0600j027j5181K31J8336
$$ -1603 9558 1931 -6734 -1677 3213 701 631 1022 -4303 -3454 7146 6119 -9062 -8831 9505
388I505J353j9615l169J8753M769j5830n516J1200N094n471l279n40Q0O091M106
$$ 9505 10858 -8757 -11926 6827 11596 -4234 -9750 1450 6544 1073 -2206 -2746 -2666 3425 7531
403G531j0396q751J3006J3107j3661j6488J2422J8197r692j7837O020J5238k154
$$ 7531 -2865 -11616 1390 14497 836 -15652 -3230 14967 5275 -12562 -6542 8696 6542
416F542j0618j190M455L476K458m205r347L398J5270j241j9405j787K1288N020
$$ 6542 -4076 -5266 -811 2665 5123 918 -8429 -5031 10239 8998 -10407 -12194 9094 14114
430A4114k0643p727J7666R225j2815r107O887P112p00l477m883j370R076O797
$$ 14114 -6529 -14256 3410 12635 -180 -9287 -2400 4712 4012 535 -4348 -5718 3358 10155
444A0155j1561j1909J2068J5946j0829j8216Q305J8332n079j6221J896J2112O88
$$ 10155 -1406 -13315 -1247 14699 3870 -14346 -6041 12291 7212 -9009 -7113 4999 5687
457E687o567k196L25K409N842j373j1147n98J4993L028j6979n398J6981P125j5218
$$ 5687 -880 -3076 -2751 -342 5500 4127 -7020 -7618 7375 10403 -6576 -11974 5007 12132 -3086
472c086p798J2015P156q000n176L744K127J02J732l177n742N184R374o052j2114
$$ -3086 -10884 1131 8287 287 -4889 -1145 982 1084 2816 -361 -6103 -919 8455 2403 -9711
487i711N983J3581n212j3550M170J2073l180r391K532N921k420k116K840j660
$$ -9711 -3728 9853 4641 -8909 -4739 7334 4154 -5237 -2705 3216 796 -1320 1520 -140
501a40l609M889M444p310n158Q809N439r443n119R349M075q696k430P746L56o656
$$ -140 -3749 1140 5584 -1726 -6884 1925 7364 -2079 -7198 2151 6226 -2470 -4900 2846 3202 -3454
517c454J905N587m052m471N815L393o979k230P494Q85p348O73O679k481n653M384
$$ -3454 -1549 4038 -14 -4485 1330 4723 -2256 -4486 3008 3893 -3455 -2782 3897 1416 -4237 147
533A47M487o302l355P943K386r100j656R558J062r174m93P910k15n876J195L311
$$ 147 4634 -1668 -5023 2920 5306 -3794 -5450 4108 5170 -4004 -4497 3413 3198 -2678 -1483 1828
549A828k543m86M261k229o071M398P934n835r500O430J0395o151j0369N160R230
$$ 1828 -715 -1201 3060 831 -5240 -842 7092 1257 -8243 -1813 8582 2431 -7938 -2778 6452
564F452l742o995K231L783r74J12K41m263j66Q067Q27j1151k012J3068L459j3529
$$ 6452 2710 -4285 -2054 1729 755 867 1108 -3155 -3321 4746 5573 -5578 -7590 5478 8937 -4592
580d592m781J2503N608j0116n580O716M551k812k454j063n75M362M123o633p773
$$ -4592 -9373 3130 8738 -1378 -6958 -242 4309 1497 -957 -2020 -2595 1767 5890 -743 -8516
595h516P668J0921p434j3085O093J3835m030j2977J694J0561L78o814j805K242
$$ -8516 -848 10073 2639 -10446 -4353 9482 5452 -7525 -5831 4730 5108 -1706 -3511 -1269
609a269K286K636j679p118J89J0663J928j2893m186J3523O172j2599p376J0311
$$ -1269 1017 3653 1974 -5144 -4955 5708 7636 -5257 -9443 4080 10252 -2347 -9723 588
623E88P518p118o423L457M171M6r58l021k791N007O548n897r831N737J2110m675
$$ 588 8106 988 -5435 -1978 2193 2239 1281 -1740 -4531 476 7024 1127 -8704 -2967 9143 4468
639D468j3047L070J2517j341j0528j13P444J021l628j082m90L84M266R91p278
$$ 4468 -8579 -5509 7008 5667 -4861 -4974 2470 3491 -137 -1219 -1709 -1325 2941 3932 -3346
654c346k728R257M445j0065n793R728O398q441o175O560M990m418l033K362M64
$$ -3346 -6074 3183 7628 -2437 -8230 1498 7896 -545 -6720 -160 4830 412 -2621 -259 205
669B05o15K363o64n003J404P115j622q549J631R060j446q701J373P528j493n769
$$ 205 -410 1953 1289 -3714 -2310 4805 3183 -5366 -3735 5325 3879 -4822 -3449 4079 2586 -3183
685c183J881L657k527j441L327o42m120K369M697l655m947M498M745m952m079
$$ -3183 -1302 2355 -172 -1613 1714 1072 -3048 -679 4018 363 -4584 -86 4659 -293 -4372
700d372N138K990n179j546N125m4m995J579M821k883m525L831M033m354l235M465
$$ -4372 766 3756 -1423 -2969 2156 2112 -2883 -1304 3517 634 -3891 -60 3973 -381 -3616 849
716H49K097m259o52L862j061l423K867L013m586k713N955K546o847k423P106K247
$$ 849 2946 -1313 -1965 1897 836 -2587 280 3293 -1293 -4006 1949 4495 -2352 -4775 2331 4578
732D578o668j875N604J207m009j35K125j320j55L056j592m864K882O514l554p817
$$ 4578 -2090 -3965 1639 2846 -1163 -1298 827 -493 -648 2408 816 -4048 -1166 5348 1794 -6023
748f023L628Q469l178q317K361P222j395n338N58K757p8K19J15l258o60N896J635
$$ -6023 -2395 6074 2896 -5421 -3060 4162 2767 -2571 -2013 744 666 885 1000 -2258 -2918 2978 4613
765D613p801k871Q824M085q802m948P809N250n988m789L697L514j259j486r82
$$ 4613 -3188 -6059 2765 6850 -1952 -6900 909 6159 171 -4618 -921 2593 1334 -152 -1134
780a134j093K689L862l691o444L875Q515l383r715K335R852j054q875j79O876
$$ -1134 -2227 462 4324 633 -5811 -1936 6579 3196 -6519 -4184 5668 4614 -4261 -4440 2436
795B436J063m103j408R23J068K318q6n129j347P183L018q290m564Q374N683p504
$$ 2436 3499 -604 -2012 -1089 -21 2297 2211 -2918 -4265 2918 5936 -2354 -6918 1456 7139 -365
811c65o095N878N669l828m421J700K407J83J32j595k830K378N269k476p201K052
$$ -365 -6460 -582 5087 1259 -3162 -1462 945 1128 1260 -335 -3165 -787 4482 2006 -5195 -3143
827c143Q364j298q593M49P889K92o388o90M313O03j870p1n58q94K719K071m347
$$ -3143 5221 3923 -4670 -4221 3668 3960 -2428 -3118 1195 1798 -72 -143 -701 -1595 1124 3195 -1152
844a152l264N316M232n642m815N383M847m701m281L765L131k744j542J832k93
$$ -1152 -4416 900 5132 -510 -5325 58 4905 204 -4077 -312 2819 75 -1467 365 72
859G2j117K158O53l748m26M974L15n639k23N741R2n379K41M564p62l506J456K327
$$ 72 -1045 1113 1766 -1982 -2408 2566 2881 -2758 -2981 2760 2852 -2527 -2286 2278 1516 -1990 -534 1793
877A793k243j186K974J73l582O57L896j307l898J816L547k271k845K679J935l098
$$ 1793 -450 -1636 1338 1511 -2071 -1414 2482 1175 -2723 -907 2640 369 -2476 203 2138 -960
893i60q50L491j78l827J100M062j810m054K256L771k447l137K430K164k326q94
$$ -960 -1810 1681 1503 -2324 -1224 2838 1028 -3026 -770 3001 554 -2583 -153 2011 -315 -1209
909a209K193n77k123K057K144l400k292M412K479m998k592N056K558m602k264
$$ -1209 984 407 -1716 341 2485 -915 -3207 1205 3684 -1314 -3906 1150 3708 -894 -3158
924c158L708J628k508o23J229p06J3K205r78l707J569N027j777n921J568O300
$$ -3158 550 2178 -330 -953 276 -430 -417 1788 810 -2897 -1328 3699 1922 -3999 -2431 3869
940C869j123o044N54N143m7l658k39J724J89L93K46k423j004M106K023n277l013
$$ 3869 2746 -3298 -2744 2399 2352 -1306 -1545 179 368 761 1007 -1416 -2420 1686 3709 -1568 -4581
957d581N729L887n550m384M739M378l493l736J992K518n30p85p12j231J521L280
$$ -4581 1148 5035 -515 -4899 -160 4218 725 -3011 -1019 1499 969 184 -528 -1759 -238 3042
973C042j857n048J689O293j149o881M14O686L60n803q92M282J114k325q91K36
$$ 3042 1185 -3863 -2174 4119 2970 -3911 -3497 3189 3549 -2254 -3146 1136 2250 -75 -966 -730
989g30K24J745P80l346j962M426L106m841m075M718M586m063m598L060L995j934
$$ -730 -506 1239 2019 -1327 -3289 1137 4243 -598 -4673 45 4631 568 -4030 -970 3025 1091
1005A091k842Q19J260M0N76n86k409P65L982n86n118K01N697K61n643o37N027
$$ 1091 -1751 -932 328 368 944 358 -2051 -1286 2696 2110 -3008 -2807 2890 3151 -2492 -3129 1898
1022A898P98l914o76K540K25j045N08l55j410J502K327k325l100K752L616k881
$$ 1898 2696 -1218 -1894 646 871 -174 334 -21 -1431 71 2398 73 -3027 -275 3341 460
1038D60l749K712L488k406k849K051J887j733p29J490m86j353J594J309k482j274
$$ 460 -3289 -577 2911 505 -2344 -293 1594 -139 -868 622 136 -1217 377 1686 -796 -2070
1054b070L102J204l399j012L392O95l149j83K707m44k203J166J665j878j144K460
$$ -2070 1032 2236 -1163 -2175 1217 1912 -1237 -1420 1287 843 -1360 -194 1471 -407 -1551 909
1070I09O91k864k90L008r4k869M81K491r47j893J462J198k013m91K560j57l019
$$ 909 1600 -1264 -1554 1454 1360 -1509 -1028 1463 516 -1377 85 1283 -730 -1221 1339 1182 -1837
1087a837O70L316r91l374J147L143j177k628J170J783j144p56J202l93j353J476
$$ -1837 -1167 2149 1158 -2216 -1069 2074 897 -1731 -561 1222 78 -678 524 131 -1222 254
1103B54J625k427j934L086K242l393k442L338K458k926k186K246J616j433p37
$$ 254 1879 -548 -2482 604 2846 -547 -2989 349 2807 -119 -2305 -59 1557 124 -613
1118f13O28l95J10J615o04k807Q27L785p85m434N09M644j47m361k09L572M25k428
$$ -613 15 -380 -270 1345 741 -2066 -1239 2546 1761 -2673 -2164 2480 2333 -2028 -2237 1335 1760 -668
1136f68m06J022J37M31M27j747j178K786K004l403k751L572L311l297l517K687
$$ -668 -1074 -52 85 516 943 -804 -1982 804 2808 -595 -3346 226 3537 240 -3277 -590
1152e90L302j847k663R54J616j46l00m44j158P40K534p27l673M44M411nm675m86
$$ -590 2712 865 -1798 -844 772 626 326 -118 -1276 -536 1998 1271 -2402 -1958 2453 2448 -2227 -2713
1170b713M404R02l704j060K617R60j316n53J3j58J194J027k073j944K620K721
$$ -2713 1691 2593 -1111 -2171 446 1406 90 -463 -450 -608 586 1613 -460 -2404 216 2937
1186B937k762l271K572L453k125l233J546K619r83j654M93M73j74P53P2j898j60
$$ 2937 175 -3096 -524 2929 804 -2429 -883 1736 753 -901 -408 65 -109 644 716 -1182 -1342
1203a342K815L58l386o13L598Q20l444q99K984P83k269m79J449j8o40O69r5j346
$$ -1342 1473 1831 -1555 -2168 1430 2250 -1194 -2093 891 1674 -595 -1074 375 357 -283 386 291 -1055
1221a055O59J967j057k416J252K644j310k601J249K316j188j771J159J069j157
$$ -1055 -396 1571 514 -1902 -650 1994 684 -1917 -668 1648 460 -1311 -152 917 -240
1236b40l01J232m44j318J073J427j558j433J851J332j962j108J938P04j807k00
$$ -240 -541 691 247 -1071 2 1429 -129 -1562 289 1621 -341 -1449 489 1193 -614 -814
1252h14J614l89j424R87J229j511j069J880R15k081p41K087M91j898j50J558k58
$$ -814 800 411 -1013 -26 1203 -308 -1377 503 1418 -663 -1404 683 1174 -724 -874 684 426
1269D26j124P62O76j290k64J824m5k271K67K538l65k589L53K418l42j983L37J336
$$ 426 -698 64 740 -550 -814 1010 965 -1306 -1039 1499 1134 -1455 -1102 1316 974 -1009 -672 664
1287F64m07n75N92k62q85J036J232j658j606K034J928k162k102K043K084j715
$$ 664 257 -318 274 12 -873 163 1395 -263 -1869 165 2093 -69 -2171 -128 1956 241
1303B41j805J255J293p39n43K73l48P9J270k56k124K58K791j10l155j58L207M15
$$ 241 -1564 -309 984 245 -298 -25 -373 -294 976 720 -1404 -1146 1645 1535 -1620 -1778 1429 1844
1321A844k920o03K313O66j500n11N58J41L90L99j213j041J784J698k070k224K049
$$ 1844 -1076 -1679 634 1300 -200 -711 -153 -12 378 777 -436 -1477 307 2005 -65 -2289 -240
1338b40K589j806k646J371K384q47j835L65R97Qj6k30r63K12J872m3k556k42K943
$$ -240 2349 543 -2103 -732 1652 805 -1030 -665 332 340 324 94 -869 -657 1215 1172 -1384 -1626 1317
1357A317N80k992q56K730R92k188r28J467O53o59j95j10m00P51J070j207j679
$$ 1317 1897 -1095 -1951 779 1771 -417 -1345 122 775 116 -79 -189 -589 162 1232 25 -1654
1374a654J418K152j420k428J245K426r84k161O68J661m24r63K75J63k27O11L37
$$ -1654 -236 1916 496 -1932 -687 1739 755 -1406 -738 923 499 -464 -189 -26 -253 358 695
1391F95j314m94J800P14k083q76K147R50j969q87J663O57j253k95Q16j67m13O75
$$ 695 -619 -1113 687 1401 -682 -1558 589 1539 -430 -1317 346 1003 -250 -545 271 104 -309 366
1409C66Q6j176J49J556l04j789L84J832m45j694M72J427n64j025O88N73q57j00
$$ 366 452 -724 -575 981 677 -1112 -728 1104 659 -1035 -563 864 300 -725 -37 536 -321 -421
1427d21J030l12j178O39J285q57j276R63J162r75r41R76N84r51j42R18l11r10
$$ -421 609 297 -881 -242 1043 186 -1090 -127 1035 60 -881 95 679 -272 -414 504 193 -717
1445g17P31R27j087r38J290R29j380q41J314O80j136m23Q95L2o00M02L63q93j48
$$ -717 14 941 -146 -1084 206 1135 -245 -1086 228 908 -228 -651 244 276 -324 78 441 -452 -600
1464f00J323L5j669RJ866K2j893o1J722Q3j382m2Q78q5l13L02k59n96P70R30j128
$$ -600 723 758 -911 -902 964 986 -907 -968 754 837 -545 -587 291 206 -107 195 -64 -660 110 1040 -88
1485h8j267J330J543j349j671J195J642r35j407O22R74k97m20O4k64P5R29q4j489
$$ -88 -1355 -25 1518 169 -1502 -307 1335 400 -1007 -385 589 292 -128 -64 -328 -253 676 592 -897
1504h97n6J917K38k110m69K078O40j816p26J380O60q20m32K28O5L39M11p76r17
$$ -897 -953 964 1202 -908 -1377 701 1341 -475 -1201 179 839 19 -413 -185 -120 219 630 -146 -1063
1523a063J063J375j134j748J077J914q64j883N91J617l07j161P6N54N5J21q6p70
$$ -1063 0 1375 241 -1507 -430 1484 620 -1263 -672 945 638 -523 -447 107 162 283 197 -573
1541e73l8J311K45j696m96J872P10j820q64J601Q82j217p41P61M55k92m8j00m24
$$ -573 -611 700 945 -751 -1247 625 1335 -485 -1349 252 1134 -83 -824 -63 392 100 52 -48 -472
1560d72M01Q99n52j313O03J578n45j679M19J590k84j344J80R52j46m82J86j4l02
$$ -472 -71 828 276 -1037 -434 1144 599 -1080 -661 929 645 -699 -519 433 287 -195 -9 -23 -325
1579c25M76M55q28o39J076P84j181q71J183Q26j048o95Q60M55o60j31M64k28l25
$$ -325 151 606 -222 -861 215 999 -182 -1053 130 956 -92 -787 73 528 -132 -263 201 -27 -352
1598c52O05K01q84j57J105J12j189q0J164K4j023N4Q22k03n60L97K88n96m5P85
$$ -352 253 454 -430 -587 518 630 -559 -639 525 549 -474 -420 402 199 -361 36 324 -272 -317 468
1618D68j18r55K47J037l26j015L50Q99l66o79L79L90m35p1N12k62o20N41P13p30
$$ 468 350 -605 -358 679 353 -662 -312 587 221 -458 -79 311 -124 -195 317 55 -565 -24 689 -41
1638d1q16Q46Q41q27q08P53O79o11m29M42J25k74K29J73n93j07R28J06j184j61
$$ -41 -857 -11 830 3 -805 -52 627 16 -413 29 154 -120 109 282 -311 -418 510 616 -568 -729
1658g29J301K32j287k82J129K85q64k24M88Q8j32J34k07m26M92P21o73r87P39
$$ -729 572 804 -483 -765 364 649 -215 -439 49 137 5 139 -68 -494 -2 719 46 -941 -202
1677b02J171o62j256N29J213l61r98J70O75j6k60l4k25L3O61O2j022k13J253L97
$$ -202 969 307 -949 -420 793 432 -566 -396 279 263 3 -31 -256 -223 438 500 -522 -735 518 915
1697I15j340n73J279O50j056o63P59N43m08k96M4oK50L78m69p52N74J041n35j252
$$ 915 -425 -998 281 931 -125 -788 -29 514 106 -190 -146 -152 98 476 7 -745 -171 870 335 -917
1717i17M37J312k75j235J16J006Oo56q5K61O7J60M5n47k05Q33L90r97n80J057
$$ -917 -480 832 557 -678 -562 444 450 -206 -291 -30 37 197 242 -305 -510 323 713 -284 -864 193
1737A93P04r90p31Q09O93n84n24L34K65j12N3o8l86J64O92j90r37J67J053r4j079
$$ 193 897 -93 -824 -15 678 94 -430 -96 169 57 110 42 -344 -180 512 322 -615 -448 605 511 -568
1758e68L0R64J9p78pN13m3k14J41n9k99L08M69m80n91N54O87n67o96N41O15m44
$$ -568 -538 426 445 -333 -340 173 130 -84 57 -2 -301 7 476 -4 -595 -41 646 79 -617 -76 539 95
1780I5m82L74K72l12l7K65k14k53M26K70o08k69O83K76o93k77O42K09n38r2M01
$$ 95 -387 -13 259 -53 -90 175 -39 -292 134 404 -204 -473 210 486 -207 -484 158 367 -171 -263 138
1801A38o5k47K35J42m40k8N92j9p06N3P54n2p19O2O06p3m36J17K18k05J6K88j92
$$ 138 73 -174 61 203 -237 -265 327 308 -398 -345 409 357 -362 -300 306 233 -203 -86 132 -73 -57 231 39
1824C9m35L59N42m41o42M69O67m34o35L50N31k58l32J48J08q4J51O9m10r0O31
$$ 39 -396 -37 505 64 -578 -109 558 124 -511 -161 370 112 -220 -72 36 -48 103 172 -238 -328 303
1845C03J41p60k36Q38L05q03l51O85L22m75k62K51J32k6O1j69k84L05N20l77p06
$$ 303 444 -316 -552 286 591 -212 -563 122 444 -31 -293 -42 90 64 125 -44 -328 -23 497 120 -586
1866e86L87Q18k97q67J97P83o7o40j3L84N6r6n6k07nM67J14o56k66P75L85p73
$$ -586 -199 619 322 -545 -348 435 368 -272 -285 99 155 59 3 -204 -209 258 372 -284 -550 225 610 -163
1888a63m82O94N29n45m89L58L61j39j86k2o2J74L16k40n24K24P16j99q07R8Q26
$$ -163 -645 49 578 33 -456 -98 263 124 -62 -84 -146 28 344 104 -420 -196 520 321 -486 -388 438
1909D38j3p40o6N62J09l51r5R4K1J54R1l65k26M86L68n59m64N31N55m72n47L90
$$ 438 425 -315 -381 181 290 -61 -156 -62 -41 113 204 -161 -387 99 467 -92 -556 -25 530 58 -489 -99
1931i9M38k34k93J19J08l3J21k2l15J9M85J2n96n3O38R7o09j31N08J14l73o9K06
$$ -99 339 105 -188 -69 39 6 127 105 -210 -191 294 306 -290 -343 295 392 -217 -348 160 274 -99 -168 38
1954C8ro3J24p3k50J69L65k23m50K45M85k13m68J81M09j60k87J41J23j32L4J59
$$ 38 29 -34 90 17 -233 -64 301 78 -372 -127 358 145 -323 -142 267 107 -180 -39 84 -48 -14 145
1976A45j91j96L03K56l88k70L97K80l64k66L24J90k26j10J75m8r6J80M4k99l4
$$ 145 -46 -242 61 317 -71 -341 56 336 -28 -294 30 220 -6 -116 59 11 -85 95 139 -160 -194
1997a94M08M3m83o4M95P1m41r1L51O7k27kP1n6N1J59j61k82K38L76k51m50K34
$$ -194 214 257 -226 -290 205 276 -165 -256 95 162 -65 -67 4 -52 -1 158 -3 -285 -47 329 78 -372 -138
2020a38M81j90m26J25L47o2k20K9N0NJ00L0k69p6L99J39m87k06M98K64m47l00
$$ -138 343 153 -273 -148 199 137 -83 -54 -4 1 101 131 -138 -214 185 324 -163 -369 129 393 -54 -354
2042c54L51K58k32j90Q4Q8L8O6j45k09J98L51j91m67J62N34r4n45K3M89L1l50
$$ -354 -3 255 23 -167 -83 5 43 109 -36 -245 -47 304 113 -354 -192 342 248 -297 -274 215 246 -104
2064a04q1K03Q0k4l9j41k7K75J20l82k25M16L21m06l78L46L76k49l33J30K26k1
$$ -104 -185 18 98 74 35 -106 -133 142 262 -120 -345 71 392 -14 -392 -46 330 81 -252 -122 104 83
2086H3q2n8n8Q5K38j07l61O7M56j7m84l5M61P9l83j10K77R4j26o1Kl1J38J09k12
$$ 83 1 -57 -115 -30 208 101 -260 -193 263 246 -238 -273 188 267 -116 -226 51 145 19 -42 -40 -71 67 176 -36
2111c6k09K67K80k61l42K29L57j74l21J08K58o0j52QK2RQ4K1k13n0L02Q9l48j22
$$ -36 -245 22 302 41 -301 -72 285 111 -210 -102 156 96 -56 -48 -26 -17 67 88 -125 -175 127 216 -132 -254
2135b54L37J42k91j46K32J16j45n8Q1l9J2J09n7j88O7K86q2l01N0L23m4k73J6
$$ -254 83 225 -66 -212 20 136 -9 -67 14 -25 -13 96 39 -149 -82 204 122 -179 -129 194 150 -123 -107
2158a07K12j9j29L9J4n2N0R8j38j50J89J89k00k34K00K24j54k02J21J52q2o0M1
$$ -107 105 86 -43 -4 10 -42 8 106 -32 -182 7 196 -4 -238 -38 186 32 -170 -49 103 21 -39 2
2181Bk8j3J13K3j95m0K67O7k83j09K88J11k32j22J78R7j00n1J4l0M9J14j05j91
$$ 2 -26 -39 74 97 -98 -138 129 196 -87 -196 92 203 -29 -151 27 124 24 -27 -13 -43 6 120 15 -176
2205a76J17K54j13k91R4L00n0k82J0K27Rj21k6J2K3Q6Kj72o0K45J21k67j66K51
$$ -176 -59 195 82 -209 -115 185 135 -147 -137 90 99 -22 -48 -36 -13 73 75 -97 -157 88 209 -58 -224 27
2229B7K19k25k17J58J82p0j36QN8L8L8q6j25Q2K24o3k97L4L20Ql05m3K39Q5j82
$$ 27 246 21 -196 -38 144 74 -62 -54 4 42 80 -6 -131 -49 175 112 -185 -151 169 177 -128 -171 68 153 -29
2254b9o8Q4M7J2pj15m5J72J16k06j76K08K16j82k28J36K17p3j77L4J01K3j6l6
$$ -29 -97 -13 34 46 39 -76 -121 51 167 -39 -215 -7 209 27 -201 -65 152 79 -98 -64 37 60 44 8
2278Hq1M5J62k7k18j6K48M6k50r1K19J10j70j11J01Q4k9m6k7l2Q1R4j09j46J19
$$ 8 -73 -28 134 107 -111 -127 121 167 -83 -174 45 155 -15 -126 -25 59 30 -16 -43 -75 6 100 -9 -155 -36
2303c6J85q8k20P3K00j6j79J0J26Lm4j1l1J8Q4K5j49o5J70R5j72j27J64J21j24
$$ -36 149 61 -159 -86 114 98 -81 -71 55 58 14 3 -28 -10 74 99 -50 -115 55 150 -22 -149 15 136 12
2328A2j11Q1P4m5k8nk2J0Q5j3j46L1J71%j92pJ70K6j37k8Q9L4m6pjk3M9O6q9j02
$$ 12 -99 -18 56 11 -17 -22 -44 -34 51 38 -108 -77 94 94 -98 -105 65 91 -46 -74 15 49 3 -4 -5 -28 21 87 -2 -104
2358a04R3J30q0j44N2J57m7j19J1Q7Ll9kl2RQ1Nj17l5J45O3j59r2J48R5j19q7
$$ -104 -11 119 39 -105 -53 104 57 -62 -51 36 39 0 -2 -34 -25 56 61 -56 -91 54 117 -42 -134 14 109 -10 -97
2385i7O8O2j6k7j4j7N6N5n2j20N8J54l9j77K9J67J6j43l9J05L5l9m7nJ5N4J4j05
$$ -97 -29 33 17 -10 -24 -41 15 70 18 -102 -44 110 71 -106 -77 90 106 -37 -76 29 64 25 -22 -27 -12 42 56 -49
2413d9m3J19Q8j30j12J06J31r6j19L4J20j0o7k4J2M6L8m3p7L7J34k0j48j5J58
$$ -49 -92 27 115 -15 -127 -21 110 14 -105 -71 49 39 -28 -52 -40 6 44 1 -76 -39 95 75 -73 -88 70
2438G0M4j44n4J13O0p6n3J1L4L8j1o5m3R6P0q7j10O0J48o3j35K3J22Pq6j9L2M1
$$ 70 114 -30 -84 29 89 13 -40 -29 5 43 32 -33 -76 20 90 3 -107 -47 101 38 -97 -74 48 55 -31 -50 -18 23
2466B3Kk9n5J7R4J4j11l6J22N1j11o6Q6P6n1o6K3M0LKm5l1M2O9l9q8K9R5j0j17
$$ 23 25 -4 -59 -42 52 66 -45 -81 41 92 -19 -85 1 77 26 -40 -17 23 26 28 -17 -48 -6 63 24 -64 -35 60 50 -67
2496f7PR8K1q7j9L2L5Qk1l5j5O2K3o5o0P8P7o9p9M9P2j6o8LL9J6Ok6l1K4N2oq3
$$ -67 -60 38 59 -28 -47 -15 20 28 7 -28 -43 19 42 -23 -83 -5 72 3 -76 -27 45 29 -39 -36 3 19 25 -1 -32 -8 44 38 -45
2529d5J2R3J3r1l2P3L5l8n8L2L2nj7k6j9N4L1m9o5M6P6l5p6J4P6On4k0L8L0ml4
$$ -45 -33 60 73 -18 -50 23 58 20 -38 -6 26 21 4 -22 -41 13 44 -5 -70 -24 52 17 -59 -45 31 37 -17 -37 1 31 27 -7
2561gj0J0M8ko9nP1L7o7n9N7O0l1p0J7M1Jj2l2qJ7M8m0n9L6O5np9j1Q3J9o6l2
$$ -7 -17 -7 41 39 -30 -35 36 73 6 -53 4 64 33 -37 -20 21 22 10 -22 -30 -13 35 -5 -64 -28 37 32 -47 -58 25 44 -22 -54
2594e4M6L3pk5j2NM8Nn5l1N5N6n9p1O4O2k8o2lM9K2l2l2J2K4L4l2m9%P7Jp1k1
$$ -54 -8 25 18 -7 -19 -14 34 39 -16 -47 8 64 5 -66 -2 60 32 -30 -33 16 38 6 -26 -14 10 44 12 -37 -37 40 41 -30 -51
2627e1O8K9n9l5L6L6j5l1j1K7K7ml1k6L9M3k2o3K5N4ln0j0N2K1m0k7J5L5J1k6
$$ -51 17 46 -13 -48 -12 24 9 -22 -33 -6 21 17 -14 -40 -1 42 20 -43 -18 36 33 -17 -27 25 46 6 -21 -6 29 40 14
2658A4l2NN1Jn1l1N6K2k8n5K5M0ql2pJ5J7Qk6k4K4M9j7n3J6M4Qm8j2L2K7rl5P
$$ 14 -18 -13 38 39 -12 -43 13 35 7 -48 -23 17 9 -23 -30 -15 2 10 -16 -40 -16 33 16 -37 -21 23 31 -17 -29 3 30 21 -14 -7
2692gK5Qml9J4K0K2m0l6M4L1l1m3K0K6J2l0j9J6K4rj9j2J5L1j0k1j6M1K5m1j8
$$ -7 18 26 22 -17 -3 17 39 -1 -37 7 38 7 -36 -16 10 22 -8 -27 -11 13 4 -15 -27 -12 19 9 -12 -28 13 38 -3 -21
2724b1J4L7qk4qJ7L0k4j4j8L0K8k9l4QN1k2l0nL1J5k2k3J2J6Qk5j1J9J2%l0oK8
$$ -21 -7 30 22 -2 -10 7 37 13 -1 -19 11 39 10 -24 -16 35 13 -17 -22 9 24 2 -21 -9 7 15 -10 -21 -2 10 10 -20 -26 2
2758BJ4k8k5J6M6j2j3k0J5J4%j7oK0J4pl0J3L6ll7j3K6K6k1k6J4QJ1j0k9OL2P
$$ 2 16 -12 -37 -21 25 13 0 -20 -5 9 9 -8 -14 6 20 13 -17 -4 32 29 -8 -21 5 31 10 -16 -2 6 17 7 -22 -16 16 23
2792B3m3qK2J9j8k4kL8ol1OPJ9j2j3J1J3J9j3k8J2K1Qj7j7J9K0pj4j0K9rj7Ll
$$ 23 -20 -28 -6 13 -5 -29 -31 7 1 -30 -24 -17 2 -10 -23 -12 1 20 7 -21 -9 12 20 3 -14 5 25 18 4 -6 23 14 -3 0 -3
2827cJ2lk2j3K1KppjK1J1k6j8K3J4Pk8lJ5Nlj5LK2J5j7j7PK0Pk1qRJ3lk4QJ1J4
$$ -3 9 6 -16 -29 -8 -6 -13 -20 -21 0 11 -15 -33 -10 4 11 -17 -20 -5 0 -3 -18 -15 7 22 5 -12 -5 15 22 1 -7 2 15 12 -12 -4 7 21
2866B1l2kJ7J5k4j1KQJ8pk3jK6Lk8j2J5K6j4j7J4RMj3l%J3Oj3j1PK6qk2QJ9kj6
$$ 21 -11 -13 4 19 -5 -16 -14 -6 12 5 -18 -19 7 10 -18 -30 -15 11 -3 -20 -6 3 7 -6 -9 -9 4 10 -3 -14 -7 19 11 -11 -3 16 14 -2
2904bqJ4J8j8j2jOQpnj2J1J1j7j2QQRk1JK4jj4nOMPj0kQJ2Rj4N%J0j8mKK3j3j4
$$ -2 -10 4 22 4 -8 -9 -3 5 -2 -7 -19 -8 3 -14 -26 -18 -10 -1 -22 -21 3 2 -12 -17 -11 -7 0 -10 -12 -4 8 17 3 8 8 18 0 -4 -2 21 8 -6
2946fMOPnrlJ3Nj4j5JJ3Lk4J3J0JppRlJ%LjPon%KJ8%%mJ0ookjQLj7PnNknlLNK
$$ -6 -2 4 11 6 -3 -6 7 12 -2 -17 -16 -3 0 -24 -11 -1 0 -7 -14 -5 -8 -7 -7 -4 -5 2 -4 -9 -9 -7 11 11 11 7 17 11 5 3 2 10 13 -4 3 -2 3 1 -4 -7 -4 1 3
2997Cj6OJ0j1qJ4mLJ0oj2J3rKj0KK0j3j2J4QJ4j1nJnkLMqJ0J0rlQMj9%LJ6j1j3
$$ 3 -13 -7 3 -8 -16 -2 -6 -3 7 1 -11 2 -7 -5 -15 -13 7 -6 -18 -4 4 18 7 2 3 -2 -4 -1 3 -5 5 15 6 3 11 15 -4 -4 -1 15 4 -9
3039iOkqJ0Rk0MLj2kQJ1j5%PJ0Ok0J0J4pjQLj0nJ9Jj0OLMk6J7rkMPKj2kpJ2rM
$$ -9 -3 -5 -13 -3 6 -14 -10 -7 -19 -21 -13 -2 -17 -17 -10 0 6 -14 -4 10 3 2 10 13 3 -2 17 18 8 14 17 21 -5 12 3 1 5 12 14 2 0 -7 5 -4 0
3084@Kj1mQKj6kJ6J4j7lJ9Nk1J4LnKJ1nLj3J1j1lOlLoLOj0qRJ3j4kKJ0j2oRq%
$$ 0 2 -9 -13 -5 -3 -19 -21 -5 9 -8 -11 8 13 -8 6 9 4 6 17 12 15 2 13 2 -1 5 2 5 -1 2 8 -2 -10 -1 12 -2 -4 -2 8 -4 -10 -1 -9 -9
3128inJ4j1pK4oj0JJ1Lk0J1J4lj3J5JkpOl%jJ4oj4J4Mqj8J4J0rj4J9nKomjnJ6
$$ -9 -14 0 -11 -18 6 0 -10 -9 2 5 -15 -4 10 7 -6 9 10 8 1 7 4 4 3 17 11 -3 11 15 7 -11 3 13 4 -10 9 4 6 0 -4 -5 -10 6
3170FjqrJ9qk1NRQkoJ7m%mLLKJmQkJ3k0jROj7mNJ1j2j0J3knoJ4k1oJ9Mj7JK1K
$$ 6 5 -3 -12 7 -1 -22 -17 -8 0 -2 -8 9 5 5 1 4 7 9 10 6 14 12 25 5 4 13 19 2 -2 3 14 2 -8 5 3 -2 -8 6 -15 -21 -2 2 -15 -14 7 9
3216Ij6mLJ3j1Q%QjjjrRJ1jk4NK6k1%J0oJpJ0qlJ3nj3mNP%j6J2Kj2kJ6MqmRrj
$$ 9 -7 -11 -8 5 -6 2 2 10 9 8 7 -2 7 18 17 -7 -2 24 3 3 13 7 8 1 11 3 0 13 8 -5 -9 -4 3 3 -13 -1 1 -11 -13 3 7 -1 -5 4 -5 -6
3262fOj%qL4j7j4RJ9kk2nK2mlN%j0qK8j2j7J0Rnj6jJ2l%j0K4k3%J2j1OJjkqKR
$$ -6 0 -1 -1 -9 25 8 -6 3 22 20 -2 -7 15 11 8 13 13 3 -5 23 11 -6 4 13 8 -8 -9 3 0 0 -10 14 -9 -9 3 -8 -2 -1 -2 -4 -12 -10 -1
3305ajqJ4J4j5j2J9kOpjmJ1jlj3KK2j3rOJ9ok7JQKj0nJ3pPjmoQJ3j9mJ4J2j2k4
$$ -1 -2 -10 4 18 3 -9 10 8 14 7 6 2 13 12 9 -4 -2 20 7 -2 4 23 17 -10 -9 -1 1 -9 -14 -1 -8 -1 -2 -6 -12 -4 9 -10 -14 0 12 0 -24
3348b4K8J6j7rMJ7nmjLkJ1mj9j1K5J3k1nJ0J0k9LpJ0OoklRQj9oJ7Plj0JK1qj5
$$ -24 4 20 3 -6 -2 15 10 6 5 8 6 17 13 -6 -17 8 21 0 -5 5 15 -14 -11 -18 -8 -2 -8 -10 -13 -4 4 -15 -21 -4 3 0 -10 -9 12 4 -11
3389a1pJ3R%LnqJ9Kj0j7J8Oj7kJ2Pj3ljJ5Lj1oj0J5Jj0j7J6J4rlj0J6J4j9j0J8
$$ -11 -18 -5 4 4 7 2 -6 13 15 5 -12 6 12 -5 -7 5 12 -1 -4 -5 10 13 2 -4 -14 1 2 -8 -25 -9 5 -4 -7 -17 -1 13 -6 -16 2
3428BmNjj0NJ3mjoPJ0j7LRQmj1MLNj5nJMJ0mk4%J6J8k0j7J5J5k3pJ9nLj0LNNP
$$ 2 -2 3 2 -8 -3 10 6 5 -1 6 16 -1 2 11 19 15 4 8 11 16 1 -4 -3 1 11 7 -17 -17 -1 17 -3 -20 -5 10 -13 -20 -1 -6 -3 -13 -10 -5 0 7
3472GrrPJ8Jk1OJ9j0j0jRMlqnPNj1OoQNk0nMJ1mj3RJ9mk0J2%nJ4j5j3J5J2po%
$$ 7 -2 -11 -4 14 15 -6 0 19 9 -1 -2 7 11 8 0 -5 2 7 -4 2 -4 4 9 -11 -16 -12 -1 -5 -18 -9 10 6 -14 -2 -2 -7 7 -8 -21 -6 6 -1 -7 -7
3516gK1rlj2J9Qj1qj%J1knlJ3Kj2j3kK4jj3pPLj5OLJ4qj7OmJ6Lk4JJ5K1j8nkK1
$$ -7 14 5 2 -10 9 17 6 -2 -3 -3 8 6 1 -2 11 13 1 -12 -14 10 9 -4 -11 -4 -1 -16 -10 -7 7 -1 -18 -12 -16 0 3 -21 -20 -5 16 -2 -7 -9 12
3559A2mk0jK7oLj1kPOJk9J1K7qk3mK3roq%K1lj0j3J1LNj8lJ8Oj1k1J4J7MrlLJ3
$$ 12 8 -12 -13 14 8 11 0 -2 5 11 12 -17 -6 21 13 -10 -14 9 0 -6 -14 -14 7 4 -6 -19 -8 -5 0 -18 -21 -3 3 -8 -29 -15 2 6 -3 -6 -3 10
3601A0MplM%JnKjJ5k5qK1%nrOK%qppJ6Jjj2lK9j7Jj1J9jj8PJ6Mnmj0J8k%j3KK0
$$ 10 14 7 4 8 8 9 4 6 5 20 -5 -13 8 8 3 -6 0 2 2 -6 -13 -20 -4 -3 -4 -16 -19 10 -7 -6 -17 2 1 -17 -10 6 10 5 1 -9 9 7 7 -6 -4 16
3647A6mroPJ3pj9LJ0J4k2j0J2j0K6j6j8J2J1jk4OJ6J2j9j1NJ8poLj%Pj1J2JJ5
$$ 16 12 3 -3 4 17 10 -9 -6 4 18 -4 -14 -2 -12 14 -2 -20 -8 3 2 -22 -16 0 12 -7 -18 -13 5 -2 -8 -5 -6 -6 1 -10 2 3 18
3685A8rk0J0J3kj2jLPJqmJ7oMj3nRJ1l0jK2loj7J0J3qkj5K1j%oqJ5J0qj1OK3j0
$$ 18 9 -11 -1 12 10 -2 -3 0 7 8 0 -4 13 7 11 -2 -7 2 13 -17 -18 4 1 -5 -22 -12 1 -7 -9 -24 -3 -4 -4 -10 -18 -3 7 -1 -12 -6 17 7
3727GnmOJ2rr%J3Rj5j1J1Lnj2PlJ1j7n%J8j2jKNKlj6NJ7J0j7pJ2J1%j3kJ4Pj7
$$ 7 2 -2 4 16 7 -2 -2 11 20 5 -6 5 8 3 -9 -2 -5 6 -11 -16 -16 2 -10 -11 -9 -4 -2 -5 -21 -16 1 11 -6 -13 -1 10 10 -3 -5 9 16 -1
3769ajqK1Qj3kM%J2k1j5K1J0pk7J9RJk1JRmNqJNQj3j0LK1Jj5j4J1J3KjrOLNj4
$$ -1 -2 -10 11 19 6 4 8 8 20 -1 -16 5 15 8 -19 0 9 10 -11 -10 -1 -5 0 -8 -7 -2 6 -7 -17 -14 7 8 -7 -21 -10 3 5 4 -5 1 4 9 -5
3812eJJ2J0j5oJ7jmorJ9lj0%lNQj9JKOJj3lKJ2rLlJ1Pj4PkQkmpJ1J3oj4J2J0q
$$ -5 -4 8 18 3 -3 14 13 9 3 -6 13 10 0 0 -3 2 10 -9 -8 -6 0 1 -12 -15 -13 -1 -10 -7 -10 1 8 -6 1 -1 7 5 1 -6 5 18 12 -2 10 20 12
3857A2oj0J2Rj4nnK4lrj2JQkj0JQ%mj7J3K0nj5mJ2Qlj9J5J1%ql%J4Nlk7L3J3k6
$$ 12 6 -4 8 17 3 -2 -7 17 14 5 -7 -6 2 0 -10 -9 -1 -1 -5 -22 -9 11 6 -9 -13 -1 7 4 -15 0 11 11 3 0 0 14 19 16 -11 22 35 9
3899IKnjJ5j7j4J5KNj0j2OJ4lk6K0J6qpj1J1NqmlPPooLJ2jonOJ9j6jrJ8KpoMJ8
$$ 9 11 6 5 20 3 -11 4 6 11 1 -11 -5 9 6 -20 0 16 8 1 -10 1 6 -2 -6 -9 -2 5 -1 -7 -4 8 7 1 -4 2 21 5 4 -5 13 15 8 2 6 24
3944B4nj1j2PJ2pj7rK2kj2J0j0J3npoJ5klm%PQkj5J5Qoj3QJJ3pqJ3kNj4j5K5m
$$ 24 19 8 -4 3 15 8 -9 -18 4 2 -10 0 -10 3 -2 -9 -15 0 -2 -5 -9 -9 -2 6 4 -11 4 12 6 -7 1 2 15 8 0 13 11 16 2 -13 12 8
3986HNj5kK1nmj7kJ4Jpj4J0OOj4oJ2M%j4MK0%rj5J5NnJkMJ4j9MJMOj3%J2Rk1n
$$ 8 13 -2 -4 17 12 8 -9 -11 3 4 -3 -17 -7 -1 5 -9 -15 -3 1 1 -13 -9 11 11 2 -13 2 7 2 3 1 5 19 0 4 5 9 15 2 2 14 23 2 -3
4030c%OJmLj2J5nonNQlj3oK0Kkj2J1KJ0k6RPOpqJ1NmOj4PJ1Lj6mJ1jJpJ1Jlj4
$$ -3 -3 3 4 0 3 -9 6 1 -5 -10 -5 3 0 -13 -19 1 3 1 -11 0 2 12 -14 -5 2 8 1 -7 4 9 5 11 -3 4 15 18 2 -2 9 8 9 2 13 14 11 -3
4076cj0NJ2jj5j2J9J0omrJ5jrnJ4MqmMPPqmMRRj3JKJ0pj3PQpnpRqJ3j3olPMk2
$$ -3 -13 -8 4 3 -12 -24 -5 5 -1 -5 -14 1 0 -9 -14 0 4 -4 -8 -4 3 10 2 -2 2 11 20 7 8 10 20 13 0 7 15 8 3 -4 5 -3 10 -3 -9 -12 -5 -1 -23
4123b3J3J2Mj1j2LK5oj0LMjNj6QK0rj1JRJ1lj4oJ8jlj5J5mLj6MjJ3j1j0QPKj3
$$ -23 -10 2 6 -5 -17 -14 11 5 -5 -2 2 1 6 -10 -2 18 9 -2 -1 8 19 16 2 -4 14 13 10 -5 10 6 9 -7 -3 -4 9 -2 -12 -4 3 5 -8
4164hRmOJpkjPNooLJ4j0j1OK2nj6mJ8Mlj7JK5jj9kJPMj8J5rlKj9J0NRj2oJ3J0
$$ -8 1 -3 3 4 -3 -5 -6 1 6 0 -6 -3 11 1 -10 -4 18 13 -3 -7 11 15 12 -5 -4 21 20 1 -1 0 7 11 -7 8 -1 -4 -2 -21 -11 -6 3 -9 -15 -2 8
4209Hj5kJjJKOoJ0%qKjJ4kpkRJ0j5KmLJ0pLoJ0j0rOQrrpJ0Ljj7OOJ1nrJJ6%qq
$$ 8 -7 -9 -8 -9 -8 -6 0 -6 4 4 -4 -2 -3 11 9 2 0 9 19 4 6 2 5 15 8 11 5 15 5 -4 2 10 1 -8 -15 -5 -2 -3 -20 -14 -8 3 -2 -11 -10 6 6 -2 -10
4258a0PPkkkQPj2J1j2NJ1j7lPK2j1nqMJ1qj7QQJk1PNOLk0LJ5Lj5mRj2J7j2jK1
$$ -10 -3 4 2 0 -2 6 13 1 12 0 5 16 -1 -4 3 25 14 9 1 5 16 8 -9 -1 7 8 -13 -6 -1 5 8 -12 -9 6 9 -6 -10 -1 -13 4 -8 -9 12
4301A2j3KrJ2J3j5KKJJKnmJ4LnpLJRk1JJ1n%j2jJ0kjqOKqJmOJ0omjMJ7nkMJok
$$ 12 -1 1 -8 4 17 2 4 6 7 8 10 5 1 15 18 13 6 9 10 19 -2 -1 10 5 5 -7 -8 2 0 -1 -9 -3 -1 -9 -8 -12 -6 4 -2 -6 -7 -3 14 9 7 11 12 6 4
4350DpJ5LqL%J0lj5j1K1J2j7nLjLrKRqjj3KJ1jMlkJ2j4JjNlJ0okJ2Mrj0RJ5oq
$$ 4 -3 12 15 7 10 10 20 17 2 -9 12 24 7 2 5 4 7 -2 0 9 1 0 -13 -11 0 -1 3 0 -2 10 -4 -3 -4 1 -2 8 2 0 12 16 7 -3 6 21 15 7
4396G%jQjj2lJ6Lqj1J1Nk4LKlJ9j5j2J5JMKlj6J6kjJRmrMQPklj1PkJ0%j1J0Pr
$$ 7 7 6 14 13 1 -2 14 17 9 -2 9 14 -10 -7 -5 -8 11 -4 -16 -1 0 4 6 3 -13 3 1 0 1 10 6 -3 1 9 16 14 11 0 7 5 15 15 4 14 21 12
4442A2j5J0kJOj5QJ1kj4lRkj1OmNLkoJ2%lmnJ1kOmNQmj6PNJ0kj6QpJ0Oj0nKOn
$$ 12 -3 7 5 6 12 -3 5 16 14 0 -3 6 4 -7 -1 -5 0 3 1 -5 7 7 4 0 -5 6 4 10 6 11 19 15 -1 6 11 21 19 3 11 4 14 20 10 5 7 13 8
4489HoJ0j%j8PPnjnjJ3pj1J1oJ2klOLjnj3PJ5Oj2%jJNqQmLkj5J4Rj4nklPk1J2
$$ 8 2 12 11 11 -7 0 7 2 1 -4 -5 8 1 -10 1 -5 7 5 2 8 11 10 5 -8 -1 14 20 8 8 7 8 13 5 13 9 12 10 -5 9 18 4 -1 -3 -6 1 -20 -8
4536hMKOmljJ3j1%j0J8oMj3QLJpQ%N%pJNnNJrJ3k0P%J4Prj2mJ3j1NlMKpQnLno
$$ -8 -4 -2 4 0 -3 -4 9 -2 -2 -12 6 0 4 -9 -1 2 3 -4 4 4 9 9 2 3 8 3 8 9 0 13 -7 0 0 14 21 12 0 -4 9 -2 3 0 4 6 -1 7 2 5 0 -6
4586f%NOrK%oJ2Olj3J5oPj4QJ1lroJ2%J0j5qNNqJ2oLjj1J0j1Kj1MKJ3Lj2NjkJ1
$$ -6 -6 -1 5 -4 -2 -2 -8 4 10 7 -6 9 3 10 -4 4 15 12 3 -3 9 9 19 4 -4 1 6 -2 10 4 7 6 -5 5 -6 -4 -15 -11 -9 4 7 -5 0 -1 -3 8
4632HqK%Oj5RpJ7Oj6PJ1oj0lLLLj2nMJ0NrrKJ7qj6mJ4%MrmOLjmQKpOj2RNqJ1j
$$ 8 0 2 2 8 -7 2 -5 12 18 2 9 20 14 4 1 4 7 10 -2 -7 -3 7 12 3 -6 -4 13 5 -11 -15 -1 -1 3 -6 -10 -4 -1 -2 -6 2 4 -3 3 -9 0 5 -3 8 7
4681GKJ3j6lJ1mnjRLj2ljQOrKj2J3j0lmMJ1pj3NK0k4QpLJ5moMmLLjOj1PJ1oJn
$$ 7 9 22 6 3 14 10 5 4 13 16 4 1 0 8 14 5 7 -5 8 -2 -5 -9 -5 6 -1 -14 -9 11 -13 -5 -12 -9 6 2 -4 0 -4 -1 2 1 7 -4 3 14 8 9 4
4728DJ%lJ0j1QrJlJ2qNk%jrpOJ6j7oRmJ1oKkJ0qlLNQpoLJ5%j4oRJQolOjrLmJ2
$$ 4 5 5 2 12 1 9 0 1 -2 10 2 7 5 5 4 -5 -12 -6 10 -7 -13 -4 -8 3 -3 -1 -3 7 -1 -4 -1 4 12 5 -1 2 17 17 3 -3 6 7 15 9 6 12 11 2 5 1 13
4779A3lnjnPpKllKJlmOLnMkNJjjJNknLMlJ%J7j2LMmKMj2Kj5J4Jj5J0mJmlKOql
$$ 13 10 5 4 -1 6 -1 1 -2 -5 -3 -2 -5 -9 -3 0 -5 -1 -3 2 3 2 1 2 7 5 0 3 7 4 5 5 22 10 13 17 13 15 19 7 9 -6 8 9 -6 4 0 1 -3 -6 -4 2 -6 -9
4832iKjJ4rRj0KlJ3lOj8J4lj1J4LPj2qK2nrJlJ1kmm%OjjlLPj2j1OMKNpKmjoNj
$$ -9 -7 -8 6 -3 6 -4 -2 -5 8 5 11 -7 7 4 -7 7 10 17 5 -3 19 14 5 6 3 14 12 8 4 4 10 9 8 5 8 15 3 -8 -2 2 4 9 2 4 0 -1 -7 -2 -3
4881cNlj%QPj2JJ2QqlNkpQpRnpJ6j5kJ0qrOKLnonNRlkMLj4OoJ2MmQrJ0j1L%NJ0
$$ -3 2 -1 -2 -2 6 13 1 2 14 22 14 11 16 14 7 15 8 17 12 5 21 6 4 14 6 -3 3 5 8 3 -3 -8 -3 6 3 1 5 8 -6 0 -6 6 10 6 14 5 15 4 7 7 12 22
4933B2rkklPnrNQnrMJ1lj0PjkrJ0Jnk%LklJ6mJqPjnOj4J1jK%nNj0NMNlLj2PNp
$$ 22 13 11 9 6 13 8 -1 4 12 7 -2 2 13 10 0 7 6 4 -5 5 6 1 -1 -1 2 0 -3 13 9 10 2 9 8 3 9 -5 6 5 7 7 2 7 -3 2 6 11 8 11 -1 6 11 4
4985DqRJjpNoKJmjlJ6j3%MNKpKPqkJOJJ1rM%pMLj4J1J%koQJ2j7j5J2Qj5jlRKL
$$ 4 -4 5 6 5 -2 3 -3 -1 0 -4 -5 -8 8 -5 -5 -1 4 6 -1 1 8 0 -2 -1 5 6 17 8 12 12 5 9 12 -2 9 10 10 8 2 10 22 5 -10 2 10 -5 -6 -9 0 2 5
5036ErMj8J4mjnJQNjMMkrRJ1jqj1KJ0lLmORj6mMQlknmJ0j0%lJ1mLjlnoOnJ5%M
$$ 5 -4 0 -18 -4 -8 -9 -14 -13 -5 0 -1 3 7 5 -4 5 16 15 7 -4 -2 8 5 8 4 10 19 3 -1 3 11 8 6 1 -3 7 -3 -3 -6 5 1 4 3 0 -5 -11 -5 -10 5 5 9
5087Ij4lOoJJ1o%LLloJ2LkjnLK%MJJk3J4pLLj3J7j8J4j1%RkjJOmmJ1qmPjJ7k3
$$ 9 -5 -8 -2 -8 -7 4 -2 -2 1 4 1 -5 7 10 8 7 2 5 7 7 11 12 13 -10 4 -3 0 3 -10 7 -11 3 -8 -8 1 -1 -2 -1 5 1 -3 8 0 -4 3 2 19 -4
5135dJ2Kj4PLONj3mJ2qJ0kmqJj0QNpLmRj5Rj0MNJj0LPj0J3njJ1j6J7rj4J8j0J1
$$ -4 8 10 -4 3 6 12 17 4 0 12 4 14 12 8 0 1 -9 -1 4 -3 0 -4 5 -10 -1 -11 -7 -2 -1 -11 -8 -1 -11 2 -3 -4 7 -9 8 -1 -15 3 -7 4
5179DOjl%NnmNJ1j4LKj3QljJJ2mj4%Rkj1jNLknJJ2plkJOnOjNNkkOj2KJ4j2jLQ
$$ 4 10 9 6 6 11 6 2 7 18 4 7 9 -4 4 1 0 1 13 9 -5 -5 4 2 -9 -10 -5 -2 -4 -9 -8 4 -3 -6 -8 -7 -1 -6 0 -1 4 9 7 5 11 -1 1 15 3 2 5 13
5230A3j2oQKJqm%MnQMj5PkJJ0%j1LjQj2J%JPPj6P%kJ3j9J3LQpnNqNj0JJ7j0j2
$$ 13 1 -5 3 5 6 -2 -6 -6 -2 -7 1 5 -10 -3 -5 -4 6 6 -5 -2 -3 5 -7 -6 -6 -5 2 9 -7 0 0 -2 11 -8 5 8 16 9 4 9 1 6 -4 -3 14 4 -8
5277hLP%Ljklj5PJ1Lj6RNj4KNjJ0j0MNjJOqLKKj1J4krkLJ2j4llMLJn%RqJ%MqP
$$ -8 -5 2 2 5 4 2 -1 -16 -9 2 5 -11 -2 3 -11 -9 -4 -5 5 -5 -1 4 3 4 10 2 5 7 9 -2 12 10 1 -1 2 14 0 -3 -6 -2 1 2 -3 -3 6 -2 -1 -1 3 -5 2
5328BkjmNL%mMlnNKPj7J4mPoMrRlNnOpPpKjnNqlKJ6j7kPklnPjn%pJ7NrNjnpOL
$$ 2 0 -1 -5 0 3 3 -1 3 0 -5 0 2 9 -8 6 2 9 3 7 -2 7 4 9 4 10 3 10 3 5 4 -1 4 -4 -7 -5 11 -6 -8 -1 -3 -6 -11 -4 -5 -10 -10 -17 0 5 -4 1 0 -5 -12 -6 -3
5384cnJ2pMpOLRj6J0qP%nJoO%j0NQkloLoJ6pppRJ1j7QlJ1pmK0rqlJ8LJk1J3rJ4
$$ -3 -8 4 -3 1 -6 0 3 12 -4 6 -2 5 5 0 1 -5 1 1 -9 -4 4 2 -1 -7 -4 -10 6 -1 -8 -15 -6 5 -12 -4 -7 4 -3 -7 13 4 -4 -7 11 14 15 -6 7 -2 12
5433A2Jj3KnJ2kmqNj0J4j0lJ1rj2K2oOKoKpoRoM%JOj0lJ1nmMJOjnJ0Mmj3mJ8l
$$ 12 13 0 2 -3 9 7 3 -5 0 -10 4 -6 -9 2 -7 -19 3 -3 3 5 -1 1 -6 -12 -3 -9 -5 -5 -4 2 -8 -11 0 -5 -9 -5 -4 2 1 -4 6 10 6 -7 -11 7 4
5480DjM%qoMPoNmkknjRmKMrJOJlJkKJ4j4OKmPlKoJMr%MoMMj0POOqrljjLRj1lQ
$$ 4 3 7 7 -1 -7 -3 4 -2 3 -1 -3 -5 -10 -11 -2 -6 -4 0 -9 -8 -2 -1 -4 -3 -5 -3 11 -3 3 5 1 8 5 7 1 2 6 -3 -3 1 -5 -1 3 -7 0 6 12 4 -5 -8 -9 -10 -7 2 -9 -12 -4
5537dRj1pLN%nLNNrJ1mKmmROmkNj6J0J1j3JlRnoJ0j0J2j2KLj4RJLpj4QPNkmO%
$$ -4 5 -6 -13 -10 -5 -5 -10 -7 -2 3 -6 5 1 3 -1 -5 4 10 6 4 9 -7 3 14 1 2 -1 8 3 -3 7 -3 9 -3 -1 2 -12 -3 -2 1 -6 -20 -12 -5 0 -2 -6 0 0
5586@OLj6KPjrMJJ0qJ0n%LoL%jljJ3%jlqOnLj8LJ3JMj4LJ0kmKpjjJjOjKPj7KJ8
$$ 0 6 9 -7 -5 2 1 -8 -4 -3 7 -1 9 4 4 7 1 4 4 3 0 -1 12 12 11 8 0 6 1 4 -14 -11 2 3 7 -7 -4 6 4 0 2 -5 -6 -7 -6 -7 -1 -2 0 7 -10 -8 10
5638A0Moj0J3j3J4olJ5j2pKJ3mjmrKJ6l2K3j7J3ml%%J3j1kLJ6j2kmJ4j5PoOQq
$$ 10 14 8 -2 11 -2 12 6 3 18 6 -1 1 14 10 9 5 -4 -2 14 -18 5 -12 1 -3 -6 -6 -6 7 -4 -6 -3 13 1 -1 -5 9 -6 1 -5 1 9 1
5680AQj2KPOj5QqOklNrJ2ojkoJ7j2%nJJ3j6OLllJ0koMklQOmjOOpj3J1J0j3mnJ2
$$ 1 9 -3 -1 6 12 -3 5 -3 3 1 -2 3 -6 6 0 -1 -3 -9 8 -4 -4 -9 -8 5 -11 -5 -2 -5 -8 2 0 -6 -2 -4 -7 1 7 3 2 8 14 7 -6 5 15 2 -2 -7 5
5729E%%j0J4j3%OkpJ0JojkJJokKOPrPlj0J6j0RmlLKJoJ6jnMKkmNj%rnJ2pKj1M
$$ 5 5 5 -5 9 -4 -4 2 0 -7 3 4 -2 -3 -5 -4 -3 -9 -11 -9 -3 4 -5 2 -1 -11 5 -5 4 0 -3 0 2 3 -3 13 12 7 11 13 11 7 12 11 11 2 -3 9 2 4 -7 -3
5780c%nJ0mMoMj1JNjlKkQkMJ0qQnkOJMpmJKK%oQj2NNkomOlkNmJMkkj0J1%Oj1k
$$ -3 -3 -8 2 -2 2 -4 0 -11 -10 -5 -6 -9 -7 -9 -1 -3 1 11 3 11 6 4 10 11 15 8 4 5 7 9 9 3 11 -1 4 9 7 1 -3 3 0 -2 3 -1 0 4 2 0 -10 1 1 7 -4 -6
5834fKkPj2J4mKJL%%KmJ1j3KRqj4K1nNomJ%KoJ4j7PpJ1j3N%M%j0JJ1lKOoMj3J0
$$ -6 -4 -6 1 -11 3 -1 1 2 5 5 5 7 3 14 1 3 12 4 -10 11 6 11 5 1 2 2 4 -2 12 -5 2 -5 6 -7 -2 -2 2 2 -8 -7 4 1 3 9 3 7 -6 4
5882DNnjJ0j2J%Oj0J5j0Q%NjnpJ1rnQpj1J7mJpmLnoJ3j3PJ1mjJJnQQoJLKmlLN
$$ 4 9 4 3 13 1 2 2 8 -2 13 3 11 11 16 15 10 3 14 5 0 8 1 -10 7 3 4 -3 -7 -4 -9 -15 -2 -15 -8 3 -1 -2 -1 0 -5 3 11 5 6 9 11 7 4 7 12
5932A2%Kj0lQj1Lj0J5%q%jJkMjkmKoJ1%ljMMj2OkJQn%J0j4J1pJ0%qPjNonLqKQ
$$ 12 12 14 4 1 9 -2 1 -9 6 6 -2 -2 -3 -2 -4 0 -1 -3 -7 -5 -11 0 0 -3 -4 0 4 -8 -2 -4 -3 5 0 0 10 -4 7 0 10 10 2 9 8 13 7 2 5 -3 -1 7
5982Gkj4J2Okj2kLjjkjpJ6jl%LN%ok%kR%%KPj8J6jOmpKRj1kNl%JMMrj4N%%j2O
$$ 7 5 -9 3 9 7 -5 -7 -4 -5 -6 -8 -9 -16 0 -1 -4 -4 -1 4 4 -2 -4 -4 -6 3 3 3 5 12 -6 10 9 15 11 4 6 15 4 2 7 4 4 5 9 13 4 -10 -5 -5 -5 -17 -11
6034a1J2Kj6PlkNLk%J1qJ2oK%JKllOMjq%J6j8NOjlqkRrJkljQlj0nJ3K%%jJNkL
$$ -11 1 3 -13 -6 -9 -11 -6 -3 -5 -5 6 -2 10 4 6 6 7 9 6 3 9 13 12 4 4 20 2 7 13 12 9 1 -1 8 -1 0 -2 -5 -6 2 -1 -11 -16 -3 -1 -1 -1 -2 -1 4 2 5
6086EolPJ%koM%RloJ1OqmMLqMl%lMNmj0KmLOrMJJ4j3pLrkJ2RoMkpJ1kjK%Rk3R
$$ 5 -1 -4 3 4 4 2 -4 0 0 9 6 0 11 17 9 5 9 12 4 8 5 5 2 6 11 7 -3 -1 -5 -2 4 -5 -1 0 14 1 -6 -3 -12 -14 -2 7 1 5 3 -4 7 5 4 6 6 15 -8 1
6140AoPjRlJoKLmQLj1jnN%Kj0NjJmlPj2J6Jj5J0nRJ0j2%Ljk%OjoLnJ6rrLNOKq
$$ 1 -5 2 1 10 7 8 2 4 7 3 11 14 3 2 -3 2 2 4 -6 -1 -2 -1 -5 -8 -1 -13 3 4 -11 -1 -6 3 13 1 1 4 3 1 1 7 6 0 3 -2 14 5 -4 -1 4 10 12 4
6192DK%nqJkMrJ6mNknpPjNnJKJLRjoJjRjj0KQjmpQjj3jJ6pLkj0OKKJqnLRjj6Q
$$ 4 6 6 1 -7 -6 -8 -4 -13 3 -1 4 2 -3 -10 -3 -4 1 -4 -3 -1 0 3 12 11 5 6 5 14 13 3 5 13 12 8 1 9 8 -5 -6 10 3 6 4 -6 0 2 4 5 -3 -8 -5 4 3 -13 -5
6247eNKQj3LKJoRrMMKJKnKlJ3j8MKjmOJ7k0jOj7LOkkLj%%KjJmNo%M%NnJ2rmJN
$$ -5 0 2 10 -3 0 2 3 -3 6 -3 1 5 7 8 10 5 7 4 17 -1 3 5 4 0 6 23 3 2 8 -9 -6 0 -2 -4 -1 -2 -2 -2 0 -1 0 -4 1 -5 -5 -1 -1 4 -1 11 2 -2 -1 4
6301Dj0jJ3QkqJ1j9J1KNj9RKJj1kPlOj1kOJqjkJ0KpKMn%pJ8rmRLQKqlJ0mKmNQ
$$ 4 -6 -7 6 14 12 4 15 -4 7 9 14 -5 4 6 7 -4 -6 1 -2 4 -7 -9 -3 -2 -10 -11 -13 -3 -1 -8 -6 -2 -7 -7 -14 4 -5 -9 0 3 11 13 5 2 12 8 10 6 11 19
6351A9lnj0OJj0QoJjMKj4KQKqMQokjkJ0noJ3lMm%jJ0kj9J5kj%nJ0pj0J4jpOll
$$ 19 16 11 1 7 8 -2 6 0 1 0 4 6 -8 -6 2 4 -4 0 8 2 0 -1 -3 7 2 -4 9 6 10 6 6 5 15 13 -6 9 7 6 6 1 11 4 -6 8 7 0 6 3 0
6400@%O%lrLlPjJkjlJ2%qJlRoOKjLkoN%jKjlM%Kmj1J5rRoj8RjJ0nmlOnRj4J1m
$$ 0 0 6 6 3 -6 -3 -6 1 0 1 -1 -2 -5 7 7 -1 0 -3 6 0 6 8 7 10 8 2 7 7 6 8 7 4 8 8 10 6 -5 10 1 10 4 -14 -5 -6 4 -1 -5 -8 -2 -7 2 -12 -1 -5
6454ekJ5j9J3JnONJj4QKQJ1k0j2J5rQJ3qoJ%j0J3pNkj2K6j8Q%Lj6JlQ%mj1J8j
$$ -5 -7 8 -11 2 3 -2 4 9 10 -4 4 6 14 25 5 -7 8 -1 7 20 12 6 7 7 -3 10 3 8 6 -6 20 2 10 10 13 -3 -2 -5 3 3 -1 -12 6 5
6498ElJmkKOj1OJ5oj0Ol%J0kmnqJ0Qp%j4J7mNlj0qJ4%mqKJLmQ%mkQ%j4J6PrpJ4
$$ 5 2 3 -1 -3 -1 5 -6 0 15 9 -1 5 2 2 12 10 6 1 -7 3 11 4 4 -10 7 3 8 5 -5 -13 1 1 -3 -11 -9 -8 -5 -9 -1 -1 -5 -7 1 1 -13 3 10 1 -6 8
6548HkoPnQpOLjrJ1k0J7jmMqjPj6LkjJ3%j3J5j8MlPjKOmNpJ2j1QpQkjmQnJ0j2
$$ 8 6 0 7 2 10 3 9 12 11 2 13 -7 10 9 5 9 1 0 7 -9 -6 -8 -9 4 4 -9 6 -12 -8 -11 -4 -5 -3 3 -1 4 -3 9 -2 6 -1 7 5 4 0 8 3 13 1
6597AjPJ2okj2Kj%JLlKmLKonNoJ6onKJJ2k2J5j6J5JjpNMlLqOnRmnOjK%qKnRkK
$$ 1 0 7 19 13 11 -1 1 0 0 1 4 1 3 -1 2 4 -2 -7 -2 -8 8 2 -3 -1 0 12 -10 5 -11 4 5 4 -3 2 6 3 6 -2 4 -1 8 4 -1 5 4 6 6 -2 0 -5 4 2 4
6650Dj4J0kQj1nJ0j0RjkpOJ4pmnKNj1J5kOnNMMnkkJlJ1j4NKrLnnJLKJ0j4mJ7n
$$ 4 -10 0 -2 6 -5 -10 0 -10 -1 -2 -4 -11 -5 9 2 -2 -7 -5 0 -11 4 2 8 3 8 12 16 11 9 7 8 5 16 2 7 9 0 3 -2 -7 -6 -3 -1 9 -5 -9 8 3
6698CppM%KJlP%k%Pj0J2qMMjmQQj7%J3m%jOkKqllRqMmj%Oj4J2pnpPKOpoNkJ4r
$$ 3 -4 -11 -7 -7 -5 -4 -7 0 0 -2 -2 5 -5 7 -1 3 7 6 2 10 18 1 1 14 10 10 9 15 13 15 7 4 1 10 2 6 2 1 1 7 -7 5 -2 -7 -14 -7 -5 1 -6 -12 -7 -9 5 -4
6752dRlJ2j0rMRj0K0j2Nnj%%mJ5j5RmOj4KMl%n%KMmLj5OL%jRmL%JqRKpJ2l%KM
$$ -4 5 2 14 4 -5 -1 8 -2 18 6 11 6 5 5 5 1 16 1 10 6 12 -2 0 4 1 1 -4 -4 -2 2 -2 1 -14 -8 -5 -5 -6 3 -1 2 2 3 -5 4 6 -1 11 8 8 10 14
6803A4j2NoKPJLkpJMjomQomjLknJMNjjj1PoNqJ2Qj1NJJ0pklPJpLLRj6NkKJ0rq
$$ 14 2 7 1 3 10 11 14 12 5 6 10 9 3 -1 7 1 -3 -4 -1 -3 -8 -7 -3 2 1 0 -11 -4 -10 -5 -13 -1 7 -4 1 2 12 5 3 0 7 8 1 4 7 16 0 5 3 5 15 6 -2
6856bMMopPMl%nmOmMo%kQkLJ0pLlnkoOJ7nlMlOkjqKPj3On%KJMm%pQmnLKNj2J0
$$ -2 2 6 0 -7 0 4 1 1 -4 -8 -2 -6 -2 -8 -8 -10 -2 -4 -1 9 2 5 2 -3 -5 -11 -5 12 7 4 8 5 11 9 8 0 2 9 -4 2 -3 -3 -1 0 4 0 0 -7 1 -3 -8 -5 -3 2 -10 0
6912@jKpRj6J5lkmQKlJ2j0kRj5J2m%NpoRmpNkQrMj1MN%%j0J2jj2MNJ8j5jKjJ0
$$ 0 -1 1 -6 3 -13 2 -1 -3 -7 1 3 0 12 2 0 9 -6 6 2 2 7 0 -6 3 -1 -8 -3 -5 3 -6 -2 -13 -9 -4 -4 -4 -14 -2 -3 -15 -11 -6 12 -3 -4 -2 -3 7
6960Gj2K0j2lNlkQmqOJpJ8j2OjmjKJjoLNjjj8QjkQj0%OjPrK0j8%MJk%PRj3%KQ
$$ 7 -5 15 3 0 5 2 0 8 4 -4 2 3 -4 14 2 8 7 3 2 4 5 4 -2 1 6 5 4 -14 -6 -7 -9 -1 -11 -11 -5 -6 1 -8 12 -6 -6 -2 -1 -3 -3 4 13 0 0 2 10
7011A0j1RNrMrK%Mmjj6J5rJ2LlJnKKrPrRmkQLNj1JJMnRknpJ2joQj1JJ7j1L%Mj1
$$ 10 -1 8 13 4 8 -1 1 1 5 1 0 -16 -1 -10 2 5 2 3 -2 0 2 -7 0 -9 0 -4 -6 2 5 10 -1 0 1 5 0 9 7 2 -5 7 6 0 8 -3 -2 15 4 7 7 11 0
7062@L%rPnJPq%LK%JlNmllMKMj1J6oQKj5J2mKqOklMJ0LrjNj1MoKJpJ2j1qJ1Jm
$$ 0 3 3 -6 1 -4 -3 4 -4 -4 -1 1 1 2 -1 4 0 -3 -6 -2 0 4 -7 9 3 11 13 -2 10 6 8 0 6 4 1 5 15 18 9 8 13 2 6 0 2 3 -4 8 -3 -11 0 1 -3
7114cqLPj2J0koK1pqQlKRlMqpLLNpRrJ1KpmOqLkmjJ3oj2OoJ5kj1j%Kj%lNjQrL
$$ -3 -11 -8 -1 -13 -3 -5 -11 10 3 -5 3 0 2 11 8 12 4 -3 0 3 8 1 10 1 12 14 7 3 9 1 4 2 -2 -3 10 4 -8 -2 -8 7 5 -6 -7 -7 -5 -6 -6 -9 -4 -5 3 -6 -3
7167cN%jNKnJ2oj0NN%kLMJqMj0MoNLmNooMJ0oj4JOJJ2nj6J7j6%PlJ7j1Ql%pJ2
$$ -3 2 2 1 6 8 3 15 9 -1 4 9 9 7 10 14 15 7 11 1 5 -1 4 7 3 8 2 -4 0 10 4 -10 -9 -3 -2 10 5 -11 6 -10 -10 -3 -6 11 0 8 5 5 -2 10
7216A0jjqO%JJjnn%K%lJ5%r%j1OJLJk4J2Qj2PnJ7j2n%J2mJ0JrJOQjrjNj0J6j0
$$ 10 9 8 0 6 6 7 8 7 2 -3 -3 -1 -1 -4 11 11 2 2 -9 -3 -2 1 2 -22 -10 -2 -14 -7 -12 5 -7 -12 -12 0 -4 6 7 -2 -1 5 13 12 3 2 7 -3 13 3
7264C%jMj2J0j0J0mRrkJ3j1nOKnpJ1koKJ3pjNLJmmOlMrOjMQrJ0j2KkKqJ5oLnm
$$ 3 3 2 6 -6 4 -6 4 0 9 0 -2 11 0 -5 1 3 -2 -9 2 0 -6 -4 9 2 1 6 9 10 6 2 8 5 9 0 6 5 9 17 8 18 6 8 6 8 0 15 9 12 7 3
7314CJ1lj2QrmQLj1RlqkJ4nOjJpJJ0pJ1orJ7j0J0nnmOQ%nlqJjM%J1qQj2OmLmo
$$ 3 14 11 -1 7 -2 -6 2 5 -6 3 0 -8 -10 4 -1 5 4 5 -2 -1 9 2 13 7 -2 15 5 15 10 5 1 7 15 15 10 7 -1 0 -1 3 3 14 6 14 2 8 4 7 3 -3
7364cjlmMLpJ3JjPj2MRqPnoJ0%oJ0pJ4rlljMPj7OjPp%Qj3jj0J5Qj0oOJnmN%KL
$$ -3 -4 -7 -11 -7 -4 -11 2 3 2 9 -3 1 10 2 9 4 -2 8 8 2 12 5 19 10 7 4 3 7 14 -3 3 2 9 2 2 10 -3 -4 -14 1 9 -1 -7 -1 0 -5 -9 -4 -4 -2 1
7415A%qJ0LKlnOnRpQrJ3j4kJ6j1NmNn%Nk%kmrRkPj0oJ0kJrJ0KoLrMmJ6nPkqLO
$$ 1 1 -7 3 6 8 5 0 6 1 10 3 11 2 15 1 -1 15 4 9 5 10 5 5 10 8 8 6 2 -7 2 0 7 -3 -9 1 -1 0 -9 1 3 -3 0 -9 -5 -9 7 2 9 7 -1 2 8
7467HOj5J6j8RkOj0JJJ5j0npLoNqOKPj3M%J3lmJJJrPmjnJ3nJ6j3RpK%nQjmJKj
$$ 8 14 -1 15 -3 6 4 10 0 1 2 17 7 2 -5 -2 -8 -3 -11 -5 -3 4 -9 -5 -5 8 5 1 2 3 4 -5 2 -2 -3 -8 5 0 16 3 12 5 7 7 2 10 9 5 6 8 7
7517GOj3QlKoOkj1LjJLn%NMpPoojJ3pRnrLJ5KkoQmmoQmKNkPjlmLlKmmjlJOnNL
$$ 7 13 0 8 5 7 1 7 5 -6 -3 -4 -3 0 -5 -5 0 4 -3 4 -2 -8 -9 4 -3 6 1 -8 -5 10 12 10 4 12 8 4 -2 6 2 4 9 7 14 13 10 6 9 6 8 4 0 -1 -4 -3 3 -2 3 6
7574FmoRJpK%PJljnOKnMJ4jj1KPpn%njJ0j3kJ4JqkJMjmomRJj0KLKMoMLjoNKJK
$$ 6 2 -4 5 6 -1 1 1 8 9 6 5 0 6 8 3 7 21 20 9 11 18 11 6 6 1 0 10 -3 -5 9 10 2 0 1 5 4 0 -6 -10 -1 0 -10 -8 -5 -3 1 -5 -1 2 1 -5 0 2 3 5
7629ELkmQMojkQqKmkK%L%jo%KorK7k4RqOrMMJ3mLNrMj4KJ5o%nNKpJ1pmKJ0mj1
$$ 5 8 6 2 10 14 8 7 5 13 5 7 3 1 3 3 6 6 5 -1 -1 1 -5 -14 13 -11 -2 -10 -4 -13 -9 -5 8 4 7 12 3 7 -7 -5 10 4 4 -1 4 6 -1 10 3 -1 1 11 7 -4
7682dOqJ5kp%KnlJ0j5KJ1j4O%JnJ3knoMJ1qOj2J3j3K3j1nQJmQmnOnQooRjkj4J1
$$ -4 2 -6 9 7 0 0 2 -3 -6 4 -11 -9 2 -12 -6 -6 -5 -10 3 1 -4 -10 -6 5 -3 3 -9 4 -9 14 3 -2 6 7 3 11 7 2 8 3 11 5 -1 8 7 5 -9 2
7730BqPmOpLqLOj1RNppJLkJ1J2qJnNJNqOqOjjJQnkmJJjnLkj%poJ4o%PpKlOj1J2
$$ 2 -6 1 -3 3 -4 -1 -9 -6 0 -11 -2 3 -4 -11 -10 -7 -9 2 14 6 7 2 7 8 13 5 11 3 9 8 7 8 16 11 9 5 6 7 6 1 4 2 1 1 -6 -12 2 -4 -4 3 -4 -2 -5 1 -10 2
7786Bj6K1jmrJ6j1LOJ2oMj1OpJ%OjjnpKKkLRqJ4j8LJpkLNPoj0lkoJ3kJ8j2lJ2
$$ 2 -14 7 6 2 -7 9 -2 1 7 19 13 17 6 12 5 6 6 12 11 10 5 -2 0 2 0 3 12 4 18 0 3 4 -3 -5 -2 3 10 4 -6 -9 -11 -17 -4 -6 12 0 -3 9
7834IqPnPrNjjkQrJ4prPrLKMqK%lmkjQJ1Jj3j3MjJ1lLmMQjj2QnJPpJ2npJ1lJO
$$ 9 1 8 3 10 1 6 5 4 2 10 1 15 8 -1 6 -3 0 2 6 -2 0 0 -3 -7 -9 -10 -2 9 10 -3 -16 -12 -13 -2 -5 -2 -6 -2 6 5 -7 1 -4 -3 4 -3 9 4 -3 8 5 6 12
7887A2j4lNJqRj%LqJPj0KojQOrJqkNK%%J1lJqQklRoLLnPj4Qj0K%J2j5J4kmMoP
$$ 12 -2 -5 0 1 -7 2 1 1 4 -4 -3 4 -6 -4 -10 -11 -3 3 -6 -5 -13 -15 -10 -8 -8 -8 3 0 1 -7 1 -1 -4 5 -1 2 5 0 7 -7 1 -9 -7 -7 5 -10 4 2 -2 2 -4 3
7939C%j0POj6MqQkLNj2LQ%nLqNOqPmJ3Lj6J3lj1nJ0lLPpPmLLlKMj6JjJ2j1Lj7
$$ 3 3 -7 0 6 -10 -6 -14 -6 -8 -5 0 -12 -9 -1 -1 -6 -3 -11 -6 0 -8 -1 -5 8 11 -5 8 5 -6 -11 -1 -4 -1 6 -1 6 2 5 8 5 7 11 -5 -4 -5 7 -4 -1 -18
7988a8J8j2KOjLklMPoLPj5J0KjLj6J1J2j1QoLnNKo%%jLjJj7QoJ3mlPj0QjoJJN
$$ -18 0 -12 -10 -4 -5 -2 -4 -7 -3 4 -2 1 8 -7 3 5 4 7 -9 2 14 3 11 5 8 3 8 10 4 4 4 3 6 5 6 -11 -3 -9 4 0 -3 4 -6 2 1 -5 -4 -3 2
8037BoNOj3PJ4k0%J4j4P%O%jmoJ5qPj7J4j4LQ%pnNOoKj0J6nj3RlJ8qqnMN%qNJ1
$$ 2 -4 1 7 -6 1 15 -5 -5 9 -5 2 2 8 8 7 3 -3 12 4 11 -6 8 -6 -3 5 5 -2 -7 -2 4 -2 0 -10 6 1 -12 -3 -6 12 4 -4 -9 -5 0 0 -8 -3 8
8085HLpkJ0p%MJm%JJ0mpkOKMk0JRkprQNlJ%LqqmPJ5rjNoLNMo%J0kqOmOMNj2J0
$$ 8 11 4 2 12 5 5 9 10 6 6 7 17 13 6 4 10 12 16 -4 -3 6 4 -3 -12 -4 1 -2 -1 -1 2 -6 -14 -18 -11 4 -5 -6 -1 -7 -4 1 5 -1 -1 9 7 -1 5 1 7 11 16 4 14
8139A4j4%NqRKJnj9OlJ5jj3QqLj%OLnKJlkJ3pNj1J1%Rj2JKloRlLjLmmNMpkj0R
$$ 14 0 0 5 -3 6 8 9 4 -15 -9 -12 3 2 -11 -3 -11 -8 -9 -9 -3 0 -5 -3 -2 -5 -7 6 -1 4 -7 4 4 13 1 2 4 1 -5 4 1 4 3 6 2 -2 3 7 0 -2 -12 -3
8190cl
8191f
##END NTUPLES=NMR FID
##END=
