##TITLE=1H_LY-DMAA.PER.1
 CDCl3
 8 sc, 
 20.1.2022
##JCAMPDX= 6.0         $$ Bruker NMR JCAMP-DX V2.0
##DATA TYPE= NMR FID
##DATA CLASS= NTUPLES
##ORIGIN= UXNMR, Bruker Analytische Messtechnik GmbH
##OWNER= root
$$ XWIN-NMR		Version 3.5
$$ Thu Jan 20 11:23:28 2022 Russian Standard Time (UT+4h)  she@DPX200
##.OBSERVE FREQUENCY= 200.131346
##.OBSERVE NUCLEUS= ^1H
##.DELAY= (6, 6)
##.ACQUISITION MODE= SIMULTANEOUS
##.ACQUISITION SCHEME= undefined
##.AVERAGES= 8
##.DIGITISER RES= 18
##SPECTROMETER/DATA SYSTEM= spect
##.PULSE SEQUENCE= zg30
##.SOLVENT NAME= CDCl3
##.SHIFT REFERENCE= (INTERNAL, CDCl3, 0, 15.7039)
##AUDIT TRAIL= $$ (NUMBER, WHEN, WHO, WHERE, WHAT)
$$ ##TITLE= Audit trail, XWIN-NMR		Version 3.5
$$ ##JCAMPDX= 5.01
$$ ##ORIGIN= Bruker BioSpin GmbH
$$ ##OWNER= she
$$ F:/spectra/data/she/nmr/H-F/1/audita.txt
$$ ##AUDIT TRAIL=  $$ (NUMBER, WHEN, WHO, WHERE, WHAT)
(   1,<2022-01-20 11:22:13.34 +0400>,<she>,<DPX200>,
      <created by zg, POWCHK disabled, PULCHK disabled
       configuration hash MD5:
       00 E9 B6 7A A2 85 ED C7 34 08 36 98 17 FE 4E 26
       data hash MD5: 16K
       36 13 65 8C A8 FE C9 69 7B 2E 01 DB BE C0 10 57>)
$$ ##END=
$$ 
$$ hash MD5
$$ 65 91 20 08 90 E9 E3 AF 44 AC 43 5D D8 25 13 9E
##$RELAX= 
##$RELAX= 
##$RELAX= 
##$RELAX= 
##$RELAX= 
##$RELAX= 
$$ Bruker specific parameters
$$ --------------------------
##$DU= <F:/spectra>
##$EXPNO= 1
##$NAME= <H-F>
##$PROCNO= 1
##$TYPE= <nmr>
##$USER= <she>
##$AMP= (0..31)
100 100 100 100 100 100 100 100 100 100 100 100 100 100 100 100 100 100 
100 100 100 100 100 100 100 100 100 100 100 100 100 100 
##$AQSEQ= 0
##$AQ_mod= 1
##$AUNM= <au_zg>
##$AUTOPOS= <>
##$BF1= 200.13
##$BF2= 200.13
##$BF3= 200.13
##$BF4= 200.13
##$BF5= 200.13
##$BF6= 200.13
##$BF7= 200.13
##$BF8= 200.13
##$BYTORDA= 1
##$CFDGTYP= 0
##$CFRGTYP= 5
##$CHEMSTR= <none>
##$CNST= (0..31)
1 1 145 1 1 1 1 1 1 1 1 1 1 1 1 1 1 1 1 1 1 1 1 1 1 1 1 1 1 1 1 1 
##$CPDPRG= <>
##$CPDPRG1= <>
##$CPDPRG2= <>
##$CPDPRG3= <>
##$CPDPRG4= <mlev>
##$CPDPRG5= <mlev>
##$CPDPRG6= <mlev>
##$CPDPRG7= <mlev>
##$CPDPRG8= <mlev>
##$CPDPRGB= <>
##$CPDPRGT= <>
##$D= (0..31)
0 1.2 0 0 0 0 0 0 0 0.06 0 0.03 0 0 0 0 0.0002 0 0 0 0 0 0 0 0 0 0 0 0 
0 0 0 
##$DATE= 1642663332
##$DBL= (0..7)
120 120 120 120 120 120 120 120 
##$DBP= (0..7)
150 150 150 150 150 150 150 150 
##$DBP07= 0
##$DBPNAM0= <>
##$DBPNAM1= <>
##$DBPNAM2= <>
##$DBPNAM3= <>
##$DBPNAM4= <>
##$DBPNAM5= <>
##$DBPNAM6= <>
##$DBPNAM7= <>
##$DBPOAL= (0..7)
0.5 0.5 0.5 0.5 0.5 0.5 0.5 0.5 
##$DBPOFFS= (0..7)
0 0 0 0 0 0 0 0 
##$DE= 6
##$DECBNUC= <off>
##$DECIM= 32
##$DECNUC= <off>
##$DECSTAT= 4
##$DIGMOD= 1
##$DIGTYP= 9
##$DL= (0..7)
0 120 120 120 120 120 120 120 
##$DP= (0..7)
150 150 150 150 150 150 150 150 
##$DP07= 0
##$DPNAME0= <>
##$DPNAME1= <>
##$DPNAME2= <>
##$DPNAME3= <>
##$DPNAME4= <>
##$DPNAME5= <>
##$DPNAME6= <>
##$DPNAME7= <>
##$DPOAL= (0..7)
0.5 0.5 0.5 0.5 0.5 0.5 0.5 0.5 
##$DPOFFS= (0..7)
0 0 0 0 0 0 0 0 
##$DQDMODE= 0
##$DR= 18
##$DS= 0
##$DSLIST= <SSSSSSSSSSSSSSS>
$$ [...]
##$SUBNAM2= <"">
##$SUBNAM3= <"">
##$SUBNAM4= <"">
##$SUBNAM5= <"">
##$SUBNAM6= <"">
##$SUBNAM7= <"">
##$SUBNAM8= <"">
##$SUBNAM9= <"">
##$SW= 18.0517287032376
##$SWIBOX= (0..15)
0 0 2 0 0 0 0 0 0 0 0 0 0 0 0 0 
##$SW_h= 3612.71676300578
##$TD= 16384
##$TD0= 1
##$TE= 0
##$TE2= 300
##$TE3= 300
##$TEG= 300
##$TL= (0..7)
0 120 120 120 120 120 120 120 
##$TP= (0..7)
150 150 150 150 150 150 150 150 
##$TP07= 0
##$TPNAME0= <>
##$TPNAME1= <>
##$TPNAME2= <>
##$TPNAME3= <>
##$TPNAME4= <>
##$TPNAME5= <>
##$TPNAME6= <>
##$TPNAME7= <>
##$TPOAL= (0..7)
0.5 0.5 0.5 0.5 0.5 0.5 0.5 0.5 
##$TPOFFS= (0..7)
0 0 0 0 0 0 0 0 
##$TUNHIN= 0
##$TUNHOUT= 0
##$TUNXOUT= 0
##$USERA1= <user>
##$USERA2= <user>
##$USERA3= <user>
##$USERA4= <user>
##$USERA5= <user>
##$V9= 5
##$VALIST= <valist>
##$VCLIST= <CCCCCCCCCCCCCCC>
##$VD= 0
##$VDLIST= <DDDDDDDDDDDDDDD>
##$VPLIST= <PPPPPPPPPPPPPPP>
##$VTLIST= <TTTTTTTTTTTTTTT>
##$WBST= 1024
##$WBSW= 4
##$XGAIN= (0..3)
0 0 0 0 
##$XL= 0
##$YL= 0
##$YMAX_a= 32943
##$YMIN_a= -32347
##$ZGOPTNS= <>
##$ZL1= 120
##$ZL2= 120
##$ZL3= 120
##$ZL4= 120
##$ABSF1= 10
##$ABSF2= 0
##$ABSG= 5
##$ABSL= 3
##$ALPHA= 0
##$AQORDER= 0
##$ASSFAC= 0
##$ASSFACI= 0
##$ASSFACX= 0
##$ASSWID= 0
##$AUNMP= <proc_1d>
##$AZFE= 0.1
##$AZFW= 0.1
##$BCFW= 1
##$BC_mod= 2
##$BYTORDP= 1
##$COROFFS= 0
##$CY= 11.3945322036743
##$DATMOD= 1
##$DC= 2
##$DFILT= <>
##$DTYPP= 0
##$F1P= 2.36226072786647
##$F2P= -0.459571619588291
##$FCOR= 0.5
##$FTSIZE= 0
##$FT_mod= 4
##$GAMMA= 1
##$GB= 0.15
##$INTBC= 1
##$INTSCL= 1
##$ISEN= 128
##$LB= 0.24
##$LEV0= 0
##$LPBIN= 0
##$MAXI= 10000
##$MC2= 0
##$MEAN= 0
##$ME_mod= 0
##$MI= 1.114404
##$NCOEF= 0
##$NC_proc= 0
##$NLEV= 6
##$NOISF1= 3.799351
##$NOISF2= 2.8
##$NSP= 1
##$NTH_PI= 0
##$NZP= 0
##$OFFSET= 15.70392
##$PC= 1
##$PHC0= -15954.72
##$PHC1= 19.20078
##$PH_mod= 1
##$PKNL= yes
##$PPARMOD= 0
##$PSCAL= 0
##$PSIGN= 0
##$REVERSE= no
##$SF= 200.130013532006
##$SI= 16384
##$SIGF1= 3
##$SIGF2= 2
##$SINO= 400
##$SIOLD= 16384
##$SREGLST= <1H.CDCl3>
##$SSB= 0
##$STSI= 0
##$STSR= 0
##$SW_p= 3612.71676300578
##$SYMM= 0
##$S_DEV= 0
##$TDeff= 0
##$TDoff= 0
##$TI= <>
##$TILT= no
##$TM1= 0
##$TM2= 0
##$TOPLEV= 0
##$USERP1= <user>
##$USERP2= <user>
##$USERP3= <user>
##$USERP4= <user>
##$USERP5= <user>
##$WDW= 1
##$XDIM= 8192
##$YMAX_p= 0
##$YMIN_p= 0
$$ End of Bruker specific parameters
$$ ---------------------------------
##NTUPLES= NMR FID
##VAR_NAME=  TIME,          FID/REAL,        FID/IMAG
##SYMBOL=    X,             R,               I
##VAR_TYPE=  INDEPENDENT,   DEPENDENT,       DEPENDENT
##VAR_FORM=  AFFN,          ASDF,            ASDF
##VAR_DIM=   8192,          8192,            8192
##UNITS=     SECONDS,       ARBITRARY UNITS, ARBITRARY UNITS
##FACTOR=    0.0002768,     1,               1
##FIRST=     0,             0,               0
##LAST=      2.2672688,     0,               0
##MIN=       0,             -32347,          0
##MAX=       2.2672688,     32943,           0
$$ Real data points
##PAGE= N=1
##DATA TABLE= (X++(R..R)), XYDATA
$$ plain form
0 0 0 0 0 0 0 0 0 0 0 0 0 0 0 0 0 0 0 0 0 0 0 0 0 0 0 0 0 0 0 0 0 0 0 -4 7 -8 8 -8 8 -8 8 -8 8 -10 15 -16 16 -16 17
49 17 -21 23 -24 27 -31 33 -38 42 -47 53 -60 70 -82 98 -121 156 -208 303 -512 1146 -6822 -32347 -4572
72 -4572 28262 10979 -19800 -13927 9419 13286 1121 -8414 -9797 698 15465 9102 -16981
85 -16981 -18516 14401 25626 -8807 -28787 1711 27371 4562 -22264 -9135 14224 10528 -5171
98 -5171 -8830 -3597 3828 10248 3319 -13668 -11133 13663 18029 -10559 -22295 5963 23543 -749
112 -749 -21256 -3454 16299 6049 -9332 -6133 1969 3683 4297 747 -8620 -6372 10181 11567
126 11567 -9653 -15729 7238 17652 -4225 -17387 1150 14775 1036 -10455 -1680 5480 840
139 840 -629 1527 -2981 -4383 5352 7565 -6079 -10059 5732 11664 -4645 -11977 3368 10892
$$ packed form
0@%%%%%%%%%%%%%%%%%%%%%%%%%%%%%%%%%mJ1j5J6j6J6j6J6j6J6j8K5l1L2l2L3
49A7l8M4m7N1n8O4p1Q0q9J00j13J30j52J80k19K77l64N11q15J658p968k5525K7775
72d572L2834j7283l0779N873K3346L867j2165r535j383J0495J4767o363k6083
85a6981j535L2917J1225l4433j9980L0498K5660k2809k6826J3129K3359l696j5699
98e171l659N233P425O420o929j6987K535K4796M366k8588j1736K8258J7580k4292
112g49k0507J7802J9753j0250j5381L199Q102J714O14l550r367K248J6553J386
126A1567k1220o076K2967J0414k1877j3162J8537J3625j3739j1491Q775P160m640
139H40j469K156m508j402R735K213j3644l980J5791N932j6309p332J5345P524
$$ plain form
153 10892 -2560 -8849 2299 6031 -2957 -3350 3938 870 -5289 875 6422 -1988 -7264 2593 7635
168 7635 -2899 -7356 3378 6710 -4008 -5553 5120 4488 -6223 -3429 7295 2692 -7864 -2147
182 -2147 7811 1645 -7210 -1110 5925 83 -4529 1291 2998 -3343 -1944 5563 1404 -7842 -1534
197 -1534 9619 2190 -10427 -2981 10198 3762 -8685 -3875 6418 3329 -3615 -1657 1054 -920
211 -920 870 4169 -1719 -7571 1299 10426 -9 -12332 -2028 12559 3918 -11297 -5379 8487
225 8487 5623 -4877 -4508 1183 2025 1937 1683 -3642 -5714 3943 9713 -2614 -12540 330 13906
240 13906 2442 -13306 -4829 10908 6155 -7260 -6065 2934 4223 972 -1147 -3925 -3040 5136
254 5136 7277 -4772 -11039 2817 13374 13 -13936 -2943 12604 5294 -9484 -6216 5414
$$ packed form
153A0892j3452o289J1148L732q988l93P288l068o159O164N547q410n276R857N042
168G635j0534m457J0734L332j0718j545J0673o32j0711K794J0724m603j0556N717
182b147R958o166q855O100P035n842m612N820J707o341J399P507m159r246O308
197a534J1153p429j2617P446J3179o436j2447M810J0293l089o944J958K711j974
211i20J790L299n888n852Q870R127j0435j2323J0304J4587q641j5215N918J3866
225H487k864j0500L69N691Q42q8k54n325k072R657N770j2327r926J2870J3576
240A3906j1464j5748Q477J5737m753j3415J195Q999J289l251k119k778Q85Q176
254E136K141j2049o267J3856J0557j3361j3949J0993J5547p310j4778L268J1630
$$ plain form
267 5414 5656 -1003 -3334 -2714 -204 5140 4427 -5815 -8562 4798 11705 -2521 -13416 -479 13131
282 13131 3128 -11207 -5003 7732 5278 -3712 -4109 -284 1509 3392 2063 -5056 -5769 5211
296 5211 9113 -3905 -11257 1780 12051 703 -11132 -2643 8912 3667 -5731 -3417 2235 1909
310 1909 890 523 -3223 -3520 4197 6331 -4091 -8646 2848 9860 -1164 -9886 -500 8738 1679
325 1679 -6608 -1934 4062 1310 -1345 301 -839 -2311 2349 4467 -2909 -6312 2669 7474 -1937
340 -1937 -7896 980 7366 -334 -6283 39 4638 -444 -2949 1301 1281 -2526 8 3809 -854 -4796
356 -4796 1319 5510 -1361 -5635 1408 5437 -1395 -4803 1646 4061 -2085 -3201 2743 2396 -3454
371 -3454 -1734 3968 1073 -4330 -588 4247 -42 -4031 617 3493 -1444 -3005 2336 2599 -3274
$$ packed form
267E414K42o659k331O20K510N344p13j0242k747J3360O907j4226j0895J2937J3610
282A3131j0003j4335O204J2735k454q990l97L825J793J883j329p119p13J0980
296E211L902j3018p352J3037J0271j1348j1835Q489J1555n245r398K314N652l26
310A909j019l67l746k97P717K134j0422m555J1494P012j1024q722R386R238p059
325A679q287M674N996k752k655J646j140j472M660K118p376l403Q981M805r411
340a937n959Q876O386p700n949O322M599n082k505M250k0l807K534L801m663l942
356d796O115M191o871m274P043M029o832l408O449K415o146j116N944l47n850
371c454J720N702k895n403L742M835m289l989M648K876m937j561N341K63n873
$$ plain form
386 -3274 -2359 4163 2390 -4772 -2419 5097 2502 -4847 -2241 4299 1765 -3360 -794 2382 -528
401 -528 -1548 2063 1032 -3693 -1068 4990 1416 -6015 -2191 6298 2803 -6021 -3251 5034 3113
416 3113 -3652 -2360 2110 1000 -677 951 -194 -2995 499 4989 0 -6449 -996 7230 2226
431 2226 -7142 -3328 6168 3844 -4587 -3662 2606 2537 -753 -711 -753 -1693 1438 4064 -1300 -6090 412
448 412 7428 1000 -7804 -2437 7252 3565 -5766 -3893 3828 3370 -1670 -1921 -219 -249 1472 2715
464 2715 -1913 -5041 1447 6795 -355 -7795 -1156 7695 2495 -6729 -3430 4971 3512 -2897 -2724
479 -2724 782 1078 933 1185 -1876 -3484 2054 5580 -1354 -6933 199 7468 1194 -7006 -2329 5743
495 5743 2865 -3983 -2674 1995 1593 -269 82 -1074 -2192 1633 4104 -1577 -5661 904 6507 63
$$ packed form
386c274R15O522j773p162K353P516k595p349K606O540k534n125K566L176k910
401e28j020L611j031m725K625O058l574p431L824Q489l495q824K770Q285j921
416C113o765J292M470j110j677J628j145k801L494M490m989o449N453Q226n004
431B226r368L814R496k324q431R25O268o9l290M2m2r40L131K626n364m790O502
448D12P016o428q804N367R689l687r331J873P721m58n040k51J702l0J721J243
464B715m628l128O488N348p150p440O639Q851n200r224L299Q401j459o409J73
479b724L506K96j45K52l061j608N538L526o934n579P132P269o274q200M677Q072
495E743k878o848J309M669m02j862L51j156j118L825K471n681m084O565N603o444
$$ plain form
511 63 -6550 -1003 5901 1702 -4594 -1752 3115 1310 -1486 -139 211 -1312 717 2934 -1092 -4319
527 -4319 957 5230 -558 -5655 -69 5346 502 -4658 -745 3547 518 -2392 82 1255 -1061
542 -1061 -399 2186 -127 -3202 420 4027 -398 -4354 337 4374 -214 -3981 265 3387 -500
557 -500 -2663 916 1965 -1535 -1401 2153 918 -2788 -595 3160 258 -3392 44 3324 -416 -3088
573 -3088 871 2780 -1357 -2401 1900 2152 -2331 -1906 2719 1757 -2889 -1523 2921 1213 -2751 -723
589 -723 2453 25 -2140 771 1812 -1693 -1696 2452 1662 -3089 -1841 3400 2024 -3409 -2134 3163
605 3163 2056 -2641 -1605 2077 887 -1436 226 1073 -1386 -855 2564 1001 -3459 -1349 4004 1804
621 1804 -4111 -2275 3715 2428 -3103 -2326 2181 1655 -1360 -627 622 -758 -258 2179 277 -3419
$$ packed form
511F3o613N547O904m199o296K842M867j805k796J347L50j523K029K217m026l227
527d319N276M273n788n097N586N415m844n160L913M292l029k910K474J173k316
542a061O62K585k313l075L622L607m425l956M691M037m588l767M246L122l887
557e00k163L579J049l500J34L554j235l706K193L755k902l650L436L280l740k672
573c088L959J909m137j044M301K52m483M25M625r62m646J366M444j708l964K028
589g23L176k428k165K911J041l505lM148p90m751J248N241j376n433J275N297
605C163j107m697J036L682j190k323J662Q47k459N31L419j563m460K110N353k200
621A804n915J836N990j287n531P77M507n26l015P33J249j380N00K437j902l696
$$ plain form
637 -3419 -598 4318 1225 -4616 -1861 4451 2428 -3719 -2566 2750 2311 -1608 -1451 626 170 39
653 39 1323 -318 -2829 66 3976 438 -4677 -1225 4717 1887 -4271 -2357 3340 2372 -2203 -1855
669 -1855 1071 871 -153 523 -339 -1965 448 3348 -83 -4277 -502 4710 1190 -4578 -1762 3897
685 3897 2027 -2917 -1891 1735 1200 -726 -164 -78 -1179 418 2484 -393 -3609 27 4283 539
701 539 -4433 -1062 4100 1456 -3325 -1489 2367 1168 -1329 -424 508 -582 40 1683 -256 -2725
717 -2725 117 3456 153 -3867 -561 3777 801 -3395 -909 2678 706 -1886 -249 1152 -427
732 -427 -543 1262 228 -2041 -75 2747 142 -3155 -235 3307 327 -3137 -327 2708 122 -2213
748 -2213 160 1596 -668 -1156 1144 753 -1737 -554 2140 402 -2479 -319 2605 200 -2540 26
$$ packed form
637c419K821M916l093n841K755O312k023o147J153N316m39l919J57K077m56j31
653C9J284j641k511K895L910l538n115L452N942k830o158J914N697r68m575L48
669a855K926k00j024O76q62j626K413K900l431m194L775N212l520n768K816N659
685C897j870m944J026L626n35j926N62Q6j101J597K066k877l216L636M256l744
701E39m972L371N162k644m781J836L856j199k497R05R32j090O22J643j939k469
717b725K842L339l303m020L306M338k976m196K486L587j972k592J637J401j579
732d27j16J805j034k269J966K822k605l297K920L542k980l464K810L035k586k335
748b213K373J436k264m88K300l91k490J183K694j738k881K160K924k405k740K566
$$ plain form
764 26 2359 -280 -2045 670 1778 -1021 -1461 1405 1247 -1685 -1042 1884 860 -1996 -660 1973
780 1973 331 -1938 36 1790 -550 -1726 1005 1587 -1493 -1547 1800 1492 -2000 -1440 2027 1333 -1897
797 -1897 -1081 1731 730 -1484 -165 1325 -446 -1198 1131 1219 -1722 -1319 2152 1458 -2381 -1594 2310
814 2310 1601 -2092 -1494 1676 1124 -1291 -607 947 -119 -755 922 759 -1650 -899 2265 1193 -2570
831 -2570 -1444 2635 1665 -2370 -1687 1908 1461 -1368 -1015 852 293 -539 529 373 -1432 -501 2159
848 2159 753 -2694 -1135 2873 1456 -2735 -1652 2317 1613 -1712 -1273 1105 704 -560 121 260
864 260 -986 -199 1823 392 -2473 -738 2818 1090 -2872 -1406 2549 1469 -2055 -1347 1384 899
880 899 -820 -257 345 -553 -142 1360 179 -2045 -390 2555 743 -2726 -1013 2661 1233 -2272
$$ packed form
764B6K333k639j765K715J108k799m40K866j58k932O43K926j024k856J336K633
780A973j642k269J974J754k340j176K731N82l080n4L347l08l492N60L467o94l230
797a897Q16K812j001k214J319J490j771p52K329Q8k941M03L471o94l839P87L904
814B310p09l693N98L170n52k415O84J554j066o36J677j63k409P51L164j072l763
831b570J126M079r70m035O83L595m47k829L53J867n59q32J068j56j805R31K660
848B159j406l447J559M008j417m191J083L969p04l325M39K378m01j264O81J39
864B60j246P87K022j431k865J735L556j728l962J466L955j080l524P08K731m85
880H99j719N63O02q98M11J502j181k224J655K945j812l469J713L674j428l505
$$ plain form
896 -2272 -1177 1761 941 -1155 -441 647 -222 -311 943 148 -1644 -227 2159 396 -2525 -688 2552
913 2552 827 -2392 -899 1979 736 -1502 -390 1028 -106 -611 705 387 -1247 -267 1769 360
929 360 -2063 -446 2230 573 -2172 -584 1958 463 -1647 -238 1271 -169 -952 569 659 -1023
945 -1023 -510 1391 437 -1676 -422 1832 406 -1842 -326 1779 204 -1595 47 1398 -337 -1177
961 -1177 682 960 -1003 -797 1255 653 -1446 -554 1510 398 -1546 -251 1484 3 -1417 264
977 264 1313 -571 -1229 876 1148 -1106 -1038 1275 944 -1309 -767 1319 592 -1228 -301 1165 6
994 6 -1095 353 1070 -718 -1098 1019 1116 -1280 -1169 1363 1114 -1390 -1042 1245 820 -1117 -535 947
1012 947 141 -828 323 800 -739 -830 1160 981 -1411 -1074 1568 1184 -1545 -1163 1394 1022 -1178 -745
$$ packed form
896b272J095K938q20k096P14J088q69q9J254p95j792J417K386j763k921J837L240
913B552j725l219J493K878j243k238J112J418j134n05J316l18j634R80K036j409
929C60k423J617K676j657k745J588K542j495k110J409J509j440p83J521R0j682
945a023N13J901r54k113J254K254j426k248J516K105j575j799J642J351j735q40
961a177J859K78j963K06K052o02k099Q92K064j112j944J295J735j481j420J681
977B64J049j884o58K105K72k254O8K313l31k253N42K086p27j820R27J466j159
994Fj101J448P17j788l80K117R7k396J11K532k49k504L48K287m25j937N82J482
1012I47q06r69J151M77j539r1J990j79k392L37K642l84k729L82K557l72k200M33
$$ plain form
1030 -745 884 314 -712 135 576 -686 -621 1103 726 -1481 -919 1656 1071 -1665 -1156 1528 1132 -1259
1048 -1259 -903 962 577 -665 -87 479 -437 -398 958 470 -1375 -653 1636 853 -1756 -1045 1662 1072
1066 1072 -1467 -1015 1112 721 -805 -324 515 -208 -366 729 342 -1199 -438 1562 622 -1717 -813
1083 -813 1733 932 -1568 -911 1306 745 -992 -443 662 -19 -465 502 322 -978 -344 1319 441 -1578
1101 -1578 -597 1635 730 -1576 -754 1385 685 -1126 -456 851 130 -594 298 430 -716 -351 1090
1118 1090 365 -1353 -441 1479 512 -1508 -583 1377 490 -1231 -379 965 68 -798 215 582 -604
1135 -604 -486 908 408 -1156 -402 1312 419 -1331 -382 1305 339 -1176 -191 1044 -9 -894 258
1152 258 741 -530 -655 764 537 -982 -489 1066 390 -1147 -334 1097 197 -1061 -79 967 -111
$$ packed form
1030g45J629n70j026Q47M41j262O5J724l77k207N62K575n85k736N09K684l96k391
1048a259L56J865l85j242N78N66r16L9J356m88j845P22K289p83k609P11K707n90
1066A072k539M52K127l91j526M81Q39p23j58J095l87j541P61K000r40k339R04
1083h13K546q01k500O57K217n61j737N49J105o81m46R67j80j300O34J663q78k019
1101a578R81K232r05k306Q22K139p00j811O70J307p21p24Q92J32j146L65J441
1118A090p25j718R12J920r67k020R25J960q87j721Q52J344q97q66J013L67j186
1135f04J18J394n00j564P54J714q93j750R49J687r66j515R85J235j053q85J152
1152B58M83j271j25J419k27j519M93J555o76j537Q13J431r00j258R82J046j078
$$ plain form
1169 -111 -900 332 829 -531 -763 732 705 -864 -606 949 516 -955 -352 946 171 -915 12 863
1187 863 -245 -848 440 817 -643 -834 779 791 -888 -745 888 609 -876 -453 825 229 -766 33
1205 33 726 -283 -714 535 739 -730 -789 858 824 -920 -831 895 737 -841 -604 732 345 -664
1223 -664 -85 561 -238 -561 512 587 -758 -667 920 754 -986 -809 981 796 -880 -685 768 496
1241 496 -620 -181 522 -143 -460 468 472 -769 -561 937 618 -1072 -742 1034 752 -970 -718 812
1259 812 564 -669 -324 528 17 -414 346 406 -633 -415 908 510 -1021 -588 1090 679 -1012 -685
1277 -685 885 591 -729 -423 550 136 -435 178 343 -510 -369 770 396 -973 -474 1053 542 -1029
1295 -1029 -573 938 532 -786 -398 647 191 -498 95 418 -367 -362 659 369 -855 -409 974 431
$$ packed form
1169a11p89J232M97j360k32J495k7j569K58J555m33j471O03J298p75j086R27Q51
1187H63j108o03J288L77j460j91J613J2j679J43J633k79j485M23J278n96r95P99
1205C3O93j009m31J249K04j469n9J647l4j744Q9J726j58j578K37J336l87j009
1223f64N79O46p99l23J073P5j345R1J587j66j740J77J790j85j676J95J453k72
1241D96j116M39P03o65l17R28Mj241K08J498l19j690L30J776k82j722K52J530
1259H12k48j233L45Q52n11m31P60O0j039K18J323l98j531M33J678m11j691L27
1277f85J570k94j320L06R73m14n71O13J65q53J41J139l74j369M99J527n11j571
1295a029M56J511m06j318L88J045m56o89N93L23p85NJ021k90j224M46J383n43
$$ plain form
1313 431 -1017 -466 948 430 -856 -348 698 175 -581 22 466 -272 -412 501 372 -707 -367 852
1331 852 384 -908 -362 902 345 -823 -261 737 141 -629 23 525 -241 -486 410 418 -592 -412 711
1350 711 364 -802 -348 802 260 -784 -171 720 60 -638 108 591 -243 -513 412 506 -523 -453 629
1369 629 407 -700 -348 695 221 -705 -134 644 -28 -631 140 574 -307 -563 412 537 -507 -520 580
1388 580 484 -588 -391 609 291 -576 -133 580 -24 -527 204 550 -331 -540 453 548 -528 -556 554 512
1408 512 -576 -461 536 328 -525 -182 467 -21 -484 192 483 -376 -503 509 529 -576 -543 613 556 -580
1428 -580 -489 557 408 -468 -233 435 53 -399 155 409 -357 -442 498 460 -614 -526 630 520 -625 -518
1448 -518 549 431 -475 -300 386 128 -347 92 349 -295 -358 476 410 -592 -446 652 488 -653 -498
$$ packed form
1313D31j448N51J414n18j286N08J046n23p56O03M44p38j40R13j29j079L40J219
1331H52m68j292N46J264n57j168N62R98n96p70O52N02p66k45Q96Qj010J80J123
1350G11l47j166M54J150n42j044O13Q91o60o98P46M83q34k70R25R4j029P0J082
1369F29k22j107L52J043m74r26N71P78o72o03P71M34q81k56R75J25j044j3J100
1388E80r6j072J97J000l18q67M43P13o04n03P31L46q81k09R93R5j076k8J110m2
1408E12j088J15R97k08q53L43O49m88m63O76K91q59j27J012K0j105L3J156n7j136
1428e80R1J046j49q76K35O68l82m52N54K54p66q5R40l8j074Q8J156j10j145J07
1448e18J067j18r06J75O86k58m75M39K57o44o3Q34o6j002J46J098j64j141J55
$$ plain form
1467 -498 601 431 -516 -344 418 173 -358 13 307 -228 -307 416 344 -564 -376 649 436 -674 -425 642
1487 642 415 -542 -329 469 208 -367 -45 318 -141 -304 318 305 -495 -346 580 360 -650 -389 611 353
1507 353 -577 -320 489 194 -410 -77 340 -86 -311 248 304 -401 -298 531 333 -568 -323 611 310 -560
1527 -560 -260 518 161 -455 -72 375 -75 -343 196 300 -356 -317 432 295 -526 -300 537 253 -550 -210
1547 -210 514 138 -455 -28 414 -77 -355 193 349 -286 -324 372 302 -434 -281 468 247 -483 -183 454 101
1568 101 -446 -10 409 -101 -398 193 363 -279 -348 347 326 -380 -290 412 252 -414 -183 415 91 -396 18
1589 18 407 -124 -399 217 377 -300 -366 344 343 -373 -325 372 272 -365 -192 351 80 -344 20 351 -119 -356
1611 -356 235 370 -302 -370 347 373 -353 -334 338 292 -324 -220 306 110 -301 3 288 -126 -326 225 328
$$ packed form
1467d98J099j70r47J72P62k45n31L71K94n35p9P23p2r08J88J025k13j110K49J067
1487F42k27r57K13P98k61n75L22L63m59j63O22j3q00J49R26k20j010K61J000k58
1507C53r30K57Q09k95o04L33M17m26k25N59N6p05J03Q29j98r01K45R34l01q70
1527e60L00P78l57o16L83M47m50k68N39J04o56L9P49j37q21K26Q37k84q03L40
1547b10P24l76n93M27M42m91k78N48J56o35l8O96p0p36J53P49k21p30L00O37l53
1568A01n47M36M19n10k97N91J70o42o9O95k1p06R0P02j60o66K31N98l24m87M14
1589A8L89n31k75O16J60o77o6P10jp16M8O97j00o37J73N43k71m24L64L31m70k37
1611c56N91J35o72o8P17K6p26J9O72m6o16J04N26j96m11L04K85m14k00N51J03
$$ plain form
1632 328 -339 -375 365 364 -389 -356 371 307 -333 -233 302 143 -246 -10 279 -80 -259 233 301 -314 -326 373
1654 373 345 -409 -348 376 302 -360 -272 290 153 -265 -63 231 -72 -238 183 244 -284 -278 356 313 -376 -317 392
1677 392 311 -348 -245 310 181 -261 -85 227 -24 -203 148 218 -241 -249 311 273 -370 -284 381 278 -378 -258
1699 -258 331 181 -296 -97 243 -2 -213 117 214 -217 -223 285 241 -337 -259 359 256 -365 -224 334 162 -304
1721 -304 -99 261 -5 -230 78 209 -176 -214 235 220 -289 -229 329 216 -323 -181 339 156 -291 -82 280
1742 280 18 -242 72 232 -140 -223 198 210 -267 -208 278 183 -311 -184 290 99 -298 -85 260 -1 -263
1763 -263 71 243 -137 -228 208 235 -225 -200 265 200 -258 -154 272 113 -261 -58 255 -13 -260 71 241
1784 241 -141 -250 166 219 -232 -239 211 180 -237 -165 218 109 -228 -53 228 -13 -235 81 244 -132 -256 191
$$ packed form
1632C28o67l6P40jp53L3P27o4o40J00N35j59l89K36K89l59j79M92O8o15j2O99
1654C73k8p54O1P24p4o62Q8N62j37m18K02K94l03j66M21O1n28OO34m3o89N9P09
1677C92q1o59J03N55j29m42J76L12k51j79L51P0m59qN60l8o43Q6O65j03o56J20
1699b58N89j50m77J99L40k45k11L30R7m31oN08m4n78P8O18j03o21J41N58j72m66
1721c04K05L60k66k25L08J31l85l8M49j5n09O0N58j13n39J42N20j83m47K09L62
1742B80k62k60L14J60l72q3M21J2m77N9M86r5m94J27M74j91l97K13L45k61k62
1763b63L34J72l80r1M36K7m60K5M65o5m58J04M26j59l74K03L13k68k47L31J70
1784B41l82j09M16N3m51pM50l1m17P2L83j09l37J75K81k41k22L16J63l76j24M47
$$ plain form
1806 191 246 -211 -218 229 217 -218 -158 220 99 -210 -50 199 -26 -209 79 217 -152 -234 175 239 -221 -244 223
1829 223 205 -218 -172 196 113 -181 -55 183 -10 -177 74 187 -136 -219 171 221 -220 -230 212 208 -224 -189 186
1852 186 133 -191 -83 152 -5 -154 65 162 -140 -186 180 210 -204 -203 219 210 -213 -176 198 139 -177 -104 165 5
1876 5 -165 44 136 -132 -169 164 160 -208 -204 214 194 -214 -174 207 148 -174 -93 161 35 -150 40 143 -90 -148
1900 -148 147 159 -170 -173 200 161 -215 -168 184 142 -189 -109 150 38 -168 8 134 -92 -149 127 130 -167 -150 187
1924 187 151 -193 -143 191 126 -178 -84 166 48 -154 21 166 -63 -138 110 154 -143 -139 169 131 -181 -135 171
1947 171 92 -191 -101 167 31 -163 6 154 -52 -151 85 155 -121 -140 154 142 -150 -116 167 110 -159 -72 155
1970 155 22 -152 3 151 -59 -155 86 146 -119 -148 144 144 -145 -114 152 99 -139 -58 147 26 -142 17 149
$$ packed form
1806A91N5m57pM47j2m35O0L78j21l09J60K49k25j83K88J38l69q2M09O4m60k3M67
1829B23j8m23M6L68q3k94J26K38j93j67K51J13l23q3L90N0m41j0M42mm32L5L75
1852A86n3l24J08K35j57j49K19R7l02m6L66L0m14JM22rm23L7L74n9l16P3K69j60
1876Ej70K09R2k68l7L33ml68MM18k0m08M0L81n9l22Q1K54j26j85J90J03k33n8
1900a48K95J2l29lL73l9l76M7L52m2l31Q0K59j12k06J76J26k26n7K76Lk97J7L37
1924A87l6l44N0L34o5l04R4K50j18k02J75J45k29p5K48M4k97ML08l8l12M6L06
1947A71p9k83R0K68j36j94J69J48k06r9K36P0k76j9K94j2k92L4K83n7k69Q7K27
1970A55j33j74J55J48k10r6K41O0k65k9K92%k89L1K66n3k38Q1K05j21j68J59J32
$$ plain form
1993 149 -47 -151 93 147 -115 -152 113 133 -141 -127 127 94 -146 -68 114 16 -127 17 128 -63 -140 82 142
2016 142 -102 -149 130 153 -118 -122 130 105 -116 -53 118 31 -116 24 119 -64 -126 78 125 -115 -152 104 124 -143
2040 -143 -138 123 98 -130 -79 105 18 -121 13 110 -53 -110 98 126 -97 -115 127 140 -113 -120 120 102 -110 -77 105
2065 105 32 -102 4 93 -51 -109 69 102 -116 -118 110 112 -119 -125 106 108 -102 -85 96 53 -104 -3 106 -34 -87
2090 -87 69 101 -100 -105 113 106 -127 -109 118 95 -114 -74 105 40 -102 -16 103 -15 -85 64 86 -76 -100 102 94
2115 94 -116 -92 113 85 -109 -73 97 40 -104 -20 91 -24 -104 41 84 -82 -91 93 94 -105 -91 95 71 -107 -71
2140 -71 98 34 -80 -7 92 8 -73 56 95 -48 -75 97 100 -90 -74 110 75 -97 -53 103 25 -97 -26 74 -17
2165 -17 -104 28 89 -64 -94 64 86 -74 -74 100 71 -87 -48 99 38 -81 1 86 -5 -78 47 89 -54 -91 67
$$ packed form
1993A49j96j04K44N4k62l7K65K0k74J4K54l3k40P8J82r8j43J44J11j91p7K22O0
2016A42k44m7K79K3k71mK52k5k21O3J71q7j47J40R5j83o2K04M7k40l7K56K0k67
2040a43NK61k5k28N1J84q7j39J34R7j63n7K08K8k23j8K42J3k53pK40j8k12L3J82
2065A05p3j34J06Q9j44n8J78L3k18kK28Kk31oK31Kk10J7J81m3j57J01J09j40n3
2090h7J56L2k01nK18pk33J8K27k3k09M0J79o5j42Q6J19j18p0J49K2j62k4K02q
2115I4k10K4K05k8j94L6J70n7j44Q4J11j15q0J45M3j66rJ84Jj99J4J86k4j78L6
2140g1J69o4j14P3R9q4q1J29L9j43k7J72Lj90J6J84l5j72M4J56p8j22P1J00r1
2165a7q7J32O1j53l0J58K2j60%J74k9j58L9J47o1j19Q2Q5r1p3J25M2j43l7J58
$$ plain form
2190 67 87 -76 -79 86 62 -95 -61 77 30 -87 0 87 -16 -79 35 69 -53 -85 67 79 -70 -78 76 64 -70
2215 -70 -52 70 28 -76 -5 74 -22 -64 43 77 -48 -80 74 80 -56 -73 69 61 -67 -47 79 37 -66 -12 61 -11
2241 -11 -64 40 66 -47 -71 73 69 -72 -71 63 65 -64 -62 70 33 -63 -9 53 -14 -65 27 63 -54 -71 70 72 -63 -55
2269 -55 78 61 -51 -36 79 44 -53 -11 56 -5 -61 24 51 -56 -70 61 55 -86 -70 66 38 -78 -48 60 22 -58
2295 -58 -16 44 0 -55 32 61 -32 -54 58 64 -45 -48 79 48 -66 -39 67 36 -52 -20 52 -2 -40 28 46 -33 -51 42 53
2324 53 -51 -50 60 43 -76 -44 57 25 -55 -20 47 2 -45 30 47 -32 -42 43 42 -47 -43 60 52 -56 -46 49 31 -49 -12
2353 -12 52 6 -50 20 53 -38 -48 30 49 -48 -49 48 40 -59 -36 50 22 -52 -6 54 -12 -55 20 48 -41 -44 34 28 -42 -47 39 41 -51
2386 -51 -31 50 23 -41 1 41 -9 -42 24 42 -13 -45 47 52 -41 -29 50 53 -42 -33 42 26 -36 -10 29 -8 -48 9 37 -43 -56 32
$$ packed form
2190F7K0j63lJ65k4j57L4J38m7j17Q7Q7j03o3J14L4j22l2J52J2j49qJ54j2j34
2215g0J8J22m2j04P1P9r6m2J07L4j25l2J54Oj36j7J42qj28K0J26m2j03N4P3p2
2241a1n3J04K6j13k4J44mj41JJ34Kj29KJ32l7r6N4O2o7n1R2L6j17j7J41Kj35Q
2269e5J33j7j12J5J15l5r7M2O7o1n6Q5K7j07j4J31oj41J6J36k8j16L0J08l8q0
2295e8M2O0m4n5Q7K9r3k2J12Oj09lJ27l1j14K7J06l1q8L2P2n4l8O8J8p9j8R3J1
2324E3j04JJ10j7j19L2J01l2q0L5O7m5m7P5J7p9j0Q5jq9MJ03qj08J0R5j8q0L7
2353a2O4m6n6P0L3r1j0P8J9r7jR7qr9K3Q6k8p4M6O0o6m3P5K8q9lP8op0nQ6Kr2
2386e1K0Q1k7o4M2M0n0l3O6J8n5l2R2Nr3J2P9Lr5RP5j6o2K6L9l7m0N7K8q0j3Q8
$$ plain form
2418 32 39 -54 -44 38 32 -31 -26 29 26 -36 -8 43 -6 -31 16 37 -21 -29 51 43 -36 -22 40 42 -39 -29 26 22 -28 -19 30 -5 -39 -3 26
2453 26 -28 -50 21 21 -47 -40 30 28 -42 -25 35 16 -39 -13 47 9 -22 13 29 -16 -32 27 33 -36 -36 34 28 -35 -31 42 11 -22 -11 30
2487 30 4 -27 9 33 -26 -31 21 27 -34 -31 21 30 -47 -23 26 10 -41 -18 32 -11 -30 4 15 -25 -22 24 39 -30 -28 35 37 -31 -22 47
2521 47 31 -37 -9 37 4 -22 6 26 -14 -23 21 35 -29 -29 27 16 -31 -26 32 5 -40 -31 15 -2 -42 -2 27 -14 -33 17 18 -21 -27
2554 -27 37 17 -18 -9 38 33 -20 -5 32 8 -20 17 23 -11 -21 14 23 -40 -30 18 13 -36 -32 19 14 -26 -12 24 1 -33 8 19 -17 -20
2588 -20 17 23 -25 -19 31 28 -22 -11 27 25 -27 -2 21 -8 -17 4 18 -4 -31 20 25 -25 -21 31 14 -21 -16 31 3 -19 -3 12 -11 -32
2622 -32 9 11 -21 -34 16 12 -26 -25 30 27 -27 -15 19 14 -20 -3 21 2 -16 11 12 -6 -15 17 31 -19 -23 18 26 -26 -15 20 5 -20 -12
2657 -12 15 -3 -19 1 9 -27 -26 7 20 -28 -23 10 7 -37 -30 19 13 -26 -10 27 13 -6 12 31 -5 0 15 27 -2 -5 23 16 -9 -10 27
$$ packed form
2418C2Pr3J0Q2oo3NN5lo2K8N1m9k5M7K1n8qQ0qp9J4O2Kq1J0N5mn0RM9l5l4L6K9
2453B6n4k2P1%o8PP0kp0J7O0j9n5K6O0l8l1L5J6m5j6N9Oo9%P0oo3MP3l1l3J1M1
2487C0k6l1L6K4n9nN2Oo1LN2Rp7K4M9j6n1K3N0m3j9L4J1m0LM6J5o9KO3Ko8RO9
2521D7j6o8K8M6l3k6K8K0m0rM4J4o4%N6j1m7NN8k7m5RM6j7m0M0K9m1j9N0Jl9o
2554b7O4k0l5RM7nn3J5L7k4k8L7Ol4j0L5Ro3J0M8nm9MN1nm0J4L6k3l4M1J1l6l
2588b0L7Om8ON0ln0J1L8kn2K5K3k9rK1J4k2k7N1Nn0MN2j7l5NM7k8k2J6J5k3k1
2622c2M1Kl2j3N0ml8JN5ln4J2L4nl4J7K4j9j8K7Jj8rL2J4n0mM1Qn2J1L5j5k5Q
2657a2K7j8j6K0Ql6JL3J3m8NL3lm4PM9ol9J6L7j4j9J8J9l6NJ5J2k9lK8pk5jL7
$$ plain form
2692 27 15 -24 -10 11 1 -23 2 6 -18 -14 -4 12 -24 -21 13 3 -17 -10 19 10 -27 -12 16 -5 -20 5 19 -14 -10 24 16 -12 -6 18
2726 18 13 -21 -9 23 0 -15 -4 16 2 -8 4 17 -9 -20 7 3 -29 -2 15 14 -27 -22 6 8 -19 -12 19 -4 -10 -2 17 -4 -17 9
2760 9 15 -16 -9 8 6 -6 -16 18 7 -5 5 21 2 -4 12 19 2 -6 28 18 -14 -5 17 3 -14 -9 14 -7 -21 -18 10 -10 -13 -11 13 -22
2796 -22 -16 8 13 -4 0 17 16 -5 2 22 9 1 2 30 17 -3 17 12 -4 -10 8 16 -7 -16 16 -1 -26 -6 17 -2 -18 -13 11 1 -13 -11 10
2833 10 -15 -7 4 2 -15 -12 15 2 -15 -14 10 2 -13 -5 8 16 -14 2 12 3 2 13 1 -1 -2 16 3 -17 -7 16 5 -19 -6 14 -2 -9
2869 -9 9 8 -8 -9 4 7 -9 -7 7 8 -8 -10 13 3 -17 -9 2 1 -1 -1 9 1 1 13 13 2 2 14 20 -5 7 17 18 -2 8 14 6 2 14 7 -5
2910 -5 -9 -7 1 -12 -17 -5 0 -18 0 5 -1 -9 2 7 3 -12 4 6 -2 8 8 14 -9 -2 19 8 -3 1 12 2 -7 -1 7 4 -2 -2 2 -5 -19 2 -2 -17 -6
2953 -6 6 -10 -14 -13 1 -13 -13 -10 1 0 -5 3 5 -3 -1 22 3 3 -1 20 12 -5 10 5 10 -5 8 7 6 5 2 -3 -10 -4 3 1 -19 -3 12 7 -1 -3 18 5
$$ packed form
2692B7j2l9J4K1j0k4K5Mk4MJ0J6l6LL4j0k0PK9rl7J5K8k1j5K5J4l3ML4qk8OK4
2726A8nl4J2L2k3j5J1K0j4j0J2J3k6j1K7ml2K7J7jm1NK8Kk7PL1k3oQJ9k1j3K6
2760IOl1PJ7kj2j0L4j1j2J0J6j9oJ6Pj7qL4j0l2RK2j4j7NK3k1j4LK8k0lKK4l5
2796b2OK4Nj7MJ7jk1PK0j3qJK8j3k0K0nj6oJ8Qk3rL2j7k5K0K3j9j6NK4j0j4KK1
2833A0k5QJ1kj7LK7j3j7JK4qj5QJ3Ql0J6J0rjJ1j2kjJ8j3k0J0K3j1k4J3K0j6p
2869iJ8jj6jJ3Lj6KJ4Jj6kK3j0k0QJ1jk%J0q%J2%j1%J2Ok5J2J0Jk0J0OqmJ2pj2
2910emKQj3nJ2Nj8J8NoqJ1Nmj5J6KqJ0%Ok3PK1j1j1MJ1j0rOQlo%Mpj4K1mj5J1
2953fJ2j6mJJ4j4%LJ1jnQKqKK3j9%mK1qj7J5nNj5J3jjjlnpOPkk0J6J5nqkK1j3
$$ plain form
2997 5 -9 3 4 1 -11 3 -8 -6 -5 5 -4 -18 -2 9 0 0 -3 15 3 4 -2 8 2 -2 5 1 5 -5 13 -8 -8 -4 5 -4 -10 -3 -2 -6 -15 -3 -1 -18 -7
3040 -7 -3 6 -2 -8 -6 -1 -10 -4 5 0 -11 3 12 -9 -2 0 4 11 1 -1 6 -4 3 12 18 -5 0 15 -7 7 9 13 -2 -14 -6 -2 -13 -13 -3 -5 -19 -17 -3 -6 -5 -14
3086 -14 1 -12 -12 0 2 -5 3 10 13 5 -1 10 10 0 -12 3 -10 -9 -11 8 -5 -6 -9 -5 -11 -1 -1 -2 -12 -5 0 4 -5 -6 -3 -4 -9 -7 -4 -4 -9 3 -4 -6 -15 8
3132 8 2 0 -8 12 10 -3 -1 1 1 -4 1 8 4 1 -1 14 1 -2 12 -1 -6 -1 -6 -7 5 -7 1 -3 -22 -10 0 -4 -14 -6 0 -9 -6 -3 -6 -17 -5 -8 -12 -10 2 1
3178 1 2 0 16 10 -6 -7 4 7 2 -4 16 8 1 11 4 -1 2 -5 -4 -3 -19 -7 -1 -17 -17 -20 -10 -1 -16 -13 3 -12 3 9 -4 -8 -1 6 -3 2 8 11 2 -7 1 8 -12
3225 -12 4 -3 8 -3 -3 5 2 -3 4 7 5 -4 9 -1 -2 -14 -11 4 -6 -7 2 -8 -6 2 1 -8 -20 -3 4 -8 -11 4 12 -6 -12 -3 2 1 2 -6 10 -12 -8 -5
3269 -5 9 5 -5 -1 -8 -13 0 23 -2 -7 -3 -6 -5 -11 -4 3 -8 -2 -9 -9 -13 -5 -8 -17 -14 0 -7 -4 -4 -1 -9 -17 1 1 7 -5 4 8 3 3 9 17 1 12 11 13 10 -11 6
3318 6 0 -9 -15 10 0 -19 -8 -6 -6 -12 1 5 -12 -9 10 -1 -11 -11 -3 -5 -8 -6 -1 9 4 -15 4 3 -5 3 -1 5 -2 11 2 7 -1 9 4 3 -3 1 0 -5 -2 1 -6
$$ packed form
2997Ej4J2Jlj2J4j1KJJ0rj4J6J1r%lJ8j2JoJ0omPmMj0J8k1%MRroPJmrJ2Kj7J1
3040gMRqoKNrORnj1J4Rk1PKMPj0kPj0PROk3NJ5k2J4KMj5j2QMj1%J0kj4KJ4lJr
3086a4J5j3%J2KpQPLqoJ1%j0j2J5j3JkJ9j3jlMoJ0%jj0PNMrjLjnKL%nJ2pkrK3
3132HokqK0kj3KK%nNPmlkJ5j3lJ4j3nNnjJ2j2Qmj9J2J0mj0QOrLLlj1J2lmKJ2j
3178AJkJ6oj6jJ1LnoK0qpJ0pnLpJJj6J2Oj6%lJ0Rj5LJ6j5J5Oj3mPPrNOLrrQPk0
3225a2J6pJ1j1%QlnPLkrJ3j0jj2LJ5j0jRj0KQjrj2J7Pj2lJ5Qj8oRNjJqJ6k2ML
3269eJ4mj0MpnJ3K3k5nMlJoPPj1Op%mQlrLJ4pL%LqqJ8%Oj2RMn%OQj6J1jKlk1J7
3318ForoK5j0j9J1K%oJ3Mj7LJ9j1j0%QklKNJ0nj9J9jqQmOpJ3rNqJ0njoMjnLLp
$$ plain form
3365 -6 -11 -18 1 -5 -20 -10 -9 -11 -14 -2 -8 -16 -15 -10 6 -6 -6 -6 -2 -1 -9 0 5 -6 -5 -7 -5 -3 12 2 -10 0 -10 8 -5 10 2 2 -13 -4 3 -1 -7 -6 -8
3410 -8 -10 1 -9 -5 -13 -13 -6 -7 -19 -17 -5 1 -10 -11 -2 -4 -5 1 6 -4 2 5 3 -3 6 3 0 3 -5 0 13 9 13 5 -1 -10 3 8 -4 -5 -11 -6 -8 -12 -5 -7 -10 -5 -11 -4 -8 -17
3462 -17 -3 -11 -1 -7 -1 -2 2 -1 3 -6 -5 7 5 2 0 14 5 -2 -5 -5 0 -1 8 7 -2 -7 -4 0 -4 -21 -11 -13 -15 -20 -7 -5 -8 -15 -17 -10 -1 1 -6 -3 -9 -11 -5 4 -9 -2 0 -8
3514 -8 -8 -5 -11 -9 2 8 2 -9 4 7 -5 -1 4 2 -3 -9 -8 -2 -18 -8 -14 -7 -3 -6 -6 -16 -21 -7 -12 -10 -13 -2 -6 -7 -7 1 3 -9 -6 0 -2 -6 10 2 -2 1 -2 1 -4 2
3564 2 8 6 -9 4 4 -6 0 2 4 6 -7 11 -2 -14 -12 -12 -16 -15 -12 -4 5 -8 -20 -4 -2 -9 4 -4 9 2 -1 11 10 6 2 4 -9 0 14 14 0 3 1 -1 -9
3609 -9 2 1 -1 -12 2 5 -5 -7 -9 -2 -5 -13 -8 4 -1 -1 2 -2 -7 -3 4 -5 -4 6 1 -3 -3 3 10 -5 7 10 0 -2 -1 0 12 1 -3 3 6 1 -3 8 -4 -11 -5 -5
3657 -5 -4 0 1 -4 -15 -7 -8 0 -14 -14 -1 0 -7 4 -3 -2 -1 3 -4 10 -2 3 14 -1 -3 3 11 12 9 6 17 3 9 5 9 -2 -2 0 1 3 -10 -8 -3 -10 -4 -4 -6 -15 -5
3706 -5 -12 -15 -8 -2 -3 -13 5 -1 11 -5 3 6 4 2 4 7 3 -3 8 2 8 1 8 8 -1 0 7 5 0 7 6 6 7 6 -1 -3 -1 0 2 -7 4 -1 3 -3 -1 -5 -19 -13 0 -5 -7 3
$$ packed form
3365fnpJ9oj5J0JklJ2oqJNJ6j2%%MJqRNj1JkKKJ5j0j2J0j0J8j3J5q%j5RPmoJk
3410hkJ1j0Mq%Pjj2KJ2Oj1jRkjONj0OLkoRllLqNJ3mMqorJ3Nj2joNkmPklNoPmr
3462a7J4qJ0oOjMlMrJJ2klkJ4rpl%NjRjrnLMmj7J0kknJ3KlpkPRKpLokORj3PKq
3514h%LoKJ1Ooj1J3Lj2MNknoJOj6J0oPMl%j0nJ4nKlJ1mj%QKj2LOkmJ6qmLlLnO
3564BOkj5J3%j0OKKKj3J8j3j2K%mJLQRj3j2J6KpJ3qJ3plJ2jmmKj3RJ4%j4Lkkq
3609iJ1jkj1J4Lj0kkPlqNJ2n%LmnMPrJJ0nm%OPj5J2Lj0kJJJ2j1mOLnmJ1j2pO%
3657eJMJnj1QjQj4%J3JpJ1pJJMpJ4j2NJ1j5kOQJllJ1j4OmMj1%KJKj3KNpO%krJ0
3706eplPOjj0J8oJ2j6QLkkKLmoJ1oOpP%rJPknPj%JjpkKJKrJ1nMoKmj4OJ3nkJ0
$$ plain form
3758 3 -2 -10 10 -2 -4 6 -1 5 3 7 -3 22 -7 -3 4 7 16 -1 -6 -8 2 -7 -2 -5 -1 -2 -10 -7 -11 -7 -3 -6 -9 -10 -14 -8 -4 2 4 -3 -11 -13 -9 5 -4 1 4 -2 18 10 14
3809 14 6 3 5 6 3 4 1 0 7 1 11 -3 -3 -6 1 -1 -6 -12 -11 -15 -10 -1 -12 -7 -8 -1 -9 0 -5 5 -7 1 1 3 -5 -2 4 10 15 -1 6 4 -1 7 6 8 3 2 2 -2 -3 -8 -3 -2
3863 -2 -7 -12 0 -9 -4 -8 -8 -10 -14 -4 -8 -11 -6 -18 -9 -2 -5 -9 -2 1 -1 3 -13 -2 1 -1 -4 1 9 12 2 9 4 1 -3 -7 -4 -4 0 4 -1 -3 -6 -2 -4 -4 1 0 -5 -8 -1 0 -13 -10
3917 -10 -10 -10 -3 -6 -10 -6 -3 3 -2 5 2 -13 -7 5 5 6 2 5 13 -2 -1 10 1 12 11 -2 3 -1 -6 -1 0 -7 -3 -5 -3 -3 -9 -3 0 2 -2 -2 2 -7 -5 -6 6 6 -6 -9 6
3968 6 6 0 8 4 2 5 7 -2 14 7 15 6 10 0 0 3 2 6 7 0 -7 -3 5 -5 -7 -17 -4 8 -10 -10 -8 -6 -1 6 7 -1 7 11 10 4 -2 9 13 10 7 10 2 1 -5 7 6 6
4020 6 -8 -1 5 0 8 5 2 2 2 3 12 0 0 -7 -5 4 -2 -10 -9 -12 -8 -7 8 -13 0 -6 -10 -6 -13 -11 -1 -2 -7 1 0 7 11 3 7 5 13 7 8 18 10 5 0 5 9 11 6 14 -1
4073 -1 1 4 5 -13 -4 5 -1 -3 -4 -8 -1 -13 -4 -10 4 -2 -2 -4 0 -7 7 1 5 14 14 5 7 10 12 13 6 1 10 11 13 6 -1 5 0 6 2 -6 -9 -13 0 4 -10 -6 -2 -6 -2 -2 -9 -6 -5
4128 -5 4 5 5 3 -3 -3 9 3 8 4 8 10 -4 5 16 11 2 5 15 6 12 8 8 11 6 2 6 -3 5 -6 -4 7 -6 -8 -9 -17 -12 -7 -11 0 -5 -10 -4 3 3 7 1 6 0 12 12 0
$$ packed form
3758CnqK0j2kJ0pOkMj0K5k9MPLRj7nkJ0rNlMjqLmMMlljmOMOKpqkMJ4rNLoK0qM
3809A4qlKJlJljPoJ0j4%lPknoJmNRj1NjPqRnJ0j2Q%KqLOONj6PknQjKnj%mjnNJ
3863bnnJ2rNm%kmJ0mlNj2RPlmPLkMj6J1LklNQLj0PnlmmL%MMnklMk%NjnlPJj3L
3917a0%%PlmMLOnPlj5OJ2%JmLQj5JJ1rJ1jj3NmnNJpMkK%oOLKm%MrKjJ2%j2lJ5
3968F%oQmkLKrJ6pQrMj0%LjMJppMQj0kj0J3J2j8%KKNPJqQMjooJ1MllLqjoJ2j%
4020Fj4POnQll%%JRj2%pKRoqJlMJJ5k1J3omMpKJ0jnQjPMqMkQoJJ0qnnNMKnQj5
4073aKLJj8RRokjmPj2RoJ4o%kMpJ4oMR%rKLKJpnRJKppOnOmqlmJ3Mj4MMmM%pLJ
4128eRJ%ko%J2oNmMKj4RJ1nrLJ0rOm%LnmMrQj1KJ1j3kjqNNmJ1nnOP%MoNoJ2%j2
$$ plain form
4180 0 8 9 14 12 18 9 6 6 6 5 8 10 10 11 9 7 6 2 2 -8 -1 9 -4 6 4 -13 -1 -5 0 -13 -11 -9 -7 -2 5 4 6 -4 12 12 4 5 1 6 13 13 21 13 11 2 6 3
4232 3 -5 2 4 -4 4 -7 4 7 -2 1 -6 -8 -4 -1 0 -11 -1 1 3 0 0 -9 -4 -5 1 3 8 -4 0 -3 -1 4 6 1 8 6 14 9 13 -1 8 1 10 0 -2 7 -12 2 -10 -7 2
4283 2 -6 -7 -6 -7 -2 0 -7 -4 -6 11 -8 -5 -10 -4 7 1 5 3 4 -4 5 -7 5 1 11 13 15 8 15 2 6 22 5 10 12 5 -1 3 -4 -7 -9 -7 -3 -7 4 -8 -5 -10 -13 2
4333 2 -8 -7 -16 -8 4 0 3 3 1 -9 -6 5 8 18 4 16 13 13 12 11 13 5 9 7 0 8 4 -3 -6 3 5 -2 -4 -8 -4 6 -20 -6 -1 -10 -12 -9 -9 -5 -14 -4 0 4 2 -8
4383 -8 3 12 6 4 6 -2 -1 16 9 14 13 10 14 10 12 10 3 5 3 -1 -3 0 0 5 -5 2 -11 11 5 -3 -9 -3 -8 -8 0 -14 -7 -14 -8 -8 6 -7 -4 -6 -2 1 -2 -4 8 3 1 9
4435 9 -3 6 9 18 14 -3 16 7 5 -1 -3 8 -14 -15 -11 -9 -4 -8 -16 -6 -17 -13 -15 -5 -8 -1 0 6 5 -6 1 1 -2 6 7 8 0 0 16 5 7 11 15 5 10 13 19 2
4483 2 3 0 2 3 4 0 -6 -7 -8 1 -1 -2 -11 -8 -6 -1 -17 -22 -12 -5 -3 6 2 6 8 -3 -1 7 13 7 19 2 3 -10 -4 6 18 3 9 18 7 -2 9 7 0 -4 -2 -3 -8 4
4533 4 3 -11 0 -6 -3 5 -8 0 0 -2 2 -9 -7 -7 -3 -5 -7 4 -6 -5 5 5 6 10 10 15 6 5 9 8 9 14 3 0 15 11 12 -4 0 -11 -1 6 -7 -10 -3 -15 -9
$$ packed form
4180@QJNkOrl%%jLK%Jkkjm%j0PJ0j3J0kj7J2mNj3KKKNPjKj0J6%qJmNP%QqkrMl
4232CqPKqQj1J1LrLpkMLJj1J0KKl%rNjOKNj2MlKNKnPkQnMj4RpRj0kRj9J4j2LR
4283BqjJjNKpLkJ7j9LnOJ1oMkJqRj2J2mJ0KKpPj3MJ6j7NKpoMplkKMmJ1j2LnlJ5
4333Bj0JrQJ2mL%kj0LJ1LJ0j4J2l%jjKqMkpQmplRKpkmMJ0k6J4NrkL%MrJ0MMkj0
4383hJ1RokKqJJ7pNjlMmKkpKkmkL%Nj0Pj3K2oqoOn%Qj4PpO%J4j3LkMLlkJ2nkQ
4435Ij2RLRmj7J9rkokJ1k2jMKNmqJ0j1MkJ0lPJOjj1P%lQJJq%J6j1KMMj0NLOj7
4483BJlKJJmojjRkjrLKNj6nJ0PKRmMKj1KQOoJ2j7Jj3OJ0J2j5ORj1rJ1kpmKjnJ2
4533Djj4J1oLQj3Q%kMj1K%MkkJ1j0JJ0%JM%NrjMjJNj1lJ5mJj6Mj1J0Pj3lPj2O
$$ plain form
4580 -9 -13 0 -4 -7 -6 -3 -9 -3 -7 -12 -2 0 -3 -2 0 -2 12 5 10 4 2 8 6 1 10 7 13 6 14 10 9 8 2 8 -8 8 -9 4 -2 -6 -9 0 -19 -8 -20 -13 -9 -8 -1 7 -5
4631 -5 0 -4 7 2 -3 -4 -1 3 3 4 2 1 -3 4 3 15 9 16 0 7 4 1 -2 7 1 -13 -1 2 2 4 -5 -5 -4 -7 -9 4 -7 -8 -1 2 -1 -5 1 -3 -7 0 9 5 10 9 16 13 5 3
4685 3 6 9 6 3 7 14 7 5 0 4 -2 7 1 1 5 -8 -2 -3 -5 -2 -13 -11 -3 -6 -12 -13 -7 -1 5 3 -7 2 -7 -4 4 2 11 8 13 7 10 18 15 4 7 6 8 14 13 0 1 1 -8 10 -4
4740 -4 -7 -4 -5 -3 -4 7 -3 -14 -6 -6 -2 -6 -2 1 2 0 0 9 5 5 4 3 2 9 -3 12 12 15 10 4 4 7 7 2 9 -1 0 -3 1 0 7 4 -3 -16 -1 -7 -11 -19 -6 -9 -5 -5
4792 -5 -4 -5 -10 0 -3 2 0 13 16 1 4 2 3 12 7 13 5 8 -11 3 5 11 1 2 4 9 11 -9 -1 1 7 3 2 -22 4 5 -8 -10 -4 -9 -12 -8 -10 -8 -5 -7 -9 1 -14
4841 -14 5 -5 -1 6 2 7 10 12 2 6 12 5 4 2 -1 6 1 -2 0 2 -6 4 -2 -1 -7 0 -12 -13 -2 -12 -9 -9 -2 -8 -9 -9 -12 -7 -4 -6 -4 -8 -10 -2 12 7 5 14 4 14
4891 14 19 11 5 11 8 4 4 -3 13 -5 7 3 -3 1 -8 -10 -6 -8 7 -14 -16 -1 -8 -13 -10 -9 -15 -8 -11 8 6 5 2 2 11 5 0 7 10 11 -4 2 -10 4 5 -1 5 7 5 10
4941 10 9 2 1 8 -4 4 -7 2 1 -4 -4 -13 -4 -2 -3 -8 -9 -3 -7 -9 -1 -9 -2 8 -2 4 7 18 6 4 9 7 8 14 14 12 9 4 20 12 13 6 -8 0 5 2 -3 3 7 -6 -1
$$ packed form
4580imJ3mlJLoOmnJ0KlJKkJ4pNokOknRlOpQmjjoOj6J6j7J3omlRj9J1j2PMJPQj2
4631eNmJ1nnjLM%JkjmPjJ2oPj6PlllRoj4J2L%Kr%JlkJ3j1jPLlmOmmPRmNjPlqk
4685CLLllMPpknMoRo%Mj3OjkLj1KQlojOOOkj0RrLQkRlNoLQlj1LjKOjj3J%rJ8j4
4740dlLjKjJ1j0j1Q%MmMLJk%Rm%jjjPj2J5%Lno%L%nPj0JlMjPlpj3J5omqJ3lM%
4792eJjnJ0lNkJ3Lj5LkJRnOqLj9J4KOj0JKNKk0QKOmjk4K6Jj3kOnlMkKLkkJ0j5
4841a4J9j0MPmNLKj0MOpjklPnlKKqJ0oJoPj2jJ1j0L%Poj%lNLkKmkQJ4nkRj0J0
4891A4NqoOlm%pJ6j8J2moMrkMkJ5k1kJ5pnLJoPlJ9kjl%RonPLJj5Oj2J4JoOKkN
4941A0jpjPj2Qj1Rjn%rRKjnjOmkQqPJ0j0OLJ1j2kNkJO%klnJ6qJpj4QNlnOMj3N
$$ plain form
4992 -1 -5 -10 -4 6 -8 -3 -2 0 -11 -6 1 7 -1 -10 -10 4 3 5 17 4 5 16 7 8 12 5 4 15 7 10 14 2 15 5 6 -5 7 -6 -7 -7 -15 -2 -5 -3 -2 -12
5038 -12 -6 4 0 1 -12 -14 2 -3 -6 -10 11 2 3 -1 10 7 -1 -5 9 6 1 4 7 8 15 19 1 6 15 12 2 5 13 5 -2 10 0 -9 -7 -5 4 -16 0 -3 -3 -11 1
5085 1 -1 -4 0 -3 0 9 -2 6 1 12 6 2 8 0 -4 10 11 8 2 3 6 8 9 -6 3 -1 17 -3 4 -1 -14 -4 -7 -8 -8 -11 -18 -8 -21 -16 -4 -6 -8 -7 -11 3 -4 3 -3
5134 -3 9 10 3 15 8 18 15 18 14 2 7 10 5 9 -7 4 -1 -5 1 -6 0 -6 -5 -9 -13 -14 -6 -10 -2 -2 -6 -11 -10 -1 -15 -6 -9 -4 -10 9 -4 2 4 2 10 10 7 13 2 14
5184 14 6 17 7 9 6 13 7 5 7 4 -3 14 0 -3 -3 -8 -7 -7 -16 -12 0 -7 -7 -6 0 -2 0 2 -9 3 1 0 8 -5 1 3 2 -1 4 8 14 13 13 -1 4 5 5 0 9 12 6
5235 6 18 3 4 1 -3 -8 -3 -10 -7 -17 -9 -11 -10 -6 -13 -6 -8 -8 -6 1 -1 -11 4 4 8 5 12 4 8 11 1 1 16 12 13 12 2 3 -4 11 10 5 3 -6 4 4 -4 3 6 6 10
5286 10 1 -2 -12 -7 -6 -4 -4 -5 0 -2 -5 -2 -2 6 8 8 -6 5 14 4 10 11 15 12 14 8 13 9 -5 5 2 2 -1 -5 1 -4 -16 5 -2 6 3 -1 0 -5 -4 -5 0 1 -6 0 -2 -7
5338 -7 4 -1 -1 -3 6 2 5 7 10 8 5 18 10 22 16 18 4 7 13 13 5 2 5 -7 0 -4 -5 -13 0 -8 -10 -13 2 5 -15 -10 4 -5 8 -8 -3 -2 4 7 2 2 2 2 -2 6
$$ packed form
4992amnOJ0j4NJKj1NPOqr%J4jKJ2j3JJ1rJMpjJ1qLMj2J3j0Jj1J2j3j%qJ3lKJj0
5038a2OJ0mJj3kJ6nlmK1rJmJ1lqmJ4lnLLJPMj8NRlj0LQqpJ2j0rKKRk0J6l%qJ2
5085AklMlLRj1QnJ1omOqmJ4JloJLKJj5RmJ8k0Pnj3J0lj%lpJ0j3NJ2kkJmJ4pPo
5134cJ2JpJ2pJ0lLmj2NLnMj6J1nmOpOoJmmjQmQ%mnJRj4RlNoJ9j3OKkQ%lOj1J2
5184A4qJ1j0KlPokKlpJ7j4l%nJ%rMJ2p%JOkKKj1J2kjQj3OKjlNMOj%j4NJ%nRLo
5235FJ2j5JlmnNpLj0QkJMpPk%KPkj0J5%MlPqMLj0%J5mJjj0JpJ5jnkrJ0%qPL%M
5286A0rlj0NJK%jNklL%QK%j4J1Rj0OJMlKoNmj4J0l%lmOnj2K1pQlmJnJjNJpOkn
5338gJ1n%kRmLKLklJ3qJ2oKj4LO%qlLj2PmjqJ3qklJ5Lk0NJ4rJ3j6NJOLn%%%mQ
$$ plain form
5388 6 11 12 2 6 15 10 8 16 7 -3 -1 7 12 5 0 0 -6 -1 2 8 -2 -1 -14 3 -8 1 -2 -5 -2 -1 2 -2 2 3 -10 0 15 16 12 11 1 -2 15 7 2 15 6 10 9
5437 9 -6 9 -3 -2 10 3 0 0 2 4 1 -4 -10 -6 -5 -1 -7 8 4 -2 0 -5 -7 -2 -5 -7 -1 -10 -2 9 3 10 10 3 11 10 7 12 9 11 13 10 12 9 9 5 2 5 -7 3 -4 -17
5489 -17 -7 -7 -5 -1 -11 -5 1 -9 -10 -3 -7 -12 -2 1 -10 -7 0 3 7 0 5 -2 5 3 1 7 9 4 5 7 6 13 13 9 16 4 6 -5 4 5 -2 -5 -2 -9 -8 0 -2 0 -13 -10 -7 -14
5541 -14 -14 -5 -3 -3 3 -1 2 1 8 6 4 8 -6 5 5 7 14 10 4 11 15 8 4 2 -3 7 11 8 -2 1 -7 -3 -4 11 -8 -6 1 -7 -6 -5 -5 -13 -13 -13 -1 -12 0 -2 -6 -5 -1
5592 -1 9 6 8 15 -1 -1 16 12 25 18 10 11 10 2 8 3 5 2 2 0 6 -3 3 2 -3 -1 9 1 -9 3 4 -4 -1 -2 4 -1 5 3 -2 -4 -1 0 3 1 1 5 8 17 11 10 9 6 21
5645 21 8 3 18 10 4 2 0 8 3 -10 -8 -1 -8 -1 -3 -5 -2 -8 -5 -5 5 -9 -11 -4 -1 5 4 -3 -1 -7 0 14 5 4 -1 -2 0 9 9 5 2 3 -1 3 18 5 10 16 11 -2 7
5696 7 -3 0 -2 -5 -4 -15 -16 -21 -10 -10 -6 -5 -11 -1 -7 5 -6 5 -4 -4 -9 7 11 3 11 11 4 5 11 12 2 -2 2 14 7 6 9 9 1 9 11 3 1 8 0 -5 -6 -5 -7 -20
5746 -20 -6 -4 -13 -17 0 -8 0 -12 -18 -2 8 -5 -7 5 -5 2 1 11 8 10 13 6 1 12 8 4 7 4 -4 -5 -13 1 -8 -10 -7 -16 -7 -7 -17 -15 -11 -3 -10 -11 -10 -6 -14 -4
$$ packed form
5388FNJj0MRnkQrj0KQNpn%oNLOj0Jj3J7j1RllLJLmMJj3J0J5Jmjj0lJ7qnJ3rMj
5437Ij5J5j2JJ2pl%KKlnoMJMoJ5moKnkNlkOrQJ1oP%pQjlNlKKlKl%mlLj2J0pj3
5489a7J0%KMj0OOj0jPmnJ0Lj1LPLMpNpPkkOKnJKjP%mPj2Kj1RJplLpJQkKj3LLp
5541a4%RK%OmLjPkkMj4J1%KPmoPMpmknJ0Mlj0LqMjJ5j9KPqJJ%q%%J2j1J2kmJM
5592aJ0lKPj6%J7mJ3pqJjqOnKl%kOrOjnKJ0qj0J2JqLjOnOknkLJLk%MLRojjlJ5
5645B1j3nJ5qokkQnj3KPpPkkLoL%J0j4kPLOjpKoPJ4rjnjKR%mlJmMJ5j3NOnj3R
5696Gj0LklJj1jnJ1%MJoJ0oJ2j1J1r%nJ6MqQ%pJOJj0mMJ2pjL%qQKqkPqnjJkj3
5746b0J4KrmJ7qQj2oJ6J0j3kJ2j0PjJ0lKLpnJ1mmLlqjqJ4rkLrR%j0KMQpjJMqJ0
$$ plain form
5794 -4 -9 -5 7 -3 -6 -5 0 -6 -3 2 4 8 3 5 8 7 7 8 2 8 6 6 5 7 -7 -5 5 -7 -5 -7 -7 -5 -15 1 -5 -12 -3 -10 -3 -2 -8 -4 -2 -6 4 1 -1 -5 0 -4 -9 6
5846 6 3 9 15 12 7 4 7 17 6 10 15 14 -3 4 -2 7 -7 -4 -7 0 5 -7 0 -7 -8 -10 -5 -8 -7 -25 -2 -10 -7 -3 3 2 -2 -6 7 3 -3 -1 10 9 7 -1 7 8 7 -3 -1
5897 -1 -5 5 -1 0 4 3 4 -1 -4 -3 -7 -11 1 -6 -4 -10 1 -9 -1 -4 -2 -4 -9 -12 1 -8 -10 -3 -3 6 -1 9 8 -1 11 6 8 9 4 3 3 7 -1 9 -6 3 1 -4 0 9 -13
5948 -13 2 -8 -15 -10 -2 0 -10 -3 -10 -2 -9 -10 -6 -6 -1 -4 -14 -8 -5 -10 -9 -13 -4 4 3 10 6 3 11 2 10 8 5 10 -1 3 5 -3 -6 1 1 -11 -9 -15 -10 -4 -7 -2 -2 -11 -9 -10 -10 0
6002 0 -2 -2 -8 -3 0 5 5 -3 -4 0 14 -1 16 6 3 15 3 7 3 11 6 -1 -1 10 5 -9 -13 -4 -8 -6 -9 -14 -11 -16 -12 -12 -4 -13 -11 -14 -10 -12 -13 -13 -7 -20 -1 2 -2 6 11
6053 11 -4 4 9 4 16 8 8 -2 6 -6 7 -1 7 -4 4 2 0 -9 -6 -1 -7 -2 -7 -7 -10 -4 -4 -17 -18 -6 -12 -4 5 -11 -7 -7 -6 -12 -10 -1 4 -4 5 0 15 -1 13 12
6101 12 9 13 12 4 5 8 12 5 1 1 -6 2 -3 -8 -7 -14 -7 -2 -11 -16 -3 -7 2 4 -14 -4 1 -5 1 -2 -7 6 4 8 12 9 -2 6 12 9 5 1 8 2 7 12 -3 -2 8 5 7 2 -7
6154 -7 2 -4 -4 -8 3 -10 -2 -10 -11 -11 -8 -8 -7 -1 -9 -4 4 -1 -8 -4 4 4 4 1 7 3 8 8 4 13 4 4 4 6 -2 10 7 1 0 3 -4 -5 -8 10 -2 -13 -1 -6 0 -5 8 -6
$$ packed form
5794dnMJ2j0lJNoLNKMnKLj%JoOk%jKj4KJ0j2Kk%Kj0J6opRpPJoMKmJ0lkmNmnJ5
5846FlOOlnlLJ0j1MNjj7PoRj4LlPNj2PpjkNlJj8K3qLMOjmmJ3moKJ1jkqQJjj0K
5897amJ0oJMjJnlJmmJ2pKoJ1j0QlKknlJ3rkP%RpJ0jrJ2nKJnj%MqJ0j5RknMRk2
5948a3J5j0pNQKj0PpQpjM%Nlj0OLnJmRQjPmlQrQklNj1MKqlP%j2KoNOlN%rKj%J0
6002@k%oNLN%qjMJ4j5J7j0lJ2j2MmQnp%J1nj4mRmKlnLnM%QrKlMkj%Oj3J9LmQN
6053A1j5QNnJ2q%j0Qj2J3qQj1QkkrLNoNn%lO%j3jJ2oQRj6M%JoKRNqRnJ5j6J4j
6101A2lMjqJLMpm%pQnnJpPNrnJ3mRKj8J0NoOlnJ3kMMlj1QOlmmPoNNj5JJ0lKnr
6154gRo%mJ1j3Qqj%L%JOqNQnpMQ%%lOmN%mRr%%KqJ2lojLpjlJ8j2j1J2nOnJ3j4
$$ plain form
6206 -6 -14 -6 -2 -14 -11 -14 -5 1 -9 -15 1 12 0 0 11 8 4 21 9 10 5 11 3 3 1 -7 1 3 -6 -4 5 5 -4 -7 -8 -18 -8 -3 -3 -10 -9 1 -8 -7 -15 -14 -9 -5 -4 2
6256 2 -3 15 -2 -2 3 11 8 12 5 11 1 12 14 3 14 3 8 5 -7 9 0 0 6 -2 0 -16 -10 -24 -2 -16 -11 -8 -9 -11 -10 -13 -4 -5 -11 -7 0 3 2 -4 5 2 -7 3
6304 3 2 -5 6 7 3 8 3 -11 -3 -1 5 10 13 -6 2 0 3 4 -12 4 -3 1 -9 -8 -9 -10 -13 -14 -7 -11 -6 1 -9 -7 -2 9 8 15 5 11 11 19 11 6 11 6 -1 10 -1 3
6354 3 8 21 10 15 5 0 4 -1 3 2 1 3 -2 -5 1 -10 -9 0 -9 -15 -12 -5 -8 -3 1 -2 8 -7 4 5 2 4 17 11 10 14 9 10 5 12 8 8 10 15 8 8 1 6 2 3 8 -5
6406 -5 -6 -13 -6 -5 -10 -6 -3 0 -4 -12 1 -7 -1 0 3 -7 7 5 6 7 6 3 3 8 -1 -1 17 16 10 6 4 6 14 6 -4 3 13 15 -13 1 -4 2 -7 -10 -11 -9 -4 -15 -13 -7 -9 -3
6458 -3 -8 3 -1 -2 9 -9 -9 0 0 0 6 2 2 5 -3 5 -3 -1 -9 -4 25 7 5 -1 8 5 7 8 7 -1 0 2 -7 -5 -6 -2 -10 -16 -4 -6 0 -8 -5 1 1 -10 -9 -4 3 8 6 10 4 2
6512 2 6 4 6 5 5 5 -1 5 1 5 -8 5 -2 -2 0 -5 11 -3 -8 -14 0 -5 -10 -9 3 -10 -2 -7 -7 0 0 -14 -8 -1 3 0 -7 -6 5 2 -1 6 7 12 9 1 5 7 7 9 1 -2
6564 -2 5 -2 -4 0 -5 0 -6 8 -9 -6 -2 -4 1 -7 -10 -4 -15 -5 -2 -16 -3 -5 -3 3 -5 -6 2 0 0 -4 -1 -1 -1 10 10 2 0 -5 4 11 11 4 4 9 9 8 -14 -5 -2 -2 0 -6 -8
$$ packed form
6206fqQMj2LlROj0oJ6J1j2%J1lmJ7j2JnOq%kqQKrKR%rljj0J0N%pJJ0rJqJNMJO
6256BnJ8j7%NQlMpOj0J1Kj1J1j1Nlj2J6r%OqKj6Oj4K2j4NLjkJlRjoMPLjoRlrJ0
6304CjpJ1JmNnj4QKONLj9QkLJj6J6pMj0JjjljPmNPj0KNJ1jPj0O%QqnNnpJ1j1M
6354CNJ3j1Nj0nMnMjjKnlOj1JRroLPlNMlJ0j5J1JlKJ3ojMnJnPm%KNp%pNmJNj3
6406ejpPJnMLLmqJ3qOJLj0J4kJJjl%Nr%J8jomkKQqj0PJ0Kk8J4nOrljKNj1KOkO
6458cnJ1mjJ1j8%R%%Om%LqQqKqNK9j8koRlKJjqJKrKjMqoJ2kOqLO%j1JNPNkMok
6512BMkKj%%oOmMj3J3p%KnJ6j4noJ4nnJJ2j3Qn%P%j4OPMlpJJ1llPJNlqMK%Kql
6564bPpkMnNoJ4j7LMkNqlOj1J0Lj4J3kKOqjQk%mL%%J1%qknRP%p%N%jk2RL%Kok
$$ plain form
6617 -8 -3 -2 -3 -7 -7 -12 -5 -3 0 -14 -5 2 1 -3 5 5 10 6 8 4 5 3 1 6 4 9 6 15 1 10 6 7 2 9 1 8 0 1 8 1 -1 -3 -11 -8 0 -5 1 -5 -6 -16 -13 8 -9 4 11
6672 11 -2 1 -5 15 7 15 11 10 5 2 9 7 13 16 6 8 7 4 9 7 6 4 -1 -8 10 -9 -2 -7 6 -4 -8 4 -2 -7 -11 0 -6 -6 -2 -10 4 -3 -3 1 -11 1 7 9
6720 9 -7 11 6 5 16 6 9 -3 16 8 7 8 1 -1 -8 1 -5 -7 -13 -3 -9 -8 0 -1 -7 -10 2 -1 -10 -4 1 -2 -6 -4 0 -4 2 6 0 14 6 2 4 6 7 3 6 9 10 8 8 -1
6772 -1 7 9 12 9 2 -8 5 -9 -18 -3 -4 -3 -10 -9 -3 -11 -4 -8 -6 -6 -10 2 2 -4 2 0 -5 4 7 -11 -1 9 0 4 13 2 2 6 3 5 14 8 13 -4 -1 6 9 4 -4 1 0
6823 0 -5 3 2 1 -15 -13 -8 -18 -14 -14 -25 -7 -5 -11 -10 -8 -7 0 -8 -8 -4 4 7 5 7 3 7 7 1 3 3 3 0 -2 7 5 -9 -10 -3 0 -9 -1 -9 -6 -7 -6 -9 -14 -7 -3 -13 -16 -19 -3
6877 -3 -17 -8 -5 -9 -11 -9 -7 -6 -6 -1 -3 1 -5 9 -1 7 -3 0 1 2 -7 11 -2 3 -4 -9 3 -8 -10 -14 -11 -10 -15 -10 -20 -10 -6 -15 -10 -16 -21 -11 -4 -6 -9 -2 5 -7 -4
6926 -4 -1 -11 1 -4 4 7 -1 5 8 -2 0 0 0 2 2 -1 -2 -7 1 -4 7 -2 -3 -2 -9 -7 -8 2 -15 -16 -9 -4 -14 -18 -15 -10 -6 -2 2 -4 5 5 5 -2 5 -2 11 9 6 2 10 1 11
6979 11 -2 5 -4 -7 -6 -1 -4 -5 -7 -5 -13 -4 -13 -19 -17 -10 -7 -18 -6 -25 -14 -15 -13 -10 -9 -15 -7 -17 -6 -8 -2 -7 -3 -17 -4 1 5 11 5 -7 -1 -1 -10 -1 -2 -5 1 -16 1
$$ packed form
6617hNJjm%nPKLj4RPjmQ%NmKmJkkNkNlRj4RmJnPqPqJPpkkqLQnOojj0LK1j7J3P
6672A1j3LoK0qQmjnlPkOLj0KjlNkjknpJ8j9PnJ3j0mJ2onmJ1o%MqJ4p%Mj2J2OK
6720Ij6J8njJ1j0Lj2J9qjJpkpRokoJ0oJQjolJ2lrONlmKMmOMoJ4qmKKJmLLJk%r
6772aQKLlpj0J3j4rJ5jJpJOqPmK%mJ2%oOknRLj8J0J0rMRj1%MlKRoNj7LPLnqNj
6823@nQjjj6KNj0M%j1J8KoJKJPq%MQLkKmM%oK%%lkRkj4jPLrQqLjJlnPMj0llJ6
6877cj4RLmkKKJ%NkMoJ4j0Qj0LJJrJ8j3NpnJ2j1kmLJnNj0J0MrNonJ0PklPPj2L
6926dLj0J2nQLqOLj0K%%K%ljnQnJ1rjJpKjJ0j7jPNj0mLNMMMoR%%pPpJ3klmQrJ0
6979A1j3PrlJNljkKqRroKPLj1J2j9J1jKLJoQj0J1kOnMj4J3NMOoj2O%rRjlOj7J7
$$ plain form
7028 1 -2 0 3 -9 -12 -9 -11 -8 -3 -9 -12 1 -14 -15 -10 -9 1 3 -14 -14 4 -4 -1 -3 1 -1 2 -2 9 7 7 2 5 4 2 5 8 3 0 -1 0 -2 -9 -5 -9 -4 -3 -7 -4 -12 -4 -15 -15
7081 -15 -6 -16 -8 -10 -6 6 -10 -14 -5 -2 1 6 3 -6 6 18 -6 2 5 -1 1 3 13 8 -5 6 4 5 3 1 -4 -14 7 -3 -5 -7 -13 -8 -8 -15 -19 -6 -17 -18 -17 -14
7127 -14 -3 -10 -11 -8 7 2 -5 -1 0 4 5 15 8 10 16 4 7 3 9 11 -2 -3 8 3 7 4 -2 3 -1 -9 -1 -10 -7 -14 -13 -5 -11 -17 -6 -17 -24 -9 -8 -3 -4 -18 -7 -6 -5
7176 -5 -3 -5 19 0 3 14 6 12 3 9 5 -6 -3 3 10 -1 0 -8 -6 1 -2 -3 -11 -10 -8 -5 -21 -7 -14 -10 -12 -15 2 -6 -8 2 -14 -10 -6 -8 0 -6 2 -5 3 1 4 9 5 2 3
7227 3 1 7 -8 -1 7 -6 4 -3 -11 -3 0 -19 -14 -9 -14 -19 -10 -20 -21 -11 -26 -7 -10 -7 -11 -2 -5 -1 -6 0 -5 1 -5 -5 4 -2 6 -8 -4 -4 6 -1 -2 5 -3 1 -2 9 0 -10
7277 -10 -3 4 -6 -5 -17 -5 -3 -7 -13 -11 -10 -10 -10 -12 -14 -9 -5 -8 -7 3 -3 -5 -1 -8 2 -3 5 0 -5 0 11 8 11 0 1 5 -2 -1 -8 -4 -4 -17 2 -10 -17 -1 -9 -10 -13
7326 -13 -5 -11 -6 -13 12 -4 -8 -9 -8 -7 -10 -9 -7 5 2 -3 -3 0 3 2 -3 0 3 3 6 -4 8 9 6 6 6 -2 1 -5 -9 -7 -7 -3 -14 -7 -11 -11 -10 -4 -11 -11 -5 -19 -7 -11 -6 -2
7378 -2 -13 1 -1 -5 -3 -10 4 -11 1 1 -4 -6 6 6 6 14 3 12 4 -1 4 12 -5 1 5 -1 -5 -8 -10 -10 -4 -1 -6 -19 -16 -16 -12 -4 -15 -20 -5 -10 4 2 -6 -1 8 1 2
$$ packed form
7028AlKLj2lLkLNolJ3j5jNJJ0Kj7%J8qLkMkLmJ1k%nLjkLLnljJkpMmNJmLqQj1%
7081a5Rj0QkMJ2j6mRLLNlrJ2J2k4QLoKKJ0nj3J1kJkknj0K1j0kkoN%pmJ3j1jJL
7127a4J1pjLJ5npMJMJJ0pKOj2LmOKj3jJ1nMloNmqQrLpJQooJ1j1pJ5JNjj4J1JJ
7176eKkK4j9LJ1qOrOmj1LOPj1JqKPljqJKLj6J4pMklJ7qkJ0j6MMkQoQpQkLNmlJ
7227CkOj5PQj3J0pqQLj9NNnnRj0jJ0j5J9lLmRlMnOnOo%RoQj4M%J0pjPqMlJ1rj0
7277a0PPj0Jj2J2KmoKJ%%kkNMlJJ0okMpJ0nQnnNJ1lLj1JMpJpM%j3J9j2pJ6qjl
7326a3QoNpK5j6mjJJlJKJ2ln%LLjnLL%Lj0J2Jl%%qLomK%Mj1Pm%JOp%Oj4J2mNM
7378bj1J4kmKpJ4j5J2%nkJ2%%Qj1RqnNQj7OMomlk%OLnj3L%MQj1nJ5nJ4kqNRpJ
$$ plain form
7427 2 7 2 8 8 9 4 -1 5 5 4 1 4 -5 -6 1 0 -6 -4 -10 -10 -20 -7 -18 -6 -6 -10 -10 -9 -12 -15 -5 -17 -10 -16 -7 -4 -1 5 -13 -8 7 12 11 5 13 9 3 0 2 15 7 6
7479 6 6 3 -6 2 2 2 5 -4 -7 -17 -5 -1 -8 -4 -23 -12 -3 -18 -11 0 -7 -7 -8 0 3 1 -10 -4 11 0 1 5 5 2 7 4 7 2 9 4 12 0 6 1 6 15 -3 -2 2 1
7529 1 -13 -13 -4 -7 -23 -12 -18 -14 -2 -21 -5 -14 -3 1 -6 0 2 9 4 0 -1 3 4 0 1 6 -1 5 8 2 4 4 6 7 4 0 6 -3 -5 8 3 -6 -1 -5 -4 -9 -1 -9 -12 -12 -11 -12 -1
7582 -1 -3 -2 -6 -9 -4 1 -2 -2 0 -4 10 0 11 0 12 10 0 4 9 4 4 -1 2 19 1 -7 1 -6 -9 -6 -6 -14 -3 -8 -15 -19 -13 -17 -10 -13 -11 -5 -7 -5 -16 -12 -12 -5 -12 -11 -3
7633 -3 1 0 -4 1 2 12 14 13 2 8 11 4 6 2 7 13 -1 2 9 3 -13 -11 -13 -2 -8 -8 -13 -12 -12 -4 -5 -6 -6 -16 -7 -3 -9 -3 -8 4 1 3 2 -4 2 5 3 4 1 7 18 15 11
7686 11 9 9 12 5 10 12 1 -2 -2 2 -2 -11 -17 -10 -3 -16 -6 -9 -7 -17 -15 -10 -11 -14 -11 -8 1 0 9 8 1 -3 7 9 4 13 2 3 15 10 17 -1 1 7 6 0 0 4 2 4 2 -5
7738 -5 -10 7 2 -2 -13 -7 -12 -1 -3 -15 -11 -3 -5 -15 -6 -6 0 -1 -7 3 -3 6 3 1 16 12 9 9 15 14 1 7 16 -4 3 14 5 -5 -4 -1 -4 -6 -9 -5 -7 -9 -17 -16 0
7787 0 1 -10 -9 -9 1 -4 -7 -11 0 -4 0 2 -6 -5 -2 9 8 5 7 13 7 3 12 3 -1 22 1 4 10 5 5 8 5 0 -4 -1 -8 -15 2 -7 -4 -10 -16 -14 -15 -16 -6 3 -4 -4 -8 -13 -9
$$ packed form
7427BNnO%JnnO%jlLrjPjoKo%j0J3j1J2%m%JllJ0j2PoRLLOj8NJ5NjoQmolKJ3qj
7479F%lrQ%%Lrlj0J2MpMj9J1Rj5PJ1p%jQLkj1OJ5j1JM%lNlLnPnQj2OnNRj8JMj
7529Aj4%Rlj6J1oMJ2j9J6rJ1MpOKPnmjMJmJNpOLoK%KJlmOrkJ3nrNmJnQql%JjJ1
7582akJmlNNl%KmJ4j0J1j1J2kj0MNn%nLJ7j8qQplL%qJ1npmOmPlKOkKj1M%PpJQ
7633cMjmNJJ0Kjj1OLpKmNOj4LPoj6KkJ1o%nJ%Qjj%j0RMoOnJ2lKjoOLkJlOJ1lm
7686A1k%LpNKj1l%MmroPPj3J0lKj0KNjlLLRjRjpmJ0KnRj1JJ2nPj8KOjo%MkKkp
7738enJ7nmj1OnJ1kj2MQkj0R%OjoJ0oRlkJ5ml%Ojj3ORk0PJ1rj0JLlklMkkqJJ6
7787@Jj1J%J0nlmJ1mMKqJLJ1jlKOomRrmK3k1LOn%LlnmLppJ7rLooKjjJ0Rp%mnM
$$ plain form
7840 -9 -2 5 2 3 0 1 -4 0 0 11 0 7 4 7 11 -3 10 4 10 7 8 1 11 -7 -8 -8 -5 -7 -6 -8 -16 -13 -16 -23 -12 -11 -5 -5 -4 3 -7 3 7 13 7 12 3 0 14 11 4
7891 4 0 13 6 4 2 -3 2 6 9 6 12 -1 0 0 6 -6 -9 -4 -14 -14 -6 -11 -4 -9 -14 -13 -14 -5 -4 -13 1 -9 1 -6 -6 12 3 5 5 5 8 17 9 -2 2 9 10 -5 7 4
7941 4 -8 -3 0 -6 -9 -11 -8 -8 -12 -4 -4 -2 -11 -9 -19 -8 -5 1 -6 -5 -7 -7 -2 4 -2 9 -1 -2 -1 2 15 12 7 6 5 2 5 9 14 10 1 6 5 -4 -4 -3 -4 -8 0 -12 -14 -6 -13 -12
7995 -12 -19 -7 -10 -13 -5 7 5 -4 -4 -8 0 -9 -3 5 6 -7 7 2 1 3 8 13 0 16 3 7 7 -4 5 3 -1 -6 2 -3 0 -3 -5 -10 -10 -4 -14 -21 -14 -12 -14 -8 -8 -8 -16 -13 -13
8046 -13 -8 -12 1 5 8 0 1 11 4 8 3 12 -4 1 14 9 0 0 0 -4 1 -1 -8 4 -1 -7 -4 -9 -1 -12 -7 -1 -4 -9 -4 -17 -8 -14 -6 -5 -8 -7 -13 -5 2 -1 7 12 15 11 0 13
8098 13 11 17 12 9 10 -5 6 3 7 9 2 1 -6 -13 4 -16 -5 -6 -1 -11 -1 -18 -10 -15 -10 -14 -12 -4 -7 -2 -4 -10 -9 2 -9 -2 -5 0 3 2 -3 -2 8 11 5 9 12 -1
8146 -1 15 4 0 -5 -5 3 -1 10 -10 -5 -15 -14 -7 -11 -25 -14 -10 -10 -18 -16 -12 -11 -6 -14 -13 1 9 2 10 7 0 5 6 9 6 6 6 10 0 -7 11 0 5 6 13
$$ packed form
7840iPPlJlJnM%J1j1PlLMj4J3oOlJpJ0j8j%LkJkqLlpJ1JO%JPj0J0MOoNrlJ4lp
7891DmJ3pkknNMLlOj3J%Oj2lNj0%QnPnnJjRJrJ4j0J0p%J8rK%%LRqj1MPJj5J2l
7941Dj2NLolkL%mQ%KrKj0J1LOpJk%NOoJ1j0jJLJ3lnjjlLMNmrNjr%JjmQj2kQpJ
7995a2pJ2llQJ2kr%mQrOQJj3J4njKNNj3J6j3M%j1RkmnQnLlkn%Oj0pPKkO%%qL%
8046a3NmJ3MLqJJ0pMnRj6NJ3nr%%mNkpJ2noLnQj1NOlnNj3RoQJlJoQPlQNLmj1J3
8098A3kOnlJj5J1lMKpjppJ7k0J1jNj0J0j7QnNmKQlNkoJJ1j1PlNLjnJJ0LoMLj3
8146aJ6j1mn%QmJ1k0Nj0JPmj4J1M%qKMJNqJJ4QpQlpNJLl%%Mj0pJ8j1NJP
8191A3
$$ Imaginary data points
##PAGE= N=2
##DATA TABLE= (X++(I..I)), XYDATA
$$ plain form
0 0 0 0 0 0 0 0 0 0 0 0 0 0 0 0 0 0 0 0 0 0 0 -8 8 -8 8 -8 8 -8 16 -16 16 -16 24 -24 25 -32 33 -40 41 -48 56 -59
42 -59 65 -73 81 -89 97 -110 121 -133 145 -161 177 -197 216 -239 266 -296 332 -375 424 -484 562
63 562 -663 799 -997 1312 -1891 3298 -14045 -4055 32943 6648 -23449 -13800 15360 13504
77 13504 -3560 -11724 -5360 4590 13442 3879 -16456 -14109 16452 22405 -11635 -27841 5486 28559
91 28559 1748 -25311 -7065 18399 10271 -9869 -10104 515 6669 7140 -504 -12511 -7292 14001
105 14001 14792 -12466 -20550 8346 23353 -3317 -22755 -1491 19146 5073 -12899 -6361 5686
118 5686 5266 1468 -1603 -6712 -3472 9746 9086 -10174 -13875 8573 16938 -5832 -17874 2568
132 2568 16277 25 -12858 -1622 7936 1410 -3023 183 -1371 -2918 4371 6028 -5831 -8869
$$ packed form
0@%%%%%%%%%%%%%%%%%%%%%qJ6j6J6j6J6j6K4l2L2l2M0m8M9n7O5p3Q1q9J04j15
42e9J24j38J54j70J86k07K31k54K78l06L38l74M13m55N05n62O28p07P99r08J046
63E62j225J462j796K309l203N189j7343R990L6998k6295l0097R649K9160j856
77A3504j7064q164O364R950Q852r563k0335K347L0561N953l4040j6206L3327K3073
91B8559k6811k7059J8246K5464q128k0140k35J0619O154M71p644j2007N219K1293
105A4001P91k7258q084K8896J5007k6670j9438K1264K0637j4073j7972O538J2047
118E686m20l798l071n109L240J3218o60j9260l701K2448Q365k2770j2042K0442
132B568J3709j6252j2883J1236R558o526m433L206j554j547P289J657j1859l038
$$ plain form
146 -8869 6080 11059 -5190 -11932 4047 11636 -2838 -9962 2346 7484 -2535 -4686 3386 2005
160 2005 -4654 42 5829 -1571 -6968 2292 7467 -2802 -7608 3089 7067 -3650 -6144 4535
174 4535 5038 -5642 -3883 6850 3079 -7604 -2357 7972 1937 -7553 -1381 6644 672 -5241
188 -5241 517 3730 -2286 -2469 4393 1549 -6787 -1447 8769 1760 -10188 -2619 10427 3399 -9585
203 -9585 -3897 7649 3736 -4987 -2573 2322 533 90 2555 -1385 -5815 1688 9137 -728 -11528
218 -11528 -965 12646 3002 -12137 -4788 9992 5610 -6792 -5305 2946 3368 456 -330 -3017
232 -3017 -3709 3965 7779 -3436 -11278 1595 13480 1088 -13794 -3676 12371 5712 -9163
245 -9163 -6265 5146 5382 -879 -2836 -2632 -902 4753 5158 -5205 -9316 3913 12353 -1519 -13955
$$ packed form
146h869J4949M979j6249o742J5979P589j4474p124J2308N138j0019k151Q072j381
160B005o659M696N787p400n397R260N175j0269m806J0697L978j0717k494J0679
174D535N03j0680J759J0733l771j0683N247J0329o035r490O172Q025n972n913
188e241N758L213o016j83O862k844q336N340J0216p009j1948P569J3046p028j2984
203i585N688J1546l913q723K414M895j789m43K465l940m430P503P449r865j0800
218a1528J0563J3611r644j5139P349J4780m382j2402J487Q251M22k912p86k687
232c017o92P674L814j1215p842J2873J1885j2392j4882J0118J6047o659j4875
245i163K898J1411K36o261j957K04J730N655M05j0363m111J3229Q440j3872j2436
$$ plain form
260 -13955 -1561 13470 4222 -11257 -5972 7520 6144 -3173 -4650 -972 1730 4163 2330 -5669
274 -5669 -6524 5536 10315 -3742 -12755 1060 13525 1867 -12383 -4228 9586 5302 -5785
287 -5785 -4926 1617 2930 1959 169 -4432 -3948 5301 7530 -4717 -10351 2928 11870 -514 -11758
302 -11758 -1741 10209 3325 -7358 -3656 4015 2837 -574 -777 -2196 -2015 3865 4944 -4294 -7623
317 -7623 3540 9368 -2095 -10070 266 9414 1158 -7790 -1947 5333 1722 -2689 -598 200 -1250
332 -1250 1736 3464 -2693 -5397 2926 7028 -2305 -7769 1485 7752 -594 -6887 115 5487 -195
347 -195 -3836 779 2051 -1929 -629 3138 -528 -4372 1097 5168 -1397 -5644 1393 5585 -1380
362 -1380 -5136 1514 4467 -1807 -3586 2436 2836 -3065 -2017 3769 1418 -4167 -799 4332 279
$$ packed form
260a3955J2394J5031r248j5479N285J3492j376r317j477L678K702K433j833p999
274e669q55J2060M779j4057r013J3815J2465j1658j4250Q155J3814m284j1087
287e785Q59O543J313r71j790m601M84R249K229j2247n634J3279Q942j2384j1244
302a1758J0017J1950o884j0683L702P671j178l411k03j419J81N880J079r238l329
317g623J1163N828j1463p975J0336R148q256q948N843P280l611m411K091P98j450
332a250K986J728o157k704Q323M102r333n464R254O267q346o293P002N372n682
347a95l641M615J272l980J300L767l666l844N469M071o565m247P037M192o965
362a380l756O650K953o274j779O022M00n901J048N786k351n585L368N131m053
$$ plain form
377 279 -4181 301 3757 -1042 -3283 1846 2762 -2846 -2489 3707 2324 -4525 -2412 4966 2484 -5018
393 -5018 -2390 4631 2072 -3821 -1294 2899 210 -1901 1309 1277 -2870 -975 4388 1197 -5566 -1790
409 -1790 6223 2493 -6268 -3104 5570 3236 -4410 -2854 2844 1739 -1371 -86 165 -1970 440
424 440 4055 -304 -5770 -425 6973 1639 -7273 -2787 6787 3695 -5430 -3847 3624 3204 -1640 -1714
440 -1714 -99 -478 1179 2863 -1525 -5184 904 6821 229 -7778 -1759 7637 3060 -6611 -3829
455 -3829 4841 3778 -2717 -2736 711 934 985 1507 -1783 -3892 1808 6027 -961 -7415 -379 7863 1849
472 1849 -7347 -3066 5903 3549 -3975 -3264 1764 1965 117 -25 -1544 -2369 2057 4599 -1786 -6340
488 -6340 832 7342 525 -7316 -1782 6499 2734 -4883 -2862 3023 2260 -1089 -813 -478 -1125 1428
$$ packed form
377B79m460M482L456m799k241N129R16n608L57O196j383o849K113P378k482p502
393e018K628P021k559n893K527M193k689k111L210l2m147J895N363l191o763L776
409a790Q013l730q761L164Q674k334p646J556N698j105l110J285K51k135K410
424D40L615m359n466N345P398n334q912M486R574l092r125J583P471m20m844p4
440a714J615l79J657J684m388l659O088N917o592q007O019R396m577r671K782
455c829Q670j063o495j9L447K23N1N22l290k109N700M219o988o454P036Q242o014
472A849r196M281Q969k354p524P11N028K01j848j42j519q25M426K542o385m554
488f340P172O510o817p841N534Q281l765p617K021N885p63l349K76L35o47K553
$$ plain form
504 1428 3169 -1710 -4974 1277 6159 -475 -6658 -579 6284 1384 -5303 -1814 3882 1622 -2291
519 -2291 -775 840 -538 348 2165 -946 -3659 1100 4877 -761 -5503 258 5573 304 -5060
534 -5060 -685 4122 675 -2985 -295 1775 -557 -813 1588 62 -2727 290 3651 -431 -4237
549 -4237 370 4420 -250 -4192 240 3727 -321 -2998 713 2332 -1195 -1665 1865 1155 -2494 -762
565 -762 2989 409 -3338 -144 3349 -252 -3265 602 2910 -1127 -2602 1615 2273 -2123 -2020 2555
581 2555 1843 -2811 -1632 2963 1418 -2830 -961 2652 424 -2273 379 1977 -1240 -1742 2072 1652
597 1652 -2808 -1755 3249 1900 -3475 -2140 3296 2105 -2945 -1890 2339 1271 -1759 -353 1238
612 1238 -799 -918 2015 928 -3026 -1119 3825 1615 -4071 -2020 3993 2417 -3432 -2421 2662
$$ packed form
504A428J741m879l264O251M882o634o183O079O863m900o687L489N696k260l913
519b291J516J615j378Q86J817l111k713M759L777n638m742N761N315n269n364
534e060M375M807l447l660K690K070k332k56K401j526k789L017L361m082l806
549d237M607M050m670l942M432L487m048k677L711J619l527m70L530p10l649J732
565g62L751k580l747L194L493l601l013L867K308m037j475M217O58m396J03M575
581B555p12m654J179M595j545m248J869L613k228k697K652J598l217n02L814m20
597A652m460J053N004j349n375J335N436j191n050J055M229j068l030J406J591
612A238k037j19K933j087l954J907M944k210n686K051O013j576n849J011N083
$$ plain form
627 2662 2047 -1757 -1192 956 -51 -422 1457 188 -2858 -419 3914 877 -4552 -1560 4586 2167
643 2167 -4125 -2543 3275 2521 -2157 -1912 1115 880 -218 596 -210 -2083 259 3465 151 -4380
659 -4380 -827 4761 1553 -4582 -2172 3825 2394 -2815 -2208 1605 1409 -573 -228 -153 -1247 457
675 457 2697 -291 -3858 -170 4588 870 -4685 -1480 4302 1956 -3432 -2014 2332 1604 -1214 -738
691 -738 267 -513 282 1823 -483 -3106 228 3994 224 -4430 -810 4314 1295 -3761 -1527 2881
707 2881 1390 -1819 -814 921 -23 -162 1177 -165 -2209 239 3149 11 -3709 -349 3881 684
723 684 -3644 -902 3028 817 -2311 -534 1476 -90 -849 818 342 -1673 -135 2416 100 -2974
739 -2974 -174 3275 315 -3234 -316 2974 277 -2436 32 1907 -383 -1357 917 937 -1458 -635
$$ packed form
627B662o15l804N65K148j007l71J879j269l046K439M333l037n429K992O146k419
643B167o292J582N818p54m678K45L027k35j098Q14q06j873K342L206l314m531
659d380L553N588l208o135K410N997j431n209O07L813j96j982L45P5j094J704
675D57K240k988l567L688M758l718n555L205N782k346n388J418M346p28k818M76
691g38J005p80P95J541k306k623L334L766l770m654L620N124l019n056K234M408
707B881j491l209J005J735r44j39J339j342k044K448K910l138l720L360M230l197
723F84m328K742L930k211l128J777K010j566p59J667m76k015J538K551k316l074
739b974K800L449k960l549K918L290k697k713K468J875k290r74K274K0k395Q23
$$ plain form
755 -635 1955 451 -2344 -373 2529 247 -2618 -122 2446 -156 -2232 456 1912 -845 -1615 1228
771 1228 1358 -1540 -1125 1824 977 -1930 -756 2012 515 -1948 -155 1874 -283 -1767 774 1636
787 1636 -1274 -1592 1635 1509 -1952 -1494 2023 1385 -1986 -1238 1819 920 -1593 -461 1405 -117 -1243
804 -1243 814 1215 -1437 -1246 1977 1400 -2293 -1526 2379 1606 -2230 -1579 1885 1330 -1503 -910 1090
821 1090 233 -843 503 728 -1315 -826 1979 1034 -2452 -1310 2638 1583 -2516 -1688 2170 1630 -1637
838 -1637 -1261 1120 695 -666 120 437 -980 -406 1804 595 -2465 -949 2806 1281 -2865 -1599
854 -1599 2536 1641 -2048 -1495 1387 1010 -811 -319 380 -543 -195 1436 282 -2162 -524 2718 937
871 937 -2875 -1247 2764 1476 -2324 -1437 1732 1154 -1094 -602 530 -156 -229 944 111 -1740 -279
$$ packed form
755f35K590j504k795J971K902k282k865K496K568k602k076K688J456k757p70K843
771A228J30k898M15K949q47k907J174K768j497k463J793K029k157j484K541Q62
787A636k910l18L227j26l461M58L517o38l371P48L057q99k513J132J866j522j126
804a243K057M01k652J91L223n77l693P67L905p73l836O51L464n55k833N93K000
821A090q57j076J346K25k043M89K805r45l486J142L948j055m099Q28L858n40l267
838a637L76K381m25j361P86L17j417N74K210j209l060J516L755j525m146J266
854a599M135q95l689N53K882l77j821M92O99r23L48J631j154k444J638L242j781
871I37l812J628M011j288l800Q87L169n78k248M92J132o86p3J173q33j851J461
$$ plain form
888 -279 2323 535 -2688 -892 2725 1145 -2489 -1235 2044 1098 -1453 -705 897 144 -439 587
904 587 207 -1300 -168 1934 307 -2380 -554 2565 756 -2514 -903 2209 835 -1763 -602 1253
920 1253 157 -809 392 473 -976 -310 1522 314 -1922 -390 2177 533 -2212 -587 2080 549
936 549 -1800 -364 1463 50 -1111 351 772 -810 -586 1194 454 -1552 -441 1750 396 -1861
952 -1861 -395 1824 274 -1704 -90 1516 -169 -1272 532 1086 -818 -865 1151 745 -1338 -590
968 -590 1508 488 -1536 -327 1520 133 -1464 105 1349 -437 -1295 714 1168 -1023 -1109 1192
984 1192 992 -1321 -861 1340 697 -1264 -456 1212 182 -1106 194 1099 -519 -1060 895 1121 -1148
1001 -1148 -1144 1339 1152 -1400 -1097 1318 929 -1204 -704 1010 322 -895 84 792 -545 -816 960 895
$$ packed form
888b79K602j788l223J796L617j580l634J254L279r46k551P48J602p53n83J026
904E87l80j507J132K102j627k687J826L119j809l270J611L112j374k598J161J855
920A253j096r66J201Q1j449O66J832j208k236J532K567j644k745J625K667j531
936E49k349J436J827j413j161J462M21j582K24J780p40k006J111K191j354k257
952a861J466K219j550j978J614J606j685j103J804N54j904m7K016m06k083P48
968e90K098j020k024J209J847j387j597J569J244j786q58K009M54k191q6K301
984A192k00k313M60K201o43j961Q08J668j030j288J300R05j618n41J955K26k269
1001a148MK483j87k552L03K415l89k133N00J714o88j217R79P08j337k71J776o5
$$ plain form
1019 895 -1302 -1034 1515 1155 -1567 -1180 1486 1125 -1277 -888 1032 570 -784 -90 634 -415 -580
1036 -580 900 661 -1321 -819 1578 985 -1688 -1132 1623 1156 -1415 -1045 1110 763 -812 -340 567
1053 567 -162 -413 710 428 -1166 -538 1548 757 -1712 -931 1737 1085 -1585 -1070 1293 877 -967
1070 -967 -547 635 53 -438 463 309 -985 -375 1399 528 -1661 -714 1757 901 -1669 -925 1469 880
1088 880 -1127 -582 840 230 -542 270 389 -742 -332 1169 375 -1488 -531 1610 645 -1636 -779 1468
1106 1468 724 -1282 -596 971 300 -714 75 504 -501 -373 929 356 -1223 -379 1448 506 -1495
1123 -1495 -533 1471 562 -1294 -446 1098 246 -869 55 671 -421 -539 747 437 -1055 -429 1229
1140 1229 402 -1331 -414 1320 366 -1238 -270 1125 108 -960 134 836 -372 -688 677 609 -860
$$ packed form
1019H95k197K68K549l60k722L87K666l61k402L89J920m62j354O94P24j049j65
1036e80J480k39j982N02K397n93k673N56K755m67k571L70K155l47j575M72R07
1053E67p29k51J123k82j594O28K086p91k469P81K668o52k670N15K363m16j844
1070i67M20J182n82m91R01j54j294O10J774q71k189R47K471q56k570P44K394n89
1088H80k007N45J422o10p72Q12J19j131M10J501p94j863R57K141r65k281Q57K247
1106A468p44k006O86J567o71j014P89M29j005J28J302n73j579Q44J827r42k001
1123a495R62K004r09j856Q48J544q52j115R24O16j092j18J286l10j492O26J658
1140A229q27j733R17J734r54j604R68J395j017j068J094P02j208l16J365o8j469
$$ plain form
1157 -860 -508 1044 446 -1123 -373 1131 276 -1086 -148 1019 -27 -943 213 856 -429 -794 636
1174 636 729 -805 -651 918 569 -945 -425 967 290 -917 -71 884 -126 -847 351 827 -548 -821
1192 -821 695 800 -848 -790 892 693 -906 -552 853 345 -793 -102 732 -151 -701 429 731 -630
1210 -630 -743 821 817 -878 -813 934 812 -877 -668 799 499 -687 -238 603 -82 -568 377 556 -660
1229 -660 -642 840 708 -975 -790 986 803 -936 -748 825 599 -684 -349 575 47 -472 320 482
1247 482 -610 -484 867 591 -1015 -685 1063 752 -1014 -750 892 645 -743 -467 570 146 -474
1264 -474 153 387 -514 -396 774 449 -981 -561 1071 642 -1053 -680 972 667 -801 -506 649 293
1282 293 -484 30 388 -333 -337 657 369 -890 -437 1020 510 -1063 -580 989 554 -880 -481 720 297
$$ packed form
1157h60L52J552n98j569P50J504q55j362R38J167j046r16J156O43j285l65J430
1174F36R3j534J54J569l49j514N20J392o77j207Q46R55j010p21J198M76j375k73
1192h21J516J05j648N8J682j99j599L54J405n08j138O91Q34q83n50J130L02j361
1210f30j13J564mj695O5J747j22j689K09J467l00j186M49Q41o85m86R45J79j216
1229f60J8J482j32j683J85J776j83j739J88J573k26j283L35R24n28n19P92J62
1247D82j092J26J351k76j606L30J748l11j766K64J642k47j388K76J037m24o20
1264d74O27K34r01J18J170l25j430M20J632m29j695L73J652l05j468K95J155l56
1282B93p77N14L58p21mR94k88j259M53J457n10j573M83J569m35j434L99J201m23
$$ plain form
1301 297 -564 -53 456 -225 -371 528 366 -764 -371 940 422 -1004 -455 982 451 -908 -400 781
1319 781 271 -648 -92 513 -156 -440 380 389 -617 -368 795 367 -892 -363 925 370 -860 -282 798
1338 798 222 -657 -51 586 -118 -497 320 454 -505 -412 663 385 -760 -352 799 287 -807 -229 742
1357 742 101 -688 32 608 -172 -568 330 520 -460 -468 588 447 -656 -364 721 309 -690 -161 686 64
1377 64 -624 96 594 -228 -569 362 548 -474 -537 526 474 -603 -446 589 330 -606 -209 589 43 -559
1397 -559 107 560 -271 -543 405 564 -483 -546 561 556 -557 -490 564 411 -526 -256 515 92 -479 111
1417 111 481 -307 -501 449 515 -541 -540 601 550 -599 -521 580 465 -484 -314 460 161 -412 69 406
1437 406 -258 -416 440 451 -557 -495 635 531 -639 -522 580 482 -510 -385 440 223 -376 -19 345 -193
$$ packed form
1301B97q61N11N09o81j46Q99j62j130L93J311n18j426N49J437n31j359N08J181
1319G81n10r19N56O05o69k84Q20Rj006K49J163m28j259N29J288n55j230N78J080
1338G98n76q79O06O37p04l79Q17J34r59R3J075k78j145M08J151n12j094N78R71
1357G42o41p89P20N76p80l96Q98J90r80qJ056j41j103K92J085m12r99N29Q47o22
1377F4o88P20M98q22l41R31J86j022o3J063n2j077J57J035k59r36L97P98n46o02
1397e59O66M53q31k72R48J59j047o3J107nj113O7J054j53r37K70P71m23n71N90
1417A11L70p88j94R50O6j056JJ141n1j149P8J101j15r49J70P74k99n73M81L37
1437D06o64j58Q56J1j008O2J130j04j170J17J102r8r92J25Q25k17n99L57L64n38
$$ plain form
1457 -193 -345 399 389 -527 -426 653 473 -648 -485 635 481 -545 -382 476 259 -387 -83 331 -128
1476 -128 -318 313 320 -504 -373 609 387 -673 -441 654 414 -604 -384 510 286 -404 -119 347 -33 -290
1496 -290 255 318 -400 -303 556 367 -602 -362 653 388 -594 -340 524 259 -454 -148 357 -18 -322 165
1516 165 296 -332 -308 459 326 -546 -309 603 331 -586 -280 558 217 -483 -116 429 1 -351 145 330
1536 330 -275 -308 398 303 -484 -302 525 283 -554 -247 520 178 -480 -84 449 -31 -384 129 345 -239 -330
1557 -330 341 322 -397 -289 456 277 -464 -214 468 153 -450 -60 429 -53 -399 152 376 -243 -369 316
1577 316 342 -365 -312 399 283 -414 -213 412 137 -394 -17 409 -60 -383 184 395 -255 -372 332 366 -360
1598 -360 -344 372 289 -367 -240 364 143 -368 -37 338 -93 -365 172 364 -284 -369 335 380 -344 -350 372 337
$$ packed form
1457a93j52P44j0r16J01J079j80j121J63J120j54j026J63Q58k17o46L04M14m59
1476a28j90O31Pq24J31R82k22j060K32J095k40j018K20Q94k24o90K85M66l80k57
1496b90N45O3p18R7Q59j89r69K40J015k65r82K54Q64k65p13L06N05l75l04M87
1516A65J31o28K4P67j33q72K37R12k72r17L06Q38l41p00L67N45m28l52M96J85
1536C30o05l3P06r5p87J82Q27k42q37L07P67l42o58L96N33m80l53N13K16n84r1
1557c30O71j9p19J08P45j79p41K50O82l15o03L90M89m82l46N51K24o19j26O85
1577C16K6p07N3P11j16o97K01O25k75n31L77M26m69l23N67K11o50j17P04L4p26
1598c60J6P16q3o56J27O04k21n11L31L75m31k72N37J92o48q5P04M5p24oP22l5
$$ plain form
1620 337 -327 -248 322 175 -280 -46 305 -56 -299 191 328 -283 -349 343 362 -387 -357 376 329 -361 -284 297
1642 297 186 -290 -87 260 -47 -265 163 283 -270 -301 354 330 -389 -329 412 347 -359 -275 345 227 -276 -109
1664 -109 246 -1 -228 128 239 -235 -269 315 289 -380 -323 381 322 -375 -291 336 237 -286 -138 254 35 -219
1686 -219 86 208 -203 -226 288 261 -352 -282 379 276 -388 -273 351 212 -313 -142 265 50 -234 58 212
1707 212 -163 -209 262 246 -311 -233 375 254 -366 -228 350 203 -320 -129 283 52 -248 34 215 -140 -218
1728 -218 197 204 -276 -233 291 215 -331 -215 327 174 -315 -119 297 53 -245 44 248 -104 -212 190 224 -231
1750 -231 -198 295 214 -289 -183 306 158 -289 -104 278 37 -278 27 240 -116 -256 164 224 -225 -219 240 204
1772 204 -272 -181 258 138 -267 -75 260 34 -245 47 257 -99 -238 153 256 -186 -223 219 204 -236 -173
$$ packed form
1620C37o64P9N70j47m55K34L51l61k43M90J37o11o6O92J9p49L0P33m7o90P7N81
1642B97j11m76K03L47l07k18M28J20n53l1O55k4p19O0P41o5p06Q4O20j18n03J67
1664a09L55k47k27L56J11m74l4N84k6o69N7P04n9o97Q4O27r9n23J48L92k19k54
1686b19L05J22m11k3N14k7o13P0O61j03o64J15O24j39n25J71M07k15k84K92J54
1707B12l75m6M71j6n57P8O08j21o20J38N78j47n23J91M12k31l00K82J81l55p8
1728b18M15Pm80M3N24p6n46J16N42j53m89J96M16k44k98K89K04l52j08M02L4m55
1750b31L3M93q1n03J06M89j48m47J85L82k41l15L05K13l56j40M20O0m49OM59l6
1772B04m76R1M39j20m05J92L35k26k79K92K10l56j39L91J03m42l7M42j5m40O3
$$ plain form
1793 -173 231 137 -227 -89 219 16 -213 49 237 -102 -243 171 255 -199 -229 222 222 -215 -179 234 148 -210
1815 -210 -77 200 9 -202 59 192 -118 -226 161 231 -209 -238 220 221 -216 -192 216 154 -192 -82 194 25
1837 25 -164 55 179 -97 -191 176 222 -196 -209 224 218 -211 -201 217 166 -197 -109 158 26 -157 33 159 -106
1860 -106 -170 157 185 -196 -211 215 215 -212 -193 211 169 -170 -108 184 63 -141 35 157 -69 -150 147 158 -187
1883 -187 -180 208 193 -224 -187 203 156 -208 -138 164 62 -164 -3 140 -55 -138 122 137 -171 -146 199 172 -189
1906 -189 -147 221 172 -181 -105 192 84 -153 -7 150 -42 -136 100 141 -141 -147 163 152 -187 -145 198 133 -192
1929 -192 -108 177 74 -162 -14 146 -40 -139 95 143 -125 -139 159 136 -174 -145 181 122 -174 -98 162 61 -155
1952 -155 -17 151 -26 -143 80 150 -101 -142 142 149 -148 -125 171 117 -149 -77 162 49 -156 -15 151 -29
$$ packed form
1793a73M04r4l64J38L08k03k29K62J88l39j41M14Q4m54l0M51%m37L6M13q6l58
1815b10J33K77j91k11K61J33l10j08L87P0m40k9M58Jm37K4M08o2l46J10K76j69
1837B5j89K19J24k76r4L67M6m18j3M33om29J0M18n1l63Q8K67j32j83J90J26k65
1860a06o4L27K8l81j5M26%m27J9M04m2l39O2K92j21k04J76J22k26q1K97J1l45
1883a87PL88j5m17L7L90m7l64P0L02j02k26J61J43j95q3K60J5l08K5L45k7l61
1906a89M2L68m9l53P6K97j08k37J46J57j92r4K36M1k82oL10j1l39M2L43o5l25
1929a92Q4K85j03k36J48J60j86r9K34M8k68j4K98k3l10K9L26n9k96P6K60j01k16
1952a55J38J68j77j17K23P0k51m1K84Pk97K3K96n4k66P2K39j13k05J41J66j80
$$ plain form
1974 -29 -149 72 162 -115 -159 130 136 -143 -135 149 96 -149 -82 138 41 -137 8 145 -38 -132 72 159 -101 -148
1998 -148 125 167 -114 -124 149 112 -128 -69 129 42 -126 3 123 -45 -127 69 134 -102 -158 106 138 -128 -149
2021 -149 135 110 -126 -79 128 45 -115 7 132 -17 -108 81 143 -88 -125 120 134 -121 -134 124 109 -118 -86
2044 -86 101 47 -113 -9 105 -40 -117 68 116 -102 -125 121 125 -120 -121 122 100 -112 -89 108 54 -98 -23 99
2068 99 -27 -109 67 91 -82 -119 116 122 -112 -116 114 109 -107 -94 108 65 -97 -27 108 -15 -98 52 97 -77 -104
2093 -104 115 122 -108 -103 107 106 -108 -78 112 66 -102 -36 85 -24 -104 39 87 -82 -97 89 90 -114 -98 117 89
2118 89 -111 -68 113 68 -95 -30 92 16 -91 37 102 -59 -87 79 78 -107 -97 97 70 -112 -85 104 47 -104
2142 -104 -41 84 -6 -96 27 87 -65 -91 74 99 -97 -81 104 82 -87 -51 110 51 -90 -18 101 9 -83 23
$$ packed form
1974b9j20K21R0k77m4K89Ok79QK84n3k45O7K20r7j78J45J37j83r4K04Q7k60m7
1998a48K73M2k81j0K73l7k40N9J98q7j68J29J20j68q2J96O5k36n6K64L2k66k1
2021a49K84k5k36M7K07q3j60J22J25j49r1J89O2k31l7K45J4k55j3K58j5k27L2
2044h6J87n4j60J04J14j45p7J85M8k18k3K46Mk45jK43k2k12K3J97n4j52P5J22
2068I9j26q2J76K4j73l7K35Ok34mK30nk16J3K02m3j62P0J35j23q3J50M5j74k7
2093a04K19Pk30NK10jk14L0J90m6j68O6J21j09q0J43M8j69j5J86Jk04J6K15k8
2118H9k00M3J81m5j63O5J22p6j07J28O5j61k8J66jj85J0J94k7j82K7J89n7j51
2142a04O3J25r0r0J23O0j52k6J65K5j96J6J85k2j69L6J61n9j41P2J19r2r2J06
$$ plain form
2166 23 93 -42 -89 67 91 -81 -88 79 71 -85 -67 85 46 -96 -17 78 -5 -78 43 91 -50 -92 56 81 -74 -71
2192 -71 86 76 -68 -54 82 43 -75 -12 89 -6 -85 28 76 -45 -81 53 86 -69 -84 81 80 -63 -53 88 46
2217 46 -68 -8 75 -12 -63 32 78 -59 -76 65 77 -74 -82 67 69 -92 -70 56 33 -80 -22 71 -19 -70 26 78 -36
2244 -36 -57 83 87 -58 -65 90 92 -68 -61 72 60 -63 -19 59 -2 -72 25 66 -45 -65 57 63 -77 -75 60 64 -78 -55
2272 -55 54 32 -63 -41 59 4 -50 20 70 -35 -57 57 70 -60 -54 76 62 -57 -46 64 42 -48 -25 58 9 -55 14
2299 14 52 -32 -51 42 49 -66 -56 61 41 -66 -50 70 39 -58 -20 56 12 -47 13 65 -27 -63 53 43 -62 -51 57
2326 57 47 -76 -40 58 22 -60 -22 51 8 -42 16 50 -22 -54 40 65 -44 -48 64 46 -55 -49 67 29 -60 -31 40 -10 -56
2355 -56 -1 36 -40 -53 39 47 -43 -53 51 52 -44 -46 54 34 -44 -4 54 17 -44 22 54 -25 -35 47 58 -30 -46 49 53 -51 -40
$$ packed form
2166B3P0j35m7J56K4j72pJ67qj56J8J52l9j42P9R5q3p3J21M8j41m2J48K5j55L
2192g1J57j0j44J4J36l9j18O3J01r5p9J13M8j21l6J34L3j55j5J65jj43J0J41m2
2217D6j14O0Q3q7n1R5M6j37j7J41J2j51qJ49Kj61K2J26k3j13N8R3r0n1R6N2j14
2244c6k1J40Mj45pJ55Kj60PJ33j2j23M4P8o1p0R7M1j11k0J22Oj40KJ35Mj42K3
2272e5J09k2r5K2J00n5n4P0N0j05k2J14J3j30OJ30j4j19J1J10k2r0K3Q3m9o4O9
2299A4L8q4j9R3Pj15J0J17k0j07J6J20l1r7L8P6m4n9O0N2r2l6J16j0j05J1J08
2326E7j0j23L6R8l6q2L8P3m3n0N8L4p2l2R4K5j09mJ12j8j01OJ16l8q9K9P1n0m6
2355e6N5L7p6j3R2Qr0j0J04Jr6kJ00k0p8M0N8l7o1O6L2p9j0Q2J1q8j6R5Mj04J1
$$ plain form
2386 -40 45 23 -58 -20 49 -6 -50 7 39 -25 -48 30 44 -43 -55 44 37 -55 -43 50 34 -34 -12 53 5 -35 22 49 -16 -39 52
2417 52 47 -42 -41 41 38 -49 -35 28 18 -48 -26 36 0 -41 -1 40 -12 -42 34 38 -36 -38 47 38 -44 -26 45 27 -42 -10 37 -2 -27
2450 -27 3 48 -20 -44 38 45 -34 -35 44 39 -40 -33 46 25 -37 -12 41 15 -27 8 35 -16 -32 17 33 -30 -34 38 26 -41 -34 32 19
2483 19 -41 -2 26 3 -37 5 23 -14 -29 19 26 -27 -29 31 34 -38 -29 46 32 -24 -5 36 15 -31 10 38 -1 -24 25 33 -29 -30 26
2516 26 26 -37 -35 27 6 -42 -23 36 -6 -38 7 29 -10 -21 15 28 -6 -18 42 35 -31 -18 45 20 -26 -20 33 13 -25 0 33 -14
2548 -14 -11 23 17 -33 -19 24 22 -38 -21 29 19 -23 -13 39 2 -26 5 22 -12 -20 21 31 -24 -20 39 26 -31 -10 38 25 -14 0 23
2581 23 7 -26 7 32 -9 -14 34 21 -15 -10 23 19 -21 -10 31 20 -26 -15 23 11 -25 11 27 -6 -28 16 24 -18 -26 9 17 -39 -19
2614 -19 11 13 -27 -13 14 3 -27 6 22 -8 -13 26 30 -10 -13 24 24 -13 -10 26 14 -24 -16 14 -3 -28 -6 5 -12 -22 15 16 -25 -30 24
$$ packed form
2386d0Q5k2q1L8O9n5m4N7L2o4k3P8J4q7j2R9pr2J2R3j6o8K2O5m8m0N7K7o5k3R1
2417E2nq9JQ2lq7J4O3j0o6K2O2l6m1M0M1n2l0P6Mp4kQ5rq2J8P1j8o9L2M7l9k5
2450b7L0M5o8k4Q2Pp9jP9np9PP9k1o2K5N3k6m2L5K7n1j6M9J6o3mP2j2o7PO6j3
2483A9o0L9K8k3m0M2J8l7j5M8Pn3kO0Lp2RP5j4n6J9M1k1m6M1K8l9k3M9Qo2jN6
2516B6%o3KO2k1m8J9N9m2l2M5K2l9j1L6J3l4j2O0po6J3O3k5m6ON3k0l8K5L3m7
2548a4LL4on0J4M3ko0J7N0j0m2J0N2l7k8L1J7l4qM1J0n5MN9j3n7K1M8j3l9J4K3
2581B3j6l3L3K5m1nM8j3l6NL3mm0J1M1j1m6J1L8j2l6L6J6l3k2M4Qm2qL5Qn6K0
2614a9L0Km0J4K7j1l0L3J6l0nL9Mm0lL7%l7LL6j2l8QL0j7k5K2J1j7j0L7Jm1nN4
$$ plain form
2649 24 15 -20 -13 29 14 -29 2 18 9 -2 19 20 1 -19 23 27 -16 -13 30 25 -12 -8 38 14 -25 -8 13 0 -24 1 17 -21 -21 10 10
2684 10 -25 -15 12 3 -23 -15 17 6 -25 -10 19 0 -19 4 24 1 -16 11 5 -21 -15 22 15 -16 -12 18 9 -4 -8 23 9 -23 5 11 -6
2719 -6 -15 20 18 -20 -13 14 23 -17 -11 21 -1 -28 -4 15 -6 -25 -11 -1 -14 -12 9 11 -15 -15 14 22 -14 0 32 21 -14 2 24 13 -3
2754 -3 -6 17 4 -20 23 11 -15 -13 6 6 -26 -7 10 -5 -24 -16 12 0 -20 1 4 -10 -13 11 14 -6 -10 19 7 -9 -6 23 12 -5 2 18
2790 18 3 -6 13 13 -11 -5 5 5 -8 -18 7 5 -16 -19 11 11 -17 -9 11 0 -17 -6 -8 -21 -8 8 4 1 -6 12 1 -15 -6 17 18 -13 -6 2
2828 2 1 -13 -4 11 -9 -3 9 11 -8 -11 12 9 -6 -9 14 5 -11 -1 10 -4 -3 6 8 -11 -6 -1 -2 -11 -13 3 -7 -21 -18 12 -7 -9 3 7 -3 -5 -2
2869 -2 9 5 -1 15 5 -18 0 23 18 1 6 17 7 -9 -10 12 12 -9 1 5 -5 -11 8 6 -9 -2 17 12 -11 -5 9 7 -5 1 10 1 -14 9 8
2908 8 6 -1 0 4 2 4 13 18 -7 15 16 2 0 5 11 -8 -18 0 1 -8 -1 8 4 -20 -13 -6 0 -15 -10 3 9 3 0 6 0 4 2 19 -5 -2 10 7 -11 -11 15 7 -14
$$ packed form
2649B4rl5PM2j5m3L1J6rj1K1Jj9k0M2Mm3LM3nl7MM6k4l9J7K1j3k4K5J6l8%L1%
2684A0l5J0K7rk6QL2j1l1J5K9j9j9K3K0k3j7K7ok6OL7pl1ML0rj3mL1j4l2K8Oj7
2719frL5kl8PK7Rm0OL2k2k7K4J9k1j9J4J0j3KK1Kk6%K9Ql6J4L2j1l5J6K2j1j6
2754clK3j3k4M3j2k6KJ9%l2J9J7j5j9QK8j2k0K1Lj4lK4Lk0mK9j2j6LK9j1j7PJ6
2790A8j5rJ9%k4OJ0%j3j0K5kk1lL0%k8QK0j1j7J1kj3J3J6mlpJ8j1j6RK3Jl1PQ
2828Bjj4RJ5k0OJ2Kj9lK3lj5lK3rj6J0J1j4JRKj9NNjrkJ6j0j4LL0j9kJ2Mj0kL
2869bJ1moJ6j0k3J8K3nj7NJ1j0j6jK2%k1J0Mj0oJ9kj5PJ9nk3OJ4kj2ORrj5K3j
2908HkpJMkKRNk5K2Jj4kNOj9j0J8JrPRmk4PPOj5NJ3OolOoMkJ7k4LJ2lj8%K6qk1
$$ plain form
2955 -14 -9 -6 5 -13 6 7 11 -4 14 0 5 8 3 3 -8 0 3 10 -12 -6 -9 7 -7 -7 5 2 -12 -1 5 -10 -5 7 8 -10 -8 4 8 1 0 20 -4
2996 -4 -6 2 1 5 -8 2 3 0 -11 5 5 1 1 14 4 -3 -1 -3 -7 -10 1 -13 -7 -11 -11 2 -16 -15 -5 -7 -15 -19 -6 -2 -9 3 4 5 -6 10 6 5 3 13 12
3041 12 6 8 14 3 -10 -1 -1 1 -14 -5 8 -5 -13 -8 7 -10 -23 -3 -1 -13 -12 -3 -7 -8 1 2 -1 -3 7 18 -2 -7 6 -7 -6 -1 14 0 -3 -6 10 13
3083 13 -3 2 -3 -4 -9 -6 2 -7 -19 -1 0 -15 -13 -2 -5 -13 -11 -6 -4 -18 -2 15 3 1 3 0 -3 -4 0 4 -1 -5 -7 2 -12 -4 13 2 5 7 -3 -5 -6 -5 0 -1 -5
3130 -5 -3 20 -4 -1 1 -3 -3 -6 5 -3 -17 -7 -4 -4 -3 -15 -3 -10 -18 -17 -1 -3 -9 -8 -2 -5 -4 10 1 -5 1 8 -2 -1 8 10 -5 -5 1 -5 2 -10 -1 -9 -5 2 -4 0 -10
3179 -10 -5 6 -4 -11 -5 2 -13 -19 -8 -2 -10 -20 5 0 -9 -9 2 -20 -6 -1 4 2 -4 5 9 -4 -6 8 10 -1 -2 15 10 8 -7 14 4 -11 9 14 -8
3220 -8 -9 -2 6 0 -8 -4 13 -19 1 -3 -7 -7 2 -1 0 -13 1 8 7 4 0 4 -5 -6 2 8 1 6 0 12 -1 13 8 8 14 14 1 4 -5 3 9 4 -2 -6 1 3 -4 5 -3 -19 -8
3271 -8 1 -7 -11 -4 3 2 -3 2 14 3 0 10 1 -3 -11 -4 8 1 4 9 4 4 -5 -4 0 -6 -3 11 -6 -10 3 -10 -10 -12 -6 -8 -8 -1 -6 -10 -10 -3 -3 -5 -14 -10 4 10 -2 0 6
$$ packed form
2955a4NLJ1j8J9JMj5J8j4NLn%j1QLPk2OlJ6j4%J2lj4J1Oj5NJ2Jj8KJ2MpjK0k4
2996dkQjMj3J0Jlj1J6%m%J3j0pKkmlJ1j4Om%J3j8JJ0kqmJ3MpJ2JJj1J6mjkJ0j
3041A2oKOj1j3R%Kj5RJ3j3qNJ5j7j3K0Kj2JRmjRJlkJ0J1k0nJ3j3JNJ5j4llJ6L
3083A3j6NnjnLQrj2J8Jj5KJ1lqKNKj4J6J7j2kKlljMMnmkRj4QJ7j1LKj0kjJNjm
3130eKK3k4LKm%lJ1qj4J0L%Jj2J2pqJJ6koJOlJJ4roOPj0JRKj5%OoPj2RqMPoMj0
3179a0NJ1j0pOPj5oJ1Oqj0K5nr%J1k2J4NNkoRMj3kJ4Kj1jJ7nkj5K1j0j5K0Nk2
3220hjPQoqMJ7l2K0mm%RlJj3J4PjlmMrjQOpNoJ2j3J4n%O%j3LrQOnomPKpRqj6J1
3271hRqmPPjnNJ2j1lJ0rmqPJ2pLNn%rJMoLJ4j7mJ3j3%kOk%Pnm%P%krMJ4Oj2KO
$$ plain form
3322 6 3 -7 4 1 -9 -2 9 -1 0 0 1 -8 3 0 3 -3 -9 3 8 3 -10 0 0 -12 -7 12 -8 -6 8 -5 -4 2 -6 3 -1 -13 -1 3 -13 -4 -8 -12 -11 -10
3366 -10 0 0 -7 5 8 -4 -8 -3 3 -1 -1 6 -5 -1 0 10 11 3 -4 1 -10 -3 -9 3 -8 -15 1 -10 -13 -13 -10 -3 -10 -3 1 -10 4 -2 5 -6 -8 4 -7 12
3410 12 -6 -2 3 -5 2 -1 9 6 -5 7 1 7 7 0 5 2 6 7 -9 -2 -8 1 -16 -9 3 -2 -17 -15 0 -7 -6 -1 7 -7 3 -4 4 4 -1 7 5 -5 3 5 7 -7 1
3457 1 19 -1 0 -7 5 -6 -8 3 0 -4 -4 4 8 -3 4 7 1 -5 -8 14 -8 -12 -8 -11 -5 -6 -8 -4 -7 -12 -8 7 -1 -4 0 11 8 8 3 0 -3 1 15 -1 5 2 12 9
3505 9 -12 8 0 0 -5 -3 5 -8 6 7 2 -4 2 3 3 0 1 1 -7 -4 0 -7 1 -7 6 1 -6 1 4 5 3 3 4 -4 3 14 13 4 2 -3 6 5 3 0 7 8 -5 -2 -14 -18 -12 -11 -7
3558 -7 -16 -17 0 -14 -16 -8 4 -6 -4 6 -3 -2 -4 2 -5 -3 -3 -3 5 -7 -8 -7 -1 -13 2 -7 -3 -9 9 4 -1 -6 -6 -1 -3 -13 1 -18 -7 -1 0 -2 -13 0 6 -13
3604 -13 -9 -4 -7 -9 -7 -6 -5 2 -7 -1 -5 -5 2 4 -1 -8 -10 11 -1 6 -3 9 -1 -6 -1 1 -3 0 -5 1 -3 9 6 -3 0 5 4 3 1 -7 -5 -8 -2 0 -3 -7 -15 4 -1 -7 -8 4 6
3657 6 -1 0 -5 2 4 13 8 16 14 8 3 -7 10 -1 -1 -7 7 0 1 -10 -5 -4 -11 -18 0 -9 5 5 -12 1 -6 -9 2 -2 8 0 0 -5 1 -5 -6 -9 -5 7 6 -5 -3 -2
$$ packed form
3322Flj0J1lj0PJ1j0J%JrJ1lLooJ2Nnj3J0%j2NJ9k0KJ4j3JOqRmj2J2Mj6RmmJJ
3366a0J0%pJ2Lj2mNOm%Pj1MJJ0JqpNj1PoJ2j1pJ6j1l%LPpPMj1J4oPj1kJ2j1J9
3410A2j8MNqPlJ0lj1J2oO%pNlMJj6PoRj7PJ2nj5KJ5pJNQj4J0pQ%nQkj0QKKj4Q
3457AJ8k0JpJ2j1kJ1lm%QMj1PLoolK2k2mMlOjkMlnMJ5qlMJ1l%nllMJ4j6OlJ0l
3505Ik1K0q%nKQj3J4JnoOJ%lJ%qLMpQqJ3npPLJk%JqPJ1jrknRjklPJj3Lj2mOJM
3558grjJ7j4kQJ2j0KJ0rJkOpK%%Qj2jJOj2J5rMoJ8nnn%Nkj0J4j9J1OJkj1J3Oj9
3604a3MNlkKJJPrOm%PKnpkK1j2PrJ2j0nNKmLnOmJ2lrLNjjkqKlOKlmqJ9nojJ2K
3657FpJnPKRnQkonj0J7j1%oJ4pJj1NJppJ8rJ4%j7J3plJ1mJ0q%nOojlMJ2jj1KJ
$$ plain form
3705 -2 -3 -4 -1 -7 6 -3 -4 11 2 2 -5 1 -5 -6 -9 4 -7 -11 -10 -18 -8 -6 -8 -4 6 -1 -7 -6 -4 1 1 -8 -8 5 -4 -3 -5 -7 0 -12 0 8 4 -6 1 2 3 -2 4 6 0
3756 0 0 3 6 -8 -2 -2 4 -6 2 2 0 -15 -8 -5 -12 -10 -6 -12 -7 -4 -1 0 -1 -4 -6 -2 -9 8 9 5 6 8 9 2 7 4 10 -1 -5 1 4 -3 -4 12 -14 -4 -4 -5 1 -9 -2 -8
3808 -8 -4 -1 5 -3 -17 -8 10 7 -4 -6 3 0 -1 -8 4 -3 -5 3 -5 0 1 3 3 0 0 -1 11 5 6 2 -4 2 -7 -2 3 -5 -4 -5 0 -3 -12 -10 -5 0 9 -7 -7 -4 -5 3 -6 -7 -3 -3 -16
3863 -16 -2 -3 -6 -5 -1 0 1 -3 1 3 -1 -2 -2 3 -2 8 2 -7 7 1 -4 2 -3 2 3 -3 -10 -17 -7 -1 -18 -5 -10 -4 -8 -8 2 -1 -2 1 6 0 -4 -2 -2 -5 -2 -2 -2 -4 4 -1 1
3916 1 -10 -1 1 7 -5 13 3 3 3 -1 9 1 11 9 0 -1 -5 -13 -2 -5 -4 -15 0 -7 -3 -5 -3 2 4 -3 -2 12 2 0 1 8 4 -1 -8 6 0 -3 8 11 9 11 -6
3963 -6 0 -7 -3 5 -8 -14 -11 5 -3 -4 -11 -5 4 -1 6 -2 -9 1 1 -2 -8 -4 -12 -4 3 9 3 5 -11 -3 1 0 -2 1 9 -1 -8 11 3 -1 -6 -9 4 7 -5 -3 7 -2 -6 0 -13
4014 -13 -11 -8 -3 -1 -10 -1 -3 -4 -9 -3 1 -2 -3 -2 0 -7 -8 8 4 -1 -3 7 15 -2 -8 0 11 0 3 7 5 3 5 1 -1 -1 -3 5 -4 12 -8 -4 -13 -12 -9 -19 -16 0 -7 -13 -13
4065 -13 -8 -4 -2 0 -4 -2 0 3 -2 9 6 12 14 9 0 0 0 2 5 0 3 4 -3 -4 -1 -8 0 -5 2 3 11 14 -8 1 -9 5 4 -6 2 -2 -6 -9 -9 -6 -9 4 0 -3 -4 6 -1 5 4
$$ packed form
3705bjjLoJ3rjJ5r%pOojlJ3j1mJqJ0KkMJ0poJKN%r%J3rJkkPj2J2Qmj0PJJnOKo
3756@%LLj4O%Oj0Q%kj5PLpKMoNLLJjlkMpJ7JmJKJpNlOj1mOLpjJ6k6J0%jOj0Po
3808hMLOqj4RJ8lj1kRljpJ2pkQqNJK%l%jJ2oJmoOrNNqJjNlrKNNRj6%LjQrjM%j3
3863a6J4jlJMJJmMKmj%NnJ0orJ4onOnNJoppJ0Oj7J3nOm%J0ljLNomK%lL%%kQnK
3916Aj1RKOj2J8j0%%mJ0qJ0krjmqJ1lJj1J5pMkKNKpJJ4j0kJPmnpJ4olJ1LkKj7
3963fOpMQj3oLJ6qjpORnPqpJ0%loMqQPOoKj6QMjkLQj0pJ9qmnlJ3Lj2KJ0rmOj3
4014a3KLNKrRkjnOMljJKpjJ6mnkJ0Qj7oQJ1j1LMkkKmk%kQrJ6k0MrJLj0LJ6po%
4065a3NMKKmKKLnJ1lOKnr%%KLnLJpjLpQnPJQLk2Rj0J4jj0Qmml%LlJ3mljJ0pOj
$$ plain form
4118 4 -2 4 -1 2 15 0 17 10 -2 8 -15 13 -1 -12 2 0 -13 1 6 -3 -1 -7 -6 -5 -7 5 2 0 -5 -2 6 -8 -8 -5 8 1 -7 -7 -5 2 0 -2 -3 -5 0 -3
4164 -3 8 -6 0 3 7 4 -2 9 -7 2 1 4 7 1 -3 -10 -11 -14 9 -17 -6 -9 -9 -6 -9 -8 -10 1 -5 -5 8 -5 4 9 2 2 5 -1 -4 -3 4 2 -5 6 6 -5 5 1
4212 1 -2 -2 6 6 -3 -2 -2 -1 -3 0 0 -6 -7 -9 3 -3 -4 1 5 3 -6 -10 1 -11 10 1 -2 7 10 8 0 8 0 -3 -5 5 7 4 1 2 5 9 -9 5 -1 5 9 5 3 -2 -7 5 7
4265 7 -4 -7 -3 7 5 -5 -7 -17 -12 -11 0 4 -10 5 -8 -2 -7 -1 5 0 -4 -5 1 -4 8 4 4 5 10 12 2 -12 1 1 -2 3 -1 -5 0 -7 -2 -1 -11 -9 -7 -6 -6 -1
4313 -1 6 -5 6 1 -2 -3 -9 1 -6 3 -7 -7 2 1 10 6 1 6 2 3 -6 1 -1 15 -3 1 -1 -1 8 -8 -7 -17 -4 -17 -9 -8 -8 -12 0 -12 -10 -8 -8 -8 -14 -13 -2 6
4361 6 -2 3 0 -4 -5 -3 -11 3 -1 -6 -4 -2 5 -5 -5 -9 3 6 -6 -4 -5 -8 0 2 5 -2 -1 6 1 -7 4 -5 -4 2 -8 -10 -7 -6 3 2 0 -2 -1 -2 -5 3 4 4 2 3 3 7 -3 11
4415 11 3 2 6 5 -2 3 4 -6 1 -2 -6 -9 -6 -5 -17 -10 -1 -12 -2 -3 -8 -11 -3 2 -16 -2 -3 -3 -5 0 3 12 -1 -4 -3 -4 8 -3 5 -4 0 11 0 11 11 8 5 -3
4463 -3 -7 1 -4 -2 -8 -6 -19 -1 -3 -13 2 -12 -18 -10 -5 6 1 2 2 11 4 6 -6 7 -7 -4 -1 8 5 -7 3 2 -5 1 1 1 0 -1 0 5 2 -3 5 -2 -2 7 1 -1 1 1
$$ packed form
4118DoOnLJ3j5J7pj2J0k3K8j4j1J4kj3J4NrKoJJkJ2lknLQj4%LJ3pq%KPkkjkNl
4164cJ1j4OLMloJ1j6RjLLompjlK3k6J1l%LlJkJ1o%J3j3RNp%LolJPkpJ1%j1J0m
4212Al%Q%rJ%JkL%ojkJ2ojNMkrmJ1j2K1rlRLkqQqlkJ0KllJLMj8J4oOMmknnJ2K
4265Gj1lMJ0kj0kj0NJJ1Mj4J5j3OnOOnmjOnJ2m%JNKj0j4J3%lNmmNpNJj0KKJ%N
4313aPj1J1nljoJ0pRj0%RjRmnNmJrPkJ6j8Mk%Rj6Jj0J3j3QJ%mJ2j2KK%%oJJ1Q
4361FqNlmjKqJ4mnKKPj0%mJ2Lj2KjlQKLpJPnqJ1rJOj0kLJRjkkJjlQJ%kJ%Mj0J4
4415A1qjMjpNJj0PlmlLJj2PRj1J0jnlQNj8J4j%kNLRj3lJjJ2j1QrMJ1j1J1%llq
4463cmQnKoKj3J8kj0J5j4oQNJ1nJ%RpKj2J3j4LLRlj2J0jpO%%jjJNlnQp%RokK%
$$ plain form
4513 1 5 0 3 0 -5 -7 -8 -6 -8 -1 7 -1 -9 -8 -8 0 -2 1 -3 -5 -2 2 1 4 -6 -5 1 1 -3 5 2 -11 5 -9 -2 4 -9 -9 -7 -13 -11 -1 -7 -8 -8 2 -9 -2 0 -4 -14 -6
4565 -6 -5 -1 -7 -6 4 6 3 -2 -5 -18 7 5 6 2 7 -3 0 6 -2 5 -2 -6 3 -1 -10 1 2 -8 -10 2 -1 -3 -3 -7 -12 -2 10 -1 4 -11 -4 2 -13 -6 2 2 4 -5 -4
4614 -4 4 -6 4 -5 -6 3 8 13 21 1 17 3 6 -4 3 3 19 -2 -6 -8 -18 2 4 0 -7 -12 -8 -7 2 -8 -4 -9 -18 0 -5 0 7 -4 -1 -4 -4 -6 2 -9 -9 -4 4
4661 4 -5 -2 -2 0 -5 -4 -13 -7 -3 -3 -10 6 -3 -4 5 2 -3 -4 -15 -8 0 -1 -9 -2 -4 -7 -10 -3 -2 -10 -2 0 7 -4 -7 -2 3 -1 12 -1 4 -3 -3 5 0 4 3 -2 -1 4 -4 -5 0 -8 7
4716 7 7 0 1 -8 2 -2 6 -6 -1 -3 -2 2 -11 -7 -7 0 2 -1 -6 -4 -2 -14 5 -6 5 4 -3 3 6 9 -3 -2 1 7 14 -3 0 3 8 10 -2 3 -9 7 1 -6 1 4 -11
4765 -11 -10 -1 -5 2 5 6 1 -7 1 3 -2 6 -5 -5 -5 -4 4 5 10 -3 6 -1 -2 0 10 -6 12 12 11 1 1 5 7 3 -6 8 2 -5 -5 2 4 -7 -13 -6 -14 -2 -7 8 -4
4814 -4 -10 -5 -6 -4 2 5 -7 5 -3 13 5 5 0 0 3 3 -8 2 1 6 2 7 2 6 4 2 -9 -4 5 1 -15 -9 -4 -9 -4 -7 -6 -10 -10 -12 -12 -2 -4 -6 0 -7 -6 -4 1 -1 6 -1 -2
4867 -2 7 5 8 2 -5 5 10 10 -4 3 -12 -12 -9 -2 -11 -8 -3 -7 6 -2 -3 4 -1 4 -7 -6 -2 -1 -5 6 -2 -13 -4 -3 -3 5 2 -2 -2 2 8 -3 4 15 7 10 11 4 11 -2 8
$$ packed form
4513AMnLlnkjKkPQqqJ%QkLmkLMjLj0JO%mQlj3J6j4POj3%KoKJ0oj%J0j1PKmj0Q
4565fJMoJJ0Klnlj3K5kJmNj0LOqPpmRmrJ1Jj0kJ2lk%mnJ0J2j1Nj5POj5PQ%KrJ
4614dQj0J0rjRNNQk0J6j4Lj0P%J6k1mkj0K0KmpnMJRj0MnrJ8nNPj1Ll%kQj1%NQ
4661DrL%KnJrOM%pJ6rjRlnjj1PQjqPkllPJqQKPj1lNNmJ3j3Np%QnMjnJNqjNqJ5
4716G%pJrJ0mQj2NkJMj3M%PKlnKKj2J9j1J1jpOLLj2JLOPj7LLNKj2Nj2J6opPLj5
4765a1JRmPLJnqQKnQj1%%JQJNj3RpjKJ0j6J8%jj0%MKmrJ4op%PKj1oPqJ2nJ5j2
4814doNjKOLj2J2qJ6q%n%L%j1J0jNmNnMkkj1NRmj6ONnNlJm%k%J0kkOpJKNkPpj
4867bRkLopJ0N%j4Pj5%LPrLNmJ3qjPnNj1JMJmJ1qj1RJ%Qlm%MOj1PJ1qLJpPj3J0
$$ plain form
4918 8 3 6 7 5 9 1 -1 11 1 -7 -1 -5 -7 7 -1 -10 -8 -2 -2 3 7 2 -2 7 5 7 10 1 0 8 -9 3 -7 1 -1 6 6 4 12 1 3 4 6 14 3 4 -14 3 9 2 -2
4969 -2 2 3 -6 1 1 -4 -11 -4 -7 -11 1 1 1 1 0 -13 2 4 0 13 3 9 3 1 -7 15 3 -7 8 0 8 0 2 -4 2 4 1 -11 -4 5 3 8 1 7 -9 -8 3 3 -2
5018 -2 -10 -5 4 -4 -12 7 3 2 5 4 0 6 6 -4 -1 -7 13 4 -4 -3 0 15 -5 4 12 11 4 5 0 4 5 0 -3 4 -4 -4 1 -7 -5 -4 -1 -5 -9 0 -16 1 -6 -8 -10 -3 -9 -6 6
5071 6 4 1 8 -10 6 -6 0 -4 0 8 -1 20 6 9 -5 7 6 6 1 4 -2 -1 -5 -19 -4 -7 -7 -15 -20 -6 -6 -3 -3 -12 5 -13 -8 3 2 -8 -4 5 -6 4 3
5116 3 -5 10 15 -9 -4 6 6 -4 2 -5 0 1 -1 -5 -3 -4 1 4 -2 -1 -4 -5 -4 2 -11 -20 5 -14 -6 -1 3 -4 -12 -2 2 -6 -4 -1 -8 3 4 -2 0 0 9 10 -4 2 12 9
5166 9 9 2 0 0 1 2 -12 -1 12 0 2 2 -6 0 3 3 -4 -5 -2 -9 6 5 -2 -9 -10 3 -12 -5 1 -4 -1 -6 3 2 -1 7 3 5 2 13 3 9 8 -7 0 8 -1 3 -1 6 1
5217 1 -4 3 -2 1 -10 -6 -1 -10 1 -17 4 -7 4 -13 1 -1 14 14 -7 -6 6 -2 -8 1 -4 6 3 5 -3 -2 3 4 6 6 11 -1 2 7 3 -2 3 4 -1 -3 -12 1 -16
5264 -16 -5 -2 -4 -7 -3 -2 3 -5 -6 -14 -7 -4 -5 -1 -1 4 -8 3 1 -11 -7 1 1 -3 -1 0 -9 6 2 -3 -5 -1 3 0 -3 -4 -2 0 0 -10 -2 -2 -3 3 -3 -7 -7 -8 -2 -4 6 -7
$$ packed form
4918HnLJkMqkJ2j0qOmkJ4qrKO%NMnmRkKLrjQj7J2j0QkP%kQj1KJKQj1Jj8J7Opm
4969bMJrP%npPlmJ2%%%jj3J5KmJ3j0OokqK2j2j0J5qQqKoOKlj2PRkNpOj6JJ1%n
5018bqNRqqJ9mjLjmO%j0LoK0rqJLJ5k0RQjpJnMJnlPq%NqKJLmmRj6J7pkkPoLJ2
5071FklPj8J6j2OmMQrK1j4Lj4J2j%nLoJmj4J5l%qnJ4%L%rJ7j8NJ1jj0MRj1J0j
5116CqJ5Nk4NJ0%j0OpNJkmKjNLoJljJOj3rK5j9QNMpqJ0MqKLpJ1JoK%RJj4OJ0l
5166I%pk%JJj4J1J3j2K%qOL%pjLpJ5jppjJ3j5POnLnRjlQmKlJ1j0Ojj5PQrMmPn
5217AnPnLj1MNrJ1j8K1j1J1j7J4kJ5%k1JJ2qoRnJ0lKqJNJK%Nj2LNmnNJnkrJ3j7
5264a6J1LklMJNqjqPLjM%Nj2J1kj2MQ%mKJrJ5mnkMMlljKK%j0Q%jOom%jOkJ0j3
$$ plain form
5316 -7 -8 -12 -1 2 1 1 0 7 6 4 4 -3 -1 7 -4 6 -1 -9 -1 -4 -1 -4 -5 -2 6 -2 9 7 1 2 3 0 5 9 -4 1 -11 6 11 0 -10 -2 -4 0 4 3 7 13 -1 -5 -1
5367 -1 0 4 9 11 7 11 12 15 6 13 4 11 -6 -2 -2 3 5 -8 -7 -1 2 -8 5 1 6 5 -2 -4 1 3 0 6 6 10 7 4 7 2 1 1 3 8 4 2 9 6 -7 2 7 5 3 3 1 11 17
5422 17 9 -2 3 -3 0 0 -5 -1 0 -9 4 -3 -2 -13 1 -2 0 -15 -2 -1 -1 3 6 10 15 -3 4 -6 6 5 7 -5 0 3 -5 2 -1 11 -4 6 1 7 -2 -3 -6 6
5468 6 -1 -7 -8 -3 2 -8 -3 -3 0 3 0 4 6 7 -4 -4 -4 1 3 0 8 -2 6 3 -3 9 5 4 12 -7 -6 4 -3 5 2 -4 7 2 -11 -4 10 2 -2 1 -7 -1 -10 2 10 -3
5518 -3 3 -1 -3 2 6 1 0 -1 10 -9 5 3 4 2 1 2 9 4 15 13 2 9 6 2 5 10 3 3 -5 -5 -4 3 5 0 4 0 -7 -2 8 -2 -17 3 -5 -7 -4 7 1 9 4 -9
5568 -9 3 1 -2 5 7 6 7 7 10 10 5 7 7 3 16 14 -10 2 5 4 6 0 9 2 -2 4 -1 6 14 -6 -8 -5 -6 -1 8 -6 -2 -10 3 5 -2 0 5 0 6 11 2 7 6 5 14 13 4 -2
5622 -2 0 3 -1 3 1 -3 12 -3 -6 2 5 -7 1 -1 4 4 3 -6 -3 -4 -8 -5 -10 11 -4 -8 -8 1 -1 -4 -2 9 -4 -14 -3 -12 -7 10 14 8 11 7 7 4 2 4 7 -4 2 -5
5672 -5 -1 -3 0 -10 -3 0 -9 0 2 -7 -8 5 -7 0 -4 -2 1 -3 -9 -8 -6 8 2 -5 -6 2 2 4 3 -5 -1 8 8 -1 8 -8 5 5 5 7 0 5 13 11 2 -4 -2 -4 -3 -7 -4 -3 -5 -9 -15
$$ packed form
5316gjmJ1Lj%jPjk%pKQj1J0pqQlLljLQqJ1koJJlNMj3Nj2J7Nj1j0QkMMjMOj4mM
5367aJMNKmMJLrPrPj7M%NKj3JOLj0J3mNjpkNKlO%MllLnj%KNmkPlj3RNkk%kJ0O
5422A7qj1NoL%nMJrJ3pJj1J4lKj5J3J%MLMNj8Pj0J2jKj2NLqPlJ2j5J0nOrjlJ2
5468FpojNNj0N%LLlMKJj1%%NKlQj0QloJ2mjQj9JJ0pQloJ1nj3PJ4qmLqOrJ2Qj3
5518cOmkNMnjjJ1j9J4kJkjJPnJ1kj1PlmLNp%q%JPKnMmpNJ0j0j5K0qkLJ1oQnj3
5568iJ2klPKjJ%L%nK%mJ3kk4J2LjKoRpmOnPQk0kLjNRj4MqJ3KpKNnONrNjjRjro
5622bKLmMkmJ5j5lQLj2QkN%jrLjmLnK1j5m%RklKJ1j3j0J1rNJ7MoLm%lkKLj1Op
5672eMkLj0PLrRKrjJ3j2PmKLmoJKJ4opjQ%KjqMR%rRj6J3%%KpNQkroKkJmLJkmo
$$ plain form
5727 -15 6 -4 -3 -1 -10 1 -3 -5 4 0 -2 -4 4 6 2 2 3 0 -3 -3 2 -7 -1 7 5 9 7 1 -3 1 1 -1 5 10 5 -10 -3 3 -1 -1 -7 -15 -5 -4 -11 -2 -7 -3 4 11 10 4 0 8 5
5782 5 4 7 15 2 1 6 3 1 3 -1 5 5 -1 3 9 4 7 0 -1 3 -4 6 4 3 -4 -5 -10 3 3 1 -11 -5 2 0 -4 -7 -2 -6 3 -8 1 6 3 1 0 3 8 11 4 10 3 8 -1 -4 13
5837 13 10 7 0 0 -1 -7 2 -1 1 -9 -3 -7 -4 -2 12 -1 -4 6 -3 1 -1 -1 -15 -3 -4 -6 -6 -5 -1 3 6 4 -6 2 2 8 11 15 6 -6 11 1 8 -4 16 -7 6
5884 6 12 -7 -9 5 -10 -6 -8 -3 -6 5 -2 -5 -1 -3 0 2 12 -1 6 4 2 8 0 5 -3 22 6 8 -5 -2 4 2 0 2 -3 -3 -9 1 7 3 4 -10 11 -2 2 0 8 0
5932 0 1 0 -5 -12 -7 -6 -8 -10 -3 -1 0 -1 5 2 5 6 10 -2 10 12 2 13 14 -1 -2 10 9 6 4 4 -3 2 -3 -8 -2 1 -2 3 2 -3 1 -2 -1 -14 -11 -2 2 -3 10 -5 -8 -5
5984 -5 1 10 -1 5 1 4 -6 -2 13 19 8 6 10 2 16 6 7 3 1 -5 -5 6 2 -12 -12 -2 3 -14 -8 -8 11 -5 -3 -15 2 -1 -2 10 2 -4 1 6 -4 3 -7
6029 -7 6 1 4 -3 5 9 7 2 0 5 2 15 15 14 0 5 7 10 0 0 2 -5 6 2 3 -5 7 6 1 -1 1 -4 3 -9 -3 0 -5 -9 4 -3 6 2 0 17 13 9 4 3 -4 -3 0 0
6081 0 2 -1 5 5 1 0 2 10 0 4 2 2 4 4 0 -3 1 8 -3 2 -3 4 3 -15 -5 -5 1 -6 -3 -12 -5 5 10 9 -6 -3 17 -5 -2 0 7 14 7 8 9 4 -6 -3 4 1 8 1
$$ packed form
5727a5K1j0JKrJ1mkRmkkQKm%Jll%NrOQkMkomM%kONnj5POm%oqJ0JpRnMPPjomQl
5782EjLQj3jNlkKmO%oMOnLpjMpJ0kjpjnJ3%kj2OPkmlNmRj1RNlkjLNLpOpNrlJ7
5837A3llp%joRlKj0OmLKJ4j3lJ0rMk%j4J2jk%JMMLkj0Q%OLMrj2J7j0Pj2K0k3J3
5884FOj9kJ4j5MkNlJ1plMkLKJ0j3PkkOqNqK5j6Kj3LOkkKn%oJ0OmJj4K1j3MkQq
5932@JjnpNJkkPKJjOlLJMj2J2Kj0J1Jj5jJ2jlk%pNnnOLlNjnMlJj3LRMnJ3j5lL
5984eORj1OmLj0MJ5Oj1kMqJ4j0Jmko%J1mj4%J0Nj7O%J9j6Kj2J7ljJ2qoNNj0Pj0
6029gJ3nLpQMknkNlJ3%jj4NKLj0%KpJ1mJqJ2jnkKnPj2OLnmJ3pRmkJ7mmnjpJL%
6081@KlO%mjKQj0Mk%K%mlMPj1NnPjj8J0%OpLrPJ0Njj5LK0k2LKPPpJJnj0LPlPp
$$ plain form
6133 1 -5 -1 -5 -8 -4 -3 -6 -5 -7 0 9 5 7 -2 6 4 -5 -3 1 4 6 -6 -5 5 -8 -10 7 -1 -3 14 -6 10 11 0 8 3 9 -1 16 6 4 6 3 5 6 -2 -2 -4 -6 -10
6183 -10 -11 1 -5 -5 1 -8 0 -4 -8 3 2 1 5 6 2 5 -2 0 -4 -2 5 -3 -7 0 0 0 4 -1 -1 0 -4 12 -12 5 -2 0 0 6 -6 -9 1 -1 -12 -5 2 -12 4 -2 2 2
6233 2 2 -1 3 1 3 2 -2 9 7 1 0 3 5 3 8 4 9 -6 3 1 -1 1 11 11 7 -1 2 -4 1 2 9 -4 6 -1 -5 1 -7 3 -4 -1 -2 -2 3 -5 -2 4 -3 8 5 -4 7 -7
6285 -7 5 6 12 -2 7 5 -1 1 -6 0 0 -4 -3 1 -5 2 5 4 -2 -11 -1 -2 -5 0 -4 -3 0 0 -4 1 7 -5 -6 -5 -4 2 2 0 8 -2 8 11 -2 -8 3 10 9 3 3 -3 4 4 15
6338 15 8 4 2 -2 8 4 0 -12 1 -1 -2 -8 -9 -3 2 -8 4 -15 -7 -11 -1 9 1 16 -2 5 3 6 3 0 -1 2 8 -5 1 3 11 -2 10 -2 6 0 -6 -2 -3 -5
6384 -5 -2 -2 -7 6 0 0 0 -1 -6 2 -11 -5 -2 -2 2 5 6 3 4 1 -2 14 3 -2 0 2 11 -4 1 0 4 0 -4 8 -4 1 4 -1 1 -1 0 6 -5 1 2 2 4 2 5 -1 2 -1 -6
6437 -6 -4 -4 4 3 -7 -12 -5 0 1 -7 13 2 5 -14 1 12 9 8 5 14 5 1 8 4 1 6 -6 -1 1 5 0 -8 -1 5 -5 -5 -3 6 -13 2 3 -2 11 2 -1 3 -1 -4 -6 2
6487 2 -5 0 16 2 9 4 1 6 1 9 -7 0 7 11 8 8 9 16 7 9 5 -7 5 -6 1 -7 -4 5 -3 4 -4 -5 -9 9 7 2 -4 7 3 3 1 -1 4 15 0 5 8 0 6 -8
$$ packed form
6133AoMmlMJlJkPRmKrQkrKMLKj2JJ0j3kJ7qkJ7k0J6Jj1QnOj0J7j0kKlKJq%kkm
6183a0jJ2o%OrQmmJ1jjMJmLpKmKPqmP%%Mn%JmJ6k4J7pK%Oj2lJ0kj1PPj4J6oM%
6233B%lMkKjmJ1kojLKkNmNj5RkkKJ0%mqLoNJPj3J0pmOqJ0pLj%NqLOpJ1lrJ1j4
6285gJ2JOj4RkoKpO%mJMoPLjorJ0jlNmJL%mNOj2jJJO%kQj0J0Lj3oJ1Pjo%oP%J1
6338A5pmkmJ0mmj2J3kjojONj0J2j9QmJ0J0qJ5j8PkLlljLOj3OKQj3J2j2QooMjk
6384eL%nJ3o%%jnQj3OL%MLJlJllJ6j1nKKRj5NjMmmJ2j2NLnKkJOj1OJ%KkLoLln
6437fK%Qjj0nPNJqK0j1Lj9J5J1ljlRrmPmlNj2NKMnqPOj0%KRj9J5JnJ3rlMmlkQ
6487BpNJ6j4PnlNnQj6PPMl%JPrKmj2J2j1PqLRqPqjmJ8knoJ1m%kkNJ1j5NLqOj4
$$ plain form
6537 -8 4 -1 6 5 10 -8 11 6 6 -3 -1 16 1 3 1 -9 0 -6 -3 1 -16 -2 -4 7 -8 -2 -7 -5 -6 -5 -4 -2 4 -7 -6 5 -7 -1 4 8 8 4 8 2 -5 5 5
6584 5 -7 -4 -3 -12 3 5 -10 -6 -1 -8 -1 -1 -10 -4 -7 -3 -1 -7 4 3 -1 -1 -9 5 2 -17 -4 -3 2 -3 -5 3 -14 -3 5 2 7 -5 5 11 9 -5 5 -4 1 -7 4
6631 4 -5 0 -11 -6 -7 4 -14 -17 0 -11 -14 -9 -1 -6 5 -1 9 2 -1 -12 -1 -9 -3 0 2 5 0 -4 -7 3 0 -6 -3 1 0 -6 1 -1 -8 -1 1 4 6 6 -7 -9 1 -2 -2
6680 -2 5 2 -5 -6 -7 -5 -7 2 0 -5 7 0 -5 3 3 12 8 -1 3 3 1 4 9 6 15 -2 7 -3 9 -1 1 2 4 5 -6 3 6 2 -2 -6 6 -10 0 -1 3 -1 -8 11 -10 -6
6730 -6 -6 -4 7 -2 0 -4 0 -4 0 12 0 -7 2 14 4 7 7 12 13 13 2 3 3 -1 4 3 4 9 1 -10 -7 1 0 3 0 5 9 -3 -7 -7 3 -6 4 -1 2 10 -3 3 0 3
6780 3 0 -1 10 2 10 3 1 5 7 8 17 6 5 8 7 -6 3 11 0 5 -9 -2 -9 -8 2 0 -11 -4 -7 -5 -4 -6 -19 -6 4 -2 -5 18 -18 -3 2 -5 -8 3 7 -10
6826 -10 -5 -5 7 0 -5 -2 1 -6 0 3 -6 -2 -2 -3 -1 -6 7 -9 -7 4 -2 -6 2 3 -5 -3 -2 -7 -5 -3 7 -5 -8 -1 4 -1 -6 -18 4 1 3 14 9 0 9 3 -6 1 0 9 9
6877 9 7 3 -1 -5 -4 2 -4 -5 4 4 -2 -4 3 9 0 2 -9 -6 11 8 -11 4 -2 3 -2 1 8 1 -5 -4 7 -1 3 4 5 7 -1 5 -1 2 2 3 9 -3 -5 2 -10 -2 -10 -4 -4 1 -4 -2
$$ packed form
6537hJ2nPjNj8J9n%rKJ7j5Kkj0RoLMj7J4kJ1j5OnKjJJKOj1JJ1j2ONM%mMopJ0%
6584Ej2LJrJ5Kj5MNpP%rOlMKoJ1jm%qJ4lj9J3JNnkQj7J1QlNj2J0Okj4J0rNqJ1
6631DrNj1NjJ1j8lJ7j1lNQnJ1oJ0plj1J1qOLKLnmlJ0loLMjoPkpPKLK%j3kJ0l%
6680bPlpjjKkRknJ2pnQ%RmrM%kLNlRj7Rj0J2j0KJKJj1RLmmmJ2j6J0jMmpJ9k1M
6730f%KJ1rKmMmMJ2j2pRJ2j0L%NJ%j1J%mNjJNqj1LQjLlNMj2m%J0rJ0nLQj3OlL
6780CljJ1qQpkMKJRj1jLjj3RQj1Nj4PpJJ0kj1PlKJkj3J3J0olK3l6J5NplJ1Mj7
6826a0N%J2pnLLpOLrM%jKnJ3j6KJ1omQJqKJnKKJ0j2lPNnnj2K2lKJ1nrRorPjR%
6877IkmmmJOojR%okPOrKj1LJ7lj9J5oNnLPpoJJ1qMJJKqOoL%JOj2kPj2QqO%NnK
$$ plain form
6931 -2 -13 -5 -4 -2 -7 -3 -3 -7 0 4 -8 -1 -8 2 0 5 -8 -11 -11 0 -1 -2 8 -3 -5 6 -5 -5 -6 -4 -2 -6 2 -1 3 -1 -2 -5 -7 -11 -6 -3 -9 4 -6 -4 -7 -5 -4 2
6981 2 5 1 6 3 -5 3 0 -1 0 -3 4 4 15 4 13 5 5 -2 -3 -5 -2 8 5 4 4 4 -13 3 0 2 11 -2 9 -3 -4 -12 -3 -3 -7 4 -7 -8 -15 -13 4 9 9 1 -5 -10
7031 -10 9 -1 0 10 5 7 11 14 6 -3 0 -4 3 -4 2 7 -9 -2 2 -9 6 1 -1 1 -2 -11 1 0 -15 -7 0 6 -8 -2 2 -7 2 3 -3 0 -2 0 4 -2 0 1 8 0 0 6 7
7082 7 7 -10 0 3 3 4 0 1 -4 -9 -2 -1 -14 2 -9 -8 -4 -5 4 -12 -7 1 -16 -11 5 -5 9 4 7 12 4 3 7 8 1 -1 1 6 2 9 1 -5 8 5 5 -3 4 11 5 10
7132 10 1 4 -4 -7 7 -6 -1 -5 -2 -8 -11 -2 -13 -10 2 -7 -2 -6 6 -2 6 8 11 6 10 7 3 0 1 -1 7 1 -2 -1 6 2 7 4 -1 2 11 6 2 -2 3 -4 10 3 -7 -2 -3 -10 -10
7185 -10 7 0 2 0 3 5 -5 -6 -9 -6 5 -6 9 -3 -1 11 12 4 3 2 -3 1 7 -4 5 7 2 1 -3 -4 -9 -17 -5 6 -7 -5 3 -6 -3 -7 5 -6 1 0 9 9 0
7232 0 5 1 8 0 -5 0 4 -2 6 -3 4 2 2 7 8 5 7 9 1 14 18 9 0 0 10 8 2 -7 9 -5 4 3 -3 -4 -4 -14 -2 -2 -5 10 2 9 0 -3 -4 7 4 -14 1 -2 13
7283 13 2 -2 4 1 2 4 12 -13 5 -1 8 2 0 -5 0 -4 5 11 -2 3 -3 -2 -13 -4 -6 -12 -4 -4 -7 -7 -3 -1 -2 -1 0 -7 2 12 9 9 6 12 0 1 6 5 -1 -1 -3 3 -5 0 4
$$ packed form
6931bj1QJKnM%mPMj2PpJ0kNj3l%J1jjJ0j1kJ1j1%jKKmQlMmjlkmNLoJ3j0KlKJO
6981BLmNlqQljJlP%J1j1Rq%pjkLJ0lj%%j7J6lKRj3J1j2jqR%mJ1j1jpKJ7N%qon
7031a0J9j0JJ0nKMLqrLmPpONj6PMj1J5nkKlrJ2jj5QPOj4OMrRJoLkKMoKJPq%OJ
7082G%j7J0L%JmJnnPJj3J6j1JMjRj6NQj7NJ6j0J4nLNqjMJpkKNmPqoJ3l%qPPoN
7132A0rLqlJ4j3NmLolRj1LJ2rNmJ2qQKLnMlmlJkQolJPmNlnLRnmmNpJ4pj0Njp%
7185a0J7pKkLKj0jlLJ1j1J5j2KJ2JqjjnMOj1RKnjmjnqJ2J1j3KQrLmJ2j1PjR%r
7232@NmPqnNMoQrPk%NJlKKqJ3Mrr%J0korJ6j4Rjoj%j0J2%lJ5qPrljJ1lj8J5lJ5
7283A3j1mOlJKQk5J8oRoknNmROj3NoJj1RkoQ%l%MKjJJpRJ0l%lOj2JNjo%kOqNM
$$ plain form
7336 4 -9 -2 2 -1 0 -4 0 -3 0 -11 -5 -2 -4 -7 -9 5 -8 8 -1 -3 4 -10 -5 -5 8 4 -1 4 5 3 3 4 -2 -8 6 7 7 14 8 7 -2 6 -1 -4 -9 -11 -7 0 0 -2 -9 5
7388 5 -14 7 -4 -1 0 5 1 5 4 -5 16 6 4 -1 -6 5 10 -4 11 15 10 4 18 9 3 0 6 9 8 10 10 9 8 1 12 5 -2 0 7 -5 -8 -3 -9 0 3 -9 -10 -7 1
7437 1 -6 2 -7 9 -5 12 6 4 6 9 7 5 10 -2 3 12 -5 3 -9 -2 18 14 1 6 -6 -1 7 -2 2 0 8 7 7 -5 7 -4 -11 -6 -4 9 -6 -6 -3 1 2 -6 0
7484 0 6 6 1 5 -6 13 7 4 -1 11 -2 4 5 8 -5 2 -4 -6 1 -9 0 -7 -7 -8 0 0 8 4 1 -3 5 -8 9 9 4 -4 -4 4 -2 -6 -2 3 -4 3 -4 0 0 0 -1 13 9 9
7536 9 4 4 13 8 10 11 3 3 1 2 1 6 -3 -3 3 0 -3 -5 -5 -7 -1 3 1 -1 0 4 5 -3 -10 -1 6 2 -6 5 7 3 10 1 -3 5 10 -2 1 12 7 11 1 5 7 6 11 0 1 1 -3 5
7592 5 -3 -3 -11 -7 -2 3 5 -10 0 6 0 2 -4 -3 7 3 -3 7 -1 -1 -2 5 1 0 1 -1 10 9 7 8 3 2 7 -2 8 0 10 -1 -12 0 5 -2 5 1 -4 3 2 -2 -4 1 -3
7643 -3 -2 -9 1 -1 -1 -8 -5 5 -2 3 3 -4 4 -2 6 -5 6 1 14 -4 1 12 -6 10 0 3 0 -2 -5 6 3 6 0 -1 1 -3 -1 -9 -4 -5 -3 -3 -1 -1 4 3 -5 -10 6
7692 6 5 2 1 -1 2 6 -8 3 7 -8 -1 -12 7 2 -4 -5 16 -7 3 -3 -7 -6 5 4 -6 -2 -5 -1 -2 5 -2 -9 -6 0 4 -3 3 2 2 -2 8 3 2 11 10 1 -9 -7 -1
$$ packed form
7336Dj3PMlJmMlLj1OLklkJ4j3J6rkPj4N%J3mnNJk%JooJ4J%PojrQplnkMP%kpJ4
7388Ej9K1j1LJNmMjrK1j0knnJ1Nj4J5MnoJ4rolOLjK%jjpJ1ppKPj2lNoRLj2jLQ
7437ApQrJ6j4J7okKLkkNj2NRj7Qj2PK0mj3Nj2NQrMkQj%j2J2j1pNKJ3j5%LMJqO
7484@O%nMj1J9olnJ2j3OJLj3PokPj0Rp%jQ%QmlmQj3J7%nq%QomMNpPpM%%jJ4m%
7536In%RnKJq%kJjNr%Ollk%kOMkkJMJqpRPmqJ1KmPrmQNj2LJ1nMj0MKjNj1J%mQ
7592Eq%qMNNKj5J0OoKoJJ0moJ0q%jPmjJkJ1jkJnjNrJ0qJ0j1j1J2NpPmnPjmkNm
7643cJpJ0k%pLJ0pN%pQoQj1J1nJ3j8NJ1j8J6j0LlklJ1lLojKmKqNjK%K%NjqnJ6
7692FjljkLMj4J1Mj5Pj1J9nojK1k3J0omJJ1jj0MlMjPppLOMpOj%mJ0njRjrj0KO
$$ plain form
7741 -1 0 5 -6 6 -1 -10 -2 0 -4 6 -3 -10 -5 -8 2 2 -13 4 -4 -4 -12 -8 -1 -10 -1 -2 -2 -2 -8 -5 -18 -2 -3 -1 0 -1 -3 9 6 14 4 -3 7 -1 1 7 4 1 4 4
7791 4 1 3 -1 -1 10 -4 -10 6 -6 1 -15 2 -2 -4 -7 -3 -5 -4 -5 -15 -6 -8 -6 -2 -4 10 -4 -12 -4 4 -3 -5 -2 3 6 10 11 9 5 2 6 -5 -2 -7 3 -6 6 -8
7839 -8 6 7 -2 -1 -11 1 -4 -1 2 -2 -5 -4 -3 -4 0 -5 -6 -2 0 11 -7 2 5 10 -3 1 -1 9 -1 -3 5 10 10 -2 4 3 0 3 8 10 8 -1 -2 -4 -1 -9 3 3 -1 -4 -13
7890 -13 -7 4 1 1 -7 -8 -14 6 14 -8 -7 6 3 12 4 5 5 0 5 6 5 9 7 -1 2 5 0 10 14 6 7 -1 4 -2 -1 6 -5 -9 8 -3 -4 -8 0 -9 -6 -7 -2 -3 -3 0 1 -8
7942 -8 3 8 -8 9 4 -1 13 5 6 2 9 9 9 4 -3 -4 -9 -1 3 -5 -5 -14 4 -8 -4 -10 -8 -10 2 -6 1 -4 1 7 -3 -12 1 -2 -13 -4 -1 -2 -8 -3 -2 -2 -2 5 -4 1 1
7993 1 -2 5 1 -4 6 5 6 8 -11 3 3 -2 4 -2 -6 2 -1 -5 -1 -15 -13 -8 0 -6 -5 1 -13 -3 -1 -5 6 -11 0 3 -5 -4 -9 -9 0 -3 -2 1 -3 -7 3 -4 5 -3 -4 -8 -12
8044 -12 11 -3 5 6 -2 5 11 -2 2 -3 3 -5 -6 -3 2 -5 -3 -15 -4 2 10 2 -2 0 1 4 1 2 8 -2 10 8 7 8 -1 -3 -2 2 5 1 -5 -3 2 2 0 -6 3 -1 -4 -3 1 -11
8096 -11 -1 -13 -6 -2 -7 -4 -9 -1 -10 -2 -4 -2 3 -7 8 -5 -4 -5 -2 5 0 1 11 6 -1 3 -5 -2 -8 1 -6 -1 -13 -7 -9 -18 -10 -9 -9 -3 0 1 -5 0 -2 -8 -3 -4 -6 -6 -2 -6 1
$$ packed form
7741aJNj1J2prQKmJ0rpNlJ0%j5J7q%qMPrRj%%oLj3J6jKJjkJ2lQj0pJ0qKOllL%
7791DlKm%J1j4oJ6j2Pj6J7mklMkJjj0RkKMkJ4j4qQQpkLNLMJkmlMj1LnJ0rJ2j4
7839hJ4JrJj0J2nLLmlJJjMnjMKJ1j8RLNj3MkJ0j0kQN%j2OjlLNKkrjkLqJ2%mlr
7890a3OJ1l%qjoK0Qk2JJ3lRqJ%nNJjMkqLLnJ0MqJqNoJPj1mJ7j1jmQrLjNj%LJr
7942hJ1Nj6J7nnJ4qJmP%%npjnQMq%rJ8j2MoKkJ2qPnNOj0rJ3lj1RLjoNJ%%PrN%
7993AlPmnJ0jJKj9J4%nOomQlmMj4KNQoJOj4J0KmJ1j7J1LqJn%RlJLmmJ0pRqjmm
8044a2K3j4QJqPOj3MnOqjLNpKj2J1OQqmKJLlJOj0J2kjJrkJMLmoKN%koRmlJMj2
8096a1J0j2PMnLnQrQkKNj0J5j3JjLPnJJ0npMqLoRpNj2OkrQJ%OLJoNkoNjk%MmP
$$ plain form
8149 1 -2 -1 -1 -1 4 1 -5 -15 -8 4 -2 1 1 -11 -2 -3 -2 3 2 -1 -10 -8 -16 -3 -9 -5 -13 -3 -10 -14 -10 -13 -1 -5 -7 -5 -7 -4 -17 -9 3 5
$$ packed form
8149AlJ%%Nloj0PJ2oL%j2RjJNjlrKqJ3oMqJ0pmMlJ2mkKkLj3QJ2K
8191E
##END NTUPLES=NMR FID
##END=
