##TITLE=1H_LY-DMAA.3.21
 CDCL3
 8 sc, 
 11.04.2022
##JCAMPDX= 6.0         $$ Bruker NMR JCAMP-DX V2.0
##DATA TYPE= NMR FID
##DATA CLASS= NTUPLES
##ORIGIN= UXNMR, Bruker Analytische Messtechnik GmbH
##OWNER= root
$$ XWIN-NMR		Version 3.5
$$ Mon Apr 11 15:21:44 2022 Russian Standard Time (UT+4h)  she@DPX200
##.OBSERVE FREQUENCY= 200.13135
##.OBSERVE NUCLEUS= ^1H
##.DELAY= (6, 6)
##.ACQUISITION MODE= SIMULTANEOUS
##.ACQUISITION SCHEME= undefined
##.AVERAGES= 8
##.DIGITISER RES= 18
##SPECTROMETER/DATA SYSTEM= spect
##.PULSE SEQUENCE= zg30
##.SOLVENT NAME= CDCl3
##.SHIFT REFERENCE= (INTERNAL, CDCl3, 0, 15.7039)
##AUDIT TRAIL= $$ (NUMBER, WHEN, WHO, WHERE, WHAT)
$$ ##TITLE= Audit trail, XWIN-NMR		Version 3.5
$$ ##JCAMPDX= 5.01
$$ ##ORIGIN= Bruker BioSpin GmbH
$$ ##OWNER= she
$$ F:/spectra/data/she/nmr/H-F/1/audita.txt
$$ ##AUDIT TRAIL=  $$ (NUMBER, WHEN, WHO, WHERE, WHAT)
(   1,<2022-04-11 15:20:27.50 +0400>,<she>,<DPX200>,
      <created by zg, POWCHK disabled, PULCHK disabled
       configuration hash MD5:
       00 E9 B6 7A A2 85 ED C7 34 08 36 98 17 FE 4E 26
       data hash MD5: 16K
       F1 D7 D3 21 D6 29 AB 7E 73 BE F3 B8 AE 98 2D 4C>)
$$ ##END=
$$ 
$$ hash MD5
$$ 2D D7 D6 64 52 56 8C 0C E4 77 8C 77 8F A3 CD DF
##$RELAX= 
##$RELAX= 
##$RELAX= 
##$RELAX= 
##$RELAX= 
##$RELAX= 
$$ Bruker specific parameters
$$ --------------------------
##$DU= <F:/spectra>
##$EXPNO= 1
##$NAME= <H-F>
##$PROCNO= 1
##$TYPE= <nmr>
##$USER= <she>
##$AMP= (0..31)
100 100 100 100 100 100 100 100 100 100 100 100 100 100 100 100 100 100 
100 100 100 100 100 100 100 100 100 100 100 100 100 100 
##$AQSEQ= 0
##$AQ_mod= 1
##$AUNM= <au_zg>
##$AUTOPOS= <>
##$BF1= 200.13
##$BF2= 200.13
##$BF3= 200.13
##$BF4= 200.13
##$BF5= 200.13
##$BF6= 200.13
##$BF7= 200.13
##$BF8= 200.13
##$BYTORDA= 1
##$CFDGTYP= 0
##$CFRGTYP= 5
##$CHEMSTR= <none>
##$CNST= (0..31)
1 1 145 1 1 1 1 1 1 1 1 1 1 1 1 1 1 1 1 1 1 1 1 1 1 1 1 1 1 1 1 1 
##$CPDPRG= <>
##$CPDPRG1= <>
##$CPDPRG2= <>
##$CPDPRG3= <>
##$CPDPRG4= <mlev>
##$CPDPRG5= <mlev>
##$CPDPRG6= <mlev>
##$CPDPRG7= <mlev>
##$CPDPRG8= <mlev>
##$CPDPRGB= <>
##$CPDPRGT= <>
##$D= (0..31)
0 1.2 0 0 0 0 0 0 0 0.06 0 0.03 0 0 0 0 0.0002 0 0 0 0 0 0 0 0 0 0 0 0 
0 0 0 
##$DATE= 1649676026
##$DBL= (0..7)
120 120 120 120 120 120 120 120 
##$DBP= (0..7)
150 150 150 150 150 150 150 150 
##$DBP07= 0
##$DBPNAM0= <>
##$DBPNAM1= <>
##$DBPNAM2= <>
##$DBPNAM3= <>
##$DBPNAM4= <>
##$DBPNAM5= <>
##$DBPNAM6= <>
##$DBPNAM7= <>
##$DBPOAL= (0..7)
0.5 0.5 0.5 0.5 0.5 0.5 0.5 0.5 
##$DBPOFFS= (0..7)
0 0 0 0 0 0 0 0 
##$DE= 6
##$DECBNUC= <off>
##$DECIM= 32
##$DECNUC= <off>
##$DECSTAT= 4
##$DIGMOD= 1
##$DIGTYP= 9
##$DL= (0..7)
0 120 120 120 120 120 120 120 
##$DP= (0..7)
150 150 150 150 150 150 150 150 
##$DP07= 0
##$DPNAME0= <>
##$DPNAME1= <>
##$DPNAME2= <>
##$DPNAME3= <>
##$DPNAME4= <>
##$DPNAME5= <>
##$DPNAME6= <>
##$DPNAME7= <>
##$DPOAL= (0..7)
0.5 0.5 0.5 0.5 0.5 0.5 0.5 0.5 
##$DPOFFS= (0..7)
0 0 0 0 0 0 0 0 
##$DQDMODE= 0
##$DR= 18
##$DS= 0
##$DSLIST= <SSSSSSSSSSSSSSS>
$$ [...]
##$SUBNAM2= <"">
##$SUBNAM3= <"">
##$SUBNAM4= <"">
##$SUBNAM5= <"">
##$SUBNAM6= <"">
##$SUBNAM7= <"">
##$SUBNAM8= <"">
##$SUBNAM9= <"">
##$SW= 18.05172834244
##$SWIBOX= (0..15)
0 0 2 0 0 0 0 0 0 0 0 0 0 0 0 0 
##$SW_h= 3612.71676300578
##$TD= 16384
##$TD0= 1
##$TE= 0
##$TE2= 300
##$TE3= 300
##$TEG= 300
##$TL= (0..7)
0 120 120 120 120 120 120 120 
##$TP= (0..7)
150 150 150 150 150 150 150 150 
##$TP07= 0
##$TPNAME0= <>
##$TPNAME1= <>
##$TPNAME2= <>
##$TPNAME3= <>
##$TPNAME4= <>
##$TPNAME5= <>
##$TPNAME6= <>
##$TPNAME7= <>
##$TPOAL= (0..7)
0.5 0.5 0.5 0.5 0.5 0.5 0.5 0.5 
##$TPOFFS= (0..7)
0 0 0 0 0 0 0 0 
##$TUNHIN= 0
##$TUNHOUT= 0
##$TUNXOUT= 0
##$USERA1= <user>
##$USERA2= <user>
##$USERA3= <user>
##$USERA4= <user>
##$USERA5= <user>
##$V9= 5
##$VALIST= <valist>
##$VCLIST= <CCCCCCCCCCCCCCC>
##$VD= 0
##$VDLIST= <DDDDDDDDDDDDDDD>
##$VPLIST= <PPPPPPPPPPPPPPP>
##$VTLIST= <TTTTTTTTTTTTTTT>
##$WBST= 1024
##$WBSW= 4
##$XGAIN= (0..3)
0 0 0 0 
##$XL= 0
##$YL= 0
##$YMAX_a= 333615
##$YMIN_a= -340632
##$ZGOPTNS= <>
##$ZL1= 120
##$ZL2= 120
##$ZL3= 120
##$ZL4= 120
##$ABSF1= 10
##$ABSF2= 0
##$ABSG= 5
##$ABSL= 3
##$ALPHA= 0
##$AQORDER= 0
##$ASSFAC= 0
##$ASSFACI= 0
##$ASSFACX= 0
##$ASSWID= 0
##$AUNMP= <proc_1d>
##$AZFE= 0.1
##$AZFW= 0.1
##$BCFW= 1
##$BC_mod= 2
##$BYTORDP= 1
##$COROFFS= 0
##$CY= 11.3945322036743
##$DATMOD= 1
##$DC= 2
##$DFILT= <>
##$DTYPP= 0
##$F1P= 2.36226072786647
##$F2P= -0.459571619588291
##$FCOR= 0.5
##$FTSIZE= 0
##$FT_mod= 4
##$GAMMA= 1
##$GB= 0.15
##$INTBC= 1
##$INTSCL= 1
##$ISEN= 128
##$LB= 0.24
##$LEV0= 0
##$LPBIN= 0
##$MAXI= 10000
##$MC2= 0
##$MEAN= 0
##$ME_mod= 0
##$MI= 1.114404
##$NCOEF= 0
##$NC_proc= 0
##$NLEV= 6
##$NOISF1= 3.799351
##$NOISF2= 2.8
##$NSP= 1
##$NTH_PI= 0
##$NZP= 0
##$OFFSET= 15.70392
##$PC= 1
##$PHC0= -18302.53
##$PHC1= 13.40078
##$PH_mod= 1
##$PKNL= yes
##$PPARMOD= 0
##$PSCAL= 0
##$PSIGN= 0
##$REVERSE= no
##$SF= 200.130013532006
##$SI= 16384
##$SIGF1= 3
##$SIGF2= 2
##$SINO= 400
##$SIOLD= 16384
##$SREGLST= <1H.CDCl3>
##$SSB= 0
##$STSI= 0
##$STSR= 0
##$SW_p= 3612.71676300578
##$SYMM= 0
##$S_DEV= 0
##$TDeff= 0
##$TDoff= 0
##$TI= <>
##$TILT= no
##$TM1= 0
##$TM2= 0
##$TOPLEV= 0
##$USERP1= <user>
##$USERP2= <user>
##$USERP3= <user>
##$USERP4= <user>
##$USERP5= <user>
##$WDW= 1
##$XDIM= 8192
##$YMAX_p= 0
##$YMIN_p= 0
$$ End of Bruker specific parameters
$$ ---------------------------------
##NTUPLES= NMR FID
##VAR_NAME=  TIME,          FID/REAL,        FID/IMAG
##SYMBOL=    X,             R,               I
##VAR_TYPE=  INDEPENDENT,   DEPENDENT,       DEPENDENT
##VAR_FORM=  AFFN,          ASDF,            ASDF
##VAR_DIM=   8192,          8192,            8192
##UNITS=     SECONDS,       ARBITRARY UNITS, ARBITRARY UNITS
##FACTOR=    0.0002768,     1,               1
##FIRST=     0,             0,               0
##LAST=      2.2672688,     0,               0
##MIN=       0,             -340632,         0
##MAX=       2.2672688,     333615,          0
$$ Real data points
##PAGE= N=1
##DATA TABLE= (X++(R..R)), XYDATA
0@%%%%%%%%%%%%%Oj4J6j6J6j6K4l2L2m0M8n6O9p7Q8j04J19j32J49j70J91k16K44
$$ 0 0 0 0 0 0 0 0 0 0 0 0 0 0 6 -8 8 -8 8 -8 16 -16 16 -24 24 -32 37 -40 48 -56 63 -69 80 -90 101 -115 129
36A29k70L01l41L80m20M66n17N74o34O97p69Q50r36J029j133J250j380J523j685
$$ 129 -141 160 -181 199 -221 245 -272 302 -332 365 -404 446 -490 539 -594 656 -724 799 -886
55h86J867k075K318k600K935l342L848m494N348o537Q308j1206J6732l0752J27552
$$ -886 981 -1094 1224 -1376 1559 -1783 2065 -2429 2919 -3618 4690 -6516 10216 -20536 107016
70A07016K26599m31676k01833L63379J90107k80589j53935J52169J34225k1723
$$ 107016 333615 -98061 -299894 63485 253592 -26997 -180932 -28763 105462 83739
80H3739j10488j18895J05376K37499j01526l35325J09241L91765j12688m11902
$$ 83739 -26749 -145644 -40268 197231 95705 -239620 -130379 261386 148698 -263204
90b63204J14889L88261j03282l32365Q0614K48077m0407j50963j1725M9716P4517
$$ -263204 -148315 239946 136664 -195701 -115087 132990 92583 -58380 -70105 -20389 54128
101E4128M1065j39215j14542J99744J62282k46748j83447K74171J78059k76404
$$ 54128 95193 -44022 -158564 41180 203462 -43286 -226733 47438 225497 -50907
111e0907j51671K52158J10749k02544o4285J32690K0672n0021J2892l5406l1305
$$ -50907 -202578 49580 160329 -42215 -106500 26190 46862 -3159 9733 -25673 -56978
122e6978J13963L2840j75955j8571K14436p345k25384L9230K08641p0268j67912
$$ -56978 56985 89825 -86130 -104701 109735 102390 -122994 -83764 124877 54609 -113303
133a13303R4050J09663j05809m3072J02588k2324q4476P7071N3577j14112j4353
$$ -113303 -19253 90410 -15399 -58471 44117 21793 -62683 14388 67965 -46147 -60500
144f0500J28573k7488j19250O6020Q8267r5698m0733J12792j5776j15257P3001
$$ -60500 68073 40585 -78665 -12645 75622 -20076 -60809 51983 36207 -79050 -6049
155f049J03711j22039q0754J55896N0720j69176j8973J59592q898j27865K7961
$$ -6049 97662 -24377 -105131 50765 101485 -67691 -86664 72928 64030 -63835 -35874
166c5874P7633l5104j5275K8847n1517j0730J14594j6213j66293M6628K00493
$$ -35874 41759 6655 -8620 20227 -31290 -42020 72574 56361 -109932 -63304 137189
177A37189p4585k13784R3981K05458r9662j77506Q8586J34507n9860q2397J5877
$$ 137189 62604 -151180 -57199 148259 48597 -128909 -40323 94184 34324 -48073 -32196
188c2196K8088L9137K2255r8531o3441J54658R2335j99987j07847K27874J11019
$$ -32196 -4108 35029 57284 -41247 -104688 49970 142305 -57682 -165529 62345 173364
199A73364k33937j04736K15921R2585j74890p9095J14608O7671m1259o1009l7483
$$ 173364 -60573 -165309 50612 143197 -31693 -110788 3820 71491 30232 -30777 -68260
210f8260O0071J13290o4154j77962P1110K25112p7514k50099P9736K51251p4095
$$ -68260 -8189 105101 40947 -137015 -65905 159207 81693 -168406 -88670 162581 88486
221H8486k29410N8208J88330l0955j33567o698P1952N2014j0962j00371m3270
$$ 88486 -140924 -82716 105614 74659 -58908 -65606 6346 58360 47398 -52973 -96243
232i6243J46259Q5372j83859j12493K07493J23931k13465j21230J99394J07812
$$ -96243 50016 135388 -48471 -160964 46529 170460 -43005 -164235 35159 142971
242A42971j65815q7984J15495O6608n3430m7676j3736L4479P8862k8148j34730
$$ 142971 -22844 -110828 4667 71275 17845 -29831 -43567 -9088 69774 41626 -93104
253i3104K8452J75597l3464j97302M0342J98346m5669j79607M6225J44203l9915
$$ -93104 -64652 110945 77481 -119821 -79479 118867 73198 -106409 -60184 84019 44104
264D4104r7272K5485M4898l456O002k4361m9638N4665Q1188q3760r7586J07340
$$ 44104 -53168 -27683 17215 13759 19761 -4600 -54238 427 81615 -2145 -99731 7609
276G609R8221j21712q4433J24238N9834j13826k8920R1250k600n8758K9585K0539
$$ 7609 105830 -15882 -100315 23923 83757 -30069 -58989 32261 29661 -29097 488 21027
288B1027m7836J8764N4587n3858m9140Q0179L2548r4280p973R4473k0677q1157
$$ 21027 -26809 -8045 46542 -7316 -56456 23723 56271 -38009 -45982 48491 27814 -53343
300e3343M8528N6631p1535k4834Q5836r157q9625M0062Q2373o2866o5281P3920
$$ -53343 -4815 51816 -19719 -44553 41283 32126 -57499 -17437 64936 2070 -63211 10709
312A0709M1131p1050j3315N4444j4086k5989L7617j0367n4423M9698O2978q6405
$$ 10709 51840 -19210 -32525 21919 7833 -18156 19461 9094 -45329 4369 67347 -19058
324a9058o3135J15066N6079j31405m4177J32416L0373j17491j7883Q7587R460
$$ -19058 -82193 32873 88952 -42453 -86630 45786 76159 -41332 -59215 28372 37832
335C7832m6115p132k150J1374N1650k1441r6627L5350J31950m9824j53697O1345
$$ 37832 -8283 -15415 -17565 -6191 45459 24018 -72609 -37259 94691 44867 -108830 -47485
347d7485J60094o6427j50893O2428J28153m7716r5287K2477N6848J1357j7575
$$ -47485 112609 46182 -104711 -42283 85870 38154 -57133 -34656 22192 33549 15974
358A5974n0549j8229R0455M7111j26089o7189J52359P7884j65509q0154J62823
$$ 15974 -34575 -52804 37651 84762 -41327 -108516 43843 121727 -43782 -123936 38887
369C8887P6033j43809o8054J09755N8940o3827n1033J0912M5908M3757m4206r4075
$$ 38887 114920 -28889 -96943 12812 71752 7925 -43108 -32196 13712 57469 13263 -80812
381h0812M5513J34964m8347j62154N0746J73244n0390j67653M5150J46641l3482
$$ -80812 -35299 99665 51318 -110836 -60090 113154 62764 -104889 -59739 86902 53420
392E3420j13587J4863P2765R932k9526l9040j1317O9524M5192r7746o9099J19909
$$ 53420 -60167 -45304 27461 37393 7867 -31173 -42490 27034 72226 -25520 -94619 25290
404B5290Q1550j32665q2745J33550P4532j21443n9804R7171M2272o2815k5238
$$ 25290 106840 -25825 -108570 24980 99512 -21931 -81735 15436 57708 -5107 -30345
415c0345K2069J1837K0557l905o0245K182R2503o029j13800J3734J21900k3124
$$ -30345 -8276 3561 24118 20213 -40032 -37850 54653 48624 -65176 -51442 70458 47334
427D7334j16427L1404R8551l6263p1221L5794L8293k9314m270J6880k6283J32
$$ 47334 -69093 -37689 60862 24599 -46622 -10828 27465 -1849 -6119 10761 -15522 -15390
439a5390M9577j9586o2759L8859O4738n5017n5643O5659L7574o8916j3667O4206
$$ -15390 34187 14601 -48158 -9299 55439 422 -55221 10438 48012 -20904 -34571 29635
451B9635j2149n1970L5698L3891n3314j2720O2316q683o1163K6776N0052l9034
$$ 29635 17486 -34484 1214 35105 -18209 -30929 31387 22704 -38459 -11683 38369 -665
463f65l0542M3393N361l9310K1914K7395m7502r725O8133j0657q1157L0453Q5135
$$ -665 -31207 12186 17547 -21763 151 27546 -19956 -29681 38452 27795 -53362 -22909 62226
476F2226m5893p9929N4068O6828n2976m7708M2008K5449k1956l106m877j6843
$$ 62226 16333 -63596 -9528 57300 4324 -43384 -1376 24073 2117 -989 -5866 -22709
488b2709L5311L2133o5309m1793R0676M5475j07958m4050J14325L8903j08396
$$ -22709 12602 44735 -20574 -62367 28309 73784 -34174 -78224 36101 75004 -33392
499c3392l2060R0243K5684o1663k1434K5614K0644J3971k3441n2655K9430Q6239
$$ -33392 -65452 24791 50475 -11188 -32622 -7008 13636 27607 4166 -48489 -19059 67180
511F7180l6964j11041M4103J24644m8408j26004M7671J15603m0311r5375K5603
$$ 67180 30216 -80825 -36722 87922 39514 -86490 -38819 76784 36473 -58902 -33299
522c3299O8179m176l7672k2471P405N1437J9415p9443m0453J02748N4366j18074
$$ -33299 34880 30704 -6968 -29439 -22034 29403 48818 -30625 -71078 31670 86036 -32038
534c2038o1015J23031O1233j16248n6522R7922M9080o9510m0852L3916L3790N225
$$ -32038 -93053 29978 91211 -25037 -81559 16363 65443 -4067 -44919 -11003 22787 28012
546B8012k9072m3587K7118P7222k7752j02493K9769J16957l1838j19511L2190
$$ 28012 -1060 -44647 -17529 59693 31941 -70552 -40783 76174 44336 -75175 -42985
557d2985J10218k9308r0923K2095O4200j0177l3767o078L577K5137K3051m4989
$$ -42985 67233 37925 -52998 -30903 33297 23120 -10647 -16725 -13148 11989 35040 -9949
569i949m3185O3216N5042p6992n8188Q4368N3301q3530m2293P4236K7671n7043
$$ -9949 -53134 10082 65124 -11868 -70056 14312 67613 -15917 -58210 16026 43697 -13346
581a3346j2327L3801j079p237J0434j9628j4448M3291J2903o1072o544P0805l265
$$ -13346 -25673 8128 7049 -188 10246 -9382 -23830 19461 32364 -28708 -35252 35553 32288
594C2288p1479J4328O3399k4663m7824L2164K7324l5388m724L3586j6501k6857
$$ 32288 -39191 -24863 38536 13873 -33951 -1787 25537 -9851 -14575 19011 2510 -24347
606b4347L3549J6074m3952k716M6358j1221m0535K3790K7327l3094q773L7783
$$ -24347 9202 25276 -18676 -21392 24966 13745 -26790 -3000 24327 -8767 -17540 20243
618B0243j2444l7319L2991L2031n0067k2958O0824J1800o3656o87N7891q204m4250
$$ 20243 7799 -29520 3471 35502 -14565 -37523 23301 35101 -28555 -29242 28649 20445 -23805
631b3805J3349K4271j3467n56Q612k3904O17M6215j2488o3694K4926P4376l5382
$$ -23805 -10456 13815 348 -208 8404 -15500 -14883 31332 18844 -44850 -19924 54452 19070
644A9070p7282M1579P2548m1775o1287L5123M5121k1749k6400K645P474J9972
$$ 19070 -58212 -16633 55915 14140 -47147 -12024 33097 11348 -15052 -12407 -4933 15039
656A5039R498m3602k2924O5071L1925q1622l6211R0792L6450r1079l3725Q2022
$$ 15039 24537 -19065 -41989 23082 55007 -26615 -62826 27966 64416 -26663 -60388 21634
668B1634K9541o4080k5347L9128K2585r720k1940k0996K3688M9754k7270p3412
$$ 21634 51175 -12905 -38252 876 23461 13741 -8199 -29195 -5507 44247 16977 -56435
680e6435L1523Q9540l5025r6745L6032R4566l3161q3910K5539O6280j2953m4350
$$ -56435 -24912 64628 29603 -67142 -31110 63456 30295 -53615 -28076 38204 25251 -19099
692a9099l914K0748K3686J662m4094k0714O2842L4733p7294m2838Q5365M5367
$$ -19099 -23013 -2265 21421 23083 -21011 -41725 21117 55850 -21444 -64282 21083 66450
704F6450q5685m2977P7831L7136o2153k9609M0196K2154j4298j6163j2815J2591
$$ 66450 -19235 -62212 15619 52755 -9398 -39007 1189 23343 9045 -7118 -19933 -7342
716g342L8025j1710n8819J3103P2878j6025p8877J9114P6448k1083o6326K0714
$$ -7342 30683 18973 -39846 -26743 46135 30110 -48767 -29653 46795 25712 -40614 -19900
728a9900N0072j7072k9950R943Q775K64J0864j2517k6607K5475L6748l7183m0382
$$ -19900 30172 13100 -16850 -6907 1868 2132 12996 479 -26128 -653 36095 -1088 -41470
741d1470M5952L7638n0331k9498M9330J7750m2882m566L1594p983j6855J7665
$$ -41470 4482 42120 -8211 -37709 11621 29371 -13511 -18077 13517 5534 -11321 6344
753F344O67k3306J4866K4058k7767j9887L6193J1685l9008q66L6081j0799k7874
$$ 6344 7011 -16295 -1429 22629 -5138 -25025 11168 22853 -16155 -17021 19060 8261 -19613
766a9613K1608J5779k9878j561L4517j2566l4801K4434L0838l2205k3302L4484
$$ -19613 1995 17774 -12104 -13665 20852 8286 -26515 -2081 28757 -3448 -26750 7734
778G734J3386l0801k637K1353p410p461J5356r166k0393K6296K1977m1571k0296
$$ 7734 21120 -9681 -12318 9035 1625 -5836 9520 354 -20039 6257 28234 -13337 -33633
791c3633N2679J6282n8073j0903N6746N666m8579j894L4567O71j6225k339m248
$$ -33633 19046 35328 -22745 -33648 23098 28764 -19815 -21709 12858 13529 -2696 -5035 -9283
804i283O943K4371j3568m1995K1147N5030k8030o2353L2643O3253l3548n8289
$$ -9283 -2340 22031 8463 -33532 -12385 42645 14615 -47738 -15095 48158 14610 -43679
816d3679K9912M8306k1494l4935Q665J9972P307n220k4852p716M1917J7790n6325
$$ -43679 -13767 34539 13045 -21890 -13225 6747 14054 8834 -16018 -23734 18183 35973 -20352
829b0352k4299O6266K7359p0229k7342O7333K5448n7744k2488M2142J9738k2144
$$ -20352 -44651 21615 48974 -21255 -48597 18736 44184 -13560 -36048 6094 25832 3688
841C688j8007k30J7825K2476j9197m2334K1561N7631k4168o6916K5860O9373k5676
$$ 3688 -14319 -14549 3276 25752 6555 -35779 -14218 43413 19245 -47671 -21811 47562 21886
854B1886o5087K2605N4988j6247m0532O660K3784N568o795j9217q412L2865K0297
$$ 21886 -43201 -20596 34392 18145 -22387 -15727 8057 13625 6830 -12387 -20799 12066 32363
867C2363m4654k7874N3022L1014n6780k9926N5049K5648m7881j9470L5863J2693
$$ 32363 -12291 -40165 12857 43871 -12909 -42835 12214 37862 -10019 -29489 6374 19067
879A9067k0276o764K823K560J4509p50k9860J417M1400m034m7936P862M8889j1842
$$ 19067 -1209 -7973 -5150 -2590 11919 11169 -18691 -17274 24126 20092 -27844 -19982 28907 17065
893A7065m4267J4941L4968j6162k2222J4821Q024j0867N761M636j7300L114K5246
$$ 17065 -27202 -12261 22707 6545 -15677 -856 7168 -3699 2062 6698 -10602 -7488 17758
906A7758j1467k8508J8964K6900k4553k0951K7230J1672k6543o86K2470j0292
$$ 17758 6291 -22217 -3253 23647 -906 -21857 5373 17045 -9498 -10184 12286 1994
918A994j5660J9591P070k5806K014K8094j0150k6092J6125K0223j8939j1244J8128
$$ 1994 -13666 5925 12995 -12811 -10797 17297 7147 -18945 -2820 17403 -1536 -12780 5348
931E348N80j3754J0321O629k0140K286K7619j1666l1819J9861L2379k5487k9600
$$ 5348 5928 -7826 2495 9124 -11016 -8730 18889 7223 -24596 -4735 27644 2157 -27443
944b7443K7471K3932k5202j6469J8619Q198q362m09m369o069J8249J0505l1306
$$ -27443 28 23960 -1242 -17711 908 9106 744 335 -4034 -10103 8146 18651 -12655
957a2655j2641M1860J2757m8425j1281M9979R159m6195p094L7289O013k4220o460
$$ -12655 -25296 16564 29321 -19104 -30385 19594 28753 -17442 -24536 12753 18766 -5454 -11914
970a1914Q506Q588Q056j2303k3595J6851L6467k1456m5346K4937M9481k6439m8689
$$ -11914 -3408 5180 13236 933 -22662 -5811 30656 9200 -36146 -11209 38272 11833 -36856
983c6856K4951M3502k0127l4890J2078K4130j250j2616j1304J755K4347P452l6267
$$ -36856 -11905 31597 11470 -23420 -11342 12788 11538 -1078 -12382 -10627 13720 21172 -15095
996a5095j4239M5643J8322n1131j9892N1931J9396m7770j7582L8817J5312k5979
$$ -15095 -29334 16309 34631 -16500 -36392 15539 34935 -12835 -30417 8400 23712 -2267
1008b267j3335J0537J2138N816j2184k1289J3266L4269j5055m3348J6864M7677
$$ -2267 -15602 -5065 7073 12889 705 -20584 -7318 26951 11896 -31452 -14588 33089
1020C3089j7938m6955J7554M1616j5166l2451J0486K1003l691q718m617k820J3713
$$ 33089 15151 -31804 -14250 27366 12200 -20251 -9765 11238 7547 -1171 -5788 -8608 5105
1033E105J2233k2443j8705K9684K1645l4340k1290L5683J8079l3437j2984K7662
$$ 5105 17338 -5105 -23810 5874 27519 -6821 -28111 7572 25651 -7786 -20770 6892
1045F892P026j8992j381Q450l072K826N626j3374o000K1967M419k7657j068K9681
$$ 6892 13918 -5074 -6455 1995 -1077 1749 7375 -5999 -11999 9968 14387 -13270 -14338 15343
1059A5343l132k7840P446K2557j1007j4560J3082N031j3277M627J1478j3166p911
$$ 15343 12211 -15629 -8183 14374 3367 -11193 1889 6920 -6357 -1730 9748 -3418 -11329
1072a1329J9206L085k2050K195K1207p112j6866J0885R655j2894o42J2814q823
$$ -11329 7877 10962 -11088 -8893 12314 5202 -11664 -779 8876 -4018 -4660 8154 -669
1085f69j0790J7492P197k4047k660K7616j881k7603N559K4199p656j7676P577
$$ -669 -11459 6033 13230 -10817 -13477 14139 12258 -15345 -9786 14413 6757 -10919 -3342
1098c342R034n320O40J058j0177M541J8459j0726k4708J6502K8110k0682k8653
$$ -3342 5692 372 1012 2070 -8107 -3566 14893 4167 -20541 -4039 24071 3389 -25264
1111b5264K2479K6415k1302k2045J7086J6065r844r514M23L282J0182K123k0794
$$ -25264 -2785 23630 2328 -19717 -2631 13434 3590 -5924 -5501 -2219 7963 10086 -10708
1124a0708o087L0058Q555l6803r451L9996R238l9174q445L4254P692k5802p457
$$ -10708 -16795 13263 21818 -14985 -24436 15560 24798 -14376 -22821 11433 19125 -6677 -14134
1137a4134J4658Q072k139r712j0477J2171K1725j4960l0426J7397L5880j8916
$$ -14134 524 8596 6457 -3255 -13732 -1561 20164 5204 -25222 -7825 28055 9139
1149I139l7563J8745L5729j6485l0752J2007K3466n317j5005k875O380J1878J499
$$ 9139 -28424 -9679 26050 9565 -21187 -9180 14286 8969 -6036 -8911 -2531 9347 10846
1162A0846k0754p883K8434J2250l3899j4501L6254J4904l5311j3775L0801J1791
$$ 10846 -9908 -17791 10643 22893 -11006 -25507 10747 25651 -9660 -23435 7366 19157
1174A9157k3313r510J3510P468k370o221q701N858J8680o407k6239P513L0769
$$ 19157 -4156 -13666 -156 7312 4942 -1279 -9980 -4122 14558 8151 -18088 -10575 20194
1187B0194q828l1712R765K9297r851k3876Q710J6223o070p650K086q22K833Q082
$$ 20194 11366 -20346 -10581 18716 8865 -15011 -6301 9922 3852 -3798 -1712 -2534 299 8381
1201H381q148j3422J3222J6189j7275j6285J9624J4005j9931r849J7885M776j3882
$$ 8381 233 -13189 33 16222 -1053 -17338 2286 16291 -3640 -13489 4396 9172 -4710
1214d710N80Q220n185j710Q516m811j0060J0568R722j4675p603J6555M210j6068
$$ -4710 -4130 4090 -1095 -2805 5711 900 -9160 1408 11130 -3545 -11148 5407 9617 -6451
1228f451L3J3101m301q215P954K087j0582M428J1727j0422j1357J4982R422j7222
$$ -6451 -6418 6683 2382 -5833 2121 4208 -6374 -1946 9781 -641 -11998 2984 12406 -4816
1242d816o610J6944L231j4013J29Q769k836j847M604n818n086J3214M496j9423
$$ -4816 -11426 5518 8749 -5264 -5135 3634 798 -1049 3555 -2263 -7349 5865 10361 -9062
1256i062k960K3535J063k5084P61K3752j889j9836J953J3676o93o186j865j827
$$ -9062 -12022 11513 12576 -12508 -11747 12005 10116 -9720 -7767 5909 5216 -970 -2835 -4662
1270d662N392R443r407j5912J3285K0582j6342k2980J7876K3155j7466k1222J4868
$$ -4662 730 10173 766 -15146 -1861 18721 2379 -20601 -2725 20430 2964 -18258 -3390
1283c390J7687j0132j3020L626P896M138l123j2094j065J9567M145k5511o123
$$ -3390 14297 4165 -8855 -5229 2667 6805 3682 -8412 -9477 10090 14235 -11276 -17399
1296a7399K9205O968l0058p158K8002O865k3103o629J5894O753p253p352j993
$$ -17399 11806 18774 -11284 -18442 9560 16425 -6678 -13307 2587 9340 2087 -5265 -7258
1309g258Q555J0822j0180j8214J1820K3559j3093k6295J3511K6434j2693k4047
$$ -7258 1297 12119 1939 -16275 -4455 19104 6011 -20284 -6773 19661 6968 -17079
1321a7079J0442J9617o639j3943J602P687M252j639j0317l596J5902P513k0400
$$ -17079 -6637 12980 6341 -7602 -6000 1687 5939 4300 -6017 -9613 6289 13802 -6598
1334f598r894K3071J0650k3561j0087K1735Q583j7718o487J1950M315m956k577
$$ -6598 -16492 6579 17229 -6332 -16419 5316 13899 -3819 -10306 1644 5959 1003 -1574
1347a574k337J537R187j231j4830J801J8534k858j9976M080J9089n163j6011N649
$$ -1574 -3911 -2374 6813 5582 -9248 -7447 11087 8229 -11747 -7667 11422 6259 -9752 -4103
1361d103J1231n329n538M025m01j836N735r83r765L969J2076o730j2439Q810J0891
$$ -4103 7128 1799 -3739 286 -115 -1951 3784 2801 -6964 -2995 9081 2351 -10088 -1278 9613
1376I613r779p819R524L698p943Q47N334n133j901Q594j763j0738N043J1393p544
$$ 9613 -166 -7985 1539 5237 -2706 -1859 3475 -1658 -3559 5035 3272 -7466 -2423 8970 1426
1391A426j0450Q782Q125q581m794O834R07l839L054j68o459M490Q966q546j0394
$$ 1426 -9024 -242 7883 -698 -5492 1342 2249 -1590 1464 1296 -5163 -673 8293 -253 -10647
1406a0647J1781J0602j3621r637J3663P835j1743n576Q114L244l055j233k774
$$ -10647 1134 11736 -1885 -11522 2141 9976 -1767 -7343 771 4015 960 -273 -3047
1419c047k65Q736J090j4105j291J8187J037k0463o05K0581L54j8637n58J4768
$$ -3047 -3312 5424 6514 -7591 -8882 9305 10342 -10121 -10726 9855 10209 -8428 -8986 5782
1433E782J381r465k909L333N043K908p436q732R947J3387j1889j6603J3063J8070
$$ 5782 7163 -2302 -5211 -1878 3165 6073 -1363 -10095 -148 13239 1350 -15253 -2190 15880
1447A5880j3006j7764J1550J5968q671j2974M481R232O24n293o150J561J1490
$$ 15880 2874 -14890 -3340 12628 3957 -9017 -4536 4696 5320 27 -6123 -4562 6928
1460F928J598j6229l878J9536N369k1125o030K0697O099j8233n867J4025N588
$$ 6928 8526 -7703 -11581 7955 13324 -7801 -13831 6866 12965 -5268 -11135 2890 8478
1473H478q475n452K177N686M166o181r902O936J4418p652j7264Q018J8306p890
$$ 8478 3 -5449 -3272 2414 6580 399 -9503 -2567 11851 4199 -13065 -5047 13259 5369
1487E369j7415O932J4875n134j1162K500O728P53k220m309j903P727N253j0771
$$ 5369 -12046 -5114 9761 4627 -6535 -4035 2693 3446 1226 -3083 -4986 2741 7994 -2777
1501b777p410J2874Q345j3765q037J3274O858j1431m972Q397K821m422q11P8q07
$$ -2777 -10187 2687 11032 -2733 -10770 2504 9362 -2069 -7041 1356 4177 -245 -1056 -978 -1785
1516a785M254J690p916j896J0581J385j1874m16J1633p66r971J879P086k739l388
$$ -1785 2469 4159 -3757 -5653 4928 6313 -5561 -5977 5656 4890 -5081 -3202 3884 1145 -2243
1531b243L062o82k774M498J928p510p11R406o24r937J904R061k834o851L209L711
$$ -2243 819 137 -2637 1861 3789 -3721 -4432 4974 4350 -5587 -3683 5378 2544 -4307 -1098 2613
1547B613k944j4K084l755p10P020q75r425K339J0766l573j0786M140R534l899
$$ 2613 -331 -345 1739 -2016 -2726 4294 3419 -6006 -3667 7099 3526 -7260 -3120 6414 2515
1562B515p271K860M229r99q69j412k559M180N457o757p682Q948R041j0251r438
$$ 2515 -4756 -1896 2333 1334 465 -947 -3506 674 6131 -626 -8308 640 9681 -570 -10008
1577a0008J0452Q958r381p776P067O154l671m417m56K662M901j200r159J55J2624
$$ -10008 444 9402 21 -7755 -688 5466 1795 -2622 -3078 -416 4485 3285 -5874 -5719 6905
1592F905N77j4950j096J5848J460j5215j854J3080K418r634l208N337M301o40
$$ 6905 7482 -7468 -8564 7284 8744 -6471 -8325 4755 7173 -2461 -5669 -332 3969 3329
1606C329n513l951O754Q018p821j1117Q479J2987q478j3592P720J2886o093j1171
$$ 3329 -2184 -6135 619 8637 816 -10301 -1822 11165 2687 -10905 -3185 9701 3608 -7563
1620g563L673Q612o13n697k790K652O271J39r527k360J2003M012j3512m962J3808
$$ -7563 -3890 4722 4109 -1588 -4378 -1726 4545 4684 -4843 -7203 4800 8812 -4700 -9662 4146
1635D146N294j2776n077J0507M666p208m164L244L763R96l502n015L422Q368l483
$$ 4146 9440 -3336 -8413 2094 6760 -448 -4612 -1368 2395 3391 -111 -5126 -1704 6664 3181
1650C181j0798L611J1899l582j1739L269J0369k633q023J577N016j32j806j560
$$ 3181 -7617 -4006 7893 4311 -7428 -4159 6210 3577 -4446 -2869 2147 2015 209 -1351
1664a351j297L307L885m912n664O167O583o834o525O858N632o085m130M665K242
$$ -1351 -2648 659 4544 -368 -6032 135 6718 -116 -6641 217 5849 -236 -4366 299 2541
1679B541k675k64L20j496K112K790m261l543N881L627o750l170O676K299n746
$$ 2541 -134 -398 -78 -1574 538 3328 -933 -4476 1405 5032 -1718 -4888 1788 4087 -1659
1694a659j142L984o7j633J156j031j944L644K364n765k414P212K154p730j702
$$ -1659 -2801 1183 1116 -517 639 -392 -2336 1308 3672 -2093 -4507 2705 4859 -2871 -4573
1709d573P239J165n741p93L538M87p35m30k278N64N086q90p354J241Q819j474
$$ -4573 2666 3831 -1910 -2703 835 1322 587 157 -2121 -1557 3529 2639 -4715 -3474 5345 3871
1725C871r418J539Q945j151p627M81N536O37k951k037J48L627K547n125m879O452
$$ 3871 -5547 -4008 4937 3786 -3841 -3360 2176 2813 -138 -2175 -2027 1600 4147 -978 -5857 595
1741E95O645p355p680P513P966o873p605N424O685l320n388O35L832K438k309
$$ 595 7240 -115 -7795 -282 7684 811 -6794 -1370 5315 1995 -3393 -2758 1074 3512 1203
1756A203n446R25Q051K44r977j212J1068J850j0991k375R939K807p885l201N123
$$ 1203 -4243 -3318 4733 4977 -5000 -6212 4856 6706 -4285 -6660 3279 6086 -1799 -5000 123
1771A23L642j934m074j380M489M443m836o961N010Q699m913r591M481R481l608
$$ 123 3765 1831 -2243 -3623 866 5309 473 -6488 -1478 7221 2308 -7283 -2802 6679 3071
1786C071q601K358O971p10m927j234K690L276m56n230j419O777K951p870l887
$$ 3071 -5530 -3172 3799 3089 -1838 -3072 -382 2894 2438 -2792 -4211 2566 5517 -2353 -6240
1801f240Q275M356p917m293O771L880m914l298K618K591m9j869k602J339M800
$$ -6240 2035 6391 -1526 -5819 952 4832 -82 -3380 -762 1829 1780 -89 -2691 -1352 3448
1816C448r12o531P34P353n64p465N17O680m05n225J93L298J55j068o11j150J194
$$ 3448 2536 -3995 -3261 4092 3528 -3937 -3420 3260 2855 -2370 -2177 1121 1276 208 -403 -1553 -359
1833c59L082j780m429K259N198k601n250K620M697k353l572J759K009q60l40k29
$$ -359 2723 943 -3486 -1227 3971 1370 -3880 -1260 3437 1084 -2488 -729 1280 420 80 -149
1849a49j335J381K760k482l731L282M225l711m165L605L693l022k775J934J641
$$ -149 -1484 -103 2657 175 -3556 -274 3951 240 -3925 -320 3373 351 -2424 -490 1151
1864A151m40m27j238p53K962J749m403k428N376K792n779k916N503K798m573k551
$$ 1151 711 284 -954 -1707 1255 3004 -1399 -3827 1549 4341 -1438 -4354 1149 3947 -626 -3177
1880c177L024K212j054j836j180J527L314j250n171J022O570p83p319M87P382
$$ -3177 -153 2059 1005 -831 -2011 -484 2830 1580 -3591 -2569 4001 3218 -4101 -3614 3768
1895C768n5o719m77N433J199l670k076J626K974N71l888k549M601M208n067n443
$$ 3768 3713 -3006 -3483 1950 3149 -521 -2597 -971 2003 2574 -1314 -3863 738 4946 -121 -5564
1911e564N165O091m764o205L822N809k511m936P60L821J182k526l163J236M976
$$ -5564 -399 5692 928 -5277 -1455 4354 1843 -3093 -2333 1488 2670 144 -3019 -1783 3193
1926C193o1o347r73P262J728p431k270O962K623n838k838M139K975k080l041j49
$$ 3193 3132 -3215 -4188 3074 4802 -2629 -4899 2063 4686 -1152 -3990 149 3124 1044 -1997 -2146
1942b146L042K296l037m133K958N469k749o298K401O475j872o064J196N110k80
$$ -2146 896 3192 155 -3978 -1020 4449 1700 -4598 -2197 4278 2406 -3658 -2462 2648 2368
1957B368l823p19K228J852n97k879r29L759K193m350l087M602L541m453l547L797
$$ 2368 -1455 -2174 54 1906 1309 -1570 -2499 1260 3453 -897 -3984 618 4159 -294 -3841 -44
1973d4L258k827k614J468J884jj049j547K89K895L12l910p36M489R71m529j054
$$ -44 3214 387 -2227 -759 1125 1124 75 -1472 -1183 1712 2024 -1886 -2622 1867 2838 -1691 -2745
1990b745M119R59l179q65J929P36m56o04j068N75K371m98l403M42M034m36m136
$$ -2745 1374 2333 -846 -1711 218 954 498 -106 -1174 -599 1772 1274 -2129 -1687 2347 1911 -2225
2007b225L27L765j75l009n3J833M51m72r25q82J349K133j693l132J939L785j998
$$ -2225 -1898 1867 1692 -1317 -1370 463 914 442 -483 -1365 -16 2117 424 -2708 -769 3016 1018
2024A018l997J797L821j311l259O23K362L01j286j331J26K368R67l250j916L851
$$ 1018 -2979 -1182 2639 1328 -1931 -1308 1054 1355 69 -1262 -1136 1232 2199 -1051 -2967 884
2040H84K583m100l022L930L164l345l092K339K830j039k411m62J918K032j439
$$ 884 3467 -633 -3655 275 3439 94 -2998 -659 2171 1132 -1279 -1741 177 2209 770
2055G70l392R21M515l95n216k4N432M69n150r50M425J441l262j961J850K394k99
$$ 770 -2622 -1701 2814 2419 -2797 -2821 2611 3080 -2070 -3020 1405 2846 -416 -2377 -527 1867 1568
2072A568k774j279L052K673l203l741L076M442k756m734K170M618j380m046L59
$$ 1568 -1206 -2485 567 3240 37 -3704 -628 3814 1058 -3676 -1506 3112 1732 -2314 -1955
2087a955L230P68k185j939J084L013nl864r22M472J599m605k147M369K451l734
$$ -1955 1275 2043 -142 -2081 -997 2016 2011 -1853 -2775 1697 3296 -1309 -3456 913 3364 -370
2103c70k546K734K483j525k286J29K027J246j732k502J432L483j111m071P52M284
$$ -370 -2916 -182 2301 776 -1510 -1381 646 1892 160 -2342 -910 2573 1462 -2609 -1857 2427
2119B427l96m055l1L498M56k592q87J483J322l03j690q49J981J832k185k539K171
$$ 2427 2031 -2024 -2055 1443 1899 -693 -1580 -97 1225 922 -768 -1617 364 2196 11 -2528 -357
2136c57K931j983k987J622K706j077k152L36J476M21o81j158j41J873Q06k366
$$ -357 2574 591 -2396 -774 1932 855 -1297 -961 515 936 255 -903 -1044 829 1635 -731
2152g31j320K618J659k596j744K262J706j691j474Q95J158K2q07r57L90J857n2
$$ -731 -2051 567 2226 -370 -2114 148 1854 163 -1311 -416 742 764 -43 -1000 -610 1247 1195
2169A195k542k77K924N68l082p06K756R72k287j061J467J144m72j230n35J218
$$ 1195 -1347 -1624 1300 1868 -1214 -1920 836 1808 -479 -1540 -73 1071 599 -631 -1166 52
2185E2J591j203k372J067L000q88l293N60L293k01k902k68K294P89j471j338M75
$$ 52 1643 440 -1932 -865 2135 1247 -2046 -1486 1807 1606 -1296 -1564 730 1519 48 -1290 -815
2202h15J857M61k287j350K576K052k628k543K434K818k048k835J429K672o41k267
$$ -815 1042 1503 -784 -2134 442 2494 -134 -2677 -243 2575 527 -2308 -879 1793 1152 -1115
2218a115k78J746J301j196k185O01K898l1l401m79L592R62l491j321L023J630
$$ -1115 -1393 353 1654 458 -1727 -1126 1772 1741 -1660 -2139 1453 2415 -1076 -2397 626 2256
2234B256k288j899J398J961l17j989p71J929J731j727k590J518L125j174l383
$$ 2256 -32 -1931 -533 1428 1111 -878 -1649 280 2011 284 -2306 -788 2337 1163 -2220
2249b220P54L347k65k994k60K394Q40j621j395P53J881J37k299q73K490J502k527
$$ -2220 -1466 1881 1616 -1378 -1638 756 1596 -25 -1420 -667 1214 1351 -948 -1821 669 2171 -356
2266c56j973K360K195j949k255J406K075o84j798p5J381Q95r56j613N18K177n4
$$ -356 -2329 31 2226 277 -1978 -572 1503 819 -979 -1054 327 1222 266 -1347 -829 1348 1294
2283A294k554l27K676O09k480q90K135J058j542j168Q25J144L5j129q26J019J470
$$ 1294 -1260 -1587 1089 1698 -782 -1672 463 1521 -21 -1189 -364 780 815 -314 -1140 -121 1349
2300A349q61j993O85K274m42k304J78K102J12j676m53J113P58m59r99k60J246
$$ 1349 488 -1505 -820 1454 1012 -1292 -1114 988 1100 -576 -1029 84 842 383 -616 -876 370
2317C70Q94j361j377J386J754j301j881J022J836o45j658J75J318L37q79r02L86
$$ 370 1264 -97 -1474 -88 1666 365 -1516 -494 1342 697 -961 -786 532 869 -10 -912 -526
2334e26J376J20j746o11J957J012k013j274J831J421j416j498R19J416k50j244
$$ -526 850 970 -776 -1387 570 1582 -431 -1705 126 1547 131 -1367 -448 968 718 -526
2350e26m85J056J140p27j749M32K216j32k442k19K439N41k204q61J789J096j180
$$ -526 -1011 45 1185 458 -1291 -859 1357 1225 -1217 -1436 1003 1544 -660 -1521 268 1364 184
2367A84j324M76J464K75j554r73J568J552j451k038J280K292r44k335N47K169
$$ 184 -1140 -664 800 1075 -479 -1452 116 1668 217 -1821 -541 1751 807 -1528 -981 1188
2383A188m3j867m82J457R97q81j526L32J850K63k119p94K193J193k061j508J753
$$ 1188 1145 -722 -1204 253 1250 369 -1157 -825 1025 1288 -831 -1625 568 1761 -300 -1808 -55
2400e5J704j303j722P06J649l5j466o25J175J275q64j796N30K149j44k316k07
$$ -55 1649 346 -1376 -670 979 944 -522 -1147 28 1303 439 -1357 -827 1322 1178 -1138 -1345
2417a345K263N22k044p83J628R99j043j187M14J293K42j360q94J355J346j212
$$ -1345 918 1440 -604 -1387 241 1240 197 -990 -576 717 959 -401 -1295 60 1406 194
2433A94j664R71J876o83j900L71J689N5j388m33R65Q23m86j180L3J415M50j527
$$ 194 -1470 -499 1377 694 -1206 -835 854 909 -479 -912 53 876 390 -790 -757 658 1108 -419
2451d19q38J511J125j401j242J072J293o85j223J60J118K46p78p82M86J182k27
$$ -419 -1257 254 1379 -22 -1264 -192 1101 416 -807 -647 471 717 -61 -843 -357 825 598
2468E98j418j28J639M02j620o13J467P64j151q80P17R36k24q92l02Q65Q30p97
$$ 598 -820 -948 691 1093 -527 -1140 327 1091 -60 -940 -223 713 489 -403 -705 160 990 193
2486A93j211N96J506m16j654J52J642R1j446l68J122O37p22q49J93J059K78j164
$$ 193 -1018 -422 1084 668 -986 -834 808 899 -547 -915 207 844 122 -727 -534 525 803 -361
2504c61p11J164J115j098j369R27J493o30j478K69J373J10j137n05Q09Q97m32
$$ -361 -1072 92 1207 109 -1260 -333 1160 530 -948 -679 694 804 -333 -838 -29 868 436
2521D36j275P2J512L23j648o55J602R37j451j117J130J237p48j251K66J193K75
$$ 436 -839 -767 745 1068 -580 -1235 367 1304 -147 -1264 -134 1103 355 -896 -630 563 838
2538H38j056p74Q70J240o75j521L77J743j15j742k37J668M79j373p64J016R60
$$ 838 -218 -992 -122 1118 443 -1078 -701 1042 927 -815 -1052 616 1095 -278 -1042 -26 934
2555I34n34j143N0J188M93j275r18J204J254r97j473P42J552m43j513Q0J387K87
$$ 934 400 -743 -693 495 988 -287 -1205 -1 1253 256 -1217 -475 1077 634 -879 -799 588 875
2573H75j093o31P30R87l75j192m2J407L51j435p18J419Q74j184j045R08J067m99
$$ 875 -218 -849 -119 868 493 -699 -741 666 1017 -418 -1136 283 1157 -27 -1072 -164 903 404
2591D04j097R5J000L12q12p53O32J082m09j306J68J420J11j416l05J224N41r86
$$ 404 -693 -598 402 714 -98 -851 -219 863 454 -852 -684 736 847 -569 -874 350 891 -95
2609i5o75O13Q16k31q24k49Q92O10q62r06P03J158n85j228L41J213o5j113k15
$$ -95 -770 -157 659 428 -396 -645 247 857 -5 -911 -208 950 365 -863 -522 691 626 -487 -702
2628g02R25M16n83o61K14Q94R1r96l92J013P09r65q90Q57R31n80r86L18R11K2
$$ -702 223 639 56 -605 -391 503 594 -402 -794 219 928 -37 -927 -70 861 281 -705 -387 524 546
2648E46p93l53O05O59l49r54J03J111J37j176l94J181N57j040o87P80P64m16q16
$$ 546 -247 -600 5 664 315 -639 -536 575 712 -464 -858 323 880 -160 -847 -67 697 281 -535
2667e35K6Q50L52q00o80O16J015m83j166K68J291m4j292j55J110M46r25o30N99
$$ -535 -509 341 693 -107 -787 -171 844 361 -805 -537 754 710 -582 -737 373 819 -106 -736 -137
2686a37P85k49r24j40R84M87r74q03R06J025p37j160N25J226k90j122j8R35L90
$$ -137 648 399 -525 -665 319 806 -168 -971 -65 960 223 -937 -412 814 524 -598 -616 319 709
2705G09p43o77M79R64k09j111j26J258L86j273o28J123Q13r20r37O48R34k56r40
$$ 709 -34 -711 -232 732 523 -588 -714 544 930 -343 -971 152 965 45 -892 -244 690 434 -506
2724e06j37Q62N26p43q38N47J132l82j250J26J322P7j197l12J069N01q10o30M23
$$ -506 -643 219 745 2 -836 -289 843 461 -789 -663 659 736 -461 -773 296 797 -13 -643 -220
2743b20Q47j22r17k53R17N52q59q23P70R97n93j093L66J046j32r03j87P73L99
$$ -220 627 505 -412 -665 252 804 -55 -878 -108 889 296 -797 -431 615 483 -420 -607 166 565
2762E65n15o61K46Q72K0r41k81J004M89r57o65Q11P78n69p94K82P78K8o96l40
$$ 565 50 -611 -365 507 527 -414 -695 309 798 -159 -824 -13 765 196 -598 -316 462 490 -206 -546
2782e46N40O50m01q83K00J022k7j058j49J000L33q77m50O23N90l55o82P5O68K95
$$ -546 -6 644 243 -640 -440 582 555 -503 -652 348 681 -196 -646 -23 567 212 -470 -395 273 568
2802E68o69n62N70Q05m49r70L35J028j48r90o4Q37K58o31m80L97O23q4p75j87
$$ 568 -101 -663 -93 712 263 -707 -372 656 508 -482 -546 291 549 -82 -562 -165 458 374 -401 -588
2822e88Q78M08q40o57P76Q03o12q93M11R04j36q25j73P35M19m98p21L17Q82q2
$$ -588 290 698 -142 -799 -23 780 168 -725 -314 590 454 -371 -544 191 610 112 -609 -292 590 508
2842E08j029j33J080L14j025m86Q65O33o48p57L93P79l7q00k64P21O03o34q28
$$ 508 -521 -654 426 740 -285 -771 94 727 79 -678 -285 494 457 -343 -607 114 717 83 -745
2861g45M67J033l13j102J12J092J31j001l42Q04N65n67p07K41Q19N5q93l58Q96
$$ -745 -278 755 442 -660 -548 544 675 -326 -668 136 701 134 -573 -332 487 542 -351 -709 187
2880A87O09q48q16P13R60n13r92K76R16M6q34l09O52N72m37q07K30R51Pj019k28
$$ 187 796 -52 -868 -155 805 292 -700 -424 492 538 -296 -605 47 619 182 -625 -395 556 563 -456 -684
2901f84J013M42r37n72P50O79m86p56K44P07J07p19l89N96O72m67q50L20R40j45
$$ -684 329 771 -166 -738 12 691 205 -551 -307 400 507 -212 -601 -5 667 200 -650 -330 610 465
2921D65j022j1R32K25p93l93N54N59k98o42kP14K54o85n10O77O95n73p95L81Q60
$$ 465 -557 -568 364 589 -204 -597 -43 516 218 -424 -426 288 542 -143 -653 24 719 146 -649 -268 592
2942E92k11q21j3O91K57n74m31L65O25j39p66q7Q43K73q02m74P47N88n97o57L79
$$ 592 381 -440 -453 238 495 -79 -510 -145 480 341 -425 -512 331 604 -198 -672 75 663 66 -591 -212
2963b12O75j08o42j52O14L33m41o16L01Q02j65q90l9R33J95q47l91P27M97m82
$$ -212 463 355 -287 -439 175 508 67 -549 -248 554 389 -501 -540 393 588 -259 -650 77 574 92
2983I2o03K01O92M9o71l17O27N94n85p65M20R46k98r35J08Q99R6p73l16N69N22
$$ 92 -511 -310 382 431 -240 -557 70 664 79 -686 -266 680 382 -553 -445 454 550 -223 -539 30 552
3004E52l61o92J30Q06P8q52l14Q23N66p68p05O36P36l82q16J40P87J37o69m10
$$ 552 191 -501 -371 435 513 -339 -653 170 736 -32 -737 -101 635 253 -563 -423 364 501 -168 -578
3024e78N46O50l77q28K07R35K1j001j71R09L88p99n52N97O68l50p26L2P34K59
$$ -578 -32 618 241 -587 -380 555 576 -425 -596 313 701 -98 -650 -53 615 265 -461 -429 305 564
3044E64p14m92O16P27n40q42L50R17j58r21k7Q24K55o82l91M66N66k20p25JP81
$$ 564 -150 -642 -26 701 161 -681 -331 586 428 -493 -520 304 559 -123 -514 -48 518 298 -427 -426 355
3065C55K26p97m04P19N89o01p30M49P39k22p30j7P00K14n50m70L86O84k29p91
$$ 355 581 -216 -620 99 688 87 -643 -194 545 323 -407 -424 276 490 -60 -530 -144 540 311 -480
3085d80J5Q73J32q11l68P99M91o10n84L65O21r2o54j59O10M04n22o19M15P59k87
$$ -480 -465 408 540 -271 -639 160 651 41 -543 -178 443 351 -303 -462 148 552 30 -589 -174 585 298
3106B98q40J04Q49P7p64k40O02M01m29n35K43O13M1o72k64O60M52o01o03M88P20
$$ 298 -542 -438 411 488 -276 -516 86 487 58 -477 -234 379 420 -252 -516 144 596 -5 -608 -120 600
3127F00l42p14J41O89P1o12k87M86M68l25o64J18Q00P3q44k64Q09M11o87n60N33
$$ 600 258 -456 -315 374 445 -167 -454 32 500 175 -489 -371 429 502 -342 -606 203 614 -73 -633 -100
3148a00O58l04p34Q9O68K28o58m17N36O31l82p79K17Q54k4q87j48Q23L13o75m71
$$ -100 558 254 -480 -391 277 505 -153 -570 -34 597 215 -564 -347 507 483 -404 -552 271 584 -91 -562
3169e62M91N82k55o60l3P21K70p15m68O45O04m98p64L51Q39j80q05l4P13K88n73
$$ -562 -71 511 256 -404 -437 284 554 -161 -629 16 620 122 -642 -291 548 368 -437 -471 242 530 -43
3190d3m74M07O26j95p74j6Q65K20q63m00P82N52o24o47L78P13j51p27q0O64L24
$$ -43 -517 -110 516 321 -453 -469 396 616 -247 -647 135 687 63 -584 -206 507 356 -371 -451 213 537
3211E37n79n53M59P16k88q16R0Q80Q0q28k70P19M25n28n87L60O39j30o61j65O96
$$ 537 -42 -595 -136 580 292 -524 -434 446 526 -302 -572 147 572 44 -543 -183 456 326 -335 -500 196
3232A96L61o21n45N06O70l39p78J92P76rp18j80O01L95m46n40K46O67n1p35j61
$$ 196 557 -64 -609 -103 567 228 -550 -358 418 409 -309 -489 112 507 61 -479 -233 434 383 -352 -513
3253e13P90L12o88n23N92O08m18o60K13O45M9o16k84N32M31l36o59K18P65l6q34
$$ -513 277 589 -99 -622 -30 578 160 -500 -287 358 407 -209 -493 39 470 134 -525 -307 458 422 -412
3274d12n2P19K78o51m23M94N23k86o19R5O60J49o43l42N67N48m63p15L21P60j22
$$ -412 -464 255 533 -118 -541 -47 476 190 -429 -334 326 475 -168 -510 57 605 142 -573 -252 508 386
3295C86p78o8P39K09n82m24M42N79k65o79%P66J78p40l62O55N33n23o78L72P53
$$ 386 -392 -460 279 488 -94 -518 -76 503 238 -441 -441 325 503 -237 -599 56 589 66 -612 -240 513
3316E13j82p00o7P02K51n72m58M36O28k84p61Q4Q09J34q08k97P05M51n79n56L74
$$ 513 331 -369 -436 266 517 -55 -513 -77 551 267 -494 -410 399 533 -275 -572 133 584 5 -551 -177
3337a77O28j29o95p2O41L35o19n20N22O61l45p66J59Q04N9p89k29O49M32n37n45
$$ -177 451 322 -373 -445 196 531 -88 -608 -86 575 230 -536 -377 427 486 -303 -532 117 549 12 -533
3358e33L38O78j01p36j50P60L17o89m99N68O29l94p36K27P53l5o96j84O08M09
$$ -533 -195 483 382 -354 -504 256 573 -116 -615 -47 582 188 -548 -321 432 397 -299 -483 125 534
3378E34m51o07L28P00j58p58n0P82K44p27l95O13N22m47o35K00P07J5o63k54O09
$$ 534 83 -524 -196 504 346 -412 -462 320 564 -163 -558 55 577 130 -505 -305 402 417 -246 -500 109
3399A09M45m96o31L88O93j80p55MP45J69o79l52N46N20l69o20J55O89O8o99k50
$$ 109 554 58 -573 -185 508 328 -427 -423 322 491 -188 -540 6 526 157 -463 -308 381 449 -250 -500
3420e00O32M66n85n54L98O74k65p08O5O67J37n76l75N22M81l00o65J73P02K2p14
$$ -500 132 598 13 -541 -143 531 266 -442 -377 290 427 -149 -524 -2 479 179 -486 -313 389 411 -303
3441c03k21O76M05n66n24M13O00j83o70k9O70K25o06l97M63O17l52p02J60P75
$$ -303 -524 152 557 -9 -533 -120 480 297 -373 -402 268 493 -113 -510 -47 570 218 -484 -324 451
3461D51k1p12k09O76L70n50n09L14O45j44o85o1P02K47o57m20N53N90m13o40K04
$$ 451 430 -282 -491 185 555 5 -504 -190 455 311 -374 -435 267 514 -143 -563 -10 580 167 -473 -269
3482b69O99k4p14j44O31L18m81n35L86O11j65p01k0P10J93o23m38N82N38m23o23
$$ -269 430 406 -308 -452 179 497 16 -519 -133 478 313 -388 -408 302 495 -128 -566 16 554 131 -492
3503d92K21O72po82k08O47L99n37n34L65O71j93p52OP80J66p16l37N85M98m31
$$ -492 -271 401 394 -288 -496 151 550 13 -521 -156 515 322 -430 -424 356 522 -194 -531 54 552 121
3524A21o45K47O88j5o78k09O54L66n41n64M55O43k45p24P6P13J29o72k85N41M47
$$ 121 -524 -277 411 396 -282 -491 163 529 -12 -576 -121 522 277 -447 -371 342 471 -201 -486 55 502
3545E02l86n75K07O87j4p26j57O50L41n98m52M41N94l13o58J13O64J09o23l01
$$ 502 116 -459 -252 435 421 -305 -462 188 529 -69 -521 -80 514 201 -457 -344 320 429 -194 -495
3565d95N12M94l98o36K57O87m9p11j17O97K98o19m47M72N26k19o37O4O49J26o16
$$ -495 17 511 113 -523 -266 421 372 -339 -456 241 539 -80 -527 -55 471 252 -385 -321 328 454 -162
3586a62l39N34M95m19n98K65O66j06o86q7O64K40n82l96M08N41k21n64K6O17J25
$$ -162 -501 33 528 109 -489 -224 442 336 -350 -437 227 467 -115 -511 -103 438 217 -347 -321 296 421
3607D21o02k90N24M86m73n42K72O50j22o70o1O44K65n39m37M06N51k52o18L7P05
$$ 421 -181 -471 53 539 66 -476 -204 446 324 -346 -407 237 502 -37 -474 -68 483 231 -387 -350 355
3628C55J02o74k56N64M48m68n52K69O69j15o51j21O35L00n51m55M25N72k34o85
$$ 355 457 -217 -473 91 539 71 -481 -212 457 342 -309 -430 205 505 -46 -501 -76 496 262 -423
3648d23J04O57O0o30k52N71M19m40n40K60O05k5o85j13O59K96n55m93M42O31l19
$$ -423 -319 338 398 -232 -484 87 506 66 -474 -214 391 366 -319 -432 227 523 -32 -525 -83 548 229
3669B29o91J37O88O9o35k74N73M35m26n80K85O48j22o77j04O64K91o09m29M74
$$ 229 -462 -325 363 432 -203 -477 96 531 105 -475 -190 458 336 -341 -445 219 510 -99 -528 -54
3689e4N54l19o22J34O64M5o32k58N95L85m49n50L18O39j24o89o5O95K04n95l38
$$ -54 500 181 -441 -307 357 402 -230 -488 107 492 43 -507 -189 450 326 -363 -428 267 471 -124 -462
3710d62M58N32l48o01J34O39P0o64k38N74M26m86n37L35O20j73o72J2O56J55n84
$$ -462 -4 528 180 -421 -287 352 422 -242 -480 94 520 34 -503 -168 452 279 -393 -381 275 430 -154
3731a54l49M92N18l49n76J21O78K7o70k02O06L56m69n02L51N82j76o33%N99J92
$$ -154 -503 -11 507 158 -418 -297 381 408 -262 -464 142 498 29 -473 -122 460 284 -349 -349 250 442
3752D42n52l61M57M80k99o00J57O31K7o34j93N89L24m61m67L29N48j60o13J1N62
$$ 442 -110 -471 -14 466 167 -433 -276 355 382 -252 -445 144 468 7 -460 -131 417 257 -356 -345 217
3773B17K43n67l51M39M93k87o06J32O34M0o26k08N63L65m67m65L01N71j39o24
$$ 217 460 -107 -458 -19 474 187 -419 -287 347 387 -239 -447 116 481 14 -451 -150 421 282 -342
3793c42k3O12K08n54m00M71M86k90o12J84O41lo09j55N34L05m39m58K94N67j06
$$ -342 -365 247 455 -99 -499 -28 458 168 -444 -260 381 378 -231 -386 148 453 14 -444 -150 417 311
3814C11o63k9O26K00n93l43M94M75l47n88K05O07Mo26j60N79L44m81m89L49N87
$$ 311 -352 -381 245 445 -148 -491 3 478 131 -457 -252 355 359 -267 -427 152 496 15 -474 -125 462
3835D62j70o78K6O61J77o42l20N28M25l30n73J83O00Oo08j87N90L31n02m95L95
$$ 462 292 -386 -360 301 478 -164 -484 44 469 139 -434 -251 349 355 -253 -440 150 481 -21 -516 -121
3856a21N70k30o01N2O04J09n73k74M81M31l59n18K07N97m9o23j32O36K74n01m57
$$ -121 449 219 -382 -330 274 383 -190 -464 17 448 89 -429 -222 375 326 -297 -429 207 481 -20 -477
3877d77L88N58k53o13P9N99R9n47k64M77M14m02n10K35N96p8o26n9N69K62n43
$$ -477 -89 469 216 -397 -318 281 380 -167 -431 46 460 58 -452 -217 379 301 -325 -384 185 447 -96
3898i6l43L85M79k52n45P1N98Q3n40k58M73M22l97n05K57N68r8o10o1N55K08m52
$$ -96 -439 -54 425 173 -372 -301 297 380 -160 -418 55 477 80 -425 -168 400 302 -308 -369 186 394 -58
3920e8l83L60N01k26n48N2N72J26n70k76N10L79l73n04K51N78j24n30j06N63K25
$$ -58 -441 -81 420 194 -354 -302 270 396 -174 -450 60 439 66 -438 -187 391 267 -263 -369 194 419
3941D19m99l62L59M75k11n53M2O04J02n65k42N14L62m22m14K03N84j07n62r3N53
$$ 419 -80 -442 -83 392 181 -372 -330 274 376 -189 -431 83 445 23 -391 -188 396 289 -273 -366 187
3962A87K60m78l98L65N18k88n48J43N72L3n34k53N25L28l81m84K52N59p4o01r4
$$ 187 447 -31 -429 -64 454 166 -382 -239 333 366 -168 -421 104 432 51 -433 -181 378 304 -297 -391
3983c91N73K48n17l69M20M79k86n43J14N91L0n54j91M86L76m11m86K64N64j10
$$ -391 182 430 -87 -456 -36 443 157 -386 -272 319 349 -205 -396 90 466 55 -431 -167 397 287
4003B87o11m0O08J99n23l69M43M20k67n35J06N70L9n52j78M72L44l82m78K98N36
$$ 287 -324 -364 244 443 -80 -449 -6 414 147 -388 -282 288 327 -225 -403 69 413 31 -447 -149 387
4024C87j50n88oN86J62n29l05M37M39l15m76J19N43N0n81j81N44L12m07m72L25
$$ 387 237 -351 -357 229 391 -138 -443 -6 433 118 -358 -239 304 354 -227 -408 136 448 41 -431 -106
4045a06M89j77n44K1N51J44n06k87M00M40k96n07J62N43l4n41j38N32K53m25l67
$$ -106 383 206 -338 -317 234 378 -128 -415 -15 425 129 -378 -216 327 293 -248 -386 146 399 -26 -393
4066c93L01M46j49n08PN18J19m48k82L85M20l22m90J46N67l7n36r2M86K48m21
$$ -393 -92 354 205 -303 -296 222 341 -107 -389 -4 416 94 -396 -250 317 280 -256 -348 138 386 -35
4087c5l43K49M83j36n00%M77K13n01l09M42M21l40m83J64N21m9n01j38M76K76
$$ -35 -378 -129 354 218 -282 -282 195 408 -93 -402 40 461 121 -362 -198 323 274 -227 -365 111 387
4108C87l94l93K69N02j39n26l0N31J36m68k84M20L78k78m65J46N31m2m85j29M60
$$ 387 -7 -400 -131 371 232 -294 -324 207 343 -125 -409 11 389 111 -354 -208 323 281 -204 -333 127
4129A27K85l92m18L04M86j59n28j8N66J07n21k39M26L82l16m69J64N26m5m94j64
$$ 127 412 20 -398 -94 392 233 -295 -313 253 360 -161 -400 26 408 92 -377 -213 313 268 -226 -390
4150c90N03K63m26m08L34N25j93n65O8N48O3m91k08M05L59l18m60J88N26m3n18
$$ -390 113 376 -50 -458 -124 401 208 -357 -289 259 322 -169 -377 28 387 69 -391 -203 323 280 -238
4171b38j20N23K46m40l65L42M35k29m99R4N03N4m44k52M01L80l32m37K02N33j00
$$ -238 -358 165 411 -29 -394 -52 383 154 -345 -251 252 306 -138 -390 11 391 59 -378 -176 357 257
4192B57n09q8N08K27m68k99L24M19k25m67Q8M96K7m40k33M11L68l56m28K40M94
$$ 257 -252 -340 168 395 -73 -372 -48 371 146 -321 -233 263 290 -150 -383 28 396 40 -388 -148 346
4213C46r4n04n9M84J78m27k59L01L90k09m25M8M73Q1m53k18M04L02l27l78K20
$$ 346 252 -252 -311 173 351 -76 -335 -34 356 147 -278 -230 243 324 -129 -347 57 359 32 -346 -126
4234a26M69j46m45n4M34K03l81l06K81M12j95m62O2M63J06m89j79M07L03l00m06
$$ -126 343 197 -248 -302 132 335 -46 -352 -71 341 146 -316 -254 209 315 -174 -353 54 357 57 -349
4255c49K30M15n9m61n2M11K31m02l11K92M05j89m91J09M90L3m50j78L79K81k99
$$ -349 -119 296 237 -224 -276 135 366 -36 -347 -55 350 161 -330 -221 269 302 -148 -326 53 334 35
4276C5l60J51M38m8m35j16M66K33m32k91L25L98k19m71J08M57M9m23j80L86K68
$$ 35 -325 -174 264 216 -219 -335 131 364 -68 -359 -34 364 145 -326 -218 239 288 -135 -315 71 339
4297C39k66m03J96M37m7n20l0M84J84m54k84L65L65k57m12R3M83km42j64M12L02
$$ 339 73 -330 -134 303 256 -264 -294 190 374 -80 -364 1 366 109 -303 -210 273 271 -171 -335 77 379
4319C79l77l75K28M77j29m91OM98R1m13k21L32L35k49l99J11M30M8m61j50M36
$$ 379 2 -373 -145 332 203 -288 -282 216 307 -106 -327 5 340 91 -308 -197 233 281 -180 -330 106
4340A06K53l55l80K93M16j57m53M3M46O8l49k43K94L52k41l92J05M60Nm69r7M19
$$ 106 359 4 -376 -83 333 176 -277 -234 212 280 -69 -312 -18 334 93 -299 -194 266 271 -198 -295 124
4362A24K26l81l27L03L52j56l99K5L96J51m12k25L16L28k46l99J64M29p0m00q1
$$ 124 350 -31 -358 -55 297 141 -258 -233 163 314 -98 -323 -7 321 75 -324 -160 269 199 -201 -282
4383b82M22J82l46k53K58K84q2m07kL77J42l86k13L15K95k15l99J40M02k8m14
$$ -282 140 322 -24 -277 -19 265 183 -224 -226 151 293 -93 -306 9 304 89 -310 -170 232 204 -210
4404b10o8L64K11l12k75J90L76j11m05qM28J22m10k07L52K79k55l45J62L66l0
$$ -210 -278 86 297 -15 -290 -100 276 165 -240 -248 180 302 -108 -315 37 316 61 -284 -122 244 214
4425B14l74q4L23K24l05k98J96L75j06l97j8M13J31m00j93K99K94k67l26J17M18
$$ 214 -160 -244 79 303 -2 -300 -104 271 165 -232 -250 163 294 -106 -299 0 294 27 -299 -182 236
4446B36rl75j58L79K57l40l18K30M09j72m18Q1M12O3l90j90L31K92k65l55J41
$$ 236 227 -148 -306 73 330 -10 -328 -98 311 139 -279 -198 214 277 -113 -303 28 320 55 -300 -159
4467a59L94mm27r4M05K10l64k77K91L33j68m13Q5L82N3l53j75L20K70k62l54J63
$$ -159 235 231 -196 -290 115 325 -39 -316 -25 308 140 -273 -188 194 247 -106 -281 39 309 47 -307 -144
4489a44M10n8m20n7M13J34l73k34L21K83k00l29R8L48L9l42j88L88K21k66l71
$$ -144 266 208 -212 -269 144 278 -95 -329 -8 275 75 -254 -156 192 231 -111 -299 89 310 44 -327
4510c27K23M14j40l93J0L86J00l49k06K92K70j67l67P8L59N8l93j26L30K27k68
$$ -327 -104 310 170 -223 -213 173 273 -76 -282 10 280 113 -254 -176 183 241 -152 -278 52 279 11
4531A1l20K10L30j09l74N5L11J27k97k31K33L32j99l12P1L53K1l50q3K98J82k42
$$ 11 -309 -99 231 122 -252 -197 114 241 -56 -287 -54 278 79 -233 -162 191 212 -138 -221 77 259 17
4553A7k53J73L03j08l13l6L00J79l03k72K64L10j89l09Q7L28Kl25r4L02J51k02
$$ 17 -236 -63 240 132 -181 -217 83 262 -41 -313 -49 261 72 -237 -150 178 180 -145 -239 63 214 12
4575A2k50J49L24o7l57n6L69J30l01k08K42K77j76l20P9L41J6l25j17K75K20k23
$$ 12 -238 -89 235 168 -189 -245 124 254 -47 -255 -13 264 88 -232 -153 188 204 -121 -238 37 257 34
4597C4l00J82L38q6l64j4L50J07l35j70K55K69j92l14J03L14K8l24j42L08K33
$$ 34 -266 -84 254 168 -196 -210 140 247 -88 -258 -3 266 74 -240 -137 177 205 -119 -261 47 280
4618B80k91k82K21L48j37l51j5L92M3l17j68K84K48k00l13J12L67k4l43j23L75
$$ 280 -11 -293 -72 276 139 -212 -227 165 208 -109 -277 7 255 55 -258 -146 221 197 -146 -269 106
4639A06J87l09k69K55K83j25l51N5L11O8l26j24K52K55k00l22J34L40m5l75k6
$$ 106 293 -16 -285 -30 253 128 -223 -168 143 211 -115 -239 13 268 68 -254 -120 220 175 -200 -226
4660b26L27J35l22j90K57K44j64k64P7K77O4k99j55K59K38k11k95J66L27r5l20
$$ -226 101 236 -86 -276 -19 225 61 -203 -126 151 215 -84 -239 20 258 47 -248 -82 245 150 -170
4681a70K4K71O8k37j59J71K38j19k68j0L18O9l08j40K76K29k36k41J44K40l6k98
$$ -170 -146 125 193 -44 -203 -32 206 87 -181 -191 127 196 -112 -252 24 253 17 -224 -80 160 124 -174
4703a74K1K33J01k20j79J62K84j64k60L6L33L8l18j07K69J59k18k17J37K58k8
$$ -174 -153 80 181 -39 -218 -56 228 64 -196 -160 173 211 -107 -214 55 214 -4 -221 -84 174 146
4724A46l11j8K40J37k03k42K15K82j53k99N1L04M8l19o2K15J78j88k10Q5K77j5
$$ 146 -165 -183 57 194 -9 -251 -36 246 93 -206 -155 149 197 -122 -184 31 209 21 -189 -104 173 158
4746A58k94o4K92J27k56k10K15K36j46k67P6L13j6k75j04K29J89j67k51J15L03
$$ 158 -136 -200 92 219 -37 -247 -32 204 58 -209 -133 180 164 -111 -215 14 203 36 -215 -100 203
4767B03m7l14m1L17Q8k84j42K41K01j61k41N6L00k3k78q9K43K07k16k81J74L15
$$ 203 156 -158 -199 118 206 -78 -220 21 222 61 -180 -124 176 153 -125 -214 29 236 20 -261 -87 228
4789B28j00l41N0K85N7k75r9K17K14j79k46J06K41J5k96o7K65J58k55k10K35K24
$$ 228 128 -213 -163 122 179 -96 -195 22 236 57 -189 -83 158 173 -123 -190 75 233 -22 -232 3 227
4811B27j37k58L6K83Rk21j26J91J82j47k31J16K57m0k96k0K62R6k50j29J86K16
$$ 227 90 -168 -132 151 160 -61 -187 4 186 39 -192 -76 181 141 -155 -175 87 183 -67 -196 -10 206
4833B06j26k62O5K53K3k16j39J95K09k01j65R0K50n3k39l8K56P9k20j17J24J72
$$ 206 80 -182 -117 136 159 -57 -196 -1 208 7 -158 -68 182 129 -110 -148 108 187 -33 -150 -26 146
4855A46m8k02l0K37O6k27j26J89J92j84j95J02K26k2k27k0J79Q0j40j62J08J82
$$ 146 98 -104 -134 103 169 -58 -184 5 197 13 -182 -80 146 124 -103 -123 56 136 -4 -166 -58 124
4877A24j4k45jK54M3k48q1K03J59j77k02J04K13j8j96o1J59J95k04k09J30K65
$$ 124 110 -135 -136 118 161 -87 -168 35 194 17 -185 -81 132 114 -82 -143 16 211 7 -202 -72 193
4899A93r3k60KK89J6k28q6J73J47j26j81N6K14Rk28j06K54J74k17k22J85K47j43
$$ 193 100 -160 -158 131 147 -81 -167 6 153 27 -154 -98 116 125 -103 -209 45 219 2 -220 -35 212 69
4922F9k31K5K63K0j96j27K00J61j42k19Q6K45Mk96k6K60J16k78j35J91J97j47
$$ 69 -162 -137 126 146 -50 -177 23 184 42 -177 -91 154 158 -138 -164 96 212 -66 -201 -10 187 40
4944D0k08L7K49L5k56j07K07J89j72k29J36K50l4l02K2K60J8j90r5J73J53j21
$$ 40 -168 -131 118 153 -103 -210 -3 186 14 -215 -79 171 137 -165 -143 117 135 -55 -150 23 176 55
4966E5k16N7K18J0j96j30K47J51j95k11J77K23j31k10M8K07Lj79q1J61J29q3j90
$$ 55 -161 -104 114 124 -72 -202 45 196 1 -210 -33 190 59 -151 -103 104 107 -72 -153 8 137 54 -136
4989a36J6K50K7k72o1K41R4k05j22J43J61r7j63N0J54L8j22j28J38J62j05j99
$$ -136 -120 130 157 -115 -176 65 159 -46 -168 -25 136 39 -124 -74 80 118 -4 -132 6 168 63 -136
5011a36O6J83qk17k5K26L3j29j07P6J40j6j62l1J44Q4j46j28J29J92j29k08R8
$$ -136 -70 113 105 -112 -137 89 122 -7 -114 -38 102 86 -76 -107 37 121 -25 -153 -24 168 39 -169 -71
5034g1J87j5j81l6J46P3j04j50P7J93l3k09j9K33O7k14q6J77J36j45j41M1J51
$$ -71 116 101 -80 -116 30 103 -1 -151 -74 119 86 -123 -142 91 158 -56 -142 35 171 26 -115 -74 77
5057G7L4j92l2J39J47j33j75O8K59o3k77K6K36J2k27m1J46J45j10j87M2K11Pk06
$$ 77 111 -81 -113 26 173 40 -135 -67 192 129 -148 -122 114 126 -101 -142 4 149 39 -148 -106 105 112 -94
5081i4j13K53J16j73j68J56K14j21k31N9K18J7k10n2J36J45j13j79N4K44l6k33
$$ -94 -207 46 162 -11 -179 -23 191 70 -161 -102 116 133 -77 -129 7 152 39 -140 -86 158 122 -111
5103a11m2K46J07k26j69K02J64j32j99R4J79j3j67q2J53J48j37j83J16K06m0k64
$$ -111 -153 93 200 -26 -195 7 171 39 -160 -66 113 100 -67 -149 4 152 15 -168 -52 154 114 -150
5125a50K7K45Jk07p3K08Q9j15j22M9J84m6j52o6J73Q2j20j52J35J67j08j94Q5
$$ -150 -123 122 123 -84 -157 51 140 25 -97 -48 136 90 -62 -128 45 127 7 -145 -10 157 49 -145 -60
5148f0J82m3j67jQ9J02p9j53N9J56pj51n6J81Q8j73q4J10J03p9j07L9J15Qr2q2
$$ -60 122 79 -88 -89 0 102 23 -130 -71 85 78 -73 -129 52 140 -33 -117 -7 96 17 -90 -51 64 72 -20 -102
5174a02N4J40n3j45M5J71rj74l1J29P5r3j05Q3R5j3j33l7J22J13j27j34J18J43
$$ -102 -48 92 39 -106 -61 110 101 -73 -104 25 100 7 -98 -15 80 67 -66 -103 19 132 5 -129 -11 132
5198A32r3j83N8J77k6j24m1J00Q1p6j04L0J53K3j66n8J40J05j35j39J05J90j15
$$ 132 39 -144 -86 91 65 -59 -100 0 81 5 -99 -69 84 107 -59 -117 23 128 -7 -146 -41 149 34
5221C4j56P2J41K5j52n6J42J11j13j73N5K20k8k29mK08M7k20n3J61J00j38j24
$$ 34 -122 -50 91 116 -36 -92 50 161 48 -125 -70 150 122 -107 -111 97 144 -76 -129 32 132 -6 -130
5244a30O0J52J6j69r3J82J46j71j58J17K08j02k10O2J83M0k08o1J70P8q2j59N7
$$ -130 -70 82 98 -71 -164 18 164 -7 -165 -48 160 58 -152 -90 93 133 -75 -136 34 112 30 -129 -72
5267g2J71L2k34o0K38O2k06r0J88J25j25j45Q5R8K4j61m4J34Q4j08j35Q4J81p6
$$ -72 99 131 -103 -163 75 137 -69 -159 29 154 29 -116 -31 67 91 -70 -114 20 104 -4 -139 -55 126 50
5291E0j50j1K02mj81JJ16P6j15q8N8Q4L8j08o6J21J10j40r8J14J12o5j93J14Q5
$$ 50 -100 -111 91 87 -94 -93 23 99 -16 -104 -46 38 76 -32 -98 23 133 -7 -105 9 121 56 -137 -23 62
5316F2%j08j4M9Q2m9q2J5R4K4r9p5J18O6j03o4O4Q0o3n7j3J00pj0q4K9J22rj31
$$ 62 62 -46 -60 -11 71 22 -60 -45 49 73 -26 -101 17 83 -20 -84 -20 60 -3 -60 -73 27 20 10 -74 -45 77 68 -63
5345f3j0J22M2j54k9J04Q7j02p7M9P7Ro1r2R4Q6p7j42Q7J51l0k06L6J72Nj43m2
$$ -63 -73 49 91 -63 -92 12 99 -3 -80 -31 46 55 -6 -98 -4 82 5 -137 -50 101 71 -135 -99 73 78 -65 -107
5372a07J25L0n4r1RJ32N7j68q9J90J20j73j03R8J57r6j46P4J39nj49k0P7J10r5
$$ -107 18 48 -6 -97 -88 44 101 -67 -156 34 154 -19 -122 -24 133 37 -109 -35 104 99 -50 -70 7 117 22
5397B2j33K2K10k5j77m4K38nj69o0J36R6j08j23P6J39l9j11o2J14J22j17j34R8
$$ 22 -111 -89 121 96 -81 -125 113 108 -61 -121 15 111 3 -120 -44 95 56 -55 -117 -3 119 2 -132 -34
5421c4J71q9j84P5J43j1j49rJ37L2j03o3L1J48j1j71k7J91P5j83q5J58N2j12o9
$$ -34 137 48 -136 -61 82 71 -78 -87 50 82 -21 -84 -53 95 84 -87 -114 77 152 -31 -116 42 94 -18 -87
5446h7O1J01o0o0k1P5N7n2r2J7J26Kj72K0J77l8j42lJ20mn4m5N0L5M2p5oMQ7m3
$$ -87 -26 75 15 -45 -66 9 66 14 -78 -61 65 67 -105 -85 92 54 -88 -91 29 25 -29 -74 -24 11 53 -22 -28 -24 63 20
5476B0j20J05O5m1q8M1O7nr6J6M7J4jm7l1P6N6j02o4P3R8q0j04M8P8k7m7j4O8
$$ 20 -100 5 70 29 -59 -18 49 44 -52 -36 11 25 24 -23 -54 22 78 -24 -88 -15 83 3 -101 -53 25 -2 -49 -63 5
5505EL2Jj25K1J05K9j21l5J24O4j41n2J28O3o5j02M3O3%m2l9K2J25o9j46L5J56
$$ 5 37 38 -87 -66 39 68 -53 -88 36 100 -41 -93 35 98 33 -69 -26 37 37 -5 -44 -22 103 34 -112 -77 79
5532G9k9j74L5J55Kj41k8J08P0o2o9LJ26Mj23j03J37J37j43j25J37J48j17j60
$$ 79 50 -124 -89 66 68 -73 -101 7 77 15 -54 -51 75 79 -44 -147 -10 127 -16 -141 -4 144 27 -133
5556a33O2J67k4j34m0J25J03j10j35N1J71k5j77kK04Kj72k5J49N9j33q8R2P2j4
$$ -133 -71 96 72 -62 -102 23 126 16 -119 -68 103 78 -99 -101 103 105 -67 -92 57 116 -17 -105 -13 59 45
5581D5j00k2J05O8j03j19J12J35r8j48P7J52o2j26K9J08J0o7l8J0J02k4r0k0R8
$$ 45 -55 -77 28 96 -7 -126 -14 121 23 -125 -48 104 42 -84 -55 53 63 -4 -42 -32 70 46 -44 -64 34
5606C4O6j47m9J43M9j17o0R8N0o6l4J8RL4k3p9M8O0J8j08LR9Rj29K0J06k7m8j
$$ 34 100 -47 -96 47 96 -21 -81 17 67 1 -33 -15 -6 28 5 -74 -26 34 52 -56 -53 46 55 -74 -54 52 25 -23 -24
5635b4L7lK5l0o9O0L6Mr6M7P1oq8OJ12o4l2J3mK6K8m9o3L9Q1k2j33P5R9m3j17
$$ -24 13 10 35 5 -64 -4 32 36 -60 -13 58 52 -36 -30 82 18 -14 -1 -5 21 49 0 -63 -24 57 35 -98 -23 76 33 -84
5666h4K9J05k4m8n0O8K3J3r2J8J01K0j16q7J50Q6j47o8R7J08r7r0N3O0K1o0p1
$$ -84 -55 50 26 -22 -72 -4 19 32 -60 -42 59 79 -37 -124 26 112 -35 -103 -6 102 5 -85 -32 28 49 -11 -82
5693h2O2J19o6j28M6J44jk08L8J71qj40m9J30L9q8n0J8J00M1j36n7J15R5j28j17
$$ -82 -20 99 33 -95 -49 95 94 -114 -76 95 87 -53 -102 28 67 -21 -71 -53 47 88 -48 -105 10 105 -23 -140
5719a40J22J55j44j37R8J36p2q7j4J05L1n5o4N2J10j1j51pJ74J3j81l6J69K3j31
$$ -140 -18 137 -7 -144 -46 90 18 -69 -83 22 53 -2 -66 -14 96 85 -66 -73 101 114 -67 -103 66 89 -42
5744d2l5P7L6j8p2K1L9M6o7q1O9J33j21j05Q6J47r7q9L9R5n4l9K8K5kQk5m9R4
$$ -42 -77 0 36 18 -54 -33 6 52 -15 -96 -27 106 -15 -120 -34 113 16 -73 -34 61 7 -32 -4 21 19 27 2 -47 47
5773D7L2j03n7J20J8r8%N9J1k4k6L6j8J0j5j0j4N4J2m6l5P0Lq4L6L8k3k0L6Kj9
$$ 47 79 -24 -81 39 57 -41 -41 18 29 5 -21 15 -3 7 -8 -18 -32 22 34 -12 -47 23 26 -58 -22 16 -7 -27 9 11 -8
5804hOL4o6j2R6J7p4o1J07L3j11KN7K5j6m7k2K8N9l6p4P3M7k3j24L8J23l8j10
$$ -8 -2 32 -34 -46 50 67 -7 -68 39 72 -39 -37 20 45 29 -18 -40 -12 47 11 -63 10 57 34 -90 -52 71 33 -77
5833g7J1J18j1q4pM2M2j3o0k8R1P5j39p8J58N6j06r8J11R3r4r6R1P6k1p6l3P2
$$ -77 -66 52 41 -43 -50 -8 34 21 -39 -67 24 99 -40 -118 40 96 -10 -108 3 96 2 -94 -3 73 52 -24 -57 15
5861A5O7l3j65M9J64j5k01N0J73n2j62L3J25K8j06o3P7O0pp8q2J16J13j32r9J36
$$ 15 82 49 -116 -67 97 82 -119 -69 104 52 -110 -77 48 76 -30 -93 -16 44 37 -41 -123 -7 106 -26 -125 11
5887A1J16j29j02J06J15j12r8P8O8%p7l5M1Q7j4j13oJ34Nj67NJ54K0j44qQ9M7
$$ 11 127 -2 -104 2 117 5 -93 -15 53 53 -24 -59 -18 69 55 -58 -64 70 75 -92 -87 67 87 -57 -65 24 71
5914G1r4rJ3K3Lk4n1N1R3o0j12N6J23q1p7N4R4o6n5M0N1l1nQl4K9K7j2p6O3P0
$$ 71 -23 -32 -19 4 7 -17 -68 -17 76 16 -96 -40 83 2 -75 -21 73 7 -48 -8 43 12 7 15 -19 10 37 25 -51 12 82
5945H2j05j1L9K6n2J1K2j3j8N3l1o4O8K9l3p8N7O6p6j0O6k3k6N5m2j2N2K1o4n1
$$ 82 -23 -34 5 31 -21 -10 12 -1 -19 34 3 -61 7 36 3 -75 -18 48 -28 -38 28 5 -21 34 -8 -20 32 53 -11 -62
5975f2Q4M1j00j2Q2N0r9k2M4M0m1m1MJ6N1m5n2K2J02k9j33N1J45o2j20L6J13n
$$ -62 22 63 -37 -49 33 83 -16 -38 6 46 5 -36 -32 -16 35 -10 -62 -40 62 33 -100 -49 96 34 -86 -50 63 58
6003E8r7rN8N3n7o6mJ05M1j27n9J62N2j06j39J57P3p4j39J32M9k1r7K1O3L7k9
$$ 58 -39 -48 10 63 6 -60 -64 41 82 -45 -104 58 110 4 -135 22 95 21 -118 14 63 42 -55 -34 29 66 37
6030C7j10K6J36l2j59L1J84o5j47kJ34Rr9l3R8N7o1p0J9Q1M9j26o5J13Q7j03j15
$$ 37 -73 -47 89 57 -102 -71 113 48 -99 -101 33 42 -57 -90 8 65 4 -66 -47 34 83 -43 -108 5 92 -11 -126
6057a26J36P4p4p8O5P2n9m0J1K8j2K1p5K4Q3Mj01mJ04mq8pJ00l2p8K9N3o4K7J5
$$ -126 10 84 10 -68 -3 69 10 -30 -19 9 -3 18 -57 -33 50 54 -47 -51 53 49 -39 -46 54 22 -56 -27 26 -38 -11 4
6087Drl6O4k5l0J9L9j7p8O5J8l8oO0j1k8L6Pl8l0N8Mo6K6L9k9l1K6pj5L1M3o9
$$ 4 -5 -41 23 -2 -32 -13 26 9 -69 -4 14 -24 -30 30 19 -9 27 34 -4 -34 24 28 -38 -12 27 -2 -33 -7 -14 -29 2 45 -24
6120b4j0O3Rj19M5R5l2q4J3J00n5n0K5K2J5j5Mk1L4L1o5m0O5P0q1j07J40P0r6
$$ -24 -34 29 38 -81 -36 59 27 -57 -44 56 1 -49 -24 -2 13 -2 2 -19 15 46 -19 -59 6 76 -5 -112 28 98 2
6149Br7J29J9m5n0JO9lk2n4K9J12n3j11J3J68n3j31K6J08j7j14JJ03Jn2j8QQ8
$$ 2 -95 34 53 8 -42 -41 28 25 3 -51 -22 90 37 -74 -61 107 54 -77 -51 57 40 -74 -73 30 31 -21 -39 -31 57
6178E7lj06k4J11O7j13j25J46J06j16q4P4J02p5m4NO1M6j07k1L5O2Rj37K7J41
$$ 57 54 -52 -76 35 102 -11 -136 10 116 0 -84 -10 92 17 -27 -22 39 85 -22 -43 -8 54 63 -74 -47 94
6204I4l7j54L5J28Rj42KJ03j0k7m5J2N8L6q5n5P4P3p5o8P9Q2j00o6Q0O3q8j4N3
$$ 94 57 -97 -62 66 75 -67 -65 38 28 1 -44 -32 26 62 -23 -78 -4 69 -6 -74 5 87 -13 -79 1 64 -24 -38 15
6233A5J7k8lj4qJ5L2o7K0R1m0q8K5P6j8l8j3M7m9j2N2Jk9lK5m1J1L9nm9M2L1n6
$$ 15 32 4 1 -13 -21 -6 26 -41 -21 70 30 -58 -33 43 25 -13 -26 21 -28 -40 12 13 -16 -19 6 -35 -24 15 10 -39 3 34 -22
6266b2kM1J0o6L8M4n6l8P0J1m1k8O4J3n3RLK3j6nl6L5M6j6r4M7P3m0r4O1R4n0
$$ -22 -24 17 27 -39 -1 43 -13 -51 19 30 -11 -39 25 38 -15 -6 -3 20 4 -1 -37 -2 44 28 -66 -19 54 14 -80 -19 75 25
6298B5p2PO0j7k3l3J9J6N0n8k8O8Q8j43o4J15R0j21q0Q3Q3p5l3M7M8m0l7k7N3
$$ 25 -47 -40 20 3 -20 -53 -34 -18 32 -26 -54 14 102 -41 -105 10 100 -21 -101 -18 65 -10 -43 4 52 12 -25 -52 1
6327AP9n6r3J6J35n1j27M4J45p3r4J3Q2K0q6MK6L3J1r9J3R7M4j07q3J61N2j51
$$ 1 80 24 -69 -53 82 31 -96 -52 93 20 -74 -61 21 41 -45 -41 -15 18 29 -70 -57 40 84 -23 -106 55 107 -44
6355d4m9R5R5j02l7J5R3l2l5m1L7O8k8j05K8J25l6j15J7R5k2p1lR2j2o5KM5j0
$$ -44 -93 2 97 -5 -42 -27 66 34 -1 -42 -5 63 35 -70 -42 83 47 -68 -51 44 22 -49 -52 40 28 -37 -35 10 0
6384@jk6J8mM5o3j8Q9M1j04o7J19Pp7LM0LoRj4mJ5K3j8k4M1J8o2J8N1n8qJ5K5
$$ 0 -1 -27 -9 -13 32 -31 -49 40 81 -23 -90 29 36 -41 -38 2 5 -1 8 -6 -10 5 28 10 -14 27 45 -17 1 52 -6 -14 1 26
6418B6k7m6N8Pn7J7N3j5n1J1J9NkOl4QN5k4n1L2P9q9l4N8P2o6q9Q5L2m7l8M3K3
$$ 26 -1 -47 11 18 -39 -22 31 16 -35 -24 -5 0 -2 4 -30 -22 33 9 -42 -10 69 -20 -54 4 76 10 -79 6 38 -9 -47 -4 19
6451A9qRm3K8L3J5j02NJ23l3j26L3J23k5j17L5O2mn8l4P1K0j3n3k5O4N7j01k9
$$ 19 11 20 -23 5 38 53 -49 -44 79 46 -80 -47 76 51 -66 -31 31 27 -31 -65 6 26 13 -40 -65 -1 56 -45 -74
6480g4J11O7j25r8J25J05j23o3Q7M4l4l1j3L1Q9o3j07M0J06k7j44M1J15j7j23
$$ -74 37 104 -21 -119 6 111 -12 -75 12 56 22 -9 -22 9 98 35 -72 -32 74 47 -97 -56 59 42 -81
6505h1N6R9l4r0jM0K6k3l5K1N4Mq5m8R2J14j28p3J14O0q2p3Q7L0k5m4J1K2J8j5
$$ -81 -25 74 40 -50 -51 -11 15 -8 -43 -22 32 36 -49 -97 -5 109 -19 -92 22 82 0 -73 14 44 19 -25 -14 8 26 11
6535A1m2OP0j0j04N4R3m6j02L6J06o2m8K2L0k0k4nJJ1K3j9l2M4M1m3o4Q2pm1l4
$$ 11 -31 -25 45 35 -69 -15 78 32 -70 -34 72 10 -38 -16 14 -6 -30 -35 -34 -23 0 -19 -51 -7 34 -9 -73 9 2 -39 -73
6566g3J11j7n6K6N3l4l1N0j0k9J3K3k7j4M7k3j1J9J4p0OM3K0m7l1Q1m6m6J9O1
$$ -73 38 21 -35 -9 44 10 -21 29 19 -10 3 26 -1 -15 32 9 -2 17 31 -39 -33 10 30 -17 -48 33 -13 -59 -40 21
6596B1l5pJ7pJ6J3m5k4N4N0o2n9Q5Q2j20o3J15K8n2n9O7K4k5l2L1j3J2ln4K7J05
$$ 21 -14 -21 -4 -11 5 18 -27 -51 3 53 -9 -68 17 99 -21 -84 31 59 7 -52 15 39 14 -18 13 0 12 9 -45 -18 87
6627H7m7j13N1R3l6j38K5J61n7q4J1O4J8n3l6K0P9kn5n5Q1M6q7p0J19O9j16n4
$$ 87 40 -73 -22 71 35 -103 -78 83 26 -58 -47 17 35 -18 -54 -34 45 43 -12 -67 14 60 -27 -97 22 91 -25 -79
6655g9J08M7p7k0ROM1m0l7K2P3kj12L8R9k9j51N9J06l0q9J7O5k2l5J7MJ1Rj4m2
$$ -79 29 76 -1 -21 -12 -6 35 -5 -42 -20 53 51 -61 -23 76 47 -104 -45 61 31 -58 -41 24 2 -33 -16 -12 -1 8 -6 -48
6686d8Q6Mq6k6R6M5j07j7Q9j4o6J1K9L1l4MPj1P1n3l1J4L7j2q3K6R6l9r5P7N1
$$ -48 38 42 -44 -70 26 71 -36 -53 36 22 -44 -33 -4 27 -7 -3 4 -7 64 11 -20 -6 31 19 -64 -38 58 19 -76 1 52
6717E2n7n0O4mm0Pj2kK5L3l7lM9j4j9nM6k8o1M5N9n6j9K4M9o0lJ5N7n8J3jj5K7
$$ 52 -5 -55 9 5 -35 -28 -40 -42 -17 16 -21 -24 25 11 -8 -13 33 5 -56 -11 48 -8 -27 -3 46 -14 -17 -2 55 -3 10 9 -6 21
6751B1J1o5J7M9Pj00oJ11j1q1J9N3j9o6LQ3%l4k0lK2N0o0m1J02N2j05n8R6K7n3
$$ 21 32 -33 -16 33 40 -60 -66 45 34 -47 -28 25 6 -60 -57 26 26 -8 -28 -31 -9 41 -19 -60 42 94 -11 -69 27 54 1
6782Am2O9L1l9n8L5QJ3k0l9QP9o5n1L4J07n0r5L9Q6j9p7%M4K2n1QmL4J8m6l0P3
$$ 1 -41 28 59 20 -38 -3 5 18 -2 -41 -33 46 -19 -70 -36 71 21 -74 -35 51 32 -45 -45 -1 21 -30 -22 -26 8 26 -20 -50 23
6815B3M9r5o3J01N4j00k5O2O4o3n1M0K5j4n0MN2M8o9o1N2O8%j32K4J30q0n4M8
$$ 23 72 -23 -86 15 69 -31 -56 6 70 7 -44 -4 21 7 -43 -39 13 61 -8 -69 -17 51 51 -81 -57 73 -7 -61 -13
6844a3M4k3n6J8J7qJ6k2nM4jm8j9O1M5q5k4Q3J5n9j4M4mj9KMK1m3M4j9qN2k4m0
$$ -13 31 8 -48 -30 -13 -21 -5 -27 -32 12 11 -37 -56 5 50 -35 -59 24 39 -20 -34 10 6 -13 -11 -7 14 -29 15 -4 -12 40 16 -24
6878b4J6M2n7m2N0L3j6l3L8J8o1k3N4mj8J6K1l4L1jm0%N1j2m7M6M3n3n5N9L2m2
$$ -24 -8 34 -23 -65 -15 18 2 -31 7 25 -36 -59 -5 -9 -27 -11 10 -24 7 6 -34 -34 17 5 -42 4 47 -6 -61 -2 30 -12
6910a2l8P8Ol0l4L7pNOl9lP4nq1k9J10j0o1rP7l5m8J3M9nk5rRL4Nl6n3P7M8q1
$$ -12 -50 28 34 4 -30 7 0 5 11 -28 -31 43 38 -43 -72 38 28 -33 -42 35 0 -48 -35 14 9 -16 -25 -16 18 23 -13 -66 11 59 -22
6945b2m6J03K6q1l5P0M5o1l9N3LJ3l0j3J4K1oo0K3P8l9r5K5J21n6o6NQ7jp9nN4
$$ -22 -68 35 61 -20 -55 15 60 -1 -40 13 16 29 -1 -14 0 21 15 -45 -22 56 17 -78 -53 68 12 -54 -49 38 37 -42 -47 7
6977GJ9l9j0k9O6J0p3j6P2O7j19%N4O0r2LQL0j7pK3Oj6Kl4N1J7k7n8J5R3l5r6
$$ 7 26 -13 -23 -52 14 24 -49 -65 7 74 -45 -45 9 69 -23 -20 -12 18 1 -6 17 23 7 9 -25 26 43 16 -42 -27 66 31 -65
7010f5K0Q4m0m2K6K9k8k2N0pk7K3k8KM3J3n2MN5j5m8K8K4j3o2L3M6k8KKPkJ0r
$$ -65 -45 39 -1 -43 -17 12 -16 -38 12 5 -22 1 -27 -25 18 31 -21 -17 38 23 -25 3 27 14 -48 -15 31 3 5 7 14 12 22 13
7044A3l3J3L6k9k3K4M6p3j2K5K2l2j2O3Ko1PK7Qm7NRJ3K8mo4M3M9m8k8QN9l1m0
$$ 13 -20 -7 29 0 -23 1 47 -26 -38 -13 9 -23 -35 28 30 -31 -24 3 11 -36 -31 -22 -9 19 15 -49 -6 43 -5 -33 -25 34 3 -37
7078c7K4N6m4l5M7J7k6Pk5L7K2j0p8L2O6j2q4jR3jr1nP9Jo3oK7K6k0k1k0P0Ml6
$$ -37 -13 43 -1 -36 11 28 2 9 -16 21 43 33 -45 -13 53 41 -43 -44 49 48 -43 -48 31 32 -31 -37 -10 16 -4 -25 -45 25 29 -7
7112gl0N1M3p0l0M9M8o0k5N3K3r0L9K7JLk6qnN6j8q9M0Q7k1j12L0Q0j8o3mK7M
$$ -7 -37 14 57 -13 -43 6 54 -6 -31 22 45 -45 -6 21 22 25 -1 -9 -14 42 24 -65 -25 62 41 -71 -41 39 21 -42 -46 -19 -15
7145a5J8k0K0Lj3Nl2N9Oo7j8N6L3m2k8N0L5p0j0N4kl6Pj4K4kL5n8KO8m6o2N4O3
$$ -15 3 -17 3 6 -7 -2 -34 25 31 -36 -54 2 35 -7 -35 15 50 -20 -30 24 22 -14 -7 -21 3 1 36 -22 -20 48 2 -60 -6 57
7179E7p2k9N7Rk3j2JOOJ1k8L1l4L3m3K2J8j0j9K1K5nm9M0L4l3m6K2K9klrJnj5
$$ 57 -15 -44 13 22 -1 -13 -12 -6 0 11 -17 14 -20 13 -30 -8 10 0 -19 2 27 22 -27 13 47 14 -32 -10 19 17 14 5 6 1 -14
7214a4J5k5M6%k4oK2J4p0QO7Ko2k6M8K4j2l8J7K2K7m9Jj7N1l6j3J6J1J1m8L6N5
$$ -14 1 -24 22 22 -2 -8 14 28 -42 -34 33 35 -27 -53 -5 19 7 -31 -14 8 35 -14 -13 -30 21 -15 -28 -12 -1 10 -38 -2 53
7247E3o1m9O9K1l0j6M2l0K7m3j8K2M6kn9kP4k8n7K0M2jo8J4M4k8rOK4J4J9n7m0
$$ 53 -8 -57 12 33 3 -13 29 -1 26 -17 -35 -13 33 31 -28 -30 44 16 -41 -21 21 20 -48 -34 10 -18 -27 -21 3 17 36 -21 -61
7280f1P9kl8oL1M8n2n5N9N1m7l8M2rM3p9L1KJ4rl2K9J8J1n5J0M2k5n2M0K2Ml0
$$ -61 18 16 -22 -28 3 51 -1 -56 3 54 7 -31 11 2 45 -34 -3 -1 13 4 -28 1 19 30 -25 -15 27 2 -50 -10 12 16 -14
7313a4mRL4n5j1L1J5J3j4n0Q9k5m7oP1j8l7JM0Ql3R%rj2nNK8%k5j1NL4k4pML9
$$ -14 -18 -9 25 -30 -41 -10 5 18 4 -46 43 18 -29 -35 36 18 -19 -18 22 30 -3 6 6 -3 -15 -20 -15 13 13 -12 -23 -18 16 -8 -15 -11 28
7350B8k0m4L4J0j7j7J0mJ3J2j8j5L6nl5K1K0Mn7K3L9nn0L1L4pm8J3N5p3PL3k2
$$ 28 8 -36 -2 8 -9 -26 -16 -20 -7 5 -13 -28 8 3 -32 -11 9 13 -44 -21 18 13 -37 -6 28 21 -27 -14 41 -32 -25 8 -14
7383a4K7Ml9J2L0Nm9%K6L7q6J6N9k3Km9N0j8J1k6oQL1j8k8K9Q3o8n4M8L8n1k2
$$ -14 13 17 -22 -10 20 25 -24 -24 2 39 -47 -31 28 5 7 -42 8 -10 1 -25 -31 -23 8 -10 -38 -9 74 6 -48 0 38 -13 -35
7416c5L6J8Nn2M3Qjk7k8K2J1j2Mk5L3K2n3nP3k7l5J4K5J0m1mLL8j7mJ3J4pl9r
$$ -35 1 19 24 -28 15 23 22 -5 -33 -11 0 -12 -8 -33 0 22 -31 -36 37 10 -25 -11 14 24 -17 -21 -18 20 3 -1 12 26 19 -20 -29
7451b9L0O0o8JL1%k4k0nM1rpj4jJ9J1k5K0J9j8m9K6K6k5l3M5J9j3j4oL3j0j1m2
$$ -29 1 61 -7 -6 25 25 1 -19 -24 17 8 1 -13 -14 5 16 -9 11 30 12 -37 -11 15 -10 -43 2 21 8 -6 -12 21 11 0 -42
7485d2L7J4J1k9j9K8J9m1j1M6K7o8KN6rm6PL5l1nK4k3RJ5kkk1M4o6J6L8J1k6o
$$ -42 -5 9 20 -9 -28 0 19 -22 -33 13 40 -28 -26 30 21 -25 -18 17 -14 -19 5 -18 -9 6 4 2 -19 25 -41 -25 13 24 -2 -8
7519hj6M9l8Mj4M2j5j2kK0Rm4kL0J4j6j6K0K0k5PoM2m0l0K4L1j6l0L1JNj7j2J9
$$ -8 -24 25 -13 -9 -23 19 4 -8 -10 10 19 -25 -27 3 17 1 -15 5 25 0 7 1 43 3 -27 -3 28 12 -18 13 14 19 2 -10 9
7554IPk7qPM2J2o1%K3Ok5QoK7l7Kk3L6%nNlK9k3JPM0m0m0M0N0n2j7L2J0l8L2l3
$$ 9 16 -11 -19 -12 30 42 -19 -19 4 10 -15 -7 -13 14 -23 -21 -44 -8 -8 -13 -8 -11 18 -5 -4 3 43 3 -37 3 53 1 -16 16 26 -12 20 -13
7592a3J9Nnl4kO5m1l9K4M0k8k6j9Q0l0n7N4nK5k2oQJ7orqML4l5oK9ok0mJ1K5l8
$$ -13 6 11 6 -28 -30 35 -6 -45 -21 19 -9 -35 -54 26 -4 -61 -7 -12 13 -9 -15 -7 10 4 -5 -13 -9 25 -10 -16 13 7 -13 -17 -6 19 -19
7629a9jJ2K3j3j5K2noRj9K2j1Nj0Rk7K0oj2L0j6K8k2Kj0L0pm4RRj%JK5j9k7O2
$$ -19 -20 -8 15 2 -13 9 4 -2 7 -12 10 -1 4 -6 3 -24 -4 -10 -22 8 -8 20 -2 0 -10 20 13 -31 -22 -13 -14 -14 -13 12 -7 -34 28
7666B8Rp6L7K1nk8JL2j0Pl7J0J7J0Nn3O9k8j9j8mK4Jk7kM1j0l2OM2j7k5K7k0M5
$$ 28 37 -39 -2 19 14 -14 -13 19 9 16 -21 -11 6 16 21 -32 37 9 -10 -28 -32 -8 -7 -34 -36 5 -5 -37 -31 11 -6 -31 -4 -24 21
7701B1l4J4n1M8Rl3K0L9l5j2J4L8m7j1J5J5K1m8J8j6K7j1k0l0O1qk2j2K8Nj9k3
$$ 21 -13 1 -50 -2 7 -26 -6 33 -2 -14 0 38 -9 -20 -5 10 31 -17 1 -15 12 1 -19 -49 12 4 -18 -30 -2 3 -16 -39
7733c9O5j6k2l7N8pl0K3qK5j3oj4K1J8k0j2L0OJ4n3J0K2k8POK4j4j2Lk4RK0k7
$$ -39 26 10 -12 -49 9 2 -28 -5 -13 12 -1 -7 -21 0 18 -2 -14 16 22 36 -17 -7 15 -13 -6 0 24 10 -2 1 -23 -14 6 -21
7767b1mL5J6l9k4O0l9J6n6O8rm6L8oK7k1LnK5oql7L3MK4m9K9j5l9J8M2Pk9RK3
$$ -21 -25 10 26 -13 -37 23 -16 0 -56 12 3 -43 -5 -11 16 -5 -2 -7 18 12 4 -33 0 4 28 -21 8 -7 -46 -28 14 21 -8 1 24
7802B4nk2ok8L9J1Jl0L1K1m4m0L2J1%l2J6J0kRok4K9j0K0l2L2Ll0%J5J5m6K4J0
$$ 24 19 -3 -9 -37 2 13 14 -16 15 36 -8 -48 -16 -5 -5 -37 -21 -11 -13 -4 -10 -34 -5 -15 5 -27 5 8 -22 -22 -7 8 -38 -14 -4
7837dK3l2j6K2L6k5j5J7J9j9j4K2l1pj4OLJ9J8l1QL6l3l7M8qJ4m2J2K8j0J5k7
$$ -4 19 -13 -29 -7 29 4 -11 6 25 6 -8 14 -17 -24 -38 -32 -29 -10 8 -23 -15 21 -12 -49 -1 -9 5 -37 -25 3 -7 8 -19
7870a9K8JRo5K4J8J3k2oM3k6j8j0L3NKm0K2J3J0k9J5lJ1m7J4RJ3j5jL0J1k6n1
$$ -19 9 10 19 -46 -22 -4 9 -13 -19 24 -2 -20 -30 3 8 10 -30 -8 5 15 -14 1 -2 9 -38 -24 -15 -2 -17 -18 12 23 -3 -54
7904e4L4LqQ%M8j1j6j9J9kj4kRJ5mkk3L8k2j7KpJ8lrM0j3k2jOnJ3k6JJ0J4l2K6
$$ -54 -20 -17 -25 -17 -17 31 20 4 -15 4 2 -12 -14 -5 10 6 4 -19 19 -3 -20 -18 -25 -7 -10 -19 21 8 -14 -15 -9 -14 -1 -27 -26 -16 -2 -34 -8
7943hMKoj0K6Nll8J4%M%%qK1Ol3K8J6m5RL5nj4Nm6Q0l4j2LKJ1j0j9%K5j1m0QL7
$$ -8 -4 -2 -8 -18 8 13 10 -28 -14 -14 -10 -10 -10 -18 3 9 -24 4 20 -25 -16 19 14 0 5 -41 39 5 -7 -4 -2 9 -1 -20 -20 5 -6 -46 -38 -1
7983aJ0n0J5K7k4J7j0NJ6jj9JL1l0J7k9M5pj3jJJ4k7RKK1j4j9kJ9j0QJ0j7J9l5
$$ -1 9 -41 -26 1 -23 -6 -16 -11 5 4 -15 -14 17 -13 4 -25 20 13 0 -1 0 14 -13 -4 -2 19 5 -14 -16 3 -7 1 11 -6 13 -22
8019b2MJJ7ol0J5N5m5l2L1Jjk0%J2Jj5J8kJ8Llj2L0Qn4K3K5J2l6oL9kn3k2M3J0
$$ -22 -18 -17 0 -6 -36 -21 34 -11 -43 -12 -11 -12 -32 -32 -20 -19 -34 -16 -18 0 3 0 -12 18 26 -28 -5 20 32 -4 -10 29 27 -26 -48 -5 5
8056Ek7%J2Plk0k5M6Kl0j0L5L2k6nOj7k9M8l2L3m0K4lpK4J2j9kK7pl8J6K2j5j8
$$ 5 -22 -22 -10 -3 -6 -26 -51 -5 -3 -33 -43 -8 24 -2 -7 -1 -18 -47 1 -31 2 -38 -14 -17 -24 0 12 -7 -9 18 11 -27 -11 11 -4 -22
8092b2K0K1j5m9K0N1j8jl7K7K6j3j7mPk3NKL7m1J0k3K8j0J4j6rJ8qK6l3K1L5l0
$$ -22 -2 19 4 -45 -25 26 8 7 -30 -3 23 10 -7 -11 -4 -27 -22 -20 17 -24 -14 -37 -9 -19 -5 -21 -30 -12 -20 6 -27 -6 29 -1
8126ao2O7K0j0j0kNk2PJ0L1k6l3KK5Mk8j2K8Qk1kJ0Mj0LqK9kl3j0L3Pk3JMK4j2
$$ -1 -63 4 24 14 4 2 7 -15 -8 2 33 7 -26 -24 1 5 -23 -35 -7 1 -20 -22 -12 -8 -18 -15 -23 6 4 -29 -39 -6 1 -22 -21 -17 7 -5
8164ek1K7K4k5%j4K4kj9MjJ9nk5J8J2k4pMk4M5Lk3J8Rj8k2
$$ -5 -26 1 25 0 0 -14 10 8 -11 -7 -8 11 6 -19 -1 11 -13 -20 -16 -40 5 8 -15 3 12 -6 -28
8191b8
$$ Imaginary data points
##PAGE= N=2
##DATA TABLE= (X++(I..I)), XYDATA
0@%%%%%%%%%%%Qj6J6j6K4l2M0m8N6o6P6r4J13j33J55j80K10k42K78l18L62m14
$$ 0 0 0 0 0 0 0 0 0 0 0 0 8 -8 8 -8 16 -16 24 -24 32 -34 42 -52 61 -72 83 -97 113 -129 149 -169 193 -221
33b21M71n33O01o77P59q47R45j054J175j304J445j601J770j955K155k376K618
$$ -221 250 -283 318 -359 400 -447 498 -556 619 -685 760 -841 929 -1026 1129 -1247 1371
50A371k881L174l498L858m259M709n220N804o476P262q195R323j0724J2516j4896
$$ 1371 -1510 1664 -1834 2024 -2235 2474 -2746 3058 -3418 3844 -4351 4972 -5752 6764 -8132
65h132J8233k3290L1923n0469J57709j93385k73221M37039J72795l07595j87336
$$ -8132 10101 -13189 18734 -31735 125974 -67411 -340632 96407 269202 -38393 -225729
76b25729K31830J32660p8555j29477m2262J00157J86579j07753k85873J00740
$$ -225729 6101 138761 60206 -69271 -111533 -11376 175203 67450 -218423 -117683
86a17683L72311j14757m03850J11936M07505j12985l61964R1973K94609o3903
$$ -117683 254628 139871 -263979 -152043 255462 142477 -219487 -127514 167095 103192
96A03192j99165J4586J01073M1252j570j07792p9783J69951J42427k25924j75853
$$ 103192 -95973 -81387 19686 60938 59368 -48424 -128207 41744 184171 -41753 -217606
107b17606K62870J84104k78977j66858K67346J32626k30506q7545J69511M1723
$$ -217606 45264 229368 -49609 -216467 50879 183505 -47001 -134546 34965 76688
117G6688r2475k172O988k4113P6187L4218j47585k7434J98496O790k23399K3042
$$ 76688 -15787 -17959 -10971 -35084 41103 75321 -72264 -99698 98798 105588 -117811 -94769
129i4769K20372n5199j90927Q3449J40440j01668p6826J06159R643r5376N1517
$$ -94769 125603 70404 -120523 -37074 103366 1698 -75128 31031 40674 -54702 -3185
140c185P0361r8251l4760J24294o637j26850M7495J06183q2292o6181J05988J3099
$$ -3185 67176 -31075 -65835 58459 51822 -75028 -27533 78650 -3642 -69823 36165 49264
152D9264j15859M4895J11144r8955r3403J41256O6339j65287l4682J67319M217
$$ 49264 -66595 -21700 89444 -9511 -102914 38342 104681 -60606 -95288 72031 76248
163G6248j46286J9851J04742l3192m7519L3615j8095k1136Q4035j972j42323L1315
$$ 76248 -70038 -50187 54555 21363 -26156 7459 -10636 -31772 52263 50291 -92032 -60717
175f0717J85807o1357k09947Q5712K12234r8781j93709R6310J57547p6400j09167
$$ -60717 125090 63733 -146214 -60502 151732 52951 -140758 -44448 113099 36699 -72468
186g2468L9620N5089J0699k010o8709m4212J27484P9574j79088j01695K16488
$$ -72468 -32848 22241 32940 30930 -37779 -81991 45493 125067 -54021 -155716 60772
197F0772J10844k33830j08814K27932R9063j98133q5824J46847P2902p9136o3658
$$ 60772 171616 -62214 -171028 56904 155967 -42166 -127990 18857 91759 12623 -51035
208e1035J957N9775P6269o1636j47463O7483K04073p4596k40580P9432K53649
$$ -51035 -49078 10697 86966 25330 -122133 -54650 149423 74827 -165753 -86321 167328
219A67328p8084k43040O7621K10995m5980j62184J3309J03180K8672m0976p6075
$$ 167328 89244 -153796 -86175 124820 78840 -83344 -70035 33145 61817 20841 -55234
230e5234j7356J23964O6081j66461j00898J97676J20099k12934j24181K08901
$$ -55234 -72590 51374 117455 -49006 -149904 47772 167871 -45063 -169244 39657
240C9657J15614j84964r8431J42458P7211q5598n6643K0051M0302M6995l0400
$$ 39657 155271 -29693 -128124 14334 91545 5947 -50696 -30645 9657 56652 26252
251B6252j08331K7512J57452l0573j88960L6930K00479m3378j91308M6750J63713
$$ 26252 -82079 -54567 102885 72312 -116648 -79718 120761 77383 -113925 -67175 96538
262I6538m4096j21769L3726P1342j5333j8901r903k9122L9410O7094o9681r1361
$$ 96538 52442 -69327 -35601 35741 20408 1507 -8396 -37518 1892 68986 -695 -92056
274i2056R6453R9819j15875r2957J24507P3207j20650m4821J03998J2923p5993
$$ -92056 4397 104216 -11659 -104616 19891 93098 -27552 -72373 31625 44548 -31445
285c1445J6956M0125m0003o69N2739l7093n3301O8374M2093q8907k0996R6129
$$ -31445 -14489 25636 -14367 -15036 37703 610 -52691 15683 57776 -31131 -52127 44002
297D4002o114q9431L4952P0087o0916m1363P9884P738q9191K5348Q7323n2802
$$ 44002 37888 -51543 -16591 53496 -7420 -48783 31101 38839 -50352 -25004 62319 9517
309I517p4918P0062N3852p4299k7418O4420o63m1462K6548Q520m6904L0001N9779
$$ 9517 -65401 4661 58513 -15786 -43204 21216 20553 -20909 5639 14159 -32745 -2744 57035
322E7035o8697o4023J02076O0361j24973n0543J33929L7298j26938k3786J04213
$$ 57035 -11662 -75685 26391 86752 -38221 -88764 45165 82463 -44475 -68261 35952
333C5952J3027o8076p506K2525Q413K7059j5803p5086K8104J15756m2718j44696
$$ 35952 48979 -19097 -26603 -4078 4335 31394 15591 -59495 -31391 84365 41647 -103049
345a03049N6185J58869o4911j57306O5734J41023n6424j12682L6380P6515o513
$$ -103049 -46864 112005 47094 -110212 -44478 96545 40121 -72561 -36181 40334 33821
356C3821l6956l0557j002P0721L3731j09125n8343J40653P3676j60833p9980J66191
$$ 33821 -3135 -33692 -34694 36027 69758 -39367 -97710 42943 116619 -44214 -124194 41997
368D1997P8727j55320p2375J28465O3478q8050n4742L7937M8044J6604m4669o9745
$$ 41997 120724 -34596 -106971 21494 84972 -3078 -57820 -19883 28161 44765 96 -69649
380f9649M4582J15983m6834j50453M9791J69841n1061j72445M8509J58904m0148
$$ -69649 -25067 90916 44082 -106371 -56580 113261 62200 -110245 -61736 97168 57020
391E7020j31375K5004R3852l145n1142k4157Q501N4288K9351q4198n8537J09796
$$ 57020 -74355 -49351 44501 41356 -9786 -33943 -25442 28846 58197 -26001 -84538 25258
403B5258P6771j27685q3469J34670P9601j29100o7816J10770N1207q1059l3435
$$ 25258 102029 -25656 -109125 25545 105146 -23954 -91770 19000 70207 -10852 -44287
414d4287M2982J7965o82p086m1042K307P7558l432j04675R503J19590j8414j20832
$$ -44287 -1305 16660 15978 8892 -32150 -29843 47715 44283 -60392 -50889 68701 50287 -70545
427g0545K7566J08921l4447q5849L6782N5123l3372k1079K3704j1689q903L9016
$$ -70545 -42979 65942 31495 -54354 -17572 37551 4179 -16900 6804 -4885 -13788 25228
439B5228r672n7578K9415O5200m7516o1444O1167M7575o8226k6107O7593P33n8925
$$ 25228 15556 -42022 -12607 52593 5077 -56367 4800 52375 -15851 -41958 25635 26368 -32557
452c2557K4488M3499m5406k3482N8989J817o2983J8247N6827l3793m1208M2247
$$ -32557 -8069 35430 -9976 -33458 25531 27348 -35635 -17388 39439 5646 -35562 6685
464F685J8430m2440Q226L4234l5161j9190N8689l86p5713K0905Q4290l8913q3658
$$ 6685 25115 -17325 -9099 25135 -10026 -29216 29473 29087 -46626 -25721 58569 19656 -64002
477f4002N1057P4234n4698n7843M8777L6818l3000j4077R234p347J9891K5151
$$ -64002 -12945 61289 6591 -51252 -2475 34343 1343 -12734 -3500 -10847 9044 34195
489C4195n0588l7706P8808M4322j00579m5331J12647M1749j12896l5608J00760
$$ 34195 -16393 -54099 24709 69031 -31548 -76879 35768 77517 -35379 -70987 29773
500B9773K8704p7152k3188M4304K0565o022k1568l3667K6116P0330l3094r9893
$$ 29773 58477 -18675 -41863 2441 23006 16984 -4584 -38251 -12135 58195 25101 -74792
512g4792M0756J19327m6701j26809M8748J22210m4862j06546L3865Q2467j5683
$$ -74792 -34036 85291 38590 -88219 -39471 82739 37877 -68669 -34804 47663 31980
523C1980n3118q664K2267L6872O595o5825l0776R1871M8306j11576n8609J21944
$$ 31980 -21138 -29802 -7535 29337 35932 -29893 -60669 31202 79508 -32068 -90677 31267
535C1267O1833j21143n9374J08460N3020q4783m4915N2383L7111j4533l1071k4690
$$ 31267 93100 -28043 -87417 21043 74063 -10720 -55635 -3252 33859 19326 -11745 -36435
547c6435K7754O1259k7183r1039K8653J11200l0881j19762L2330J16217l1221
$$ -36435 -8681 52578 25395 -65644 -36991 74209 43328 -76434 -44104 72113 40892
558D0892j01672K6287P8229j6728m9217K474J8419J5327J0388l5151l4058N4494
$$ 40892 -60780 -34493 43736 27008 -22209 -19735 -1316 14011 24399 -10752 -44810 9684
570I684N0191p0846n7656Q1648N6621q4974m8400P9938L5274o6534j9882M6053
$$ 9684 59875 -10971 -68627 13021 69642 -15332 -63732 16206 51480 -15054 -34936 11117
582A1117N225k0698O368o375j3124L2015J4371n3112j0256O7009J914p2249Q743
$$ 11117 16342 -4356 2012 -4363 -17487 14528 28899 -24213 -34469 32540 34454 -37795 -29052
595b9052O8443j9771n6415K8861L8011l4392j6067L5127o219l0821K5714K1922
$$ -29052 39391 19620 -36795 -7934 30077 -4315 -20382 14745 8526 -22295 3419 25341
607B5341l9695r565M6210m306m4472J7896L4733k8950j8533L6049j680l8170K2967
$$ 25341 -14354 -23919 22291 17985 -26487 -8591 26142 -2808 -21341 14708 13028 -25142 -2175
620b175L5276m2221k7868N6359J7490o3325o122O1853m152n2032J1358L4885j4105
$$ -2175 33101 -9120 -36988 19371 36861 -26464 -32586 29267 25115 -26917 -15559 19326 5221
633E221j2652J1614j1772m460L5565o365n5686J8794O9981l0552p6799L9124P5881
$$ 5221 -7431 4183 -7589 -12049 23516 17151 -38535 -19741 50240 19688 -57111 -17987 57894
646E7894m2477o7635L9349N3646k9211l5943J2815J6781Q384J364l1905j6730
$$ 57894 15417 -52218 -12869 40777 11566 -24377 -11562 5219 13603 14967 -16938 -33668
658c3668N4754K8022p4137l4662Q7275L6754r2130l5365Q7680L1701p4064k7318
$$ -33668 21086 49108 -25029 -59691 27584 64338 -27792 -63157 24523 56224 -17840 -45158
670d5158N2378K3698k4743k1930n702K2527L5850k5266o2374K9437Q2521l3485
$$ -45158 7220 30918 6175 -15755 -21457 1070 36920 11654 -50720 -21283 61238 27753
682B7753r4307L5936R6792l5151r0234L0006P5786j9871n5751N005L2562J3540
$$ 27753 -66554 -30618 66174 31023 -59211 -29205 46581 26710 -29041 -24036 8526 22066
694B2066r265l3923j1786N3875K8406p0791l9518Q2244M4789q6603m4617Q2806
$$ 22066 12801 -21122 -32908 20967 49373 -21418 -60936 21308 66097 -20506 -65123 17683
706A7683M0358p0851l3464N1845K5788k7561j8897P26J4081K5806j1826m9158
$$ 17683 58041 -12810 -46274 5571 31359 3798 -15099 -14373 -292 25514 13688 -35470
718c5470J2152O6787j4459p6937J7643P8661k0347p2293K1261N8788j9349m0312
$$ -35470 -23318 43469 29010 -47927 -30284 48377 28030 -44263 -23002 35786 16437 -23875
730b3875J3945J9341n249J420o209j9332J9040L2461l1576l9352M2043L9743m8731
$$ -23875 -9930 9411 4162 5582 -627 -19959 -919 31542 -34 -39386 2657 42400 -6331
743f331l4155N0552K3981m6744j1217L7758j939k4509J3233Q831k1081P282K4280
$$ -6331 -40486 10066 34047 -12697 -23914 13844 11905 -12604 629 9460 -11621 -4339 19941
756A9941k1805k2500L2589J6194l8320o537L8275m987l2595J6476K2220k6153
$$ 19941 -1864 -24364 8225 24419 -13901 -20438 17837 12850 -19745 -3269 18951 -7202
768g202q811L2741n669l5151J8917L3299k8913k7406L4084J8510l3357q004K6743
$$ -7202 -16013 16728 11059 -24092 -5175 28124 -789 -28195 5889 24399 -8958 -16962 9781
781I781k582j4886J1707o47j8295J7812K1597l4348k1521M7771J8484n6175j3670
$$ 9781 7199 -7687 4020 3373 -14922 2890 24487 -9861 -31382 16389 34873 -21302 -34972
794c4972N8263Q224n3522l543M2253R18k5760j138O127M304J4534j0053l3668
$$ -34972 23291 31515 -22007 -25550 16703 17621 -8139 -9277 -3150 1154 15688 5635 -28033
807b8033J7419M9141k4769n9393L0691O3578l3603o1502L2369N3796k6287m1990
$$ -28033 -10614 38527 13758 -45635 -14944 48634 15031 -46471 -14102 39694 13407 -28583
819b8583J5584K7522j031j2465j6003j553L3518J3168m9597k1450O1948K6240
$$ -28583 -12999 14523 13492 1027 -14976 -16529 16989 30157 -19440 -40890 21058 47298
831D7298o9034k7719O9725K6573o3334k4007N0591K1051l2548j8702J1148J7726
$$ 47298 -21736 -49455 20270 46843 -16491 -40498 10093 31144 -1404 -20106 -8958 8768
843H768J1479j8323l2806K0243N0662k2898o3135K5208O9051k6116o8080K4507
$$ 8768 20247 1924 -30882 -10639 40023 17125 -46010 -20802 48249 22133 -45947 -21440
855b1440O0695j9836m8209J1812L2282p83j5178j2320j118K6200J4778l9079k4610
$$ -21440 39255 19419 -28790 -16978 15304 14521 -657 -12977 -14095 12105 26883 -12196 -36806
868c6806M9378K9996n5518l0953N6624K8141n2118k2721M2459J6031k8407r587
$$ -36806 12572 42568 -12950 -43903 12721 40862 -11256 -33977 8482 24513 -3894 -13481
880a3481J1677M386N982j365k2559P61L6191k493m5390N841M9138r942m7238J3602
$$ -13481 -1804 2582 8564 7199 -15360 -14599 21592 19099 -26291 -20450 28688 18746 -28492 -14890
894a4890M0105j5798k8925J5849J5165j3153r54Q059j1910r03K1835p315k7425
$$ -14890 25215 9417 -19508 -3659 11506 -1647 -2601 5458 -6452 -7355 14480 7165 -20260
907b0260J5362K8312k2089k4453K6333J6626k7307o317K4880m936j9322J5199
$$ -20260 -4898 23414 1325 -23128 3205 19831 -7476 -13793 11087 6151 -13171 2028
919B028J1495k3141k524K7503o301k7633J3467K3616j7963j6039J8984O070j6357
$$ 2028 13523 -9618 -12142 15361 9060 -18573 -5106 18510 547 -15492 3492 9562 -6795
932f795M952J0531j5521k267K4271p012l0150J5986L2577k3092l1392K7003K7080
$$ -6795 -1843 8688 -6833 -9100 15171 8159 -21991 -6005 26572 3480 -27912 -909 26171
945B6171k6923k0375K2413J2389j3943m217K232l027J1244Q534k4934j1869L6965
$$ 26171 -752 -21127 1286 13675 -268 -4485 -2253 -5280 5964 14498 -10436 -22305 14660
958A4660J2960m5749j2169M9879J0295m8771q003M2293O419l1164o016J6582P337
$$ 14660 27620 -18129 -30298 19581 29876 -18895 -26898 15395 21814 -9350 -15366 1216 8553
971H553k22j0296j6047J4534L0454j9238m1466K3386M8025k5966m9709K6044M6586
$$ 8553 8331 -1965 -18012 -3478 26976 7738 -33728 -10342 37683 11717 -37992 -11948 34638
984C4638k2964l9573J6503K9678o977j8364m915P072J7852L067l0498j1140M1345
$$ 34638 11674 -27899 -11396 18282 11305 -7059 -11974 -4902 12950 16017 -14481 -25621 15724
997A5724J6654m8913j9408N2166J9892n0488j8605M3842J6485l2827j4245J8502
$$ 15724 32378 -16535 -35943 16223 36115 -14373 -32978 10864 27349 -5478 -19723 -1221
1009a221J2603k358j2061j3749J2560K8195j4081l9398J5980M6126j7550m7917
$$ -1221 11382 9024 -3037 -16786 -4226 23969 9888 -29510 -13530 32596 15046 -32871
1021c2871J7945M4807j6624l7427J3139K6942p364j4812k96K743R160P866j8208
$$ -32871 -14926 29881 13257 -24170 -11031 15911 8547 -6265 -6561 -3818 5342 13208 -5000
1034e000j5850K6295K0655l2387k1878L5449K0033l5037j5726L0967J0039k3680
$$ -5000 -20850 5445 26100 -6287 -28165 7284 27317 -7720 -23446 7521 17560 -6120
1046f120m100J3855j059k791M588q282o060J7956N437k5255k898K9165r67k9204
$$ -6120 -10220 3635 2576 -215 4373 -3909 -9969 7987 13424 -11831 -14729 14436 13469 -15735
1060a5735N336K5594r344j8795J2255R894j3415r9J2578r083r904J6552N622k1081
$$ -15735 -10399 15195 5851 -12944 -689 9205 -4210 -4309 8269 -814 -10718 5834 11456 -9625
1074i625m77K2081m757j9461R182J3580j2159n293J3076m122j2031J3342R174
$$ -9625 -10102 11979 7222 -12239 -3057 10523 -1636 -6929 6147 2025 -10006 3336 12510
1087A2510k1117m997K6241L69k8063L865K6353o845k1285P948J3568o715m275
$$ 12510 -8607 -13604 12637 13006 -15057 -11192 15161 8316 -12969 -5021 8547 1832 -2443
1100b443L426n470J614J4533p659k1863J3719K6723j8788k8747K1899K7842k2316
$$ -2443 983 -4487 -2873 11660 4001 -17862 -4143 22580 3792 -24955 -3056 24786 2470
1113B470k4447J9570J9184j3802j2822N350O301M806m20j5573m309K5694P541
$$ 2470 -21977 -2407 16777 2975 -9847 -4497 1804 6610 6190 -9383 -13692 12002 19543
1126A9543l3805r167L8899R470m0106q895L7197Q071l0407p516K0497P660q449
$$ 19543 -14262 -23429 15470 24940 -15166 -24061 13136 21207 -9200 -16716 3781 11441 2992
1139B992q808m297J0877J6324j3573k6438J6253L3604j8349l7205J9060L7088
$$ 2992 -5816 -10113 764 17088 3515 -22923 -6670 26934 8585 -28620 -9560 27528
1151B7528j7919l3571J4539K7310q896j9303J397J0623P382k272j6450m876K4828
$$ 27528 9609 -23962 -9423 17887 8991 -10312 -8915 1708 9090 6818 -9632 -14508 10320
1164A0320J0325l1456j3665L5464J4962l6228j4532L3493J2895k7454j0653J8616
$$ 10320 20645 -10811 -24476 10988 25950 -10278 -24810 8683 21578 -5876 -16529 2087
1176B087Q423q037o739l210N909J3859o038k2768O899K8897q163l1695R397L0945
$$ 2087 10510 2473 -4266 -7476 -1567 12292 6254 -16514 -9615 19282 11119 -20576 -11179 19766
1190A9766r986k6848R448K0282p603j1974M256L315K88M679n504j1058J0762J5144
$$ 19766 9780 -17068 -7620 12662 5059 -6915 -2659 656 944 5623 119 -10939 -177 14967
1204A4967j5404j6589J8676J5410k0039j2105J9129P385j6105k055J1195l034
$$ 14967 -437 -17026 1650 17060 -2979 -15084 4045 11430 -4675 -6730 4465 1431
1216A431n024P075j635r519P866J0151j2872q850J5922O038j6601k146J4907k231
$$ 1431 -3593 3482 1847 -7672 194 10345 -2527 -11377 4545 10583 -6018 -8164 6743 4512
1230D512j0869O276N290r488J207J1338p575j1732J2905J0567j6394q166J7449
$$ 4512 -6357 -81 5209 -4279 -3072 8266 691 -11041 1864 12431 -3963 -12129 5320
1243E320M910j5815j508J1604j549n501L918j969m993R612M915j6527l786K1782
$$ 5320 10230 -5585 -7093 4511 2962 -2539 1379 -590 -5583 4029 8944 -7583 -11369 10413
1257A0413K057k4652j11K4792j479k2030K085J6966j512j0054m29K174L542N703
$$ 10413 12470 -12182 -12293 12499 11020 -11010 -8925 8041 6529 -3525 -3954 -1780 1762 7465
1271G465p338j2941J1445J8470j4962k2072J7348K3326j7967k2423J6479J9612
$$ 7465 127 -12814 -1369 17101 2139 -19933 -2585 20741 2774 -19649 -3170 16442
1283A6442j2765j5420P056J0486J47n448q111R31J5969K761k2767n267K7652O717
$$ 16442 3677 -11743 -4687 5799 5946 498 -7613 -6682 9287 12048 -10719 -15986 11666 18383
1297A8383k9996p157K9387P024k5852o770J9761O590j1680o953K566P927O492
$$ 18383 -11613 -18770 10617 17641 -8211 -14981 4780 11370 -310 -7263 -4697 3230 9722
1310I722r345j4741J1014K1203j2539k5294J3456K6723j3293k5513J1760K2038
$$ 9722 377 -14364 -3350 17853 5314 -19980 -6524 20199 6906 -18607 -6847 15191
1322A5191q667j6928M268J0823J284m596p302j085J3234N742j8393q886K1954
$$ 15191 6524 -10404 -6136 4687 5971 1375 -5927 -7012 6222 11964 -6429 -15315 6639
1335F639J0469k3591j0574K2945R400j9988p532J5016N379q582l358J292J982
$$ 6639 17108 -6483 -17057 5888 15288 -4700 -12232 2784 8163 -419 -3777 -2485 -503
1348e03N856j282j2196J466J6921k238j9594L491J9833m683j7735N480J3770n561
$$ -503 5353 4071 -8125 -6659 10262 8024 -11570 -8079 11754 7071 -10664 -5184 8586 3025
1362C025q468M788K532l054L196M94p953K444J1188n458j2518P906J1904r503
$$ 3025 -5443 -655 1877 -1177 2019 2513 -5440 -2996 8192 2734 -9784 -1878 10026 523
1376E23r533R842N856q883j466O766l074l649P041O1r810L452J1268o427j1107
$$ 523 -9010 832 6688 -2195 -3661 3105 31 -3618 3423 3484 -6326 -2874 8394 1967 -9140
1391i140Q350R435q850o567P873K896n490J088J920m850K338P835o614r855J0318
$$ -9140 -790 8645 -205 -6772 1101 3997 -1493 -405 1515 -3335 -997 6838 224 -9631 687
1406F87J0617j2900j0243J3863Q827j2919o733J0126M391n725k162J86M15N791
$$ 687 11304 -1596 -11839 2024 10851 -2068 -8801 1325 5716 -9 -2171 -1985 -1570 4221
1420D221P93j1559j238J6366J177j9571q18K0811M54j9901l92J6920Q87j2257
$$ 4221 5014 -6545 -7783 8583 9760 -9811 -10629 10182 10636 -9265 -9657 7263 8150 -4107
1434d107k107O472L925k25o245n911Q733J1241j1015j5201J2614J7546j3196j8116
$$ -4107 -6214 258 4183 3958 -2287 -8198 535 11776 761 -14440 -1826 15720 2524 -15592
1448a5592J2447J7087j0302j4583O736J1134k009p233l384L422Q869R3j4009k836
$$ -15592 -3145 13942 3640 -10943 -4207 6927 4918 -2315 -5699 -2277 6592 6685 -7324 -10160
1462a0160J8041M736k0548n800K1163O095j9681o052J6369N695j1387n488N354
$$ -10160 7881 12617 -7931 -13731 7432 13527 -6154 -12206 4163 9858 -1529 -7017 -1663
1475a663N510J080n917p122O534J2343p312j6051P888J8049q031j8078P491J6350
$$ -1663 3847 4927 -990 -8112 -1578 10765 3453 -12598 -4710 13339 5308 -12770 -5279 11071
1489A1071o136j3134L900R001r45m466k518O2O106L667r366o487J1977P997j3469
$$ 11071 4935 -8199 -4299 4702 3757 -709 -3227 -3165 2941 6608 -2758 -9245 2732 10729 -2740
1504b740q363J3690P553j2526n930J0035L914o488j823K315k4K151J313o220j859
$$ -2740 -11103 2587 10140 -2386 -8316 1719 5633 -855 -2678 -363 -387 1764 3077 -3143 -5002
1519e002R420J702j1375r61J1964j97j0945J356Q617k371n297K961J352l011K626
$$ -5002 4418 6120 -5255 -6216 5748 5551 -5394 -4038 4579 2208 -3089 -128 1224 -1787 839
1534H39K455o158j379Q623O3r863J333R615k419q068L091N395l155j929K641j921
$$ 839 3294 -2864 -4243 4380 4443 -5420 -4087 5528 3109 -4959 -1868 3527 372 -1557 1084 -837
1550h37j431N469k8q353J620J0266k982j0956L908J0312m109q579L502N844k023
$$ -837 -2268 3201 3173 -5180 -3560 6706 3724 -7232 -3324 6988 2879 -5700 -2198 3646 1623
1565A623k613j46q75K749M082n480o714P941Q520r738r380J0551R313j0129q397
$$ 1623 -990 -1136 -2011 738 4820 -660 -7374 567 9087 -651 -10031 520 9833 -296 -8693
1580h693Q379O998n482n246J643L510K697j906p070O69J0948K63j3943q89J5622
$$ -8693 -314 6684 1202 -4044 -2401 1109 3806 1900 -5170 -4501 6447 6710 -7233 -8122 7500
1595G500J277j5771j629J4326K084j1498k770P564L720l014m892j704O179O086
$$ 7500 8777 -6994 -8623 5703 7787 -3711 -6481 1083 4803 1789 -3103 -4807 1372 7458
1609G458p357r681Q221J2242q568j3463Q188J3404o988j2150M984R956k212p198
$$ 7458 101 -9580 -1359 10883 2315 -11148 -2960 10444 3456 -8694 -3710 6246 4034 -3164
1623c164j074M141M575j205p949j379J0845L324j2933m581J3851N158j3454n224
$$ -3164 -4238 -97 4478 3273 -4676 -6055 4790 8114 -4819 -9400 4451 9609 -3845 -9069
1637i069J1798M849q939m346N280L902j125l576l043L419O815l439r711L546J1530
$$ -9069 2729 7578 -1361 -5707 -427 3475 2350 -1226 -4269 -850 5965 2526 -7185 -3639 7891
1652G891l630j1994L479J1171k984r311K144O598r18l407p16J67K478K696m163
$$ 7891 4261 -7733 -4254 6917 3933 -5378 -3234 3364 2446 -961 -1677 -1510 968 3664 -499
1667d99m890N585O227o589o639O929O151o508m945N454L236l736j260J519o25
$$ -499 -5389 196 6423 -166 -6805 124 6275 -233 -5178 276 3512 -224 -1484 35 -590
1682e90R12K204l234l225N140L674o412l465O795K778o325j775M984N36k895O34
$$ -590 322 2526 -708 -3933 1207 4881 -1531 -4996 1799 4577 -1748 -3523 1461 1997 -898 -264
1698b64L04j597K401K194m798k416O593K301p586j935P659J373o587r32M741N94
$$ -264 40 -1557 844 3038 -1760 -4176 2417 4718 -2868 -4803 2856 4229 -2358 -3290 1451 2045
1714B045k181m24p68M92L711o93o335J077Q172j353r267J546R282j365q425Q77
$$ 2045 -136 -560 -1328 -836 2875 2182 -4153 -3076 5096 3743 -5524 -3978 5304 3939 -4486 -3609
1730c609O669Nm294j329J598K808J254m442l721N839N841o943p258P505P929p297
$$ -3609 3060 3065 -1229 -2558 -960 1848 3102 -1340 -5061 778 6619 -324 -7582 -77 7852 555
1746E55p863O270P186m472o027J986M630R11l098l955J598O768l00r125p26J0617
$$ 555 -7308 -1038 6148 1676 -4351 -2365 2265 3176 78 -3877 -2279 4489 4189 -4936 -5662 4955
1762D955J565j1202k147J0629K600r004l045O633L420l568l861K91M304K961m686
$$ 4955 6520 -4682 -6829 3800 6400 -2604 -5649 984 4404 836 -3025 -2734 1570 4531 -155
1777a55n790M981P915n004r235M760R603m103r122L021P865j564n987k70L800
$$ -155 -5945 -964 6951 1947 -7288 -2528 7075 2972 -6150 -3129 4736 3172 -2815 -3085 715
1792G15K265j589m263n40O081K206p384l508Q186M220q209m358P427M149n953
$$ 715 2980 1391 -2872 -3412 2669 4875 -2509 -6017 2169 6389 -1820 -6178 1249 5398 -555
1807e55l597L869K906j316k207j298J574L757j107n739P83P043o43p518N28P180
$$ -555 -4152 -283 2623 1307 -900 -2198 -624 3133 2026 -3713 -2930 4113 3470 -4048 -3520 3660
1823C660m86o067L09M326k3k223l57n3R18K124j497l815K065M920k470n315K664
$$ 3660 3174 -2893 -2584 1742 1719 -504 -861 -914 4 2128 631 -3184 -1119 3801 1331 -3984 -1320
1840a320N024k500m190K088K839j334j172K89m93Q36K045j939l312K932M015l562
$$ -1320 3704 1204 -2986 -898 1941 607 -565 -276 -769 67 2112 173 -3139 -207 3808 246
1856B46m233L686L989l366l297K553K208j229r92m15k26K156J273l702k107M946
$$ 246 -3987 -301 3688 322 -2975 -422 1786 557 -435 -850 -1076 1080 2353 -1349 -3456 1490
1872A490K680n671k893N717K889n106k676L866K342k072k022k2J655K245j360
$$ 1490 4170 -1501 -4394 1323 4212 -894 -3570 296 2638 566 -1456 -1478 177 2422 1062
1887A062m315J140N921r21p018O54P426l27p104j45O135Q04m608j575K643K528
$$ 1062 -3253 -2113 3808 2887 -4131 -3477 3949 3622 -3482 -3627 2508 3312 -1296 -2871 -228 2300
1903B300n15l456j569M261L467m879m847N119N834n022o233M377O062l251n394
$$ 2300 1785 -1671 -3240 1021 4488 -391 -5238 -119 5715 693 -5540 -1163 4899 1648 -3746
1918c746J662M410J88l212k170J883M085o21n712n03O869J357p419k002P275K469
$$ -3746 -2084 2326 2514 -698 -2868 -985 3100 2479 -3233 -3736 3133 4490 -2929 -4931 2344 4813
1934D813o440k723N032K925l168k988J008L021J233l056l248L004M845k840n974
$$ 4813 -1627 -4350 682 3607 439 -2549 -1541 1480 2713 -343 -3591 -587 4258 1418 -4556
1949d556K597O449k147o389J560N666p57m494k30L003J306j425k359j88L366J616
$$ -4556 -1959 4490 2343 -4046 -2486 3180 2423 -2071 -2301 702 2008 583 -1776 -1964 1402 3018
1965C018m103k690M544L324m520l599M169L429l343k952K153K311p39j495q04
$$ 3018 -1085 -3775 769 4093 -427 -4026 143 3572 229 -2723 -570 1741 1002 -493 -1297
1980a297O67K245%l431n66M258Q91m585r98M352J028l715r00K564P76j158o66
$$ -1297 -630 1615 1615 -1816 -2382 1876 2767 -1818 -2816 1536 2564 -1151 -2051 513 1289 131 -535
1997e35l31N71J740m90k945N32L759m71m165M28M013k59l471J02K408K74j169
$$ -535 -866 -295 1445 955 -1990 -1458 2301 1830 -2335 -1907 2106 1847 -1624 -1522 886 1160 -9
2014io84j96J097J540j526k675J828L531k023l938J914L985j611l558J011K817
$$ -9 -693 -889 208 1748 222 -2453 -625 2906 883 -3055 -1141 2844 1233 -2325 -1314 1503
2030A503j63j813q42O76J866M84k821j474L577K302m063k796M030L101l654l142
$$ 1503 1340 -473 -1315 -639 1227 1711 -1110 -2584 993 3295 -768 -3564 466 3567 -87 -3229
2046c229K864K935j701k596K61K154J250j653k723J138M011o57m907J72N388K75
$$ -3229 -365 2570 869 -1727 -1466 688 1938 285 -2438 -1300 2711 2054 -2853 -2681 2707 2982
2062B982n353p49M868J256l922j710K627K173j103k573n23K935K031l185l217
$$ 2982 -2371 -3120 1748 3004 -918 -2628 -1 2172 1069 -1504 -2027 908 2939 -246 -3463
2077c463L162M102k940m640K480M683j772m379Q92L639K17k693j384J643K487
$$ -3463 -301 3801 861 -3779 -1299 3384 1612 -2767 -1875 1764 1981 -712 -2096 -453 2034
2092B034n47l475m57M237J287m567j931M539K362m131k510L317K496k142k391
$$ 2034 1487 -1988 -2445 1792 3079 -1488 -3419 1120 3482 -649 -3159 158 2654 512 -1879
2107a879Q09K186N68j889j926J567L025j255l826R29M228n62m222J59L824K39
$$ -1879 -1070 1116 1684 -205 -2131 -564 2461 1206 -2620 -1691 2537 1975 -2247 -2088 1736 1975
2123A975l086o67K070J122r12j541k57J877J358k097k196K171K791k122k967J804
$$ 1975 -1111 -1778 292 1414 502 -1039 -1296 581 1939 -158 -2354 -183 2608 486 -2481 -677
2139f77K889j353k473P18J820K6j078p81K31J515M88k120j127K544J533k662j731
$$ -677 2212 859 -1614 -896 924 950 -128 -909 -678 837 1325 -795 -1922 622 2155 -507 -2238
2156b238K477J769k015j588J303J333m54r58n11N91J430j96k219j21K744M38l045
$$ -2238 239 2008 -7 -1595 -292 1041 587 -371 -882 -291 1139 943 -1276 -1397 1347 1785 -1260
2173a260o79K970Q47k556j037J904J148j010j201j9J200J068j189k023J165K722
$$ -1260 -1939 1031 1878 -678 -1715 189 1337 327 -874 -893 307 1375 186 -1837 -672 2050
2189B050r62l206P41L318l75l135k1K615N45j872j094J005J595j6k059r06K411
$$ 2050 1088 -2118 -1377 1941 1566 -1569 -1590 1025 1570 -302 -1396 -391 1204 1188 -871 -1777 634
2206F34J722k626k341K551K748k321k832J736K770j040k487J45K074P82j488j759
$$ 634 2356 -270 -2611 -60 2688 367 -2465 -729 2041 1001 -1486 -1341 733 1515 27 -1732
2222a732R53K537k98l190k08L501P34l539j182L301J521k709j774J903J892q90
$$ -1732 -779 1758 1460 -1730 -1938 1563 2297 -1242 -2424 877 2398 -311 -2085 -182 1710 820
2238H20j975k26J973J268j847k222J665K864j341l290R56L394n05l199K6K675
$$ 820 -1155 -1381 592 1860 13 -2209 -544 2320 979 -2311 -1355 2039 1534 -1665 -1639 1036
$$ [...]
8191h
##END NTUPLES=NMR FID
##END=
