##TITLE=1H_LY-DMAA.3.20
 CDCl3
 8 sc, 
 17.03.2022
##JCAMPDX= 6.0         $$ Bruker NMR JCAMP-DX V2.0
##DATA TYPE= NMR FID
##DATA CLASS= NTUPLES
##ORIGIN= UXNMR, Bruker Analytische Messtechnik GmbH
##OWNER= root
$$ XWIN-NMR		Version 3.5
$$ Thu Mar 17 13:35:11 2022 Russian Standard Time (UT+4h)  she@DPX200
##.OBSERVE FREQUENCY= 200.131346
##.OBSERVE NUCLEUS= ^1H
##.DELAY= (6, 6)
##.ACQUISITION MODE= SIMULTANEOUS
##.ACQUISITION SCHEME= undefined
##.AVERAGES= 8
##.DIGITISER RES= 18
##SPECTROMETER/DATA SYSTEM= spect
##.PULSE SEQUENCE= zg30
##.SOLVENT NAME= D2O
##.SHIFT REFERENCE= (INTERNAL, D2O, 0, 15.7039)
##AUDIT TRAIL= $$ (NUMBER, WHEN, WHO, WHERE, WHAT)
$$ ##TITLE= Audit trail, XWIN-NMR		Version 3.5
$$ ##JCAMPDX= 5.01
$$ ##ORIGIN= Bruker BioSpin GmbH
$$ ##OWNER= she
$$ F:/spectra/data/she/nmr/H-F/1/audita.txt
$$ ##AUDIT TRAIL=  $$ (NUMBER, WHEN, WHO, WHERE, WHAT)
(   1,<2022-03-17 13:34:04.50 +0400>,<she>,<DPX200>,
      <created by zg, POWCHK disabled, PULCHK disabled
       configuration hash MD5:
       00 E9 B6 7A A2 85 ED C7 34 08 36 98 17 FE 4E 26
       data hash MD5: 16K
       BC 69 45 15 AB 15 47 52 8A FA 77 E4 5F 47 91 64>)
$$ ##END=
$$ 
$$ hash MD5
$$ 19 C4 F4 F2 26 7A 26 3E C5 5C 6F 93 24 0D FC 6B
##$RELAX= 
##$RELAX= 
##$RELAX= 
##$RELAX= 
##$RELAX= 
##$RELAX= 
$$ Bruker specific parameters
$$ --------------------------
##$DU= <F:/spectra>
##$EXPNO= 1
##$NAME= <H-F>
##$PROCNO= 1
##$TYPE= <nmr>
##$USER= <she>
##$AMP= (0..31)
100 100 100 100 100 100 100 100 100 100 100 100 100 100 100 100 100 100 
100 100 100 100 100 100 100 100 100 100 100 100 100 100 
##$AQSEQ= 0
##$AQ_mod= 1
##$AUNM= <au_zg>
##$AUTOPOS= <>
##$BF1= 200.13
##$BF2= 200.13
##$BF3= 200.13
##$BF4= 200.13
##$BF5= 200.13
##$BF6= 200.13
##$BF7= 200.13
##$BF8= 200.13
##$BYTORDA= 1
##$CFDGTYP= 0
##$CFRGTYP= 5
##$CHEMSTR= <none>
##$CNST= (0..31)
1 1 145 1 1 1 1 1 1 1 1 1 1 1 1 1 1 1 1 1 1 1 1 1 1 1 1 1 1 1 1 1 
##$CPDPRG= <>
##$CPDPRG1= <>
##$CPDPRG2= <>
##$CPDPRG3= <>
##$CPDPRG4= <mlev>
##$CPDPRG5= <mlev>
##$CPDPRG6= <mlev>
##$CPDPRG7= <mlev>
##$CPDPRG8= <mlev>
##$CPDPRGB= <>
##$CPDPRGT= <>
##$D= (0..31)
0 1.2 0 0 0 0 0 0 0 0.06 0 0.03 0 0 0 0 0.0002 0 0 0 0 0 0 0 0 0 0 0 0 
0 0 0 
##$DATE= 1647509643
##$DBL= (0..7)
120 120 120 120 120 120 120 120 
##$DBP= (0..7)
150 150 150 150 150 150 150 150 
##$DBP07= 0
##$DBPNAM0= <>
##$DBPNAM1= <>
##$DBPNAM2= <>
##$DBPNAM3= <>
##$DBPNAM4= <>
##$DBPNAM5= <>
##$DBPNAM6= <>
##$DBPNAM7= <>
##$DBPOAL= (0..7)
0.5 0.5 0.5 0.5 0.5 0.5 0.5 0.5 
##$DBPOFFS= (0..7)
0 0 0 0 0 0 0 0 
##$DE= 6
##$DECBNUC= <off>
##$DECIM= 32
##$DECNUC= <off>
##$DECSTAT= 4
##$DIGMOD= 1
##$DIGTYP= 9
##$DL= (0..7)
0 120 120 120 120 120 120 120 
##$DP= (0..7)
150 150 150 150 150 150 150 150 
##$DP07= 0
##$DPNAME0= <>
##$DPNAME1= <>
##$DPNAME2= <>
##$DPNAME3= <>
##$DPNAME4= <>
##$DPNAME5= <>
##$DPNAME6= <>
##$DPNAME7= <>
##$DPOAL= (0..7)
0.5 0.5 0.5 0.5 0.5 0.5 0.5 0.5 
##$DPOFFS= (0..7)
0 0 0 0 0 0 0 0 
##$DQDMODE= 0
##$DR= 18
##$DS= 0
##$DSLIST= <SSSSSSSSSSSSSSS>
$$ [...]
##$SUBNAM2= <"">
##$SUBNAM3= <"">
##$SUBNAM4= <"">
##$SUBNAM5= <"">
##$SUBNAM6= <"">
##$SUBNAM7= <"">
##$SUBNAM8= <"">
##$SUBNAM9= <"">
##$SW= 18.0517287032376
##$SWIBOX= (0..15)
0 0 2 0 0 0 0 0 0 0 0 0 0 0 0 0 
##$SW_h= 3612.71676300578
##$TD= 16384
##$TD0= 1
##$TE= 0
##$TE2= 300
##$TE3= 300
##$TEG= 300
##$TL= (0..7)
0 120 120 120 120 120 120 120 
##$TP= (0..7)
150 150 150 150 150 150 150 150 
##$TP07= 0
##$TPNAME0= <>
##$TPNAME1= <>
##$TPNAME2= <>
##$TPNAME3= <>
##$TPNAME4= <>
##$TPNAME5= <>
##$TPNAME6= <>
##$TPNAME7= <>
##$TPOAL= (0..7)
0.5 0.5 0.5 0.5 0.5 0.5 0.5 0.5 
##$TPOFFS= (0..7)
0 0 0 0 0 0 0 0 
##$TUNHIN= 0
##$TUNHOUT= 0
##$TUNXOUT= 0
##$USERA1= <user>
##$USERA2= <user>
##$USERA3= <user>
##$USERA4= <user>
##$USERA5= <user>
##$V9= 5
##$VALIST= <valist>
##$VCLIST= <CCCCCCCCCCCCCCC>
##$VD= 0
##$VDLIST= <DDDDDDDDDDDDDDD>
##$VPLIST= <PPPPPPPPPPPPPPP>
##$VTLIST= <TTTTTTTTTTTTTTT>
##$WBST= 1024
##$WBSW= 4
##$XGAIN= (0..3)
0 0 0 0 
##$XL= 0
##$YL= 0
##$YMAX_a= 485112
##$YMIN_a= -421577
##$ZGOPTNS= <>
##$ZL1= 120
##$ZL2= 120
##$ZL3= 120
##$ZL4= 120
##$ABSF1= 10
##$ABSF2= 0
##$ABSG= 5
##$ABSL= 3
##$ALPHA= 0
##$AQORDER= 0
##$ASSFAC= 0
##$ASSFACI= 0
##$ASSFACX= 0
##$ASSWID= 0
##$AUNMP= <proc_1d>
##$AZFE= 0.1
##$AZFW= 0.1
##$BCFW= 1
##$BC_mod= 2
##$BYTORDP= 1
##$COROFFS= 0
##$CY= 11.3945322036743
##$DATMOD= 1
##$DC= 2
##$DFILT= <>
##$DTYPP= 0
##$F1P= 2.36226072786647
##$F2P= -0.459571619588291
##$FCOR= 0.5
##$FTSIZE= 0
##$FT_mod= 4
##$GAMMA= 1
##$GB= 0.15
##$INTBC= 1
##$INTSCL= 1
##$ISEN= 128
##$LB= 0.24
##$LEV0= 0
##$LPBIN= 0
##$MAXI= 10000
##$MC2= 0
##$MEAN= 0
##$ME_mod= 0
##$MI= 1.114404
##$NCOEF= 0
##$NC_proc= 0
##$NLEV= 6
##$NOISF1= 3.799351
##$NOISF2= 2.8
##$NSP= 1
##$NTH_PI= 0
##$NZP= 0
##$OFFSET= 15.70392
##$PC= 1
##$PHC0= -17109.97
##$PHC1= 14.80078
##$PH_mod= 1
##$PKNL= yes
##$PPARMOD= 0
##$PSCAL= 0
##$PSIGN= 0
##$REVERSE= no
##$SF= 200.130013532006
##$SI= 16384
##$SIGF1= 3
##$SIGF2= 2
##$SINO= 400
##$SIOLD= 16384
##$SREGLST= <1H.CDCl3>
##$SSB= 0
##$STSI= 0
##$STSR= 0
##$SW_p= 3612.71676300578
##$SYMM= 0
##$S_DEV= 0
##$TDeff= 0
##$TDoff= 0
##$TI= <>
##$TILT= no
##$TM1= 0
##$TM2= 0
##$TOPLEV= 0
##$USERP1= <user>
##$USERP2= <user>
##$USERP3= <user>
##$USERP4= <user>
##$USERP5= <user>
##$WDW= 1
##$XDIM= 8192
##$YMAX_p= 0
##$YMIN_p= 0
$$ End of Bruker specific parameters
$$ ---------------------------------
##NTUPLES= NMR FID
##VAR_NAME=  TIME,          FID/REAL,        FID/IMAG
##SYMBOL=    X,             R,               I
##VAR_TYPE=  INDEPENDENT,   DEPENDENT,       DEPENDENT
##VAR_FORM=  AFFN,          ASDF,            ASDF
##VAR_DIM=   8192,          8192,            8192
##UNITS=     SECONDS,       ARBITRARY UNITS, ARBITRARY UNITS
##FACTOR=    0.0002768,     1,               1
##FIRST=     0,             0,               0
##LAST=      2.2672688,     0,               0
##MIN=       0,             -421577,         0
##MAX=       2.2672688,     485112,          0
$$ Real data points
##PAGE= N=1
##DATA TABLE= (X++(R..R)), XYDATA
0@%%%%%%%%%%Qj6J6k4L2l4M2n6P2q8J04j21J42j66J95k32K71l14L63m17M76n44
32b91O21p02P92q94J005j126J261j407J567j744J937k147K373k624K899l195L521
49A846l880M274m709N191n726O323o996P757q628R635j0815J2224j3934J6066
63H628j8813K2498k7725L5778m9901Q1667k77036Q7910O22106l47887m88896J38891
75b12780M59333m9016k75666r8937J18882J54533J04026k09204k78373J83136
85a04066M49901j46993n42974O2727N92310J0913n57480r1294M75830J34977l36147
96e2296j55803J77636J30105n081p7240j47558p327K74301R9856l54149j92232
107c09788L89993K63581l77114l05493L28480L07093k51555k68877J63326J93348
$$ y = [0, 0, 0, 0, 0, 0, 0, 0, 0, 0, 0, 8, -8, 8, -16, 16, -18, 24, -32, 40, -48, 56, -65, 77, -89, 106, -126, 145, -169, 194, -223, 253, -291, 330, -372, 420, -474, 531, -595, 666, -741, 826, -918, 1019, -1128, 1245, -1379, 1520, -1675, 1846, -2034, 2240, -2469, 2722, -3004, 3319, -3677, 4080, -4548, 5087, -5728, 6496, -7438, 8628, -10185, 12313, -15412, 20366, -29535, 52132, -224904, -136994, 485112, 137225, -351671, -212780, 246553, 197537, -78129, -177066, -58184, 96349, 200375, -8829, -287202, -104066, 345835, 198842, -344132, -281405, 310905, 321818, -235662, -326956, 148874, 283851, -52296, -208099, -30463, 99642, 94561, 17321, -130237, -137564, 136737, 236593, -117556, -309788, 80205, 343786, -33328, -338821, -10341, 296752, 45197, -223680, -60354, 132994]
117A32994p5879r1334J492k4625N2922J38345q4418k36677R4579L06694q8910
128A25183l42086P4422L40068n9167l03954M9075K40684m8112j59879N7509P2783
139D6526p4496J1025R5418q3012j13753J38667J24617j75429j23217J94337J07220
150A47903j98376p6975J91444L5078j77864J3071J59938o1791j40240J04143J18367
161A14698j35220r3576J51174O3808j51109k7514J36705j5716j11011O5214P9787
172G7240j17471m8115J68288K1152k10813j506K38989r246k47536J2728K32535
183A16245j2132j93762J1403J33557j5643n8094K7351k4453m8947J04301P8973
194A18799j72003j14148K19058J48863k39960j75950K32911J89067j99438j82014
$$ y = [132994, 57115, -34219, -32727, -57352, -4430, 133915, 49497, -187180, -92601, 214093, 125183, -216903, -142481, 197587, 138420, -165534, -116459, 124225, 76113, -83766, -26257, 46526, -27970, -16945, 78473, -4539, -118292, 20375, 144992, -30437, -153654, 40683, 147903, -50473, -127448, 63996, 99074, -78790, -65719, 94219, 32428, -107812, -3669, 114698, -20522, -114098, 37076, 100884, -50225, -77739, 58966, 43250, -67761, -2547, 77240, -40231, -88346, 79942, 101094, -109719, -111225, 127764, 118518, -129018, -116290, 116245, 104113, -89649, -78246, 55311, 39668, -18426, 8925, -15528, -64475, 39826, 118799, -53204, -167352, 51706, 200569, -39391, -215341, 17570, 206637, 7199, -174815]
204a74815J45585J51876p8830r8453J0057K5410N1397O0191r7061j48642J21141
215c2144K28626j22007k89463J01025L21297o4357l18814J9884K79782K2928k08279
226f1522n4920J11856O9243k163o1882j07067L3718K02837J1330k73159o4898
237a96627L10062J18129l10266j60036K75402J82138k11600j78776J28825J47478
247A04729l8992r0990m5995J4971J15029P0658j61095j54761J79799K25668j71877
258D7144k73606J41684K91258r6250k75277M5265K27202K433j52134l8437N9747
269b0971N7401L9302n7163j32294L9129K08380q106k59113k8928K79372O3696
280A80705k68834q8813K30288R7950j71018q8368R9522O0154k5866j6934m1310
$$ y = [-174815, -29230, 122646, 43816, -54637, -44580, -19170, 32227, 92418, -4643, -153285, -32144, 196482, 74475, -214988, -113963, 207334, 142977, -175837, -155953, 123829, 146757, -61522, -116442, -4586, 64657, 62494, 612, -106455, -72737, 130100, 141430, -131729, -196627, 113435, 231564, -78702, -238738, 36664, 218802, 7202, -171574, -42749, 104729, 65737, -25253, -71248, -56277, 58752, 129410, -31685, -186446, -6647, 219021, 47144, -226462, -84778, 206480, 110230, -165047, -119782, 107420, 109853, -42281, -80718, -20971, 36430, 75732, 18569, -113725, -74596, 133784, 125678, -133435, -162363, 117009, 180705, -88129, -176942, 53346, 151296, -19722, -108090, -8568, 51586, 25720, 8786, -32524]
291c2524l5098R4897Q8736j30599j35097J47106J68020j46099j81889J31649J74931
302A44033j08359j47748Q2127J03809n7425m9053L7380r947k3889O6055J6142
313E3125j13426j2795J46823J1013j64539p794J65844R50j52842J1084J28752
324F6195k7814r7741M8314O3905o9074l0755Q7453P85r9295K4828J02609m6085
336B3325r5561O3693P8294p8981n2963R2593K2226j04905R407J14848l8356j21211
348h7591O0799J21722p4808j14130P9361R6950p5526o9193O5550L2071n2126J2302
360d619L9242n9718k9432J05728K4512j44151k5032J70385K9614j80339l6063
371a09873J71801M0662j45390m0027J03169L0990n0568j2108o479j6510O0407
$$ y = [-32524, -67622, 27275, 116011, -14588, -149685, -2579, 165441, 19342, -162547, -30898, 144033, 35674, -112074, -29947, 73862, 16437, -32616, 4764, -5183, -29072, 36983, 53125, -60301, -73096, 73727, 84740, -79799, -87593, 78251, 79201, -73641, -62557, 66195, 38381, -59360, -11046, 52859, -16215, -46970, 40483, 41268, -58027, -33199, 69410, 23325, -72236, -8543, 69751, -9230, -62193, 30400, 52626, -52279, -42872, 71976, 33620, -87591, -26792, 94930, 20122, -94008, -14647, 82303, 6777, -62416, 3134, 35205, -16921, -4619, 34623, -25095, -54527, 51201, 75713, -68438, -93470, 76915, 106529, -73810, -109873, 61928, 102590, -42800, -82827, 20342, 51332, 764, -11344, -17823, -34333, 26074]
382B6074N2614j04915r1672J34445J28267j45720j55974J38666J69478j15149
392C6114j64388Q0294J39221l9820r4963Q79L5624L0832L2093n0624j00389N5968
404c9159J60481m7495k04879K7604K27294j548k24995k5073J97651M6278j48732
415c2573n6933Q4255N3794j2140l5771n8381M912J19310L4912j63139p7387J85664
427D6523J15783j85107j43417J63452J54584j25164j46143P6609J17361k5573
437D8908p1071k0884J2183N6457N1615p7526j12499Q3057J62004p4243j94051
448a36050N5132K04451l0664j91690O643J58262J1990j08115k1326M8116J9978
459A6727J4417q275p2065j1398J18604L4849j49600n7640J62664P4846j58455
$$ y = [26074, 78688, -26227, -117899, 16546, 144813, -907, -156881, -18215, 151263, 36114, -128274, -47980, 91241, 51421, -43542, -42663, -7039, 23793, 55886, 5262, -95127, -39159, 121322, 73827, -131052, -103448, 123846, 122298, -102697, -127770, 69881, 116159, -32573, -89506, -5251, 48543, 36403, 632, -57749, -52837, 66473, 101385, -61754, -139141, 46523, 162306, -22801, -166218, -2766, 151818, 26654, -119489, -42880, 74481, 48908, -22163, -43047, -30864, 25593, 77208, -318, -112817, -29760, 132244, 58001, -136050, -80918, 123533, 92869, -98821, -92178, 66084, 78074, -30041, -51367, -3251, 16727, 31144, 22869, -49196, -60594, 58010, 92859, -56741, -114381, 48283, 123129, -35326]
470c5326q2963J38980P9195j08582o3364P2150L6756l4751k549J025l4973K6128
482h274P1103m4899j00484N5385J19708n8438j26291N6891J19607n2949j00853
493f9494M8930P2741m6539l9191M6111M019m7295K8599M8323n5920m7832P5751
505A8203M3689q7603l4656R1889K0292q9556j589Q2947j9894p3339M1957O2329
517E4669o1373n0581P6006L8255q3340k4946Q2476J0177p3748O902N7923k6329
529F091l7734M7410J5822o9156M435Q9196k0909j05200L1726J14133l6104j13853
541g4143L5004J02819k9801q0794K3296M9238j7622j0730J5396l0646j7603P0315
553C4729K4656j03266l5313J25540M7238j34565n7401J28741O2476j09384n9869
$$ y = [-35326, -118289, 20691, 99886, -8696, -72060, 90, 36846, 2095, -454, 571, -34402, -8274, 62829, 17930, -82554, -27169, 92539, 34101, -92190, -35299, 84308, 31359, -69494, -20564, 52177, 5638, -33553, 12558, 16577, -30718, -2119, 46204, -9716, -57548, 18203, 61892, -25711, -60367, 31522, 51814, -37742, -39331, 43616, 23722, -49617, -7660, 54669, -6704, -57285, 18721, 56976, -26364, -51310, 31166, 41343, -32405, -25503, 32420, 6091, -31643, 15767, 31589, -37567, -33132, 56064, 35155, -70045, -38319, 75814, 39710, -74143, -39139, 63680, 33879, -46915, -23619, 25619, 7997, -2733, 12663, -17983, -35586, 34729, 59385, -43881, -79194, 46346, 93584, -40981, -98382, 30359, 92835, -16549, -76418]
564g6418P8789M7572m1370k5795K053m320L4110L9899o2706p6430Q0388J09196
576A04968q5611j33008P8985J44231o2457j39822L9806J19329j5202q4238o530
587c9549L7974K1603J4015k7658o5808K3681J10779j1048j43689p674J60334K8057
599A01017j58952m5855J40149N6800j06687n7729O3545M7232j6270k5731k8913
610c1394l969O6789L8316r3236p1930J06077J00071j05259j17892R2366J22223
621A02162p0891j11916M4738Q7552j8643n1896l759Q921J9246L6040k6849p7473
633f2768K6180J10797j9143j31617Q171J38117L626j29756j2846J08521J7238
644E6520p7245j4973M0360O026k520Q536l1965k6386N9380M4343p7797n9476Q6419
$$ y = [-76418, 2371, 49943, 8573, -17222, -15169, -19489, 14621, 54520, -8186, -84616, -4228, 104968, 19357, -113651, -34666, 109565, 47108, -92714, -52908, 66421, 51219, -33019, -39549, -1575, 20028, 34043, 6385, -59423, -35742, 75037, 63989, -79700, -87374, 72960, 101017, -57935, -103790, 36359, 93159, -13528, -71257, -7712, 39520, 23250, -2481, -31394, -35363, 31426, 69742, -23494, -95424, 10653, 110724, 5465, -112427, -20061, 102162, 31271, -80645, -35907, 51645, 33002, -18894, -22653, -13732, 5514, 41554, 14705, -62768, -36588, 74209, 55066, -76551, -68380, 69737, 73363, -56393, -69239, 39282, 56520, -20725, -35698, 4662, 10688, 8168, 16704, -15261, -41647, 17733, 62076, -15721, -75197, 11222]
657A1222O8473q5946o9779P8048O2283o5287m6751N0233K4985l5141N22K1825
669A4687k6401j1041M9849K787o7800L757P8694r188q1654J4778P7080k1382o6032
682d1866K8980N0325l7403l2357M5645J3914n2525K953N6451j7385n6348K8747
694a0869N1121l7096m0682M3014K5799m7231p552N0429j1578n2875K9796N4620
706D6896m4649n4864N4477N2685n8241m6964N5800L6899m8115k2237L6557L102
718A1346k3424J9052J0639m2606j31O4556o803q2477R710R3822r059r6371O038
731d5708Q9362k151p2703n19M8100M71j7997L761j4229j2101M4738K4135p0093
744b4934l8023Q6968N1578r3858o2035Q9863O6725p6182o3879N5014N2057k9587
$$ y = [11222, 79695, -6251, -76030, 2018, 64301, -986, -47737, 2496, 27481, -7660, -7138, 14687, -11714, -22755, 27094, 29881, -37919, -34162, 44532, 35344, -46310, -31532, 45548, 24166, -41866, -12886, 37439, 36, -32321, 13324, 27238, -25287, -22334, 34117, 16732, -39616, -10869, 40252, 3156, -37526, 5488, 31287, -15944, -23496, 26933, 15355, -37520, -7724, 46896, 2247, -52617, 1860, 54545, -3696, -50660, 5140, 42039, -6076, -28313, 8244, 11346, -12078, 6974, 17613, -24993, -25124, 39432, 32629, -49848, -40138, 53684, 44625, -51746, -45708, 43654, 41503, -31200, -31719, 16381, 16852, -1145, 2616, -11613, -23714, 21024, 45159, -24934, -62957, 24011, 75589, -18269, -80304, 9559, 76284, 102, -63777, -8763, 43294, 13707]
756A3707l2189L829N587J8826K5112l5460n5822M4183Q2788m4527j02199L7856
768c8309J11128k5862j07923J1787R2613J450o6877j0860L3536J4535L162j1880
780F500l9110K989P0001J0244r2324k5606J03750L9852j03494n0020R2079N3909
792F8770p1679m9683M5382L7288j6673j7560j0380p162L2816L3876m8202n8854
804f2061N5453P8668n4887r0380M7752R2057l6398q3505K3445O5221j1582l9800
816a6017K744J0189J763J9923j783m6977k010O8208Q023q1303j4262Q5591J8966
829E3055q1024k0284O9167J7381n2108r817L2049j242j1823J4800o711k8924K1851
842c630M1298l2735n0476L9328N4388m2040n2637M1629M5085l9132l2823L5999
$$ y = [13707, -18482, -14653, -9066, 9760, 34872, -588, -56410, -12227, 70561, 26034, -76165, -38309, 72819, 46957, -60966, -49179, 43434, 44884, -21993, -32853, 683, 15218, 18380, 6500, -32610, -29621, 40380, 50624, -41700, -67306, 36444, 76296, -27198, -77218, 14861, 68770, -2909, -52592, -7210, 30078, 13405, -4155, -14535, -21697, 11119, 44995, -3207, -62061, -6608, 72060, 17173, -73207, -25455, 66602, 30204, -53301, -29856, 35365, 23783, -16017, -13273, -3084, -1321, 18602, 16819, -30158, -32168, 36040, 44063, -37240, -51502, 34089, 53055, -27969, -48253, 20914, 38295, -13813, -23630, 8419, 7177, -4646, 10154, 3443, -25481, -3630, 37668, 4933, -45543, -6215, 48173, 6133, -46504, -4875, 40210, 1078, -31745, 4254]
854D254J7100l2580J92K9417j6892k6138L1206K2750m1709j8355M7769J2415m9210
867a9781m585M6623n047m1162J5923L3756k7195k5906L7612J7949m5557j0875
879b8245M9901M479m9894J420M4977p191l5714J3763K2927k0790q322K8790o527
892I574l6846J9893M4458l0155n0132L6346N2652l8006n0934L5352M3951k9260
904F893l2045K1333J5303j3100M555N973k5780j285M5798l67o2334p97P3111M015
918D1273p6399q076P1972J1315n9696j2231M1404R749j9027l385m471o700K6402
931A2130J9498m4219l3211N5612M5844o0033n5145N7125N9090m8173n6411L4624
943a3269M6733j9007l0523L645R362R183J4784j8043l8478K1733N9419k0475p4474
$$ y = [4254, 21354, -11226, -11034, 18383, 1491, -24647, 6559, 29309, -12400, -30755, 17014, 29429, -19781, -24366, 22257, 17210, -23952, -8029, 25727, -1468, -27374, 10238, 28187, -17370, -28245, 21656, 26135, -23759, -22339, 22638, 15447, -20267, -6504, 16423, -4367, -12689, 16101, 9574, -27272, -7379, 37079, 6924, -43208, -6862, 45790, 7784, -43150, -7798, 36153, 6893, -25152, -3819, 11484, -1616, 2939, 8912, -16868, -18153, 27645, 27278, -35056, -35853, 37258, 41273, -35126, -43202, 28770, 40085, -19611, -31842, 9562, 19311, 284, -3101, -7572, -14272, 12130, 31628, -12591, -45802, 9810, 55654, -4379, -59524, -2399, 56691, 8518, -47893, -13269, 33464, 14457, -16066, -12421, -3059, 6124, 20908, 2865, -35613, -13880, 45539, 25064, -49410]
956d9410J5192Q1839p372q0307q81O9960P575n2169j0987K8945J0083l471m761
969D236k1451m344M2591J5869n7929k7818O5907L7723o6050m3817N9360M4489
981D8766m6990l9170L1508K8150j5148j2143K2o406J2086K5532k0106m2823K3696
994a3026N5985k3435o3419K0266O4038j5575n8033J0769M5920p169k9501N520
1006g660J0514o187Q563R066k5721j3145L9357J7460m8152k0583N1714K1617n0164
1019a3321j9476M4428J4181l5764o100K5702m183j5407J5197N930k5613J952L3835
1032B1361q260l8920J2921M0124j6560l7250J9327L1013k1937k2027K4490J1680
1044A5962k6815j119K8834q509k9656J6290K8969k1783k6045K4874K0704k5859
$$ y = [-49410, -34218, 47621, 40249, -40058, -40939, 29021, 36596, -15573, -26560, 2385, 12468, 8997, 4236, -17215, -21559, 21032, 36901, -21028, -48846, 17061, 54784, -11266, -55083, 4277, 48766, 1776, -37394, -5886, 22264, 7116, -5027, -5005, -11411, 675, 26207, 6101, -36722, -13026, 42959, 19524, -43895, -23629, 40409, 24834, -33199, -22430, 23490, 16321, -13180, -7660, 2854, -3333, 5230, 14296, -11425, -24570, 14787, 32247, -15905, -36488, 15226, 36843, -13321, -32797, 11631, 25812, -9952, -16052, 9650, 5467, -9940, 5257, 11187, -14426, -12474, 21361, 13101, -25819, -12898, 27226, 10666, -26584, -7257, 23756, 1819, -20208, 4282, 15962, -10853, -11972, 16862, 8353, -21303, -5013, 23956, 2173, -23872, 1002, 21706, -4153]
1056d153j2884K5198L039k3726P934K1759j8984k0061K8905J8444l6341j6932
1068b7802M0382J4915m0361j2028L6315P755k8835j509J8758o321p457J5671l433
1081F050k5537J2739L4928j9397m2358K2722M6550k2796m6582K0108M1770j5598
1093A2599l2417J0523J8831o060k606L055j4452k402L0636L967m3910p388N2749
1106B3125J1820n6044j5768N3312J8445m4969j8488L2289J5040j6690q062L29
1118e661j935J4698J4028k6914k6536L4533L7836l7444m6002L5400M9527k9537
1130A1993m7431K1082L9563j1682k6571K919J0120L678Q229p138k6278P685M1522
1143B7691n084n2276O01N7411M477n6323q793M9170J1330l7377j1044K2227P499
$$ y = [-4153, -17037, 8161, 11200, -12526, -4592, 17167, -1817, -21878, 7027, 25471, -10870, -27802, 12580, 27495, -12866, -24894, 11421, 19176, -9659, -11168, 7590, 1269, -6188, 9483, 6050, -19487, -6748, 28180, 8783, -33575, -10853, 35697, 12901, -33681, -13573, 28197, 12599, -19818, -9295, 9536, 3476, 870, 3925, -10527, -12929, 17707, 21674, -22236, -29624, 23125, 34945, -21099, -36867, 16445, 34890, -10079, -28567, 3722, 18762, 2072, -5990, -5661, -7596, 7102, 21130, -5784, -32320, 2213, 40049, 2605, -43397, -7997, 41530, 11993, -35438, -14356, 25207, 13525, -13046, -10127, -7, 3671, 11900, 4762, -21516, -13831, 27691, 22607, -29669, -29068, 28343, 32820, -23503, -32296, 16874, 28204, -9173, -20217, 2010, 9509]
1156I509n796j177r973p451K3303J6944l2824k6043L7922L2998l8311l6748L4864
1169b783L6375k8339l1348K0149K2362j1704j0164M335l662J190J7574m556k9857
1182b0428N785L8783n280m3800M084M3898k938l9631K595L1659l582k1119N931
1195d043R408r488J971J3822j2032j7898J9964K1041k5152k2171K7498K1334k7637
1208c383j7793K5760J2088k2765m624J9055l630j5516J1929J2045j9067q938K4240
1221I401N918k7124k710K7197q70k4859N047K0550r891j4848J5212Q699k0324
1234h602k729K4720k350k7646O316K8436q915k6623J0434K2184j1449j5272J2133
1247F37O404j2873L152J4212j2739j5880K0934J7513k6853j8837K9848J9217k9578
$$ y = [9509, 3713, 2536, -7437, -14888, 8415, 25359, -7465, -33508, 4414, 37412, -899, -37647, -2783, 33592, 5253, -26095, -5946, 16416, 4712, -5452, -1117, -4779, -3589, 13985, 9429, -20428, -14643, 24140, 18860, -24940, -20856, 23042, 20104, -19527, -16932, 14727, 11145, -9974, -4043, 5365, -4123, -2152, 11670, -362, -18260, 1704, 22745, -2407, -24578, 2920, 24254, -3383, -21176, 4584, 16672, -6093, -10717, 8338, 4708, -10808, 1121, 13166, -5901, -14839, 9401, 15319, -11805, -14515, 12682, 11812, -13047, -8000, 12550, 2659, -12189, 3023, 11722, -8602, -11331, 13389, 11039, -16607, -10291, 18145, 9230, -17393, -6959, 15225, 3776, -11496, 637, 7041, -5832, -2680, 11532, -1207, -17087, 3847, 21360, -5493, -24330, 5518, 24735, -4843]
1260d843j8039K6369J4854k0576r384J3216K009n410O955j752j6504P338K5673
1273A9906j0811l3155J1941L7853j0988l9024Q426L6016n296k9135K304J8905
1285F942l96o570L65o761j974J9138N461k9422r900L6290J4504l8859j8191L7251
1299G878J9995l1587j9146K3003J5225j2631q487J979m92P552J0741j5025k1110
1312b2105J9520K9977k0911l6178J9302L8809j5616l7136J0593L1306n387k1865
1324i691J076R917J685L161k194j5940Q68K6740K203l4441n964L8182R612l7624
1338a2410j2350L3351J2793k5793j0975J6271O661o184l40l302p362J1148J5164
1351A6672j6621k2004J9504K6774j9819k8709J8213K7520j5248k3144J1830J6012
$$ y = [-4843, -22882, 3487, 18341, -2235, -11619, 1597, 3606, -1804, 5151, 3399, -13105, -5767, 19906, 9095, -24060, -12119, 25734, 14746, -24278, -15852, 20164, 14868, -14267, -11963, 6942, 6546, -24, 341, -6420, -8394, 10744, 16205, -13217, -23117, 13173, 27677, -11182, -29373, 7878, 27873, -3714, -22860, 143, 15368, 2737, -5750, -3771, -4263, 3289, 14030, -995, -22105, -2585, 27392, 6481, -29697, -10395, 28414, 12798, -24338, -13745, 17561, 12174, -9691, -8615, 1302, 2987, 6148, 3954, -11986, -11118, 15622, 17825, -16616, -22580, 15602, 25214, -12410, -24760, 8591, 21384, -4409, -15384, 887, 7548, 1364, 1024, -2278, -9640, 1508, 16672, 51, -21953, -2449, 24325, 4506, -24203, -5990, 21530, 6282, -16862, -5032, 10980]
1363A0980q386p169N859k438m243J1658L591j9539l689K5126L985k7998m151K7963
1377A1549L524k5382j978K0723p49j4653M339Q246q600k010J2902l365j6405P453
1391d406J8872j0379j9316J2021J7956j2874j4573J3173R549j3164l586J3122
1403F395k718j3206Q533J3123j3271j2714J6350J1550j7667r448J7269O025j5214
1416d993j623J2350l687q931R562N597j5127k823J9960Q33k3218N92K4297j297
1430A1492k3148J710J9563k306j4021L340P002n223O34P734p967j0861J4164J4015
1444A6128j8414j6885K0444J8637j9950j8662J7467J6494j3196j2212Q263N955
1456D069l200J721j045r998M026J7839n375k4463N244K8605l864k9895J699K8024
$$ y = [10980, 2594, -4575, 1284, -1154, -5397, 6261, 9852, -9687, -13376, 11750, 15735, -12263, -16414, 11549, 15073, -10309, -12287, 8436, 7687, -6966, -2627, 5619, -2981, -4991, 7911, 4546, -11859, -4406, 14466, 4087, -15229, -3208, 14748, 1874, -12699, 474, 10023, -3141, -6727, 6395, 3677, -9529, -996, 12127, -1144, -13858, 2492, 14042, -3625, -13073, 4196, 10221, -4993, -6616, 5734, 2047, -6884, 2678, 8275, -6852, -9675, 10285, 11118, -12100, -11508, 12789, 11492, -11656, -9946, 9617, 7311, -6710, -3370, 3632, -1591, -957, 6777, -1190, -12051, 2113, 16128, -2286, -19171, 1273, 19910, -40, -18702, -1235, 15259, 2063, -10149, -1886, 4069, 869, 2590, 1545, -8453, -4427, 13412, 8037, -16426, -11182, 17423, 13559, -16336, -14637, 13387]
1470A3387L96k3062j948J5649K211o540j189k993j375J2036N121j9356r409K4245
1484G173J3545k6091j6694K5017J8188k1260j7477J5612J4247q924q719K188J508
1497a687L613O495p814j4555R987K1431j0163k6244Q751K8153o247k6981L364
1510a1897K2910r24j6225o50Q057Q06R16L66r295k743J6428N695k1421q566K3783
1525G240J0930k3664j1989K1003J1407j6575r140J1129M982n353K39O6o177M279
1539a623J1866p130j6649Q692J9819q881k0862Q233J9684p064j6359N993J1323
1552G042n269n307N111r76n519O786O377j1594p262J4816P687j6243p596J6189
1566D242O195j4634l951J2214O94r232L163O239p187l493J0903J305j3784O75
$$ y = [13387, 13783, -9279, -11227, 4422, 6633, 93, -1096, -4089, -5464, 6572, 11693, -7663, -17072, 7173, 20718, -5373, -22067, 2950, 21138, -122, -17599, -1987, 12260, 3336, -5383, -3195, -1687, 1926, 8421, 607, -13948, -3961, 17470, 7307, -18937, -10186, 17967, 11720, -15261, -11897, 11013, 10089, -6136, -6786, 1271, 2077, 2993, 3359, -5936, -8679, 7749, 13444, -7977, -16543, 7240, 18170, -5494, -17483, 3520, 14927, -1648, -10788, 341, 5323, -30, 209, 275, -5902, -1623, 10243, 3113, -13536, -4844, 14975, 6094, -14768, -6535, 13149, 6085, -10274, -4281, 7042, 1773, -3534, 1577, 601, -4918, 1868, 8245, -3349, -10611, 4205, 11892, -4351, -11947, 4242, 10437, -4197, -8148, 4066, 4760, -4472, -1309, 4930, -2257, -5750, 5153, 6458, -7326, -6651]
1580f651J5184j876j5282L097J3654m270j0613N481O661p047k183Q695k141j0584
1594g875O019J1952q845j2795J0397J2728j0678j1428R914Q745q362m889O535
1607A418J41m710N087L383j0151k580J4480K457j7509k687J8557L241j7951l337
1621a0161J5301K807j1003j623N824o88j97L684n034p357R442J0902j2150j4166
1635a4419J3310J6230j2693j6705J0856J5284p895j2009M569P027j347r24j068
1648B16n699K395J2021k560j7271J726K0570q9k1833j860K0711L305j7099m216
1662i683J1909L754n441k238j000o07P041M241j1784q048J4783J1695j5886j4234
1676a5498J5016J5335j2577j4581R078J1862n157p524J418J994J593M046l594
$$ y = [-6651, 8533, 6657, -8625, -5528, 8126, 3856, -6757, -1276, 5385, -1662, -3845, 4850, 2709, -7875, -1856, 10096, 1251, -11544, -1147, 11581, 903, -10525, -611, 8134, -228, -5117, 1418, 1559, -3151, 1936, 5319, -4832, -7412, 7068, 9525, -7984, -10671, 7886, 11127, -6824, -10161, 5140, 7947, -3056, -4679, 1145, 457, 260, 3944, -1090, -8447, 995, 11897, -253, -14419, -1109, 15121, 2428, -14277, -3421, 11863, 3968, -8041, -3472, 3555, 2208, 1284, 216, -5483, -3088, 8933, 6373, -10898, -9172, 11398, 11309, -10524, -12384, 8327, 11632, -5467, -9683, 2226, 5980, 539, -1699, -2699, -3306, 3735, 7976, -3808, -11856, 2927, 14622, -1264, -15498, -482, 14853, 2276, -12305, -3227, 8635, 3478, -4046, -2628, -634, 959, 5005, 1411]
1689A411r971M404J4788m035j8195K918J9584j369j8762j71J6014J089j1446j288
1703e029O078M40k23J345n335l534R629O179j2578q527J3950R957j3665j0379
1717a1692J2021R432r600p089O575L751l847N05J348m768M35Q709j402j1890J930
1732e582J3694j928j4037J869J2905j804j0538K172P207k911l517M171l53n555
1746d207L781O822o385p884P974Q292q755p780Q528O435p734m055O558J053n391
1761b748K383M285n683l402Q539K862j0506k492J1405K087j0958j463R495L75
1775D179p120J122M139l132j092N422j809p642L895R674n209j1125N727J1473
1789H502n407j0709M608Q700l455n631K462J727j690K532J552o686j812J0140
$$ y = [1411, -8560, -4156, 10632, 6597, -11598, -8680, 10904, 9535, -9227, -9398, 6616, 7705, -3741, -5029, 1049, 1489, 1266, 2611, -2724, -6258, 3371, 9550, -3028, -11555, 2395, 12352, -1313, -11692, 329, 9761, 161, -6928, -353, 3398, -449, 56, 1404, -3364, -2929, 5780, 4378, -7512, -5582, 8112, 6184, -7853, -5984, 6921, 5117, -5421, -3249, 3958, 1047, -2470, 1701, 1348, -4207, -426, 6396, 11, -7873, 101, 8393, -362, -8142, 386, 6821, -913, -4968, 1590, 2643, -2748, -365, 3920, -1763, -5165, 3374, 6236, -4270, -6762, 4643, 6730, -4228, -5691, 3804, 4179, -2941, -1819, 2320, -812, -1904, 3518, 1709, -5933, -2038, 7636, 2427, -8698, -2971, 8502, 3095, -7614, -3006, 5694, 2239, -3392, -930, 797, -893, 1639, 3191, -3495, -5307, 4833]
1803D833K586j2583l568J3596M437j3059m939J1109M652q098l462M314J354l14
1817H58J430l296m705O030P997p694j0785Q163J2710p443j3258N879J2385l891
1831D380r849J676O262K7j646j174l144J336P736p92j1458m79J3865K066j4805
1846e999l539J3923M700j1760m907Q285M233m125k535r9RL916L127o908o205Q743
1862H59Q943r245j0990Q686J1650p109j0938M965Q803k667n674P63J535O91K730
1877C002j291o741J120J0033m51j2162n19J2885J435j2093k122J0144K218p247
1891a789j637L928M01m43J487k658l634N059N662o587p283P133Q238o951q206
1906g280O011P198m878n223L535K595k386M49J620l549j165O194J130q093j234
$$ y = [4833, 7419, -5164, -8732, 4864, 9301, -3758, -8697, 2412, 7064, -1034, -4496, -182, 1172, 858, 2288, -1008, -5713, 317, 8314, 620, -10165, -2002, 10708, 3265, -9993, -4114, 8271, 4380, -5469, -3793, 2469, 2496, 850, -324, -3468, -2132, 5604, 4812, -6646, -7125, 6740, 8806, -5999, -9538, 4385, 9085, -2675, -7582, 703, 4936, 811, -1724, -1823, -1814, 2102, 5229, -1679, -7884, 859, 9802, 557, -10433, -1747, 9903, 2794, -8144, -3179, 5624, 2957, -2717, -1954, -419, 272, 3002, 1711, -5030, -3910, 6123, 5672, -6490, -7009, 5876, 7311, -4782, -6904, 3240, 5458, -1789, -3426, 502, 903, 460, 1947, -711, -4345, 714, 6376, -211, -7494, -361, 7877, 926, -7280, -1269, 5929, 1051, -4172, -637, 1958, -428, 21, 1641, -1908, -3073, 3121, 4251, -3842, -5076]
1921e076R101J324r064j172Q095O79o320K14M158j601j784L154k60m972K054O395
1937D925l300p296L795P547l891o961L571N637l212l477K786R83k666J802K719
1952B962m282k964O195L511p557l783P935L931p450l613O229K639m400j250K352
1967D55p78l35L059j346n393K505P424l022q826K865R451k441q877J632P372q33
1983B912m911L51J795j82J525O30m620j503P148K628q782l846R406M776q974n238
1999f885P456N051n291m097K692K351j71K01k173k901L815N481m570p860M705
2014b196R436l937j0005K743R428j325p718P3N057P92j774j075j724P05M933K08
2030C621p551j489R205K796r682m060R141M611p505m511N202L678k509k071p5
$$ y = [-5076, 4025, 5349, -3715, -4887, 3208, 3887, -2433, -2219, 1939, 338, -1446, 1708, 1448, -3524, -1470, 4925, 1625, -5671, -1876, 5671, 1780, -5181, -1610, 4027, 815, -2662, 124, 1107, -1559, 243, 2962, -1320, -4284, 1911, 5422, -2135, -5918, 2017, 5948, -1502, -5115, 1114, 3753, -647, -1897, 455, -323, -658, 2401, 1055, -4338, -1833, 5591, 2569, -6257, -3392, 6059, 3618, -5259, -3627, 3745, 2912, -1999, -1648, 147, -35, 1490, 2120, -2500, -4003, 3145, 5773, -3009, -6855, 2551, 7327, -1647, -6885, 571, 5622, 331, -3766, -1074, 1277, 1106, 1307, -866, -3767, 48, 5529, 959, -6901, -2196, 7240, 3303, -6702, -3959, 5469, 4144, -3574, -3501, 1556, 2348, 574, -501, -2225, -1520, 3413, 3621, -3930, -5419, 3786, 6582, -3100, -7160, 1981, 6592, -913, -5424, -222, 3456, 947, -1124, -1199]
2045a199j73K397K551l925m916M736O997m837q240M230Q580l334p813K076O212
2060C342r05l967R9J247J04J724m0m404m08O404J282p700k129Q082K685p495k891
2077d970O241K573m422j592K255K94l21J529j356l334K527M873l162o005L276
2092a594O466l031o173K502N149k007l505J658J329j410Q10J601k945j879M554
2107A525K283n533k525N843K694n535k432M644J858l452q46K160o75q25K314k78
2123A220l934J022N224j417n970J368O125j146n667Q80M564p24k851Q20O88j028
2139h26J362J662l151k507M594L241n240l959N402M183m789m056L810L251k475
2154E02j890R25J31L55J902j299l891J722N568j668o816J338P281q19o774M8N781
$$ y = [-1199, -1372, 1025, 3576, -349, -5265, -529, 6468, 1631, -6609, -2379, 6201, 2867, -4946, -2870, 3342, 2437, -1530, -1431, -184, -80, 1644, 1604, -2800, -3208, 3196, 4478, -3222, -5351, 2731, 5416, -2079, -4970, 1271, 3844, -578, -2170, 85, 379, 58, 1587, 231, -3103, -576, 4297, 1135, -4870, -1594, 4872, 1841, -4332, -1830, 3319, 1312, -2193, -535, 794, -616, 194, 1795, -1150, -3029, 1525, 3808, -1725, -4250, 1593, 4287, -1248, -3680, 964, 2822, -630, -1476, 684, 9, -816, 1498, 1220, -2714, -1692, 3532, 2115, -3855, -2487, 3638, 2492, -3175, -2295, 2269, 1545, -1306, -486, 202, -826, 536, 2198, -953, -3460, 1134, 4375, -865, -4824, 578, 4761, -28, -4084, -274, 2977, 502, -1388, -463, -332, 23, 1925, 626, -3265, -1543, 4025, 2357, -4459, -3121, 4160, 3341, -3433, -3385, 2396]
2171B396M73l937p86J693O78O51M9k981j042M828K199n945l358O306M172n822
2187d26m752M850M501l252l719J547K220J06k42j537j914K463L941k636n716K408
2203b158O919j789p272J006O702q7n419o70L598R45j247q74j094K14L363N50m939
2220b252j656N929K627o121l476N628L918m624l674L083K967j495j601o2q7J280
2236C84K043k099l718K374N088k259n837J723N943j007n479M59M134L4k486j80
2252h83O22j41J432M60k998j162M126K010m843k490M789K880m348k688L386K228
2268B380k299j226J074J7j14J516o66k941J160L985j316m649J140M810q64m387
2284b380N49L488m18k235M51P77p64P53J274k126j785L024K465l554k893L579
$$ y = [2396, 2869, -1068, -1854, -161, 517, 1168, 1217, -1764, -2806, 2022, 4221, -1724, -5082, 1224, 5396, -426, -5178, -328, 4173, 921, -2798, -1251, 969, 1075, 833, -704, -2618, -155, 3786, 1150, -4566, -2158, 4761, 2972, -4300, -3294, 3408, 3321, -2098, -2768, 830, 1775, 528, -346, -1440, -1226, 2137, 2687, -2252, -3908, 2021, 4648, -1473, -4949, 679, 4597, -27, -3701, -618, 2349, 854, -747, -809, -896, 384, 2427, 328, -3390, -1016, 4072, 1813, -4024, -2301, 3642, 2635, -2844, -2385, 1749, 1783, -703, -883, -261, -402, 1030, 1490, -1508, -2670, 1456, 3466, -1377, -3867, 922, 3802, -546, -3234, 152, 2380, 81, -1145, -71, -54, -168, 1348, 682, -2259, -1099, 2886, 1570, -3079, -1939, 2871, 2007, -2380, -1831, 1657, 1239, -996, -545, 232, -532, 221, 1495, -631, -2416, 608, 3073, -481, -3374, 205]
2300B05L090l174k828K517K123j678j008P41l21l3J701l46l046M24M146l90m710
2317b587P0M822K16m291n14L335N16j957k53M04j61J039J026k398j845L240K760
2334C422l717l355L528L776l026l664K147L064j128k089K44N59N05J124j086k573
2350b269R89M025p21m909J46N341M32m949j041M189J239k765j308J165R26N09
2366I99j46k074p64L202J828l967k746M010L568l660l918K843L695j776l051P95
2382a162J834K20l47j041j229J374K890j371m178J121M801m46m994k03M670P44
2398B683l743j054K341J094p63p45q56J6K209Q80l179j785L618K577l555l166
2414c428L125L345k411l013J513K219n70j040k61k17P86J567j012k788J010L654
$$ y = [205, 3295, 121, -2707, -190, 1933, 255, -753, -12, -333, -366, 1335, 989, -2057, -1633, 2513, 2123, -2587, -2517, 2305, 2521, -1770, -2284, 1051, 1567, -390, -643, -239, -400, 639, 1665, -733, -2578, 662, 3422, -295, -3650, -122, 3654, 628, -3036, -889, 2175, 1047, -1042, -798, -239, 266, 1390, 304, -2269, -1280, 2745, 2024, -2885, -2739, 2602, 3034, -1915, -2956, 1233, 2472, -293, -1601, -436, 490, 999, 853, -1221, -1985, 1217, 3045, -922, -3668, 342, 3910, 250, -3668, -825, 2870, 1094, -1957, -1162, 672, 892, 545, -496, -1725, -351, 2539, 1168, -3010, -1889, 2912, 2466, -2528, -2731, 1939, 2683, -1060, -2114, 227, 1321, 558, -187, -1043, -1027, 1182, 2062, -1117, -2902, 716, 3293, -262, -3428, -303, 3042, 631, -2382, -869, 1350, 780, -260, -521, -738, 48, 1615, 603, -2185, -1175, 2479]
2430B479o35m149J89M139J53l602m23K632M75j457k98J89k14J119P15k078j358
2447b124K659K076k897k494K691K674k302k347J580J817q55r15K41j46J41J344
2463A143l98k303K94L096j36l472k69L508M68l017o27K256N17j218k08J60l14
2480e20Q73R87j687j617K087K297k299k627K062K800j617k568J100J929n02j096
2496c98O0p8K51J256k90k365K20L052R7l523m95L460R29l007j124K223J065j165
2514A68p92J14K54R12N59j768j382K223K212k345k803K130L134j659l006R45K530
2531A426l32j736l09O59O30O79q04j813O35K872l30l440k00L598Q06l441j166
2548b266K803J358j797j283O60R40M86k15j533o03K188J439k491k292K451K786
$$ y = [2479, 1844, -2305, -2116, 2023, 2176, -1426, -1849, 783, 1258, -199, -497, -308, -522, 597, 1312, -766, -2124, 535, 2611, -286, -2780, -89, 2585, 283, -2064, -484, 1333, 478, -437, -196, -342, -201, 1143, 745, -1558, -1264, 1832, 1696, -1776, -2045, 1463, 1931, -1086, -1713, 543, 1060, -158, -366, -206, -520, 353, 1340, -347, -1964, 123, 2420, 121, -2506, -444, 2356, 739, -1829, -729, 1200, 698, -398, -338, -416, -165, 1091, 801, -1564, -1344, 1708, 1805, -1718, -2213, 1247, 2176, -831, -1955, 268, 1333, 168, -624, -510, -256, 656, 1215, -553, -1935, 288, 2500, 155, -2648, -518, 2616, 957, -2049, -1104, 1426, 1094, -642, -951, -292, 338, 1017, 213, -1600, -965, 1907, 1577, -1863, -2063, 1535, 2341, -1100, -2266, 537, 1895, 98, -1185, -525, 415, 901, 686, -847, -1450, 738, 2177, -314, -2606, -155, 2631]
2564B631k055k924J367K779o75k275M0J345N69k53q19r33Q31K021o06k804K30
2581a531L240L18l351p37K877J160k270j197J389R35k65o53o17r4J446Q33j905
2598d22j604K096K186j976k533J596K534j041k154M93J491L2n95m06m27O03J352
2615A225m99k093J85K588K12k719o22K572Q14k112r27J374Q67o01m61j93j40Q39
2633C09P91j324j402J606J861j504k252J333K188q74j953M82J400o4o42k17j68
2650d30L27R76j69j716r2K207M01k402q09K318R65j889j008J239Q83n28m91k08
2668d26q0Q10P46j235j330J374J919j303k177R99K252n95k013J55J477K15p76
2685A2m55q3M80Q68l03j582o0K215M06k454q07K296J169j896j253J280J232n61
$$ y = [2631, 576, -2348, -981, 1798, 1123, -1152, -1112, 233, 802, 549, -270, -1203, -372, 1649, 1043, -1761, -1531, 1709, 2027, -1324, -2061, 816, 1976, -294, -1491, -102, 833, 568, -85, -702, -796, 650, 1483, -422, -2026, 70, 2256, 280, -2253, -657, 1877, 836, -1318, -825, 666, 698, 103, -303, -730, -127, 1225, 726, -1367, -1182, 1406, 1618, -1101, -1723, 849, 1663, -449, -1376, -2, 865, 264, -197, -390, -530, 309, 1100, -224, -1626, -20, 1841, 337, -1915, -582, 1606, 732, -1221, -739, 661, 597, -45, -262, -430, -103, 873, 704, -1012, -1104, 1103, 1504, -898, -1707, 611, 1576, -313, -1321, -82, 801, 273, -218, -426, -506, 304, 1050, -185, -1515, -141, 1778, 475, -1702, -703, 1549, 954, -1059, -904, 573, 788, 12, -443, -526, -46, 822, 519, -1063, -1123, 1092, 1498, -956, -1763, 533, 1702, -194, -1447, -167, 1065, 504]
2703E04r70q8L26Q10L30j255j051J459J693j367k185J149K295o62k296J94J849
2720G35K64j196n38L27O22N74m97j361K21J980J35k374n32K364J060k104j331
2737a651J650J325r05j174K27P39M48j37j008n57J353J149j389j753J215K088
2753A620q37k228M49J952M0j567l45Q42N63k5n66q15M80J465j14j880l15K084
2771H03P10k005r97J638J139j090j130M77P99K31m16o58k49J040Q39j244j216
2788a329R44J763q26j886M88J844j01j484j58R04L63k63l88m27K86J093j10j466
2806g53l09J678O82j708r30J515J043j142r34N05Q14n6l85m63r4P50O24q56j132
2825a151Q41J538o44j713L59J651K4j383k87R50L67l13m42k63K45R09k7j377k78
$$ y = [504, -466, -554, -228, 582, 912, -343, -1394, 65, 1758, 391, -1794, -645, 1650, 988, -1308, -1114, 735, 999, -197, -735, -408, 214, 788, 291, -1070, -849, 1131, 1266, -1108, -1640, 724, 1784, -320, -1651, -1, 1324, 419, -755, -528, 211, 659, 522, -486, -1043, 310, 1459, 70, -1683, -468, 1620, 783, -1445, -996, 956, 996, -571, -916, -74, 489, 464, -102, -917, -437, 1028, 914, -966, -1281, 803, 1513, -492, -1489, 149, 1288, 198, -932, -455, 344, 575, 159, -499, -748, 292, 1131, -113, -1329, -385, 1378, 552, -1334, -846, 998, 897, -587, -745, 159, 522, 259, -129, -556, -270, 823, 713, -753, -1062, 616, 1298, -410, -1340, 175, 1218, 76, -858, -353, 461, 405, 20, -443, -537, 213, 837, -19, -1151, -310, 1228, 584, -1129, -770, 881, 905, -478, -765, 185, 552, 239, -203, -466, -221, 688, 661, -716, -994]
2844i94J543O40j531r36J302J146r64j148N27Q91j9n37l92O9P42M73q11j055Q14
2863b40J486o23j694K72J655J40j539k83R83N78n21n91j12M19P08j79j200j88
2881i29J510N44j521q84J374J100j012j199N91J040jq14l70L08P36K38q74q38
2899a001Q93J246o48j568L71J659n7j558k43J159N78p61o45J88N52M21l90r47
2917g51O4J345K47j392o70J369J013j125j178P64J141l53q56j30M61N60j4p95
2935c00n13Q29R39o78j322L95J533j30j449j68J226M27q94m82L07O00K22n21o18
2954e97J47J082J32j191n27J268Q03j094j046Q17J020l64r03q9O13L31j58n91
2972c47k97P50O79n99j082M59J278k22j305r7J184L66q78n08M92M91L6l92m70
$$ y = [-994, 549, 1189, -342, -1278, 24, 1170, 206, -942, -415, 476, 457, -80, -472, -403, 339, 812, 1, -1054, -240, 1246, 623, -1071, -799, 856, 996, -543, -826, 157, 735, 214, -377, -489, -70, 638, 459, -741, -929, 581, 1125, -396, -1280, 94, 1194, 182, -1017, -426, 614, 613, -201, -571, -263, 473, 711, -163, -1001, -108, 1138, 490, -1078, -707, 952, 895, -663, -906, 253, 831, 70, -575, -387, 165, 586, 196, -751, -687, 658, 905, -487, -1157, 212, 1225, 100, -1078, -314, 827, 474, -382, -512, -51, 509, 495, -300, -813, 16, 955, 277, -1045, -650, 883, 753, -696, -864, 362, 789, -105, -587, -280, 320, 542, 21, -597, -450, 632, 764, -427, -954, 314, 1117, 23, -1023, -206, 814, 450, -453, -542, 71, 402, 244, -347, -644, 106, 785, 186, -896, -437, 841, 619, -686, -783, 401, 767, -111, -619, -127, 364, 400, 8, -462]
2991d62J55Q75J8r66m22J033P41r32r48O55J003m09q92M9O22K80k46m94k29O78
3011A09N94o12q53L31J217k14j192q4J090L72q30n52M64O33j02m53m24L14O79
3030D87L3r42l35J018N84r09q60O54J024l23r90O5P01K89m12m35r3P02L76n76
3050E8p69L39J114j62j165j10J119L20r06m76N59N72j80n78k40M27N67j12q83
3069e06j49R49N22r01p42P09R03m52r47J85P67K18o04l76J31O20K24n89o46M95
3089a89Q95k46j076j7J130J88q92n00O02O50k85o41o9M75M31k17p08o6Q86L22
3109F73q06o46P10Q40n22q39K51O97R2n59l55L11M90J09n82m29M61P16k97r50
3129f35N6J065J34r08m58P23N83m06n38N7M31L74k98n82L3P00K31p01n59O66P09
$$ y = [-462, -307, 568, 586, -380, -802, 231, 972, 40, -908, -253, 750, 341, -551, -502, 120, 400, 154, -340, -569, 109, 703, 91, -762, -431, 786, 572, -620, -704, 386, 758, -72, -624, -160, 473, 371, -82, -506, -192, 487, 520, -422, -757, 261, 845, -64, -924, -270, 754, 431, -559, -494, 207, 496, 84, -351, -444, 258, 634, 58, -711, -372, 742, 580, -585, -695, 424, 744, -162, -638, -79, 493, 313, -265, -505, -78, 489, 377, -506, -655, 294, 816, -85, -827, -118, 785, 333, -614, -429, 338, 556, -48, -424, -293, 327, 551, -38, -684, -189, 706, 460, -616, -633, 497, 685, -207, -707, -105, 545, 260, -381, -450, 25, 456, 239, -469, -535, 351, 673, -133, -779, -69, 771, 249, -590, -339, 358, 450, -109, -464, -153, 337, 446, -136, -565, -104, 612, 315, -635, -579, 486, 620, -288, -746, -23, 560, 154, -384, -327, 104, 478, 180, -402, -369, 331, 562, -139, -698, -32, 677]
3150F77m51q56K70P46M6n54l38L75M13jn38k59M39O01l54p86R0R05J26p91l50
3171e90O59M67m20n00J16M60J83k69n36J22O72J35p33l67O93N81n18q04L43P20
3191D14k1o87k04M76M16j21n23k34N16M76k80p04J59P98O0q18l85P93M18m22n31
3212d04J43N44J15m40l34J76N75J5o65l08O70M78m70p13K97P72q8o69j16M32L64
3233C74k05m33j13M93L12l32n98K54P35Kq04k45P51L36m23n87K32N51P2m54l56
3254d38L09M38Mn38k31N93M36n10o45L72O53o5o78q0N45K66k74m16OM37K35l84
3276C5m84K23O55o7p15j22O30K93m78m09K38N48p0m27k50L60M28j73m95r0N22
3297A52L68n22m77K90O32j11o79j6N08K49l25l90O7M65J28l79l79K96N29j34o10
$$ y = [677, 226, -630, -360, 386, 432, -122, -460, -85, 328, 327, -211, -470, -31, 570, 216, -570, -480, 425, 551, -240, -590, 69, 536, 116, -384, -268, 192, 375, 106, -430, -308, 364, 499, -234, -601, 92, 673, 155, -649, -306, 414, 393, -294, -498, -22, 394, 273, -250, -484, 32, 508, 228, -476, -317, 481, 541, -277, -662, 131, 549, 127, -404, -261, 283, 398, -42, -376, -200, 375, 390, -275, -583, 87, 565, 95, -618, -321, 451, 363, -306, -422, 10, 374, 169, -264, -377, 116, 428, 96, -502, -248, 487, 489, -315, -560, 191, 527, 104, -483, -251, 300, 372, -82, -438, -129, 309, 313, -225, -456, 137, 573, 63, -582, -210, 443, 378, -300, -380, 165, 431, 157, -259, -253, 184, 419, 35, -449, -226, 429, 362, -353, -475, 155, 448, -30, -439, -201, 347, 277, -150, -400, -40, 388, 215, -280, -370, 152, 520, -2, -479, -189, 443, 332, -347, -363, 145, 394, 69, -321, -254, 211, 339, -40, -419, -123, 406, 272, -338]
3318c38o5N47L25n02m04K81M97r9m09j62L57L40k24l97l5N04K44m52m50L49N52
3339D59j99n89k7M89K76m14l45J71M29O3m60l02M02M31j83n60m0N60K73n36l51
3360d53L89M11q5n14o1L77K83j91m86N3M55K25n11l32M53M21k32n39j7N69J78
3381C93m38l50K16M31nl86k31L92L84k27n17M8N13J85m98l56M66L95k35m60k8
3402c08M74J94l36l48K8N41N0m70k21L52M23k30n39J26M41J44m17k67K81L74j39
3423A53l33j26L15L68k18m43O7M91R2n74j88L47M04k39l90N5L45J95l69k94J87
3444a55L64K9m20j94M03L76l31l53J7M68J15l64k59K51L37o2m36o6M17K05k45
3465I7l99J13M41jm06j19J98L78j97l94P4L26J37l14k80K19L48J2l88j47L83K48
$$ y = [-338, -403, 144, 469, -33, -437, -156, 341, 242, -167, -329, 28, 368, 144, -253, -288, 216, 460, 8, -442, -93, 459, 260, -329, -356, 133, 409, -5, -350, -179, 250, 313, -147, -449, -47, 384, 201, -359, -399, 161, 434, -102, -453, -64, 347, 262, -252, -313, 64, 347, 156, -330, -277, 178, 403, -108, -440, 13, 434, 202, -337, -354, 215, 393, -45, -395, -179, 252, 247, -139, -370, 22, 406, 179, -338, -290, 223, 408, -90, -446, 20, 415, 180, -280, -308, 166, 360, 24, -324, -296, 245, 295, -175, -396, -44, 379, 149, -390, -264, 177, 321, -96, -363, -82, 292, 153, -180, -306, 9, 377, 159, -284, -217, 274, 366, -208, -396, -49, 355, 116, -274, -219, 126, 321, -48, -342, -155, 209, 238, -182, -376, 27, 403, 72, -281, -264, 204, 319, -45, -304, -53, 284, 222, -214, -280, 137, 342, 97, -302, -189, 252, 251, -155, -274, -76, 302, 105, -289, -215, 111, 248, -66, -346, -127, 221, 233, -155, -302, 81, 329]
3487C29j74m84J57M15L7m01j32K63L20j60l86m3L54K28k76m16K21M63o4m07j41
3508b97L17K42j88l43Q2L30J38l27k44K44L06l4m27o5L55K62k74l87J66M14l2
3529B38l76j67L45K38j58l59PM02J00k92l32K92L27m8m64k4L75J98j99m12J93
3550a16L74l4k58j84K11K82j36l13q0L75K12l27k63J71L28j12l09j20L58J98k33
3571B4k82M9L73P0l25j74K24L19p8m15m4L29J91k57k36J43L46r1k54j94L40J94
3593B52j67l04L1L89L3k79k69K44L65k03k72n4K21K48k60k29J00L01K7k47j74
3614b47K42J97n9l68N0L16J46l04j55Q3L04jl50n3K59J53j57k65L5K68J43l18
3636h1j07J61K47o3l24l1L24O2k35j84J72K64m6k85j04J95K52j56l01M0L11J23
$$ y = [329, 155, -329, -172, 243, 280, -121, -253, 10, 330, 170, -216, -259, 95, 323, 47, -369, -148, 315, 251, -156, -297, 20, 262, 74, -269, -187, 143, 281, -46, -290, -46, 260, 226, -201, -266, 89, 351, 77, -310, -144, 270, 238, -138, -305, 40, 278, 120, -239, -232, 170, 270, -22, -354, -62, 265, 217, -247, -271, 104, 302, 103, -309, -116, 258, 224, -34, -218, -7, 275, 139, -174, -254, 121, 333, 6, -257, -86, 242, 130, -179, -299, 59, 257, 24, -258, -209, 164, 234, -91, -265, -41, 278, 200, -215, -259, 70, 261, 4, -232, -89, 257, 166, -88, -282, 58, 252, 85, -219, -188, 201, 234, -45, -314, -70, 295, 92, -180, -234, -13, 235, -25, -254, -154, 147, 174, -73, -247, -5, 192, 133, -235, -185, 131, 277, -27, -182, -99, 205, 204, -146, -199, 60, 213, 56, -209, -174, 94, 237, -81, -188, -27, 220, 157, -167, -198, 126, 188, -47, -231, -59, 205, 159, -126, -230, -35, 217, 61, -240, -200, 111, 234]
3658B34k62k19J87L12j61k29l6K50J76j79k96K9M29j4l14q4J83K42j07k85k8K73
3680A01Q2j60k76J76K38J5l46m3K34J81j24l02J13K92M7l51j07J73K31o5k58l6
3702a85K36J60k04k04R3L07m7k15j09K58J29j65k37M5K87R2k90j28J18K77Ll65
3724a44m6K28J59j90k25Q3K94K0k67j58K75J78j75j92j3K67J20k61j56J66K30
3745A93r2k68m3K85J63j94k45R0K04N9k22j49K07J89q4k04m7K32J49k44k03J46
3767g8K53o0k38j0J54J44j10k45O3K05P1j80j18J12K27q2k75n3L30N4k00j42J27
3790e1K23n7k34q4K08J04j5k28OK33R4j97k00J48K29q0k69N1J67J10j86j74J04
3813i8J77R8k92o1J82J86j37k78O1K58O9j84j59J26J71k2j85j09J92J70p3k04
$$ y = [234, -28, -247, -60, 252, 91, -138, -174, 76, 252, 73, -223, -194, 235, 221, -93, -177, 6, 248, 141, -144, -172, 101, 183, 23, -253, -77, 161, 176, -170, -213, 21, 202, 78, -224, -111, 181, 228, -123, -230, -57, 174, 109, -149, -185, 51, 211, 7, -197, -104, 203, 156, -59, -168, 90, 219, 54, -183, -138, 149, 241, -49, -177, -59, 218, 221, -144, -190, 38, 197, 7, -218, -135, 159, 179, -88, -246, 29, 207, 32, -160, -173, 94, 214, -47, -203, -37, 193, 101, -167, -210, 75, 238, 44, -201, -111, 93, 152, -70, -219, -12, 177, 93, -111, -158, 74, 223, -21, -224, -78, 175, 115, -123, -133, 21, 165, 55, -190, -127, 78, 149, -31, -149, -37, 190, 108, -167, -220, 110, 164, -36, -178, -51, 172, 115, -119, -203, 5, 109, 94, -134, -128, 105, 199, 2, -198, -50, 179, 99, -170, -119, 48, 158, -28, -202, -98, 79, 177, -115, -176, 6, 192, 55, -223, -162, 96, 165, -19, -178, -52, 119, 97, -88, -197, -5, 165, 92, -112]
3835a12oK40P7k82q9J38J97o5j98j7J90N6j27j40Q0J49J8j37j36J37K30j86k17
3858b00J07K15k8q1k18J81J51o6j69jJ43R6j01j93M1K00J11k59j52K16J59r8k61
3881b07J17K48n9k32n5J22K09m2j68o6J80J15j02j95N8J93O4k42j01J96R8r6j69
3904a34O4J55M2j64j40R2K03Mk32q7K37J33j44j96Q8K27j8j35j46J78P8K4k02
3927g3k9J52M2p0j46Q5J48N9k82o6J82J51j34j69P2J37M2j35p2M9J59k6j85q0
3951a89K28J87k14j34O7K27o7k04p3J99Q8o9j43qJ88N5j41j30J13J65n5k33k4
3974a67J76R8j31r8K6J42K9j07q3O3J65n5j03j15J93R9j30j31M0K00m4j44lJ09
3998B9O8q7j43K5J20P2p5j45J07J89r7j35K0Q3Q3j72l9M5J44K6j98K5K2P5nj74
$$ y = [-112, -118, 122, 199, -83, -172, -34, 163, 98, -100, -117, 73, 129, 2, -138, -58, 91, 109, -28, -164, -27, 203, 17, -200, -93, 122, 94, 13, -205, -24, 127, 61, -108, -109, 34, 130, 29, -164, -123, 77, 188, -71, -223, -7, 152, 54, -207, -90, 158, 99, -133, -188, -66, 143, 101, -67, -133, 47, 162, 60, -135, -77, 116, 180, -62, -163, 33, 131, 35, -134, -70, 85, 127, -37, -177, -85, 118, 122, -110, -197, 40, 173, 29, -167, -79, 148, 130, -5, -151, 27, 105, 129, -73, -102, 50, 92, 22, -124, -39, 109, 168, -114, -180, 2, 153, 19, -150, -78, 59, 101, -34, -106, -57, 102, 76, -109, -189, 39, 226, 12, -122, -55, 172, 105, -99, -172, 27, 115, 46, -97, -105, 83, 138, -3, -133, -20, 145, 90, -143, -167, 9, 107, -24, -122, -96, 46, 75, -32, -115, -52, 113, 58, -45, -160, 33, 132, 2, -129, -89, 111, 67, -77, -80, 29, 97, 10, -133, -108, 12, 84, 9, -136, -29, 160, 63, -72, -52, 31, 114, -58, -97, -52, 92, 118, -80, -55, -33, 42, 37, -137]
4024a37N8J13J26j42j12P8J10l8j57l7J78O5o1j35N8P2K9p1j96J49J09M8j34j26
4048a53K94k7j34o7O1J19o8l5r0J35N5lk10M9J42L6j57r9J18J33q5j31k2K45l0
4073G6j17RmJ28l4j10m0O4J43m2j61j6J70N1j29p6O1J69n5j43k0J29Lo2p9K0J40
4100G5M9j32j12M6J82l6j57M3J28M8k19K2N7Q6j5j17nQ5J09p6j32j5J95j1j42
4125d4o5J22N5o4n0k6J49mq0r8J02P3K0j42m1J18R5j20j18P7J48L6j96k6J13K2
4151E6K4j38j7J25lj9j59P8O4M5j12q2J52J7k6p1O9P5m8j6j53J38O1L4j55l2J18
4178B5Q2n0j10K0J64o2j45l2J56P8j00o1k9J44j6p1j01JJ64J3j63K9P5P4o3j05
4204h3N7P0L3j06j4K7R9J5j92j1J16O4m6j27O9J30J0j34k1M7J14p3q8K5M2K6m5
$$ y = [-137, -79, 34, 160, 18, -94, -16, 94, 56, -101, -138, 40, 105, 44, -91, -33, 39, 68, -3, -199, -50, 59, 107, -27, -153, 141, 114, -20, -87, -26, 93, 25, -10, -100, 35, 90, 87, -123, -74, 68, 104, -53, -152, -34, 99, 14, -117, -139, 106, 76, -41, -32, -36, 92, 58, -52, -92, -28, 115, 73, -88, -104, 66, 117, -12, -88, -27, 142, 87, -56, -76, 53, 56, -6, -85, -65, 75, 124, -8, -120, -74, 108, 72, -85, -42, 86, 134, -85, -63, -6, 80, 65, -52, -57, 28, 137, 61, -71, -86, 109, 98, -44, -109, 13, 68, 4, -46, -72, 77, 73, -7, -105, -3, 70, 90, -52, -93, 25, 120, 0, -118, -41, 107, 143, -53, -79, 34, 56, 80, -58, -75, 50, 47, 28, -131, -53, 11, 56, -56, -138, 14, 31, 5, -66, 3, 78, 30, 14, -139, -1, 60, 94, -61, -93, 25, 107, 57, -53, -33, 131, 69, -76, -108, 48, 126, 26, -35, -64, 80, 64, -7, -108, -107, 57, 70, -93, -64, 11, 85, 22, -83, -26, 44, 77, -29, -43, -16, 83, 98, -94, -105, 11, 75, 29, -98, -29, 101, 111, -23, -44, 3, 117, 44, -44, -19, 23, 49, 4]
4231Dj39J11J55q6j34qQ8J20j04p8N7L0M2r1l9N5Q1p0n9jJ6J04n3j31J11J22n1
4258E2j21j6O7J21j58lM4Q8m6k8j9K2R0o0j02m9J08J10j46l9Q1M7l7l3l2Q9K9
4285E9n3m2l0Q2O8o6j31P8J24j09r8M9J04N6j37k5N8O3n4J5j00J54j5k1n6o4J19
4312B8O7j20m1R0Q6j13Ll6K3R5q0p6K6Q1Mm9o3Q2oJ3q7RJ34Kr4q3J07N1l9o2Q
4343d0O4N1p7p2P6M5L2p8r7J14O7j08l1QJ05M9q4p0L8R5Lj28L1NJ06q4j02J0J40
4372F8L8j36k7Q3K9l6k1m4K5L6%o7LJ16n8j2n1J03J3p3l5QR1pr0kP9j5N5j16o2
4403a05J26L7j9j51J13P1l5j20J6P6P1p4l6k8R1m3Kn2LQ1L0q1m4Q0P3p4m4M6R0
4432A00j12J1r5J84J7j22l1K1J7N2k0p5K2J03l8o6KJ0P1n9m2k3J08p3N7q0R2K4
$$ y = [4, -135, -24, 131, 45, -89, -97, -9, 111, 7, -71, -14, 16, 58, -33, -72, -17, 64, -6, -65, -66, -50, 54, 1, -130, -19, 103, 52, -69, -85, -18, 103, -55, -58, -14, 74, 28, 0, -19, 3, 93, 33, -69, -118, -10, 100, -46, -85, -4, 43, 6, -27, -59, 30, 59, 6, -36, -66, 16, 84, 18, -113, -35, 89, -20, -118, -69, 35, 91, -46, -71, -13, 50, -4, 11, -89, 65, 50, 29, -27, -91, 28, 95, -25, -66, 24, 110, -3, 0, -36, -13, 82, 2, -74, -48, 33, 37, -12, -75, 7, 1, 14, -73, -64, 70, 72, -22, -105, 2, 53, 14, -48, -40, 24, 75, -2, -74, 2, 47, 79, 1, -96, 18, 85, -23, -54, -46, 59, 108, 24, -46, -8, 87, 90, -38, -7, -2, 104, 20, -82, -72, 68, 106, -30, -57, 26, 55, 19, -2, -46, -21, 15, 15, -52, -49, 67, 9, -3, -54, 49, 62, -11, -46, -38, 53, 46, -44, -46, 33, 18, 73, -43, -105, 21, 58, 39, -112, 1, 72, 37, -83, -67, 9, 80, 6, -30, -58, 33, -10, -8, -60, -57, 24, 54, -27, -71, 9, 82, 8, -36, 10, 100, -12, -1, -96, 88, 105, -17, -48, -27, -10, 42, 22, -53, -31, 72, 34, -32, -30, -20, 51, -8, -50, -73, 35, -38, 19, -61, 31, 55]
4460E5Lj46J3R6N9j03l2J3P9On9k6L4N2l0m2rO8M1j02l0J0J24j4j31NJ18O0j53
4489d1K5lK1J4l6j0K1J9J7l4n6R1K6m8p3M9R2o3n0nL4O6j02ojJ16n6O3j12L5O1
4520E4l0q9J2J41k8m8p4R1Om2j1n4R4Nl1l3J5K4P1j47oP6Mj6o6M8K5M1k0%m0Q8
4552F0j7o8pNJ21q4n7J7R8K1j08l3N9R0n6l4q6Q7J1l6l5L2N5J0n2n8O3J0N3q2
4582b1l2Q6M0j28j7L0O0Oj8l0JN3n6l9L0O2rn7l2R9M7j00J6J3ML2k3j02O3M2J3
4613C3p6L3K8M6o0j5%K7K8q2k5j4J10J3p0k8N3L4n3j25J42K6J9r3m2J53p3NOR
4643Il1N1kp9O1N3o1kk7k3Q5m4n7K9N9m8qK5M1J2n6k3J4J8M9q0o5Q5N1k3l3K8
4675Hj4P1n9l3K0P2m4j9n5M2M1l9l6K4O8jq1j6J18n3l2nn4Q9M6j3p7NN1N7p3l1
$$ y = [55, 58, -88, -75, 21, 80, -23, -55, -42, 37, 43, -16, -42, -8, 44, 14, -28, -37, 31, 72, -30, -60, -50, 74, 60, -71, -66, 52, 112, -41, -16, -19, 2, 16, -20, -30, -9, 10, 27, -7, -63, 28, 54, 6, -67, -18, 74, 11, -39, -44, -10, 56, -46, -52, -53, 63, 7, 70, -42, -7, 54, 24, -65, -53, 88, 60, 12, -62, 29, 35, -7, -18, -72, 22, 27, -4, -37, -22, 2, 73, -74, -80, -4, 0, -16, -82, -34, -9, 32, 12, 12, -28, 60, 43, -25, -32, -27, 94, 10, -47, -30, 68, 89, -19, -52, 7, 97, 41, 7, -79, 8, 19, -17, -52, -20, 35, 45, -7, -65, -2, 8, 61, -21, -53, 33, 73, -55, -72, -42, 18, 24, 6, -24, -23, 30, -26, -65, -35, 27, 18, -39, -71, 28, 75, -25, -9, 4, 8, 40, 17, -85, -22, 20, 33, -43, -10, 18, 64, 4, -11, -11, 16, 44, -38, -63, -77, 33, 46, -24, -52, 1, 35, -18, -143, -1, 25, 44, -49, -91, 62, -11, -6, 0, 9, -22, 29, 27, -52, 9, 62, 1, -1, -28, -51, 34, -10, -67, -38, 21, -27, -35, -10, 31, 43, -13, -36, -22, -4, 45, -35, -100, -15, 36, 13, -20, 8, -6, 65, 6, -27, -7, 65, 21, 2, -53, -11, 30, -9, -45, -21, 47, 46, -35, -51, 67, 14, -18, -23, -77, 12, 58, 45, -32, -27, 24, 81, 8, -23]
4707b3j1N2m0k7k3Q6O1j09k3M7K3J2k5l2L2K8oj04L4O0L4j13NK8Q0n8k4j8N1M1
4737C8q7Q1m0M4j2l5l7MQ5J7q3j3M5K7m3j6P5k7k0n5QL9K5k0q5K8O9N4p5q2J19
4768B8N7j24j9M1O3l3j6o8M1J39j04Kn6P2M8j34J8L5J9J6k7n8O9L1k2o4L6K1k4
4797a3L0o6j1J15Oj02j1O3lJk3L4Pj2j0l9J5MM3j0p2K3ML5p6KP6J9o0m0Q5k9j5
4830c0oK1rQ2r1jK4P2m6m2PK2O1n9l7N8N5p7K4p5K2M9n2L3q2M6M3q2K6N6%J9k8
4863CNLj2K9J8k2Rn0kj9PM4J2l4j5J1M7j7pn0PJ0m2J9L6k0R1j01j1K7Q6k2o8M0
4897A2O4q5j7LP9Pn5Kl9J01j8k9qm8L5P9j11k1N3K8l3o7R8k8K6n4pL8J9j9L2p3
4929c6J9O4m1r2J08j9K2n1k8P0M3r7L9l2R2Lp0l4M0L2l0j6m7M3j4MJ1K4L0L7j21
$$ y = [-23, -34, 18, -22, -49, -72, 14, 75, -34, -57, -10, 13, 25, 0, -32, 0, 28, 22, -82, -48, 12, 46, -67, -62, -34, 46, -12, -36, -54, -3, 38, -49, 32, -8, 36, 24, -11, -48, -44, 41, 58, -25, -38, 7, 34, -9, -25, 50, 23, 3, -52, -44, -5, 20, 0, -85, -57, 12, 66, -9, -91, 28, 85, -39, -58, -17, 46, 13, -3, -71, -30, 109, 5, 7, -49, 23, 71, -63, -45, -10, 9, 25, -2, -60, 9, 40, 18, -46, -10, 11, -13, 17, -49, -60, 55, 61, -41, -52, 11, 8, 9, -14, 20, 27, 15, 5, -34, -19, -15, 28, 18, -54, -31, -27, 8, -68, -66, 10, 29, -31, -71, 14, -15, -30, -36, -15, -24, 58, -33, -34, -10, 62, 16, -26, -19, 3, 64, 5, -32, 26, 81, 4, 28, -47, -25, 24, -28, 5, -77, -31, 12, -70, -44, 12, 12, 31, 3, 8, 11, -1, 28, 46, 24, 33, -17, -19, -38, -31, 13, 25, -9, -24, -13, 34, 17, 10, -40, -33, -23, -65, -46, -10, -30, 61, -40, -51, -24, 62, 40, -28, 12, 76, -9, -26, -23, 56, 63, 8, 10, -29, 72, 54, 25, 17, -31, 4, 83, -28, -49, 4, 32, -1, -68, 30, 2, 28, -26, -33, 5, 24, 5, 37, -36, -17, 47, 6, -86, 22, 3, 25, -26, -54, 16, 59, -38, 1, -31, 61, 64, -6, -40, 0, 32, 2, -14, -61, -18, -32, -28, -17, 7, 37, 74, -47]
4960d7M6JN7n8J3m3N0Jn1j1Q4Jo1m0MJ15j9p1J2L3L1p1N6k2QKk4L7l1lL6k2l8
4993b5P5k1Kn7J5K9K3l3mJj0Kk0k7K9N2n0m4P1k5L3k1j7L8k9L4%o8P8m8M6l5J5
5026IM1j6n2k8N5j1J1l8M9M6j4m6k8jN6l0ln6R0n6M3k3m7N5j8k2k7Q6l5O1p0J8
5058am1Q5k3o7N6J0Pj2p3Q2j0l6k1K6N3J0p1jJJJ5nk1L5N2o9L4j9J8j4m5L1qN1
5092C0k0n8K4N3p7RK9K2N4n5J6k8N4p8R5j18LN9K3j05M5L4Ql1k8O1j7L1J5m6j2
5123hK7j2l2k6J07l5l7L4o1L5J7J3l6kM1K3l9q5J08jl7l7K4N8jk6o5N8J4l7m3
5154f1PQ7Rn0J5k6P5j2r1N7oKm7L5n6O2Ok6L4J9j7j3o9N2K2J0qr2K2P4K6n6L5
5187A9Ml6k9L3J1QJ9q2K1ON3k0Op5J01m5k5K5K7O1j05kM0L1qq2L4J0mJ8m5n1O7
$$ y = [-47, -1, 0, 57, -1, 12, -31, 19, 20, -31, -42, 42, 43, -18, -58, -54, 61, 42, -29, -17, 16, 47, -24, 32, 10, 18, 20, -4, 33, 2, -1, 35, 13, -25, 50, 29, 31, -26, -11, 18, 41, 8, 4, 5, -5, -3, -23, -50, -21, 31, -19, -63, 8, -17, 16, -5, -22, 16, -13, 21, 21, -47, 31, -17, 29, -6, 9, 50, 34, -18, -46, 9, -2, 9, -29, 20, 66, 52, 6, -22, -23, 33, 3, 0, -56, 34, -22, 21, -2, -49, 6, -12, -34, -61, 25, -10, 51, -19, -1, -42, 43, 20, -47, 9, 19, 26, 14, -59, 23, 13, -23, -44, -18, 35, 45, -26, -27, -26, -25, -10, -15, -36, -1, 51, -18, 16, -3, 15, 1, -44, -13, -21, 30, 10, -48, -24, 29, -48, -39, -10, 12, 66, 11, 27, -1, 53, -25, 70, -48, -45, 14, 37, -68, -23, 11, 19, -12, -40, 21, 4, 35, 50, 4, -8, 19, 7, -25, -51, 56, 21, -16, 18, -43, -8, 9, 22, -14, -16, 25, 48, 9, -76, 32, 31, -6, -43, -19, 39, 38, 12, -53, 5, 19, -18, -61, -54, 33, 42, -8, 7, -19, 56, 44, -47, 10, 4, 6, -41, -6, -62, 0, 6, -20, 14, 33, 16, 3, -66, -14, 8, 18, 10, -82, -60, 14, 40, -16, 19, 23, -13, -42, -9, 2, 10, 29, -53, -32, -26, 27, 7, 13, -62, 39, -6, -31, -6, 21, 82, -23, -25, 15, 46, 38, -44, -10, 0, -4, 14, -31, -82, -15]
5220a5R1q3l6l4P4O2m8j5o9R6j4M4n3j1K7l1mm6Q6p7N9j6L4j9ok4K6MK5j8kK0
5252B7K8r8lKM7j3k2jl5Q2j8k9j7M3ppMk6L3QJ0rj2PL4q5Q2l9L9j1p1K4kK7lK0
5288Im5kK8jj6KM8n6J5n8R4k7J8l2J6P4o4n7L3N8k7K1m3m7O1M8o6l6P5Om5k5M6
5321Ek6N3j0l5n5P4M4p5mO2K2q5K5j8O1n4l0M2j9R2j7l4kk6K5n8J3mM8m5K9j6
5353a8km3N0J7j7N0j2m4L1nK2k3l0KL6qQm1j7J09l5l9K1L%jJ0qL2pjj03N3J2l7
5388c5L7n5J6O4l7o1R7j3j0Kjj5k1J4M1J3KK5p6k6N8M0r5L4K6k7M4p0L6J9l2N
5420aN2m2m5N0Rn5J4lJ7qk3N0pl9K6Qj7L8K9o6k8K7K4k2K9n2O7o5J3N3n4L7k2
5453fNK6m9%oK4J6L2n9M3m2J1Poj2KJ5k3lMM9L5p4K2o6P7Pm7l5M8lK6j0n7M4O1
$$ y = [-15, 76, -7, -43, -77, -3, 59, 11, -4, -73, 23, 9, 53, 0, -11, 16, -15, -19, -65, 21, -56, 3, -13, 21, 2, -4, -28, -2, 2, 27, 9, 7, 27, 55, -43, -46, -44, 3, -10, -32, -33, -68, 14, -4, -33, -50, -7, -14, -21, -17, -43, -10, -2, 8, -1, -13, -6, 28, -57, 25, -14, 25, 14, -57, -33, -35, -8, -11, 9, -36, -38, -10, -11, -27, -25, 23, -33, -18, -76, 18, -9, 9, -23, -7, 67, 3, -54, -21, 37, 10, 31, -12, -59, 2, 50, -16, -52, 23, 29, -16, -41, 5, -21, 32, 22, -13, -68, 6, 50, -25, -29, 33, 55, -30, -5, -23, 38, -16, -46, -4, -23, 69, 52, 18, 16, -10, 15, -43, -30, -34, 14, -31, -2, -18, -20, -63, -13, 4, -13, 37, 25, -19, 12, 7, 29, 6, -24, -22, 14, 6, 14, -27, -44, 65, 30, -9, 12, 15, 15, 14, 24, 16, 48, 41, 40, -63, -10, 2, -35, 2, -53, -37, 27, -10, -71, 26, 13, 3, 5, 4, -11, -32, -18, 23, 36, 38, 63, -13, -39, 19, 59, -36, -2, 24, -3, 41, -29, 7, 26, -6, -1, 51, 9, -36, 14, 23, -32, -18, -21, -4, -12, -35, 15, 8, -31, -5, 3, -14, 24, 53, -13, -41, -14, 10, -12, 17, -35, 32, -33, -20, 33, -21, 16, -6, -1, 25, -24, -24, -30, -6, 10, 42, -17, 26, -16, -5, 2, -4, -16, -14, 1, -22, -25, -21, 28, 63, -11, 11, -55, 22, 29, -18, -53, -5, -8, 18, 8, -49, -5, 56]
5489E6p5%kN6j0k1n4K5L2L8o5O3K2o3p3m0J38%n0j9M1n5N5o%N0l4nj8o9N8O1q9
5522e3MO0M3l0K7n9k9M5J8mn4K8K1o3J4P4j3k5qmL2N7j21K8K3k2j2j2N5k0M1K
5554D3k9k5PL2j2n7L0L1l1KjL6m9m1Q9j9n3M3lLj2K2lm6LN7lj1j5nJ7l6M3jJ5
5589B1k5j1QN2j0j5l1m7Q1l5P1p3JN0j05L5P6j0o6K4J0NjJ8m0K8lj7M7m2L9m7
5621a2N9m6N3m1k3K9k9M2n5J8N8k1q3oQ3J0k1o2P8k0j5j9L2OJ5j4j1MK0k0m6K7
5653a0mL3j2K1k4j6L8QRj15M5J7L9n9P0J3l6j8m0M9qO1o9K9K1m9lj7K3qj0K2l7
5686c7N1k2J5n0R1J9o9KLl4N5j4j9K8J8%J2n3L3l3Pk0m8J32k1o1mP7o0m6M0j7
5718b5M7k9NKpK6O0q9m5M9Pk2K9J6j3o8K7O5l5k8k5O0o1M5lkL9j2J8j7o0N7J7
$$ y = [56, -19, -19, -21, 35, 25, 4, -50, -25, 7, 45, -20, 43, 65, 2, -71, -111, 27, 27, -23, -42, -1, -56, -1, -7, -7, 43, 9, 4, -14, -83, -25, 36, -53, -49, 11, 54, 24, 51, -8, -37, 8, 26, 22, -32, -4, 17, -46, -32, 42, 29, 4, -4, -8, 24, 81, -40, -12, 11, -11, -23, -35, 20, 0, 41, 43, 14, -11, -4, 28, 16, -41, -11, 20, -11, -9, -10, 26, -23, -64, 25, 6, -47, -4, -7, -4, -16, 6, 3, -43, -40, 17, 14, 3, -12, -17, 0, -36, 7, 6, 21, -4, -15, -7, 45, 35, 20, -11, -58, 23, -12, 59, -14, -13, 37, -68, -33, 43, 33, -33, -9, 1, 6, 5, 23, -17, 11, 8, -9, 38, -4, 35, -12, 47, 1, 54, 13, -10, 19, -10, 32, -23, -5, 53, 32, -51, -57, 26, 36, 15, -47, 31, 11, -4, -23, 9, 15, 30, 16, 5, 9, 29, 9, -37, -10, -14, 19, 7, 28, 4, -12, 26, 34, 43, -72, -27, -10, 29, -30, 40, 53, 17, -1, -41, 8, 0, 61, -8, 21, 42, -7, -10, -27, -4, -12, -22, 0, -37, 14, -8, 7, -43, 48, 67, -2, 0, 3, -31, 24, 10, -9, 19, 37, 37, 49, -4, 29, -4, 3, -17, -65, 67, 46, -15, -19, 58, -2, -48, -8, -25, 22, -7, -2, 0, -7, 19, 79, -10, -55, -6, 1, -21, 8, 24, 11, -57, -30, 35, 0, -28, -53, 7, -54, -9, -12, -14, 25, 13, 31, 14, -46, 11, 28]
5751B8n3K0L7m0JJ0n0K4O0j1k4M4p7rL3J4RnOnl6k7M6N6r0N6k7qL3J2m5M4L2o2
5785dj6J6J8j5K5K5n7K4j0OrqJ1N7m6p1K0K6J7JL0Pm3jn5J8N5n1N8n2%M6m7P2
5819D7o0M8J6q4K7J3l6k9Q4k2l4K1K1L0m6K9j0jn5M9K2Jq5M7L5m5l0N0K0Qr1L4
5851b6k1O4j0l2nN3j6j6N5n4l6N6p8O6k3J2J2J9k2J7QpK9p9N1M7q9j6N0J6l4l2
5883d1NN6l1K3lj3M3n1J7k5L3oJ2Nn0R6l9m2L2Kk8K3m0L8j8l2J4rK0L3L0p5L9
5916A8K0l2L1o1K3J1m5kL0j1k2N9n0M2KOJ4k4J1J7l2k5J0QL5k6pQk6J7k1M3o2
5949d1NP1l5m2L4K0j4J2Njn6N2P5n4k1q8K5P8j0o6N1o0M7J1N6r3K4LpnM6j2n7
5982d7K0O5l0rj9MJq3J28jK2o9M0K1m9k9N1j9M5o6M9k0K5k4j2k0j9N0L0j8j5J3
$$ y = [28, -25, -5, 32, -8, -7, 3, -47, -23, 37, 26, 2, 46, -31, -40, -7, 7, 16, 11, 17, 12, -24, -51, -5, 51, -39, 17, -10, -18, 15, 27, -18, 26, 58, -4, -20, -4, 14, -1, 24, 49, -8, 16, 6, 12, 3, -5, 6, 63, 17, -54, -34, -8, 9, 10, 40, 47, 4, 3, -52, -34, 21, -30, 28, -24, -24, 22, -25, 47, -13, 35, 51, -33, -6, 7, -29, -58, 26, 4, -30, -9, 12, 42, -4, 25, 15, 14, -41, 8, 30, 31, -54, -7, 28, -17, -47, 3, 23, 31, -60, -26, -47, 17, 7, -25, -30, 23, 7, -9, 46, -8, -44, 12, -66, 0, -23, -11, 1, 20, -2, 15, 23, 16, 45, -34, 17, 64, -25, -41, 9, 25, -9, -41, -36, 20, -11, 12, 9, -4, 39, -12, 5, -20, 13, 7, 19, 24, -26, 70, 31, -11, 21, 23, -5, 18, -22, 16, -2, -34, -20, -29, -9, 24, 54, -21, 18, 38, 6, 37, -24, -1, 10, -35, -37, -7, -18, -40, 19, -31, 11, 13, 19, 33, 9, 20, 37, 5, -20, -10, -2, 33, 7, 0, 8, -18, -1, -22, 21, -41, -36, 35, 0, -42, -8, 12, -2, 10, 15, 14, -42, 10, 85, 31, 10, -78, -53, 25, 15, -51, 0, -60, -13, -2, 54, -39, -15, -12, -19, -24, 22, 10, -47, -27, 38, 8, -1, -20, -16, -15, -98, 30, 29, 51, -18, 22, 43, -6, -35, 16, -3, 42, -24, 25, 5, 30, 6, -6, -26, -45, 5, 35, 17, 2, 15]
6014A5%j0qJ4m7O4n0k2K8K6O1p1j8O3r8O9j6L5K5p9m3O1O2p4pm4K8O0l6Nj0j2
6046b9J7Nl8M2K6KJ1q5J03n7l7J1j6J08n2N3j07PM8k6J0l3N0ll6M0j6mN2j22J05
6077B9K1j07J7O3l2M6l2mk2L2K4j0j3nO7l8k9m4O3Ok8OJ1Rk8j5K4rpl8O8j9OL
6111A5k4J7nJ0j4n8J34m9j1j8M2l7p4Q8J1m7RK3Mk2j9O0pk6J9k8J8ok6rK1L0k5
6144dOQo0J4l4O2M0l3k9M9J0o3K0m7O7m1J0LO2m3m7N3K7m5PJ4j5o2Q3j2k5K5K6
6177B6n2J5k3Q2o2jnM2k1k0L3M8k7j5M0j42K5N4L1n2mj4K8ol8L7J5o1N1J6L9q8
6209d9K9M7n5oL5M3j0k3K8j5n6Q4Kr2jO3k9j4M4m7n2J11p9O1nk9j9L7J8o7O8R
6241C1n0J4K6k5nk7K3oM8l1j8J7L4Nl6K2o0M3j0k9J9Rj3k0N8l4j8N0nPOl4L5p0
$$ y = [15, 15, 5, -3, 11, -36, 28, -22, -44, -16, 10, 71, 0, -18, 45, -53, 16, 0, 35, 60, -19, -62, -1, 61, -13, -20, -64, -36, 24, -12, -7, -17, -29, -12, -7, -45, -3, 23, 25, 36, -49, 54, -3, -40, -29, -45, 63, 11, 64, -43, -36, 12, -14, -4, -37, 13, 10, -26, 14, -2, -6, 46, -76, 29, 50, -57, -40, 23, -9, 37, 5, 1, -21, 11, 35, 25, 12, 7, 74, 36, 7, -37, 26, 32, 4, 10, 21, 30, 2, -13, 11, 2, -5, -43, 25, 6, 12, 15, -9, 8, 3, 13, -1, -59, 75, 26, 15, -3, 39, 2, -72, 16, 27, -20, -11, 12, 16, -6, -25, 35, 28, 2, 21, -7, 11, 5, -21, -30, -9, 21, -4, 2, 10, -50, -36, -70, -8, 32, -1, -30, 19, 29, -34, -14, -61, 6, -35, -25, -22, 40, -3, -50, 3, 30, -15, -8, 6, -9, -71, 12, 0, -25, 0, 26, -26, -11, -34, 48, -14, -15, -20, 22, 1, -19, 14, 62, 35, 20, 60, -82, -57, -3, 28, -24, -28, -42, -14, -20, -58, -21, -6, -67, -16, 0, 39, -49, -20, 27, -28, -34, 1, 44, 34, 11, 39, 24, -32, 52, 54, -38, -39, 24, -5, -19, 25, -22, -74, 37, -42, 19, 14, -15, -34, 3, 21, -46, 22, 31, -19, -5, 21, -4, -9, -36, -13, -19, 29, -2, -20, -3, 31, 36, 0, 22, -38, 5, -5, -34, -15, -6, -19, -39, 19, -15, -33, 17, 12, 19, 25, -9, 26, -44]
6275d4R3o5N4qq3L3l9K2K2M5Mk3j6l0M8J8MlL2k5k9%m2j1L4LP6q9k0N5l6J5K0
6308A5l0L4l7L4j1k2m3J3R3l0n5j4M5OK1m9j0K1NQN2k8j8j5J8l9J8K2J9m6J1J0
6340bPJRRj6Jl7J6L0J3l5mj0j7L3l0NJ8j7K3Mjn8O4M7o7m1N1%J7kJ4m1K0J6j2
6376HJ8kj6k7JQKl3Q6n7K7j8rj1K4OJ9j2k2L0jl3K0j5M5n2K6M9r7M8QJn1Q2j5
6411C7o1K8j6M2lo3K9QKk9O7o1j2L4L5j0k2j8MJ0j2K6K7n0J4l3P8oj8n0k6Q1J5
6444D7q0N1jp0j2M5L3Ll2l8M5%l1pJ00m9pJ4K7l7k4KJ3L6k9j2M2n1J6k8L6n1J3
6477c6K9JMK8Mm8k1P9m2k5J9j2LJ4L0k7j5ONM4o5M2J3lm8J8N5n4JL6m2J0j9k9
6511d5M7kj4j2M9j1m1K4k4N0k2j6k8N9kk5Ml9J3RK3J6lj2K7l8j6J6j5O1n3jo0
$$ y = [-44, 49, -16, 38, 30, -53, -20, -59, -37, -15, 30, 34, 11, -5, -35, 13, 31, 35, 32, 64, 39, 10, 10, -32, -43, -9, -6, 70, -19, -39, 16, -20, -5, 15, -15, 19, -18, 16, 5, -17, -60, -47, 46, 16, -39, -53, -8, -2, 19, -30, -40, -19, -14, -6, 46, 18, 0, -15, 3, -36, -18, 4, 23, -23, -12, -2, 5, 6, 15, 24, 8, 9, -28, -12, 18, 31, -4, -8, -18, -35, -2, -32, -27, -9, -26, -3, 1, 0, -58, 6, 53, -14, -55, -4, -4, 13, 11, 25, -16, 4, 20, 8, 26, 24, 8, -19, -18, -10, -8, -41, 45, -12, 15, -3, -12, -23, 1, 7, 26, 14, -8, 22, 21, -12, 8, -7, 38, -14, 12, 61, -36, 12, 20, 21, -30, 52, 37, -24, 4, -12, 30, 27, -36, -7, 1, 3, -26, 41, -20, -32, 2, 37, 27, 5, -13, -9, 1, -11, 15, 42, -8, 6, -27, 51, 45, 27, -23, -49, 32, 47, -33, 18, 17, -53, -65, -20, 13, 16, -16, -54, -9, -9, -40, -47, 53, 4, -3, 11, 38, 1, -23, -21, -8, 28, -1, -13, 29, -22, -6, -34, 2, -49, -36, -7, -6, -2, 26, 30, -18, -39, 40, -2, -27, -8, -20, -17, -3, 27, 0, -15, -9, -4, 40, -25, 17, 30, 27, -21, -3, 52, -2, -1, 35, -7, 3, -16, -45, 2, 0, -14, -26, 23, 12, -29, -5, -29, 21, -1, -17, -45, 14, 12, -13, -9, -48, -35, -26, -3, 13, 10, -2, 25, -13, -29, -13, -28, 33, -20, -21, -81]
6544h1P5M8p6J6N7p8P1J7n9J8K5o6P2k4J5K6r5pL4J7jm6P8n5j5L2J7k4M8J0m1
6575Hk7N6J9o7LK1mn8M7pL2l5M7m7K5l0oJ4l0M8om4P3L8o7oo7O9J6Jo5j6P8m2
6609b9P3p9jMJ1kM9m4K6l7J3J4K2k4j7K0pJ9mp1M6L5K9k8J4n0m0P7pm3M6j1L6
6642D0l2K2o0pN6m3L0LoJ2n0J4L4J9k5pK7J1k1j3J0K5K4o1m4N5o0L5KlJ7L4n0
6675a2L8l7j2K9mM7p5P1m7O3k2n7K3K9k7No5M7J1l1NK8l2oM3m0K2J4k0K2J8J2
6707D0n4o2P8k8Q5j12M8k5N7n6L0L8j6l5K3k5mL6J3o5K2m3J53j01qN1k2oJ6Rn3
6738a6J3j5L0j9K9J6l1m9Q0Nm2l8m5Q7l1M0j7l5P1Qj0J2j15N7O2qq0N0j0k9N6
6769B6m3M8k7M9l6ooK8k9jL6m2K3k5l0O6n3L8J9l5lM4p1K6Lk1j9M6J0j6qLLnJ0
$$ y = [-81, -6, 42, -34, -18, 39, -39, 32, 49, -10, 8, 33, -33, 39, 15, 30, 56, -39, -46, -12, 5, 4, -42, 36, -19, -34, -2, 15, -9, 39, 49, 8, -19, 37, 56, -11, -8, 13, 9, -49, -2, -9, 23, -12, 35, -12, 13, -17, -23, -9, -39, 9, 3, -41, 32, 70, 3, -3, -70, -1, 15, 16, -49, -65, 13, -29, 44, -35, -36, -32, -21, -23, 26, -18, 8, -29, -16, -2, 20, -4, -21, -1, -8, 11, 7, -64, -18, 17, 46, 18, 32, -18, -58, 19, 12, -31, 15, 4, 40, 8, 30, -30, -37, 19, -24, 6, 9, 3, 15, -35, -21, 13, 32, 7, 0, 27, 38, 17, 4, 14, 39, 63, 2, -42, 13, -47, -12, -10, -13, 4, 38, -12, 26, -11, -23, 6, 2, 49, -26, 45, -2, 61, 39, -18, 5, 34, 7, 12, -53, -6, 5, -26, -21, 7, -25, -31, 12, -28, -6, 8, -12, 10, 28, 40, -14, -76, 2, -26, 59, -53, -5, -30, 27, -29, 1, 39, 23, -12, 11, -14, -18, 18, 31, -34, -12, -55, 98, -3, -11, 40, 18, 12, 28, 37, -16, -3, -18, 12, -7, 22, 38, 7, -42, 38, 43, 1, -37, -82, 5, -26, 14, -3, -38, 33, 41, 31, 43, -72, -15, 47, 39, -41, 9, -1, -30, 26, -17, 31, 4, 53, 17, 11, 5, 33, 4, 3, 39, -3, 20, -5, -35, 31, -22, 16, 35, 0, -3, 41, -30, -4, -1, -22, -41, 5, 15, -1, -9, -6, -3, -8, 2]
6804BL7j4k3M2n7M9K6j04M6l6L5k0Rm7M7pK5Nl6J2J8j1l6NQ4k6l4N1m4k7n2J06
6836B5j8m5N5l3K9m4J4N9q2O4m9K0J0Nn7L5J0k8j4N9K6k4l5j0j9N1oJ2j7j8N3
6867B8q9N8m5O5m7PK0j2j0J6k0N3m5j4P8l2PnOl9J6lq2P1NL3j2j5K9l9J4j3N7
6900D1l1Pnk2J7l7K0j0k5L6k3M8k7MJ4Rp2J8P3Mqjm3N7q2M0QJ1j0j0K6j7J4J2
6934C6m6J0K6j2o5O2l7J1l3M5M1l6L8m2j9K6j5j5K8L1n7K2n8J2Q1Oo2j3L2K5j5
6965Gl9J6N1o3N1m7kN6k2k7l6P5k6Po1Q0L2m2m2M0L3o5n1N9QKL6k0n2L8k5M5n7
6998d1L5L1j3m8J6J1n0N1L3J2k2Om5rO4qk1M8o0J2j0j9jN5kjNn9N5o5NqM6K6j3
7033A6K1m1J2j8L2k5J0pj1J5o0P8m8N0k3L9l2m1R3j18M5j5J0%nK4K3l5L4L3o5
$$ y = [2, 39, 25, 2, 44, -13, 36, 62, -42, 4, -32, 3, -17, -8, -55, -8, -15, 10, 15, -21, -9, 9, -2, -38, -33, 51, 25, -9, 42, -2, -29, -81, 25, 7, -38, 17, -16, 13, -31, -17, 42, -40, 24, -25, -5, 5, 10, -47, -12, -2, -30, -44, 15, 41, 17, -18, -28, -47, 4, -2, 10, -7, -25, 28, -61, -3, -48, 17, -30, -23, -3, -15, -25, -9, -29, 24, -21, -35, 43, 11, 18, 13, 19, -20, -4, -7, -89, -18, -13, 20, 8, -7, 22, -17, -3, -16, 41, 10, 17, 12, -10, 7, -30, -10, -20, -45, -9, -32, 16, -11, -7, 7, 16, -56, -38, 35, 39, 31, 30, -13, 44, -38, 2, 10, 21, 11, 1, 27, 10, 24, 36, -10, 0, 26, 14, -51, 11, -26, -15, -48, -3, 38, 2, 40, -2, -21, 5, -10, -25, 3, 34, -23, -1, -59, -47, 34, 40, -22, -35, -3, 22, 7, -32, -16, 35, -28, 23, -24, -26, 30, 8, -19, -55, 20, -6, 1, -60, 20, 52, 10, -32, 8, 41, -24, -75, -16, -8, -6, 30, 10, -42, -4, -29, 16, -41, -6, 25, 12, -36, -20, -9, -59, -8, 25, 37, 15, 21, -24, -33, 31, 23, 2, 50, -10, 2, -8, -27, -28, 27, 25, 24, 29, -30, 25, -40, -35, -43, 3, 29, 16, 37, -4, 8, -10, 22, -3, 7, 0, -11, 4, -56, 22, -26, 24, 1, 40, 8, -33, 60, -58, -13, -28, -18, -18, -23, 1, 24, -11, 23, 56, -9]
7064ip5P0K8n0P1jm8M2k6L5J2p6J8NJ5l0m7N0l9R1k5k9J8M0o0K5l8N4l0JNk2M0
7097A5l2N0m8pm5J35m6k0l4P%pK5n2P2k9j7J9mJ6K0k6Nl2L3O6r8L3l5O2r1J0O2
7130Gj5l4L3j0rk9P0Ol3K4ol7P7l7o3M5k4J5k1rN6jPn8M2M0L2o5nl6RL5J4l0k3
7165c3PN9k9k6L5L1m0l5J3J8J9k2L6j5j7%nk7pK7J2l4M5m9M6l8K6j2O9k9j5p9
7197f9K3N9m7M4o6O9l5M2p6K6M2j0jJ4k4J1m2M8j0Pq4J03k2k2J5J7L6l1N4k5o4
7228a8K6Om2J9m0LJ05o3ROm6N6n8K7L9l2J4nl6K4n8M5K7j2j2nPL3J0m8k6N9m4
7261c0%J4K9Prk1m8K8J07o7n9J10l3om7N6n4N4r7J23n6LN7o4j0OJ4m7M1oj0M2
7293B7k1m5J7Kjl5j5N7L1L4K2r3RL1Ll2RK8Rn3O3k4K3m7N7o2n0N5pPN9j16M5K1
$$ y = [-9, -84, -14, 14, -36, 35, 34, -14, 28, 2, 37, 49, -27, -9, -4, 11, -19, -66, -16, -55, 36, 11, -18, 0, 40, -20, 5, -33, 21, -9, -8, -3, -25, 15, -17, 33, -15, -22, -67, 68, 22, 2, -32, -25, -25, -32, -7, -59, 13, -16, -33, -14, -18, -2, 18, -8, -3, -35, -2, 64, -34, -1, -36, 26, -65, -55, 7, -8, -42, -9, -19, -28, -57, 13, 19, -14, 10, 4, -33, 44, 7, -56, -11, -35, -20, -41, -50, 6, 5, 12, -46, -4, 36, 68, 3, -2, -38, -29, 6, 20, -10, -33, -26, 33, 4, -22, 13, 44, 4, -31, -18, 0, 19, -3, 33, 18, 1, 1, -4, -31, -38, -11, 1, -33, 12, -37, 9, -29, -3, -15, 54, 25, 10, -69, -46, 13, -34, 10, -56, 13, -22, 20, -56, -30, 12, 2, 1, 15, -9, 2, -40, 8, -2, 5, -79, 24, 2, -20, -5, 12, 48, 17, 71, 46, -18, 8, 14, -28, -9, -49, -46, 59, -4, 5, 11, -35, 21, -37, -10, 29, -3, 11, 6, -30, -6, -64, -19, 8, -4, -16, -21, -14, 19, 29, -19, -45, 14, -30, -30, -16, 13, 20, 11, -10, -58, -30, 77, 10, -49, 61, 28, 22, -25, 31, -23, 31, -66, 57, 1, 4, 61, -3, -13, -7, 7, -40, 1, -5, -15, 27, 6, -39, -22, -20, -21, -56, -71, -14, 17, 51, 73, -20, -11, 20, 23, -9, 0, 28, 37, -16, 47, 23, 46, -1, 56, -6, -56, -1, -8, -1, 58, -58, -13, 8]
7327HJ7Lk7k2L4Ql5K1k7n1K7P0ppJ3j9n3P6k7L1k9L0l6QJ7K4n6L3Qk9kk0P8m8
7361A1J2mo1jP5o0Rj9N7j2M9n7J1k3L8n1K3k6P3l9Nj1nO6q3K8J3%k7M4l1J2j1
7394El3M2p3J5Q7pm4K1nqK6k4j8J3N8r2J8Ol5Q2n8O0n5m0O8l2k8J8P3n4nj3p%
7428c9L1M7Rm5j7M7m7n7Q4m2kJ8%kK8Mo7P5m1m6O9L1l1j1k3L3M0o9N6l0k2JJ7
7461aj3J0L8j7onJ8k8K2j5Lk9L1N9m4rm1MKLK8m2NJ2Q5o0J5p6M8j5L7j4m0P6R
7496E0n9j8L3J7m0J2m2M7jk3M6k8m0j7O9l7N2n7M5J3Jj2K0k8k7K9j0L8l2j1Ql4
7528c6L3kM1o5O8Jk8k1L3k1jpk7J8RPqM1l4k5P3n1L5k7n4K9p%kN1j4j7l2M5Mk
7564Gm8K9N7rl1mK5l6L8o6L1k9M3m3L2J3m0M3n1N0l8K1L6j5n7R3l0pQk4kj4L4
$$ y = [8, 25, 28, 1, -21, 13, 21, -14, 7, -20, -71, -44, 26, 19, 12, 25, 6, -47, 29, 2, 33, 4, 34, -2, 6, 23, 47, -9, 24, 32, 3, 1, -19, 59, 11, 23, 19, -42, -43, 32, -28, -19, -38, 19, 7, 56, -1, 10, -13, 25, -26, -3, -29, 44, 5, 10, -1, -6, 60, -23, 5, 18, 18, -9, 35, 4, 16, 5, -28, 14, -59, -44, 43, 36, -8, 13, 8, 0, 26, 2, -16, -3, 55, -37, -19, -13, -48, 34, -24, 36, -19, -59, 9, -23, -51, -33, 40, -14, -19, -32, -39, -39, -8, 39, 48, 3, -14, 33, -14, -71, 13, -29, -31, -13, -13, -15, 13, 17, -50, 25, -16, -62, 7, 38, 7, -4, -27, 6, 46, -23, 33, 3, -19, -18, -1, -14, -4, 34, 17, 11, 6, 24, -4, 18, 3, 6, -23, 8, 67, 23, 14, -27, -23, -21, -18, 10, -32, -27, -15, 70, 10, 25, -51, -3, -18, 19, 5, -35, 41, 50, -9, -27, 6, 23, -17, -5, -47, 0, -1, -24, 22, -6, -46, -63, 6, -31, 21, -36, 9, 22, 23, 11, 31, 3, -24, 5, -5, 33, 1, -10, -2, -36, -3, -5, 36, -29, 39, 40, 12, -9, 24, 3, 2, -5, -32, -14, -5, 2, -6, 35, 1, -24, 49, -2, 33, 6, -48, -19, -26, -26, -28, 23, 9, -8, -40, 5, 9, 7, -41, -12, 45, 36, 5, 1, 26, -10, 28, -38, -7, -36, 7, -36, -4, 9, -31, 12, -39, 11, -27, -6, 30, 15, -42, 51, 21, 14, 22, -2, -4, -18, 16]
7597A6j1k1RL2n3K7MM0j7J8m2K4k4l7J9lP5l2j4k4k9M3N1o1k1N1j9k9k3K4P9o7
7629a5l7lL9j1j9kJ7L6J9l1jM1K1m1m8N3Mn7P4l1j9K9k5k0OJ8k6J8M6q5K3RL6
7662A8l2lK6knOj4M8m7MK5n0K8NJL3n8qJ6k2L4k3j1N6l9j1M9n1L5rJ2J0j4rLo5
7698f4N5L7j7Rnk1K4K5j1k3Qn3O1o5qJ03oo3k2k3M9J8m0L3n8N7LJ7k0J3o4K4L9
7731A2j6L5J6q0M8m2L0L5j7j3M8j04O6J0m1Q8o2l0Q1j00M4O9j05PP9n6kJ1k3K
7761a0J7J2r4M5L7nRl2j5M6J4k8NL1k5L2l9K8k0k0PJ9Rl0K5Jj4JpM7p5PKL3K3
7796C6p3J4j1j0M2J6nl6QL3k5N0m1j5N6J0o7k3O6j7J4l1K4M4m1J4K2j8r0M1K4
7827A1l1K8l6nK3j0j5P3n5N7n3KqMK8k7n5Q1K2m8nO1m0QJ2Lk1k1L5l9jJ4K1l6
$$ y = [16, 5, -16, -7, 25, -28, -1, 3, 43, 26, 44, 2, 26, 2, -35, -16, -19, 56, 24, 10, -14, -43, 0, 51, -10, -31, 20, 1, -28, -51, -27, 52, -15, -52, -55, -16, -27, -46, -48, -31, 5, 24, -7, -8, 33, 54, 13, -35, 18, 22, -35, 39, 8, -11, 18, -7, -27, -21, -3, -29, -11, 35, -50, -27, -18, 18, -14, -17, 9, 7, 2, 8, -6, 42, -5, -1, 24, -26, 2, 7, 8, 41, -17, -25, -9, -31, 3, -20, -31, 25, -14, -25, 24, -27, 8, -1, 11, 21, 7, -2, 1, -64, -9, 28, 11, 20, 15, -6, 18, 43, 32, 9, 17, -36, 25, -40, -48, 55, 49, -14, -36, -59, -10, 8, -32, 1, -57, 0, 3, 20, 0, 13, -51, -27, 12, -4, 31, 47, -33, 15, -27, 3, 38, 21, 8, 56, -48, 18, 28, -13, 75, 13, -17, 64, -36, 8, 77, -28, -21, 58, 2, 0, 11, -12, -10, 7, 19, -75, -30, 7, 2, 11, -21, -36, 10, 24, -4, 1, 32, 7, 39, 0, 28, 8, -12, -5, 14, 23, -7, 18, 19, 5, 6, -1, 46, -29, -22, -20, 13, 36, -37, -23, -34, -44, -2, 14, 9, -27, -19, 14, -11, 39, -2, -17, 39, 49, -18, -41, 25, 8, 22, -9, 15, 59, 18, 32, 54, 36, -54, -13, 11, -20, 8, -28, -33, -10, -20, -35, 38, -17, 40, -13, -11, -19, -15, 13, -14, -69, 12, 34, -14, -19, 42, 2, 10, 22, 25, 4, -17, 18, -21, -22, -8, 13, -23]
7861b3R0n5K1K0ro6J8QN8n3Jl5l1L4%M9j6l0lk9L8L8jk3k0ol8J7L6m2N6m0j8J0
7895d4K5M0m8J5L6k1m5M2pK6k8j9M3k7J9k8%P0o9L3qqQL7k3jJ5l0J2Mj0j4J9K3
7929C7l9j5J8k9K5l2K4L7j6K9k2k9J1N9n8qL1l8j4P4q8N4l0L6On3K1K6n7P0j3
7960A7Rk2n1QP1K6p4%K3l9k7P5Kk5l2N5Kn1N3j5m5L8J1o5L1K6k1k7N3nk5K4J8
7993A8j4J5J1J3p4P2k6J1j6LJ2n0lm4L5N3mk1j0J8j2J0L0n5J1M1n4L2j9K6kJ2
8025A9NQk5J9ql8k1N0Oj8K4L7o2N4r8N8Mj9P3p2J7k1L4K8m4j3L8K4n4k7oQK1o7
8059f6Q5j8j1L1m1N0ml8%k2L6L5r5L4JL9noLJ8j1k6JK6rl7L8k1j3N0l9oN9j4j6
8094HL1m0lQj1l4R1j5k6jk0L1mj1J9p7J05l2k1J7p4R9k2j9kK0j2K6j3m0M4l3M9
$$ y = [-23, 67, 12, 33, 53, 44, -22, -4, 4, 62, 9, 10, -25, -56, -22, -22, 27, 11, -19, -22, -51, -13, 25, 24, 1, -19, -25, -63, -46, -10, -52, 4, -36, -54, -44, -19, 21, -27, -12, 24, 3, -42, 0, -7, 19, -9, -28, 15, -12, 7, -21, -21, 49, -20, 13, 5, -3, 5, 42, 19, 18, 33, 3, 15, 19, 9, -5, 14, 37, -2, -17, 1, -28, -3, -35, -11, 26, 10, 39, 17, -12, -1, 58, 0, -8, 23, -15, -29, 45, -43, 11, -19, 17, 23, -30, -9, 17, -40, 30, 17, 26, 4, -47, -39, 32, 58, -16, -16, 7, -32, -59, 16, 18, -7, -39, 16, 18, -33, 20, 5, -40, -2, 9, -56, -25, 1, -20, -47, 6, 1, -24, 0, 18, 4, 19, 30, 43, -31, 41, 15, 26, 10, 13, 25, -25, -28, -72, -37, 16, 12, -9, -19, -1, -13, -3, 27, -28, -17, 24, -30, 2, -17, 9, 7, 19, 24, 32, 7, 26, 18, -20, -41, 9, 15, -3, 21, 58, -4, 50, -48, 10, 14, -5, 68, -4, 13, -8, 26, 54, 10, -3, 35, 59, 5, -22, -28, -20, 1, -66, 19, 1, -10, 21, -20, 30, 26, -12, -12, -34, 2, 37, -58, -24, -23, 16, 11, 5, 8, 26, 15, -11, -10, 16, 7, -30, 8, -13, -26, 24, -15, -21, 38, 24, 8, 39, -1, -4, 4, -7, -41, 50, 35, 9, 8, -12, 19, 15, 4, 23, -54, 51, 19, -2, 15, -59, 40, 18, -1, -3, 17, 5, 31, 18, -22, 22, -11, 38]
8127C8o1K5m1K0J2Kk3K1J0k5J0J04r8L1k3Pk4L4rn6J7L0l2J9pLk5O9N9j25M6j
8159GRKk1J9Km0L8o0P3j0Ok0lR8p9J5k4n4K1Qkqk3O7m3l7M2J8K4l3Pl7
$$ y = [38, -23, 2, -39, -19, -7, -5, -28, -7, 3, -22, -12, 92, -6, 25, 2, 9, -15, 19, 10, -46, -29, 1, -31, -12, -19, -16, -41, 28, 87, -38, 8, 7, 16, 18, -3, 16, 18, -22, 16, -44, 29, 19, 25, 5, 2, 100, 21, 36, 12, -42, -21, -13, -15, -23, -46, 21, -22, -59, -17, 1, 25, -8, -1, -38]
8191c8
$$ Imaginary data points
##PAGE= N=2
##DATA TABLE= (X++(I..I)), XYDATA
0@%%%%%%%%%%%%%%%%%%%%%%%%%mQpPj1J4j4J9k4K4k6L3m1M6n2O0o6P4q6R5j03
46e4J17j34J47j60J78j97K15k35K57k79L02l24L44l60L71l71L47k84J35J94r59
67g50K963r887O9967M06085l36546n53409K40900M83982r3835l73400k8894K00645
79G821J32042p869j87549j93894K01954L69627j68899n03844J07252N76181k5681
90C07141n82995n3134N23495J16778m11031j49969K58987J47653r1003j07700
100d1778p4379L7406K15491N2882l20137j47356L77998K31132l89018k89043L56948
111A0146L11344k92291k92850K08304K35284j18632j44820L6616L4252K8631Q2720
122I8704p1403j90355R1859K75544r3385l29050Q2251L45624o6634l26040N3012
$$ y = [0, 0, 0, 0, 0, 0, 0, 0, 0, 0, 0, 0, 0, 0, 0, 0, 0, 0, 0, 0, 0, 0, 0, 0, 0, 0, -4, 4, -3, 4, -7, 7, -7, 12, -12, 12, -14, 19, -22, 24, -28, 32, -34, 40, -46, 49, -54, 63, -71, 76, -84, 94, -103, 112, -123, 134, -145, 157, -167, 177, -183, 188, -183, 164, -120, 15, 209, -750, 2213, -7674, 62293, 468378, 131832, -421577, -180677, 303305, 209470, -163930, -192824, 7821, 139863, 131994, -55555, -249449, -47495, 322132, 153233, -350611, -243359, 332822, 307141, -275854, -328988, 194507, 311285, -99746, -249715, 9272, 156925, 65922, -41778, -116157, -78751, 136740, 189622, -130515, -277871, 100127, 331259, -57759, -346802, 10146, 321490, 29199, -263651, -55347, 179937, 61305, -83515, -46899, -12647, 15984, 98704, 27301, -163054, -71195, 204349, 110964, -218086, -135835, 209789, 143155, -182885, -129873]
133a29873K74976m7361k01850N1517J16477o5235k9839Q4714m8795j05266J13260
144A2725J20638j59254j25490J87009J17168j97994r3671J96204N7237j85195
154g0623j1453J69205l7828j50422Q4065J29538j21473j06486J45071P9309j53286
165d4383m6615J45417O814j24943L9823R5752r1278o3666J43523L3851j90805
176i6510j0171K27149m727k45997J1754K43219j2676k15999J1556J66161j2767
187F0992r7357K0303J6950l6889O5202O3074j40341r6350J98373J31821k33017
198d7239j63743K39900J84678k19226j88303J74599J69919j13115j27873M4323
208d6080O4054K2286J6462p6603j04729J12164J90451j24397k62115J13969L09400
$$ y = [-129873, 145103, 97742, -104108, -52591, 63886, -1349, -31188, 53526, 4731, -100535, 12725, 133363, -25891, -151381, 35628, 152796, -45198, -138869, 57335, 114572, -70623, -82076, 87129, 49301, -101121, -17056, 112482, -8991, -115477, 29594, 108903, -44383, -90998, 54419, 61233, -63710, -23887, 71865, -19413, -83079, 60444, 94295, -96510, -106681, 120468, 115741, -130256, -118502, 124717, 112041, -103958, -92402, 73759, 60992, -36365, -16062, 888, -36001, 29201, 92275, -48066, -144416, 53957, 185778, -47239, -210982, 28918, 213596, -5630, -193933, -19334, 150585, 37470, -90403, -46080, 17974, 40260, 56722, -19881, -124610, -12446, 178005, 53608, -208507, -94538, 214862]
219B14862q4326l24637M2449L03726K254k47857m0734J62375O4489n8004o8337
230c3740n3375N0298J57450j2819k41793l7599K96134R2388l14796j40910K97067
241E8305J73999k46514j83853J72010J66582q3969j22064m777N4806Q2984K7246
252I4755j41381j13613J73778J92500j79039k53163J59008K86509j20379k87536
262a88561P0918K55028k0399j92649k2240J07492N0333j0099n9619q7155N0212
273d6739J73091k4834k37313j0057K73251M7104k77783p7961K52692R5580k02858
284c5827r5640J36108P6477o2446m0195r156q569P0064O2262j15215j13182J41250
296E931J53659j48671j77509J40383J81144j20703j63609R5475J27638o9350p7362
$$ y = [214862, 130536, -194101, -151652, 152074, 154328, -93529, -134263, 28112, 92601, 34597, -33740, -87115, -36817, 120633, 107814, -133979, -171578, 124556, 216944, -97852, -238762, 58305, 232304, -14210, -198063, -26053, 140529, 56560, -65504, -70281, -15475, 67509, 94755, -46626, -160239, 13539, 206039, 27000, -226163, -67155, 219354, 98975, -188561, -117643, 137385, 116986, -75663, -97903, 9589, 59922, 49823, -9796, -96951, -46739, 126352, 101518, -135795, -145852, 127399, 174503, -103280, -181241, 71451, 167031, -35827, -131467, 4641, 81118, 18672, -21523, -30679, -39248, 30816, 93078, -22137, -135319, 5931, 159590, 10919, -166590, -26207, 154937, 34234, -129375, -33900, 93738, 24388, -52974]
307e2974M6746J9597k9733L8818J9376r1297j4098J32015J1776j57865r706J67149
319G9804M882j61133M380J41868j8903j13953L7821Q0913n8793m7040P8818J5303
331D3967r4300J2566J02375l5816j00426N5366Q8212p1602o6493Q6021L8004r8905
343d1031o275J10218k4592j18631N0502J22268o9104j19043P8163J06790p8455
354A0810q4409P1058N1683n8994j0520M5538l6096l3680Q3299K6329j26051k4093
366h5126J59197K6993j77536l2827J78520L8772j60724m1213J26017L6609p7791
377i109k2883K2052j158L4141L3838q4212p2157J21676J10637j42499j43612J44419
389h867J64893j28747j69326R8842J54374o0396j19129J9850O6854J6376k408
$$ y = [-52974, -6228, 13369, -16364, 22454, 41830, -49467, -63565, 68450, 80226, -77639, -87345, 79804, 84686, -76447, -72067, 69801, 50898, -63055, -25234, 55679, -3114, -50154, 28664, 43967, -50333, -37767, 64608, 28792, -71634, -16268, 71944, 342, -66151, 19870, 57874, -41031, -47306, 62912, 38320, -80311, -29809, 92459, 23355, -95688, -17525, 89265, 10810, -73599, -2541, 49142, -9852, -20372, 25166, -10930, -44610, 38689, 65018, -61033, -85126, 74071, 101064, -76472, -109299, 69221, 107993, -52731, -93944, 32073, 68682, -9109, -31992, -9940, -11098, 23043, 56881, -27331, -99488, 22188, 132825, -9674, -153286, -8867, 156026, 27279, -142047, -43205, 111169, 50773, -68356, -48506, 18348, 34724, 32316]
400C2316m2358o6640N5095J32026n3288j85192L8711K19122j5144k29431j2040
411a26823K14177L6713j75631n3215J17878N7069m8579m6566k3887K1728R0673
422F3537J4170j43654n6091J77220R7612j88193j31298J76789J51445j46052j52894
433a37409J01686J34205n0811r6165J362M2645M0286J9571o9078q2975Q2200J39056
445A24573q0286j80658O5625K02168m3283k00959J8301J77320L691j34865j7837
456f6210P8874K2082j6618j5260m4243o94R7107K2911j36212m6641J58508O7190
468A20794j62648q0303J50326Q2491j24809p2881R0762N1285n3409k0356J7202
479a546j6196J3531N3452l6602q6799N1123J11617n7614j24736N8284J24617n5050
$$ y = [32316, -10042, -76682, -21587, 110439, 57151, -128041, -89330, 129792, 114648, -114783, -126823, 87354, 124067, -51564, -104779, 13099, 70168, 21589, -24977, -48864, -27136, 63537, 77707, -65947, -122038, 55182, 152794, -35399, -166697, 10092, 161537, 15485, -137409, -35723, 98482, 47671, -48494, -47132, -4487, 35799, 55370, -13708, -96683, -14483, 124573, 44287, -136371, -70746, 131422, 88139, -112820, -94519, 82801, 86492, -48373, -66210, 12664, 34746, 18128, 2868, -41375, -42069, 55038, 77949, -58263, -104904, 53604, 120794, -41854, -122157, 28169, 110660, -14149, -87030, 3732, 55017, 1608, -18748, -1546, -17742, -4211, 49241, 12639, -74160, -23037, 88580, 30966, -93770, -35486, 89131, 34081]
491C4081j11551N0900Q7877m7501n6403M6062K1584m6513J2790M7848m3094m8496
503e2416O6793M6198q2635l9951R0645K8101r1481j1517Q6647q910p8414L1067
515a5873O7981n2193n6392O9445M4538q0571l1761Q4042J7832p8946j875O6512
527C2739j6356m8141L6734K6772n8299n397P9500j3383r7956K7102J10582l4713
539C9184j15351L6173J09700l2759r3214K6540O6110k0131l0595J6004r895j5794
551b4028N1010K0660q7864k9605J16028M1365j31862n2729J33469O0808j20666
562b3414o2322R5210N4964o0649l7964K1562J1563J6763K1607m9569n8422P3002
574B331R3583q4607j22447Q3727J40426p1696j44043N1617J31652k7420j03378
$$ y = [34081, -77470, -26570, 61307, 13806, -42597, 3465, 25049, -21464, -8674, 39174, -3920, -52416, 14377, 60575, -22060, -62011, 28634, 56735, -34746, -46263, 40384, 31474, -46940, -15873, 52108, -85, -56477, 12968, 57506, -23065, -54826, 29216, 47048, -31898, -33773, 32739, 16383, -31758, 4976, 31748, -26551, -31948, 47552, 34169, -63787, -36685, 73897, 39184, -76167, -39994, 69706, 36947, -56267, -29727, 36383, 16252, -14343, 1661, -8234, -24028, 26982, 47642, -40222, -69827, 46201, 87566, -44296, -97025, 36444, 97252, -23414, -85736, 9474, 64438, 3789, -34175, -12613, -1050, 15713, 37320, -12249, -70671, 2331, 95914, 11307, -111140, -27413, 113013, 41317, -102726, -51109, 80543, 53123, -50255]
585e0255L798O2178J5222j2320k5918m0287K6910Q9486j8365j29086K252J54181
597G7796J7862j61982l7662J51571N2375j24977n8630Q5899N3886m0055l7646
608b1563p061J1721M9170K0887q1599n5494J01511Q7058j07343j10386J00220
619a2879J21881q2447j18985N8128J01399l1472p0912O769L0934J2461J3608k4209
631D276n7543K7455R5405k3452j22815J4009J36582k263j35608q698J20578J5845
643F3771r3830j6940N9239J1336k1236P11j5273j7066M6595L5533o9820n2429
655f9409Q3307O4931q7374p0234Q2816O7076p2205n5529N7867L6464m2629j2408
667a7327K8193j3705j6093L8611O598n9558P20P4217o407q1263J2013Q0368j7962
$$ y = [-50255, -46457, 15721, 30943, 18623, -7295, -47582, -20672, 68814, 50449, -78637, -76385, 77796, 95658, -66324, -103986, 47585, 99960, -25017, -83647, 2252, 56138, 16083, -21563, -28624, -16903, 32267, 53154, -28445, -83939, 17572, 104630, -2713, -113099, -12879, 109002, 26555, -92430, -34302, 67097, 35625, -35287, -28518, 2416, 14877, 28485, 4276, -53267, -25812, 69593, 46141, -76674, -62665, 73917, 71654, -63954, -72652, 47926, 63771, -30059, -46999, 12240, 23576, 2340, 3051, -12222, -29288, 17307, 52840, -16980, -69409, 13898, 78829, -8545, -78779, 4037, 71113, -1092, -56621, 1246, 37710, -4919, -17327, 10866, -2839, -18932, 19679, 26277, -33281, -32561, 41656, 35249, -46014, -34001, 46367, 28405]
680B8405p2208K5127N8618l3062m1579M1575K3113m9417n234N5000j0675n6948
692c7285K3373N4313l3201m6581M0252L3654m5295j6982M8976k049n1769K1036
704a1558N3994l7816n4939N0261N4186n7032n0337N7832M2556n2562l0088M2639
716G136J3221l0073P705J6777l0796m999N3798l879p4196Q710Q9083r819r6281
729e3613P749R4030m034q2214N39O1297J015l3516J084J993p419K9963J7774n8190
743b3542l0913P9763M4970r1729n7351R3205O5140q4087o6402O6402N9050m2624
755A1882m3244J6528J9496Q066R523k8051m0726M0793P0116m5445r3643M2031
767c2674J08116l2308j10995J8903J01761m852q0875o725N0995J3517j5383j4041
$$ y = [28405, -43803, -18676, 39942, 6880, -34699, 6876, 29989, -19428, -24662, 30338, 19663, -37285, -13912, 40401, 7200, -39381, 871, 34525, -10770, -27752, 21224, 19175, -32594, -11558, 42436, 4620, -50319, -58, 54128, -2904, -53241, 4591, 47147, -5415, -35503, 7136, 20357, -9716, -2011, 14766, -16030, -21029, 32769, 28890, -45306, -36596, 52487, 42668, -53613, -45864, 48166, 44132, -38082, -37543, 23754, 24769, -8747, -7663, -5670, -13089, 16874, 34648, -23542, -54455, 25308, 70278, -21451, -78802, 14403, 79543, -4544, -70946, -4544, 54506, 11882, -31362, -14834, 4662, 12728, 22251, -5800, -46526, -5733, 64383, 18938, -74705, -32674, 75442, 43134, -67861, -48958, 52803, 47951, -32924, -39649, 11346, 24863, 9480, -4561]
779d561k1494Q137N5418L163q2427j7835R9444L2993j05100m5638R9022N2906
791G4028q2917n2863N9083M4447l1061k8212K736N724K2350K0558m1521m6758
803e4406N2936O9644n6132q5659N2101R2587m2492q9070K9959P5435j7251n3292
815b5640O642K5247N8N004k388l4068L45N8449M792p5858j1193Q4558J6871q4296
829c1477k0005P5856J9428o1122j4098M2332M630k1782P933K203k1838J4736L5462
842C2258k7811m6468L6533N3127m1136n4320M2077M9564m0637l9535L7706K5133
854B6491l4319q456L0981q751k7788K4394K4608l6947k0740M5378J5650m8983
866a8482q793M8410J8m4151J0382L7637k1600k9838L2584K1846m1944j4353M8210
$$ y = [-4561, -26055, -17918, 37500, 40663, -41764, -59599, 39845, 72838, -32262, -77900, 21122, 74028, -8889, -61752, -2669, 41778, 10717, -17495, -14759, -9035, 13315, 33873, -7648, -54406, -1470, 68174, 12042, -73617, -21516, 71071, 28579, -60491, -30532, 44903, 27652, -25640, -18998, 6249, 6307, 11311, 8923, -25145, -24800, 33649, 38441, -37417, -48610, 35948, 52819, -31477, -51482, 24374, 43802, -17320, -31418, 10914, 15544, -6238, 1695, 3898, -17940, -3204, 32258, 4447, -42021, -5488, 47639, 6503, -47817, -5740, 43824, 3187, -36348, 1358, 26491, -7828, -16284, 14697, 5946, -21842, 2552, 27160, -9787, -30527, 14851, 30501, -18482, -27275, 21135, 21153, -22998, -12616, 25021, 3421, -26417, 6167, 28013, -13931, -28284, 19926]
879A9926P600n0574j516M7993m366m0755J0278K9693j7136j5808K4704Q22l2863
892b2002J3561M0912k5548m7571L3804N1936l7701n2309L7074M8191l2629l8647
904c0929K5460K4116j7163n611R250j5131l360L6044P0n4711J32O8543K190p5822
918c6922o031P5193R851o6662j2110N1085J1594l0484p025P217j233J5863J2892
931B3228l5903k6350N0768L9768n8713n1043N9408N7879n3376n8642M1811N2421
943D1256k7006l9368J1111K0359L274K461j4190k6834K0488M9566k1704o7793
955d8380J8268P9298j1498q2106L154P6270M560o1890r763M1036J1159j6303q006
968d201r279N83L2673R902n1173k1922O2874L3082o7024m1376O3524M4862n3720
$$ y = [19926, 27526, -23048, -24564, 23429, 19063, -21692, -11414, 18279, 1143, -14665, 10039, 10861, -22002, -8441, 32471, 6923, -40648, -6844, 45092, 7391, -44918, -7844, 40347, 7718, -30929, -5469, 18647, 1484, -4127, 5123, -10008, -13368, 22676, 22746, -31965, -31833, 36710, 38900, -36922, -42953, 32240, 42091, -24571, -36681, 14404, 25998, -4486, -11511, -4294, -5527, 10336, 23228, -12675, -39025, 11743, 51511, -7202, -58245, 1163, 59042, 5666, -52976, -11165, 41256, 14250, -25118, -14007, 6352, 9626, 12087, -2103, -28937, -8449, 41117, 19413, -48380, -30112, 49186, 37688, -44418, -41264, 35006, 39566, -22324, -32087, 8949, 20108, 3805, -4201, -13480, -12897, 19776, 29678, -21495, -43417, 19457, 52539, -14485, -55861, 7663, 52525, -1195]
981a195m2632L9552L4310k3310k0604P355L067O535J6058j6516l4529K2418N0001
994D0510k3952o0487K2130O4656j8058o1816J3016N2648q746l8108N995K0118
1006G906n611r13P366j7468j1020L3038J5364m4387j9269N0569K1389n1428k0914
1019c5378M7802J7292m0411j0495L0963J111k0448R657J0519k0528j727L0034
1031A8391n434l6727J0671L9945j4801l9166J7933L4554k0709k6873K3260J6922
1043A7966k5641o381K7875l794k9470J2697K9644j9376k7846K3715K3739k5574
1055b446j7104K5754Q229k4619K407K2764j3534k0850K4082J9188l2991j7743
1067b6863L8844J5975m0935j3683L8841J0097l2989m915K4059k186j3181J0926
$$ y = [-1195, -43827, -4275, 30035, 6725, -13879, -6524, -3457, 3078, 19136, 2620, -31909, -9491, 40510, 16558, -43929, -21799, 42857, 24799, -37017, -24001, 28647, 19901, -18207, -12212, 7906, 2295, 1382, 8748, -8720, -19740, 13298, 28662, -15725, -34994, 15575, 36964, -14464, -35378, 12424, 29716, -10695, -21190, 9773, 10884, -9564, 93, 10612, -9916, -11643, 18391, 12957, -23770, -13099, 26846, 12045, -27121, -9188, 25366, 4657, -22216, 1044, 17966, -7675, -14056, 13819, 10025, -19445, -6748, 22896, 3520, -24326, -611, 23128, -2446, -19550, 6204, 14433, -10186, -7779, 14985, 1451, -19399, 4683, 23871, -9120, -26863, 11981, 27956, -12979, -26662, 12179, 22276, -10713, -15628, 8431, 6245, -6936, 3990]
1079C990J894k0618Q417L0407j6367l8959K1446M4949k3100m7088K1720M4744
1091C1435j7995l7614J3125K6004q250j0976M328n869k536K2779K909l7838n481
1104b5979M8994R494n5126j3858N5339J7419m9756j8812L9060J7270k4699j1981
1116a2635Q479L411P544P867k1311k0311L1239L2606l6637m2473L6984M8412l2950
1129A0225m9252K5513M4249j6432l3728P142J8655O74r57n798j7507P850L4301
1142B4935o664m7593L143N5661J904n7631o778N3495J0317m3760j1535L0059R670
1155A5223j3969m716k293k989J7056J2181k8650k1749L6009K9863l8710l5442
1167c8186L7051L7106l1865l4426K4353K7352j5908j6515P834L369j278J0783
$$ y = [3990, 5884, -14734, -6317, 24090, 7723, -31236, -9790, 35159, 12059, -35029, -13309, 31435, 13440, -24174, -11049, 14955, 6705, -4271, 57, -5812, -8348, 14431, 17340, -20498, -25979, 23015, 32509, -22617, -36475, 18864, 36283, -13473, -32285, 6775, 24045, -654, -12635, -4156, -745, 6799, 14666, -6645, -26956, 4283, 36889, 252, -42221, -5237, 43175, 10225, -39027, -13514, 30735, 14303, -19425, -12283, 6372, 7046, 6089, 291, -17216, -9366, 24935, 18271, -29322, -26179, 29482, 31386, -26245, -33023, 20472, 30789, -12971, -24506, 5553, 15223, 1254, -3462, -5755, -8744, 8312, 20493, -8157, -29906, 6103, 35966, -2744, -38186, -1135, 35971, 4106, -30320, -5967, 21385, 5477, -11038, -3204, 165, -1113, 9670]
1179I670l153k3979N384L4857n712m1849M776M4370l458m2295K646L6033k884
1192A4406k6735M621J5318p704l566J1550p245j5961J6350J9635k2932k1875K6684
1205B546K2129k7841j9825K6814J5308k4368q468K0953N53j7272P820J3834j5644
1218c461j0539K1874P480k6064m350K7453J056k6368K860K2849p448j7799J2461
1231DJ1781j7774n620K2634P6k6438M574K8286p693k7872R862K4780j1053j8909
1245a3362J1730J1041j2477j614J3471q089j5007J7066J6669k4253j8272K8694
1257E597J9230l0133j8898K8314J6672k3691j2355J7001N900r352K378J757j1698
1270i278M769K1237r370k9624J1723L5896j1732l8893R879L8036o878l3057L608
$$ y = [9670, 6517, -17462, -12078, 22779, 17067, -24782, -20006, 24364, 20906, -21389, -18743, 17290, 14406, -12329, -7708, 7610, -94, -3660, 7890, 645, -15316, 1034, 20669, -2263, -24138, 2546, 24675, -3166, -22991, 3823, 19131, -5237, -13705, 7248, 7801, -9471, -1651, 12183, -3461, -14000, 7874, 15354, -10710, -15060, 12393, 13449, -12919, -10059, 12790, 5342, -12457, 4, 11785, -5989, -11609, 11025, 11101, -15337, -10763, 17523, 9830, -18042, -8180, 16600, 5547, -13362, -1632, 9409, -3068, -4682, 8789, 700, -14307, 2759, 19428, -4825, -23097, 5597, 24827, -5306, -24204, 4110, 20782, -2909, -15264, 1737, 7637, -1715, 663, 2420, -9278, -4509, 16728, 7358, -22266, -10543, 25353, 13621, -25272, -15393, 22643, 15765, -17292, -13684]
1283a3684K4436j222j2900P6j50r08J3098L593k4717p625L3376J2223l8112j6566
1297b9082L8648J9416l4793j9971K7576J7664j7934j2293P334M266L031N498j1615
1310b255j5929J7612K5803k0665l3449K0441L7876j7714l8441J3167L4695p960
1322A3181k6975L052J6095M87l372k177r711J807K1659M72l0980m005L6757Q000
1336B4290l8418j1141L5958J2769k9848j2179K1190R059j1237l690J324l447P485
1349B115J1199j4199j8731J8353K4716k0023k8110J9227K8511j6845k5675J3585
1361e877J9823r987j1841P106K428n006P255L838j5839l528K2634L844k6906m109
1375a6165K8308L883k6990k890K3250P54j7899K524J1426o492n058J0769q12j4730
$$ y = [-13684, 10752, 9530, -3370, -3294, -3444, -4352, 8746, 12339, -12378, -20003, 13373, 25596, -12516, -29082, 9566, 28982, -5811, -25782, 1794, 19458, 1524, -10769, -3435, 831, 3862, 9360, -2255, -18184, -572, 25231, 4566, -28883, -8442, 29434, 11720, -26721, -13554, 21141, 13181, -13794, -10742, 5353, 5840, 2468, 291, -9420, -7613, 14046, 14518, -16462, -20467, 16290, 24290, -14128, -25269, 10689, 23458, -6390, -18569, 2621, 11680, 443, -3247, -1923, -5370, 2115, 13314, -885, -19616, -1263, 23453, 3430, -24680, -5453, 23058, 6213, -19462, -5877, 13946, 3959, -7882, -776, 1652, -3354, 3901, 7739, -8100, -11628, 11006, 14850, -12056, -16165, 12143, 16026, -10964, -13854, 9396, 10150, -7749, -5225, 6201, -291, -5349, 5420, 4608, -10122]
1389a0122N616J7768r060j9304J1359J8866j2461j6482J2986J2261j3094o651
1401h318J3187M41j3253N756J3186j1029j3003J5022J2195j7278j0642J7616P926
1414A1806j6453l911J3758r89j0575O543P329j2437m119J7654J766k1804k5K4103
1428A2646r30k4041J498K1664k001j6972K773J0615m134l270O360m414r205J1238
1442A827J2434j6562j5586J9669J7954k0530j8854J8959J7825j5466j4652J0817
1454b165R271n655k274J009n849K724J4149m920k1423N563K6805m615k9628K819
1468a4189K9334n61k5950j335J9654K147j1158j879J628Q8P661L130j5938p259
1482a4627K2133J1532k5500j5332K5900J7750k3386j8147J8697J6167j2363j1714
$$ y = [-10122, -4506, 13262, 4202, -15102, -3743, 15123, 2662, -13820, -834, 11427, -1667, -8318, 4869, 5310, -7943, -2187, 10999, -30, -13033, 1989, 14184, -3094, -13736, 3880, 11806, -4647, -8558, 5200, 4211, -6364, 179, 7508, -4929, -9048, 8606, 10372, -11432, -11457, 12646, 11716, -12325, -10827, 10837, 8836, -8136, -5363, 5252, 1118, -2152, 4208, -206, -9411, 1827, 14261, -2301, -17887, 1782, 19736, -794, -19648, -689, 17136, 1670, -12982, -2165, 7106, 1451, -823, 186, -5663, -2939, 11210, 6290, -15133, -9570, 17235, 12620, -17008, -14189, 15145, 14584, -11366, -12701, 6953, 9100, -2058, -3937, -2309, -2221, 5440, 8570, -7368, -14627, 7506, 19038, -6462, -21794, 4106, 21856, -1530, -19677, -980, 15187, 2824, -8890]
1494h890N517N293R05K432n897j0695R142J8282j0388k4199R648K7577p565k8037
1508a6875M820K5281k045j9827q4J2297Q68l515l65n184j490J3127M153j9184
1522h023p249K3040R920k4047j1704K2588J2042j9077j0434J3963P156q157k596
1535b578K681l285K331R081n906j4463Q059J8498q972k0562Q657K0504p666j8258
1549a1879O519J4088n610q378N137K211n318L998N928r332o817J3362P592j5739
1563d238p798J6468P001j5585n254J3446K526j0844J181P736n225m833R164K313
1577F058j2501l18J4727j264j5457K570J4669l692j2264M826Q824o298m422P961
1591C419j76r627M238J1348p635j2493R800J2854j0751j2159J0401J0193r231
$$ y = [-8890, -3373, 1920, 2825, 5257, -640, -11335, -2193, 16089, 5701, -18498, -8850, 18727, 11162, -16875, -12055, 13226, 11181, -8646, -8730, 3567, 4435, 920, 555, -4629, -6119, 7008, 11161, -8023, -15272, 7768, 17688, -6359, -18063, 4525, 16567, -2510, -12944, 1019, 8175, 18, -2578, 103, -3182, -851, 8230, 2324, -12139, -4080, 14418, 5446, -15116, -6459, 14045, 6379, -11879, -5360, 8728, 3118, -5260, -123, 2088, -3230, 768, 6696, -2636, -9453, 3909, 11501, -4238, -12036, 4432, 11433, -4152, -9406, 4040, 6566, -4278, -3097, 4639, -586, -5419, 3745, 6058, -6443, -6761, 7966, 6702, -8755, -6185, 8484, 4792, -7472, -2646, 6178, -120, -4542, 3419, 3243, -6384, -2146, 9202, 1567, -10926, -1126, 11728, 977, -11182, -781, 9412, 181]
1604A81o951P468K603n599K518L891p658k871J2472K411j6132k503J8307K948
1618A1085j8483l371J6867L148j3270k354Q479N91k981K067k498n462P256R214
1632A0288j0933j2743J2968J5363j3277j6689J2014J6154r392j3860O210R686
1644E789k809m112k4k305J899Q982k644j4864K308J9257j057k1491q56K1489K671
1659A2233j9092l959J4641M115q745l189K214R02M187K305r557o249J3595R987
1673A3388j5542j3158J5692J4942j3921j5118J0951J3346p075r870L265M864J79
1686A943J070k751p107M116J2521m285j6793L498J9213k170j9528N49J7646P17
1700H639j3910j305Q879R70l114L01k534k429P601M918j1279p419J3481R423j4049
$$ y = [181, -6770, 698, 3301, -2298, 220, 4111, -3547, -6418, 6054, 8465, -7667, -10170, 8137, 11085, -7398, -10769, 6098, 9246, -4024, -6378, 2101, 2692, -289, 1778, -720, -6182, 1074, 10288, -645, -13388, -420, 14943, 1666, -15023, -3009, 13145, 3753, -10107, -3897, 5789, 2980, -1132, -1156, -3461, -1562, 7420, 4776, -10088, -7780, 11477, 10420, -11071, -11927, 9562, 12233, -6859, -10818, 3823, 7938, -807, -3996, -1782, -880, 3307, 5612, -3945, -10194, 3401, 13388, -2154, -15312, 380, 15322, 1401, -13717, -2766, 10580, 3505, -6365, -3100, 1764, 1943, 3013, 262, -6845, -2729, 9792, 5507, -11286, -7788, 11425, 9255, -10273, -9724, 7922, 8639, -5271, -6576, 2303, 3273, 159, 460, -2074, -4503, 3098, 8016, -3263, -10682, 2799, 12222, -1827]
1715a827j0350J3032J0060j0890q409Q095N517n155j679K478k662l54O849j099
1729C606j0392J714J2932j914j4147J943J3604j712j1864J944Q946k494n320L473
1743C19J594m787K094O173n143p412P278Q189q450q202Q650P326q209n392P246
1758A274K586o031O07M835m061l845P193L145r624k678J1105K258j1264j825J0398
1773D073R51q342L18N660k053k645M289m09o531K878Q755m651j0485N501J1394
1788H703n668j1239N034R845m050p271K939L763k043M03J561m621j640Q517K253
1803F486j1586l052J3240M104j3480m780J2280M850r682m224O226K600k400Jj560
1818i77l050M757O324o979r469Q014J1895p884j3211O772J2994m919j1232K756
$$ y = [-1827, -12177, 855, 10915, 25, -8384, -289, 5228, 73, -1606, 872, -1790, -2144, 4705, 3606, -6786, -5072, 7860, 5946, -8201, -6258, 7346, 5634, -6230, -4286, 4660, 2166, -3154, 319, 1913, -2874, -780, 5393, 250, -7162, 116, 8305, -145, -8347, 303, 7629, -580, -5972, 1274, 3860, -2171, -1564, 3271, -790, -4635, 2558, 5703, -3921, -6599, 4506, 6764, -4500, -6325, 4073, 5024, -3318, -3000, 2660, 607, -2038, 2251, 1842, -4689, -1811, 6944, 2293, -8192, -2691, 8703, 3035, -8204, -3170, 6675, 2625, -4646, -1707, 2056, 13, 416, 1977, -2644, -4284, 4233, 6486, -5100, -8152, 5088, 9192, -4288, -9068, 3212, 8062, -1620, -5844, 382, 2982, 582, 583, -977, -4027, 730, 7054, 75, -9394, -1380, 10515, 2631, -10580, -3808, 9186, 4267, -6965, -4209]
1832d209Q157p74m001o20p86J411N502j163r663J87J2850J160j4483k782J4533
1847E319M163j3073m876J0135M640o221l570K050J391K108J453n560m670P946
1861A235P733r131j0169R128J1498p957j1448O058J0071l858p285J651L657K1
1875A204O51j146m842J336Q509q38j1326M2J2608J047j2639j864J1219K316q828
1890b551j990N579J090k161N61j176k624M082M648n932o591O985P978p090q467
1905g659O526P896n528o316M234L936k929j130J996k037j433M993J058p242j119
1920d754Q700J277r262j188Q662J039p324k68N352q73l039K461P13m139J285N653
1936D295k712o861L600P489l894p394L707O423l356m674L005K323k827L87K637
$$ y = [-4209, 3948, 3174, -827, -1447, -2233, -822, 4680, 3517, -6146, -5959, 6891, 8051, -6432, -9214, 5319, 9482, -3591, -8467, 1668, 6308, 87, -3483, -1433, -42, 2066, 3519, -2041, -6711, 1235, 8968, -163, -10332, -1204, 10294, 2337, -9111, -3053, 7018, 3160, -4125, -2474, 1183, 1204, 1855, 709, -4133, -2797, 5712, 4874, -6452, -6410, 6198, 7245, -5394, -7258, 3961, 6277, -2551, -4541, 1038, 2128, -33, 528, -648, -3272, 810, 5458, -474, -7065, -80, 7898, 808, -7659, -1133, 6763, 1235, -5081, -847, 3089, 160, -970, 1026, -1011, -2444, 2549, 3607, -3635, -4754, 3946, 5223, -4039, -5227, 3435, 4474, -2850, -3118, 2234, 1361, -1678, 783, 1496, -2643, -1358, 4295, 1583, -5278, -1678, 5811, 1917, -5477, -1770, 4653, 1297, -3377, -372, 1951, -876, -489, 2148]
1951B148l030k810N305L238o966l635P858L920p832l766O897L245n349k068L445
1966F00K71j302J868o12m235K020O486k913q170L046R205k784r197J974Q228j194
1982C291o325O63L402k20j78L43l082r76N986K012q069l189R241M369r329n131
1998g192Q340N197o408m662M094L158j348j090j136j495L079M232m328o823M704
2013a678Q797m379r894L424R889k105q689P37O493L71l493r34O1R46L442l19o405
2030c736q28Q482K199r559l451R510M335q381m654O403M110l872k922J233J005
2045a26J220J390l239l821M490N980m800p675M617Q472l782q355K743P203j516
2060B801n237N21K681J4K46j85l105j79N466Q78p250j591P928K408p884k819O928
$$ y = [2148, -882, -3692, 1613, 4851, -2115, -5750, 2108, 6028, -1804, -5570, 1327, 4572, -777, -2845, 600, 871, -431, 1437, 825, -3410, -1390, 5096, 2183, -5987, -2941, 6264, 3480, -5717, -3743, 4485, 3291, -3034, -2371, 1031, 811, 633, 976, -2106, -3082, 2904, 4916, -3153, -6342, 2899, 7268, -2061, -7192, 1148, 6345, -63, -4725, -631, 2527, 1179, 89, -1047, -2542, 537, 4769, 441, -6382, -1678, 7119, 2740, -7154, -3730, 6159, 4054, -4635, -3898, 2595, 2966, -527, -1461, -1400, -454, 2988, 2669, -3736, -4564, 3918, 6117, -3442, -6893, 2617, 6952, -1429, -6083, 320, 4430, 558, -2364, -1131, -126, 1094, 2484, -755, -4576, -86, 5894, 1094, -6581, -1964, 6508, 2726, -5629, -2886, 4317, 2801, -2436, -1915, 766, 780, 1026, 841, -2264, -2443, 3023, 3901, -3349, -4940, 2988, 5396, -2488, -5307, 1621]
2077A621K693n190k213L345R94j278O34n35k458K000M217k956n507L236O430l256
2093A777o387K791N675k264m319J774K485j484l42J483j905j705L755K035n113
2108a744k393N760K672n775k599N151K235m136j284K765R1j388J492J55l100O99
2124a399M607j326n612J411O193j282o068R92N238p98l765O96J857q86K40J382
2140A480k280k080L995K833n005l604N410M143n196m150M394L683l119k648J661
2155d83J111l32Q81q90k903J563M772j817o247J657P028j063p170L70O444K41
2171C162m896o68K838P57n26l29j854m74L969J599n511k715O258L777o150m594
2187e357N432M723m089m206K404K995o38j266r76q04K038K986k602m906K537O434
$$ y = [1621, 4314, -876, -3089, 256, 1250, -28, 606, 71, -2387, -387, 3830, 874, -4633, -1397, 5033, 1777, -4610, -1819, 3856, 1592, -2727, -953, 1532, 48, -294, 1189, -716, -2421, 1334, 3369, -1744, -4137, 1623, 4295, -1480, -4079, 1072, 3307, -829, -2113, 652, 743, -645, 847, 1002, -2098, -1399, 3208, 1882, -3730, -2319, 3874, 2592, -3476, -2484, 2754, 1956, -1809, -1113, 744, -142, 98, 1480, -800, -2880, 1115, 3948, -1057, -4661, 749, 4892, -304, -4454, -60, 3623, 504, -2144, -483, 628, 296, 1177, 287, -2616, -1053, 3719, 1902, -4345, -2688, 4340, 3277, -3893, -3523, 2921, 3162, -1734, -2402, 436, 1193, 667, 338, -1516, -1990, 1979, 3578, -1933, -4648, 1610, 5387, -763, -5357, 75, 4798, 709, -3497, -1093, 1902, 1264, -2, -978, -1782, 256, 3242, 640, -4266, -1729, 4705]
2203D705k137p145J354P088m98o115l69M519Q62k398r19J7O27K261J54m199j159
2220c352N557K173o121l145O019L689n182l769L783L405k387k264O47Q86P04J051
2236A694j889k795K268M445k274n566K028N979j291n800O92M883j69l384j55J517
2252A83J70L61K23k242q08L673J524m540k309M927K662m607k842L885K566k866
2268d0j705J640O87o08P78l91k164J000L438j252m349J264M782j004m722P33L972
2285B059m44k883L70J511o26L5R62j470j511K588K160l404k703L677L008l418
2301h9k994K850K564k070j601J204L85l35R48j27k412M08L574l82m558L27M802
2318B494J02m637m11L818N80k613n12J210K0L87N95j776j457K958K278l574l077
$$ y = [4705, 2568, -4577, -3223, 3865, 3367, -2748, -3117, 1402, 2264, -134, -1053, -1036, -409, 1852, 2006, -2193, -3352, 2205, 4378, -1743, -4888, 1131, 4820, -362, -4131, -348, 3057, 670, -1594, -947, -61, 643, 1694, -195, -2990, -722, 3723, 1449, -4117, -2089, 3890, 2599, -3201, -2509, 2374, 2205, -1179, -1334, 183, 353, 714, 937, -1305, -2113, 1560, 3084, -1456, -3765, 1162, 3824, -783, -3625, 260, 2826, -40, -1745, -105, 582, -26, 752, 361, -1803, -803, 2635, 1383, -2966, -1702, 3080, 2076, -2646, -1913, 2059, 1615, -1268, -898, 613, -13, 22, 984, -486, -1997, 591, 2751, -653, -3356, 321, 3329, -89, -3083, -233, 2331, 261, -1340, -136, 249, -86, 862, 735, -1677, -1269, 2305, 1923, -2635, -2308, 2494, 2596, -2041, -2452, 1366, 1946, -667, -1179, 31, 51, 438, 1033, -743, -2200, 758, 3036, -538, -3615]
2335c615L699L674l341l838K621L522j675k610O27J306K26K21p65j865J009L350
2351B546q78m565M85N156J21n164p50M610J142l435j351K015J058k74n27j359
2367a170k35K701J347l680k332M036L228l871l802L259L876k334l474J272K489
2382A310k40j098p26m42J310K044j497l503J291M569q51n034K16M915N70m282
$$ y = [-3615, 84, 3758, 417, -3421, -800, 2722, 1047, -1563, -936, 370, 596, 817, 52, -1813, -804, 2546, 1668, -2897, -2412, 2744, 2865, -2299, -3049, 1561, 2703, -732, -2083, -68, 990, 716, 189, -1170, -1405, 1296, 2643, -1037, -3369, 667, 3895, 24, -3778, -519, 3357, 1023, -2451, -1179, 1310, 1070, -28, -754, -1196, 114, 2158, 661, -2842, -1551, 3018, 2167, -2867, -2651, 2264, 2834, -1448]
$$ [...]
8191E3
##END NTUPLES=NMR FID
##END=
