##TITLE=1H_LY-DMAA_2_30
 CDCl3
 8 sc, 
 8.04.2022
##JCAMPDX= 6.0         $$ Bruker NMR JCAMP-DX V2.0
##DATA TYPE= NMR FID
##DATA CLASS= NTUPLES
##ORIGIN= UXNMR, Bruker Analytische Messtechnik GmbH
##OWNER= root
$$ XWIN-NMR		Version 3.5
$$ Fri Apr  8 10:59:07 2022 Russian Standard Time (UT+4h)  she@DPX200
##.OBSERVE FREQUENCY= 200.13135
##.OBSERVE NUCLEUS= ^1H
##.DELAY= (6, 6)
##.ACQUISITION MODE= SIMULTANEOUS
##.ACQUISITION SCHEME= undefined
##.AVERAGES= 8
##.DIGITISER RES= 18
##SPECTROMETER/DATA SYSTEM= spect
##.PULSE SEQUENCE= zg30
##.SOLVENT NAME= CDCl3
##.SHIFT REFERENCE= (INTERNAL, CDCl3, 0, 15.7039)
##AUDIT TRAIL= $$ (NUMBER, WHEN, WHO, WHERE, WHAT)
$$ ##TITLE= Audit trail, XWIN-NMR		Version 3.5
$$ ##JCAMPDX= 5.01
$$ ##ORIGIN= Bruker BioSpin GmbH
$$ ##OWNER= she
$$ F:/spectra/data/she/nmr/H-F/1/audita.txt
$$ ##AUDIT TRAIL=  $$ (NUMBER, WHEN, WHO, WHERE, WHAT)
(   1,<2022-04-08 10:57:36.37 +0400>,<she>,<DPX200>,
      <created by zg, POWCHK disabled, PULCHK disabled
       configuration hash MD5:
       00 E9 B6 7A A2 85 ED C7 34 08 36 98 17 FE 4E 26
       data hash MD5: 16K
       A9 B4 95 97 A3 95 9B 97 32 E3 C4 37 86 FD 58 37>)
$$ ##END=
$$ 
$$ hash MD5
$$ 3D 20 9F AD C5 65 AC B8 43 93 F6 60 94 6B C1 46
##$RELAX= 
##$RELAX= 
##$RELAX= 
##$RELAX= 
##$RELAX= 
##$RELAX= 
$$ Bruker specific parameters
$$ --------------------------
##$DU= <F:/spectra>
##$EXPNO= 1
##$NAME= <H-F>
##$PROCNO= 1
##$TYPE= <nmr>
##$USER= <she>
##$AMP= (0..31)
100 100 100 100 100 100 100 100 100 100 100 100 100 100 100 100 100 100 
100 100 100 100 100 100 100 100 100 100 100 100 100 100 
##$AQSEQ= 0
##$AQ_mod= 1
##$AUNM= <au_zg>
##$AUTOPOS= <>
##$BF1= 200.13
##$BF2= 200.13
##$BF3= 200.13
##$BF4= 200.13
##$BF5= 200.13
##$BF6= 200.13
##$BF7= 200.13
##$BF8= 200.13
##$BYTORDA= 1
##$CFDGTYP= 0
##$CFRGTYP= 5
##$CHEMSTR= <none>
##$CNST= (0..31)
1 1 145 1 1 1 1 1 1 1 1 1 1 1 1 1 1 1 1 1 1 1 1 1 1 1 1 1 1 1 1 1 
##$CPDPRG= <>
##$CPDPRG1= <>
##$CPDPRG2= <>
##$CPDPRG3= <>
##$CPDPRG4= <mlev>
##$CPDPRG5= <mlev>
##$CPDPRG6= <mlev>
##$CPDPRG7= <mlev>
##$CPDPRG8= <mlev>
##$CPDPRGB= <>
##$CPDPRGT= <>
##$D= (0..31)
0 1.2 0 0 0 0 0 0 0 0.06 0 0.03 0 0 0 0 0.0002 0 0 0 0 0 0 0 0 0 0 0 0 
0 0 0 
##$DATE= 1649401055
##$DBL= (0..7)
120 120 120 120 120 120 120 120 
##$DBP= (0..7)
150 150 150 150 150 150 150 150 
##$DBP07= 0
##$DBPNAM0= <>
##$DBPNAM1= <>
##$DBPNAM2= <>
##$DBPNAM3= <>
##$DBPNAM4= <>
##$DBPNAM5= <>
##$DBPNAM6= <>
##$DBPNAM7= <>
##$DBPOAL= (0..7)
0.5 0.5 0.5 0.5 0.5 0.5 0.5 0.5 
##$DBPOFFS= (0..7)
0 0 0 0 0 0 0 0 
##$DE= 6
##$DECBNUC= <off>
##$DECIM= 32
##$DECNUC= <off>
##$DECSTAT= 4
##$DIGMOD= 1
##$DIGTYP= 9
##$DL= (0..7)
0 120 120 120 120 120 120 120 
##$DP= (0..7)
150 150 150 150 150 150 150 150 
##$DP07= 0
##$DPNAME0= <>
##$DPNAME1= <>
##$DPNAME2= <>
##$DPNAME3= <>
##$DPNAME4= <>
##$DPNAME5= <>
##$DPNAME6= <>
##$DPNAME7= <>
##$DPOAL= (0..7)
0.5 0.5 0.5 0.5 0.5 0.5 0.5 0.5 
##$DPOFFS= (0..7)
0 0 0 0 0 0 0 0 
##$DQDMODE= 0
##$DR= 18
##$DS= 0
##$DSLIST= <SSSSSSSSSSSSSSS>
$$ [...]
##$SUBNAM2= <"">
##$SUBNAM3= <"">
##$SUBNAM4= <"">
##$SUBNAM5= <"">
##$SUBNAM6= <"">
##$SUBNAM7= <"">
##$SUBNAM8= <"">
##$SUBNAM9= <"">
##$SW= 18.05172834244
##$SWIBOX= (0..15)
0 0 2 0 0 0 0 0 0 0 0 0 0 0 0 0 
##$SW_h= 3612.71676300578
##$TD= 16384
##$TD0= 1
##$TE= 0
##$TE2= 300
##$TE3= 300
##$TEG= 300
##$TL= (0..7)
0 120 120 120 120 120 120 120 
##$TP= (0..7)
150 150 150 150 150 150 150 150 
##$TP07= 0
##$TPNAME0= <>
##$TPNAME1= <>
##$TPNAME2= <>
##$TPNAME3= <>
##$TPNAME4= <>
##$TPNAME5= <>
##$TPNAME6= <>
##$TPNAME7= <>
##$TPOAL= (0..7)
0.5 0.5 0.5 0.5 0.5 0.5 0.5 0.5 
##$TPOFFS= (0..7)
0 0 0 0 0 0 0 0 
##$TUNHIN= 0
##$TUNHOUT= 0
##$TUNXOUT= 0
##$USERA1= <user>
##$USERA2= <user>
##$USERA3= <user>
##$USERA4= <user>
##$USERA5= <user>
##$V9= 5
##$VALIST= <valist>
##$VCLIST= <CCCCCCCCCCCCCCC>
##$VD= 0
##$VDLIST= <DDDDDDDDDDDDDDD>
##$VPLIST= <PPPPPPPPPPPPPPP>
##$VTLIST= <TTTTTTTTTTTTTTT>
##$WBST= 1024
##$WBSW= 4
##$XGAIN= (0..3)
0 0 0 0 
##$XL= 0
##$YL= 0
##$YMAX_a= 579571
##$YMIN_a= -510154
##$ZGOPTNS= <>
##$ZL1= 120
##$ZL2= 120
##$ZL3= 120
##$ZL4= 120
##$ABSF1= 10
##$ABSF2= 0
##$ABSG= 5
##$ABSL= 3
##$ALPHA= 0
##$AQORDER= 0
##$ASSFAC= 0
##$ASSFACI= 0
##$ASSFACX= 0
##$ASSWID= 0
##$AUNMP= <proc_1d>
##$AZFE= 0.1
##$AZFW= 0.1
##$BCFW= 1
##$BC_mod= 2
##$BYTORDP= 1
##$COROFFS= 0
##$CY= 11.3945322036743
##$DATMOD= 1
##$DC= 2
##$DFILT= <>
##$DTYPP= 0
##$F1P= 2.36226072786647
##$F2P= -0.459571619588291
##$FCOR= 0.5
##$FTSIZE= 0
##$FT_mod= 4
##$GAMMA= 1
##$GB= 0.15
##$INTBC= 1
##$INTSCL= 1
##$ISEN= 128
##$LB= 0.24
##$LEV0= 0
##$LPBIN= 0
##$MAXI= 10000
##$MC2= 0
##$MEAN= 0
##$ME_mod= 0
##$MI= 1.114404
##$NCOEF= 0
##$NC_proc= 0
##$NLEV= 6
##$NOISF1= 3.799351
##$NOISF2= 2.8
##$NSP= 1
##$NTH_PI= 0
##$NZP= 0
##$OFFSET= 15.70392
##$PC= 1
##$PHC0= -18566.08
##$PHC1= 33.40078
##$PH_mod= 1
##$PKNL= yes
##$PPARMOD= 0
##$PSCAL= 0
##$PSIGN= 0
##$REVERSE= no
##$SF= 200.130013532006
##$SI= 16384
##$SIGF1= 3
##$SIGF2= 2
##$SINO= 400
##$SIOLD= 16384
##$SREGLST= <1H.CDCl3>
##$SSB= 0
##$STSI= 0
##$STSR= 0
##$SW_p= 3612.71676300578
##$SYMM= 0
##$S_DEV= 0
##$TDeff= 0
##$TDoff= 0
##$TI= <>
##$TILT= no
##$TM1= 0
##$TM2= 0
##$TOPLEV= 0
##$USERP1= <user>
##$USERP2= <user>
##$USERP3= <user>
##$USERP4= <user>
##$USERP5= <user>
##$WDW= 1
##$XDIM= 8192
##$YMAX_p= 0
##$YMIN_p= 0
$$ End of Bruker specific parameters
$$ ---------------------------------
##NTUPLES= NMR FID
##VAR_NAME=  TIME,          FID/REAL,        FID/IMAG
##SYMBOL=    X,             R,               I
##VAR_TYPE=  INDEPENDENT,   DEPENDENT,       DEPENDENT
##VAR_FORM=  AFFN,          ASDF,            ASDF
##VAR_DIM=   8192,          8192,            8192
##UNITS=     SECONDS,       ARBITRARY UNITS, ARBITRARY UNITS
##FACTOR=    0.0002768,     1,               1
##FIRST=     0,             0,               0
##LAST=      2.2672688,     0,               0
##MIN=       0,             -510154,         0
##MAX=       2.2672688,     579571,          0
$$ Real data points
##PAGE= N=1
##DATA TABLE= (X++(R..R)), XYDATA
$$ plain form
0 0 0 0 0 0 0 0 0 0 0 -1 8 -8 8 -16 17 -24 32 -40 46 -55 64 -80 89 -105 129 -149 170 -199 230 -263 299 -342
32 -342 388 -441 498 -561 627 -704 788 -878 977 -1086 1205 -1335 1473 -1628 1798 -1984
48 -1984 2184 -2407 2651 -2920 3220 -3552 3926 -4346 4826 -5376 6016 -6769 7678 -8791
62 -8791 10193 -12028 14532 -18176 23981 -34697 60948 -260320 -124220 579571 104490 -435225
74 -435225 -188194 326686 183975 -140053 -196599 -20895 153059 201444 -111911 -332779
84 -332779 39191 444032 24776 -490158 -95790 497146 144885 -442227 -181247 354047
94 354047 186442 -229086 -172939 92973 131750 47513 -79423 -173077 12761 274948 50097
105 50097 -343535 -109033 374850 150752 -366944 -174029 324972 173165 -253866 -149144
$$ packed form
0@%%%%%%%%%jRj6J6k4L3m1N6p2Q6j01J19j44J69j94K34k78L19l69M29m93N62o41
32c42P30q29R39j059J188j331J492j666J855k063K291k540K808l101L426l782
48a984M168m591N058n571O140o772P478q272R172j0202J1392j2785J4447j6469
62h791J8984k2221K6560l2708M2157n8678R5645l21268J36100P03791m75081n39715
74d35225K47031N14880j42711l24028n6546J75704J73954M8385l13355k20868
84c32779L71970M04841m19256n14934L94368N92936l52261n87112K60980N35294
94C54047j67605m15528N6147K65912L8777q4237j26936r3654J85838K62187k24851
105E0097l93632K34502M83883k24098n17696J92915M99001j51807m27031J04722
$$ plain form
115 -149144 166080 106786 -68294 -50036 -25241 -10958 109237 70446 -173684 -118296 217078
126 217078 149753 -236871 -161269 233630 150491 -212318 -120987 175269 74803 -131048 -21929
137 -21929 81435 -33622 -33761 82160 -10504 -118767 48452 138408 -78774 -138376 102719
148 102719 121372 -118119 -87265 128825 43582 -132424 6161 131946 -52864 -125306 92156
159 92156 112841 -118403 -94418 127472 68189 -119961 -36412 95033 -2987 -59224 44990
170 44990 14398 -89229 31091 130400 -72092 -165089 102949 188954 -119109 -196940 119922
181 119922 188837 -103250 -160991 74253 116911 -34526 -57234 -8180 -10742 49763 81857
192 81857 -84164 -149186 106229 204403 -114970 -242834 107068 257327 -86442 -248158
$$ packed form
115a49144L15224n9294j75080J8258K4795J4283J20195l8791k44130N5388L35374
126B17078o7325l86624P5602L94899q3139l62809R1331K96256j00466k05851J09119
137b1929J03364j15057j39J15921r2664j08263J67219Q9956k17182n9602K41095
148A02719J8653k39491L0854K16090q5243j76006J38585J25785j84810p2442K17462
159I2156K0685k31244K3985K21890n9283j88150Q3549J31445r8020n6237J04214
170D4990l0592j03627J20320R9309k02492r2997K68038Q6005l08063p7831L16862
181A19922O8915k92087n7741K35244M2658j51437k2708M9054k562O0505L2094
192H1857j66021o5022K55415R8174l19373j27864L49902J50259l43769j61716
$$ plain form
202 -248158 53257 212378 -14227 -154417 -26794 78518 63905 7855 -91833 -95453 108255
213 108255 176889 -108990 -241194 96600 283170 -70452 -295856 36169 279067 2880
223 2880 -232698 -40984 161138 72530 -73119 -94604 -23937 102711 117529 -98381 -200183
234 -200183 80208 260591 -52765 -294080 18877 296837 16351 -268727 -47990 213959
244 213959 73125 -137271 -86686 49215 89396 42907 -79174 -127622 59607 197926 -32028
255 -32028 -245870 636 267464 29614 -262085 -55920 229556 73261 -176150 -81578
265 -81578 105799 77543 -28386 -63654 -49371 40869 118629 -12794 -172820 -16514 207717
276 207717 43827 -219345 -63207 209766 74362 -179330 -73553 134346 62822 -78686
$$ packed form
202b48158L01415J59121k26605j40190J27623J05312j4613n6050r9688l620K03708
213A08255O8634k85879j32204L37794J86570l53622k25404L32025K42898k76187
223B880k35578J91714K02122q8608j45649k1485P0667J26648J4818k15910j01802
234b00183K80391J80383l13356k41315L12957K77960k80486k85078K20737K61949
244B13959j40834k10396N0585J35901M0181m6489j22081m8448J87229J38319k29954
255c2028k13842K46506K66828k37850k91699K06165K85476j56295k49411R4572
265h1578J87377k8256j05929l5268J4283R0240P7760j31423j60026J56306K24231
276B07717j63890k63172J56138K72973j35404k53692J05777K07899p1524j41508
$$ plain form
286 -78686 -42170 19941 15578 35961 12669 -84592 -39722 120492 60102 -143089 -72673 149799
298 149799 73640 -143471 -64859 124971 46292 -98102 -21075 66199 -7155 -32271 35280
309 35280 732 -57907 28079 73921 -50537 -79114 67675 74201 -77899 -58458 83089
320 83089 34747 -83736 -6172 79876 -24463 -73738 51499 64024 -73013 -52887 84178
331 84178 38158 -85020 -21447 74071 2083 -53076 19246 24847 -41524 7665 64052 -39030
343 -39030 -83436 66758 99364 -85434 -108034 94118 109042 -90452 -99930 75508 80857
354 80857 -51188 -53003 19686 16986 13548 22644 -46108 -64141 72045 101458 -89766 -132323
366 -132323 95716 151806 -89893 -157475 72850 148076 -46277 -122796 14837 84526 19110
$$ packed form
286g8686L6516O2111m363K0383k3292r7261M4870J60214o0390k03191P0416K22472
298A49799p6159k17111P8612J89830p8679j44394P7027Q7274p3354k5116O7551
309C5280l4548n8639Q5986M5842j24458k8577J46789O526j52100J9441J41547
320H3089m8342j18483P7564Q6048j04339m9275J25237J2525j37037K0126J37065
331H4178m6020j23178O3573R5518p1988n5159P2322N601o6371M9189N6387j03082
343c9030m4406J50194L2606j84798k2600K02152J4924j99494r478J75438N349
354H0857j32045j815P2689k700l438R096o8752j8033J36186K9413j91224m2557
366a32323K28039N6090k41699o7582K30325P5226j94353p6519J37633O9689o5416
$$ plain form
377 19110 -34899 -49652 -19663 74395 75159 -89015 -124402 92889 162564 -85390 -185341 67167
389 67167 188755 -41953 -173277 11667 138565 18077 -89627 -45423 30000 65571 33021
400 33021 -77236 -93173 79042 144079 -70952 -179632 55341 197321 -32862 -193732
410 -193732 8293 171007 16696 -130239 -37792 76791 53565 -15933 -61768 -46133 61295
421 61295 102124 -53504 -147514 38552 176274 -20037 -187321 -949 178279 20085
431 20085 -151677 -35456 110285 44988 -58656 -47280 3331 43271 51057 -32523 -97354
442 -97354 18624 132677 -2321 -152439 -12586 156425 24594 -144409 -31595 118485
452 118485 32382 -82985 -28008 40846 17913 1921 -5369 -42355 -8918 75180 21262 -98931
$$ packed form
377A9110n4009j4753K9989R4058P64j64174l5387K17291O9675k47954r9951K52508
389F7167J21588k30708j31324J84944J26898j20488j07704M4204P5423L5571l2550
400C3021j10257j5937J72215O5037k15031j08680K34973J41980k30183j60870
410a93732K02025J62714j54311j46935R2447J14583k3226o9498m5835J5635J07428
421F1295M0829j55628r4010J86066J37722j96311j67284J86372J79228j58194
431B0085j71762J16221J45741o5297j03644J1376N0611L9940P786q3580o4831
442i7354J15978J14053j34998j50118J39853J69011j31831j69003J12814J50080
452A18485q6103j15367N4977O8854k2933j5992p290l6986L3437Q4098n3918j20193
$$ plain form
464 -98931 -30545 111505 34848 -112501 -33244 103456 26447 -85207 -14200 61833 -263
475 -263 -34627 16482 7838 -30858 17088 42020 -37428 -47859 52235 46772 -61617 -39473
487 -39473 64722 25366 -63633 -7440 57988 -13483 -50487 33418 40803 -50425 -30478 61748
499 61748 19943 -65459 -8764 61261 -2051 -48344 13806 29419 -24837 -5169 36246 -20069
511 -20069 -46482 44241 55399 -63768 -61715 75800 63926 -79473 -62224 72965 54469
522 54469 -58244 -41925 35311 23692 -8401 -1900 -20257 -22519 47154 47405 -68421 -69744 82126
535 82126 87856 -85612 -98234 79725 100350 -63575 -92051 40456 74239 -12439 -47568
546 -47568 -16716 14372 43425 21671 -65254 -57784 78668 88814 -83340 -112480 77723 124615
$$ packed form
464i8931O8386J42050p6657j47349P9257J36700p7009j11654P1007P6033o2096
475b63l4364N1109q644l8696M7946K4932p9448j0431J00094n463j08389K2144
487c9473J04195l9356q8999N6193O5428p1471l7004Q3905P385r1228J9947R2226
499F1748m1805q5402N6695P0025o3312m6293O2150J5613n4256J9668M1415n6315
511b0069k6413R0723J1158j19167K053J37515j1874j43399J7249J35189j8496
522E4469j12713J6319P7236j1619l2093O501j8357k262O9673K51j15826j323J51870
535H2126N730j73468j2622J77959K0625j63925k8476J32507L3783q6678l5129
546d7568L0852L1088K9053k1754q6925P470J36452J0146j72154k9140J90203M6892
$$ plain form
558 124615 -64024 -124545 43024 111181 -17798 -85729 -8408 50986 33106 -9594 -52653
569 -52653 -32890 66130 73414 -70808 -106330 67718 129071 -56771 -138260 39821 133250
580 133250 -19169 -114694 -3183 83650 23441 -44468 -40417 102 51015 43450 -55331 -82706
592 -82706 52327 112808 -43335 -130659 30000 134936 -13859 -124805 -1993 102324
602 102324 16452 -69216 -26492 30563 32414 10480 -33052 -48846 29348 80912 -22272 -103688
614 -103688 12818 114570 -3531 -113948 -5128 101256 10754 -79467 -13950 50257 13273
625 13273 -17894 -10041 -14395 4841 43775 1526 -66654 -7047 82030 11559 -87732 -12878
637 -12878 85061 11738 -73996 -7200 56939 383 -35842 8029 13364 -16949 7782 24116
$$ packed form
558A24615j88639o0521J67569O8157j28979o7931P7321N9394j7880m2700m3059
569e2653J9763R9020P284j44222l5522J74048O1353j85842q1489J78081R3429
580A33250j52419r5525J11511Q6833o0209o7909M051M0519N0913p565r8781k7375
592h2706J35033O0481j56143q7324J60659J04936j48795j10946J22812J04317
602A02324q5872q5668M2724N7055J851k1934m3532j5794P8194N1564j03184q1416
614a03688J16506J01752j18101j10417J08820J06384r0502r0221O5517O4207l6984
625A3273l1167P853m354J9236L8934m2249o8180N9607Q9077p0471r9291P4854
637a2878R7939p3323q5734O6796O4139n6556l6225M3871N335l0313K4731J6334
$$ plain form
649 24116 -26480 -29358 40040 30223 -48991 -27272 52213 19419 -50984 -8086 45848 -5699
661 -5699 -38009 20429 29090 -33557 -19293 44186 10477 -49400 -1860 49293 -5295 -42623
673 -42623 11799 30507 -17421 -13674 22374 -5991 -27271 25629 30954 -43817 -34489 57060 36148
686 36148 -64634 -36451 64418 34092 -56813 -29012 42165 21012 -22025 -9769 -801 -3424
698 -3424 24599 18559 -45522 -33300 62070 46980 -71327 -57290 72686 63059 -65793 -63093
710 -63093 51160 56344 -31142 -43893 7245 25562 16800 -3874 -39431 -20027 56935 42803
722 42803 -68141 -62453 71610 76632 -66950 -83187 55247 81732 -37150 -71112 15867
733 15867 53106 7300 -28548 -28800 594 46872 28553 -59264 -55369 64524 76838 -62979
$$ packed form
649B4116n0596k878O9398r817p9214K1719P9485l2794p0403M2898N3934n1547
661e699l2310N8438Q661o2647J4264O3479l3709n9877M7540N1153n4588l7328
673d2623N4422J8708m7928L747L6048k8365k1280N2900N325p4771R328R1549k0912
686C6148j00782K8183J00869l0326r0905K7801P1177k1153m3037J2256Q968k623
698c424K8023o040o4081J2222R5370j5090j18307J4037J29976r627j28852K700
710f3093J14253N184q7486j2751N1138J8317q762k0674l5557J9404P6962j4132
722D2803j10944N688J34063N022j43582j6237J38434K6485j18882l3962Q6979
733A5867L7239m5806l5848k52K9394M6278j8319q7817L895J19893J2314j39817
$$ plain form
745 -62979 -91105 53945 95361 -39961 -90195 21700 75019 -2318 -52142 -16508 23550
756 23550 32334 7566 -43476 -37604 49319 63924 -48826 -82759 43427 93182 -33260 -93280
768 -93280 20878 83856 -7120 -65714 -5922 41034 16687 -12882 -24694 -16250 28629 42492
780 42492 -29380 -64030 26398 77901 -21415 -83636 14643 80333 -7525 -68916 1293 50947
792 50947 4017 -28059 -6893 3747 8460 20321 -7768 -40708 6309 56273 -4114 -64897
804 -64897 2174 66415 -1187 -61239 1294 49941 -3242 -34836 5965 17149 -9877 253
816 253 13395 -16345 -16436 29055 17463 -37460 -16119 41625 12312 -41024 -5617 37097 -2608
829 -2608 -29968 12361 21595 -21653 -12471 29719 3944 -35093 3458 36606 -9422 -34223 13230
$$ packed form
745f2979k8126J45050M1416j35322n0234J11895N3319p7337m9824L5634M0058
756B3550Q784k4768n1042N872Q6923J4605j12750l3933J26186M9755j26442o0020
768i3280J14158O2978r0976n8594N9792M6956k4347k9569j1812Q444M4879J3863
780D2492p1872l4650R0428N1503r9316o2221R8279O5690q7858o1391P0209M9654
792E0947m6930l2076K1166J0640M713J1861k8089l2940M7017M9964o0387o0783
804f4897O7071O4241o7602o0052O2533M8647n3183l1594M0801J1184k7026J0130
816B53J3142k9740r1M5491j1592n4923K1341N7744k9313n3336L5407M2714l9705
829b608k7360M2329R234m3248R182M2190k5775l9037L8551L3148m6028k4801M7453
$$ plain form
842 13230 27037 -15918 -16371 16791 2410 -17156 12555 16670 -27537 -16268 40238 15770 -49036
855 -49036 -15103 53062 14509 -50713 -12914 43000 10930 -29667 -7241 12748 2570 6364
867 6364 3644 -25191 -10878 41652 18259 -54086 -25594 60280 31021 -60327 -34649 53245
879 53245 34609 -40591 -31468 23012 24330 -2980 -14068 -17580 1476 36380 12600 -51092 -26204
892 -26204 60628 38452 -63182 -47120 59240 51702 -48679 -50767 32951 44350 -13836 -32961
904 -32961 -6726 17258 25991 723 -42533 -19773 53695 36887 -59131 -50912 57832 59573
916 59573 -50457 -62104 37933 57912 -21693 -47179 4224 31491 13186 -11807 -27832 -8822
928 -8822 39053 28997 -45096 -45842 46169 57800 -42291 -63619 34063 62399 -23227 -54818
$$ packed form
842A3230J3807m2955m53L3162j4381j9566K9711M115m4207J1269N6506k4468o4806
855d9036L3933O8165l8553o5222L7799N5914l2070m0597K2426J9989j0178L794
867F364k720k8835J4313N2530k3393p2345K8492Q5874k9259r1348K5678Q7894
879E3245j8636p5200R123N4480J318k7310j1088l512J9056L4904k3780o3692K4888
892b6204Q6832k2176j01634J6062J06360p538j00381k088Q3718J1399n8186j9125
904c2961K6235K3984Q733k5268m3256K2760P3468j6808r6018Q219J08744J741
916E9573j10030j1647J00037J9979p9605k5486N1403K7267j8305k4993j6025J9010
928h822M7875j0056p4093p46R2011J1631j00091k1328R7682K8336q5626l1591
$$ plain form
940 -54818 10505 41181 1943 -23634 -13385 3434 22187 16547 -27997 -34610 30408 48735
952 48735 -29366 -57232 25800 59683 -19779 -55368 12955 45599 -5703 -30927 -690 13636
964 13636 5883 4506 -9442 -21571 11216 35285 -11706 -44966 10863 48824 -9867 -47678
976 -47678 8352 41108 -7503 -30939 7027 17986 -7087 -4087 7611 -9006 -7905 20267
988 20267 8042 -28169 -6945 32769 4967 -33134 -1403 30311 -3140 -24482 8564 16812
1000 16812 -14347 -8410 19416 -14 -23594 6905 25350 -12390 -25018 15426 21356 -16455
1012 -16455 -15216 15532 6473 -13157 3974 10023 -14819 -6522 25336 3725 -33436 -1315 38840
1025 38840 294 -39958 232 36902 88 -29449 -646 18366 865 -4893 -725 -9949
$$ packed form
940e4818O5323L0676l9238k5577J0249J6819J8753n640m4544o613O5018J8327
952D8735p8101k7866Q3032L3883p9462l5589O8323L2644n1302k5224L0237J4326
964A3636p753j377j3948j2129L2787K4069m6991l3260N5829L7961n8691l7811
976d7678N6030L2756m8611k3436L7966J0959k5073L000J1698j6617J101K8172
988B0267j2225l6211K1224L9714k7802l8101L1731L1714l3451k1342L3046Q248
1000A6812l1159N937K7826j9430k3580L0499J8445l7740j2628M0444N930l7811
1012a6455J239L0748r059j9630J7131O049k4842Q297L1858k1611l7161L2121M0155
1025C8840l8546m0252M0190L6670l6814k9537K8803J9012j7501n758M168r224
$$ plain form
1037 -9949 -700 24107 2552 -36387 -5771 44774 9036 -48841 -12422 47553 15145 -41019
1049 -41019 -16531 30207 16343 -15587 -13812 -543 9617 17401 -3344 -32157 -4014 43978
1061 43978 11909 -51062 -19166 52641 24869 -48781 -28507 39388 28804 -26129 -26205 9767
1073 9767 19940 7214 -11289 -23434 695 36848 10549 -46041 -20964 50213 29608 -48712
1085 -48712 -35006 42425 36809 -31489 -34250 17897 27993 -2709 -18267 -12125 6338 25028
1097 25028 6455 -34963 -19033 40604 29325 -42108 -36871 38807 40228 -32049 -39415 22115
1109 22115 34143 -10635 -25247 -1137 13572 12286 -231 -21102 -12793 27486 24704 -30175
1121 -30175 -33363 29932 38515 -26544 -39090 20902 35184 -13916 -27511 6233 16696 778
$$ packed form
1037i949R249K4807k1555l8939L0616N0545l5738n7877L6419N9975l2408n6164
1049d1019K4488M6738j3864l1930J775J3269J0160P784k0745k8813K8143M7992
1061D3978l2069o2971L1896P1807k7772p3650K0274O7895j0584n4933p6L5972
1073I767J0173j2726j8503j2145K4129L6153k6299n6590K5077P1177k0605p8320
1085d8712J3706P7431n616o8298k761N2147J0096l0702j5558O142J8463J8690
1097B5028j8573m1418J5930N9637j1279p1433N237P5678J421p2277p366O1530
1109B2115J2028m4778j4612K4110J4709j286j2517k0871Q309M0279k782n4879
1121c0175l188O3295Q583o5059j2546N9992J4282m9100j3595L3744J0463j5918
$$ plain form
1133 778 -4614 -7076 -8043 11481 19063 -14544 -27847 15498 32928 -15227 -34248 13899 31640
1146 31640 -11717 -25548 9472 17116 -6967 -6942 5062 -3103 -3159 12574 1853 -19720 -593
1159 -593 24395 -826 -26047 2324 24490 -4408 -20470 6495 14100 -9269 -6972 11614 -593
1172 -593 -13961 7331 15390 -12544 -15563 15826 14396 -16722 -11290 15637 6750 -12441 -492
1185 -492 8321 -6389 -3411 13684 -1164 -20214 4934 25247 -7380 -28101 8134 27977 -7770
1198 -7770 -24973 5840 18777 -3444 -10435 510 180 1920 10486 -3697 -20689 4443 29348
1211 29348 -3766 -34954 2170 37484 542 -35739 -3362 30409 6213 -21434 -8285 10047
1223 10047 9270 2764 -8746 -15672 6673 26951 -3391 -35831 -1169 40660 5716 -41532 -10288
$$ packed form
1133G78n392k462r67J9524P582l3607j3303M3345J7430m8155j9021M8147J7741
1146C1640m3357j3831L5020P644k4083K5J2004q165n6J5733j0721k1573J9127
1159e93K4988k5221k5221K8371K2166k8898j6062K6965P605k3369K297J8586j2207
1172e93j3368K1292Q059k7934l019L1389j430l1118N432K6927q887j9191J1949
1185d92Q813j4710K978J7095j4848j9050K5148K0313l2627k0721L6235J9843l5747
1198g770j7203L0813J2937k2221o991J0945l30J740Q566j4183j6992K5132K4905
1211B9348l3114l1188L7124L5314l6942l6281L2377L3771k4196k7647J3149J8332
1223A0047p77o506j1510o926K2345K0278l0342l2440L4662M1829l4944m7248L1244
$$ plain form
1236 -10288 37510 13647 -29764 -15476 18612 15388 -5420 -13054 -8190 9119 21060 -3487
1248 -3487 -31418 -2734 38566 9240 -41304 -14719 39822 18776 -34158 -20795 24918 20240
1260 20240 -13396 -17606 532 12344 11809 -5805 -22892 -1920 31030 9481 -35809 -16363
1272 -16363 36553 21428 -33550 -23897 27214 24001 -18174 -20861 7967 15497 2854 -8015 -12435
1285 -12435 -320 20364 8786 -25696 -16274 27833 21603 -27224 -24623 23693 24362 -18266 -21444
1298 -21444 11358 15706 -4165 -8410 -2899 83 8745 8014 -13209 -15033 16029 20285 -16788 -22734
1312 -22734 16223 22777 -13985 -19994 11196 15065 -7717 -8340 4335 914 -1265 6227 -1297 -12569
1326 -12569 2998 16994 -4378 -19481 4989 19297 -5593 -16925 5925 12571 -6501 -6851
$$ packed form
1236a0288M7798k3863m3411J4288L4088l224k0808p634M864J7309J1941k4547
1248c487k7931K8684M1300k9326n0544K6585N4541k1046n2934J3363M5713m678
1260B0240l3636m210J8138J1812n35j7614j7087K0972L2950k1549m5290J9446
1272a6363N2916j5125n4978R653N1111l213m2175k687K8828P530j2643j0869m420
1285a2435J2115K0684j1578l4482R422M4107o230m8827K601M8316O69m2628l178
1298b1444L2802M348j9871m245N511K982Q662p31k1223j824L1062M256l7073n946
1312b2734L8957O554l6762o009L1190L869k2782o23J2675l421k179P492p524j1272
1326a2569J5567J3996k1372j5103K4470J4308k4890j1332K2850O646j9072l50
$$ plain form
1338 -6851 7093 586 -7754 5452 8516 -10350 -8660 13950 8494 -15304 -7273 14778 5207
1351 5207 -12299 -2083 8320 -1826 -3687 6205 -1304 -10799 5631 14649 -9111 -17791 10865
1364 10865 19016 -11202 -18617 9738 16079 -7022 -11677 3568 5668 457 1621 -3988 -8873 7114
1378 7114 16080 -8670 -21783 9015 25672 -7797 -26935 5419 25405 -2243 -21084 -1416
1390 -1416 14177 4556 -5696 -7324 -3947 8542 13244 -8682 -21600 7202 27676 -4753 -30908
1403 -30908 1375 30960 2440 -27557 -5777 21199 8637 -12343 -9976 2258 10317 8251
1415 8251 -8961 -17932 6378 25676 -2822 -30757 -1378 32478 5412 -30995 -9113 25903
1427 25903 11502 -18412 -12686 8771 11990 1455 -9921 -11458 6416 20078 -1813 -26224
$$ packed form
1338f851J3944o507q340J3206L064j8866J690K2610n456k3798Q031K2051r571
1351E207j7506J0216J0403j0146j861R892p509r495J6430R018k3760q680K8656
1364A0865Q151l0218p415K8355O341k3101m655J5245K100n211J164n609m885J5987
1378G114Q966k4750j3113L0798J6657l3469j9138L2354J9986k7648j8841J9668
1390a416J5593r621j0252j628L377J2489M702k1926j2918K8802K0474l2429k6155
1403c0908L2283K9585k8520k9997K1780K6976j2562k0980K367J2234Q059k066
1415H251j7212q971K4310J9298k8498k7935K9379L3856k7066l6407K1882L5016
1427B5903j4401k9914N726K1457L219j0535j1376j537J7874J3662k1891k4411
$$ plain form
1439 -26224 -2982 29706 7748 -29612 -11369 26680 13767 -20824 -14287 13153 12973 -4366
1451 -4366 -9970 -4499 5525 12367 -496 -18731 -4893 22607 9349 -24086 -12911 22803 14686
1464 14686 -19390 -14697 14180 12780 -7937 -9247 1306 4695 5004 653 -10188 -5680 14053
1477 14053 10247 -16012 -13375 16222 14803 -14803 -14401 12079 12160 -8587 -8444 4563 3430 -961
1491 -961 1685 -2412 -6747 4705 10825 -6298 -13649 6903 14523 -6695 -13483 6245 11041 -5330
1505 -5330 -6862 4635 2211 -3950 2949 3634 -7303 -3423 10907 3305 -12874 -3145 13032 2571
1519 2571 -11756 -1648 8615 62 -4725 1809 82 -4238 4353 6661 -8340 -8920 11066 10686
1533 10686 -12291 -11449 11973 11367 -9858 -9729 6787 7162 -2576 -3122 -1616 -1358 5712 6344 -8898
$$ packed form
1439b6224K3242L2688k1958l7360J8243L8049j2913l4591O537K7440j80j7339
1451d366n604N471J0024O842j2863j8235J3838K7500j3258l3435J1175L5714q117
1464A4686l4076M693K8877j400k0717j310J0553L389L09m351j0841M508J9733
1477A4053l806k6259K637K9597j419k9606M02K6480Q1k0747J43J3007j133m391
1491i61K646m097m335J1452O120j7123p351K0552P620k1218o788J9728M796j6371
1505e330j532J1497k424o161O899O85j0937L880J4330p602j6179R729J6177j0461
1519B571j4327J0108J0263q553m787O534j727m320Q591K308j5001n80J9986l80
1533A0686k2977Q42K3422o06k1225J29J6516L75r738n46J506K58P070O32j5242
$$ plain form
1548 -8898 -11096 10741 15019 -11220 -17633 10015 18323 -7630 -17291 4146 14069 -288 -9274
1561 -9274 -3579 3095 6830 3657 -9065 -10296 10109 16225 -9537 -20387 7988 22575 -5119
1574 -5119 -22319 1758 19762 1962 -14834 -5261 8236 7808 -687 -9430 -7114 9627 14262
1587 14262 -8731 -20022 6437 23528 -3462 -24635 -59 22958 3452 -18917 -6317 12844
1599 12844 8376 -5227 -9047 -2618 8665 10349 -6832 -16678 4249 21103 -860 -23158 -2468
1612 -2468 22727 5457 -19872 -7760 14795 8777 -8581 -8789 1407 7367 5466 -5105 -11665
1625 -11665 2013 16312 1338 -18982 -4388 19664 6950 -18110 -8350 14915 8856 -10062
1637 -10062 -7914 4687 5939 1023 -3139 -6240 -104 10474 3328 -13299 -6313 14421 8244 -14077
$$ packed form
1548h898k198K1837M278k6239o413K7648Q308k5953r661K1437R923j4357q986
1561i274N695O674L735l173j2722j231K0405O116k5762j0850K8375J4587k7694
1574e119j7200K4077J8004j7800j6796R573J3497m28q495q743K316J6741M635
1587A4262k2993j1291K6459J7091k6990k1173K4576K3017j9506k2369J2600J9161
1599A2844m468j3603l820O429J1283J684j7181r846K0927J6854k1963k2298K0690
1612b468K5195j7270k5329J2112K2555o018j7358k08J0196N960j901j0571o560
1625a1665J3678J4299j4974k0320J4594K4052j2714k5060R760K3265o059j8918
1637a0062K148J2601J252m916m162l101O136J0578p146j6627O986K0734o177k2321
$$ plain form
1651 -14077 -9286 12108 8783 -9255 -7306 5457 4558 -1688 -1299 -1850 -2292 4662 5579 -6565 -8124
1666 -8124 7552 9781 -7427 -9862 6733 8941 -5292 -6521 3795 3328 -2297 451 988 -4203
1680 -4203 -175 7296 -473 -9749 490 10691 -593 -10482 319 8788 -343 -5933 413 2368
1694 2368 -834 1712 1747 -5507 -2685 8808 3976 -10815 -4913 11718 5845 -10888 -5951 8804
1708 8804 5523 -5513 -4314 1521 2227 2520 339 -6437 -3508 9319 6399 -11224 -9113 11485
1722 11485 10909 -10467 -11646 8100 11228 -4619 -9367 816 6393 3262 -2372 -6670 -2057 9439
1736 9439 6672 -10870 -10679 11061 13795 -9861 -15497 7438 15515 -4251 -13890 432 10545
1749 10545 3212 -5935 -6483 507 8765 4992 -10030 -10174 9885 14322 -8525 -16856 6206 17662
$$ packed form
1651a4077M791K1394l325j8038J949J2763q99o246L89n51m42O954R17j2144j559
1666h124J5676K229j7208k435J6595K208j4233j229J0316m67n625K748N37n191
1680d203M028P471p769r276J0239J0201j1284r889J0801Q469r131n590O346J955
1694B368l202K546L5p254K822J1493m832j4791N902J6631n873j6733M937J4755
1708H804l281j1036J199N835P06K93k181o776K929J2827k920j7623K111K0598
1722A1485n76k1376j179J9746L128j5847m748J0183N577l131n634m298M613J1496
1736I439k767j7542J91K1740K734k3656n636K2935Q077j9766r639J4322J0113
1749A0545p333r147n48O990Q258l773j5022j44K0059M437k2847q331K3062J1456
$$ plain form
1763 17662 -3039 -16388 -244 13380 3540 -8657 -6047 3182 7724 2759 -8305 -8325 7728
1776 7728 12952 -6211 -16216 3739 17486 -1148 -16984 -1657 14499 3981 -10665 -5691
1788 -5691 5530 6531 -51 -6387 -5340 5392 10148 -3637 -13429 1552 15403 862 -15447
1801 -15447 -2887 14017 4571 -10968 -5349 6779 5411 -2192 -4588 -2593 2946 6676 -1094 -9985
1815 -9985 -1245 11758 3107 -12258 -4718 11252 5470 -9115 -5362 6113 4375 -2662 -2730 -651
1829 -651 600 3687 1874 -5880 -3916 7263 5661 -7549 -6600 7045 6589 -5798 -5729 3965 3902 -2088
1845 -2088 -1644 183 -1262 1320 3861 -2374 -6187 2810 7766 -2760 -8357 2283 7970 -1482 -6355
1860 -6355 701 4046 99 -901 -448 -2385 506 5412 -112 -7886 -642 9379 1516 -9780 -2522
$$ packed form
1763A7662k0701j3349J6144J3624r840j2197K610R229M542m965j1064k0J6053
1776G728N224j9163j0005J9955J3747j8634j5836J5327J6156j0518j4646M974
1788e691J1221J001o582o336J047J0732M756j3785r792J4981J3851j4541j6309
1801a5447J2560J6904r446j5539N619J2128j368p603k396J995N539L730p770q891
1815i985Q740J3003q651j5365P540J5970n782j4585L753J1475j738p037o8K079
1829f51J251L087j813p754J964J1179j602j3210R49J3645m56j2387O9R694o3n990
1845b088M44J827j445K582K541o235l813Q997M956j0526n597J0640N687r452m873
1860f355P056L345l947j000M53j937K891M906n524p774P244J0021p863j1296P258
$$ plain form
1875 -2522 8837 3052 -6898 -3374 3873 2991 -506 -2161 -3150 759 6391 1077 -8860 -3053 10246
1890 10246 5063 -10378 -6423 9409 7426 -7128 -7413 4127 6560 -509 -4777 -3025 2362 6228
1904 6228 477 -8752 -3726 10086 6503 -10454 -8832 9358 10154 -7229 -10489 4165 9454 -767
1918 -767 -7389 -2668 4270 5808 -475 -8062 -3315 9386 7064 -9394 -9920 8401 11855 -6258
1932 -6258 -12284 3523 11431 -537 -9192 -2569 5879 4993 -1880 -6883 -2376 7693 6296 -7682
1946 -7682 -9704 6611 11911 -4867 -12791 2549 12244 -59 -10397 -2205 7443 4218 -3548 -5374
1960 -5374 -501 6007 4585 -5543 -8053 4565 10486 -2992 -11784 1028 11558 796 -10156
1973 -10156 -2575 7538 3584 -4170 -4165 387 3971 3248 -3076 -6354 1859 8622 -320 -9735 -1216
$$ packed form
1875b522J1359n785r950L524P247q82l497j655r89L909N632n314r937N807J3299
1890A0246n183j5441L955J5832j983j4554k85J1540K433p069m268J752N387L866
1904F228n751r229N026J3812l583j6957J622J8190P96j7383l260J4654N289j0221
1918g67o622M721O938J538o283p587M747J2701k322j6458n26J8321L454j8113
1932f258o026J5807P908j1968q655O623Q448q86o873n003M507J0069j397j3978
1946g682k022J6315N300j6778p924J5340R695j2303j0338Q192R648l225p766j826
1960e374M873O508j422j0128k510J2618N921j3478q792J2812J0530j0762j0952
1973a0156P581J0113l954p754NM552L584p23o324l278Q213O763q942r415Q519
$$ plain form
1988 -1216 9740 2447 -8482 -3212 6498 3530 -3734 -3012 876 2170 2019 -758 -4384 -832 6025
2003 6025 2278 -6902 -3590 6777 4282 -6040 -4479 4447 3891 -2644 -2713 581 1073 1379 940 -2823
2019 -2823 -2851 3797 4585 -4017 -5662 3764 6244 -2863 -5732 1782 4543 -517 -2682 -649 288 1530
2035 1530 2223 -2016 -4642 1987 6454 -1557 -7630 698 7727 194 -7043 -1274 5323 2092 -2914
2050 -2914 -2516 72 2583 2916 -1971 -5401 1149 7529 282 -8627 -1634 8908 3045 -7963 -4094
2065 -4094 6091 4637 -3543 -4689 425 3912 2590 -2621 -5507 777 7583 1211 -8892 -3388
2079 -3388 9128 5146 -8138 -6395 6279 6921 -3661 -6440 646 5379 2456 -3316 -5048 948
2093 948 7164 1749 -8346 -4322 8490 6433 -7665 -7933 5878 8318 -3595 -7881 806 6462
$$ packed form
1988a216J0956p293j0929N270R710k968p264P22L888J294j51k777l626L552O857
2003F025l747r180L312J0367k495j0322J561Q926n56o535o9L294M92L06m39l763
2019b823k8O648P88q602j645R426K480r107k869P514K761n060k165K033R37J242
2035A530O93m239k626O629M467q011o073Q328P029p533p237N769O597l231n006
2050b914L98K588K511L33m887l430O550O380p247q909O993J0542n863j1008L869
2065d094J0185j454q180j146N114L487j322n211k886O284O806o372j0103N504
2079c388J2516l982j3284J743J2674O42j0582k779P086M733k923n772j732N996
2093I48O216n415j0095M024J2812k057j4098k68J3811K440j1913m286Q687N656
$$ plain form
2107 6462 1852 -4357 -4303 1599 6073 1332 -7084 -4195 7298 6597 -6539 -8138 5112 8856 -3008
2122 -3008 -8495 851 7228 1444 -4992 -3339 2256 4750 778 -5415 -3737 5355 6128 -4674 -7886
2137 -7886 3346 8637 -1753 -8311 -57 6981 1536 -4954 -2765 2331 3510 482 -3647 -3131 3266
2152 3266 5366 -2390 -6854 1342 7559 -25 -7211 -1087 6142 1988 -4309 -2456 2093 2546 200
2167 200 -2132 -2551 1233 4325 -310 -5572 -902 5979 1857 -5731 -2600 4725 2898 -3181 -2740 1440
2183 1440 2090 544 -965 -2231 -358 3533 1720 -4193 -2953 4286 3865 -3802 -4263 2793 4079 -1492
2199 -1492 -3281 16 1925 1225 -262 -2363 -1618 2943 3250 -3027 -4712 2732 5582 -1954 -5710 907
2215 907 5220 259 -3927 -1359 2245 2321 -87 -2740 -2089 2786 4116 -2301 -5711 1409 6605 -302
$$ packed form
2107F462m610o209N4N902M474m741q416K889J1493p01j3136j599J3250L744j1864
2122c008n487R346O377n784o436J653N595K494l972o193J678R092P73j0802l212
2137g886J1232N291j0390o558Q254P038n445o490K189N096J179l028m129N16O397
2152C266K100p756m464Q196O217p584p186O124P229m154o297J853M549M53k346
2167B00k332m19L784L092m635n262M670O881m122p588L131P325j827o079M41M180
2183A440O50j546j509j266J873L891j813n913J240P239m21p667m61P056J286n571
2199a492j789L297J909p00j487k101P45M561L07o277j685P444K850p536l756O617
2215I07M313m961m186K568L604P6k408k653O51M875J330o417l410P120N196o907
$$ plain form
2231 -302 -6834 -964 6105 2049 -4688 -2985 2678 3419 -263 -3326 -2176 2788 4342 -1714 -6069
2246 -6069 412 7099 1209 -7229 -2643 6599 3805 -5046 -4483 2973 4609 -567 -4070 -1972 3017
2261 3017 4171 -1606 -5884 -163 6916 1951 -7154 -3562 6453 4709 -5101 -5427 3153 5383 -872
2276 -872 -4656 -1410 3403 3538 -1604 -5145 -401 6115 2389 -6209 -4163 5702 5437 -4478 -5983 2690
2292 2690 5869 -749 -5051 -1280 3474 2949 -1563 -4209 -616 4811 2670 -4872 -4373 4243 5569
2307 5569 -3162 -6072 1824 5865 -202 -4816 -1204 3379 2439 -1418 -3210 -646 3491 2618 -3330
2322 -3330 -4202 2714 5260 -1748 -5686 624 5313 472 -4446 -1473 2904 2123 -1153 -2374 -768
2337 -768 2213 2507 -1708 -3890 897 4740 113 -4959 -943 4548 1784 -3509 -2178 2119 2293 -448
$$ packed form
2231c02o532N870P069m056o737J703N663P41l682l063J150M964J554o056m355
2246f069O481O687n890q438M586R242k794q851N63P456J636n176l503K098M989
2261C017J154n777m278N721P079m965r105L592J0015j744r810l26Q580K230o255
2276h72l784L246M813J35n142l541M744O516l726q598K046R865k65r915j505Q673
2292B690L179o618m302L771M754n25m512k646L593N427k141p542M99Q616J326
2307E569q731k910P896M041o067m614L612M583r40l857j792K564M137q73n948
2322c330q72O916K546p008l938O310M689m841m918K973M377p81l276j221J606
2337g68K981K94m215k182M787L843m627n072M016N491k764n293J331M297J74k741
$$ plain form
2353 -448 -1924 -1088 1155 2543 -198 -3617 -889 3999 1783 -3997 -2590 3328 3035 -2389 -3029 1033
2369 1033 2542 269 -1734 -1587 525 2592 844 -3210 -2102 3426 3209 -3009 -3923 2349 4204 -1222
2385 -1222 -3809 32 3059 1137 -1843 -2145 240 2790 1383 -3045 -2957 2678 4144 -2118 -4955 1133
2401 1133 5038 30 -4609 -1153 3595 2181 -2073 -2810 238 3147 1668 -2852 -3338 2277 4665
2416 4665 -1287 -5416 149 5556 981 -5010 -2190 3886 2854 -2321 -3412 377 3323 1521 -2860
2431 -2860 -3271 1956 4554 -767 -5392 -559 5629 1811 -5018 -2899 3992 3614 -2372 -3744 582
2446 582 3523 1331 -2712 -3001 1565 4281 -172 -4979 -1300 5009 2563 -4571 -3537 3407 4051 -2087
2462 -2087 -4078 417 3539 1203 -2605 -2635 1297 3642 249 -4132 -1658 4224 2958 -3663 -3776 2740
$$ packed form
2353d48j476Q36K243J388k741l419K728M888k216n780J407N918k93n424o40M062
2369A033J509k273k003J47K112K067j748m054J108N528k17o218r14O272J855n426
2385a222k587L841L027j922k980l02K385K550j407m428Q8N635J466o262k837O088
2401A133L905n008m639L456M748j414m254p37L048K909j479m520m86N615K388
2416D665n952m129N565N407m575n991K820O076j032n175j091L789K946j802m381
2431b860m11N227K598n321m625M833O188l818o829K119O891l78n986j372M326
2446E82K941k192m043k89M566K716m453m807L679O309k446p134J034O944O44o138
2462b087j991M495L122k336l808l0L932K345l393m381K474N882j266o621j13O516
$$ plain form
2478 2740 4247 -1466 -4013 184 3408 1103 -2322 -2168 1000 2821 492 -3232 -2010 3086 3019 -2579
2494 -2579 -3909 1721 4149 -721 -3879 -367 3162 1306 -1928 -1943 536 2407 946 -2244 -2208 1887
2510 1887 3199 -1226 -3779 395 3885 482 -3446 -1288 2587 1728 -1394 -1992 12 1881 1257 -1372
2526 -1372 -2414 730 3165 -8 -3589 -914 3450 1594 -2865 -2120 1983 2343 -814 -2173 -397
2541 -397 1706 1576 -867 -2522 -63 3092 1039 -3185 -1969 2897 2587 -2255 -2958 1215 2873 -147
2557 -147 -2442 -1015 1598 1970 -576 -2700 -658 2983 1862 -2849 -2843 2336 3538 -1483 -3657 502
2573 502 3533 660 -2736 -1594 1742 2354 -347 -2787 -1036 2802 2274 -2458 -3295 1710 3957 -816
2589 -816 -4154 -242 3790 1213 -3053 -2133 1857 2631 -424 -2839 -1041 2647 2427 -2003 -3434 1196
$$ packed form
2478B740J507n713k547M197L224k305l425J54L168J821k329l724J222N096o7n598
2494b579j330N630K428m870l158L512L529j856l234j5K479J871j461l190L6M095
2510A887J312m425k553M174L490l403l928K158L875q59l122n98K004J869o24k629
2526a372j042L144K435l173l581K675M364j856m459P45M103L60l157j359J776
2541c97K103j30k443j655K459L155k053m224J216M866l10m842p03M173J658l020
2557a47k295J427K613L72k546k124K042L641j121m711ON179J202n021k174M159
2573E02L031k873l396J142L336O12k701k440J751L838n28m732q37N005K247m773
2589h16l338L912M032k577m266R20L990P74l055k415J798L688k20m430j431M630
$$ plain form
2605 1196 4115 -113 -4212 -847 3812 1821 -2914 -2512 1752 2878 -302 -2819 -1151 2361 2410 -1600
2621 -1600 -3433 569 3918 434 -3996 -1521 3599 2278 -2709 -2812 1598 2957 -233 -2713 -1007
2636 -1007 2108 2195 -1161 -2968 161 3433 939 -3398 -1810 2991 2599 -2220 -3018 1159 2949 -53
2652 -53 -2581 -1092 1847 1913 -844 -2609 -301 2869 1336 -2763 -2228 2231 2837 -1407 -2979 561
2668 561 2889 465 -2217 -1235 1433 1912 -313 -2244 -764 2183 1742 -1840 -2529 1309 2924 -569
2684 -569 -3017 -207 2637 909 -1964 -1593 1002 1829 70 -1931 -1107 1616 1928 -1111 -2570 421
2700 421 2872 298 -2799 -959 2326 1541 -1610 -1866 643 1907 493 -1643 -1408 1151 2184 -514
2716 -514 -2674 -376 2739 1075 -2559 -1770 1932 2144 -1059 -2243 130 2055 889 -1572 -1711 836
$$ packed form
2605A196K919m228m099L365M659j991m735M02M264J126l180k517J668L512M9m010
2621a600j833M002L349l484m430K475N120j321m987j03M410J359l190k480J706
2636a007L115Q7l356j807L129L272k494m337J588M801l92m819p98M177J790l002
2652e3k528J489K939O6k757j765K308L170j533m099N35M459O06m244j572L540
2668E61K328k424k682R82K668M79k225j931J480K947m41l582o89L838J615l493
2684e69k448K810K844j728k873L71K595Q27j759k001Q24K723L12l039j459K991
2700D21K451k574l097J840L285p85l151k56K509J264j414k136K35K559J033k698
2716e14k160K298L115j664l634P89L702K12l203j184K373J925j166k461j39K547
$$ plain form
2732 836 2349 114 -2656 -951 2587 1770 -2169 -2344 1550 2621 -665 -2603 -296 2174 1143 -1573
2748 -1573 -1876 561 2339 353 -2481 -1341 2278 2114 -1864 -2753 1059 2903 -172 -2740 -657 2298
2764 2298 1529 -1440 -2081 471 2402 640 -2280 -1615 2011 2393 -1336 -2956 554 3093 277 -2791
2780 -2791 -1175 2156 1785 -1322 -2134 299 2257 733 -2073 -1742 1533 2400 -878 -2926 61 2937
2796 2937 724 -2631 -1382 2027 1936 -1127 -2166 193 2163 802 -1797 -1683 1161 2339 -456 -2670
2812 -2670 -353 2650 1147 -2314 -1789 1642 2082 -875 -2196 -133 1940 1012 -1484 -1712 761 2241
2828 2241 24 -2382 -846 2164 1609 -1767 -2022 1132 2267 -369 -2075 -461 1721 1135 -1134 -1738
2844 -1738 327 1961 428 -2012 -1199 1734 1754 -1244 -2146 632 2211 136 -1990 -772 1541 1324
$$ packed form
2732H36J513k235k770J705L538q17l939j75L894J071l286j938K307K470j031k716
2748a573l03K437J778j986k834J140L619j64l978q89L812J844l075k568K083K955
2764B298p69k969o41K552J931j762k920O65L626L82l729j620L510K539k816l068
2780b791J616L331l71l107q12K433J958j524k806L31L275Q67l278k048K987K876
2796B937k213l355J249L409r1l063j039K359J970j361k599J14K844J178k795k214
2812b670K317L003j503l461N25L431M40k957j321K063K073r28k496k28K473J480
2828B241k217k406J536L010n55l376k55L154J135k636j706J614K182n86k269o04
2844a738K065J634j533k440Q13K933K0k998r02K778J579k075k126J218K313k17
$$ plain form
2860 1324 -807 -1642 46 1775 798 -1599 -1517 1252 1983 -738 -2249 -49 2178 611 -1854 -1190
2876 -1190 1198 1540 -540 -1780 -411 1537 1123 -1321 -1780 702 2132 -97 -2261 -532 2054 1189
2892 1189 -1558 -1610 952 1823 -109 -1780 -627 1491 1344 -934 -1868 340 2086 348 -2127 -976
2908 -976 1858 1530 -1361 -1953 648 1912 149 -1784 -882 1321 1476 -688 -1888 38 2040 722
2924 722 -1948 -1414 1579 1866 -969 -2091 275 2082 497 -1731 -1169 1188 1641 -500 -1937 -352
2940 -352 1945 967 -1708 -1643 1231 2041 -628 -2216 -122 2035 768 -1646 -1327 1018 1664 -294 -1827
2957 -1827 -448 1711 1204 -1397 -1731 902 2081 -236 -2125 -386 1942 1025 -1443 -1446 801 1654 -28
2974 -28 -1785 -697 1438 1347 -1054 -1813 472 1939 179 -1985 -804 1657 1311 -1217 -1580 530 1692
$$ packed form
2860A324k131q35J688J729r77k397Q2K769P31k721j511K200K227j567k465O64
2876a190K388L42k080j240J369J948m14k444m59K482J430k229k164J729K586q65
2892A189k747n2K562Q71j932j671J153K118j47k278r34K208J746j738k475J151
2908i76K834l28k891n92K601J264j763j933R02K203J55k164j200J926K002j318
2924G22k670N34K993K87k835j122K366J807j585k228N62K357M53k141j437J585
2940c52K297r78k675O5K874Q10k669j588K094K157j267k414L19K345O46j958j533
2957a827J379K159n07k601l34K633J179k317j889J739K328r17k468lK247Q53j682
2974b8j757J088K135r1k401p59K285J467j760k164J181K461l46k528l63K110J162
$$ plain form
2991 1692 234 -1478 -872 1211 1451 -700 -1733 99 1879 570 -1725 -1092 1338 1447 -841 -1644
3007 -1644 245 1640 452 -1438 -1003 907 1408 -381 -1679 -247 1684 852 -1472 -1300 1063 1598
3023 1598 -469 -1691 -122 1550 655 -1185 -1125 696 1523 -56 -1555 -549 1429 1124 -1152 -1560
3039 -1560 633 1722 -79 -1732 -525 1418 996 -951 -1336 362 1446 273 -1471 -836 1244 1366
3055 1366 -766 -1626 292 1784 317 -1580 -786 1232 1243 -761 -1419 137 1467 528 -1336 -1023 936
3072 936 1378 -432 -1624 -79 1621 616 -1450 -1062 1018 1430 -490 -1568 -98 1447 694 -1152
3088 -1152 -1160 763 1518 -139 -1564 -441 1523 944 -1224 -1282 742 1518 -221 -1570 -400 1389 942
3105 942 -982 -1307 473 1511 41 -1481 -694 1310 1135 -967 -1414 542 1548 39 -1489 -545
$$ packed form
2991A692j458j712O06K083K40k151j033J832J780j309k295O33K430J09k288q03
3007a644J889J395j188j890M35J910N01j789j298J432J931q32k324J72K363N35
3023A598k067j222J569J672q95j840O0J821Q27j579j499J006J978l05k276m08
3039a560K193J089j801j653J207J943m22j947l85J698J084j173j744O35K080J22
3055A366k132q60J918J492j467j897P94K018J1k004o58J556J330r39j864L13J959
3072I36M42j810j192J545J700j005k066L88K080M12j920j078J470J545p53j846
3088a152qJ923P55j657j425J123J964n79k168n8K024P76j739j349J170J789m47
3105I42j924l25J780J038j470j522P87K004j75k102m47J956J006j509j528R44
$$ plain form
3121 -545 1216 1037 -743 -1305 285 1442 310 -1414 -870 1112 1223 -720 -1488 205 1582 304
3137 304 -1399 -795 1062 1151 -525 -1335 -36 1428 486 -1277 -1028 856 1329 -404 -1507 -113 1463
3154 1463 590 -1183 -1030 851 1269 -296 -1360 -250 1222 762 -1009 -1161 626 1353 -110 -1436
3170 -1436 -327 1235 729 -1015 -1130 556 1273 -97 -1263 -397 1168 891 -768 -1202 322 1353
3186 1353 143 -1273 -600 1154 1018 -771 -1213 337 1342 181 -1225 -586 988 1080 -592 -1234 84
3203 84 1290 393 -1234 -872 916 1149 -565 -1302 28 1310 416 -1115 -836 829 1112 -312 -1297
3220 -1297 -117 1214 628 -1015 -933 740 1180 -252 -1284 -161 1251 578 -1003 -964 606 1172 -176
3237 -176 -1240 -330 1166 709 -852 -1111 484 1257 -43 -1242 -371 1186 837 -807 -1093 384 1222
$$ packed form
3121e45J761j79j780n62J590J157j132j724N44J982J11j943p68J693J377j278
3137C04j703O04J857Q9j676q10J299J464r42j763K49J884M73j733j103J394J576
3154A463q73j773J53J881M18j565j064J110J472m60j771j52J787P27j463j326
3170a436J109J562n06j744j15J686P17j370j166Q66J565k77j659m34J524J031
3186A353j210j416O73J754j36j789m42J550J005j161j406O39J574R2j672o42J318
3203H4J206q97j627L62J788K33j714p37J330J282q94j531K79J665K83j424r85
3220a297J180J331n86j643Q2J673M40j432j032J123J412o73j581L9J570N66j348
3237a76j064R10J496m57j561k59J595P73j300j199Q71J557l49j644k86J477Q38
$$ plain form
3254 1222 100 -1170 -549 985 882 -685 -1130 223 1246 159 -1204 -579 906 921 -638 -1131 179
3271 179 1163 214 -1091 -643 839 966 -450 -1144 78 1159 401 -998 -740 791 989 -402 -1139
3288 -1139 54 1081 458 -935 -810 650 1030 -234 -1188 -108 1072 532 -900 -910 537 1102 -199
3305 -199 -1129 -247 1050 605 -789 -884 430 1104 20 -1027 -331 998 711 -684 -1002 399 1035 53
3323 53 -994 -482 916 715 -625 -968 231 1035 187 -1040 -562 841 804 -520 -1008 89 1074 271
3341 271 -975 -532 792 828 -388 -1009 49 1040 385 -881 -666 663 931 -314 -1081 -46 1054
3358 1054 380 -849 -769 583 980 -205 -1007 -197 976 523 -799 -822 515 1002 -150 -1086 -203 1002
3376 1002 590 -758 -809 433 984 -116 -958 -292 850 649 -656 -859 322 963 -16 -1033 -355 881
$$ packed form
3254A222j122j270O21J534j03j567m45J353J023j087j363O25J485J5j559m93J310
3271A79R84r49j305M48J482J27j416o94J222J081p58j399K58J531J98j391p37
3288a139J193J027o23j393J25J460L80j264r54J080J180n40j432j0J447N65j301
3305a99r30Q82J297m45j394r5J314O74j084j047O96J329k87j395l18J401O36r82
3323E3j047N12J398k01j340l43J199Q04q48j227M78J403l7j324m88J097R85q03
3341B71j246M43J324L6j216o21J058R91o55j266K15J329K68j245p67J035J100
3358A054o74j229Q0J352L97j185q02Q10J173m53j322k3J337M87j152r36Q83J205
3376A002m12j348n1J242N51j100q42O66J142k01j305k03J181O41r79j017O78J236
$$ plain form
3394 881 646 -645 -871 283 975 34 -913 -445 808 703 -486 -971 156 1017 191 -908 -504 756
3412 756 785 -472 -896 140 978 277 -825 -593 635 795 -307 -905 45 932 339 -816 -618 535
3430 535 768 -309 -876 -34 882 316 -734 -623 535 839 -173 -912 -156 831 473 -656 -663 500 869
3449 869 -139 -889 -250 793 490 -619 -744 329 833 -6 -880 -329 669 637 -555 -820 248 886
3467 886 54 -858 -338 661 545 -436 -822 160 845 189 -746 -443 566 709 -405 -800 107 810 184
3486 184 -731 -466 535 660 -322 -823 -37 780 221 -668 -578 431 736 -197 -857 -56 805 381 -657
3505 -657 -584 443 738 -84 -772 -144 803 424 -536 -687 321 770 -42 -885 -214 772 537 -566 -720
3524 -720 297 820 -37 -804 -305 667 504 -510 -761 196 805 109 -751 -340 717 573 -456 -725 236
$$ packed form
3394H81k35j291k26J154O92r41r47M68J253j05j189m85J127Q61q26j099M04J260
3412G56K9j257m24J036Q38p01j102K32J228J60j102n98R50Q87n93j155J98J153
3430E35K33j077n67Q42R16n66j050J11J158L04j012p39P56R87l58j129pJ163L69
3449H69j008p50O39J043l03j109j25J073N04q39q74N51R98l2j192k65J068O38
3467H86q32r12N20R99j16r81l86R82O85o56r35L03J009J43j114l95R07P03o26
3486A84r15K65J001J25r82n01P86Q17n59q89R0J009L05r33o60Q01Q61m24j038
3505f57P3J027K95q22o88O28R47l79r60j51J008M49q12q43O71R86k35j103j54
3524g20J017N23q57p67M99R72j63j014k51R57O09o96q60M11J057j44j029k69R61
$$ plain form
3543 236 791 150 -741 -362 608 614 -359 -768 85 814 233 -742 -464 563 699 -338 -864 37 784 170
3563 170 -705 -499 519 674 -233 -729 -53 799 342 -615 -536 493 729 -192 -785 1 769 328 -586 -517
3583 -517 425 682 -190 -771 -131 623 387 -551 -581 361 709 -104 -764 -184 660 421 -485 -526 258 647 1
3604 1 -672 -238 563 455 -378 -645 198 692 90 -672 -290 591 457 -394 -659 109 697 61 -640 -371 494
3625 494 526 -257 -605 45 645 198 -560 -384 451 570 -280 -613 27 638 235 -518 -363 338 539 -119
3645 -119 -659 -115 618 358 -516 -478 302 645 -140 -649 -97 547 345 -426 -481 215 612 -39 -548 -219 596
3666 596 457 -351 -557 221 604 62 -564 -276 504 473 -320 -533 158 637 96 -530 -311 446 482 -340 -612
3687 -612 70 638 180 -603 -358 491 502 -249 -588 52 602 191 -477 -395 396 647 -198 -598 -21 675 287
$$ packed form
3543B36N55o41q91L79R70Or73m09Q53P29n81r75K78J027J36j037n26R01P47o14
3563A70q75K06J018J55r07m96O76Q52m57r57P9J029K36r21n93P86P68m41r14O9
3583e17R42K57q72n81O40P54k36r38l0R42L48q13o60N80Q44k39r06m1P84L89o46
3604Ao73M34Q01j08q33k67Q43M94o02p62L82Q81j34q51k65P68N88o36p01K69Q65
3625D94L2p83l48O50O00m47p58J76Q35J19q50l33O40O11m03p53J55P01K01o58
3645a19n40N44P33k60q74L8P80L43p85n09N52O44k02p71n5O96L97o51n09L29Q15
3666E96j39q08k06P78L83n42o26K88P80l1p93k13O91M79n41o26K19P57L6q22k72
3687f12O82N68m58p83K45Q49J1p51l39O40N50m11o68Q2P91K51q45m00N77O96l88
$$ plain form
3708 287 -554 -438 393 613 -184 -599 -77 564 275 -451 -436 331 509 -94 -606 -90 583 278 -482 -484 281
3729 281 608 -97 -586 -41 565 309 -389 -469 255 576 9 -595 -178 554 381 -403 -492 214 566 53 -546
3750 -546 -187 478 398 -268 -467 91 547 67 -488 -279 438 442 -250 -546 116 570 130 -468 -224 405 474
3771 474 -250 -462 35 479 175 -423 -423 266 511 -162 -530 -37 530 203 -461 -297 287 421 -195 -528 -58
3792 -58 445 269 -373 -373 197 490 -24 -473 -79 473 284 -336 -399 209 420 -41 -392 -165 347 250 -279 -480
3814 -480 90 448 21 -454 -226 417 339 -256 -429 91 445 89 -367 -190 377 392 -154 -432 74 485 266
3835 266 -364 -324 344 432 -163 -502 6 499 130 -438 -301 272 383 -131 -448 -81 403 213 -330 -396 269
3856 269 425 -47 -461 -82 433 188 -321 -333 260 419 -23 -417 -132 402 269 -293 -369 166 466 -32 -488
$$ packed form
3708B87q41J16Q31K20p97m15N22O41k89p26J5P67J78o03n12N16O73l05p60kP65
3729B81L27p05m89N45O06k56o98q0P24L21n67o04M17P32j73p84q9P06L52n13n99
3750e46L59O65q0o66j99N58M56m80n55K09P17Mo92k96O62M54m40n98K44O29O9
3771D74p24k12M97M44l04n98%O89K45o73l68M93N67l27o64J64N84J34o16l33M70
3792e8N03j76o42%N70K93n14m49L94N52j89o20o3O08K11m61l51K27N12r7n29k01
3814d80N70L58m27m75K28O43p8n95j73N20L54l56m56J77N67J5n46k78N06M11k19
3835B66o30M0O68Q8n95l39N08M93l69n68J37N73J11n14l17L67M84j90n43o6O65
3856B69J56m72m14L79N15k45n09j2N93J59m42l94K85N34j33n62p6N35L00m98m56
$$ plain form
3877 -488 -131 397 328 -234 -376 169 396 49 -363 -185 316 350 -155 -424 104 497 89 -433 -243 362 326
3898 326 -227 -390 155 436 116 -398 -263 282 326 -151 -405 17 440 141 -407 -323 301 435 -173 -415 49
3919 49 425 158 -323 -238 250 399 -87 -398 -32 410 236 -309 -275 223 411 -88 -398 -60 353 178 -269
3940 -269 -304 158 319 -69 -339 -125 316 233 -283 -329 140 415 -34 -365 -74 323 216 -268 -247 123 405
3961 405 30 -252 -184 202 293 -152 -303 48 390 75 -336 -175 249 269 -188 -308 -11 288 151 -316 -221
3982 -221 191 310 -74 -383 -50 387 199 -267 -252 225 371 -99 -323 -63 275 122 -268 -212 131 297 -45
4003 -45 -348 -95 326 234 -187 -296 123 307 -18 -326 -123 259 147 -153 -294 148 405 47 -302 -166 249
4024 249 280 -188 -337 81 331 9 -309 -135 306 251 -148 -283 30 343 94 -279 -234 204 263 -73 -349
$$ packed form
3877d88L57N28o9n62j42N45K27l47m12J78N01L4n05k69N28L93m08n22J90O05l6
3898C26n53j63N45K81l20n14J35N45M4m77k54M22M23k99n48Q4O24J34o08k42M64
3919D9L76k67m81Q5M88J49m86l11L66M42j74n45L4M98J88m99l10L38M13j75m47
3940b69l5M62J61l88k70K14M41q3n16m6M69K75m49l31K91L97j07m84K1L70K82
3961D05l75k82O8L86R1m45j51L51L42l15m11J61M24K0m57j20K97K99j37m67R5
3982b21M12J19l84l09L33M37j88m66J5M77J46m70k24K60L38j53l90N6L43J66l42
4003d5l03K53M21r2m21j09M19J84l25l08K03L82j12l00j41M42K57l58l49J36M15
4024B49L1m68j49M18K50l22l18J74M41n5l99j35L13L13k49l73M5M38N9l36k76
$$ plain form
4045 -349 -25 359 134 -341 -236 225 273 -145 -300 43 261 171 -229 -222 164 300 -57 -359 -56 282 198 -293
4067 -293 -235 196 273 -100 -330 -82 275 133 -206 -302 90 313 -28 -326 -135 293 168 -210 -192 85 254
4088 254 -13 -290 -66 231 180 -185 -246 75 286 27 -255 -118 264 182 -198 -263 83 264 37 -283 -118
4109 -118 187 177 -125 -276 -29 221 63 -250 -203 177 273 -125 -254 70 266 116 -196 -175 159 279 -72
4130 -72 -260 -59 234 143 -169 -167 118 276 -31 -254 -121 253 162 -194 -270 108 249 -31 -201 -79 203 166
4152 166 -143 -235 71 232 46 -271 -127 212 166 -164 -268 15 216 41 -208 -97 177 177 -67 -227 -24
4173 -24 254 48 -219 -192 213 225 -120 -252 49 226 48 -220 -131 168 237 -40 -186 -48 280 116 -229 -223
4195 -223 144 230 -47 -270 -28 240 132 -162 -178 43 199 -24 -231 -61 268 192 -182 -176 76 254 19 -220
$$ packed form
4045c49L24L84k25m75J05M61M8m18j55L43K18r0m00PL86J36l57l02L03L38q4m91
4067b93N8M31P7l73k30K48L57j42l39r6L92K23l41k98J91M28j25l78J8K77J69
4088B54k67k77K24K97n1l65o1L21K11k59k82J37L82q2l80o5L46J81k27l20J65
4109a18L05j0l02j51K47K50j58l13M7L80R6l98j29L24J96j50l12K1L34J20l51
4130g2j88K01K93r1l12KK85J58l07k23J33L74r1l56p6L78J41k80j70J22K82l7
4152A66l09r2L06J61j86l17J44L39m6l30j04K83K01j75k49J11K74%k44j60K03
4173b4K78k06k67K7M05J2l45j32L01J77j78k68Q9K99O9k77j46J38L28j64l45O
4195b23L67Q6k77k23K42K68j08k94j6K21J56k23k07J70L29p6l74OK52J78k35k39
$$ plain form
4217 -220 -71 246 128 -172 -186 42 226 13 -183 -170 145 217 -129 -273 93 244 19 -199 -105 186 128 -124
4239 -124 -206 13 159 73 -200 -102 158 177 -45 -202 -18 236 41 -224 -143 172 223 -151 -259 66 216 3
4261 3 -93 -171 95 176 -48 -187 -7 229 94 -189 -151 90 222 -54 -160 -61 135 110 -137 -141 81 172 5 -176
4285 -176 -36 177 108 -162 -169 115 166 -21 -133 -41 162 91 -88 -113 26 88 2 -139 -28 144 155 -72 -205
4308 -205 66 200 8 -182 -79 148 159 -17 -154 61 131 100 -143 -88 149 203 -43 -227 -16 196 83 -208
4330 -208 -158 80 97 -56 -139 -106 136 105 -76 -145 60 164 23 -140 -45 136 99 -116 -136 61 157 5 -165
4353 -165 22 157 102 -70 -183 -48 230 33 -150 -127 101 140 -127 -158 40 168 19 -128 -89 107 144 -51
4375 -51 -140 6 177 -6 -146 -93 136 145 -132 -181 35 162 61 -158 -62 131 140 -38 -107 21 172 31 -96
$$ packed form
4217b20J49L17j18l00j4K28J84k13j96J3L15P2l46j44L66J51k25k18R4K91n8k52
4239a24q2K19J46q6k73R8K60J9k22j57J84K54j95k65Q1L15N1l74j08L25J50k13
4261Cr6p8K66Q1k24j39J80K36j35k83L8K41J32k76j06R9J96k5k47mK22R1j67j81
4285a76J40K13o9k70pK84N1j87j12R2K03p1j79k5J39O2q6j41J11J72J1k27j33
4308b05K71J34j92j90J03K27J1j76j37K15P0l1k43N5K37N4k46j84K11K12j13k91
4330b08N0K38J7j53q3L3K42l1j81o9K05J04j41j63R5J81l7k15k0J97R6j52j70
4353a65J87J35n5j72j13J35K78j97j83K3K28L9k67l1J98J28j49j47L9J96L7j95
4375e1q9J46J71j83j40N3K29Rk77m9K16J27j01k19R6J93Rj78o9J28J51j41j27
$$ plain form
4398 -96 -134 64 173 -51 -187 -31 186 102 -139 -109 80 155 -13 -146 -62 179 96 -124 -129 61 167 -46 -230
4421 -230 -6 138 88 -165 -161 54 154 -9 -120 -41 55 82 -98 -126 -14 218 23 -146 -27 159 148 -71 -100
4444 -100 10 125 -16 -144 -47 70 89 -99 -179 -29 43 60 -134 -117 66 150 -68 -130 26 110 -14 -116 -113 75
4468 75 151 -15 -93 -10 131 83 -83 -83 79 145 -11 -158 29 139 70 -64 -126 51 147 16 -126 -113 46 92
4492 92 -59 -105 31 102 12 -118 -56 103 31 -87 -92 12 101 -18 -120 -92 120 97 -24 -148 0 159 34 -93
4516 -93 -49 61 83 -30 -140 20 129 59 -77 -107 49 69 20 -110 -20 153 111 -43 -115 109 135 -4 -83 -24
4540 -24 74 64 -78 -109 -14 124 -10 -131 -63 83 104 -82 -90 26 160 26 -134 -26 127 108 -57 -106 46 81
4564 81 -28 -81 -50 73 113 -11 -120 66 140 33 -69 -64 110 53 -13 -31 -25 127 32 -80 -113 70 98 2 -84 -2
$$ packed form
4398i6l8J98J09k24j36J56K17q4k41L0J89P5j68j33Q4K41q3k20nJ90J06k13j84
4421b30K24J44n0k53MK15J00j63j11P9R6K7j80k8J12K32j95j69J19J86j1k19k9
4444a00J10J15j41j28R7J17J9j88q0J50P2J7j94J7J83Q4k18o2J56Q4j24j02LJ88
4468G5P6j66p8Q3J41m8j66%J62O6j56j47J87J10o9j34o2J77R6j31j42J3J59M6
4492I2j51m6J36P1r0j30O2J59p2j18nJ04Q9j19j02K8K12k3j21j24J48J59j25j27
4516i3M4J10K2j13j10J60J09p0j36l0J56K0m9j30R0J73m2j54p2K24K6j39p9N9
4540b4R8j0j42l1R5J38j34j21O8J46K1j86qJ16J34j34j60J08J53j9j65m9J52L5
4564H1j09n3L1J23M0j24j09J86P4j07j02NJ74n7o6j8OJ52r5j12l3J83K8r6q6Q2
$$ plain form
4590 -2 78 62 -102 -37 124 36 -53 -115 -13 52 79 -112 -80 87 105 -19 -100 -26 132 85 -58 -63 62 61 -17 -83 -29
4617 -29 96 21 -72 -53 47 144 -22 -135 -35 45 66 -130 -136 38 100 -16 -45 -2 68 60 39 -11 3 48 55 -119 -54
4644 -54 81 111 -35 -116 18 109 20 -82 -6 75 80 -51 -70 -32 23 48 -35 -86 34 74 -23 -51 18 67 41 -54 -46 15
4672 15 91 -41 1 -30 55 94 -80 -123 77 62 -4 -106 -13 45 94 -22 -89 63 93 3 -23 -9 33 45 15 -27 30
4699 30 58 79 -71 -68 59 61 -35 -102 8 88 53 -63 -31 24 64 -7 -54 -48 99 28 -72 -45 27 134 -17 -88 -30 79
4727 79 100 -41 -17 104 65 -11 -72 -19 42 66 -22 -89 6 118 1 -132 11 118 45 -47 -37 60 52 -11 -81 -46 111
4754 111 85 -82 -78 5 73 1 -121 -24 70 62 -28 -47 11 105 17 -34 -51 63 91 -37 -104 43 140 36 -42 -34 73 35
4782 35 11 -19 47 75 74 -83 -19 39 97 -26 -53 -11 61 4 -28 -60 32 67 -8 -36 1 53 26 -26 -7 21 66 51 -53
$$ packed form
4590bQ0j6j64O5J61q8q9o2J02O5K7j91L2J67J8j24q1P4J58m7j43nJ25jp8o6N4
4617b9J25p5r3J9J00R7j66j13J00Q0K1j96oJ74O2j16k9M3P0qk1n0J4M5Pj74O5
4644e4J35L0j46q1J34R1q9j02P6Q1Nj31j9L8N5K5q3n1J20M0r7k8O9M9k6r5QO1
4672A5P6j32M2l1Q5L9j74m3K00j5o6j02R3N8M9j16o7J52L0r0k6J4M2J2l0m2N7
4699C0K8K1j50LJ27Kr6o7J10Q0l5j16L2N5M0p1m7OJ47p1j00K7P2J07j51p1N8J09
4727G9K1j41K4J21l9p6o1N3O1K4q8o7R5J12j17j33J43J07p3r2J0R7qo3p0L5J57
4754A11k6j67MQ3O8p2j22R7R4qr0j9N8R4q8n1j7J14K8j28o7J47R7j04p8QJ07l8
4782C5k4l0O6K8jj57O4N8N8j23k7M2P2n7l2l2R2L5p5k8L7N2k7n2J9K8M5j5j04
$$ plain form
4811 -53 -56 64 88 -32 -34 21 96 -6 -21 -19 28 22 -28 -62 62 7 70 5 -64 32 45 -18 -100 -6 37 13 -64 -48 35 22
4841 22 -20 -40 11 -25 65 -15 -73 34 93 2 -74 -29 51 44 -50 -19 36 85 -9 -43 -21 28 30 -21 -47 37 127 -31 -92 -42
4871 -42 88 49 -96 -107 29 25 5 -43 -5 74 33 -30 -52 21 76 21 -59 -60 73 107 -14 -51 15 53 10 -66 -27 28 37
4900 37 -60 -75 50 28 32 -49 -103 44 113 -30 -76 -34 69 56 -24 -57 24 18 1 -57 8 68 44 -61 -110 4 56 -9
4928 -9 -86 8 41 25 -47 -71 25 39 7 -17 1 -40 31 -18 -84 26 85 17 -42 -22 52 33 -24 -46 40 14 6 8 34 72 -2
4959 -2 -18 -47 46 15 29 19 -15 12 -1 8 -16 -19 49 -8 -79 -6 -6 9 -4 -4 -28 68 76 -59 -104 8 39 28 -24 5 52 25
4991 25 -26 -28 58 19 3 -22 5 -13 41 -14 -37 -15 80 47 -3 -95 43 39 -36 -10 10 15 9 -42 -43 7 4 -67 -51 3 89 16 -77
5024 -77 -31 37 43 54 -45 -10 16 50 -14 -102 38 86 53 -45 -9 46 41 -67 -23 26 90 2 -64 18 31 17 67 -60 48
$$ packed form
4811e3lJ20K4j20kN5P5j02j5KM7on0l4J24n5O3o5o9R6J3o3q2R4M3k4p7J6Q3j3
4841B2m2k0N1l6R0q0n8J07N9r1p6M5Q0pr4L1N5M9r4l4K2M9Kn1k6Q4R0j58o1N0
4871d2J30l9j45j1J36mk0m8L8P9m1o3k2P3N5n5q0jJ33L4j21l7O6L8m3p6L9N5R
4900C7r7j5J25k2Mq1n4J47O9j43m6M2J03j3q0l3Q1oj7n8O5O0k4j05m9J14N2o5
4928ip7R4L3j6p2k4R6J4l2k4J8m1P1m9o6J10N9o8n9K0P4j9n7k2Q6k6qKK6L8p4
4959bj6k9R3l1J4j0l4K7j3Rk4lO8n7p1P3%J5j3%k4R6Qj35m5J12L1j1n2K9M7k7
4991B5n1kQ6l9j6k5K7j8N4n5k3K2R5l3n0r2J38mp5K6K0Non1jN0lp1J6N4Q6p3r3
5024g7M6O8OJ1r9L5K6L4o4q8J40M8l3r8L6N5nj08M4M9O4q8o6Q2J3j4N0j27J08
$$ plain form
5053 48 70 -21 -86 -66 24 47 -9 -79 -24 70 22 -78 15 -10 75 -42 -20 23 38 -16 -77 10 27 95 -9 -57 24 -9 23
5082 23 -35 -60 36 -5 30 -60 10 50 -8 -13 -31 85 22 28 -82 18 106 13 -102 -55 -27 32 -27 -48 0 36 75 -30 -36
5111 -36 75 79 0 -70 22 35 68 -69 -1 64 112 -15 -25 -10 30 55 -11 -39 -31 75 30 -55 -22 26 32 7 -61 48 15
5140 15 -33 -16 -16 -1 -1 28 -41 -20 27 48 2 -30 20 17 -37 -9 -3 50 -63 -25 32 54 -21 9 -40 -49 3 27 -30 -3 10 86
5172 86 8 -54 -19 21 56 10 -23 -9 42 5 -7 7 -20 44 -29 -53 -32 80 -4 -44 -30 53 53 8 35 -71 5 21 -33 0
5202 0 12 22 14 -57 -53 90 46 -53 -37 4 37 15 -29 -23 89 37 -18 -22 35 31 25 -81 4 92 -40 -24 -95 41 57 -46 -61
5233 -61 -12 45 -1 15 26 20 36 -31 -43 10 92 14 -2 1 81 48 -48 -47 -53 59 36 -48 30 2 105 -21 -39 -59 36 75 -45
5264 -45 -91 -34 36 -21 -82 -12 58 -19 -44 -63 35 30 13 -34 -39 27 22 -37 -91 49 51 -18 -67 39 92 35 -68 -23 50 17 27
$$ packed form
5053D8K2r1o5K0R0K3n6p0N5R4m8j00R3k5Q5j17K2M3J5n4o1Q7J7O8j04m8Q1l3L2
5082B3n8k5R6m1L5r0P0M0n8nj8J16o3Oj10J00Q8r3j15M7K8N9n9k1M8L6L9j05o
5111c6J11Mp9p0R2J3L3j37O8O5M8j27j0J5M0K5o6k8QJ06m5q5L3M8Ok5o8J09l3
5140A5m8J7%J5%K9o9K1M7K1m6l2N0ln4K8ON3j13L8N7K2p5L0m9rN2K4n7K7J3P6
5172H6p8o2L5M0L5m6l3J4N1l7j2J4k7O4p3k4K1J12q4m0J4Q3%m5K7j06P6J6n4L3
5202@J2J0qp1MJ43m4r9J6M1L3k2m4OJ12n2n5mN7moj06Q5Q8j32J6p1J36J6j03j5
5233f1M9N7m6J6J1oJ6o7j2N3Q2p8j6LQ0l3r6JoJ12k3q4P8k8J03j26j8k0R5L9j20
5264d5m6N7P0n7o1P0P0p7k5j9R8nj7m7nO6nn9n4J40Ko9m9J06N3n7j03M5P3l3J0
$$ plain form
5295 27 -2 -9 -4 56 -26 7 -13 67 -36 -34 -12 17 44 -18 -55 37 8 32 6 1 -53 0 32 -12 20 15 53 16 23 53 18 14 -44
5328 -44 -14 48 24 21 -13 20 8 18 22 -39 3 97 -9 -52 -1 63 33 -72 -26 11 14 18 -30 -6 -37 32 -5 -125 5 17
5358 17 24 -21 -6 28 56 -42 -18 24 63 -15 -18 3 66 -1 -42 1 26 63 -15 -43 -40 27 100 -35 -44 4 -3 -21 -70 -45 9 36
5390 36 -35 -58 -49 88 23 -31 -56 15 21 -70 9 37 52 19 -65 8 30 54 43 -28 -58 69 65 -7 -41 69 140 -34 -75 -4
5420 -4 21 17 -96 -45 19 29 13 -14 -47 5 8 -4 -39 19 39 20 -64 5 52 80 -79 -75 6 16 -22 -61 -22 20 12 -12 -28 18
5452 18 75 -7 -43 -7 33 41 11 -37 39 9 -27 -48 33 4 25 -18 -17 29 -10 48 -39 -25 39 26 3 -40 3 52 28 -25 30
5483 30 54 -39 6 4 -56 25 21 -36 -53 -37 47 1 2 5 17 56 -8 43 3 44 82 5 -7 -13 57 -43 -53 -2 8 -10 -45 -5
5515 -5 2 52 -73 4 -9 20 37 2 -88 -8 4 23 -18 -8 33 -30 -33 -40 24 44 34 -21 50 -1 56 -1 -20 -31 82 10 -77
$$ packed form
5295B7k9pNO0q2L3k0Q0j03KK2K9K7o2l7R2k9K4k6nn4N3L2m4L2nL8l7PL0l5mn8
5328d4L0O2k4ll4L3j2J0Mo1M2R4j06m3N1O4l0j05M6L7LMm8K4l1O9l7j20J30J2
5358A7Pm5J5L4K8r8K4M2L9p8lK1O3o7m1M3K5L7p8k8LO7P3j35rM8pj8m9K5N4K7
5390C6p1k3RJ37o5n4k5P1Or1P9K8J5l3q4P3K2K4j1p1l0J27mp2l4J10P1j74m1P1
5420dK5mj13N1O4J0j6k7l3N2Lj2l5N8K0j9q4O9M7K8j59MQ1J0l8l9L9M2qk4j6M6
5452A8N7q2l6L6M0Ql0m8P6l0l6k1Q1k9K1m3JM6l9N8q7J4O4j3k3m3M3M9k4n3N5
5483C0K4r3M5ko0Q1mn7j7J6Q4m6JLJ2L9o4N1m0M1L8p7j2oP0j00j0N1J0j8l5M0
5515ePN0j25P7j3K9J7l5r0Q0J2J9m1J0M1o3lpO4K0j0n5P1n1N7n7j9j1J13p2q7
$$ plain form
5546 -77 16 84 46 17 -14 30 71 -28 -24 -3 -34 -22 31 7 13 63 31 -102 -21 102 58 -51 -61 2 64 -36 -45 59 17
5575 17 -4 21 -81 -10 85 56 -53 -10 50 54 -41 -72 72 100 -2 -10 1 43 9 2 -36 4 54 0 -5 -43 27 31 -10 -39 -19
5606 -19 37 42 -90 -50 16 34 -30 -25 26 60 11 -50 -11 -7 74 -47 -10 37 87 9 -38 -29 53 6 -7 -18 26 55 -21 53 11
5637 11 46 -12 -48 -20 17 86 -17 -96 24 -11 72 -6 -46 1 5 3 -5 -84 -6 23 -63 8 -23 52 50 0 -32 39 48 8 -28 -19
5669 -19 -35 54 10 39 -35 39 44 21 -58 -30 41 -32 -24 25 39 -12 -3 -75 5 19 -27 -3 -38 -19 76 7 -32 2 60 27 -38 -35
5701 -35 70 53 -18 -23 -9 20 -13 -56 -45 47 12 -44 -36 -39 61 11 -63 37 69 29 -2 -26 52 24 31 17 -68 10 27 16 -63
5732 -63 -57 42 13 -71 -24 2 31 -64 -50 39 80 41 -45 15 10 62 29 -71 -67 80 81 -78 -79 8 68 20 -46 45 51 -16 -1 38
5764 38 45 58 47 -16 -54 -3 75 -51 -53 37 53 -53 -43 9 113 -21 -75 -28 11 -32 -63 -53 -56 0 42 -41 -36 5 50 -7
$$ packed form
5546g7R3O8l8k9l1M4M1r9MK1l1J2N3k4ON0l2j33Q1J23m4j09j0O3O2j00rJ04m2
5575A7k1K5j02P1R5k9j09M3O0Mr5l1J44K8j02qJ1M2l4pl8M0N0n4nl8P0Mm1k9K0
5606a9N6Nj32M0O6J8o4NN1L4m9o1L9MQ1j21L7M7N0p8m7RQ2m7j3j1M4K9p6P4m2
5637A1L5n8l6K8L7O9j03p9J20l5Q3p8m0M7Mkqp9P8K9q6P1l1P5kn0l2P1Rm0l6R
5669a9j6Q9m4K9p4P4Nk3p9K8P1p3QM9J4n1Rp2Q0J4m6K4l5J9R5o9l9L4N8l3o5L
5701c5J05j7p1nJ4K9l3m3J1R2l5n6QlJ00n0p4J00L2m0l1k4P8k8Pj4q5P8J7j1p9
5732f3OR9k9q4M7K6K9r5J4Q9M1l9q6O0nN2l3j00MJ47Jj59jQ7O0m8o6R1Oo7J5L9
5764C8PJ3j1o3l8N1P8j26kR0J6j06J0N2J04j34n4M7L9m3l1J0lN6M2q3NM1M5n7
$$ plain form
5794 -7 -54 -4 49 22 -52 -32 54 32 -34 -35 72 17 52 15 -23 28 36 36 -39 22 37 38 -32 26 8 23 -13 28 -9 -44 8 23
5826 23 -22 -23 31 2 -45 -2 62 1 6 0 27 -45 33 18 13 -5 -4 -2 13 -23 -4 60 -25 -44 41 15 24 24 -19 -7 -70 23 -8 -4 17
5861 17 33 3 -1 25 26 43 -79 -38 27 12 -65 -13 79 11 76 -50 -69 18 104 1 -56 -27 76 65 -82 -47 69 48
5889 48 14 -29 30 54 -20 -36 1 12 21 23 -26 -1 99 -2 -66 -11 -13 16 -49 -6 5 30 21 -16 -44 51 74 -7 -42 13 84
5920 84 33 -66 12 68 40 -61 -21 32 54 7 -19 -4 79 5 -9 -48 -6 50 59 1 -80 1 26 -46 -11 7 61 1 -72 12
5950 12 68 27 12 -40 3 59 19 -36 -4 51 98 -16 -64 57 6 50 -27 19 79 59 -58 11 31 -30 34 26 3 37 13
5979 13 -45 -23 -12 52 30 -43 -12 16 35 -77 -50 49 8 -20 -10 -30 -31 -16 4 -35 -25 46 23 25 8 1 30 -5 -36 43 -4
6010 -4 -18 10 -48 -32 -18 34 -7 37 57 42 48 -10 31 -2 -4 16 -51 -55 19 5 -17 -59 14 -29 16 -75 -43 -1 60 -98 -84 46
$$ packed form
5794gm7N0N3k7p4K0Q6k2o6jJ07n5L5l7l8N1Q%p5O1J5Jp0N8j8J5l6M1l7l5N2J5
5826B3m5jN4k9m7M3O4o1NoK7p2P8j5nj8JKJ5l6J9O4q5j9Q5k6R%m3J2o3R3l1MK1
5861A7J6l0mK6JJ7j22M1O5j5p7N2R2o8O5j26j9Q7Q6j03n7K9J03j1j47L5J16k1
5889D8l4m3N9K4p4j6L7J1RKm9K5J00j01o4N5kK9o5M3J1K5rl7k8R5K3q1l5N5P1
5920H4n1r9P8N6k8j01M0N3K2m7k6J5Q3p4j4l9M2N6Rn8q1Q1K5p2L5J8N4o0p3Q4
5950A2N6m1j5n2M3N6m0n5L2N5M7j14m8J21n1M4p7M6O0k0j17O9K0o1O4qk3L4k4
5979A3n8K2J1O4k2p3L1K8J9j12K7R9m1k8J0k0jJ5K0l9J0P1k3Kj7pK9l5l1P9m7
6010dj4K8n8J6J4N2m1M4K0j5On8M1l3kK0o7mP4j4k2m2P3m3M5r1L2M2O1j58J4J30
$$ plain form
6042 46 -24 24 -27 -58 -2 57 13 17 19 54 11 -20 -6 54 107 -12 8 3 32 20 -33 -27 40 26 -23 -38 5 74 3 -24 -2 101
6074 101 56 -125 -45 45 34 -45 -38 29 50 47 -36 6 -12 66 41 -19 -55 54 51 -37 3 64 82 -60 -27 24 54 8 17 -8
6104 -8 7 19 5 -76 -38 65 9 -53 -38 95 81 -16 -72 -5 72 -15 -61 -59 57 -2 16 5 -15 84 -7 -64 -30 43 88 8
6134 8 -59 14 50 -20 -22 -1 5 -18 21 -34 47 4 41 -7 6 9 63 22 -25 -25 -15 -16 -24 -16 34 -52 26 -7 13 9 -5 34 5 18 65
6169 65 20 -31 14 -1 1 -4 30 4 -8 14 11 27 -28 44 83 26 -11 29 36 -21 12 74 59 0 12 -35 18 12 46 -4 12 19 50
6202 50 -23 -58 -5 30 9 -50 -52 14 -4 -2 -64 -41 6 -38 7 -16 24 83 56 -54 18 77 -4 -68 -85 27 61 5 1 -3 82
6233 82 -12 -68 -5 0 27 10 -82 -3 -6 21 -72 -2 31 67 -58 -55 30 1 4 0 -39 -3 66 -46 -43 -30 37 32 -58 11 18 19 -45 -49
6267 -49 38 68 -40 -14 11 16 -33 -16 -54 76 65 57 -41 -17 52 33 -15 -47 -10 33 -6 -38 8 34 15 -44 -24 37 41 51 -64
$$ packed form
6042D6p0M8n1l1N6N9m4MKL5m3l1J4O0N3j19K0nK9j2n3OO7j4m9j5M3O9p1k7K2J03
6074A01m5j81Q0R0j1p9PO7K1lq3M2j8P8k5o0l6J09lq8M0O1J8j42L3N1L0m6Rk5
6104hJ5J2j4q1L8J03n6o2J5J33j4r7n6O7P7q7m6KJ16n9J8j1k0R9r1n7L4P3M5q0
6134Ho7P3L6p0kK1Ok3L9n5Q1m3L7m8J3LN4m1m7%J0jqQN0q6P8l3K0mj4L9k9J3M7
6169F5m5n1M5j5KnL4k6j2K2lJ6n5P2L9n7l7M0Pn7L3O2j5n9J2m7N3oL4n0J6PL1
6202E0p3l5N3L5k1n9kO6j8Ko2K3M7m4M5k3M0N9k7j10P2N9q1o4j7J12L4n6mmQ5
6233H2r4n6O3NK7j7r2P9lK7r3P0L3L6j25LQ5k9Lml9L6O9j12LJ3O7nr0O9PJo4m
6267d9Q7L0j08K6K5Nm9J7l8J30j1qr8K4O9j9m8l2L7M3l9l2M6K6j9n9K0O1MJ0j15
$$ plain form
6298 -64 6 47 48 -49 -64 40 80 -13 -17 30 36 45 0 33 31 90 15 -86 -78 59 50 -17 -66 -4 -19 0 17 -21 3 -73 -2 42
6330 42 35 -29 -50 -6 -6 -27 -2 -21 -34 33 24 -21 -8 59 -51 -28 37 11 30 -18 47 57 24 -33 41 2 -3 -5 0 -10 4 -4 8
6363 8 2 -11 -18 -26 -16 -23 72 20 -17 14 60 9 -31 -16 48 -1 -45 30 39 -31 85 5 11 43 -2 9 -54 15 44 -3 -27 -9 86
6396 86 74 -10 -20 37 -7 -10 -23 3 48 9 -15 -63 20 90 -22 -41 6 12 -23 -38 -54 52 6 -1 -50 -18 19 1 12 -28 27
6427 27 86 -9 -21 -34 114 50 -71 -35 44 44 -19 -75 7 77 25 -17 -15 36 60 8 -7 16 58 37 -82 -3 42 47 -33 -84
6457 -84 19 25 -11 -15 -18 42 0 -30 -32 9 64 34 -9 5 80 8 -32 -47 45 38 -11 -18 32 45 -26 32 18 -40 -19 36 -5 -27 -3
6490 -3 -11 -27 -26 51 36 -6 -20 1 -47 -24 -22 25 -10 -24 -30 -32 16 73 41 18 -11 13 31 -9 -17 10 19 0 6 24 38 14 -19 72 -25
6525 -25 9 19 11 0 3 26 -19 -29 -41 -52 -10 5 73 0 -59 8 25 5 20 11 -25 -60 -81 39 -4 32 -36 8 -15 10 52
$$ packed form
6298f4P0M1Jr7j5J04M0r3mM7ORm5L3kN9p5j01QJ37ro7m9O2j5J9J7l8K4p6P1M4
6330D2po4k1M4%k1K5j9j3O7rm5J3O7j10K3O5k6J9m8O5J0l3n7P4l9nkNj0J4qJ2
6363Hoj3pqJ0pR5n2l7L1M6n1m0J5O4m9m4P5Rp0J16q0OL2m5J1o3O9K9m7k4J8R5
6396H6j2q4j0N7m4lj3K6M5l9k4m8Q3P0j12j9M7Ol5j5j6J06m6pm9L2L7j8J1m0N5
6427B7N9r5j2j3J48o4j21L6P9%o3n6Q2P0n2m2KN1K4n2j5K3M2k1j19P9M5Nq0n1
6457h4J03Ol6mlO0m2l0kM1N5l0m3J4P5p2m0j5R2pm9pN0J3p1N8j4n8K1N5m1k2K4
6490cqj6JP7j5m2j4K1m8K3KM7l5j4okM8N7l2k3k9K4J8m0qK7Rj9OJ8J4k4l3R1r7
6525b5L4J0qj1LK3m5j0j2j1M2J5O8p3n9O7J7k0J5rl6l5k1J20m3L6o8M4k3K5M2
$$ plain form
6556 52 -38 -41 -6 76 -22 -79 5 49 18 0 -43 -2 16 9 -14 -53 26 -24 -29 -12 77 48 -40 -70 22 40 7 -39 -25 41 -11 -40
6588 -40 -35 16 27 -32 6 -28 24 71 9 -3 27 58 -40 -16 20 115 53 -2 29 62 2 2 -47 -21 41 13 7 -38 59 56 3 -37
6620 -37 -47 64 69 -48 -9 -15 -29 0 -47 -8 40 8 -62 -12 23 32 8 -53 1 3 -27 -11 -5 15 11 -24 -17 27 48 22 9 -26 9
6653 9 11 25 9 24 17 -17 -6 -4 60 2 -55 8 -10 -20 -9 13 30 -37 5 54 -10 -33 25 -6 -18 2 27 35 -23 19 78 -44
6685 -44 2 -7 30 32 43 38 -2 -44 -21 10 16 19 -25 17 -13 10 1 -22 -41 -3 8 -23 -23 25 26 -9 -29 28 57 4 -23 0 30 -14
6719 -14 -4 -14 -12 10 36 -66 -18 15 36 -8 -28 -1 36 12 -83 40 8 -35 23 41 -8 38 -29 -41 26 3 -34 -24 -26 7
6749 7 -2 -33 -51 4 43 39 -40 -4 64 10 6 -29 28 19 -6 -15 -10 48 87 -44 -78 -7 79 22 -80 27 52 19 -23 -9 -5 43 7
6782 7 27 -23 -4 28 24 -23 8 72 10 -82 17 13 8 -62 -55 23 -4 12 -34 -18 45 -28 1 -38 -16 20 24 -28 -9 13 30 -33 -20
$$ packed form
6556E2r0lL5Q2r8n7Q4M4l1j8m3M1J8pk3l9P9n0nJ7Q9k9q8l0R2J8l3m6J4O6n2k9
6588d0NN1J1n9L8l4N2M7o2j2L0L1r8K4L6R5o2n5L1L3o0%m9K6O2k8om5R7ln3m0
6620c7j0J11Nj17L9oj4K9m7L9M8l2p0N0L5Rk4o1N4Kl0J6OK0ml5PM4K1k6j3l5L5
6653IKJ4j6J5pl4J1KO4n8n7O3j8j0J1K2J7o7M2M9o4k3N8l1j2K0K5Qn8M2N9j22
6685d4M6rL7KJ1nm0m2K3L1OLm4M2l0K3rk3j9L8J1l1%M8Jl5k0N7K9n3k7K3L0m4
6719a4J0j0KK2K6j02M8L3K1m4k0K7L7k4r5J23l2m3N8J8m9M6o7j2O7k3l7J0kL3
6749Grl1j8N5L9mp9L6O8n4ml5N7rk5rNN8L9j31l4P1Q6n7j02J07K5l3m2J4MM8l6
6782GK0n0J9L2mm7L1O4o2r2R9mnp0PP8k7J6m6J6O3p3K9l9K2L6Mn2J9K2J7o3J3
$$ plain form
6815 -20 54 52 -45 12 11 -27 21 21 11 46 35 0 -10 -20 20 -16 -13 8 115 35 -9 -19 28 11 -51 -34 46 -17 -60 -24 -58 -50
6847 -50 42 3 -76 14 33 94 -3 28 69 -6 5 -23 10 -10 0 52 16 25 6 -20 5 -11 36 0 -15 21 38 -29 -12 -33 35
6878 35 -22 -27 14 25 -53 -22 44 50 -16 -27 11 -41 29 -10 -30 5 36 68 -68 -12 36 45 8 -39 25 37 25 17 12 -7 -1 -7 14
6911 14 -21 8 55 16 -21 5 48 -17 -14 46 35 -25 -31 -6 31 -56 -20 -55 16 34 -15 -52 -9 58 13 -58 -65 -14 68 -40 -23
6942 -23 -37 54 48 -45 6 24 42 -13 -5 -57 -14 108 -20 -16 55 77 -40 -38 8 99 -8 -44 0 48 13 14 -54 -12 -5 -38 19
6973 19 -47 -3 14 -18 -42 24 63 7 -106 29 56 54 -28 -48 -5 -14 1 0 -8 -6 76 32 13 28 -21 3 24 -28 10 -35 -10 44
7005 44 33 -25 -12 -8 -14 -9 19 21 -28 2 -33 32 -17 -2 12 -4 -12 -7 38 8 -10 25 48 1 -20 24 12 59 10 10 -11 45 -5 -39
7039 -39 -19 18 38 -10 -12 27 31 -82 -22 0 28 0 -7 9 -24 -22 -30 21 9 7 41 -8 -72 -3 16 27 -19 40 9 0 -7 60 59 -21
$$ packed form
6815b0P4kr7N7jl8M8%j0L5j1l5j0j0M0l6LK1J07q0m4j0M7j7o2J7Q0o3m3L6l4Q
6847e0R2l9p9R0J9O1r7L1M1p5J1k8L3k0J0N2l6Rj9k6K5j6M7l6j5L6J7o7J7k1O8
6878C5n7nM1J1p8L1O6Oo6j1L8n2P0l9k0L5L1L2j36N6M8Rl7m7O4J2j2qnj9OoK1
6911A4l5K9M7l9l7K6M3o5LO0j1o0oK5L7q7L6l5P1J8m9l7M3O7m5p1pN1Q2j08J7
6942b3j4R1or3N1J8J8n5Qn2M3J22j28MP1K2j17KM6R1j07l6M4M8l5Jo8M2Pl3N7
6973A9o6M4J7l2k4O6L9n6j13J35K7kq2k0M3rJ5jqKQ2m4j9J5m9K4K1n2L8m5K5N4
7005D4j1n8J3MoNK8Km9L0l5O5m9J5J4j6qNM5l0j8L5K3m7k1M4j2M7m9%k1N6n0l4
7039c9K0L7K0m8kL9Mj13O0K2K8k8pJ6l3KqN1j2kL4m9o4O9J9J1m6N9l1rpO7jq0
$$ plain form
7073 -21 19 47 40 -3 17 28 -1 79 -13 12 -65 -14 26 -61 -10 3 52 5 -94 46 42 5 -27 15 64 -8 -18 -8 -14 25 1
7104 1 -33 -25 15 39 -28 -60 57 60 10 -58 35 45 29 22 -26 33 -27 21 -25 9 14 32 -16 -34 8 65 34 -17 34 4 30 -71
7136 -71 -42 41 42 -64 -9 -23 29 -29 -11 4 -32 42 13 6 5 -27 29 -5 -34 32 30 4 2 6 19 20 20 -53 47 17 -22 37 23
7169 23 55 -11 -6 60 18 -74 24 -26 12 -28 17 -36 6 35 12 25 -16 -12 40 -12 -6 37 37 -8 13 -34 23 -29 -2 23 -23 12
7201 12 56 19 3 -1 18 3 29 44 32 -31 14 69 49 54 -3 54 -6 -31 -37 11 40 -28 0 27 11 24 -5 -34 -43 -41 -32 -38 26 15
7235 15 49 -26 -35 55 43 13 -31 17 15 45 19 26 -26 46 -7 -39 6 26 38 -59 17 46 91 -56 41 70 15 6 -11 6 19 20
7267 20 -32 -26 29 22 -15 -80 -8 89 39 -20 -14 33 30 20 -2 -42 63 -30 -29 3 21 25 -4 -29 -6 60 -7 11 -25 64 -17 -18 26
7300 26 48 10 -20 25 13 18 -30 -5 -43 -6 17 19 14 10 -5 -28 4 -68 6 16 3 -65 -25 23 41 7 -9 -6 -5 52 -15 6 36
$$ packed form
7073b1M0K8pm3K0J1k9Q0r2K5p7N1M0q7N1J3M9m7r9J40ml7l2M2M9p2j0J0oL9k4
7104Al4QM0K4o7l2J17Ln0o8R3J0j6pm8N9o0M8m6L4NJ8m8j8M2N7l1n1N1l0K6j01
7136g1K9Q3Jj06N5j4N2n8J8J5l6P4k9pjl2N6l4k9O6kk6kMJ3J%p3J00l0l9N9j4
7169B3L2o6NO6m2r2R8n0L8m0M5n3M2K9k3J3m1MN2n2OM3%m5K1m7N7n2K7K5m6L5
7201A2M4l7j6mJ9j5K6J5j2o3M5N5k0Nn7N7o0k5oM8K9o8K8K7j6J3k9k9rKRoO4j1
7235A5L4p5rR0j2l0m4M8kL0k6Pn2P2n3l2M5K0J2r7P6K9M5j47R7K9n5rj7J7J3J
7267B0n2ON5pl7o5P2R7n0n9OM7lj0k2m0J05r3JL2J8Mk9k5K3O6o7J8l6Q9q1jM4
7300B6K2l8l0M5j2Nm8K5l8L7K3Knmj5k3L2p2P4J0j3o8M0M8J8l4j6LJN7o7K1L0
$$ plain form
7333 36 -45 18 38 41 -28 0 26 40 85 10 28 -35 9 7 -2 -4 5 -46 -20 -23 8 0 -33 -37 -32 29 51 -1 -34 -6 2 -47 -29 -4 -7 7
7369 7 -4 13 56 39 24 40 41 6 25 18 38 6 5 -10 -24 3 2 -43 -48 15 32 46 4 32 -34 4 -17 -1 -13 60 0 -57 -1
7402 -1 68 -22 -36 0 50 34 -68 -15 25 30 -27 -21 8 56 62 -1 -8 9 36 -8 -11 0 7 45 -76 -33 -6 15 -24 45 -4 7 51
7435 51 -35 -5 65 0 44 -23 -5 38 -12 -55 -31 17 53 -9 -37 -17 25 33 -13 1 22 49 76 76 38 3 30 -8 31 11 24
7466 24 -8 -39 111 20 -30 -24 58 -2 15 11 -48 25 9 -36 -16 -18 27 33 -56 -29 44 48 -5 -21 44 23 46 3 61 1 26 -58
7498 -58 -32 -2 35 -23 15 33 25 63 -10 -20 42 42 32 17 42 48 8 -21 -15 53 4 -2 4 -41 43 -14 -16 17 -19 40 -50 14 10 9 -65
7533 -65 -62 36 9 27 21 9 -7 -43 54 19 18 71 11 -50 6 77 65 -7 -48 -6 58 -19 -31 20 47 -2 -21 22 0 5 -16 -39
7565 -39 11 62 31 20 -21 16 13 13 -33 67 -31 -44 -13 43 17 9 -31 -53 21 27 55 -21 2 64 51 -14 24 -9 -17 -22 -9 38 27
$$ packed form
7333C6q1O3K0Lo9K8K6J4M5p5J8o3M4krkRn1K6lL1ql3mNO1K2n2l3K8Qm9J8K5lJ4
7369Gj1J7M3j7j5J6Jl5J9pK0l2jj5j4K7jm5nO3J7J4m2K8o6L8k1J6j2P3o0n7N6
7402aO9r0j4L6N0j6j02N3M0Nn7OK9M8Oo3pJ7K7m4lJ1PL8j21M3K7K1l9O9m9J1M4
7435E1q6L0P0o5M4o7J8M3n0m3K4M8L6o2k8K0M2Qm6J4K1K7K7%l8l5K7l8L9k0J3
7466B4l2l1J50r1n0OQ2o0J7mn9P3j6m5K0kM5Oq9K7P3Mn3j6O5k1K3m3N8o0K5q4
7498e8K6L0L7n8L8J8qL8p3j0O2%j0j5K5Om0k9OO8m9oOm5Q4n7kL3l6N9r0O4mjp4
7533f5LR8k7J8oj2j6l6R7l5jN3o0o1N6P1j2p2m1M2O4p7j2N1K7m9j9M3k2Nk1k3
7565c9N0N1l1j1m1L7l%m6J00r8j3L1N6k6qm0k2P4OK8p6K3O2j3o5L8l3qnJ3M7j1
$$ plain form
7598 27 -39 16 -18 50 -35 17 0 32 -3 17 -19 -9 26 -3 -81 -9 66 38 22 20 26 -16 -9 24 44 19 16 34 1 29 3 -62
7630 -62 -4 -52 17 -21 32 -13 -25 22 -11 20 5 -1 -21 -43 -13 -21 25 -32 -12 4 -1 2 -78 23 16 -11 -35 7 -39 31 -26 -53
7662 -53 49 24 -5 -20 18 -38 69 -8 8 9 83 2 1 5 81 19 -49 -2 49 34 -16 -21 -8 21 -4 -7 -7 13 -1 -2 -52 -11 -11
7695 -11 -37 31 6 21 14 -42 42 49 -25 5 -14 -39 -5 27 16 33 5 -5 12 -15 10 13 81 3 13 64 -19 -7 10 51 -18 -14
7727 -14 -52 27 7 -67 -27 7 -1 13 -9 4 -21 1 -13 -17 -25 75 -1 -45 -10 44 -8 -15 21 -24 6 24 23 8 18 31 -18 -4
7759 -4 18 8 21 2 30 62 -6 39 5 -16 -39 -92 6 -25 57 3 -32 -14 -2 -16 0 20 -5 10 -13 -68 -52 -11 29 -35 -5
7790 -5 10 2 -6 -9 2 -25 31 -16 -5 11 6 -21 -3 -26 42 1 -39 -18 15 34 -6 -15 19 2 28 3 -22 2 30 -55 -47 15 18 25 -46
7825 -46 -26 37 19 -34 -21 -6 -9 7 -22 52 27 -1 -4 -3 32 57 19 13 19 41 6 -29 1 7 8 -80 5 16 -10 -56 35 13 52 -14
$$ packed form
7598B7o6N5l4O8q5N2j7L2l5K0l6J0L5k9p8P2P5k8j6kOm2PL3K0k5lJ8l3K8k6o5
7630f2N8m8O9l8N3m5j2M7l3L1j5ok0k2L0qM6n7K0J6nLq0J01pk7k4M2m6P0n7k7
7662e3J02k5k9j5L8n6J07p7J6JP4q1jMP6o2o8M7N1j5n0nJ3K9k5l%K0j4jn0M1%
7695a1k6O8k5J5pn6Q4Pp4L0j9k5L4L2j1J7k8j0J7k7K5LO8p8J0N1q3J2J7M1o9M
7727a4l8P9k0p4M0L4qJ4k2J3k5K2j4mqJ00p6m4L5N4n2pL6m5L0J8jj5J0J3m9J4
7759dK2j0J3j9K8L2o8M5l4k1k3n3R8l1Q2n4l5J8J2j4J6K0k5J5k3n5J6M1M0o4L0
7790eJ5qqlJ1k7N6m7J1J6nk7J8k3O8m1m0K1L3J9m0rL4j7K6k5k5K4K8q5QO2LPp1
7825d6K0O3j8n3J3J5lJ6k9P4k5k8lJL5K5l8oOK2l5l5L0OJq8Q5J1k6m6R1k2L9o6
$$ plain form
7859 -14 -13 -6 -4 37 13 -13 -23 24 -2 -22 -8 -17 31 -50 7 8 67 -59 30 36 -2 -14 -36 7 32 -5 0 -32 -2 50 5 -65 -31
7892 -31 11 -23 21 39 93 -10 -7 24 8 -25 17 -27 -27 -17 -23 -18 7 -4 -7 -12 7 12 42 -38 13 -2 -11 14 16 21 -28 16 -28 17 -18
7927 -18 1 12 -3 2 47 27 61 -8 -51 12 5 -66 -25 18 -26 3 -17 6 17 -39 -15 -21 0 44 14 -1 6 47 13 -5 7 -19
7959 -19 2 -17 48 -8 -7 -20 -19 4 47 16 -9 -4 -11 61 35 19 -20 56 16 13 54 9 -11 -33 10 39 40 38 -4 -54 -29 16 0 4
7993 4 -6 38 -4 18 -29 37 8 -46 -55 44 39 19 -23 -16 39 41 -4 2 43 60 52 -47 36 53 -2 -42 -21 12 34 -79 22 18 1
8026 1 -55 -9 -32 -84 21 4 -10 -24 2 -14 20 -16 27 -5 -32 68 -3 10 -5 3 38 14 9 15 10 -28 77 19 -18 -7 68
8057 68 37 17 23 63 67 24 8 4 -21 11 -48 -19 -23 -20 -33 -39 31 7 -37 -19 -30 34 0 -42 7 11 -10 -52 25 7 1 12 30 22 51
8092 51 11 -24 -2 36 43 -8 -36 6 36 -35 -11 11 34 5 -28 36 -21 -30 36 -44 10 27 0 31 22 10 19 -20 -24 -13 32 16 -73
$$ packed form
7859a4JPKM1k4k6j0M7k6k0J4rM8q1N7JN9j26Q9Ol8j2k2M3K5l7Nl2L0N2m5p0L4
7892c1M2l4M4J8N4j03LL1j6l3M2m4%J0oNK5j1lnJ9NL0q0N1j5rK5KNm9M4m4M5l5
7927a8J9J1j5NM5k0L4o9m3O3pp1M1M3m4K9k0K3J1n6K4oK1M4l0j5PM1l4j8J2k6
7959a9K1j9O5n6Jj3JK3M3l1k5NpP2k6j6l9P6m0lM1m5k0k2M3K9Jkm2n0K5M5j6M
7993Dj0M4m2K2m7O6k9n4rR9nk0m2PN5Km5OM1J7qr9Q3J7n5m0K1L3K2j13J01mj7
8026An6M6k3n2J05j7j4j4K6j6L4l6M3l2k7J00p1J3j5QL5k4nOnl8J05n8l7J1P5
8057F8l1k0OM0Mm3j6mk5L2n9K9mLj3oP0k4m4J8j1O4l4m2M9Mk1m2P7j8oJ1J8qK9
8092E1m0l5K2L8Pn1k8M2L0p1K4K2K3k9l3O4n7rO6q0N4J7k7L1rj2Rl9mJ1M5j6q9
$$ plain form
8125 -73 -62 30 -13 11 11 49 27 -8 -16 -58 30 61 -11 3 20 26 9 1 46 25 -37 -24 -24 52 13 -42 21 4 9 20 -12 -31 20
8158 20 13 -10 -38 29 -7 38 -19 4 35 -26 -64 -46 43 -40 -41 0 -7 6 -29 -44 -9 0 47 -18 -8 4 55 -3 11 42 23 17 22
$$ packed form
8125g3J1R2m3K4%L8k2l5qm2Q8L1p2J4J7Oj7qM5k1o2J3%P6l9n5O3j7NJ1l2j9N1
8158B0pk3k8O7l6M5n7K3L1o1l8J8Q9q3jM1pJ3l5j5L5RM7o5J0J2N1n8J4L1j9oN
8191B2
$$ Imaginary data points
##PAGE= N=2
##DATA TABLE= (X++(I..I)), XYDATA
$$ plain form
0 0 0 0 0 0 0 0 0 0 0 0 0 0 0 0 0 0 0 0 0 0 0 0 0 4 -4 3 -3 4 -4 4 -4 4 -4 4 -4 3 -2 3 -5 5 -4 5 -3 1 -1 2 0 -1 1 -1 0 0 0 2 -6 10 -15 25 -42
59 -42 65 -99 150 -231 368 -598 1026 -1918 4141 -11809 85472 555542 104974 -510154 -151713
74 -151713 386474 188025 -235804 -194619 59125 176583 112827 -135408 -271410 76684
84 76684 394140 -7321 -473573 -61439 500456 122722 -475012 -165146 403544 187641
94 187641 -293980 -182287 162503 155101 -21460 -106796 -112323 46963 227518 18668 -314152
105 -314152 -81441 363623 131791 -375896 -165640 349332 175836 -293081 -164429 211365
115 211365 129973 -117407 -79493 20670 19753 69166 41815 -143543 -95525 198937 137026
126 137026 -229336 -157792 238124 158763 -224745 -137551 195590 99513 -153985 -49245 105993
$$ packed form
0@%%%%%%%%%%%%%%%%%%%%%%%MqPoPqQqQqQqPnNqJ0rRqMkLkjKkJ%%KqJ6k5M0o7
59d2J07j64K49l81N99r66J624k944O059j5950R7281M70070m50568o15128L58441
74a51713N38187j98449m23829M1185K53744J17458o3756k48235j36002L48094
84G6684L17456m01461m66252M12134N61895l77734n97734L09866N68690k15903
94A87641m81621J11693L44790p402j76561q5336n527J59286J80555k08850l32820
105c14152K32711M45064k31832n07687K10256N14972j73496m68917J28652L75794
115B11365q1392k47380L7914J00163r17M9413k7351j85358M8018K94462o1911
126A37026l66362P1544L95916p9361l83508Q7194L33141r6077k53498J04740J55238
$$ plain form
137 105993 -6681 -57692 58748 10677 -102797 29874 130323 -65135 -141248 91237
147 91237 131902 -111220 -105921 124312 66417 -131194 -18693 133149 -29661 -128729 74502
158 74502 120337 -106813 -104143 125404 82380 -125599 -52829 109528 17388 -78568 23322
169 23322 36926 -67521 8246 110086 -52840 -149246 88641 178174 -113499 -195395 121441
180 121441 195091 -113492 -177113 90284 140993 -55124 -88321 13672 24501 30091 46873
191 46873 -67728 -116245 97105 178917 -112278 -225979 113143 253160 -98482 -256189
201 -256189 70623 232925 -34623 -186324 -6710 117958 45810 -36541 -79644 -52255 101582
212 101582 137517 -110362 -211474 104687 265545 -84828 -293066 54431 291672 -16311
$$ packed form
137A05993j12674n1011J16440m8071j13474J32671J00449j95458p6113K32485
147I1237M0665k43122N299K30233n7895j97611J12501J51842j62810r9068K03231
158G4502M5835k27150K670K29547m3024k07979P2770J62357r2140r5956J01890
169B3322J3604j04447P5767J01840j62926r6406K37887Q9533k91673q1896L16836
180A21441P3650l08583o3621K67397N0709j96117l3197J01993J0829N590J6782
191D6873j14601m8517K13350Q1812k91195j13701L39122J40017l51642j57707
201b56189L26812J62302k67548j51701J79614J24668p2148q2351m3103K7389J53837
212A01582L5935k47879j01112L16161J60858l50373k08238L47497K37241l07983
$$ plain form
222 -16311 -258819 -22010 199932 57996 -118532 -84834 25179 100576 71756 -102323 -161181
233 -161181 90507 233056 -67921 -281367 35982 299051 -1451 -286868 -33235 244107
243 244107 61445 -177868 -81334 94266 89653 -2798 -85600 -86525 70803 165425 -46104
254 -46104 -224525 16945 260465 14989 -268062 -43422 249057 65956 -205151 -78784
264 -78784 142317 80722 -67906 -72147 -11285 52880 85243 -27579 -148225 -2306 192463
275 192463 30447 -216469 -54547 217330 70202 -196659 -75254 158528 69689 -107051
285 -107051 -53126 49829 29829 9000 -1221 -61329 -26545 104326 51019 -133577 -67597
296 -67597 148259 74287 -148538 -70798 135182 56374 -112673 -34592 82275 6850 -49535
$$ packed form
222a6311k42508K36809K21942j41936j76528L3698J10013P5397k8820j74079n8858
233a61181K51688J42549l00977k13446L17349K63069l00502k85417K53633K77342
243B44107j82662k39313R6534J75600m613r2451q2802r25J57328R4622k11529
254d6104j78421K41470K43520k45476k83051K24640K92479j83101k71107J26367
264g8784K21101o1595j48628m241O0862O4165L2363j12822j20646J45919J94769
275A92463j62016k46916J61922K71877j47128k66861J21405K33782q8839j76740
285a07051N3925J02955k0000k0829j0221o0108L4784J30871n3307j84596O5980
296f7597K15856p3972k22825P7740K05980p8808j69047P8081J16867p5425n6385
$$ plain form
307 -49535 21304 15927 -47473 14268 67141 -39930 -77731 60017 78131 -73344 -67177 81577
319 81577 47904 -83604 -20586 82400 -9083 -76991 38636 69287 -63233 -58768 79757
330 79757 45594 -86335 -30436 80667 11779 -64936 8135 39427 -30539 -9067 52727 -23845
342 -23845 -74148 53767 92177 -77176 -104505 91447 109863 -93532 -105374 84698 91956
353 91956 -64077 -67747 36162 35839 -3065 2554 -30208 -43561 59980 83284 -82423 -118301
365 -118301 93914 143294 -94529 -156724 82435 154440 -60781 -137505 30913 105158 2226
376 2226 -60640 -34779 8105 63176 47903 -82798 -100497 92745 145475 -90200 -175896 77565
388 77565 189583 -55194 -183332 27138 158084 3381 -115813 -32611 60453 56172 1200
$$ packed form
307d9535P0839n377o3400O1741N2873j07071l7801J37748J8114j51475O167J48754
319H1577l3673j31508O3018J02986r1483o7908J15627L0651j32520M465J38525
330G9757l4163j31929N5899J11103o8888p6715P3071L1292o9966K1472O1794p6572
342b3845n0303J27915L8410j69353k7329J95952J8416k03395j1842J90072P258
353I1956j56033l670J03909l23l8904N619l2762j3353J03541K3304j65707l5878
365a18301K12215M9380k37823o2195K39159P2005k15221p6724J68418P4245j02932
376B226o2866K5861M2884N5071j5273j30701j7699J93242N2730k35675q5696K53461
388G7565J12018k44777j28138K10470J30946j54703j19194Q3202R3064m281n4972
$$ plain form
399 1200 -72838 -64065 79137 119919 -76343 -164193 63862 190870 -44704 -197999 20870
410 20870 184937 4548 -152409 -27651 105047 46859 -46507 -58357 -15068 62755 75274
421 75274 -58252 -126515 46775 164146 -29650 -184327 9345 184991 10615 -167337
431 -167337 -28677 132340 40885 -85592 -47286 30931 45904 24282 -38565 -75426 26033
442 26033 116873 -10405 -144439 -5218 156665 19341 -151990 -28497 133243 32935
452 32935 -101619 -30775 62442 23502 -19268 -11854 -22791 -1945 59616 15156 -88658 -26656
464 -26656 106455 33218 -113565 -34932 109003 30357 -95354 -20902 74125 7318 -48233
475 -48233 8582 21162 -23829 5255 37202 -27632 -45425 45809 48419 -57517 -43922 63901
$$ packed form
399A200p4038Q773J43202M0782j96262q7850K28055J27008k35574j53295K18869
410B0870J64067j80389j56957J24758J32698n8188r3366j1850M3289P7823J2519
421G5274j33526o8263J73290J17371j93796j54677J93672J75646j74376j77952
431a67337J38660J61017r1455j26477L8306P8217J4973k1622o2847l6861J01459
442B6033R0840j27278j34034J39221J61883j37324j71331J23493J61740j00308
452C2935j34554P0844R3217l8940m2770P414j0937K0846O1561m4460j03814O2002
464b6656J33111p3237j46783P8633J43935p8646j25711P4452R5027o6807n5551
475d8233N6815J2580m4991K9084L1947o4834j7793R1234K610j05936J3595J07823
$$ plain form
487 63901 33164 -64718 -16838 61142 -3039 -54654 23435 45533 -42746 -35947 56657 25064
499 25064 -64784 -14609 64273 3266 -55910 7884 39682 -19182 -17571 30740 -7227 -41338
511 -41338 32767 51466 -54508 -58633 71083 63578 -78703 -63664 77521 59061 -66630
522 -66630 -48962 47473 33305 -22458 -13431 -6219 -10410 33956 34904 -58881 -59169 76235 79407
535 79407 -85322 -94135 83943 100624 -72639 -97359 53063 84498 -26654 -61674 -1896
546 -1896 31828 30769 3651 -55095 -39938 73116 74068 -82238 -101880 81664 119932 -72013
558 -72013 -126408 53938 119219 -30925 -99991 4474 69186 21025 -30903 -43674 -11788
569 -11788 60341 53848 -69386 -90811 70478 119343 -62969 -135193 49177 137790 -29539
$$ packed form
487F3901l0737r7882M7880P7980o4181n1615P8089K2098q8279O799R2604l1593
499B5064q9848N0175P8882o1007n9176O3794L1798n8864J611M8311l7967l4111
511d1338P4105J8699j05974m125J29716p505j42281J5039J41185j8460j25691
522f6630J7668R6435j4168n5763R027P212m191M4366R48r3785k88J35404L172
535G9407j64729q813J78078J6681j73263k4720J50422L1435j11152l5020N9778
546a896L3724j059k7118n8746J5157J13054R52j56306j9642J83544L8268j91945
558g2013n4395J80346O5281j50144o9066J04465O4712m8161n1928j2771L1886
569a1788P2129o493j23234k1425J61289M8865j82312p2224J84370Q8613j67329
$$ plain form
580 -29539 -125446 8133 100594 13721 -64861 -32532 22504 46457 21890 -54187 -64121 54461
592 54461 98889 -48722 -123554 36937 134474 -22173 -131657 5676 114926 9563 -86747
603 -86747 -21872 50549 30218 -9790 -33186 -30068 31898 66099 -25931 -93455 17845 110747
615 110747 -8020 -115761 -1048 108867 8306 -91468 -12853 65323 13801 -34519 -12147
626 -12147 1408 7439 29552 -1833 -56259 -4498 75304 9500 -85965 -12496 87580 12842
638 12842 -80257 -9731 66232 4254 -46515 3891 24818 -12290 -2310 20927 -17515 -27209
650 -27209 33828 30243 -45255 -29351 51134 23655 -52307 -14341 48598 1185 -42338 12951
662 12951 33500 -27402 -24287 39338 14784 -47412 -5976 50284 -1666 -46624 8792 37438
$$ packed form
580b9539r5907J33579R2461q6873p8582L2329N5036K3953k4567p6077r934J18582
592E4461M4428j47611p4832J60491R7537j56647j09484J37333J09250j05363r6310
603h6747O4875P2421k0331m0008k3396L118O1966L4201r2030o7524J11300R2902
615A10747j18767j07741J14713J09915j00561r9774P8615P8176n1522m8320K2372
626a2147J3555O031K2113l1385n4426N1761P9802o5804r5465P3469J00076p4738
638A2842r3099P0526P5963o1978n0769N0406K0927l7108R980K3237l8442r694
650b7209O1037l585p5498J5904Q0485k7479p5962L7966O2939m7413m3523N5289
662A2951K0549o0902L115O3625k4554o2196M1436N6260n1950m4958N5416K8646
$$ plain form
674 37438 -14460 -22336 20149 4231 -24736 15976 29256 -35067 -32877 51038 35450 -61787
686 -61787 -36660 65306 35402 -61788 -32169 50115 25244 -32817 -15871 10748 3337 12760
698 12760 10876 -35521 -25906 54735 40554 -67484 -52420 73196 60933 -70045 -63589 59482
710 59482 60601 -41658 -50823 19486 35271 4893 -15104 -28645 -8091 48700 31484 -63697
722 -63697 -53367 70681 70304 -70364 -81007 61854 83499 -46924 -77479 26892 63038
733 63038 -4147 -41380 -18256 14957 38588 14222 -53655 -42231 62977 67049 -64562 -84993
745 -84993 59220 94458 -47610 -94115 31089 83662 -12167 -64594 -7501 38156 24716
756 24716 -8205 -38698 -22994 47100 51430 -49827 -74368 46801 89311 -38750 -94325 27485
$$ packed form
674C7438n1898p876M2485j5918k8967M0712J3280o4323K190Q3915j5588r7237
686f1787K5127J01966k9904r7190K9619Q2284k4871n8061J6946K6619p411R423
698A2760j884m6397R615Q0641j4181j08038J5064J25616j2263j30978O456J23071
710E9482J119j02259r165P0309J5785l0378j9997j3541K0554N6791j7216r5181
722f3697J0330J24048l77j40668j0643J42861K1645j30423l0555J04371L6146
733F3038o7185l7233K3124L3213K3631k4366o7877J1424J05208M072j31611k0431
745h4993J44213L5238j42068m6505J25204N2573r5829n2427N7093M5657j3440
756B4716l2921l0493J5704P0094M330j01257k4541J21169M2510j28061n5575J21810
$$ plain form
768 27485 89832 -13844 -75604 577 54173 11853 -27083 -20996 -1675 27148 29798 -29472
780 -29472 -54106 28178 71911 -24255 -82014 17990 82905 -11231 -75726 4125 60489 1443
792 1443 -40008 -5776 15947 7870 8547 -8248 -30952 7289 49384 -5115 -61271 3266 66731
805 66731 -1388 -64468 1204 56348 -2041 -42776 4484 26117 -7923 -8392 11570 -8777
817 -8777 -15167 22966 17062 -34013 -17289 40012 14418 -41864 -9349 39410 1646 -33859 7492
830 7492 25999 -16992 -16941 26047 8205 -32648 50 36498 -6480 -35875 11650 31205 -14692
843 -14692 -22154 16453 9662 -17134 4911 16819 -20357 -16657 34066 15863 -45324 -15568 51667
856 51667 14750 -52714 -13880 47594 12072 -36883 -9208 21645 5211 -3160 545 -15781
$$ packed form
768B7485O2347j03676o1760P6181N3596m2320l8936O087J9321K8823K650n9270
780b9472k4634Q2284M3733r6166n7759J00004O4915r4136o4495P9851N6364n9046
792A443m1451L4232K1723q077O77j6795k2704L8241M2095n4499n6156O4537O3465
805F6731o8119o3080O5672N5144n8389m0735M7260K1633l4040m69J9962k0347
817h777o390L8133n904n1075J6724N7301k5594n6282L2515M8759l7764l5505M1351
830G492J8507m2991N1M2988j7842m0853L2698L6448m2978k9395M7525J9555m5897
843a4692p462L8607o791k6796K2045J1908l7176L700N0723j8203o1187K9756O7235
856E1667l6917o7464L8834O1474l5522m8955K7675L0853j6434q371L705j6326
$$ plain form
868 -15781 -7063 33972 14714 -48384 -21953 58022 28514 -61150 -33132 57510 34946 -47692
880 -47692 -33570 32185 28208 -13345 -19754 -7478 7929 27164 5430 -44363 -19582 56610
892 56610 32661 -62685 -43223 62142 50100 -54540 -51723 41485 48388 -23541 -39187 3682
904 3682 25625 16717 -8364 -34777 -10318 48727 28567 -57239 -44556 59166 55820 -54926
916 -54926 -61831 44581 60691 -30251 -53403 12941 39906 4644 -21935 -20902 1631 34093
928 34093 19245 -42599 -37723 46430 52650 -44617 -61402 38680 63958 -28823 -59368 17003
940 17003 48631 -4179 -32824 -7969 13637 18031 6547 -25634 -26123 29505 42150 -30409 -53853
953 -53853 27827 59174 -22929 -58290 16518 51221 -9267 -38646 2524 22622 3619 -4338
$$ packed form
868a5781Q718M1035j9258o3098K6431P9975k9508q9664K8018R0642k2564q2638
880d7692J4122O5755l977m1553o409J2276J5407J9235k1734m9793K4781P6192
892E6610k3949r5346J9462J05365j2042j04640K817R3208O903p1929j5646M2869
904C682K1943q908k5081k6413K4459N9045k0160q5806J2683J03722l346j10746
916e4926o905J06412J6110r0942k3152O6344K6965l5262k6579J033K2533L2462
928C4093j4848o1844M876Q4153O220r7267j6785J00082K5278r2781l0545P6371
940A7003L1628n2810k8645K4855K1606M394j1484l2181m89N5628J2645p2559k3444
953e3853Q1680L1347q2103l5361P4808L4703o0488k9379M1170K0098j9003p957
$$ plain form
965 -4338 -7762 -13170 10685 29007 -11512 -40656 11448 47568 -10473 -48929 9019 44862 -7949
978 -7949 -36533 7059 24569 -7149 -11140 7219 -2708 -7863 14916 8033 -24665 -7636 30904
991 30904 6132 -33355 -3274 32215 -559 -27629 5877 20882 -11360 -12558 17094 4229
1003 4229 -21638 3671 24738 -9925 -25555 14143 23463 -16349 -18687 16131 10958 -14632 -1461
1016 -1461 11556 -9461 -8309 20178 4999 -29696 -2377 36577 741 -39870 190 39126
1028 39126 20 -33583 -285 24437 926 -11713 -821 -2496 139 17180 1439 -30577
1040 -30577 -4096 41028 7262 -47504 -10842 48700 13740 -45070 -16081 36036 16604 -23314
1052 -23314 -15346 7569 11909 9089 -6556 -24994 -194 38692 8084 -48001 -15485 52726
$$ packed form
965d338l424n408K3855J8322m0519k9144N2104L6120n8041l8456N7948L5843n2811
978g949k8584M3592J7510l1718l991J8359r927n155K2779o883l2698J7029L8540
991C0904k4772l9487L0081L5489l2774k7070L3506J5005l2242j198K9652j2865
1003D229k5867K5309K1067l4663j5630L9698R320l9812k338L4818n173k5590J3171
1016a461J3017k1017J152K8487j5179l4695K7319L8954l5836m0611M0060L8936
1028C9126l9106l3603L3298K4722k3511j2639J0892j675K635J7041j5741l2016
1040c0577K6481M5124l3766n4766L6662N9542l4960n8810K8989N2117j9432l9918
1052b3314P968K2915M340k820j5645j8438K4800L8886l0608n6085L2516O8211
$$ plain form
1064 52726 22412 -51354 -26922 44814 29110 -33186 -27939 18195 23359 -1380 -16016 -15626 6033
1077 6033 30403 4806 -42078 -16003 48656 25563 -50213 -32772 46146 36357 -37414 -36002
1089 -36002 25023 31659 -10277 -23317 -4731 12590 19002 159 -30417 -12818 38425 24580
1101 24580 -41908 -33594 40925 39122 -35896 -40399 27287 37215 -16600 -30173 4583 19493 6830
1114 6830 -7054 -17038 -6420 24632 19007 -29269 -29375 30467 36502 -28483 -39236 24112 37794
1127 37794 -17456 -31728 10172 22510 -2550 -10730 -4107 -1800 9524 13742 -13297 -23868 15150
1140 15150 30748 -15647 -34201 14574 33312 -12894 -28975 10536 21487 -8166 -12077 6024
1152 6024 1845 -3980 8043 2625 -16343 -1055 22520 -39 -25481 1648 25696 -3230 -22701
$$ packed form
1064E2726l0314p3766K4432P1736j5704o2296N247M6134N164k4739j4636L90K1659
1077F033K4370k5597m6884K6075O4659k3093p5776J7441P8918r789p3771J412
1089c6002O1025O636m1936j3040J8586J7321O412j8843l0576J7599N1243j3845
1101B4580o6488Q314P4519j803p5018m503O7686R928n3815j3573L4756J4910j2663
1114F830j3884r984J0618L1052n625m8276j06N9842O035o4985j0753O3348J3682
1127C7794n5250j4272M1900J2338k5060q180O623K307J1324M218k7039j0571L9018
1140A5150J5598m6395j8554M8775J8738m6206j6081L9511J0951k9653l911J8101
1152F024m179n825J2023n418j8968J5288K3575k2559k5442K7129K4048k8926j9471
$$ plain form
1165 -22701 5379 17523 -7877 -10687 10349 3082 -12959 4044 14617 -10330 -15730 14373
1177 14373 15119 -16635 -13155 16408 9224 -14222 -3724 10469 -2908 -5785 10166 1196 -17021
1190 -17021 3197 23081 -6195 -26949 8040 28502 -8108 -26791 6930 22239 -4753 -14927
1202 -14927 1941 5387 690 4987 -3051 -15804 4114 25234 -4355 -32608 3034 36684 -932
1215 -932 -37110 -1941 33620 4874 -26238 -7296 16100 9045 -3628 -9062 -9147 7990 21641
1228 21641 -5079 -31752 1259 38790 3483 -41688 -8197 40062 12036 -34209 -14857 24445
1240 24445 15611 -12247 -14514 -1434 11232 14813 -6442 -26647 376 35468 6091 -40451
1252 -40451 -12060 41222 17074 -37367 -20030 29991 20933 -19267 -19106 7093 15198 5783 -9263
$$ packed form
1165b2701K8080J2144k5400k810K1036p267j6041J7003J0573k4947n400L0103
1177A4373P46l1754L480K9563p184k3446J0498J4193j3377k877J5951q970j8217
1190a7021K0218J9884k9276k0754L4989K0462l6610j8683L3721J5309k6992j0174
1202a4927J6868L446m697M297q038j2753J9918K1120k9589k8253L5642L3650l7616
1215i32l6178L5169L5561k8746l1112J8942K3396p055j2673n434q5J7137J3651
1228B1641k6720k6673L3011L7531l5307m5171L3491M8259k8026m6245J9352L9302
1240B4445q834k7858k267J3080J2666L581k1255k0205K7023L5092k9377m6542
1252d0451K8391N3282k4148n4441J7337N0021r058m0200J61K6199Q105r415j5046
$$ plain form
1265 -9263 -17654 1948 27291 5686 -33916 -13148 36645 19028 -35603 -23115 30681 24287
1277 24287 -22988 -22824 13171 18455 -2466 -11877 -7838 3967 16801 4699 -23307 -12661 27262
1290 27262 19329 -27856 -23425 25754 24906 -21245 -23209 14883 18796 -7854 -12243 468 4246
1303 4246 5849 3909 -11264 -11821 14762 17810 -16639 -21896 16641 23123 -15133 -21650 12716 17809
1317 17809 -9331 -11722 6007 4825 -2631 2806 0 -9523 2297 15071 -3792 -18492 4719
1330 4719 19629 -5387 -18453 5684 14866 -6294 -9879 6639 3628 -7456 2426 8095 -8143
1343 -8143 -8620 12384 8700 -14805 -7967 15277 6419 -13637 -3706 10604 243 -5964 4064
1356 4064 1238 -8490 3567 12813 -7533 -16337 10107 18553 -11246 -19195 10605 17592 -8648
$$ packed form
1265i263q391J9602K5343k1605l9602K0768M9793j7617n4631J2488N3796o394
1277B4287m7275J64L5995N284k0921r411M039J1805J2834j2102k8006J0646L9923
1290B7262p933m7185M431M9179q48m6151j964L8092L913k6650m389J2711L778
1303D246J603j940j5173n57K6583L048l4449n257L8537O482l8256o517L4366N093
1317A7809k7140k391J7729j182p456N437k806r523J1820J2774j8863j4700K3211
1330D719J4910k5016j3066K4137R182k1160l585J6518l011j1084R882N669j6238
1343h143m77K1004l684k3505O838K3244q858k0056R931J4310j0361o207J0028
1356D064k826r728J2057R246k0346q804K6444Q446k9799p949K9800O987k6240
$$ plain form
1369 -8648 -14165 5282 8722 -1629 -2188 -2321 -5205 5699 12601 -7995 -19099 9073 24057 -8546
1383 -8546 -26600 6835 26590 -3891 -23517 493 17923 3064 -10055 -6070 972 8050 8625
1396 8625 -8810 -17745 8071 24890 -6159 -29832 2974 31312 497 -29696 -4260 24659
1408 24659 7345 -16951 -9508 7411 10408 3115 -9715 -13233 7919 22139 -4615 -28583 774
1421 774 32155 3491 -32095 -7327 28806 10440 -22469 -12344 13729 12487 -3760 -11230 -6621
1434 -6621 8143 15894 -4231 -23522 -642 28315 5417 -30038 -9694 28573 12805 -24011
1446 -24011 -14140 17203 13940 -8722 -11576 -77 7941 8634 -3050 -15816 -2118 20967 7154
1459 7154 -23657 -11373 23682 14024 -21483 -14984 16945 13885 -11168 -11287 4527 6982 1852
$$ packed form
1369h648n517J9447L440j0351n59j33k884J0904O902k0596j1104K8172J4984l2603
1383h546j8054L3435J9755l0481j9626K4010J7430j4859j3119L985P042P078N75
1396H625j7435q935K5816J6819l1049k3673L2806K8338l0815l0193K5436K8919
1408B4659j7314k4296P443J6919K997p293j2830l518K1152J4220k6754k3968K9357
1421G74L1381k8664l5586K4768L6133j8366l2909J0125K6073j242j6247p470M609
1434f621J4764P751k0125j9291K2880K8957k2898l5455K0344L8267j5768l6816
1446b4011R871L1343l263k2662k854J1499Q018O93j1684j2766J3698K3085j3813
1459G154l0811J2284L5055r658l5507O499L1929l060k5053j19J5814K455n130
$$ plain form
1472 1852 -2060 -7754 -3272 12408 8090 -15241 -11942 16439 14385 -15670 -14805 13635 13580 -10361
1486 -10361 -10369 6646 6032 -2741 -859 -823 -4351 3606 8844 -5686 -12442 6602 14159 -6910 -14322
1501 -14322 6444 12355 -5817 -9107 4937 4550 -4255 432 3798 -5129 -3455 9395 3492 -12036
1515 -12036 -3186 13298 2990 -12592 -2144 10419 984 -6773 774 2406 -3018 2199 5398
1528 5398 -6478 -7912 9826 9862 -11931 -11254 12285 11548 -11129 -10721 8501 8549 -4719 -5218 591
1543 591 1032 3780 3879 -7378 -8705 10082 13176 -11091 -16433 10839 18218 -8956 -18075 5914
1557 5914 15866 -2296 -11909 -1778 6283 5244 155 -8135 -7033 9720 13360 -10040 -18475 8944
1571 8944 21833 -6608 -22740 3542 21351 159 -17511 -3591 11745 6684 -4475 -8708
$$ packed form
1472A852l912n694M482J5680m318k3331L299K8381k054l0055Q65K8440n5k3941
1486a0361qJ7015o14q773J882L6l528P957N238j4530o756J9044P557k1069p412
1501a4322K0766N911j8172l290J4044l87q805M687L366q927J674J2850n903j5528
1515a2036Q850J6484j0308j5582J0448J2563r435p757P547J632n424N217L199
1528E398j1876j434J7738L6k1793O77K3539p37k2677M08J9222M8j3268m99N809
1543E91M41K748R9j1257j327J8787L094k4267n342K7272P379k7174r119K3989
1557E914R952j8162r613J0131Q061j039n089q290J102J6753L640k3400q435K7419
1571H944J2889k8441j6132K6282J7809k1192j7670J3920J5336n061j1159m233
$$ plain form
1583 -8708 -3218 9737 10879 -9371 -17360 7684 22008 -5077 -24448 1695 24074 1703 -21308
1596 -21308 -5071 16004 7432 -9222 -8971 1288 9038 6576 -7916 -13670 5663 19166 -2576
1609 -2576 -22385 -716 23321 4156 -21479 -6694 17609 8490 -11810 -8920 5076 8157 2054
1622 2054 -6302 -8764 3563 14068 -444 -17947 -2977 19542 5719 -19176 -7879 16684
1634 16684 8773 -12672 -8479 7425 7089 -1728 -4592 -3709 1597 8521 1815 -12031 -4833 14137
1648 14137 7429 -14493 -8908 13273 9180 -10743 -8206 7361 6039 -3625 -3009 -222 -499 3310
1662 3310 3935 -5756 -7023 7136 9080 -7610 -10015 7249 9563 -6017 -7771 4649 5033 -3021
1676 -3021 -1449 1640 -2276 -501 5836 -210 -8680 570 10338 -557 -10784 366 9736 -420
$$ packed form
1583h708N490J2955J142k0250p989K5044J4324k7085j9371K6143K2379k2371k3011
1596b1308J6237K1075q572j6654K51J0259P750k462j4492n754J9333J3503k1742
1609b576j9809K1669K4037j9165k5635J4785K4303r119k0300K890J3996L081o103
1622B054q356k462J2327J0505j4512j7503J4970K2519j3823k4895J1297K4563
1634A6684p911k1445M193J5904l36q817k864Q83N306O924o706j3846P198J8970
1648A4137o708k1922N585K2181m093j9923K537J5567j322r664O16K787k77L809
1662C310O25r691j267J4159J944j6690k405J7264K314j5580j754J2420L84q054
1676c021J572L089l916J775O337o046q470R250R768j0895j0227J1150R370j0156
$$ plain form
1690 -420 -7516 255 4140 -752 -384 1258 -3729 -2213 7248 3282 -9954 -4473 11475 5505 -11397
1705 -11397 -5945 9983 5900 -7205 -4953 3663 3348 623 -946 -4488 -1940 8000 4939 -10455
1719 -10455 -7841 11473 10082 -11210 -11530 9363 11560 -6478 -10496 2745 7939 1237 -4435 -5057
1733 -5057 224 8204 4409 -10265 -8726 11216 12463 -10534 -14759 8783 15696 -5869 -14846 2337
1747 2337 12431 1443 -8360 -4969 3311 7693 2160 -9555 -7722 10089 12275 -9445 -15855 7412
1761 7412 17514 -4655 -17245 1379 15115 1944 -11135 -4851 6052 7044 -140 -8125 -5601
1774 -5601 8209 10863 -7026 -14755 5121 17086 -2508 -17456 -316 15925 2818 -12800
1786 -12800 -5011 8103 6167 -2876 -6634 -2745 5997 7747 -4618 -11975 2606 14649 -327
$$ packed form
1690d20p096P771L885m892L68J642m987J516R461l966j3236N481J5948n970j6902
1705a1397N452J5928m083j3105K252Q616l15k725j569l542K548R940l061j5394
1719a0455K614J9314j391k1292l20K0893K197j8038m018J3241N194o702n672o22
1733e057N281P980l795j4674J539J9942J247k2997m225K3542O913k1565q977J7183
1747B337J0094j0988r803L391Q280M382n533j1715J833J7811K186k1720o410K3267
1761G412J0102k2169j2590J8624J3736j3171j3079O284J0903R92p184p985K524
1774e601J3810K654j7889p729J9876J1965j9594j4948J7140J6241j3107j5618
1786a2800P789J3114j936r043l758L889Q742J750j2365p357J4581J2043j4976
$$ plain form
1799 -327 -15628 -1897 15009 3926 -12582 -5031 8997 5560 -4443 -5098 -192 3889 4751 -2021
1813 -2021 -8489 -102 10992 2178 -12221 -4076 11867 5121 -10295 -5565 7651 4956 -4427 -3669
1827 -3669 976 1693 2217 594 -4866 -2916 6700 4881 -7519 -6192 7496 6789 -6415 -6294 4941
1842 4941 4970 -3045 -2792 1064 234 533 2530 -1944 -5103 2669 7025 -2925 -8253 2550 8220 -1940
1858 -1940 -7267 1061 5257 -260 -2509 -271 -712 607 3987 -319 -6679 -197 8828 1139 -9700
1873 -9700 -1905 9464 2843 -7917 -3260 5486 3234 -2213 -2735 -1395 1486 4759 86 -7756 -2147
1888 -2147 9605 4018 -10498 -5844 10009 7021 -8366 -7526 5781 7098 -2314 -5735 -1192 3678
1902 3678 4712 -877 -7508 -2091 9624 5219 -10416 -7784 10015 9628 -8413 -10433 5814 10105
$$ packed form
1799c27j5301J3731J6906j1083j6508P551J4028l437j0003o55M906M081Q62o772
1813b021o468Q387J1094q814j4399Q145J5943o746j5416M730J3216k695r383P58
1827c669M645P17N24j623n460J950R616j819j2400J327J3688p07j3204J21J1235
1842D941K9q015K53L856q30K99J997m474l159P772M356r950n328J0803N670j0160
1858a940n327Q328M196n517k249K238m41J319L380m306o360O482R025p689j0839
1873i700P795J1369o621j0760M657Q746k252n447n22J340K881L273m673p842N609
1888b147J1752n587j4516M654J5853k988j5387Q40J3307J317r412l421M543M870
1902C678J034n589o631N417J1715m405j5635K632J7799l87j8041k020J6247M291
$$ plain form
1916 10105 -2548 -8597 -1026 5882 4303 -2473 -7061 -1473 8863 5270 -9527 -8640 8999 11111
1930 11111 -7359 -12244 5020 12087 -1996 -10441 -995 7680 3824 -3930 -6060 -299 7368 4416
1944 4416 -7826 -8132 7251 10910 -5824 -12590 3719 12661 -1349 -11523 -1127 9050 3296
1957 3296 -5570 -4876 1539 5835 2663 -5827 -6374 5219 9475 -3755 -11278 2037 11902 -58
1971 -58 -11004 -1720 9008 3163 -5924 -3979 2292 4086 1444 -3601 -4988 2490 7584 -1155 -9349
1986 -9349 -466 9867 1822 -9258 -2883 7588 3434 -5164 -3316 2405 2708 605 -1431 -3178
2000 -3178 28 5302 1588 -6501 -2971 6990 4027 -6525 -4498 5300 4219 -3617 -3459 1561 1917
2015 1917 414 -148 -2145 -1969 3305 3737 -3976 -5229 4036 6043 -3345 -6052 2408 5280 -1114 -3677
$$ packed form
1916A0105j2653o049P571O908j579o776m588N588J0336l593j4797Q87J7639K112
1930A1111j8470m885J7264P067j4083q445R446Q675l856p754k130N761P667k952
1944D416j2242l06J5383L659j6734o766J6309Q942j4010j0174J0396J0177n754
1957C296q866O94O415M296l172q490n47J1593M256j3230p523J3315R865j1960
1971e8j0946R284J0728n845r087J945O271J794k642n045j387P478N094q739q194
1986i349Q883J0333q045j1080O375J0471m154q598J848N721L03k103k036j747
2000c178L206N274l714q089L530R961k963j0552K027R798j081p836J58N020L56
2015A917j503n62j997J76N274M32p713j253R265K007r388k707Q460K872o394k563
$$ plain form
2031 -3677 -105 1536 1233 1008 -1887 -3468 2114 5648 -1829 -7169 1139 7806 -235 -7487 -852
$$ packed form
2031c677L572J641l03k25k895j581N582L534p477n340Q308O667q041p252O635
$$ [...]
8191a2
##END NTUPLES=NMR FID
##END=
