##TITLE=1H_LY-DMAA_2_29
 CDCl3
 8 sc, 
 8.04.2022
##JCAMPDX= 6.0         $$ Bruker NMR JCAMP-DX V2.0
##DATA TYPE= NMR FID
##DATA CLASS= NTUPLES
##ORIGIN= UXNMR, Bruker Analytische Messtechnik GmbH
##OWNER= root
$$ XWIN-NMR		Version 3.5
$$ Fri Apr  8 10:52:42 2022 Russian Standard Time (UT+4h)  she@DPX200
##.OBSERVE FREQUENCY= 200.13135
##.OBSERVE NUCLEUS= ^1H
##.DELAY= (6, 6)
##.ACQUISITION MODE= SIMULTANEOUS
##.ACQUISITION SCHEME= undefined
##.AVERAGES= 8
##.DIGITISER RES= 18
##SPECTROMETER/DATA SYSTEM= spect
##.PULSE SEQUENCE= zg30
##.SOLVENT NAME= CDCl3
##.SHIFT REFERENCE= (INTERNAL, CDCl3, 0, 15.7039)
##AUDIT TRAIL= $$ (NUMBER, WHEN, WHO, WHERE, WHAT)
$$ ##TITLE= Audit trail, XWIN-NMR		Version 3.5
$$ ##JCAMPDX= 5.01
$$ ##ORIGIN= Bruker BioSpin GmbH
$$ ##OWNER= she
$$ F:/spectra/data/she/nmr/H-F/1/audita.txt
$$ ##AUDIT TRAIL=  $$ (NUMBER, WHEN, WHO, WHERE, WHAT)
(   1,<2022-04-08 10:51:35.90 +0400>,<she>,<DPX200>,
      <created by zg, POWCHK disabled, PULCHK disabled
       configuration hash MD5:
       00 E9 B6 7A A2 85 ED C7 34 08 36 98 17 FE 4E 26
       data hash MD5: 16K
       D9 3C 5C C9 BA 70 07 E2 CE D3 43 B6 C0 FF B6 40>)
$$ ##END=
$$ 
$$ hash MD5
$$ 0D AE F6 89 82 5D 4A 95 DE B9 AB CB E5 6F 1C A0
##$RELAX= 
##$RELAX= 
##$RELAX= 
##$RELAX= 
##$RELAX= 
##$RELAX= 
$$ Bruker specific parameters
$$ --------------------------
##$DU= <F:/spectra>
##$EXPNO= 1
##$NAME= <H-F>
##$PROCNO= 1
##$TYPE= <nmr>
##$USER= <she>
##$AMP= (0..31)
100 100 100 100 100 100 100 100 100 100 100 100 100 100 100 100 100 100 
100 100 100 100 100 100 100 100 100 100 100 100 100 100 
##$AQSEQ= 0
##$AQ_mod= 1
##$AUNM= <au_zg>
##$AUTOPOS= <>
##$BF1= 200.13
##$BF2= 200.13
##$BF3= 200.13
##$BF4= 200.13
##$BF5= 200.13
##$BF6= 200.13
##$BF7= 200.13
##$BF8= 200.13
##$BYTORDA= 1
##$CFDGTYP= 0
##$CFRGTYP= 5
##$CHEMSTR= <none>
##$CNST= (0..31)
1 1 145 1 1 1 1 1 1 1 1 1 1 1 1 1 1 1 1 1 1 1 1 1 1 1 1 1 1 1 1 1 
##$CPDPRG= <>
##$CPDPRG1= <>
##$CPDPRG2= <>
##$CPDPRG3= <>
##$CPDPRG4= <mlev>
##$CPDPRG5= <mlev>
##$CPDPRG6= <mlev>
##$CPDPRG7= <mlev>
##$CPDPRG8= <mlev>
##$CPDPRGB= <>
##$CPDPRGT= <>
##$D= (0..31)
0 1.2 0 0 0 0 0 0 0 0.06 0 0.03 0 0 0 0 0.0002 0 0 0 0 0 0 0 0 0 0 0 0 
0 0 0 
##$DATE= 1649400695
##$DBL= (0..7)
120 120 120 120 120 120 120 120 
##$DBP= (0..7)
150 150 150 150 150 150 150 150 
##$DBP07= 0
##$DBPNAM0= <>
##$DBPNAM1= <>
##$DBPNAM2= <>
##$DBPNAM3= <>
##$DBPNAM4= <>
##$DBPNAM5= <>
##$DBPNAM6= <>
##$DBPNAM7= <>
##$DBPOAL= (0..7)
0.5 0.5 0.5 0.5 0.5 0.5 0.5 0.5 
##$DBPOFFS= (0..7)
0 0 0 0 0 0 0 0 
##$DE= 6
##$DECBNUC= <off>
##$DECIM= 32
##$DECNUC= <off>
##$DECSTAT= 4
##$DIGMOD= 1
##$DIGTYP= 9
##$DL= (0..7)
0 120 120 120 120 120 120 120 
##$DP= (0..7)
150 150 150 150 150 150 150 150 
##$DP07= 0
##$DPNAME0= <>
##$DPNAME1= <>
##$DPNAME2= <>
##$DPNAME3= <>
##$DPNAME4= <>
##$DPNAME5= <>
##$DPNAME6= <>
##$DPNAME7= <>
##$DPOAL= (0..7)
0.5 0.5 0.5 0.5 0.5 0.5 0.5 0.5 
##$DPOFFS= (0..7)
0 0 0 0 0 0 0 0 
##$DQDMODE= 0
##$DR= 18
##$DS= 0
##$DSLIST= <SSSSSSSSSSSSSSS>
$$ [...]
##$SUBNAM2= <"">
##$SUBNAM3= <"">
##$SUBNAM4= <"">
##$SUBNAM5= <"">
##$SUBNAM6= <"">
##$SUBNAM7= <"">
##$SUBNAM8= <"">
##$SUBNAM9= <"">
##$SW= 18.05172834244
##$SWIBOX= (0..15)
0 0 2 0 0 0 0 0 0 0 0 0 0 0 0 0 
##$SW_h= 3612.71676300578
##$TD= 16384
##$TD0= 1
##$TE= 0
##$TE2= 300
##$TE3= 300
##$TEG= 300
##$TL= (0..7)
0 120 120 120 120 120 120 120 
##$TP= (0..7)
150 150 150 150 150 150 150 150 
##$TP07= 0
##$TPNAME0= <>
##$TPNAME1= <>
##$TPNAME2= <>
##$TPNAME3= <>
##$TPNAME4= <>
##$TPNAME5= <>
##$TPNAME6= <>
##$TPNAME7= <>
##$TPOAL= (0..7)
0.5 0.5 0.5 0.5 0.5 0.5 0.5 0.5 
##$TPOFFS= (0..7)
0 0 0 0 0 0 0 0 
##$TUNHIN= 0
##$TUNHOUT= 0
##$TUNXOUT= 0
##$USERA1= <user>
##$USERA2= <user>
##$USERA3= <user>
##$USERA4= <user>
##$USERA5= <user>
##$V9= 5
##$VALIST= <valist>
##$VCLIST= <CCCCCCCCCCCCCCC>
##$VD= 0
##$VDLIST= <DDDDDDDDDDDDDDD>
##$VPLIST= <PPPPPPPPPPPPPPP>
##$VTLIST= <TTTTTTTTTTTTTTT>
##$WBST= 1024
##$WBSW= 4
##$XGAIN= (0..3)
0 0 0 0 
##$XL= 0
##$YL= 0
##$YMAX_a= 668203
##$YMIN_a= -591900
##$ZGOPTNS= <>
##$ZL1= 120
##$ZL2= 120
##$ZL3= 120
##$ZL4= 120
##$ABSF1= 10
##$ABSF2= 0
##$ABSG= 5
##$ABSL= 3
##$ALPHA= 0
##$AQORDER= 0
##$ASSFAC= 0
##$ASSFACI= 0
##$ASSFACX= 0
##$ASSWID= 0
##$AUNMP= <proc_1d>
##$AZFE= 0.1
##$AZFW= 0.1
##$BCFW= 1
##$BC_mod= 2
##$BYTORDP= 1
##$COROFFS= 0
##$CY= 11.3945322036743
##$DATMOD= 1
##$DC= 2
##$DFILT= <>
##$DTYPP= 0
##$F1P= 2.36226072786647
##$F2P= -0.459571619588291
##$FCOR= 0.5
##$FTSIZE= 0
##$FT_mod= 4
##$GAMMA= 1
##$GB= 0.15
##$INTBC= 1
##$INTSCL= 1
##$ISEN= 128
##$LB= 0.24
##$LEV0= 0
##$LPBIN= 0
##$MAXI= 10000
##$MC2= 0
##$MEAN= 0
##$ME_mod= 0
##$MI= 1.114404
##$NCOEF= 0
##$NC_proc= 0
##$NLEV= 6
##$NOISF1= 3.799351
##$NOISF2= 2.8
##$NSP= 1
##$NTH_PI= 0
##$NZP= 0
##$OFFSET= 15.70392
##$PC= 1
##$PHC0= -18561.67
##$PHC1= 27.60078
##$PH_mod= 1
##$PKNL= yes
##$PPARMOD= 0
##$PSCAL= 0
##$PSIGN= 0
##$REVERSE= no
##$SF= 200.130013532006
##$SI= 16384
##$SIGF1= 3
##$SIGF2= 2
##$SINO= 400
##$SIOLD= 16384
##$SREGLST= <1H.CDCl3>
##$SSB= 0
##$STSI= 0
##$STSR= 0
##$SW_p= 3612.71676300578
##$SYMM= 0
##$S_DEV= 0
##$TDeff= 0
##$TDoff= 0
##$TI= <>
##$TILT= no
##$TM1= 0
##$TM2= 0
##$TOPLEV= 0
##$USERP1= <user>
##$USERP2= <user>
##$USERP3= <user>
##$USERP4= <user>
##$USERP5= <user>
##$WDW= 1
##$XDIM= 8192
##$YMAX_p= 0
##$YMIN_p= 0
$$ End of Bruker specific parameters
$$ ---------------------------------
##NTUPLES= NMR FID
##VAR_NAME=  TIME,          FID/REAL,        FID/IMAG
##SYMBOL=    X,             R,               I
##VAR_TYPE=  INDEPENDENT,   DEPENDENT,       DEPENDENT
##VAR_FORM=  AFFN,          ASDF,            ASDF
##VAR_DIM=   8192,          8192,            8192
##UNITS=     SECONDS,       ARBITRARY UNITS, ARBITRARY UNITS
##FACTOR=    0.0002768,     1,               1
##FIRST=     0,             0,               0
##LAST=      2.2672688,     0,               0
##MIN=       0,             -591900,         0
##MAX=       2.2672688,     668203,          0
$$ Real data points
##PAGE= N=1
##DATA TABLE= (X++(R..R)), XYDATA
$$ [...]
1644D923j4209M590J0650j987n908j166M52M331N216p023j0689R128J5105j0130
1658C283j7953R903J9110q394j8289N788J5622k294j1332j686N925N629K95r315
1672c708o435J2088J1876j3550j6397J3727J9178j2493k0015R675J9087n946j6226
1685i139J359J1870L539o300q296K67J2486N635j5509j0905J7072J5046j6969
1698A56j7584J5197J8400j1910j7345P286J4677j894j0677l716N632R043l43j3497
1712f575m711J6469R143j7864j2516J7599J4350j5419j4780J1829J3686p159j1208
1725g156J910P779L473l688q449l93J2389M279j5055p459J6239R486j5748j0482
1739a2875J3698J0308j0435q905O179O625j434l882l263P85P393K137j0670m567
$$ y = [4923, -9286, -4696, 5954, 3967, -1941, -3107, -2655, 1676, 6892, -131, -10820, -1692, 13413, 3283, -14670, -4767, 14343, 5949, -12340, -6552, 9070, 6776, -4556, -6242, -317, 5312, 5607, -3708, -10143, 1945, 13821, 271, -16126, -2399, 16779, 4286, -15729, -6054, 13033, 7087, -9139, -7780, 4090, 7629, 1329, -6967, -6700, 5786, 11421, -4088, -14993, 2079, 17125, 156, -17428, -2231, 16169, 4259, -13086, -5800, 8877, 6983, -3694, -7410, -1778, 7265, 6922, -6575, -11286, 5183, 14326, -3538, -16054, 1545, 15895, 476, -14304, -2475, 11211, 4052, -7156, -5246, 2533, 6006, 2318, -6131, -6524, 5865, 10144, -4911, -12370, 3869, 13355, -2393, -12875, 823, 11131, 696, -8209, -2030, 4595, 3161, -721, -3984, -3199, 4194, 6331, -4339, -8906]
1753h906J2773O266j3349p022J2490O871j0314n783P263L854l407j575m95r44
1767b278M199L187p064n140R024O298r855o541R303N921p789m486N445K370k587
1782GK26n47k869L451N233n673p176P299Q196p616q458P135P634n525o008L247
1798a444L592n59n49k411k573M966N653p134q141Q347R844q601j0586P657J0264
1813H325n751q854L022O411K96l285l623k35O733L879r133p132J0508R860j0796
1828B25j1502R783J2117p766j1429M688R649r37p050l012L746O667n8r793l711
1843h383J1989P056j3035r617J2662J1428j1156j1907Q235J1478m608r804L33
1856e329P356M047m147q053N85J1376K814j3444n973J4257Q391j3637r852J1485
$$ y = [-8906, 3867, 10133, -3216, -10238, 2252, 9123, -1191, -6974, 289, 4143, 736, -839, -1334, -2278, 1921, 5108, -1956, -7096, 1928, 8226, -1629, -8170, 1133, 7054, -735, -5221, 224, 2594, 7, 233, -314, -3183, 268, 5501, -172, -7348, -49, 8147, 531, -7927, -792, 6842, 1317, -4691, -1444, 2148, 1589, 1040, -1371, -3944, 1022, 6675, -459, -8600, -253, 9591, 990, -9596, -1939, 8325, 2574, -6280, -3258, 3153, 3449, 164, -3459, -3694, 3039, 6918, -2215, -9347, 1161, 11021, 225, -11277, -1494, 10623, 2857, -8572, -3884, 5765, 4828, -2222, -5234, -1488, 5179, 5121, -4672, -8383, 3606, 10662, -2373, -11990, 672, 12100, 944, -10963, -2728, 8750, 4142, -5662, -5329, 2027, 6074, 1927, -6126, -5541, 5835, 8649, -4795, -10768, 3489, 11880, -1757, -11609, -124]
1870a24J0350q199r849M148Q299K80o068m665L315Q520l17j1467k429J3101M979
1885I874j3542o819J2625P840j0407p910P118P316l223o116p16M190M604k040
1899B794p912j72J0278K190j1603l801J1620M939j0512n431Q327N255n368m456
1913c852J870L294J579j642m828P2P372J467r021k647R523L462q982l703P377
1928A341L458n034k688K205J572P42k38l513j172N687K459p129l402P563L947
1943E798p144l922N804L419l749k486J319J175J263M26l634k009N564L439o741
1958a478m606P168N236o607n387N251M853l138l890O49K407J948m51m543j507
1973d095O436L428p686n076Q121O150p496o684N982O518l678n700R26M358K005
$$ y = [-124, 10226, 2027, -7822, -3674, 4625, 4905, -1163, -5828, -2513, 6007, 5690, -5777, -8206, 4895, 9874, -3668, -10487, 2138, 9978, -429, -8339, -1221, 6095, 2872, -3244, -3960, 230, 4834, 2794, -5118, -5290, 4988, 7178, -4425, -8226, 3394, 8333, -2179, -7610, 717, 5972, 604, -3852, -1982, 1312, 2891, 1249, -3579, -3507, 3865, 5332, -3689, -6336, 3187, 6649, -2333, -6036, 1341, 4799, -235, -2923, -718, 854, 1596, 1358, -2155, -3327, 2360, 4819, -2310, -5712, 1851, 5798, -1346, -5268, 536, 3955, 206, -2280, -961, 214, 1477, 1903, -1731, -3740, 1824, 5263, -1478, -6084, 1084, 6320, -287, -5674, -423, 4430, 1292, -2598, -1949, 458, 2406, 1955, -2588, -4095, 2341, 5769, -1917, -6993, 1128, 7278, -218, -6902, -920, 5598, 1920, -3780, -2854, 1504, 3509]
1988C509k388m837K29P268J898q923l941R601N661r344o780Q022P292n874p079
2003e686K977O225K46m888l509L139O352q98q776j258J0254L357j0690n050J0006
2018A801O284q262o931N736O876k572o110r12M848M216l149p104J167R211Q73
2033E972j0398k763J0529M248r528n369P620N747m816n654J611N119J660m020
2047d2m752K660P228j063q888m55R584K002r497l117Q313L855o279m264L751M103
2063C139p40l720k098K832M673j728o673N50P763P09q177j717P635K476o250k850
2079d176M198K918j698k642q01K007L161j167n024K40O221O59o655j447O374J905
2095D073n282k206L651K071j585j721o54J097K751l75m426m16N429J355n870j976
$$ y = [3509, 1121, -3716, -3487, 3781, 5679, -3244, -7185, 2416, 8077, -1267, -8047, -25, 7267, 1393, -5686, -2709, 3516, 3762, -1126, -4635, -1496, 4856, 3958, -4818, -6076, 4178, 7535, -3155, -8205, 1801, 8085, -177, -7108, -1372, 5504, 2932, -3178, -4090, 758, 4974, 1825, -5279, -4112, 5099, 5972, -4426, -7189, 3340, 7588, -1940, -7309, 311, 6058, 1242, -4412, -2801, 2318, 3978, -42, -4794, -2134, 5094, 4031, -4857, -5312, 4272, 6274, -3223, -6340, 1973, 5828, -451, -4715, -964, 3139, 2399, -1321, -3419, -587, 4086, 2358, -4315, -3765, 3998, 4707, -3470, -5187, 2448, 4924, -1326, -4176, 22, 2940, 1242, -1400, -2201, -194, 2967, 1800, -3224, -2984, 3237, 3896, -2759, -4206, 2168, 4073, -1209, -3415, 236, 2307, 722, -999, -1653, -556, 2195, 1820, -2606, -3022, 2407, 3762, -2108, -4084]
2111d084N633K389m729k489L215K360j240j902q81J220K876l63m525o43N604J581
2127D022n963k508N746L135m954l366L304L353j243k979q60K099K991j011m875
2142c109j09O117J396o759k471O631L399n794l931M259M167k260l981j09L396
2157H42K547k536m636J336O340q8p344j279P585K520p062l534N798M219l962m485
2173c739J661M304R38l752l318K855N254j522o801K04P613J141p528k504O766
2188A572L429n239m051L157M337q19m188j667L620L881k643n674J472O887k60
2203C814p354r81P093K015o014k825M303L464k306l704J84L505K092l055l921
2218c690K272N404j393o240L31O426O30n977j492M742K278l223k634J253K840
$$ y = [-4084, 1549, 3938, -791, -3280, -65, 2295, 1055, -847, -1728, -508, 2368, 2005, -2520, -3163, 2441, 4022, -1941, -4449, 1297, 4432, -522, -3888, -584, 2769, 1526, -1453, -2313, -214, 2777, 1766, -3109, -3218, 2899, 4295, -2464, -4935, 1696, 5095, -699, -4630, -371, 3796, 1536, -2445, -2554, 842, 3389, 853, -3783, -2447, 3893, 3805, -3539, -4818, 2767, 5287, -1775, -5309, 489, 4708, 746, -3739, -2078, 2226, 3164, -588, -3906, -1051, 4203, 2681, -4120, -3916, 3697, 4838, -2690, -5194, 1572, 5001, -238, -4289, -1132, 3205, 2386, -1802, -3469, 151, 4032, 1389, -4285, -2813, 4074, 3814, -3540, -4521, 2572, 4587, -1427, -4252, 51, 3515, 1209, -2495, -2311, 1194, 3286, 231, -3690, -1418, 3986, 2593, -3647, -3316, 3110, 3740, -2237, -3729, 1013, 3291, 68, -2566, -1313, 1527]
2233A527P63k760k558K257M151j660n053P73N492J61n278r15M367J626l110k049
2249b266J533K158K39k071j892J731L260j124m328M57M753K04m614q12L901J389
2265B518k874j686J398J878J74j748j661J340L107r06l963K16M491L98m426j103
2281b847L899J627k823j963J471K030J33j951j684J580K974r79m074K94M571N78
2297B836m686j264M136J964l230k327J801K594j88k545j410K178K929j591m093
2312b896Q24M915k8n080r35M810J732l973k431K690K859j135l080n23K906K147
2328B802k480l592J856M585q73n252j3N211J028m637j854L517K689k223l063N96
2344a703L165J155l009k692K505L899j687m766P65N045K90m916j242M168K040
$$ y = [1527, 2290, -470, -3028, -771, 3380, 1720, -3333, -2560, 2932, 3093, -2185, -3100, 1267, 2893, -217, -2266, -733, 1425, 1664, -407, -2299, -568, 2692, 1568, -2760, -2303, 2450, 2654, -1960, -2772, 1129, 2518, -356, -2042, -644, 1234, 1408, -340, -2001, -661, 2446, 1540, -2423, -2207, 2284, 2682, -1744, -2847, 1052, 2679, -144, -2107, -636, 1394, 1527, -424, -2108, -528, 2446, 1467, -2607, -2313, 2258, 2836, -1850, -3114, 1022, 2986, -244, -2571, -770, 1824, 1636, -909, -2319, -141, 2788, 1197, -2896, -2072, 2843, 2815, -2265, -3200, 1610, 3342, -631, -3062, -372, 2487, 1352, -1728, -2251, 655, 2802, 322, -3270, -1414, 3171, 2298, -2954, -2967, 2244, 3272, -1365, -3219, 298, 2987, 764, -2299, -1703, 1462, 2617, -392, -3084, -579, 3320, 1633, -3133, -2368, 2677, 2967, -1949, -3191, 977, 3017]
2359C017l011k655J503L042M9l018j613K767K958k266l909J507M542o61m641j86
2375b575M209J092l426j789K248K377q76k732n20K635J985k469l005J925L748
2390B827j268l978L70L827M82l386j146K459J714j265k105m0K310J223k102k293
2406b371J756L114j196l480M89L479K51l150q93K395J452j377j821K02J945R48
2422A743j887j953J596K670j093l208N78L184J27k913p45K300J289j416j640L77
2438i91J837P85j824j794J577K640j262k982N28L204J05k986p28K449J283j646
2454A95j723N68K017N33k029j538J744K423j339l041P24L286N5l261o95K813J347
2471B079j997j887J006K191J11k312j155K130K145j743k916J190L324n18l352
$$ y = [3017, 6, -2649, -1146, 1896, 1945, -1073, -2686, 81, 3039, 773, -3136, -1629, 2913, 2252, -2389, -2575, 1634, 2726, -700, -2489, -241, 2136, 1260, -1472, -1992, 643, 2628, 159, -2846, -921, 2827, 1559, -2419, -2049, 1778, 2260, -1126, -2272, 187, 1901, 636, -1469, -1509, 801, 2024, -78, -2371, -615, 2499, 1303, -2177, -1688, 1791, 2042, -1108, -2001, 394, 1846, 469, -1352, -1150, 795, 1743, -144, -2097, -501, 2169, 1076, -2132, -1554, 1630, 1757, -1156, -1901, 399, 1688, 272, -1368, -991, 846, 1631, -193, -1987, -410, 2230, 968, -2014, -1486, 1718, 1823, -1163, -1891, 558, 1841, 195, -1528, -960, 1057, 1590, -439, -1977, -233, 2190, 851, -2190, -1466, 1820, 1875, -1386, -2081, 732, 2079, 82, -1805, -799, 1392, 1503, -809, -1964, 166, 2311, 568, -2348, -1158, 2166, 1648, -1704]
2486a704l02L122R46k467j579J532K218o22k450n08K407J637k167k479J700L052
2502B336j025l316K86L275M73k857j219K111J850j159k298J34K474R40k378j890
2518b263J954K643j489l043P85L172l3k949p64K547J315j691j852P37K183K51
2534A503k248j187K161J888j706k501J204K847n95k801j23K410Q38j837j399J054
2550d92J803j77k080o46J994J473j796k066J327K432p14k570J47K302N46j831
2566c48j129J207J550m23j794l85J817J196j718j719J288K134p74k329K65K132
2582I70L78j785r59J293J349n93j669j06J706R02j655j493J392J870q76k111M16
2599i71K075J53j784q10J333J282p03j588m0J821O67j701j319J392J828j028k038
$$ y = [-1704, -2006, 1116, 2062, -405, -1984, -452, 1766, 1144, -1306, -1814, 593, 2230, 63, -2416, -716, 2336, 1311, -2005, -1719, 1556, 2029, -828, -2047, 64, 1914, 755, -1543, -1409, 1065, 2005, -373, -2263, -309, 2334, 845, -2198, -1413, 1759, 1726, -1223, -1987, 560, 1875, 184, -1668, -931, 1252, 1503, -745, -1932, 229, 2117, 411, -2090, -886, 1961, 1366, -1435, -1558, 852, 1690, -147, -1546, -492, 1311, 1134, -946, -1592, 402, 1875, 79, -1987, -660, 1772, 1058, -1512, -1365, 937, 1483, -348, -1477, -270, 1280, 857, -937, -1322, 495, 1691, -27, -1746, -458, 1676, 902, -1427, -1162, 970, 1348, -437, -1396, -103, 1246, 653, -1016, -1122, 584, 1486, -169, -1662, -270, 1600, 724, -1387, -971, 1104, 1257, -527, -1337, -4, 1278, 575, -1013, -1053, 768, 1435, -266, -1585, -193, 1635, 607, -1431]
2616a431M70K130Q1j946o92J516J191r44j555K95J737M27j773j085J579J664j216
2633D48k008P58K118j35k076m27J725J009j272j447O97J674M6j815p41J775J266
2650A595j437j788J017K024n22j981j78J857P72j535j157R13J606k33j815m14
2666a276J857R30j586j492J259J799p10j979K18J834M61j651r38J081J398n37
2682F68j700M5J747N27j643j158J466J506j004j711M79J709J31j660n97J328J087
2699A220q34j424K93J557K79j584q13J473J154j082j459O33J583j15j553l83J350
2716B95Q41r35j280L97J510Q7j507n86J314J121j093j299O52J510k05j540k09
2733i27J254P62j040j032N67J249lj521l34J355Q02j116j195Q33J274l57j316
$$ y = [-1431, -961, 1169, 1250, -696, -1388, 128, 1319, 375, -1180, -885, 852, 1279, -494, -1579, 0, 1664, 448, -1560, -802, 1316, 1181, -895, -1322, 403, 1412, 140, -1307, -610, 1064, 1110, -705, -1446, 329, 1595, 158, -1630, -613, 1411, 889, -1092, -1270, 587, 1359, -176, -1333, -420, 1186, 953, -862, -1276, 581, 1511, -75, -1567, -308, 1491, 781, -1198, -980, 854, 1315, -336, -1274, -193, 1205, 668, -1032, -987, 760, 1287, -356, -1514, -48, 1458, 454, -1257, -778, 931, 1062, -598, -1195, 133, 1220, 386, -1038, -745, 812, 1091, -493, -1306, 167, 1321, 239, -1220, -587, 996, 881, -672, -1055, 295, 1136, 201, -1079, -682, 828, 915, -592, -1178, 136, 1257, 164, -1135, -483, 1027, 822, -718, -927, 327, 1089, 49, -983, -416, 833, 830, -691, -1025, 330, 1132, 16, -1179, -346, 928, 571, -745]
2750g45j60J387M99j111r33P66J209k33j422j00J294O15j216r47Q74J291n28j369
2768h29R9J315L66j078q41P78J161m85j245j08J420M55j244r06J052J119o10j320
2786i01K07J343K09j155p17R88J024o29j187J68J302K35j280o60J171R42q05j172
2804i17M09J306n9j210l63R54P99o92j045K51J241N4j247m00J142P75r59j000
2822i61O44J129j76j146k77J066N87q24q69M92J102j98j122k01J164M89r30q42
2840h73O76R47k81j108pJ004M47r10p68O10J027l09j078K0J019L55r55n93O79
2859i8Q66m00r96O4R80K65q86n30N90Q81l50j017N9J027K24r62n07P53P48m70
2879B41q49J08R69J55q57n05P07P44l95r59J52J009J84r49m70P91O36n81p29K16
$$ y = [-745, -905, 482, 981, -130, -1063, -297, 912, 679, -743, -843, 451, 1066, -150, -1097, -223, 1068, 540, -829, -730, 585, 951, -127, -968, -190, 971, 486, -759, -867, 553, 1008, -236, -1142, -90, 1029, 419, -901, -694, 649, 858, -297, -1014, -26, 998, 369, -818, -650, 652, 887, -393, -1053, 118, 1060, 255, -917, -508, 798, 739, -471, -834, 120, 919, 227, -818, -567, 674, 728, -519, -919, 223, 998, 39, -961, -317, 812, 636, -510, -787, 279, 866, 42, -827, -335, 767, 569, -553, -754, 410, 899, -31, -873, -197, 750, 469, -639, -646, 358, 805, -105, -873, -263, 764, 455, -623, -603, 416, 771, -184, -777, -98, 768, 368, -628, -564, 416, 681, -205, -735, -145, 736, 386, -631, -572, 455, 679, -283, -790, -37, 711, 241, -608, -500, 469, 624, -233, -738, -31, 713, 318, -641, -489, 520, 704, -245, -715, 76, 712, 131, -598, -382]
2899c82Q73J01q43m20P17O85n49q88K99R74k7r56k78Q35O05o94p01L68Q01o2q39
2920c81k19P40N99o16p82M06Q81j61r19j19Q35L83o82o07M39P85k16p51k21Q12
2940B06M40o80o65M86Q02k32q90j0Q36K89p47m70N58O27k24p60m1P38L27o99n02
2961f11N24P42l91q06J21Q18P6o70k69N30M66m25n40P9O70J94o53m33N56O05m29
2982A54o65K03P01J3o44j97N15M04l15n75J36N95P2m99l81N25M79m20n45J67O76
3003C99l5o52j17N03K64l58m24K34M51Pn02k09N40L94m19n28K89N63n9o15j38
3024d12N81K36m10l55K19M29M1n00k28M27L85l80m51K41O27k44n26p7N77J96l90
3045a4l38J80M60n7m42j69N32L64m74m57K50N73j30n29n7N16J61m13k94K78M41
$$ y = [-382, 491, 592, -251, -671, 46, 731, 182, -706, -407, 567, 540, -416, -694, 141, 746, 52, -649, -281, 520, 458, -381, -600, 140, 739, 123, -659, -253, 628, 467, -452, -571, 264, 647, -35, -642, -203, 582, 366, -385, -606, 206, 646, -34, -699, -213, 589, 357, -533, -543, 293, 582, -165, -635, -77, 550, 326, -434, -475, 263, 590, -109, -611, -87, 655, 264, -542, -421, 397, 473, -197, -466, 64, 530, 105, -435, -356, 314, 508, -145, -578, -22, 583, 154, -511, -308, 393, 406, -238, -435, 80, 484, 169, -406, -270, 325, 397, -102, -483, 42, 521, 101, -444, -277, 399, 364, -288, -405, 98, 362, 4, -420, -186, 265, 272, -230, -439, 101, 495, 76, -452, -163, 400, 341, -274, -412, 169, 405, -5, -360, -141, 288, 329, -171, -399, 28, 413, 33, -418, -177, 450, 206, -320, -397, 180, 376, -14, -352, -172, 288, 231, -211, -380, 152, 516, 42, -415, -165, 408, 278, -251, -308, 208, 369, -44, -338, -60, 381]
3066C81k20m06j09N09K10m51l99L79N43k75n82R0O18O4n21j90L32L56k02m31O3
3087b41M49J69m46l42M37M68l71m42J39N60q4n45p5M33K17k48l83Q6M04O7l47
3108i5l14M81L04l49m29K67M66j92l93L0M18K3k10k82K17K80Nl86j44M13L06l90
3130B6l69K78L53j61l74M9L28M5k03j80J29K91j01k87n7L00J83k35k79K84K64
3151B84j48l30J1L50J9k41o0R0J46k8j84j36K98J61k40k40K07K87j64k37P6J72
3173I3K1j57n8J19J20m1j66n4J47J48j60k43J91K37j23j55qK39kj69j17J24J22
3196A08q3o3j44K30J50j93j94J36K69j34l11J01K76k0j64j00J55M1J3r8j02J50
3218B3K39k65k42K01L26j93l02J46K20m3j95n9J49O3p2r0n1J69J07j22k33J87
$$ y = [381, 161, -245, -354, 155, 365, -86, -485, -106, 437, 162, -420, -330, 288, 352, -169, -359, -27, 329, 127, -304, -241, 208, 377, -69, -411, 26, 494, 123, -319, -180, 380, 296, -249, -324, 109, 326, 78, -305, -219, 185, 252, -95, -409, 72, 376, 27, -402, -135, 331, 139, -254, -224, 194, 217, 7, -275, -58, 222, 227, -159, -303, 110, 416, 26, -343, -65, 288, 127, -247, -198, 130, 175, -28, -208, -79, 212, 111, -176, -233, 67, 250, 15, -264, 20, 284, 136, -194, -183, 167, 186, -55, -115, -25, 121, 93, -91, -227, 71, 232, -8, -248, -41, 246, 82, -155, -79, 93, 114, -43, -101, 18, 138, 97, -69, -123, 24, 172, 12, -231, -40, 197, 74, -81, -89, 150, 148, -21, -138, -14, 108, 25, -38, -182, 48, 198, 5, -189, -53, 216, 82, -229, -128, 148, 128, -36, -136, 19, 60, 73, -25, -127, 23, 262, -3, -245, -44, 282, 89, -213, -67, 153, 110, -85, -144, 5, 68, -4, -94, -145, 24, 131, 9, -224, -37]
3240c7K50j69k07P4K74r9k37M5J71P3j29m6n6J71N9j80j37J62K00j73j60R5K42
3263A86j20k25R6J85l3j13l4O0N7Jj51k7J84J08j90j65J33K16q4j64O9Q5l2p5
3287c3M7pP2K4j02r1Q6J11r9q4L3J01o2n0P2P1j01K5P6r9k5N8j7l9lJ06nj11K4
3316b2J32n1o6K1R1o9l8L7n9qO9J6j23J5J39pj84J2J06M1o8m2Q5L9l4m2p4P1L5
3345B2R0k40N9K10J2k92J4K23Oj04m8J01nL2p6q6M1J13K6k34J2K79k0k80M7J67
3371F9M2j59l5J18N8n4r4k1N0J40m1j35k5K28ok23mJ76J4j42j0P3OJ8j15J9K4
3398b9J9Rm9K3J10l2j78MK32J5j92M6O8P0j25m8J3N9N6l9p0rJ14j8j29m7J70R
3426E2j09m8J33O2r7n1L1P4j0P9k27J8K46Pk26n5J82J11k01r9J47R5p3r6K9P3
$$ y = [-37, 213, 44, -163, -89, 185, 86, -151, -106, 65, 138, 9, -37, -93, 78, 137, -43, -180, -18, 182, 9, -151, -56, 186, 66, -159, -63, 122, 89, -24, -58, 2, 59, 60, -91, -118, 66, 174, -16, -181, -48, 168, 84, -80, -11, 74, 42, -33, 14, 7, 79, 103, 1, -90, -4, 107, 8, -76, -43, 58, -4, -54, 18, 89, -12, 13, 89, -10, -35, 23, 6, -33, -36, 70, 65, -46, -22, 110, 59, -7, 14, 105, 36, -2, 35, -24, -32, 37, 53, -70, -55, 84, 77, -107, -95, 11, 52, -16, -58, 27, 66, 32, -10, -84, -13, 22, 112, -128, -69, 141, 153, -139, -125, 98, 104, 0, -48, 53, 48, 80, 4, -82, -41, 72, 98, -136, -124, 155, 135, -145, -98, 69, 111, -48, -83, 35, 93, 39, -55, -76, -26, 114, 73, -62, -87, 141, 135, -88, -92, 84, 98, -44, -54, 19, 25, 43, -72, -53, -29, -10, -1, -50, -27, 83, 51, -127, -123, 109, 124, -68, -22, 46, 116, -9, -57, -44, 15, 71, 32, -38, -47, 67, 49, -80, -127, 43, 52, -57, -105, 28, 90, -7, -58, -27, 47, 37, 116, -111, -93, 153, 160, -66, -121, 61, 172, -29, -128, 19, 114, 41, -55, -26, 47]
3452D7N5J8j74m1K23pj81q6K13P0j93m4Q5J58q9j37j7R4P9m6j63J1K85m8k46Q
3478a26K46R5k59j30J81J75j68o9n0J71N7j04j94R9K10j7k83m6K98O7k61r1K16
3501A7J77j50k03J23J70K9k07j19J93J37o5l12K0L76kk62j64L52R1k15j64J32
3523d6J72j2k04p5J55J62q5k25j3L55k9l10j2K33J51j90j96J31K54j41j32q6K07
3546F4J12k00j59J28J82J9l09K8K22R2k76q8J98R5o1k11N5J90O1j47k13J69K40
3569A91k8l42M8K91O7l02j40K20J74j25k16Q0J73L1j32k07J75K37q0k76k4K72
3591H7O2k26j58K09K44j81k24O3K30R7k31j97J80K22p3k90J1L35R2l50j34K43
3613A1K10j62k57J07J94O4k19j34J97J77j33k86M3L83Kk95j41K94J86k35k48K25
$$ y = [47, 102, 120, -54, -95, 128, 121, -60, -146, 67, 137, -56, -100, -15, 143, 54, -83, -100, -6, 73, 27, -136, -125, 160, 112, -134, -126, 120, 215, -44, -174, 7, 182, 14, -55, -105, 66, 123, 19, -175, -76, 134, 117, -166, -212, 86, 153, -108, -199, 17, 194, 44, -159, -36, 134, 163, -44, -163, 30, 167, 102, -210, -190, 186, 184, -78, -242, 110, 201, -14, -178, -46, 126, 114, -90, -165, -10, 152, 67, -158, -171, 184, 155, -155, -167, 66, 217, 27, -169, -38, 216, 75, -57, -143, 64, 176, -24, -183, -55, 127, 146, -163, -135, 87, 179, -97, -185, 13, 108, 47, -164, -109, 81, 142, -5, -218, -49, 191, 163, -179, -131, 160, 227, -75, -215, 5, 179, 54, -162, -82, 91, 122, -10, -217, -42, 195, 115, -161, -185, 87, 149, -77, -235, -26, 218, 37, -187, -124, 106, 203, -28, -225, -45, 177, 104, -186, -175, 160, 252, -98, -232, 11, 221, 59, -198, -91, 103, 167, -52, -186, 11, 188, 55, -231, -188, 195, 197, -98, -239, 55, 241, 6, -242, -17]
3635a7J56N9l18j05K43K55k19k76J15L44Ql73j34L26J94l33j65J28L67j61k92
3656a98j4K75J65k14k80J38L61k1m09j5L67R0k64k45K27L37j55l06k4K78J64k96
3678c9k22J77L20o6l88k0L85J14l19k03K80K36j89k50J7K95J28l13k30K52K79
3699B44r7l64N4L14M9k79j65K77K46k50k90Q0M01j1k64j32J54K89j85l02P4L62
3721B05L1l81j16L26K30k45k92J52L32n8l17q2K26K84k69k10M7M18j5m22j09L60
3743I5J60k58k66J41L87o5l47n1K67J64k26l03J76L50l5l53q0K97K25l11k46K09
3765g0L09n9l60qL28Q6k15k46K21L23j46m09mM29R4l30k33K26K93q7l83N5L34
3788A48J07l32j78K37L01j25m05N9L83O7l69j84L17K77j98l36Q3L34Mk90k08L39
$$ y = [-17, 139, 198, -120, -225, 18, 273, 54, -222, -107, 237, 245, -128, -262, 64, 258, -75, -240, -112, 255, 94, -198, -212, 63, 228, 14, -266, -128, 233, 212, -197, -212, 155, 245, -19, -264, -37, 300, 145, -161, -185, 93, 257, -39, -261, -84, 236, 170, -218, -238, 147, 261, -58, -261, 19, 255, 66, -184, -167, 128, 256, -57, -287, -35, 244, 147, -217, -163, 151, 200, -79, -244, 33, 279, 29, -261, -181, 220, 209, -55, -187, -33, 256, 71, -231, -157, 205, 236, -145, -261, 65, 295, 50, -242, -90, 242, 184, -133, -215, 11, 295, 26, -184, -137, 281, 266, -156, -265, 95, 255, -3, -269, -128, 259, 194, -153, -204, 63, 227, 1, -302, -126, 224, 189, -164, -244, 53, 278, -33, -279, -70, 239, 180, -180, -188, 140, 226, 11, -235, -14, 309, 163, -246, -250, 179, 273, -57, -290, -64, 229, 142, -241, -186, 148, 255, -77, -255, -18, 283, 158, -247, -188, 195, 262, -107, -291, 26, 303, 105, -231, -148, 186, 190, -100, -308, 31]
3810C1K49j84l36O2M01J6l97j64M02K19k17l64J48L15M3l76q9L08K17k21l70J60
3832a47L78%m10r0L33K58l09l06J59M00r3l79nK94J97k48l46K10L36j1m11q0M29
3855A59J75l50k53J53L91q6l82l0L42J65l09k49J95L84j29l84l4L89J57l32k79
3876c07K34L02p6l66K0L31J29l58k27K97L48j74m28MM26J41l90k55L08L96k35
3897A20m42J17L88Q7l84j97K99L30k24m14J20M03R8m34j59K95K89k07l96J13M18
3918B20L6m15j48L80J88j87l96J86L63l6l37j39L70K51k75l94J95L53pl79j23
3939b94L55K79l06l94K42L47l5l68j09M03K25l67k27J20M12r1l56j19L65K45l26
3960Ak80J66L91o2m05l2M10J04k80l65L17K76j9m63k3L94J59l36l22L14L77j48
$$ y = [31, 280, 96, -240, -178, 223, 239, -158, -322, 80, 299, 82, -282, -134, 181, 224, -152, -241, 67, 284, 63, -307, -147, 231, 231, -179, -269, 64, 322, 13, -293, -134, 266, 173, -206, -211, 83, 280, 32, -314, -104, 232, 221, -190, -270, 159, 334, -16, -269, -116, 275, 189, -193, -223, 119, 284, -25, -274, -79, 305, 176, -208, -242, 147, 304, -28, -307, -73, 229, 153, -213, -193, 138, 267, -91, -318, -21, 327, 153, -275, -271, 155, 296, -94, -349, -41, 355, 120, -322, -205, 183, 270, -114, -311, -12, 318, 94, -320, -200, 203, 301, -133, -292, 3, 292, 85, -311, -198, 220, 256, -159, -307, 73, 261, 74, -322, -136, 227, 191, -146, -285, 85, 336, 61, -333, -138, 215, 208, -171, -294, 61, 340, 34, -360, -118, 229, 194, -174, -283, 120, 345, -22, -249, -129, 283, 192, -164, -283, 82, 327, 1, -279, -113, 278, 216, -189, -221, 189, 293, 13, -352, -35, 241, 222, -241, -264, 130, 289, -47, -369, -55, 322, 174]
3982A74m16NM07K4k98j98K77L24j80l73O1M22L5l24k55K97L25k27l65L3M46M3
4004B37l39k44L18L77k64l49R6L73N8l92j36L23K53k55l14Q1L88J6l57k12L70
4025B8L21k67l96K09L30L0m19p2K92K55k74l23J65L60nm46q6M07K11l56l13K22
4047a27L81j06l59k5L60J97l28l55K76L57q0l74m1L73J65l56k74K61L60j35l96
4068b26k7M44R0l92k44L07L05j36l64n9M16J74l73k38K98L34j59l82O6L56O9l59
4090a00j68K73L29k34l19k8M66O8l90k02L22K90k11l96J45L63M8m00j72L77K37
4111B98k04l88J41L70K6m02j37L97K08l28k61J61L33J0l43r7L36J71k57k74J35
4132a05L46J6m79k5L38K15k92l22J95L60l4m11q0L85J76l19l20K54L48r2l83j9
$$ y = [174, -242, -237, 170, 194, -104, -302, -25, 299, 119, -254, -193, 229, 264, -60, -315, -18, 307, 80, -285, -252, 194, 237, -102, -346, -28, 349, 85, -264, -168, 205, 263, -129, -265, 58, 311, 56, -258, -177, 211, 227, -130, -342, 28, 349, 82, -314, -105, 225, 255, -164, -236, 56, 311, 37, -286, -121, 239, 234, -212, -298, 109, 320, -36, -349, -127, 254, 148, -211, -236, 124, 321, -7, -362, -86, 271, 191, -183, -224, 149, 314, -42, -316, -55, 305, 170, -226, -253, 191, 281, -111, -355, -48, 257, 121, -243, -302, 114, 288, -85, -323, -25, 309, 150, -232, -166, 190, 259, -100, -268, 5, 334, 100, -219, -247, 219, 287, -103, -305, 17, 307, 96, -300, -155, 208, 256, -144, -316, 61, 298, 94, -294, -153, 217, 243, -159, -296, 101, 309, -19, -280, -119, 214, 224, -119, -216, 120, 291, 34, -240, -105, 241, 257, -222, -247, 91, 306, 14, -308, -113, 247, 213, -198, -278, 107, 283, -36, -356, -102, 246, 154, -229, -248]
4154b48L99J40l15k29J46L96j44l82PL95Q1k78k73K75L30j65l99K8L94J09l25
4175e8k58L27L37k14l71L9M14N0l32k18K75L34k22l42M2L97J04m04k22K80L55
4196C13k54l81J15M48j5l81p0K52L11k83l60J56L36L7l71j67L34K88k73l48J38
4217a75M42k8l85j57L76J97k57l00J45M18j08l93o0M04J89l55k49K05L65o3l98
4238a87m6L31J56l19k30K17L49p3m10k0L47J83l30k77K31L71r7l93j7L67R7k99
4260d9k51K84K93j47l85Q5K99P4k90k52L48K71j77l18K4L59R7l37j81K76K46j72
4282I7l20L8L30N4l04j37L20J89j67l61J10L74J6l78j41K89K73k44l10J35L44
4303B07j3l25r1K24K61k53l00J54L96o2l96j16L81J76k08k32N7L42K6m17k7L21
$$ y = [-248, 151, 291, -24, -253, -107, 289, 145, -237, -230, 165, 246, -32, -305, -30, 300, 135, -264, -236, 158, 267, -58, -316, 11, 348, 134, -237, -198, 216, 266, -66, -284, -9, 325, 103, -239, -197, 200, 304, -100, -322, -42, 313, 59, -322, -207, 241, 226, -155, -225, 27, 338, 55, -305, -149, 187, 224, -147, -314, 20, 308, 35, -313, -175, 267, 239, -146, -303, 73, 270, 13, -287, -142, 276, 168, -225, -285, 119, 308, -47, -296, -91, 274, 211, -187, -233, 98, 254, -65, -295, -78, 271, 198, -212, -232, 115, 298, -32, -309, -78, 293, 196, -197, -214, 153, 250, -49, -300, -16, 277, 130, -255, -170, 129, 203, -87, -339, 9, 280, 103, -215, -191, 168, 265, -72, -253, 23, 269, 97, -223, -185, 145, 199, -105, -242, 78, 267, 100, -261, -151, 223, 239, -139, -280, 9, 282, 38, -272, -137, 207, 194, -131, -222, 2, 263, 10, -290, -136, 260, 198, -198, -314, 67, 243, 35, -197, -140, 202, 228, -189, -216, 105]
4325A05K02l28k38K05L48j19l59n8L45J51k84k05J48L12l1l92n2L84J19k75k55
4346b77J81L62j19l73M8K87J12k49k14J77L41j72l38J1L61J41l49k17K89K78j72
4367A08l38M3L42O2l22j96L00K96j93k93K4L46M2l02j92L17K58j77l83J17M04
4388B63p0l32q1K92K35k30l39R4L52K9l90o2K90K00k05l68J98L04J3l30j42L31
4410E2K23k52k49J37L63j37l17J0K52K01k64l25K92K89j26l20l4L05J52l25k07
4431b80K70K11n9l08p7L19J99l33k01J80L19j15l07l2L23P3k43j70K03K57p1l29
4453a71K8K68R0k85j99L06J86j38l51L4L31O2k29j19J88K16j66k49L6L66pk94
4475i7j72K97J71j43k79N1L84k0k98j36K40K09j64k70Q3K87mk64j15K66K23j68
$$ y = [105, 307, -21, -259, -54, 294, 175, -184, -242, 103, 254, -30, -235, -87, 225, 194, -198, -250, 134, 253, -22, -277, -96, 266, 147, -226, -178, 109, 221, -28, -242, -65, 276, 104, -234, -223, 138, 279, -70, -287, 2, 280, 108, -230, -187, 155, 217, -105, -301, -1, 295, 102, -191, -167, 179, 221, -81, -273, 44, 302, 125, -258, -141, 263, 193, -139, -220, 72, 307, 77, -262, -168, 184, 213, -177, -239, 51, 251, 46, -322, -124, 180, 193, -137, -279, 52, 275, 23, -226, -89, 274, 137, -180, -170, 82, 283, 19, -306, -14, 275, 149, -171, -205, 100, 252, -73, -280, -10, 201, 142, -166, -243, 76, 275, -58, -259, -79, 240, 125, -182, -214, 109, 182, -61, -231, -28, 229, 158, -171, -143, 125, 215, -70, -269, 37, 223, 85, -266, -232, 99, 161, -68, -187, 1, 217, 51, -198, -162, 204, 197, -97, -269, 28, 199, 56, -223, -172, 212, 192, -106, -242, -2, 207, 43, -227, -144, 143, 139, -125, -240, 26, 249, 81]
4497H1l48J55L11l0l54qK64K00k24k85J35K73J2k92p0K02K11k31k61J47L18n1
4519A55l33q8L57J00j70k83J74K76l0l34j04L63J63k66k62K60K70j16l47N5K93
4540A33J18l11j21J19K80j19l43K9L47J01k81j92K53K33j74k69O8L16K4k84j36
4561b09J76K37j30k87N5L15J7k75j20K30K46j62l30Q7L28Kk64j11K70J79k43k40
4583b29J29K63mk99p7L03J54k43k61J54K82o6k01n8K21J52k57j49R9K68o0k20
4605i9j26K66J52j83j98Q0K94j06k96N1K67R0k04j86J46K23m3k85K5K13J23k13
4627ij59J28K56j28k61J7K73M4k19j22J67J50m8k32k1K91R8k90j87K63J65j15
4649F1k81Q7L35l1k41j23J65K07n9l13O9K87J8k59j13J95K02j53k50O2K39J4k26
$$ y = [81, -267, -112, 199, 169, -185, -193, 71, 271, 47, -238, -103, 170, 182, -110, -180, 22, 233, 2, -259, -112, 206, 155, -178, -266, 91, 191, 21, -262, -88, 188, 158, -176, -280, 83, 246, -20, -282, -22, 248, 132, -215, -160, 133, 251, -60, -181, -62, 218, 99, -244, -215, 132, 233, -48, -240, 13, 246, 72, -197, -129, 187, 211, -73, -209, -33, 204, 74, -213, -158, 157, 174, -101, -221, 9, 255, 93, -237, -150, 178, 180, -84, -195, 75, 254, 11, -229, -100, 163, 159, -140, -217, 86, 240, -3, -264, -110, 172, 106, -95, -153, 68, 220, -37, -186, -87, 181, 121, -99, -225, 41, 193, 10, -188, -108, 186, 80, -216, -165, 102, 192, -12, -198, -52, 171, 128, -157, -132, 81, 204, -9, -168, -40, 216, 88, -173, -156, 117, 161, -58, -180, -13, 137, 89, -143, -164, 127, 225, -65, -252, 11, 176, 61, -220, -133, 202, 171, -70, -193, -28, 179, 120, -193, -124, 163, 181, -78, -191, 4, 206, 53, -197, -135, 104, 118, -108]
4672a08o6K63R4j55j86K3K88P4l00j11K19J86j41k52J36K15q5k43l4K31J25k20
4694d7j66J45K12j3k47j14K97J71k54j92J53K55m4l13j5L21Q0k08j77Q6K39l7
4716A32k19r9K60K00k81k07J88K00p9l29J38K26M9k44j26K57J04m8l16J34J56
4737I6Q6k53j23K42J62j20k99J02K60Pk54j11K33J40q0k37L7K40O2k67r6K23J44
4760A94j91k38J80K51o9k24m6J51J47j64j77P6K81q9k00k0K15Q4k02j61J43J84
4782A25l5k01lJ70J04j64j63R4J11O3k26mK11J28k11j93J33J81m2j51n6K03J30
4805B04j85j59Q7K03l5k63J0K77P3k23k31K31J47r3j30l1K46k8j01j85J80J95
4827A89j19j87L0J82N9k93K8J11K10j74k15Q1J80N9j56j68J47J67o2k20N2K19
$$ y = [-108, -174, 89, 183, 28, -158, -135, 153, 227, -73, -184, 35, 221, 80, -172, -36, 179, 94, -149, -183, 48, 173, -47, -213, -68, 144, 131, -116, -230, 67, 238, -16, -208, -55, 200, 156, -157, -172, 149, 229, 21, -156, -70, 169, 132, -87, -186, 74, 274, -7, -214, -26, 174, 95, -234, -96, 130, 179, -65, -191, 66, 170, 122, -194, -60, 96, 182, -71, -194, 48, 210, 90, -209, -107, 153, 160, -94, -205, 28, 168, 88, -149, -112, 128, 190, -77, -173, 50, 194, 3, -235, -55, 196, 127, -97, -143, 8, 155, -9, -186, -110, 171, 82, -118, -138, 77, 161, -41, -202, -59, 125, 90, -111, -114, 56, 160, -4, -167, -73, 38, 101, -125, -129, 82, 210, -1, -194, -61, 120, 78, -73, -129, 74, 204, 19, -140, -53, 150, 115, -148, -138, 139, 212, -11, -242, -11, 136, 43, -87, -118, 128, 100, -1, -186, -6, 189, 70, -117, -87, 95, 154, -139, -111, 0, 210, 36, -179, -98, 82, 141, -15, -183, -36, 131, 69, -151, -99, 120]
4849A20L8k61r5K10J68j23k65J05K14L2k59q2J96J90j51j51o8L20K4k56m8K20
4871G8J22k10k16K26K06p2k75J2J88J16j67j63R9K28j20j80l7K07J57k15j50J24
4893d2J97r8j80J0J91O7j58j28J20J65m9j99JJ91N8k43o3J83J37j26k00J31P8
4916D3Q8j70r5J32J33q6k07O4K35Ok14n1J40J16j19r6M1J80k0j91j6J13M3m1j36
4941a08PK03k8k12lJ40R9q6q4O4R7l8j43%Q7R1j26m9L0J00P1j50p8R4J47j24j25
4968a24J29N4k5j65l4J88J09o0k58J74R2M8k09n5K21O3j09k13J59J28jj64m3J43
4992D8N2r1j40O8J58L5k15m6J62J45j98j48J58J48j26j03K2J57J9j43r9P0K16
5015A49q6j43k6K16Kj20j09J27J61j39j18jK29l1j37j42J86R8m4j83oK74Jk14
$$ y = [120, 158, -103, -198, 12, 180, 57, -208, -103, 111, 143, -116, -198, -2, 188, 37, -114, -182, 138, 162, -94, -142, 78, 200, -10, -226, 0, 206, 134, -141, -129, 59, 175, 8, -155, -56, 172, 52, -128, -165, 42, 199, -16, -166, -42, 155, 57, -123, -113, 78, 145, -13, -141, -21, 144, 95, -104, -103, 88, 146, -97, -160, 23, 160, 34, -166, -35, 43, 131, -39, -134, -2, 131, 45, -162, -98, 137, 143, -71, -122, 18, 134, 15, -81, -40, 140, 120, -71, -87, 26, 69, 28, -108, -101, 102, 74, -138, -141, -1, 98, 12, -72, -8, 89, 51, -92, -92, -5, 86, -40, -89, -59, 41, 112, -38, -116, -22, 125, 1, -124, 5, 59, 34, -131, -165, 23, 132, 72, -186, -12, 80, 128, -81, -136, 85, 148, 39, -174, -15, 113, 112, -52, -95, 48, 100, 9, -131, -63, 95, 130, -85, -131, 31, 176, -22, -170, -12, 136, 10, -93, -71, 86, 105, -38, -137, -67, 149, 63, -80, -106, 110, 112, -8, -117, 10, 171, 32, -86, -87, 142, 111, -26, -168, 18, 116, 72, -111, -117, 157, 158, -56]
5039e6j20K12J08j47j49J14J78p7j69K6J66Kp8j02PK08qj97l1J64N3r5j48J18
5063b1J71q6j19n9K14j5n2k15J62J29l8j13j42L25p5j11r3J41J47j41j19O2J34
5086H6Kj48p1J83L3J1j86k2K25o3r0l3Q2J15j12j02Q0N5Oq9r6J16N7J4j22pJ78
5113A02oj40j00J77L6m3j22pJ75j9j48L1L8J37j17o0LP6R1j66k8J11Q9r2j47Q9
5139d0O6L2j19n5J41P1j08r0O2R3K4j22j47K43Q3j33j31J16N0O3j57k4J18M5l9
5164D2j40JJ71Nj52r0J84J36j79r3J62K5k7r0qJ11N9j06r0M8J75n2j67q8K25N3
5190A15j24j65J45J44q1j36L1J36L4j33p9P6P9K8k25N2J80K8j77q0J33J38j22
5213cq2J04J12q5j05m9J04J35j56j12N5J93rj50q0J35J10j70n5N3J43o7j07J5
$$ y = [-56, -176, 36, 144, -3, -152, -38, 140, 63, -106, -80, 86, 88, 10, -92, -85, 123, 115, -82, -113, 51, 104, 9, -139, -21, 150, 64, -55, -114, 100, 85, 33, -182, -20, 109, 71, -42, -184, 141, 66, -45, -138, 3, 150, 9, -110, -48, 86, 88, -60, -131, 52, 85, 96, -90, -112, 113, 50, -40, -73, 9, 124, 12, -90, -10, 45, 51, -38, -134, -18, 39, 53, -69, -76, 102, 96, -44, -144, 33, 69, 26, -96, -103, 72, 53, -95, -64, -26, 111, -6, -66, -63, 13, 104, -62, -90, 21, 110, 18, -129, -40, 26, 58, -61, -116, 25, 96, -12, -102, -40, 53, 77, -45, -192, 51, 134, 1, -130, -14, 36, 99, -58, -82, 36, 81, 42, -98, -97, 74, 79, -73, -163, 21, 157, -22, -115, 47, 72, 45, -45, -53, 58, 117, 11, -79, -31, 144, 92, -75, -163, 62, 115, -9, -174, -29, 115, 34, -102, -71, 65, 99, -34, -113, -37, 42, 70, -155, -103, 77, 105, -72, -152, -19, 119, -3, -85, 19, 131, 46, -59, -108, -4, 131, -25, -137, -82, 111, 102, -48, -128, 7, 117, -53, -108, -55, 88, 21, -86, -71]
5237g1J24O9j16j44Q0J91k1k07nJ87K5j85l6J45P6j51o0J17RM2p5p9N4J11n5j01
5263g6j0J44K2j24n5J37l2Lp4J3N9j2l6n9Q3L1K2r4pJ03Qm7j05J19MQp4N8RQk5
5294Aj40J03J10j8j29p4K25m5r7k4J63mj4j28R0k0N3l4q4Q2O4m6j75J22J20N9
5320A60k15l2J01O4r8o9P2K6K3k7r1O9J08m2j66Q6J12%j81OQ6J21j48r2P2J09
5346E4pj16l2J13K0l5j11Q9J42n7j67LJ99M6j94r9J37P5L2k06O7Q8M8j57J0P7
5372A9Q0l9j94K9K22L2k12l2J15L0m0j09N0J08q0J1p0J05N6o1m7k4J35nj73k4
5398a18K20l9r5o2J08M4k7p5k2R2J1k6r5O1J34l1j48k0J38Mm5m9J06Jl4l4o6J31
5426F4km8j01N0O8L0j21L1N5lqm9oO6k8l0M2K4l7M8n7o2J37j9q7n2J18K2k9o4
$$ y = [-71, 53, 122, 6, -138, -58, 133, 112, -95, -100, 87, 112, -73, -109, 36, 112, -39, -99, 18, 27, 69, -6, -85, -31, 80, 25, -76, -86, 58, 80, -44, -99, 38, 6, 9, -65, -52, 7, -5, -41, -100, -17, 14, 36, -58, -65, 38, 46, -1, -106, 13, 17, 25, -49, 9, 18, 26, 1, -139, -36, 74, 56, -73, -147, 78, 33, -64, -88, 75, 71, 57, -71, 19, -1, 52, 18, -66, 16, 80, 34, -141, -19, 101, 160, -55, -87, 14, 78, -20, -89, -17, 9, 32, 5, -86, -17, 91, 49, -117, -31, 81, 81, -100, -94, -8, 113, -35, -127, -55, 54, 47, -69, -101, 12, 32, -3, -114, -25, 117, 60, -107, -104, 95, 141, -53, -152, -15, 60, 92, -114, -47, 41, 89, -68, -58, 19, 99, 60, -134, -105, 117, 149, -63, -95, 20, 50, 10, -99, -49, 59, -21, -10, -80, 25, 81, 20, -27, -51, 84, 79, -94, -118, 102, 63, -32, -94, 14, 58, 31, -44, -66, 26, 37, 11, -84, -23, 111, 80, -68, -88, 50, 54, 9, -40, 66, 67, 33, -1, -67, 64, 62, 14, -87, -37, 31, 61, -60, -29, 26, 23, 15, -34, -40, 26, -2, -32, 10, 34, -3, 45, -12, -74, 63, 44, -43, -95, 23, 45, 16, -48]
5456d8O8M9p6m0M5JM2l1n3j9J16j1k2n3M2N9p3J3l3P9n2j4k5N5K1k7p7O7L5Oj02
5487e8k7J31P2j38r4J52M1j2j54R6j5O8n6j02J21N5l9o7o9J50P1j75n3J02P6r4
5513a8l7nJ37Kj13J1o5J79p1j15N4P7J01k60O9J06N8q9j26J52M2l0p2k0R0O0j51
5540c4n1K7J35k6j49P6J47m1j49JJ01K3r7o2Q1N6L5n4j33J05Q2l3j81Q8J30j0
5566F7j25qR7k7k1n7J18qp0K1n6R7K2rm4j4Q6k6n8kP5q0L7k8L0jl7K8o7P9J0l9
5598a0n4J2N8L1q6K2L3Nm6nK4Pj9K5l9J8M4L4q9J8P0k8l9k8Q2P1j38l5J39p1o
5629@K5j07J2J41j0j16JJ19L2j56mQ6N6m9n5qL4M5m9k9NP8j1j43O2Q2J6r8m5J44
5659E8N3j43n2L2J27j6q4n7O6J01j24p7P4J29q7o7n2K31j3j25o7O2O9J0q4j3R2
$$ y = [-48, 20, 69, -7, -47, -2, -1, 41, 10, -43, -62, 54, 43, 21, -32, 10, 69, -4, 9, -24, 55, 3, -11, -36, 19, 40, 13, -64, 3, 38, 44, -58, -85, 46, 118, -20, -114, 38, 79, 67, -87, 9, -6, 62, 6, -96, 25, 80, 41, -26, -95, 55, 126, -49, -102, 0, 76, -18, -55, -60, 77, 79, -34, -23, -88, 91, 20, -95, -41, 36, 137, -123, -54, 52, 110, 21, -105, 47, 89, 59, -13, -33, 57, 117, -34, -85, -58, 77, 51, -98, -22, 125, 84, -65, -64, 37, 60, -37, -99, -18, 38, 73, 19, -114, -9, 73, 40, -141, -53, 77, 67, -58, -66, 31, 4, -17, -74, 44, 36, -34, -13, -69, 28, 50, 41, -3, -17, 69, 43, -15, -17, 58, -22, 15, -13, 17, 16, -21, 7, -60, 19, 29, -10, -64, -52, 6, 37, -49, -27, 6, 11, -35, -40, -16, -9, -28, -3, -42, -24, 20, 54, -35, -17, 53, 25, -14, -42, 40, 111, -27, -62, 77, 6, 0, 25, -82, -70, 71, 61, -55, -54, 65, 97, -59, -63, 23, 79, 30, -25, -33, 1, 46, -3, -32, -27, 51, 40, -103, -41, 41, 57, -41, -86, 58, 111, -32, -84, -52, 75, 59, -25, -82, -16, 85, -39, -116, -42, 87, 0, -67, -119, 112, 99, -26, -93, -31, 38, 48, -36, -49, 43]
5686D3R2j67q6Q8J58j38j34M8J74m1j39L6J04M4j11l2J2O5Pn5o0J11K3o3p3P8
5712a6J20l7j18J7R2Oj24n0J29P6p7o1P0J1L1j07p9J62pk4n2K6P3n2p3K7J55j04
5740A4l2Kj8Q6l4PK1r0N8mj02R3O9p3q5J14M7n4p1N5pJ6RJ2m5L1K9m2m4O2L7m6
5772A5m8j9R6o5M3m4J4j7M9l7knM1L4j12%J45o9l3oJ9k7JK2J1J9j8J2q0L9O4k5
5804A7j12L1P9P0j31j4K8Q6l9p3L5L1M4Mj02L8R5p9q1nJ68k4j09J3N1N3p2p9M0
5833c7L9M4p5k9M8R4p1p5j7J45k2r4l6J50k8j3p1P5m4J6m9Q0l2N9p2l1L3O7m8
5862Fq5O1P3J3j05J2M3L2k2q1O5O2n8k5m5Q1M4p3n4O3M7j1q8J3R9o4r7Q6N4on
5893C5j0p3R9kr0J0k0J40j56L1L0K0K1o3M5j7k2j2l2L7J0L8Kq3M4N0m8j0QO2m5
$$ y = [43, 135, -32, -118, -30, 128, -10, -144, -96, 78, 37, -102, -66, 38, 82, -29, -61, -49, 16, 23, -32, -92, 19, 42, -21, -94, -16, 104, 67, -51, -34, 58, 64, -60, -110, 19, 95, 18, -43, 27, 38, 69, -38, -117, 45, 38, 14, -38, -12, 61, 9, -64, -37, 118, 14, -18, -16, -34, 52, 18, 25, 46, -44, 14, 10, -92, 1, 70, -3, -88, 26, 73, 19, -52, 3, -4, 12, 21, 33, -12, 19, 48, 6, -38, 24, 61, 15, -33, -52, 44, -21, 22, -22, -8, -25, 24, -13, -15, -20, 21, 55, -57, -57, 88, 19, -14, -20, -1, -28, -27, -5, 6, 25, 7, 19, -61, -22, 42, 17, -95, -64, 15, 85, -46, -60, -32, 54, 15, -58, -23, 8, 52, 56, -46, -8, 87, 8, -73, -78, 90, 66, -43, -30, 21, 74, 2, -77, -37, 2, 46, -29, -58, -10, 84, 13, -62, -79, 66, 44, -50, -86, 64, 36, 23, -48, 27, -17, -1, -50, 30, -2, 57, -15, -46, -13, 54, 6, -79, -18, 55, 68, -37, -25, 18, 50, 28, -53, 12, 74, 16, -9, -54, 27, 71, -2, -56, 7, 54, 43, -45, -32, 67, 3, -94, -8, 46, 40, 35, 25, -48, 51, 49, -41, -31, -51, 89, -67, -36, -6, 14, 35, -28, 17, 0, -22, -34, -66, -29, -19, 19, 21, -62, -18, 32, -16, -26, -18, 44, -1]
5924aj5Q0m4p3P7L4p2p5R2K1n9J9L7J7m1K8lk6Mk0K2j1M4l1l8N7J8Nlj21J29K5
5956G6j14kM8L6m5J6J5o8N2j3n0M9M8n8m0K3J02j3j03pQ3J0r8L1M4J5m6Mmk0R6
5987F7n6p7N7Q7n4p2nJ11mp5j6P1Oj07JM9Q0%r8j6L4Q1o1j01P3J27l4r4j3J16
6017G7m8q8P2p3R2J8l5l7J5P0o0m5O8M7n2r8O5R1k9p6k0P0k0l9M5l2P9lj34JP
6048g2J27o3l4R5Km9p0J00k6k9o9N1O7rm4j2LN2p1J9M8PJ3p6m0Q2O0j42K4J08
6078E2j8p2L6K7On5O7K1p8j4pN1k0N9r6M1jN3ok7J9J3k9l4J7Ol3K4KrL1o1Q9n6
6112bK2Pm2kM6j7n7L3J9K4n5m6O6k0MJ1NK9Kk2o5L4kJ7l4M9N2n5k8J9M6n4n5N2
6146a9M0k7m3L4J3L2n0N0q5L1J19p0q7L5Q7m6o4L2N2J6m7m2R3k2mn8j1R4mp3l5
$$ y = [-1, -16, 64, 20, -53, 24, 58, -14, -89, 3, 24, -35, -16, 21, 38, -3, 25, 22, -4, 0, -20, 2, -9, 35, 4, -34, 23, 41, 46, 43, -78, 51, 76, -38, -40, 8, 44, -1, 15, 30, -38, 14, 1, -49, 0, 48, -10, -50, -27, 75, 62, -41, -48, 35, 45, -53, -22, 22, 37, -9, -5, -9, -29, 67, 11, -66, -9, 78, 24, -48, -53, 58, 54, -21, -37, 34, 40, -67, -66, -17, 63, 63, -35, -51, -17, 64, 3, -98, -25, 102, 68, -26, -39, 77, 29, -59, 13, -60, 32, 50, 15, -22, -7, 63, 3, -42, 26, 73, 21, -77, -12, 79, 50, -26, -46, 24, 4, -35, 10, -22, 57, 54, -80, -79, -72, 55, -8, -42, 53, 55, 6, -64, 36, 10, -19, -88, -37, 30, 21, -23, -35, -32, 20, -51, -32, 16, 23, 36, -40, -80, 2, 62, -80, -56, 52, 34, -38, -2, 25, 31, -24, 43, 64, -14, -28, -35, 16, -4, 55, -41, 0, -1, 52, 46, 19, 38, 51, 22, -12, 5, 11, -22, 2, 4, -5, 26, -35, 54, -2, 20, 27, -15, -17, 29, 12, -45, -12, 7, 31, -24, -70, -4, -24, -20, -9, -4, 25, 27, 5, -60, -26, -28, -11, -45, 4, 56, 1, -27, -8, 38, -16, -71, -19, 21, -6, -49, -15, -2, 30, -20, 30, -55, -24, 95, 25, -62, -27, 60, 14, -50, -18, 34, 50, 3, -39, 54, 32, 28, -30, -41, 53, 49, -24, -59]
6177e9N2L3K3j51O2J11o5o0L1R5l9k3o3K6N6J5q8jO4po3M2%N3p4RL1O3q2K9qL4
6209D6K4j05K6jj7Q2q6L1RJ5m0k9N1k1nk6P8n3K5rK8j5j8K1p7K6K4k0OK2K8J7
6241C7r9J9O9j2p4N1Lm8J9L9k2P5o4K4k3J6J4K0n0pN9p8L9L2Ln1rN3rom4O9l5
6274A0p8M5M9k1K6qK6jm8Nk3N9L1oj37L1N5J4l9M7Pn6j0PQoR1p0m3L7J0kn7P3
6308B6N2j22j0N8N7l5j08O8J5J9rr0N5P0lk0o6Q6%l1n9N4P7j33M5oJ7l9l1LR1
6339C1J0m6p1O7P4o6Pn1N3P1r4l4J31rr6k2L8k6J6Rj4J1N2l2j7M4m9L7o7MQ5j9
6371B7p8M4KN4q1K2Jj3j4N3k1j1lJPOM0l1Mn8Q0m4p8J33k4k3J6K9k8n2N4Monj2
6406em3K2P4l7nk6L7j4N2p0O2n8K3Kjm5J2N6k9L1m3%jJ8rN0r6PM0K5p8lJ27m8
$$ y = [-59, -7, 26, 49, -102, -40, 71, 6, -54, -23, 72, 33, 10, -53, -27, 29, 44, -44, -45, 19, 12, -51, -9, -9, 44, -30, -21, 10, 73, -9, 20, 12, 46, 70, -35, -9, -10, -27, 55, -31, 0, 9, 24, -16, -45, 6, -15, -20, -46, 32, -21, 4, -5, 23, 8, -10, 11, -66, -40, -16, -36, -30, -8, 20, 37, -62, -43, 26, 14, -60, -9, -6, -54, -35, 4, -18, 57, -7, 17, -6, 10, 24, 44, -6, -13, 46, -32, 7, 39, 42, -9, -18, 35, 26, 20, -24, 45, 10, -68, -23, 26, 5, 31, 23, 49, 48, 0, 5, -18, 41, 72, 66, -71, -40, 15, 29, -10, 37, 44, -12, -22, -15, -7, -13, 78, 8, -35, 2, 12, 10, -47, 26, 78, -44, -54, 4, 61, 26, -82, -14, 1, 20, 11, -79, -24, 46, 43, 23, -43, 43, 43, 12, -47, 7, 84, -49, -4, -10, 7, -32, -63, -60, 31, 41, -5, -76, -9, 65, -1, 6, -45, 8, 79, -15, -49, 82, 73, -23, -45, -7, -33, -17, -8, -22, -11, 41, 9, -8, 36, -13, 24, -43, -39, 46, 27, -51, -7, -5, 49, -32, -10, -9, -22, -36, 17, -4, -15, -18, -17, -10, -4, 36, 5, 9, -49, 31, -13, -91, 42, 18, -5, 11, 40, 12, -40, 14, 18, 12, 7, -5, -48, -26, 48, 11, 6, -20, 17, 3, 55, -15, 47, -11, 12, 14, 13, -32, -20, 36, 7, 38, -5, -5, -6, 12, 3, 53, -43, -36, 4, 29, -49, -52, 75, 27]
6440B7o8N2Jj6l8L6kL7j4k0oK8pj8oNP2oj10M5M5n3j1nK9J5m6L5l8O2l4lk0K2
6474a0P6j38Q0k0O4m2l4K1O3n3l9L4oK4l3j5J8M5No5J4K5J9p2j6P9Mm6nK2jjL
6507@K9qL7j07P6o4P1km8M2Omq2J3L0M5o4m8Q7J4K7m1l3Q8q1Nm3M5J22j21o9L6
6539d2M3k5l0R9j5o8k1K4N8mLOn7N0rj3n4J01Jm1l8M4P6q8l0K4mJ3m2O2J5m8L8
6572B8km1j9L9j6m9P1Mn4j8J42m2p1j5N0Lm2Q4l1m0oJK2J8j2l3j6M1P1K5j08N1
6604C5J2k7p9N9K1Mm4JM6j5m4J0L8l3l4M8m6L8O7p4J3NP1j10l6J1P1L0l6L9k8
6635A3J1k5l8M1L2j9m1RO0kr1NK3P6j24M7O3K7j13L4J0j2M9o0JJ2O3l3j6k8M0
6666A4Op0K3J19q0jl4K3K2n9PN0J9m3Pn6N3K6n5l5M8M7K6o7j1O8n2l4J8L1Ln5
$$ y = [27, -41, 11, 12, -4, -42, -6, -8, 29, 15, -5, -11, 17, 10, -8, -14, -9, 63, 57, -53, -8, 37, -16, -27, -32, -3, 12, -34, 1, -37, 25, -9, -12, -32, -10, 66, -72, 8, -12, 52, 10, -24, -3, 60, 7, -32, 2, -4, 20, -13, -28, -10, 35, 40, -25, -11, 14, 33, -39, -55, 24, 28, -18, -23, -1, -2, -3, 0, 29, 21, 58, -49, 27, -37, 34, 32, -16, 26, 32, 28, -54, -41, -11, 34, -30, -78, 9, 23, 50, 9, -24, 64, -17, -12, -55, -10, 112, -9, -78, -42, 1, -24, -54, 45, 30, -38, -59, -35, 23, 19, 22, 28, -29, 21, 12, -1, -55, 46, 47, 6, -32, 12, 88, 0, -30, -6, -10, 3, -39, 23, 38, -10, 28, 26, -15, -34, 5, -11, -60, 11, 15, -39, -57, 85, 43, -28, -43, 7, 10, -32, 52, 21, -19, -25, -24, -2, 16, 4, -29, -45, -4, 67, 92, -16, 35, 47, 20, -59, 0, 21, 25, -19, -18, 28, 13, -31, -21, 17, -16, -50, -2, -48, -10, 57, -17, -4, 1, 72, -38, -74, -63, 8, 38, 2, 41, 13, 24, -1, -39, 2, 34, 15, -26, -17, 43, 41, -50, -45, -22, 54, -70, -23, 40, 67, -46, -12, -2, -14, 35, -25, -24, -12, 51, 18, 2, -26, 14, 20, -50, -27, 92, 12, 11, -23, 0, 22, -37, -30, 20, 39, -4, 3, -53, 0, 26, -29, -64, -16, 31, 57, -10, -21, 47, -5, -39, -21, 10, 13, -42]
6698d2j9L1L9k2OqK9J9n7m1J00J5k3m8M2j0l9pL7L3m1J4m2K9J2j8l3J0J19k2p8
6729a5m4J04l8l5oJ02m1Rm6Mj6M8j1j9j3J4J0l3k6M2N1n3j7P3Mo4O3K7p4m6J7
6760b9P3jl8pj6O7j9q9LQ5N6r1m8M8R9q6MPM5q1N4m0M1L0r2LK4NJ8j1m9J2L7o1
6794d7lJ04k8l7o5P7K1j1K6JJ0nkl3p4M5Rn1J08k1m1J2k0R3k6r2N2L4Mm9kQNK7
6828B9j6m6QP2l9l5M4M4o7r9J50j1n4l9M6JJ9k3l3N6J0J5n7jM5K0o4j3L1J01j14
6859b0okN3j2LK1m4k3k2O2K7K2p0k0k9J37j11oj5Q2l8ol3J28p6j6k0K6P1p2K4
6890A5J3k1Q3q7l4N2K0q2QM3M0n1m2K1J9K2n6N3%k5k2j6J9RP8j08j6O1L4n6QN7
6922C9K3j01j6Q9k1L4n7NL0l9O9j20P4N5k7p8MM6ml1lN0j1p2j6P0M4q6N4l4K0
$$ y = [-42, -61, -30, 9, -13, -7, -15, 14, 33, -24, -65, 35, 50, 27, -21, 21, 11, -28, -35, 2, 35, -6, 8, -34, -5, 7, -11, -44, -34, 85, 63, -15, -59, 45, 7, -28, -34, 68, 27, 36, -10, -6, -22, 26, 15, -4, -17, -3, 7, -26, -52, -10, 41, -12, -29, 44, 48, -16, 47, 74, 0, -46, -29, 44, 43, 5, -2, -18, 49, 30, -59, -56, 29, 85, -6, -54, -6, 93, 7, 11, 18, 63, -18, 36, -4, 37, 67, -25, -22, 2, 7, 25, 14, -35, -23, 14, -47, -50, 54, 26, -11, -76, 1, 22, 11, 37, 38, 48, 43, 41, 8, -66, -21, -12, -63, 45, 24, -17, -5, -25, 68, 42, -50, 2, 36, 40, -9, -11, -3, 2, 29, 13, -33, -25, 47, 8, -27, 17, 61, -6, -105, 45, 34, -20, -59, -13, -12, 7, -16, -49, 7, 17, 32, -25, -26, 19, 39, -25, -38, -7, 94, -20, -26, -28, 25, 13, 16, 37, -7, -30, -52, 10, 37, 59, -11, -31, -60, 77, -34, -40, -55, 27, -11, -17, -50, 78, 2, -14, -34, -8, 63, -9, 15, 28, 7, 90, 3, -31, 21, 41, -41, -33, 10, 50, -1, -43, -22, -3, 19, -37, 16, 16, -9, -31, -47, -28, -19, 59, -49, -65, -4, 30, -26, -18, 39, 62, -39, -55, 34, 13, 47, -10, -5, 25, -14, 55, -65, 9, 64, 37, -41, -37, 9, 5, -26, -29, 21, 10, -62, -78, -8, 36, -50, 4, -30, -10]
6953a0J1L6k7K7m2L6j3M6J7r0q0L7J10n1m9L4N0J5n0k1N5qm1l9K2K4O8j18j5J05
6983C9L1o6p4R0R6r5n4j5J12q2j0J5N7k6p5O9l5N5op1j4N6N3o8n8R1L6n7j6JJ8
7014cJ5o8R4j0M5q9mkK9N1o4j0O5J5j40N2Q7Kj25j3J11l6j2L9m7mP4m0l6j4Q3
7045D5k3j07J07K3j4j06O8Q1q5K1k5K7M2n1j7k2KL6J9q1O4J6k5k4L8N8r5K6J2
7074A0nj3kn5O2N3n3%J3l6K0k6K4l7J07p7MJ9K4l9p8R5Pm4L9k2M5Oq9O3j5K6q
7107A8m4j1N3k1n4O7P1Qj07QL7kl0J4oJ4k6Lj6J5M3m7n4O5O3q8r0J26P9l9j42
7138i3L8R7k3j2l8K9J7J9j15N5M8K3o0RnN3o9rO0j2m2n4N7L5l6J4J1k9Q9p0jN
7170iK6N4j90O5Q2M0j18M1N7k7k3j5M0ll8j0oJ5P3r1OK9N4k0n5PM0m9m9O0J09
$$ y = [-10, 1, 37, 10, 37, -5, 31, 18, 64, 81, -9, -89, -52, 58, 7, -42, -8, 42, 57, 7, -14, 41, 33, -8, -47, -25, -1, 67, -51, -66, 39, 70, 4, -70, 20, 116, 21, -33, -48, 64, -18, -28, -13, 44, 18, -57, 12, -23, 32, 26, -45, -59, -3, 50, -18, -76, 15, 51, -6, -22, -21, -3, 12, -56, 38, 28, 73, -16, -20, -22, 7, 58, -6, -16, 49, 64, -76, -24, 63, 65, -60, -73, 38, 2, -10, 29, -18, -22, 52, 12, -24, -38, 45, 22, -85, 22, 45, 31, -75, -7, 74, -11, 10, -15, 12, 54, 3, -14, -36, -34, 2, 21, -60, 4, 20, -5, -29, 9, 67, -28, -2, 10, 5, -8, -10, -65, -3, 50, -3, -3, 10, -26, -6, -32, -8, -45, 62, -15, -11, 8, 32, -7, -85, 10, 17, -27, 12, -10, 35, 41, -48, 15, 0, 26, 18, -26, -37, 16, -5, -59, 8, 79, 87, -20, -12, 25, 23, -7, 7, 1, 15, -11, -8, -24, -9, 34, -13, -67, -2, 61, -27, -117, 9, 88, 49, -93, -55, 42, 19, 7, -31, -2, 15, 34, -81, -26, 22, 45, -15, -6, -11, 42, -27, -36, 24, 12, -30, -84, -27, 8, -28, -14, -3, -32, 57, -13, -14, -9, 17, 71, -119, -54, 28, 68, -50, -9, 48, 21, -2, -17, 23, 20, -18, -28, -34, -19, 54, -37, -31, -2, 52, 32, -23, -16, 24, -25, -74, -14, 95]
7201I5q3n7k0N7Pj2J3l4O9N0j58J8K9J14j08k6O8mm6n3P5J1ol1N3k7K3K4q1K8
7231a2oJ07q9j3M3lo1KN9mk9PJ4K8m8qk1J1K5N2r8O5Pk3j4k2O2j0q5N5M1j7m9
7264c4k2L3m3N5j6K1N0j1m9pK3N2k4p7k6Q3j4j01J16mJ1o3pJ30j8m9m1N7J1J2
7294D8p8o3J19J7j02J9R0kr4l8J08L0p7K2n5P9J9l6m4J1N1l6j9j6R9m4p5P6O1
7323G0k8r2lJ29j8n7K4Mj9J3n2p0R0N8j0o0k7R8j4j07M9N9J3j02L0Q7n4k4k8J34
7353I3n4k3l5KP1om2l4QL1K4r5L3Q7o3m0L6Q2n2m4P3o6N2o0k4L3M1J1l1q0P6K8
7385C2m7m9R1j4n7k9N1L5n5RK4ko4N7Qj7O8J6r6LQ0k8n6j4J03j8n1m1N5K6n4K9
7417ej9M8m5K3l1j6J14r8k7L7N9q6j7O5Jm8pM9N5j3n2mLL2K7p3J3M2M6n5n5L3
$$ y = [95, 12, -45, -65, -8, -1, -13, 0, -34, 35, 85, -73, -55, -26, 88, -20, -46, 22, 18, -28, -81, -6, 5, -1, -32, 21, -6, 17, 41, -40, -12, -18, 89, 0, -13, 30, 27, -34, -32, 27, 23, -6, 1, 15, 43, -5, -13, -34, -23, 2, 54, -44, 21, 28, 5, -9, -31, 31, 21, -64, -9, 32, 15, -34, -56, -23, -66, -11, -27, -6, 44, 33, -16, -23, 0, 52, 28, -49, -75, 8, -6, -107, 9, 5, 16, -47, -54, 76, 58, 9, -32, 25, 36, 48, -30, -93, 26, 43, -59, -40, 50, 48, -46, -84, 24, 54, -23, -1, -56, 23, 42, 6, -38, -27, 24, -12, -31, -47, 52, 8, -67, 9, 70, 42, -50, -53, 76, 58, 1, 25, 29, 10, 23, -29, -99, -9, 49, 39, -21, -48, 50, 36, -71, -22, 37, 50, -52, -22, 65, 11, -13, -41, 93, 39, 16, -19, -17, 54, 48, 6, -28, -20, 11, 35, -60, -27, 60, -3, -43, -7, 75, 23, -21, 52, -14, 38, -22, -46, -13, 28, 39, 8, -72, 4, 32, -15, -64, 27, 13, -44, -73, -22, 13, -42, -33, -9, -11, -75, -18, -10, -27, 41, 57, -39, -36, 44, 16, -40, -54, 49, 31, -20, -61, -6, 20, -34, -5, -24, 24, -21, 2, -29, -45, 69, -29, -56, -19, 40, -46, -63, 2, 3, -45, -52, -3, 52, 39, -13, -17, -14, 18, 45, -28, -15, 27, 73, 18, -37, -4]
7449dM1%p1M3N0l7J6k4qJ5m1nL4J0l5l1j5M9P5q1m5N7O2p0k2Q3M9j17%O2mJ3o2
7482a3J0kN5m7k6RP6m8p0M1O0k8m1k3J14k9j3oOk1rj8MJ8M8k1r9O5J22j21n7Q7
7514B3M4l4n7J8P6o8m9KM8Q8n2j09O7J5J6%m4K5j4P2r8J9R4p1k2J3M8n0k6L1M
7545IN8m4m6N7J2J0j21O0J2kn3QJ13qq5m1Q1k7j2K5l8L8nl2j2P2K7J1n6l9R0J
7577F3r8K4O9l6p0M6MMj2J9pJ3j4j9k6O1K6k4q6O0Q0m0o3K7opj5j9P9n5M3r3R0
7610A8m7L5rOQ3p2J5m5P2k5m2m4P9Mn4%JO1l0K1l5J8K5Ml6k0K2jm5j1J04K0q7
7643a5L4L2J3j01L1QJ3o1J1K6J1njl1K6O1l3m9lJ39k6j42j7J22j2p7M9j8P1n4
7673Bm5M0lM0l6JL7Q5j59k3P9N3p4nQJ7k0mk2J2J01j00l7L1kR5n3n6P9J7q5m8
$$ y = [-4, 37, 37, -34, 9, 59, 22, 38, 14, 6, 21, -20, -25, 9, 19, -16, -47, -62, -13, 62, -19, -64, -7, 55, -15, -37, 46, 95, -22, -22, 40, 36, 49, -13, -3, -5, 50, 3, -23, -14, 62, 14, -56, -15, 45, 17, -24, -47, 67, 38, 25, 19, 25, 4, -5, -23, -19, -1, 47, 26, -73, -8, 114, -7, -64, 23, 67, 33, -24, -6, 70, 2, -47, -45, 3, 91, 39, -70, -3, 12, 28, 28, -16, 9, -5, 67, -31, -12, 82, 11, -11, 2, 50, 0, -26, 5, 9, 67, 23, -23, 34, 46, 56, -65, -5, 7, 5, -48, -40, 73, 65, -20, -61, 20, -7, -19, 6, -32, 6, 1, -31, -43, 29, 56, 67, 11, -28, 62, 63, -35, -11, 58, 22, -48, -2, 2, 6, -6, 13, 6, 19, 5, -14, -40, 21, 47, 23, -63, -3, 77, 37, -26, 1, -5, -12, -27, -46, 33, -22, 21, -72, 18, -29, 6, -3, 3, 86, 14, 29, -16, 56, 31, -11, -55, 24, 28, -26, -26, -25, 36, 6, 27, -8, 10, 35, 39, 3, -17, 5, 4, -41, -52, 52, 72, -15, 19, 51, 64, -37, -6, 2, 15, -46, -35, -9, 2, -3, -4, -35, -9, 52, 19, -30, -33, 106, 80, -62, -79, 43, 31, -46, 3, -15, 56, 2, -43, -3, -6, 34, -2, -1, 36, 121, -38, -61, 18, 71, -3, -8, 0, 17, -3, -7, -29, -17, 84, -16, -53, -22, -24, 71, 18, -38, 41, 58, -27, -75]
7705g5R5K5o2n5M1M2kl4kL5l1O7q5J4J08j6l7k4O9k0j09J4Q7J1j12k2P2P0o5m0
7735d1M4J1L3j4m4NPk2j3M9P2j01l5R3O1p6n7L6M0K4r0N1k7k%Pq0O9MK9q3O7M3
7768F0n5k4MM3l4Pl7M6l2k3M5qk4N8ol8L9N1q6k7K7P1l8m3K6N1l0p9N6N1j10P1
7800A2L6m9N5n4q6J13L1m2o1K4J12p2p3j3J23k9K4j00Q8m6M8q8K8J03l1j8o6L0
7828aJ0k5q7J05KJ2k7LL2jj8n7O1rQnpP7qj7n4rJ13r7m9N8N3n5m4N8o6M7n9OP6
7863B6k8L0o9J2K7K1p3qQ8M0p7J0K3J2o6N2j7N8o9k0M1m8O1kn3kP0Qn9J0P3k8
7895D3p9M0N8o4K9o8Q3m9n1N7j9J9J3M2p1L8J3o1r6J60ll9l4P8J6K3q1kL3L0k6
7926C2m4MqL2l6L0RRp7J5Q9l7nm2L5L2p3KQ7k6M8j03J0O9Kn4k4L8oMo0K4N5rm6
$$ y = [-75, 20, 45, -17, -72, -31, 11, 9, -25, -27, 8, -23, 44, -41, -27, 81, 65, 28, 4, 73, 53, -56, -42, 45, 56, -56, -78, -6, 64, -1, -41, 3, 14, 47, 33, -11, -6, 1, -21, -34, 15, 87, -14, -49, 44, 105, 29, -28, 8, 48, 72, -18, 33, 6, 4, 4, 11, -69, 0, 4, 33, -50, 17, 60, 5, -19, -15, 28, -6, 1, -36, 10, -22, -45, 0, -8, -32, 26, 20, -18, 21, 72, -14, -41, -14, 57, 19, -24, 2, 53, 23, -56, 0, 51, -59, 12, 48, -1, 54, 0, -86, 27, 58, 16, -45, -21, 91, 19, -54, -67, 56, 27, 51, -49, 39, -7, 41, -47, -19, 84, 53, 35, -31, -1, 9, -16, -103, 2, 4, 16, -11, -8, 24, 23, 5, -52, 9, 0, 8, 3, -4, 73, 65, 48, -6, -15, 98, 1, -48, 10, 63, 8, -36, 22, -44, 3, -56, -50, 26, -2, 28, -41, -29, -2, 19, -54, -62, 26, 66, -11, -1, 22, 34, -32, 20, 3, 61, -8, -28, 13, -35, 26, 24, -29, -31, 39, 47, -12, -2, 71, 43, -36, 4, 62, -2, 27, -41, 42, -7, -58, -1, -20, -1, 12, 54, -17, 21, 34, -27, -123, 37, 34, -5, -39, 39, 55, 78, -3, -5, 28, 58, 32, -12, -8, -16, 16, -20, 10, 19, 28, -49, -34, 55, 18, 13, -29, 6, 38, -35, -33, 54, 28, 76, -27, -17, 52, 54, 0, -24, 14, 8, 12, -48, -24, 31, 22, -24]
7961b4J2LJ6m0P5J0j6mj9o6P8oMn0K6K5J1o5rR8n1J4m8P4j6Qk2L1l0k4k4N2J5
7994C8Oo7j1L1O4p1l6L2L2M3j10M4J7Qk7PJ2NJ6p0J3P0J5r3rQ2n1j5rL9J2k7M4
8027C4j8rJ8l2j3M1O5j07K4k6Q4k3o5j0O7K4o0k9O9o8J0L1mj1K7n2L1L3Ll8p9
8058h3J09k7k5j9O2N9p1pj9P2p1N0OJp4K2nM6J6m9M1q2K6N4o2J4Q4Nj08l0R9o
8090B8j7K9l8M3m5M0k3m0J4M2l8l7P5j5l6j7Q6%j15N4O2j0o8k1K7M6J5Jl1MJ3
8121B8q2L5l7R3k2o7l1J38m4p1pJ21j2j4o4k0P6JJ6n0L5M8j20M2J6O0l7j46R1
8150b4R1l4k4mM5q3N1k3QQm5N4m4P0rk9Mk9O6n9j4P4L3l1rm8k3R2r3%K6L6k4n1
8184d2M9J2K3q9K8O3p3
$$ y = [-24, -12, -9, 7, -33, 42, 52, 36, 32, 13, -53, 25, 19, 23, -27, -1, 24, 35, -30, -39, 59, 8, 22, -26, 48, 32, 40, 18, 49, 19, -5, -29, 23, 38, 44, -23, -34, -3, 61, -10, -46, -14, 18, 61, -49, -5, 12, 20, -7, 0, 12, 17, 33, -37, -24, 46, 61, -32, -41, 41, -10, -25, -34, 5, 17, -10, 34, 16, 7, 25, -7, -20, 21, 86, -21, 3, -23, 61, 38, -27, -37, 30, 54, -6, -35, 34, -34, -24, 7, 3, -8, 19, -33, -2, 31, 34, -4, -83, 26, -1, -26, -45, 17, 76, 5, -2, -21, 51, -20, 30, 36, 37, -37, -15, -20, 26, 42, -7, 34, -48, -22, 32, -30, -16, 68, 73, -35, -65, 34, 28, 11, 40, 2, 45, 0, 40, 17, -23, -9, 33, -5, -42, 33, 18, -18, -35, 51, 51, -64, -10, 52, 42, -26, -47, -20, 26, 41, 42, 11, 15, 28, -54, -19, -56, 37, 15, -52, -83, 55, 11, -60, -67, 54, 42, 28, -36, -56, 20, 21, 37, -13, 22, 70, -50, -8, 8, 68, 31, -115, -24, 67, 33, 9, 5, 50, -33, 18, -5, 3, 11, -34, 20, -24, 46, 37, 8, 12, -17, 49, -10, -24, 50, 83, 52, 43, -5, -28, 64, -29, -29, -3, 33, 9, -42, 7, 19, 42, -47, -19, 44, -29]
8191b9
$$ Imaginary data points
##PAGE= N=2
##DATA TABLE= (X++(I..I)), XYDATA
0@%%%%%%%%%%%%%%%%%%%%lL%LpPlMqQqQqOmMmLjjLnNrJ4j5J8k2K8l0L0l6L9l7
54a8L5l2K4rj3M8j08K00l40N76r85J728l225O785j8152J11499N39272n37584o91601
73e91900M56497N94109k85135m69573J01886K96247J02472j14259k92351p1195
83b73202M60911K33280n81919l64320O51120M47803o55782m82418O01358M65074
93E01905m90406m04581L38214L08384j57597j91878l2440O6801K15381N1191l73629
104a68655j52151M93246K24570n63604k64092N79848K68067n41828k39780M55474
114I1095J85248l30006j14112J80170L7330k0318L4610j32755r1966K65237J27832
125B32365l64617j37972M23229J22325m37698q4527M09358L0177l43918L1152
$$ y = [0, 0, 0, 0, 0, 0, 0, 0, 0, 0, 0, 0, 0, 0, 0, 0, 0, 0, 0, 0, 0, -3, 0, 0, 3, -4, 3, 0, 4, -4, 4, -4, 4, -4, 2, -2, 2, -2, 1, 0, -1, 2, -3, 2, -7, 7, -8, 10, -12, 16, -14, 16, -20, 19, -18, 17, -15, 9, 0, -13, 35, -73, 127, -213, 363, -622, 1106, -2119, 4666, -13486, 98013, 637285, 99701, -591900, -135403, 458706, 173571, -296002, -194116, 102131, 204603, 90344, -202007, -273202, 187709, 420989, -160930, -525250, 125870, 573673, -82109, -564527, 36831, 501905, 11499, -393082, -54868, 253516, 95919, -95959, -128399, -61598, 153783, 204974, -168655, -320806, 172440, 397010, -166594, -430686, 149162, 417229, -124599, -364379, 91095, 276343, -53663, -167775, 12395, 49725, 29407, 64017, -68738, -160704, 104533, 232365, -132252, -270224, 153005, 275330, -162368, -246895, 162463, 192640, -151278, -120126]
135a20126K50501r0542j41226J38112K8029j67020P6864J71969j63431j50958
145a67828K23917J05888k54481m0816K54650l6268k26922J17323J77552j91845
155c8830j14123K50942M5938k86438J8656K92542p1633k66899J06842K10300j21599
166B5698j27542J14992K5681q9854Q4463N0661j92328m203K85866m1997l54899
177b23462Q0930L91208j06175l89742J13611L50131j01009k74935O9894J71735
187H2186k3380n0115l2491p7843R1062J99371j43972l02938J84007L78037k05648
198I8276m17771K04101M18135j78100l79929J28906L06273o0948k04986j9563
208a05606Q5636J04538M0321j84386j60940K50771K65120k95394l42667L12711
$$ y = [-120126, 130375, 39833, -101393, 36719, 64748, -102272, -25408, 146561, -16870, -167828, 56089, 161977, -92504, -133320, 121330, 85062, -141860, -24537, 153015, -38830, -152953, 97989, 143927, -142511, -123855, 168687, 97054, -169845, -63003, 147297, 25698, -101844, 13148, 38829, -51025, 33438, 84099, -108229, -112432, 173434, 131437, -223462, -142532, 248676, 142501, -247241, -133630, 216501, 115492, -159443, -89549, 82186, 58806, 8691, -23800, -101643, -10581, 188790, 44818, -258120, -74113, 303924, 98276, -319495, -115394, 302741, 124641, -255288, -126382, 179891, 118943, -86043, -105606, -19970, 84568, 124889, -59497, -220437, 30334, 295454, 60, -342607, -29896]
218b9896L87416k99209l95198K55043L66420j83538l04261R0719K15890J4553
228A17939j11064j22273jK21180J05936l01713j96792L54920K64157l75424l02807
239c45942L60302L10530l10921k88323K32025K40308j30559j73191J7168R4884
249F281R7916j3727k02950o1698K88436J24427l46054j69224L70540J93342l60196
260g2907j95968L16117J78627k43414j45392J49207J00804m3391n1071o4004J959
271f9433J62410M0533k42626p1837K97351Q9566l22149r2041L15638Q0721k79232
282i1099n8138K18276K8727j39295K628N1022l0523L7016N0666j16123n9712J78555
294G2000N5918k19214l9836K34620J3431k25245J9268J93752n4159j45172Q5988
$$ y = [-29896, 357520, 58311, -336887, -81844, 284576, 101038, -203223, -112504, 103386, 117939, 6875, -115398, -115399, 105781, 211717, -89996, -286788, 68132, 332289, -43135, -345942, 14360, 324890, 13969, -274354, -42329, 197979, 67420, -105771, -88603, 6281, 104197, 90470, -112480, -174178, 114258, 238685, -107369, -276593, 93947, 287289, -72907, -268875, 47242, 225869, -17545, -162937, -13730, 87074, 43683, -7388, -71392, -69433, 92977, 133510, -109116, -180953, 116398, 205964, -116185, -208226, 107412, 188133, -91099, -149237, 69039, 97766, -41529, -38901, 12121, -18402, 18614, 69280, -46843, -106555, 72000, 127918, -91296, -131132, 103488, 116919, -108326, -89058, 104694, 50535, -94637, -8649]
305h649Q5752j09846k2967J22063l5815j19698Q4574J02331j18328p0402J34575
316D3590K6939j32215K3796J13725p6871q2358J26192M3318j66487k221J92382
327A09790l5393k00476O3903J88646q0309j56937Q2122J07568o9561m4957M4286
338H682k5023j0039R5727k8305j59583O5596K10111r6040k41621J15263K50771
349A85539j19406k36047J07375J98796p9470j42351L8064P2071J2273N095o6178
360b4239q2186J17058J51278j58760k06401J85447K42450j93395k56230J80259
370d4719K46816j46437k15376R4761J65213k9702j00792m2081K8787J13419M4242
381A14131j76359j11310K24178J66604k51596k04720K54792K22650k33073k19564
$$ y = [-8649, 77103, -32743, -55710, 66353, 30538, -89160, -4586, 97745, -20583, -90985, 43590, 70529, -61686, -37890, 75835, -1036, -83394, 42798, 86116, -80371, -82592, 109790, 74397, -126079, -62176, 126470, 46161, -110776, -28654, 78914, 9353, -35604, 8682, -16341, -26380, 69347, 41042, -118541, -52945, 157166, 61126, -180495, -65232, 185539, 66133, -169914, -62539, 136257, 56787, -85564, -47500, 24571, 36844, 41939, -24239, -106425, 10633, 161911, 3151, -203250, -17803, 224647, 31252, -224978, -44719, 202097, 55660, -159716, -64955, 100258, 70556, -30236, -72317, -43530, 69889, 114131, -62228, -173538, 50640, 217244, -34352, -239072, 15720, 238370, 5297, -214267]
391b14267J87970J96108j23497j55810M5525J02945L7969m3570j18971j6343J89375
402H7434P0924k42238j14973K72291J44957k76219j58794K54063J56685k07629
412a3499j39899J41769J11679o2828p5698k1264L6427J02424J644j72855l5104
423a27204K25442O1010k55893p7416K61027Q3583k41417q0153J99356O8518j39580
434b2727n1120O8517L0910O463j0775p7820o120J38670J8178j83236k3408K07887
446I5419K1786k10857j3874J93012J397j56995J3126J07425k7181n0429L7729
457A0558p752m2988O0907M1060j04024l1562J32659J4910j44646P087J39903l1964
469D4148j19968N6773Q8325p8115m9374R3481Q463j00070K9552R6670n9916q2757
$$ y = [-214267, -26297, 169811, 46314, -109496, -63971, 38974, 76943, 33373, -85598, -101941, 87434, 158358, -83880, -198853, 73438, 218395, -57824, -216618, 37445, 194130, -13499, -153398, -11629, 100050, 37222, -38476, -59740, -23313, 79111, 80755, -92100, -127204, 98238, 159248, -96645, -174061, 86966, 170549, -70868, -151021, 48335, 116853, -22727, -73847, -5330, 25580, 32043, 21268, -56552, -62672, 75998, 94176, -89060, -112468, 95419, 117205, -93652, -107526, 85486, 86883, -70112, -56986, 50439, 23258, -27171, 10558, 2806, -40182, 20725, 61785, -42239, -73801, 58858, 73768, -70878, -63791, 76112, 44148, -75820, -19047, 69278, -8837, -58211, 35270, 43733, -56337, -26785, 69885, 9969, -72788]
481g2788P9490N9123q6380k7563Q0272r350o2806M7841L6721q4376o062J14910
493F9032k5041j36253N1895J45508p0827j41411P9232J23509p5423r3198N9915
504a3062N3016l4060o460J069m1596L5189Q7039p0146j24902R9034J51753j17849
516A9025j64861J23598J62856j14603j46280R0940J16308n4751p6174R326K9422
527e194M0455J9304q9114o5805J31058J05864j61111j35991J75622J53735j72201
538c378j57536J50727J47612j12625j24791O1547R1727k556n1588n8312Q248J14972
550F4047L3962j61533p1434J92929J00564k06091j19112J99238J25600j73014
560a4844j20330J29804J04227p3592p9806J0027N0207N4760j8424j14404j2020
$$ y = [-72788, 6702, 65825, -20555, -48118, 32154, 22804, -40002, 7839, 44560, -39816, -45878, 69032, 43991, -92262, -40367, 105141, 34314, -107097, -27865, 95644, 20221, -72977, -13062, 39954, 5894, -566, 503, -41093, -5904, 81135, 10989, -113913, -14879, 136874, 19025, -145836, -22238, 140618, 26015, -120265, -29325, 86983, 32232, -43942, -34616, -5194, 35261, 54565, -34549, -100354, 30704, 136568, -24543, -160534, 15088, 168823, -3378, -160914, -10187, 137425, 24800, -99991, -38444, 53283, 50727, -861, -59173, -50925, 64047, 98009, -63524, -134958, 57971, 158535, -47556, -166668, 32570, 158170, -14844, -135174, -5370, 98857, 25265, -54541, -44514, 5693, 60453, 42029, -72375, -84395]
571h4395J63074L8721j96010n8946K10070P1777k03970p6495J78130P3835j35513
582a9722o4889Q0397N1408j8766l5407m3649J8771J00186l431j45590r198J75396
594H5506J8036j87232k2733J80607K3309j56542k0295J18309J5086p0267q716
605b4932J7910K855L3614J335p8861k772J13473J099j34663L832J40686j1400
617F2176j31973K0299J10032k9363p8075L6621L9968m0795n45M0750l6173l5358
629d2436O5730K5052q5405j0061R3536q078q9545K7846P4830m6881n1702O3317
641A6203K3637p4978N507Q0401l1887p8660N2104O9338o3781n3005O5329L0662
653D0870n6995m501L9819k3341j6507N0285r865p3874L5903R1589n7898j01427
$$ y = [-84395, 78679, 117400, -78610, -137556, 72514, 144291, -59679, -136174, 41956, 115791, -19722, -84611, -4214, 47194, 28428, -6979, -50628, -31857, 68329, 64898, -80692, -89890, 85506, 103542, -83690, -106423, 74184, 97493, -59049, -79344, 38965, 54051, -16216, -24932, -7022, -4167, 29447, 30782, -48079, -50851, 62622, 63721, -70942, -67110, 73576, 62176, -69797, -49498, 60534, 31171, -46904, -10283, 29685, -11110, -11655, 29095, -7078, -42436, 23294, 48346, -37059, -47120, 46416, 38338, -51207, -23361, 51469, 4588, -47114, 16203, 39840, -35138, -29631, 50770, 18883, -59777, -7673, 61665, -2116, -55121, 10208, 40870, -16125, -20626, 19193, -4148, -20655, 29630, 19765, -54109, -18206, 73383, 15485, -85942]
665h5942P2895J02493p8519r4113P3842P7026n8803n2598L4932K3158m687Q728
677A8412k8706m0054O1211O7853q8936q9728J08264J03537j16618j08281J12154
688h92J03474r4950q9699O5985O8634k8312m1904j4402J2274N7627J7788r6614
700d0991m5370J27073O8355j45234q4813J49310R3250j38103r3391J12701Q5445
711H8232p5540p0643L0304N0269J8544k6841o6118K291J07538K0819j38894m0447
723a00486J56682N5303j59477o3999J46726O6510j19715o2936Q1167N4575l4725
734A9625m2414j4788K8208O2660j3345j04116o69J35070J2607j52519k1807J54853
746F3365K7572j42175l0095J15692K9714p8845k7071L5296K2816J0168j7814n2877
$$ y = [-85942, -13047, 89446, 10927, -83186, -9344, 67682, 8879, -43719, -8787, 14371, 9684, 18412, -10294, -50348, 10863, 78716, -10220, -99948, 8316, 111853, -4765, -113046, -892, 102582, 7632, -82067, -16082, 52552, 24240, -17664, -32066, -19792, 37835, 55623, -40991, -86361, 40712, 109067, -36167, -120980, 28330, 121580, -16523, -109914, 2787, 88232, 12692, -57951, -27647, 22622, 41166, 14325, -51793, -49502, 58036, 78855, -60039, -100486, 56196, 111499, -47978, -111977, 34749, 101259, -18456, -81392, -225, 54350, 19625, -22789, -37577, -9369, 53291, 39946, -64170, -64839, 70231, 82838, -69681, -91488, 63365, 90937, -51238, -81333, 34359, 64073, -14772, -41843, -6547, 16269, 26437, 8623, -44254]
758d4254J2962Q8686q758j14066N739J27056m057j26544L703J13560m305q9731
770d0009N341N8349o257k2973O322j2606n089M4631J922o9931K974Q6145r581
783C9238r2044J7105Q7371k4937p3322L1779N2011l6560k6219L8556p17l7022
795b4761K5790L1738m5872k2671N8697J0676o2851L424N8374j8377m6115L2773
807H25K7864m5172o305N4218j5710n9011L5031N8706m9067n3592N6149M3368n5050
820g746k9213M5890J2155k9865O554Q912k4901J4416M1551l7128n4823N6527O3744
833F6073o9920o7237P5426O4952p1853n7307N9524M4629l9223k8335J2924R563
845g84J6490R640m6012k7788P2044M3402r1748n5069J02495O1821j02594o3341
$$ y = [-44254, -31292, 57394, 48636, -65430, -59691, 67365, 63308, -63236, -59533, 54027, 49722, -40009, -34668, 23681, 17424, -5549, 773, -11833, -16922, 27709, 29631, -40300, -37326, 48819, 39238, -52806, -35701, 51670, 26733, -46589, -14810, 37201, 641, -25578, 12978, 12261, -24761, 1029, 32767, -13105, -35776, 22921, 33597, -29254, -25830, 32544, 14167, -31948, 825, 28689, -16483, -22788, 31430, 15720, -43291, -8260, 50446, 1379, -52213, 3936, 47304, -7746, -36959, 8931, 21086, -8779, -2225, 6687, -18214, -3798, 37753, 625, -54198, 2329, 66073, -3847, -71084, 4342, 69294, -2559, -59866, -342, 44287, 5064, -23271, -10347, -784, 15706, 25346, -20666, -48454, 23590, 66992, -24756, -79825, 22670, 84491, -18103, -81444]
857h1444R1921N9652p1030n0950M1906L8641p526k3566k8720P458O2866Q503r1267
870d3556k3007J11013L4739j19843m3137J16738M7488j02072m7847P7083M4440
881E2039m4507l7989P453K9087L0465j8897o5339Q180R3968K118j13279j1174
893f7875J21685J8533j18060k3904J03123K7195p8237k8309M6032K7574r837k5387
905g467k6738K2006N9892j7980q6421J3469J03673r057j10152M754J05385q47
917E0517r0275k644O6663N799l7425q491N853J0973K4842j3167n1386J5276P1231
930D7766j7005q2533J8366Q4723j9146p7952J9060O3342j8019m3002J5675J9367
942A0642j2098M636P256k6632j261M4004n375n5274J2305N9342j9100n5831K4918
$$ y = [-81444, 10477, 70129, -901, -51851, -9945, 28696, 21170, -2396, -31116, -23658, 39208, 47711, -43556, -66563, 44450, 79189, -40654, -83791, 32947, 80435, -21637, -69484, 7599, 52039, 7532, -30457, -23004, 6083, 36548, 17651, -47688, -39508, 54460, 56578, -56701, -67875, 53810, 72343, -45717, -69621, 33502, 60697, -17540, -45849, 183, 27757, 17920, -7467, -34205, -12199, 47693, 29713, -56708, -43239, 60434, 51377, -58775, -54021, 51364, 50517, -39758, -42402, 24261, 30060, -7365, -15856, -10003, 970, 25812, 12645, -38741, -23465, 47766, 30761, -51772, -33406, 51317, 32171, -45781, -26721, 36621, 18602, -24400, -8725, 10642, -1456, 3180, 10436, -16196, -17457, 26547, 21172, -34102, -21797, 37545, 18445, -37386, -12468]
955a2468M5886k9251l0747L1707J2557l1673O373K9280k3527k4378L6805J7250
967B7814m4530q521M5741j232m0481J1176K9378k0652j3911K8443l782l4137K1175
980c519L7304l6357l7461M6976L4802n1762k9374M9859K1754m1203j2447K7039
992E611K296q595P943j1871j7514L2261K5584m9853l1712O2688L5313o9079l6337
1005e3265O7981L4493n9148l0358M3432K3861k2168j5951k473P165K7875J867
1017B3311n1369j0378P0440J7634q2441k3418Q6402K7222q1326k8900O7899K8450
1029D3526m7238k5997K1413K2029O823j6955l4639J0985N9194m754p7963j601
1041d5177Q9055P404r1356j2559Q4581J6892o9716k0083M8054K2178k1910k2952
$$ y = [-12468, 33418, 4167, -26580, 5127, 17684, -13989, -7616, 21664, -1863, -26241, 10564, 27814, -16716, -25237, 20504, 19272, -21209, -10033, 19345, -1307, -15218, 13225, 9443, -24694, -3519, 33785, -2572, -40033, 6943, 41745, -10017, -39391, 10468, 32222, -8981, -21428, 5611, 7907, -688, 7255, -4616, -22130, 10131, 35715, -14138, -45850, 16838, 52151, -16928, -53265, 14716, 49209, -9939, -40297, 3135, 26996, 4828, -11123, -13596, -6431, 21444, 23311, -28058, -38436, 32004, 49638, -32803, -56221, 30181, 57403, -23923, -52823, 15076, 43526, -3712, -29709, -8296, 13733, 20556, 3601, -31038, -20053, 39141, 34387, -43576, -45177, 43878, 51282, -40074, -52633, 31948, 48840, -20876, -40959, 7095, 29273, 7363, -15589]
1053a5589o031K2445L3258k0664n6840J7829P4538j3841q4747R251Q6269l947
1065D1931p9394j561O4830O870m4224j1789J9655J6000N938j9304l0165K1371
1077i842N0501k2355o4681K1883P1740j9934p1211J7007O3206j2796m9045P681
1089a7846L0601j941j0028l835j0372R574K8479j4867m2288J9020N0761k2093
1101A5165n3119K3550M9413k3368m0553K1429K7622j8026j2329J3138l365p284
1113g727J7589J034k8857N370L5925j1270l7892J6427L4733k0119k7053K2371
1125E31J5912k2918k748K1768j0627j9125K2450J5078l1289j0126L5763M605l5402
1138a6128J046L0081o442k0564J1183P799j4805O434J7316k0449j8590L2634J8661
$$ y = [-15589, -21620, 825, 34083, 13419, -43421, -25592, 48946, 35105, -49642, -40391, 45878, 41931, -37463, -39024, 25806, 32676, -11548, -23337, -3682, 12318, 18256, -1048, -31213, -9842, 40659, 18304, -46377, -24494, 47246, 27312, -43899, -26892, 36314, 23518, -25527, -17846, 12755, 10814, 786, -3049, -13421, -3847, 24632, 9765, -32523, -13503, 37258, 15165, -37954, -14404, 35009, 11641, -28912, -7483, 20139, 2113, -10216, 2922, -443, -7727, 9862, 10896, -17961, -12591, 23334, 12064, -25828, -9401, 25332, 5213, -21840, 531, 16443, -6475, -9223, 12545, 1918, -17207, 5243, 20321, -10968, -21094, 14669, 19274, -16128, -15082, 14999, 8557, -12007, -824, 6975, -7830, -1396, 15920, -4529, -23119, 9515, 28176]
1151B8176m1275j7399M5295J5248m4002j2353L7503Q893k6199n253J1494J526
1163A654N182K062k2139n406L7410Q202m9287j0612N6325J2307n7560j3538N2709
1176A7309J4049m2197j3760K6853J2988q339j1494j1478R518L0534o951m6842
1188b9810M092N8606q03o4532k559O3944N993n6881r313M4000J2269k6783j4790
1201a6567O883J6516J3617j7362l2743J7090M8477j5549n9425J2855O4363q904
1213B9251o2974L978N5593J633m2836p438K6271J2908p308j7707j1786K1289K9218
1226C0092k3200m3414K3246N2888k1593n6604J7933N4601j2970m7205O888L5178
1238A5840j65k0122o624L684J2888J2359j8148k6321K2113L6821k4226m2766K4473
$$ y = [28176, -13099, -30498, 14797, 30045, -13957, -26310, 11193, 20086, -6113, -11366, 128, 1654, 6836, 8898, -13241, -18647, 18763, 26965, -22322, -32934, 23391, 35698, -21862, -35400, 17309, 31358, -10839, -24599, 2254, 15242, 6903, -4591, -16069, -6551, 23983, 17032, -29810, -25718, 32888, 32085, -32447, -35006, 28938, 34931, -21950, -31263, 12737, 25006, -1777, -16567, -9684, 6832, 20449, 3087, -29656, -12566, 35911, 20362, -39063, -26208, 38155, 29251, -33723, -29745, 25848, 27481, -15355, -22793, 3478, 16386, 9078, -8629, -20415, 874, 30092, 6892, -36522, -13276, 39612, 18019, -38585, -20652, 33949, 20979, -26226, -19338, 15840, 15675, -4447, -11071, -7387, 5501, 17860, -288, -26609, -4496, 32325, 8099, -34667, -10194]
1251a0194M3795k2633m0030J8934L2372j3844k1504P444R111n85L479o290j4852
1264a4797J2341K3855j7443k9433K0759L1149k2200k9132K1784K3582j9470j5385
1276a4390J5610N811j0684M164N201j3200L83K0274n432k4406R745K5113j2822
1289E367k2327J4588J6438j4978q360J4178j346j2165J0869R537j9370o482K5552
1302A1501L238k8592k66K8065k330k3849M215J6446n282o680N720m287n569J5512
1316G842M835k5217m088L2746L184l6711k616L6807K380l2932k559K5189L174
1329A2034j4611l945K067M673J1106n282k3436N365L3668m758m0754L557M3631
1342B3315j525m2184r24L6286L889k6556o911J4059R762M3j2061j4253J3537K7170
$$ y = [-10194, 33601, 10968, -29062, -10128, 22244, 8400, -13104, -5660, 3451, 2866, 6345, 55, -14797, -2456, 21399, 3956, -25477, -4718, 26431, 4231, -24901, -3117, 20465, 995, -14390, 1220, 7031, -3653, 511, 5712, -7488, -7105, 13169, 7737, -16669, -6924, 18189, 5367, -16960, -2372, 14066, -912, -9272, 4906, 3560, -8605, 2264, 11801, -7569, -14051, 11501, 14739, -13853, -14119, 13946, 11616, -12233, -8018, 8428, 3146, -3534, 2186, -2101, -7670, 7842, 12677, -12540, -16628, 16118, 19302, -17409, -20025, 16782, 19162, -13770, -16329, 8860, 12034, -2577, -6522, -4455, 218, 11324, 6042, -17394, -12029, 21639, 16881, -23873, -20316, 23315, 21790, -20394, -21318, 14968, 18857, -7699, -14610, -551, 9211, 9254, -2807, -17060, -3523, 23647]
1356B3647j4092l7287J3223M3791j1221m5899P895M3341l498l6662j511K6309
1368H036O890j3567j2019l27J6288J4163j9433k6307K1082L5646k0772m1223J8516
1381a3027M2733j4435m0060R022L3486k575k3812m277J2124J0731L94j6427j2337
1394a8460K0519K2689k3045l0176K3261L4308k1526l4620J7791L1380j2509k5032
1406a5420O240J6415O43o535p350l381J3322J2393j8040j9465K1140K4008k2263
1419A707k5544K1302K4029j8433j9990J4026J3883q515o526K280j157L802Q161
1432I025r321j3765J3524J7482j6329j8622J7353J7417j6645j3838J4448Q577
1444I306j0973k317O792m179k294J0124j959j4675N494J7351q214j7578R638J5484
$$ y = [23647, 9555, -27732, -14509, 29282, 18061, -27838, -19943, 23398, 19900, -16762, -18273, 8036, 14926, 1359, -10660, -10987, 5301, 19464, 31, -26276, -5194, 30452, 9680, -31543, -13027, 29706, 15271, -24789, -15767, 17719, 15144, -8668, -12945, -821, 9910, 10304, -6123, -18460, 2059, 24748, 1703, -28473, -5212, 29096, 7570, -27050, -9259, 22121, 9612, -15420, -9180, 7235, 7878, 1343, -6007, -9388, 3934, 16327, -1713, -21178, -38, 23970, 1707, -23837, -2535, 21494, 3061, -16929, -2903, 10980, 2465, -4061, -1781, -2938, 864, 9025, -296, -14061, -537, 16945, 616, -18006, -653, 16764, 119, -13719, 729, 9306, -1667, -3984, 2808, -1371, -3665, 6459, 4500, -10175, -4681, 12670, 4456, -13122, -3484, 12000]
1458A2000r962j1248R153N205p339J591M913q593k207J4820l37j9580K632K2112
1472A3160m089k2130M712J9514m319j4536L206P700j348L10q58q624L039J6270
1486A2007m809k2534N930K6509o116k7883N243K6283l402k1924P09J5229K377
1499G619o835n583k352Q340J1701j0528j9816J1604K6120j1446k9684R911L0496
1512A9547p254k8115L472K3043P88j5468n565O495R988L109j3704j2473J6293
1525A56K0426j7444k6381J6957K9597j4708k9958J0995K7423o060k2123K17J4909
1538D006N883o451j1481k530J6306J0947j9544j7978K0920K3040k0366k5647J7760
1551e135K5710j3571k2979P830J8229j570j1835m868M464J0799K904j5664r640
$$ y = [12000, 2038, -9210, -57, 5148, -2191, -600, 4313, -4280, -6487, 8333, 7996, -11584, -8952, 13160, 9071, -13059, -8347, 11167, 6848, -7688, -4482, 3218, 1870, 2180, 1322, -7302, -4263, 12007, 7198, -15336, -9406, 17103, 10987, -16896, -11653, 14630, 11228, -10696, -9987, 5242, 7619, 784, -4799, -7151, 1189, 12890, 2362, -17454, -5850, 20270, 8824, -20860, -10949, 19547, 12293, -15822, -12350, 10693, 11481, -3987, -9552, -3057, 6931, 10040, -3664, -16137, 156, 20582, 3138, -23243, -6286, 23311, 8603, -21355, -10360, 17063, 11003, -11120, -10903, 4006, 9889, 3438, -8043, -10573, 5733, 16680, -2864, -20842, 78, 23118, 2752, -22895, -5135, 20575, 7004, -15975, -8145, 10084, 8514, -3321, -8189, -3725, 7074, 9978, -5686, -15326]
1564a5326J8944J5025k0319j8599J9959J9880j7471j9148J3645J6246q452j1835
1576g451K652O513L267p63q756m662J3290R039j6299j2275J7731J3753j7343j3562
1590a4866J5309J1602j1793q342P220M216k162J32k764m336P046P967j0379j0258
1604a1408J2344J1144j2805j0563J2049Q359r894m995O810R96l278L259l45p201
1618e528L486J0353o077j2181P554J2600q031j1404P358Q711n765m808L429J17
1632a86o09M803k094r424M608J3149o423j5450P225J6225o979j5261N655J2576
1646G815l403q470N63L238K672K434n772q100Q206J3076r859j6671J0155J8787
1660A4671r362j8923P224J7176m064j3662K80Q751L835k897p618l261J0751R259
$$ y = [-15326, 3618, 18643, -1676, -20275, -316, 19564, 2093, -17055, -3410, 12836, 4384, -7451, -4799, 1714, 4981, 4218, -4538, -9200, 4090, 13129, -3170, -15445, 2286, 16039, -1304, -14866, 443, 12045, 252, -8090, -870, 3346, 1184, 1316, -1448, -5784, 1262, 9229, -1150, -11408, 936, 12080, -725, -11288, 761, 9120, -774, -5769, 1041, 2037, -1241, 2018, 1673, -5528, -2042, 8311, 2234, -9947, -2393, 10207, 2176, -9228, -1870, 6841, 1076, -3732, -303, -186, -795, 4008, 1914, -7510, -2902, 10247, 3824, -11626, -4401, 11824, 4845, -10416, -4761, 7815, 4412, -4058, -3495, -257, 2415, 4849, -923, -9023, -817, 12259, 2400, -14271, -4116, 14671, 5309, -13614, -6390, 10786, 6722, -6940, -6660, 2091, 5926, 3029, -4589, -7850, 2901, 12160]
1674A2160j2944j4292J3855J7931j3227j9939J1276J9833p994j7913L742J4187
1686F675J116r242o018L442J0440K651j4087q407J6462J3168j7231j6537J6315
1699a253J8308j3730j8051R639J6198m595j2775r01Q187O466l074j1330k264J5142
1713E967P071j7438j0986J7957J3580j6663j4810J3758J4394r566j2555M497R600
1726D806P99n748o034J688J0485K424j3818o011J5832Q618j6112j0179J4905J0520
1740A2175j2175r729Q406P870l885n331r53K378N469O10r162l504J1877N542j3211
1755c623o776J3092P098j1630o376Q912M887n397k793J546K94K453K124n742m243
1770f174Q235N784r582o545R750O389q761n370O758L487m031j200R52j497K103
$$ y = [12160, -784, -15076, -1221, 16710, 3483, -16456, -5180, 14653, 6659, -11254, -7512, 6675, 7791, -1451, -7469, -4027, 6413, 9064, -5023, -13430, 3032, 16200, -1031, -17568, -1253, 17055, 3325, -14726, -5087, 11111, 6516, -6259, -7160, 1027, 7493, 4419, -6911, -9175, 5967, 13038, -4400, -15386, 2571, 16151, -512, -15322, -1564, 12830, 3264, -9291, -4794, 4806, 5605, -143, -6177, -4489, 5996, 8420, -5398, -11409, 4423, 13041, -3071, -13250, 1655, 12175, 0, -9729, -1323, 6547, 2662, -2669, -3622, -1244, 4225, 4835, -4327, -7831, 4046, 9588, -3623, -10399, 2693, 9791, -1839, -8215, 697, 5584, 187, -2606, -1060, -766, 1687, 3811, -1931, -6174, 2061, 7845, -1737, -8282, 1468, 7857, -904, -6274, 484, 3971, -60, -1260, -308, -1805, 298]
1785B98M034m607o240O537P772p611q398P498Q183o450o932M491M935j957k054
1800e01r07j160L852M125o114o937P844R100q600j0354Q207J0547o769r727M417
1815b977P738j418m913j995J514N293K099q044n596R964Q593j0772j0818J0486
1829h46J1946q892j1883O190J0766k818q479r93N437M851j897q282j878J1028
1843D250N406j2660q485J3051J0616j2074j1781R773J1860o574j0708K449Q682
1856C805J851n679o176K420R841J082j2481m458J3978P271j4031r259J2671J0248
1870A1083r947j0251O283R173j975p258k489M648O690j785j0102j128J2409L861
1884I212j3598n949J3228P364j1509q022Q812P755n225o722J231N225K667l105
$$ y = [298, 4332, -275, -6515, 22, 7794, 183, -8215, -717, 7466, 1016, -5916, -1425, 3510, 1553, -501, -1408, -2568, 1284, 5409, -705, -7642, 202, 9302, 702, -9652, -1445, 9102, 2333, -7394, -2977, 4761, 3343, -1570, -3565, -2051, 3242, 5341, -2703, -8299, 1665, 10258, -514, -11332, -846, 11100, 2208, -9675, -3485, 7281, 4463, -4016, -5009, 428, 5279, 3382, -4900, -6778, 4250, 9656, -3004, -11489, 1562, 12178, 104, -11677, -1904, 9956, 3382, -7326, -4877, 3805, 5656, -23, -6199, -3779, 6062, 7144, -5337, -9795, 4183, 11454, -2577, -11836, 835, 11083, 1136, -9115, -2832, 6341, 4366, -2892, -5381, -733, 5957, 4172, -5930, -7058, 5351, 9212, -4386, -10335, 2893, 10257, -1252, -9274, -462, 7293, 2068, -4654, -3423, 1802, 4469, 1364]
1898A364o392R78R238J165j1089l104J1874M343j1186n218R480N368o838m940
1912d957L627L879j26k452l302Q82O168P44q278k177R430L148r345l686Q292L733
1928E580o356l051L623K228q06r21k085n36M668J788o410k997P380L746p506l943
1944e598O564L689m842l067K600J888j19k98k507j246M692K764o231m061P042
1959A270N034o968n401O022N252m220m571K045L093O89j472l283n13N576K520
1974E073p267m316Q008N753p944o565O849O708m869o264K425N067N57l446l478
1989c709J412O103Q42q197k966R422M866r584o333Q816P137p084p223M457O801
2004D760j426n685j930M054N045j997p744j67R611K326j0591m254J0464N791r309
$$ y = [1364, -5028, -4050, 5188, 6353, -4736, -7840, 4034, 8377, -2809, -8027, 1453, 6821, -17, -4957, -1330, 2549, 2423, -29, -3331, -2449, 3719, 4463, -3815, -5992, 3438, 6586, -2759, -6445, 1847, 5580, -776, -3827, -204, 2024, 1218, 297, -1788, -2324, 2344, 4132, -2278, -5275, 2105, 5851, -1655, -5598, 966, 4655, -187, -3254, -654, 1234, 1115, 817, -1690, -2936, 1756, 4520, -1711, -5772, 1270, 6304, -664, -6065, -43, 5209, 989, -3582, -1537, 1556, 2245, 773, -2510, -3023, 2553, 5073, -2194, -6510, 1498, 7251, -693, -7258, -409, 6299, 1430, -4834, -2409, 2658, 3215, -231, -3709, -2297, 3806, 4648, -3549, -6515, 2907, 7773, -1811, -8144, 672, 7809, 725, -6498, -2041, 4760, 3334, -2351, -4281, -227, 4818, 2821, -4923, -5090, 4521, 6847, -3744, -7998, 2466, 8257, -1052]
2019a052o649P104O964m215o536Q37N584K563l975n776K200Q307j66r982j868
2034f660J0676L542j0223m821Q615N614o246n838L232N484Jm570l245L336O064
2049D961j804q273L02R428J289r640k611Q938L572p344m152N076M266k261m008
2064b261o71L384L423k321n758J072P377R8q129j270Q037K092p033k667N220L007
2080C600l016k859N65K276K002j617m136P57N759J73o553j061O636J729n863k168
2096c776M532K153k581j960M48J436J756p70l720k2N022Q95n818j580N864K132
2112D011n246k520L994K592k288k229L00J531J909p95l697j47N112J169n935k095
2128d334O066K845n433l337M155L453k352l227K08K571J981j632m015N49N589
$$ y = [-1052, -7701, -597, 6367, 2152, -4384, -3547, 2037, 4600, 625, -5151, -2951, 5356, 5190, -4792, -6660, 4016, 7558, -2665, -7486, 1129, 6743, 497, -5341, -2109, 3375, 3376, -1194, -4439, -1103, 4961, 3157, -5116, -4814, 4614, 5903, -3737, -6348, 2590, 6162, -1182, -5334, -258, 4008, 1747, -2261, -2932, 452, 3875, 1554, -4204, -3132, 4245, 4343, -3786, -5056, 2981, 5073, -1960, -4627, 593, 3600, 584, -2275, -1710, 566, 2568, 951, -3185, -2428, 3331, 3504, -3049, -4110, 2526, 4255, -1608, -3776, 756, 2909, 328, -1632, -1184, 252, 2008, 1238, -2482, -2504, 2518, 3413, -2405, -3985, 1879, 4011, -1235, -3755, 239, 2831, 543, -1686, -1386, 145, 2054, 1259, -2438, -2585, 2527, 3696, -2239, -4334, 1732, 4577, -856, -4193, -38, 3415, 1063, -2164, -1956, 615, 2596, 964, -3051, -2502, 3087]
2143C087O36o551j869O829K969o337l706N072M155l298m085J045L725J314k959
2158B7l593J896N578p48o820p13P520J983p428l041O444L910m906m368K802M409
2174B952l43m097k136L358M313k158o194R25P312N16p694j833P287K990o079l767
2190d648M218M295k035m302m50L969K777l241m787K103O310q91p202l57P335J449
2206D543o579k505N280L160l414l555J195L684J015l350l049K713M804j864n929
2221c851Q86O440J37o184j229N430K045m105k547K242K851k81k797j685K476L368
2237C196j864m699J173N288k86n392n82M913J262l837j864K369K184o38k139j021
2253a937J830K694j474l796P75M594j34m823n04M363J140l418j580K153J790o22
$$ y = [3087, 3723, -2828, -4697, 2132, 5101, -1236, -4942, 130, 4285, 987, -3098, -2053, 1672, 2986, 27, -3566, -1670, 3908, 3160, -3660, -4373, 3147, 5130, -2298, -5339, 1105, 5015, 109, -4259, -1457, 2952, 2609, -1488, -3624, -266, 4047, 1889, -4305, -3380, 3932, 4448, -3246, -5079, 2208, 5198, -881, -4648, -430, 3865, 1830, -2472, -2922, 1047, 3824, 583, -4204, -2101, 4209, 3318, -3884, -4241, 3094, 4543, -2036, -4541, 739, 3899, 485, -3070, -1875, 1809, 2824, -526, -3575, -862, 3942, 2078, -3851, -2965, 3475, 3612, -2572, -3801, 1629, 3674, -431, -2978, -736, 2115, 1834, -963, -2648, -172, 3196, 1332, -3367, -2194, 3094, 2808, -2584, -3166, 1747, 3009, -828, -2692, -323, 1861, 1223, -916, -1937, -107, 2587, 1113, -2683, -1908, 2686, 2552, -2271, -2775, 1588, 2728, -690, -2270, -117, 1673, 1051]
2269A051j871j003J678K459j282l596O56M261J01m542p26M237J381l454j730K084
2285b96K188p30k125q44J821K334j284l647O53M412J43m680r63M476J642l703
2301f03k279K546K521j009k587n79K374K154j902l537J206M561l39n076m82N012
2317A981J323m423k125L407K689j950k984L09K986J353k702k942K179M153j407
2332A847m978N01N266M26n001j423M209K267k948k850J396L172K54l082j946K750
2348a40L415k136m356J206N002k80n057o71M576J628l639k451K312K948q14l073
2364a530q29K940K320k624l486J942M298j097m677K61M482O44l860j479K906K167
2380B378j613k530J39K722J230k593k473K230L330j516l978Q71L979N1l704q30
$$ y = [1051, -820, -1823, -145, 2314, 1032, -2564, -1908, 2353, 2454, -2088, -2814, 1423, 2804, -650, -2380, -296, 1892, 1162, -963, -1807, 14, 2348, 1064, -2583, -1930, 2482, 2625, -2055, -3018, 1458, 3100, -603, -2882, -336, 2185, 1176, -1411, -1990, 384, 2538, 636, -2901, -1695, 2866, 2527, -2549, -3031, 1981, 3304, -1119, -3244, 163, 2852, 902, -2082, -1773, 1213, 2566, -136, -3078, -899, 3254, 1847, -3131, -2630, 2636, 3062, -1939, -3362, 847, 3114, 166, -2684, -1288, 1884, 2138, -944, -2890, -140, 3275, 1139, -3217, -2011, 2991, 2711, -2346, -3017, 1559, 3187, -452, -2903, -591, 2357, 1543, -1530, -2359, 581, 2901, 277, -3209, -1267, 3031, 1934, -2743, -2482, 2000, 2644, -1216, -2695, 211, 2378, 765, -1765, -1626, 1096, 2326, -267, -2740, -510, 2820, 1304, -2674, -1803, 2176, 2227, -1477, -2307]
2396b307K999J460j947j926O21K230O57k279j808J973K792j578l287Q82L543j46
2412A879l302n84K733J222j931j639Q34J901L43j907j509J817K325j363l007Q55
2428a333L261k42l143m38K706R39j840j507R40J745J99j862j290J819K137j425
2444F66k773Q91L191k62l174m44K825R91k060j585J100J934J2k044j137J926K086
2461B143j561k814R81L258l52l313l76L010J121k500j610J561K061m73k269o19
2477a752K215J748j973k567J544L071q02l441J30L343N76k830j275J984J937j113
2493G95k288J4K400J099k326k088J991K764j340l264O71L424P0l094q97K520J524
2510A975j616k104O44K390M67k435j388K159K252j748k861J153L113l85l089l64
$$ y = [-2307, 692, 2152, 205, -1721, -1100, 1130, 1787, -492, -2300, -327, 2465, 887, -2400, -1518, 2025, 1879, -1423, -2007, 726, 1948, 17, -1622, -788, 1113, 1456, -451, -1960, -143, 2182, 819, -2188, -1333, 1928, 1686, -1457, -1895, 811, 1750, -90, -1597, -657, 1088, 1287, -575, -1865, -46, 2091, 666, -2107, -1216, 1975, 1713, -1461, -1905, 920, 1911, -149, -1734, -634, 1300, 1312, -732, -1869, 57, 2143, 582, -2232, -1251, 2007, 1655, -1658, -2034, 976, 2097, -403, -2013, -452, 1609, 1136, -1133, -1752, 463, 2211, 238, -2329, -785, 2286, 1484, -1957, -1827, 1516, 2092, -738, -2013, -29, 1908, 795, -1493, -1479, 921, 2020, -306, -2394, -403, 2361, 1021, -2243, -1572, 1852, 1922, -1172, -2069, 451, 1975, 359, -1745, -1101, 1289, 1756, -679, -2067, 92, 2344, 596, -2265, -1112, 2001, 1616, -1473, -1837]
2526a837K724J012k051j710J235K067k05k339o75K233J603k015k271J554K734
2541B059r15k786J25K666N00k173j096J430J724o74j950l13K101J113j984j750
2557a923J549K267j105k428L68K449K44k091q46J505J424q07j727m1J913P98j876
2574c27j397J511J985j128k212N48K247O2k057n50J483J137q89j575K64J717M56
2591A275j701j149J453J771j209k034O63K186j42j927n29J658R67j045j366L61
2607g68J656L59j711j051J565J604j242j995P76K162j93k115l85J812Q64j253
2623H5j396N87J724Q9j818p89J735J368j363j931J010K108m30k093q9J870P17
2640A384j552j204R70J660l60j789l48J748J043j596j596J305J890p64k094J97
$$ y = [-1837, 887, 1899, -152, -1862, -627, 1440, 1235, -1104, -1779, 454, 2057, 42, -2229, -675, 2059, 1144, -1642, -1517, 1149, 1649, -524, -1620, -190, 1534, 860, -1090, -1403, 698, 1811, -173, -1923, -374, 1893, 788, -1640, -1272, 1177, 1421, -670, -1516, -11, 1413, 606, -1121, -1162, 751, 1549, -327, -1724, -213, 1772, 644, -1568, -1020, 1227, 1289, -768, -1318, 165, 1302, 413, -1162, -898, 819, 1275, -426, -1575, -122, 1649, 440, -1594, -931, 1255, 1113, -814, -1343, 315, 1282, 237, -1129, -768, 888, 1247, -464, -1515, 50, 1654, 412, -1583, -807, 1355, 1162, -953, -1338, 474, 1338, 85, -1311, -724, 1000, 1089, -729, -1518, 217, 1585, 222, -1709, -699, 1409, 979, -1114, -1203, 667, 1384, -168, -1372, -402, 1258, 898, -891, -1239, 509, 1552, -44, -1640, -335, 1555, 791, -1303, -1106]
2656a106K023M08j737r81J238J453o37j742j8J825O87j726j274J490J620r79j924
2673a380N05J912J58j783o74J352J197r06j448J57J776L78j760q71J505J385j173
2690C30j774Q23J756j95j762l31J501Q03j065j215N49J488Q1j702m74J527J016
2707A356j245j405Q67J576l51j602j86J465N91j120j044O99J301j39j476l96J441
2724C32Q55j267j238R72J463m79j602N8J412N41j165r55Q64J188l29j387j46J377
2742D94O75j329r26Q95J323o11j422J56J345L26j265p55J002J053m85j384Q9J364
2760E45M63j296q24J020J238p78j359L14J375K17j317n93J014R80o00j251J75
2777f77J359L09j300p90J167J033q47j238M03J372n9j229m23J096P58p12j135
$$ y = [-1106, 917, 1325, -412, -1393, -155, 1298, 661, -1081, -1099, 726, 1413, -313, -1587, -97, 1523, 544, -1380, -875, 1037, 1195, -588, -1262, 90, 1287, 381, -1067, -910, 866, 1244, -516, -1387, 118, 1503, 330, -1444, -621, 1135, 940, -822, -1153, 348, 1151, 86, -1129, -580, 908, 989, -713, -1187, 340, 1356, 111, -1294, -427, 1149, 798, -804, -990, 475, 1066, -54, -1098, -399, 902, 763, -713, -1109, 332, 1187, -80, -1318, -346, 1117, 638, -964, -906, 506, 1047, -118, -1073, -209, 979, 650, -737, -883, 494, 1169, -160, -1086, -191, 1132, 521, -901, -745, 600, 926, -339, -1094, -92, 961, 476, -908, -819, 545, 1008, -288, -1112, -92, 1146, 368, -991, -677, 698, 915, -402, -995, 19, 999, 399, -852, -677, 682, 991, -309, -1099, 68, 1101, 254, -984, -581, 791, 732, -497, -920, 176, 934, 222, -913]
2794i13M05J271O7j367m75J263Q24j024j054O64J220k82j203k15J106P12r86q94
2812h81N06J169j28j306k51J308N37j044q83P38J088l59j183q3J165M73r37q48
2830i19O02J146l10j171n6J187L40j034o83Q24R36n07j032R3J104K43r27o06P40
2849c0Q08m63j017J08J102K03j064m52P97P87n68r38K79R68J52r69m77P42Q07
2868G75n21r23K47R88Q9r69m10Q37O47o27q75L52R58lr66k86P49O24n60q74L34
2889d14R98o0r46k51Q45N58o91p18M05Q60p0q75k56Q04N32o92p31M24R61j95r95
2910e07j01Q74M14p49n76M64P70j89q53j51Q09M63o73p19M86Q75k33r29m8R36
2930C63K54p36n58O01O77k83q18j0Q39K63p51n25O35O55l01q88P9R38O1p65l59
$$ y = [-913, -508, 763, 830, -537, -1012, 251, 1075, 51, -1003, -339, 881, 599, -604, -819, 287, 999, 13, -881, -375, 794, 666, -640, -891, 417, 954, -90, -973, -235, 853, 494, -689, -772, 393, 866, -71, -919, -317, 829, 519, -652, -708, 479, 819, -215, -898, -74, 862, 355, -677, -584, 520, 763, -164, -770, -30, 778, 315, -702, -594, 508, 711, -353, -805, -8, 779, 211, -727, -448, 520, 672, -297, -774, -32, 775, 254, -669, -422, 566, 655, -314, -724, 113, 760, 133, -742, -390, 568, 565, -401, -687, 62, 686, 126, -748, -414, 584, 524, -422, -673, 172, 730, 39, -679, -274, 586, 516, -359, -615, 189, 721, 29, -702, -278, 683, 488, -507, -608, 266, 680, -69, -645, -181, 589, 400, -453, -604, 205, 668, -5, -724, -238, 637, 404, -525, -573, 363, 617, -119, -677, -76, 601, 318, -500, -510, 329, 592, -159, -684, -49, 606, 305, -583, -504, 434, 495, -270, -629]
2951f29O00N69l61p14J83Q04O2p20m14O01N93l63q07K95Q56p6q04j73O14M04m54
2972F6n26J89O23Q9p17k55O07M90n19o12K98O94k7p67j36O56L06n11l93K35N93
2993C83q1n31j91O10K95m32n19L24O07j13o52jM77K38m18l86K84L80l3n22j31
3014d12M77L43m20m89L26N98k28n69mN54K28m75k64K29M29r3m28k05N84K90m11
3035F0m82L38N93k45o05NN66J60m73l45L71L33j13m53n3M89K71m80l74L45N15
3056D23k02o20J37N26O9m93k38M30L53j98n00Q1M34K09m82l68M36L69k54n12J58
3077b42O04q0m54j41M49J70k50m29J97M56P2n49j95M43L70m09l99K49M73o8n58
3098b91J3L66K70l57l54K15L56Om11j92M23L40m40l91L15N08k34m78O1M93L9l31
$$ y = [-629, -29, 540, 179, -535, -352, 452, 514, -206, -620, -19, 574, 211, -596, -301, 555, 479, -325, -498, 116, 520, 66, -460, -271, 352, 441, -276, -531, 76, 566, 47, -565, -267, 427, 400, -367, -503, 153, 459, -52, -445, -210, 383, 302, -229, -420, 190, 485, 53, -466, -142, 465, 352, -300, -301, 176, 414, -4, -390, -106, 274, 241, -281, -412, 65, 408, -12, -501, -175, 423, 195, -374, -378, 176, 404, -71, -335, -106, 323, 230, -198, -403, 181, 471, 60, -422, -84, 509, 264, -341, -336, 230, 390, -83, -428, -57, 276, 163, -290, -343, 146, 417, -63, -437, -92, 423, 221, -399, -262, 264, 333, -160, -398, 32, 385, 187, -313, -232, 202, 411, -71, -439, -3, 366, 112, -400, -242, 362, 282, -172, -313, 136, 306, 56, -373, -176, 280, 352, -197, -392, 51, 421, 12, -387, -138, 335, 267, -291, -278, 88, 358, 1, -353, -138, 218, 224, -187, -379, 44, 384, -56, -447, -132, 376, 142, -336, -275, 218, 257, -74]
3120g4j49K70K07r0k69p7L21J95l91k37K46L31j57l84R5L49m1k83q7K21J75j22
3142D9k35J5K77J40k72k68K77K72k49k64J78K88q0k47K8J48P1o7j77m9K44J01
3164A80k72j02K45K03j66k79J03K75j24j58n2J69O4m7j49p6J67J92j96k49K18
3185e4K28r9k63J43J57L9k13o0J24J36n1j71k5J16J58j08k33J00L04j00l36P9
3207a29K91%k56qJ24J23j23j20j2J69P8j62j72J59K95j85k75R8L08q6k84J1K26
3230G0N1q1j39L2J08J19k89j24K36K03j52l19J49L14q3k89P7J79L2j51k7k9J93
3253H0K0j61p6J99J73k23j73J51J99j29j86O0K01j09j32OP6O6n7l1k1R1R0j08
3277Fj73J46J43j16j90J30J07m4o1J9M2N2K1m3r3Q0J33j48o2O7P3k6j16Q0L9j09
$$ y = [-74, -223, 47, 254, 164, -105, -182, 139, 334, -57, -294, -48, 283, 126, -258, -163, 186, 145, -138, -225, -4, 171, 49, -186, -171, 106, 246, -26, -294, -17, 255, 6, -258, -80, 208, 128, -119, -91, 57, 128, 61, -116, -165, 79, 180, -92, -194, 51, 254, 88, -191, -88, 187, 63, -95, -147, 22, 86, 39, -110, -186, -19, 173, -23, -272, -54, 174, 75, -188, -45, 112, 151, -62, -122, 2, 138, 87, -84, -109, 7, 165, 57, -176, -76, 228, 128, -208, -129, 162, 162, -94, -102, 22, 145, 22, -98, -110, 59, 137, -25, -197, -38, 257, 72, -203, -105, 203, 117, -167, -156, 70, 121, 40, -99, -67, 41, 160, -129, -253, -17, 186, 34, -285, -136, 178, 95, -194, -117, 62, 94, -57, -84, -113, 80, 100, -61, -137, 62, 235, 12, -161, -10, 189, 60, -126, -66, 135, 26, -106, -100, -24, 42, -15, -46, -67, 24, 114, 6, -167, -21, 122, 6, -184, -54, 53, 9, -52, -33, 9, 61, 82, 39, -54, 26, 159, 11, -51, 16, 89, 63, -53, 27, 66, -43]
3303d3K8O7l9q9J14n3r8P7J25r7p5N5J00Lj28J1L5L7m1M1o7J6Q2j6r8j2J34J6
3331H5j40k4J33M0j30n1P3J6L6o3j1J0Q5j0j65M3K21k3k54mK45qj82l0J50J6j1
3358D7j46K4J15P8r2j10Q9J14k6k08j0J65R0k72J5J24P1p6l3PN9L8k7j41M0K25
3384A60j05j07k0J89K7j95j20K80Rj18p2J4O7j0%o8n3J97J9j98J1J66K7k01k5
3409a26J75O6j79j2P3K6N5o6j32P9J56l2j74oJ79kj63l7J71P7j38m5M1K6j8j6
3435b2p3J9J39M2k25k8K86m7r7j42J46R7n3j53Q4O2lmj13N6J90n1k04j3J93N9
3461A45j54j83K60O2j47q3mR4O3o1j18O7J98l4k72k2K29J49l01o0K20J55j92j72
3485a61O4J99oj22j41R6K17m3k71lK62P3l15j07L02J21j81j89J76J70J8j89j23
$$ y = [-43, -15, 52, 13, -76, 38, -15, -113, -36, 89, -8, -83, -28, 72, 75, -53, -42, -7, 30, -11, 30, -37, -21, 61, 45, -53, -65, 69, 85, -55, -79, 54, 94, -36, -87, -14, 2, 38, -25, -36, -26, 59, 49, -116, -73, 148, 125, -129, -133, 112, 104, -78, -108, 42, 58, 47, -99, -75, 40, 118, 26, -84, 5, 119, 93, -115, -125, 40, 130, -142, -127, -3, 68, -8, -41, -34, 25, 63, 36, -105, -65, 160, 55, -52, -72, 117, 144, -51, -171, 109, 118, 0, -72, -58, 9, -1, -1, -69, -122, 75, 94, -104, -93, 73, 100, -101, -126, 49, 115, -64, -76, -3, 23, 78, 12, -120, -41, 115, 83, -91, -97, 82, 80, -83, -120, 51, 128, -10, -55, -14, 12, -6, -22, -95, -76, 63, 105, -120, -148, 138, 91, -6, -148, -2, 95, 42, -111, -27, 35, 32, 28, -85, -29, 161, 110, -94, -107, 86, 145, -9, -192, 68, 130, -17, -100, -104, -10, 53, -8, -126, -59, 139, 105, -167, -189, 40, 189, -112, -172, 48, 203, 11, -161, -97, 102, 96, -26, -167, -71, 146, 103, -168, -171, 91, 164, -151, -258, 44, 165, -16, -205, -29, 141, 159, -30, -153]
3508a53J58J79j56k43J28K72k0l31o1L08J43k38j63J37K84o9k65n2J99J07j90
3529b6j85J04K83p6l07k7L32J14k47j96K15J79j23j61J5K09O5j22j85R2K83o5
3551A71k94j0K39J21k79j42K05J26q8k23O7K23Mj34k54K20K10m9l12K1L27J9k51
3574h3j87K69J71j33k09Q2J72N1j81r6J83J70j22k41oL37N2k95j29K32J27j64
3596@k14P8K74L0k01j98K31J72j13k99J05L06M8l71q1K46K10k02k24J15K31lj95
3619e5j04J55K39j49k59J09K38J6l11j23L73N7k45j21J39J79Ok99q7K82K14k05
3641D9k73J49L27m4l77o1L81J21l41k06K58K34j12k97K9K54J62l06j75J57L04
3662B33r8m05P8L50P8l40k13K83L03k12l00R1K81R4k62k07J82L41j28l55N5L03
$$ y = [-153, 5, 184, 28, -215, -87, 185, 165, -166, -227, 81, 224, -14, -177, -40, 244, 175, -90, -142, 57, 164, -26, -211, -107, 176, 100, -207, -234, 98, 212, -35, -231, -16, 163, 40, -121, -106, 103, 168, 46, -139, -47, 236, 171, -123, -133, 106, 227, -52, -194, 11, 137, 49, -174, -107, 116, 120, -14, -268, -48, 162, 113, -199, -178, 149, 168, -83, -270, -1, 170, 37, -172, -90, 82, 133, -48, -144, 39, 209, 87, -154, -160, 177, 229, -66, -195, 37, 164, 0, -214, -136, 138, 168, -33, -231, 0, 172, 59, -240, -135, 171, 219, -152, -233, 13, 223, 21, -203, -88, 143, 140, -55, -159, -4, 235, 86, -173, -64, 174, 190, -121, -244, 129, 186, -59, -180, -41, 138, 144, -155, -242, 40, 254, 49, -224, -75, 252, 208, -169, -230, 151, 272, -69, -275, -17, 217, 105, -192, -163, 91, 253, -53, -228, -71, 233, 135, -270, -192, 158, 236, -104, -317, -34, 269, 57, -243, -152, 129, 223, -39, -246, -64, 277, 149, -206, -151, 152]
3684A52P9l90j08K81K49k01k99Q4K84K7k99j08L03J77j74l18Q0L64L2l54j25L14
3706E0K22k74k81J56L27ql20oK09J72k38k71J76L56n7m02j8L14J29k53k88K01
3728a04L13m8l41q2K65K31j81l46K16L83j32l92mL36J80l27k68K83K80o4m03K6
3750a79L05R0k48k70K18L60j28m21J05L30Q1l22j80K91K87k15k89lL12J21l07
3771f2j40J75L00r3m33P3L87O5m07j57L09K67j89l12K1L78N3l16j70K24L25k23
3793G5k82M1L94nl82j34L47K53k29l53J69L25J2l81j40L73K05k36l34J59L55k6
3815B06l80j16L91J59k65k97K00L77r9l89j31M31K01k82l26J79M08q2l77p2L48
3836H4K90l97k86K27L65r9m27J0L66J46k62l50L07L19o8m15q6M10J34l71k06K83
$$ y = [152, 231, -159, -267, 14, 263, 62, -237, -153, 131, 158, -141, -249, 54, 231, 57, -261, -181, 183, 215, -139, -264, 50, 272, -2, -283, -127, 200, 192, -128, -134, 75, 247, 9, -262, -86, 270, 213, -189, -207, 107, 236, -17, -305, -104, 209, 161, -180, -262, 3, 234, 53, -293, -77, 306, 174, -218, -222, 114, 294, -33, -301, -18, 262, 198, -205, -179, 126, 216, -32, -302, -84, 276, 148, -273, -168, 162, 243, -79, -259, 32, 319, 104, -185, -188, 124, 245, -62, -202, -27, 273, 180, -253, -180, 207, 272, -135, -292, 17, 284, 95, -217, -196, 182, 235, -81, -251, -27, 298, 75, -207, -166, 228, 223, -159, -293, 54, 307, 78, -275, -106, 219, 231, -150, -290, 83, 288, 52, -282, -123, 232, 206, -174, -290, 101, 260, -5, -302, -102, 275, 176, -213, -344, 87, 288, 6, -320, -141, 267, 185, -192, -264, 84, 374, -23, -309, -82, 283, 184, -243, -233, 133, 279, 17, -333, -26, 293, 225, -190, -276, 134, 268, -103, -309, -26]
3858b6L14j48m20K2L99R2l24k39K95K94j60l54J2M22L1l35j92L81K60k57l57J03
3880a87L71M5l14k15K85L19k08l63Q2M76l5m01j80L94K18k32l34J21L96Ql59k19
3902c32L99K37k55l60K10L18j6l74j12L18K94k66l17J08M31q1l84j06L36K74l07
3923A5l14J42M55j16l78p4M23J83l19l23K28L40p5l59j10L80K24l14l00K13M27
3944C48j44m27m5L91J27l06k55K54L06j43l81QL92J14l66j86L07K97j48m43Q0
3965b20L53J22l36k03K56L70k28l35N6L35J20l67k28L54K99k52l93J25M07J1m12
3986a66j40K82K78j48m34J25M61M6m66j50L27K81k21l84J37M14j6l99j13L71K35
4007C20k71l28J12L95L0m11j11L61K10l00k78J08M27j25l38q2M03K14l33k65J44
$$ y = [-26, 288, 140, -280, -258, 141, 233, -91, -330, -35, 259, 99, -255, -243, 179, 210, -125, -317, 64, 324, 67, -290, -187, 184, 229, -85, -300, -15, 304, 96, -267, -185, 291, 256, -145, -325, 69, 287, 55, -279, -158, 238, 246, -113, -332, 67, 304, 49, -311, -101, 217, 201, -173, -285, 33, 327, 61, -256, -148, 283, 202, -182, -288, 48, 322, 15, -299, -157, 298, 182, -196, -270, 153, 336, 17, -306, -78, 262, 187, -172, -282, 98, 322, 8, -292, -79, 348, 204, -223, -268, 123, 250, -56, -311, -57, 249, 106, -275, -267, 125, 239, -127, -313, -6, 291, 143, -300, -220, 133, 255, -81, -284, -28, 342, 114, -221, -165, 170, 290, -77, -305, 49, 348, 96, -297, -172, 235, 246, -166, -306, -24, 254, 106, -328, -203, 258, 304, -162, -312, 15, 296, 75, -309, -172, 242, 226, -173, -286, 85, 320, 49, -279, -167, 228, 258, -153, -264, 97, 307, 7, -271, -163, 264, 139, -199, -281, 122, 336, 3, -262, -118]
4028a18L23mm31j2L76J50l28k75K26L37p9m52K6L91J88l49l36K94L29j24m38O3
4050b43L92J30l96k29K79L53j28m39Q2M01J00m11j96K84L67k41l66P7M41L3l93
4071a03j55K74K73k08l16L6M32M1m17j36K60L14k33l88J52L95K5l76j64L20K33
4092B59k27l79K05L96J0m36r5L48K57l14l38J24M30Kl41j63L73J77l12k36J61
4113i9L29m2l64j03M08J29k82k48K07L18m5m34j1L60J61l61j99J76L68j23l78
4134b33mM13J13l33k29K52L25j60l53KL36J21k91k76L17L03k01l31K5L67J18l64
4156h3k25K75L60j84l96N4L81N1l90o9K43K35j82l22N9M07K2l50j90L17K65j80
4178I8m20K03L32N0l75j63K84L13k93k87J42L55j6l81j15L05L07l13k92J46L98
$$ y = [-118, 205, 201, -230, -242, 134, 284, -44, -319, -93, 244, 165, -287, -261, 130, 318, -31, -367, -73, 256, 132, -306, -243, 149, 279, -117, -346, -67, 286, 158, -281, -199, 202, 302, -109, -305, -21, 346, 105, -261, -184, 257, 290, -103, -258, 16, 289, 81, -235, -199, 233, 274, -143, -279, -19, 295, 62, -326, -174, 221, 246, -130, -294, 26, 259, 32, -347, -142, 254, 264, -172, -267, 81, 338, 24, -314, -190, 240, 242, -99, -262, 111, 288, -24, -260, -99, 230, 188, -176, -279, 129, 258, -24, -272, -65, 253, 208, -226, -237, 123, 284, -77, -276, -100, 268, 145, -233, -237, 176, 289, -44, -273, -21, 304, 144, -209, -207, 129, 250, -41, -317, 0, 303, 102, -229, -204, 163, 281, -83, -308, -33, 327, 143, -253, -199, 182, 233, -157, -226, 17, 252, 70, -252, -193, 214, 236, -114, -304, 13, 278, 98, -322, -119, 213, 263, -112, -275, 9, 322, 29, -258, -116, 239, 223, -158, -273, 32, 339, 26, -266, -120, 278]
4199B78n6l95j02L82K32l07l66K40L24k8l83n6K87K69l61l18K09L95o1l88m1M03
4221A57J00l23k79K35L59r7l66j07N13Q4l13k49K60L53j77l74k6M01J36l67k01
4242b81K40K98j48l95J16L08J24l33k18K93K81k13l64J07L96M8l52j48K59K45
4262B63j42m24J21L97O4l98j36L68K05k77l33J52L59L3m25l4K84J77k05l23J36
4283a38M06q5l48j16L32K19k88k77J98L76p2l46q9L10K06k53l28J74L21q8k67
4304a53o1L09J96l19k77K18L61j57l34m1L76J09k10k84K02L62j46l52J1L14J23
4325B47k41k63K34K22m4m06M5L47J33l50j87K19K75j93k78L6L27J21l74j53K00
4346h3L27j55k97R5L05M6k79j88K80K09j52k97P2L30O9l63j78L06K35j60l72N2
$$ y = [278, 222, -173, -275, 107, 339, 32, -334, -94, 230, 202, -181, -237, 50, 319, -42, -360, -151, 244, 183, -205, -246, 157, 257, -66, -345, -110, 249, 152, -214, -321, 192, 276, -37, -286, -26, 327, 150, -224, -250, 151, 287, -80, -281, -41, 257, 109, -286, -170, 138, 262, -71, -289, 4, 285, 72, -292, -185, 211, 259, -93, -241, 18, 263, 121, -303, -182, 215, 279, -119, -255, 113, 318, 41, -292, -140, 219, 252, -173, -207, 77, 254, 49, -274, -138, 268, 183, -165, -281, 51, 270, -18, -295, -97, 279, 207, -139, -228, 82, 288, 35, -293, -119, 202, 114, -153, -214, 95, 291, -28, -305, -87, 274, 117, -217, -258, 118, 227, 17, -267, -65, 297, 151, -201, -190, 124, 247, 6, -257, -23, 199, 155, -251, -206, 141, 274, -76, -263, -44, 231, 38, -240, -204, 123, 244, -130, -283, -83, 244, 89, -208, -113, 192, 238, -41, -229, 51, 260, 108, -189, -117, 213, 282, -81, -259, 47, 282, 122, -250, -198]
4368a98L82O4l57j45K28L42l13k90J42L29ql55l9K29K39k21l43J96L23k3l02j53
4390b73L90R9j65k83J53L20n1l62l5L09J73k45l08K53K70q7m06O7K96J29k46k81
4412b83J53L96j36l39k8L98R7k91j88J33L26j43l29L8L76L7k85j41K13K08j33
4433G9k59K5L27N5k87j65K40K21j95k35L6L35P6l76j38L35J84j84k94O4K94L5
4455A73k56j51K53K47k41k90J35L46o7k89j19L13J51j62k52N5L20L3l14j67K96
4476A4K38k35k72P5L46k2k58o6K57J58k05k22P1L54p6k78q2K73K17k60k31J04
4498a00L23j33k63o6K54J77k20k18J61K98n8l27p3L41J42k59j99J45L51j54l16
4519a94L2K99Q7k97j58J75K74o0l72N3L28K5k81j85J88L22j29k89J7L16J3k68
$$ y = [-198, 184, 248, -109, -254, -26, 316, 3, -287, -145, 184, 176, -179, -218, 11, 250, 29, -314, -118, 205, 182, -120, -273, 117, 216, 51, -232, -79, 241, 190, -172, -207, 102, 275, 30, -278, -25, 245, 158, -248, -181, 115, 244, -2, -283, -130, 266, 130, -209, -237, 161, 258, -33, -221, -88, 238, 95, -234, -196, 180, 217, -68, -209, 4, 212, 79, -180, -155, 172, 227, -60, -225, 15, 236, 41, -194, -158, 177, 253, -123, -261, 74, 258, 74, -220, -156, 138, 173, -83, -234, 19, 266, 25, -265, -130, 216, 149, -140, -259, 54, 205, 43, -209, -154, 166, 199, -115, -282, 14, 252, 17, -255, -180, 166, 144, -114, -180, 77, 235, 30, -192, -121, 233, 157, -121, -203, 70, 287, 27, -204, -100, 223, 90, -173, -239, 15, 192, -28, -246, -85, 213, 155, -172, -245, 96, 238, -21, -220, -75, 276, 122, -194, -162, 137, 224, -73, -231, -56, 218, 158, -214, -161, 167, 192, -89, -274, -86, 236, 107, -182, -165, 151, 164, -104]
4541a04r5J81K92k36k44K6L97M9l60j25K59J86j77l15J71K71K8l08q1K59J36j94
4563A6k37Q2L33%l13j25L12J72k41k37J23L28o4k67o2K18J95k45k29J67K24K5
$$ y = [-104, -199, -18, 274, 38, -206, -180, 217, 266, -94, -219, 40, 226, 49, -266, -95, 176, 204, -104, -185, 74, 210, 16, -221, -139, 194, 194, -119, -244, 68, 240, -1, -238, -115, 213, 149, -118, -180, 38, 233, -12, -241, -74, 150, 175]
$$ [...]
8191I
##END NTUPLES=NMR FID
##END=
