##TITLE=1H_LY-DMAA.2.26
 CDCl3
 8 sc, 
 5.04.2022
##JCAMPDX= 6.0         $$ Bruker NMR JCAMP-DX V2.0
##DATA TYPE= NMR FID
##DATA CLASS= NTUPLES
##ORIGIN= UXNMR, Bruker Analytische Messtechnik GmbH
##OWNER= root
$$ XWIN-NMR		Version 3.5
$$ Tue Apr  5 11:21:28 2022 Russian Standard Time (UT+4h)  she@DPX200
##.OBSERVE FREQUENCY= 200.131346
##.OBSERVE NUCLEUS= ^1H
##.DELAY= (6, 6)
##.ACQUISITION MODE= SIMULTANEOUS
##.ACQUISITION SCHEME= undefined
##.AVERAGES= 8
##.DIGITISER RES= 18
##SPECTROMETER/DATA SYSTEM= spect
##.PULSE SEQUENCE= zg30
##.SOLVENT NAME= CD2Cl2
##.SHIFT REFERENCE= (INTERNAL, CD2Cl2, 0, 15.7039)
##AUDIT TRAIL= $$ (NUMBER, WHEN, WHO, WHERE, WHAT)
$$ ##TITLE= Audit trail, XWIN-NMR		Version 3.5
$$ ##JCAMPDX= 5.01
$$ ##ORIGIN= Bruker BioSpin GmbH
$$ ##OWNER= she
$$ F:/spectra/data/she/nmr/H-F/1/audita.txt
$$ ##AUDIT TRAIL=  $$ (NUMBER, WHEN, WHO, WHERE, WHAT)
(   1,<2022-04-05 11:20:25.28 +0400>,<she>,<DPX200>,
      <created by zg, POWCHK disabled, PULCHK disabled
       configuration hash MD5:
       00 E9 B6 7A A2 85 ED C7 34 08 36 98 17 FE 4E 26
       data hash MD5: 16K
       10 DE 79 3D B6 A8 80 61 D5 C5 6C F5 05 1C 3A D3>)
$$ ##END=
$$ 
$$ hash MD5
$$ 7B 76 0D AA 01 6D E4 46 56 58 13 6F 38 58 3A 1B
##$RELAX= 
##$RELAX= 
##$RELAX= 
##$RELAX= 
##$RELAX= 
##$RELAX= 
$$ Bruker specific parameters
$$ --------------------------
##$DU= <F:/spectra>
##$EXPNO= 1
##$NAME= <H-F>
##$PROCNO= 1
##$TYPE= <nmr>
##$USER= <she>
##$AMP= (0..31)
100 100 100 100 100 100 100 100 100 100 100 100 100 100 100 100 100 100 
100 100 100 100 100 100 100 100 100 100 100 100 100 100 
##$AQSEQ= 0
##$AQ_mod= 1
##$AUNM= <au_zg>
##$AUTOPOS= <>
##$BF1= 200.13
##$BF2= 200.13
##$BF3= 200.13
##$BF4= 200.13
##$BF5= 200.13
##$BF6= 200.13
##$BF7= 200.13
##$BF8= 200.13
##$BYTORDA= 1
##$CFDGTYP= 0
##$CFRGTYP= 5
##$CHEMSTR= <none>
##$CNST= (0..31)
1 1 145 1 1 1 1 1 1 1 1 1 1 1 1 1 1 1 1 1 1 1 1 1 1 1 1 1 1 1 1 1 
##$CPDPRG= <>
##$CPDPRG1= <>
##$CPDPRG2= <>
##$CPDPRG3= <>
##$CPDPRG4= <mlev>
##$CPDPRG5= <mlev>
##$CPDPRG6= <mlev>
##$CPDPRG7= <mlev>
##$CPDPRG8= <mlev>
##$CPDPRGB= <>
##$CPDPRGT= <>
##$D= (0..31)
0 1.2 0 0 0 0 0 0 0 0.06 0 0.03 0 0 0 0 0.0002 0 0 0 0 0 0 0 0 0 0 0 0 
0 0 0 
##$DATE= 1649143224
##$DBL= (0..7)
120 120 120 120 120 120 120 120 
##$DBP= (0..7)
150 150 150 150 150 150 150 150 
##$DBP07= 0
##$DBPNAM0= <>
##$DBPNAM1= <>
##$DBPNAM2= <>
##$DBPNAM3= <>
##$DBPNAM4= <>
##$DBPNAM5= <>
##$DBPNAM6= <>
##$DBPNAM7= <>
##$DBPOAL= (0..7)
0.5 0.5 0.5 0.5 0.5 0.5 0.5 0.5 
##$DBPOFFS= (0..7)
0 0 0 0 0 0 0 0 
##$DE= 6
##$DECBNUC= <off>
##$DECIM= 32
##$DECNUC= <off>
##$DECSTAT= 4
##$DIGMOD= 1
##$DIGTYP= 9
##$DL= (0..7)
0 120 120 120 120 120 120 120 
##$DP= (0..7)
150 150 150 150 150 150 150 150 
##$DP07= 0
##$DPNAME0= <>
##$DPNAME1= <>
##$DPNAME2= <>
##$DPNAME3= <>
##$DPNAME4= <>
##$DPNAME5= <>
##$DPNAME6= <>
##$DPNAME7= <>
##$DPOAL= (0..7)
0.5 0.5 0.5 0.5 0.5 0.5 0.5 0.5 
##$DPOFFS= (0..7)
0 0 0 0 0 0 0 0 
##$DQDMODE= 0
##$DR= 18
##$DS= 0
##$DSLIST= <SSSSSSSSSSSSSSS>
$$ [...]
##$SUBNAM2= <"">
##$SUBNAM3= <"">
##$SUBNAM4= <"">
##$SUBNAM5= <"">
##$SUBNAM6= <"">
##$SUBNAM7= <"">
##$SUBNAM8= <"">
##$SUBNAM9= <"">
##$SW= 18.0517287032376
##$SWIBOX= (0..15)
0 0 2 0 0 0 0 0 0 0 0 0 0 0 0 0 
##$SW_h= 3612.71676300578
##$TD= 16384
##$TD0= 1
##$TE= 0
##$TE2= 300
##$TE3= 300
##$TEG= 300
##$TL= (0..7)
0 120 120 120 120 120 120 120 
##$TP= (0..7)
150 150 150 150 150 150 150 150 
##$TP07= 0
##$TPNAME0= <>
##$TPNAME1= <>
##$TPNAME2= <>
##$TPNAME3= <>
##$TPNAME4= <>
##$TPNAME5= <>
##$TPNAME6= <>
##$TPNAME7= <>
##$TPOAL= (0..7)
0.5 0.5 0.5 0.5 0.5 0.5 0.5 0.5 
##$TPOFFS= (0..7)
0 0 0 0 0 0 0 0 
##$TUNHIN= 0
##$TUNHOUT= 0
##$TUNXOUT= 0
##$USERA1= <user>
##$USERA2= <user>
##$USERA3= <user>
##$USERA4= <user>
##$USERA5= <user>
##$V9= 5
##$VALIST= <valist>
##$VCLIST= <CCCCCCCCCCCCCCC>
##$VD= 0
##$VDLIST= <DDDDDDDDDDDDDDD>
##$VPLIST= <PPPPPPPPPPPPPPP>
##$VTLIST= <TTTTTTTTTTTTTTT>
##$WBST= 1024
##$WBSW= 4
##$XGAIN= (0..3)
0 0 0 0 
##$XL= 0
##$YL= 0
##$YMAX_a= 732428
##$YMIN_a= -649582
##$ZGOPTNS= <>
##$ZL1= 120
##$ZL2= 120
##$ZL3= 120
##$ZL4= 120
##$ABSF1= 10
##$ABSF2= 0
##$ABSG= 5
##$ABSL= 3
##$ALPHA= 0
##$AQORDER= 0
##$ASSFAC= 0
##$ASSFACI= 0
##$ASSFACX= 0
##$ASSWID= 0
##$AUNMP= <proc_1d>
##$AZFE= 0.1
##$AZFW= 0.1
##$BCFW= 1
##$BC_mod= 2
##$BYTORDP= 1
##$COROFFS= 0
##$CY= 11.3945322036743
##$DATMOD= 1
##$DC= 2
##$DFILT= <>
##$DTYPP= 0
##$F1P= 2.36226072786647
##$F2P= -0.459571619588291
##$FCOR= 0.5
##$FTSIZE= 0
##$FT_mod= 4
##$GAMMA= 1
##$GB= 0.15
##$INTBC= 1
##$INTSCL= 1
##$ISEN= 128
##$LB= 0.24
##$LEV0= 0
##$LPBIN= 0
##$MAXI= 10000
##$MC2= 0
##$MEAN= 0
##$ME_mod= 0
##$MI= 1.114404
##$NCOEF= 0
##$NC_proc= 0
##$NLEV= 6
##$NOISF1= 3.799351
##$NOISF2= 2.8
##$NSP= 1
##$NTH_PI= 0
##$NZP= 0
##$OFFSET= 15.70392
##$PC= 1
##$PHC0= -17477.43
##$PHC1= 21.80078
##$PH_mod= 1
##$PKNL= yes
##$PPARMOD= 0
##$PSCAL= 0
##$PSIGN= 0
##$REVERSE= no
##$SF= 200.130013532006
##$SI= 16384
##$SIGF1= 3
##$SIGF2= 2
##$SINO= 400
##$SIOLD= 16384
##$SREGLST= <1H.CDCl3>
##$SSB= 0
##$STSI= 0
##$STSR= 0
##$SW_p= 3612.71676300578
##$SYMM= 0
##$S_DEV= 0
##$TDeff= 0
##$TDoff= 0
##$TI= <>
##$TILT= no
##$TM1= 0
##$TM2= 0
##$TOPLEV= 0
##$USERP1= <user>
##$USERP2= <user>
##$USERP3= <user>
##$USERP4= <user>
##$USERP5= <user>
##$WDW= 1
##$XDIM= 8192
##$YMAX_p= 0
##$YMIN_p= 0
$$ End of Bruker specific parameters
$$ ---------------------------------
##NTUPLES= NMR FID
##VAR_NAME=  TIME,          FID/REAL,        FID/IMAG
##SYMBOL=    X,             R,               I
##VAR_TYPE=  INDEPENDENT,   DEPENDENT,       DEPENDENT
##VAR_FORM=  AFFN,          ASDF,            ASDF
##VAR_DIM=   8192,          8192,            8192
##UNITS=     SECONDS,       ARBITRARY UNITS, ARBITRARY UNITS
##FACTOR=    0.0002768,     1,               1
##FIRST=     0,             0,               0
##LAST=      2.2672688,     0,               0
##MIN=       0,             -649582,         0
##MAX=       2.2672688,     732428,          0
$$ Real data points
##PAGE= N=1
##DATA TABLE= (X++(R..R)), XYDATA
0@%%%%%%%qQqJ6k4L2l2M0n6P2q8J04j21J46j78K11k51K98l51M07m67N40o25P15
31C80q13R26j052J187j337J505j688J888k109K352k613K898l216L561l931M339
47B277m790N281n816O405p056P777q577R471j0477J1617j2921J4430j6196J8298
61I723k0858K4044k8137L3625m1405N3355p4210J20759m02949J87002Q71479o50267
73H2161o43093L89804O09748k66044l90483l093K49226J94265l1512m36277j10473
84c55771N90873K68656p34312l48439P76260M14044p72791m09344O73406L85237
94D87819n30692l12686L25131K34276j06841j37118j25555N4259L31029K1187
104B40809n05923o9154O23177R8354o81347j01052O69588Q8578n95733o1322M65304
$$ y = [0, 0, 0, 0, 0, 0, 0, 0, -8, 0, -8, 8, -16, 16, -16, 24, -32, 40, -48, 56, -65, 81, -97, 114, -137, 161, -190, 217, -250, 290, -335, 380, -433, 493, -559, 628, -709, 796, -892, 996, -1113, 1239, -1374, 1524, -1692, 1869, -2062, 2277, -2513, 2768, -3048, 3357, -3699, 4078, -4499, 4972, -5505, 6112, -6809, 7621, -8575, 9723, -11135, 12909, -15228, 18397, -23008, 30347, -43863, 76896, -326053, -139051, 732428, 82161, -560932, -171128, 438620, 172576, -217907, -221000, 28226, 222491, 190979, -245298, -355771, 235102, 503758, -230554, -578993, 197267, 611311, -161480, -570824, 102582, 487819, -42873, -355559, -30428, 203848, 97007, -40111, -165666, -111407, 219622, 240809, -265114, -334268, 288909, 387263, -294084, -395136, 274452, 363030, -232703, -294025, 171279]
115A71279L1004k96635j520J07432j8783P9169K6089k44965j7126L72333q177
126B00100m50721M6014M74308r1190m44939J35972L69076j72535k58576J94415
136A924J28701j96682L740J78090j21900j38332K12361Q1082k64832j1076K75097
147A48173o4936k43871J39338J77824k04355q7742K52594j3629k79207J11379
157f4432K80963j92393k58391K45030K13402k61682j51158K38842P7558j77884
167e0145N74Q5745p5964K7047J42338j46014j93621K56353K26536l42730k39021
178c08902L93598K31834m01077k07546L62358J70191k80156j25135J61942P6671
188G3778k0217l0012j30482j2022K73609M6791l93524p3611M76513R2728n13135
$$ y = [171279, 202283, -94352, -95872, 11560, -7223, 71946, 98035, -146930, -164056, 208277, 200100, -250621, -204607, 269701, 178511, -266428, -130456, 238620, 66085, -192491, 1924, 130625, -66057, -62317, 115773, -6127, -144459, 67902, 148984, -115848, -126924, 148173, 83237, -160634, -21296, 156528, -47827, -135569, 117025, 103396, -175811, -64432, 216531, 24138, -234253, 10777, 224179, -37503, -188661, 50181, 127739, -50145, -49571, 36174, -39790, -12743, 129595, -16419, -210040, 46313, 272849, -69881, -308902, 84696, 316530, -84547, -292093, 70265, 240456, -39700, -164835, -2893, 73778, 53561, 23549, -106933, -118955, 154654, 201445, -192079, -265690, 210823, 303551, -209584]
199b09584j04669M98902J11743m34454j15228L26135J17381j84392j18406K3246
209h9326J19153J41447j18365k93552J14597M17831j06147n02227R0788N37934
219C12133o7376n22457L5156M56982N335l49463n2149K11109J02417n6490j52178
230g6981r8447J96862K38564k30948l49948K50169M23156k50338m52205K29551
240a20565M36551j87356l80062J25797K90944m9675j80309l5296O0723J21218
250H1970N4594k00257j54722K64405K30121l07117k75515L23384K89068l10950
260e019k71978K70060K29414k04301j67775J19552R6298k3705k3435p3606m1979
271i6474J63399R2702k36514j24130K86384J33756l08360j22814L00505R4430
$$ y = [-209584, -314253, 184649, 296392, -138062, -253290, 72845, 190226, 5834, -112572, -89326, 29827, 171274, 52909, -240643, -126046, 291785, 185638, -316589, -225801, 312133, 244757, -277700, -242544, 214438, 219773, -129690, -181839, 29270, 131687, 75197, -76981, -175428, 21434, 259998, 29050, -320898, -70729, 352427, 102089, -350116, -120565, 315986, 128630, -251432, -125635, 165309, 115634, -64675, -99971, -39248, 81970, 136564, -63693, -218415, 45990, 276111, -31006, -306521, 16863, 305931, -5019, -276997, -6937, 222477, 18176, -149599, -30047, 66251, 42546, 19111, -54495, -96474, 66925, 159627, -76887, -201017, 85367, 219123, -89237, -212051, 88454, 182884]
281A82884k64799n4424K05061R532j28491L2930M3062o6343M1553Q5655j16459
292b9839q7603J74362P1908k09451m0486K19369j774k04232M9495J67640r5466
303A3923j15153J33086N4257j56924O852J63116o0636j50153J00124J18399j21306
314a4415p1218J21834J3028j02691N0062O7157j11515k0892J64696k9016k03759
325a36729P5512K24516j11098k24212J30417K02955j29817j61973J08327J05653
335H3551o7566l9365J1810l0341N2244R6567j17249j53037J74245J94399k15896
346a0638k17536K35506K20638k29267k04566J96212J71938j38379j26859O1087
356d1864P4501K8258j9861j19871l1892K04292P6837k71674j12031L14382J35831
$$ y = [182884, -81915, -136339, 68722, 78254, -50237, -17307, 25755, -40588, 965, 86620, -29839, -117442, 56920, 128828, -80623, -121109, 98260, 96486, -107746, -58251, 109389, 13923, -101230, 31856, 86113, -70811, -63959, 99157, 38521, -111632, -11508, 106891, -14415, -85633, 36201, 49229, -53462, -3400, 63757, -47758, -68650, 96046, 67030, -136729, -61217, 163299, 52201, -172011, -41594, 161361, 31544, -130429, -22102, 83551, 15985, -23380, -11570, -41911, 10333, 106900, -10349, -163386, 10859, 205258, -10638, -228174, 7332, 227970, -1297, -205863, -9651, 162287, 23908, -102951, -41864, 32637, 60895, 41034, -78837, -110729, 93563, 170400, -101274, -213305, 101077, 236908]
367B36908l26730j47823L06603J48349k55183j39495J77088J22639p9682j00608
377e7934k7775P5543J34025m9721k28676K4941L01917k017l46357j8046L57490
388A63390L5410l34161m9881K79133O2224j97905p2442R9103Q1036P141q7998
399a4950j09905R2929J99008r5423k65837R3843L04314q7545l11858P5205K88680
410A68461n6473k38712L1346J68106r85q5040l2653j036O7194Q1391r9305j47563
422a45269J25703J94093j43436k16867J50077K15445j44311j91486J25929J49189
432A19067r6273r4712N7549L4924j3470K2658l2514p1510P5722J06076j12175
443d658j23167J38433J21624j51981j02987J51983P0664j38166k9634J12626j3646
$$ y = [236908, -89822, -237645, 68958, 217307, -37876, -177371, -283, 122356, 42674, -57934, -85709, -10166, 123859, 74138, -154538, -129597, 172320, 170303, -176054, -194100, 163390, 198800, -135361, -185242, 93891, 156115, -41790, -114232, -15129, 65907, 73048, -14950, -124855, -31926, 167082, 71659, -194178, -100335, 203979, 116434, -195424, -120219, 168461, 111988, -126724, -95378, 72728, 71743, -13297, -45950, -46986, 20208, 101599, 2294, -145269, -19566, 174527, 31091, -185776, -35699, 179746, 35435, -156051, -30122, 119067, 22794, -71918, -14369, 20555, 7085, 29743, -2771, -74281, 1441, 107517, -4658, -127825, 10608, 132232, -19749, -122736, 29247, 99911, -38255, -67889, 44737, 31091]
454C1091p7814N3244L7633q3439M004R9797m2442j00212P4035Q4148r5673n4044
466f9672J05407J3539j03379L2106R0174p6783o8722J14557M2074j40275j4396
477g5370J50424j0584j42885K9758J17911m0349p7715M1761K6682l4090L0182
488A5725J9154q6608M21J36471k1185j74234L9397J95545n2050j97931N6117J80602
500A11424n0443j45109L4450R4808r467l5030k2032k8310N6393Q8926q9296j40424
512a34110J16159J78340j32831j99025J36389K01116j24617j84673R7538J52152
522A06438n6958j07166N994N4727N0201j92j05806n1567J54353R5809j90589j29223
534a73979K09691J49371k08722j55746J87045J48541j45888j29824Q9234J02254
$$ y = [31091, -46723, 6521, 44154, -39285, -35281, 64516, 22074, -78138, -4103, 80045, -15628, -69672, 35735, 49274, -54105, -21999, 68175, -8608, -77330, 37227, 79301, -60974, -75370, 75054, 64470, -78415, -48657, 69254, 28905, -48810, -7049, 19633, -14457, 15725, 34879, -51729, -51308, 85163, 63978, -110256, -70859, 124686, 72636, -125295, -69178, 111424, 60981, -84128, -49678, 45130, 35663, 633, -21399, -49709, 6684, 95610, 6314, -134110, -17951, 160389, 27558, -171467, -35078, 166038, 41421, -143252, -45714, 106438, 49480, -57686, -51692, 3035, 53236, 53044, -52762, -104329, 50024, 145833, -44756, -173979, 35712, 185083, -23639, -179385, 7660, 156201, 10313, -119511, -30277, 71977]
544G1977k1989o8965m8909L3909J16389Rj73531k9632K14612N2942k35458o8666
556a57312K33930P6177k10111p6462J66250P0841j07049o1270L8084M9696L3253
567E6027l8228r9835K7916J55352j9714j94291J3867K13300r728k10865O836J87945
579H8582l665j47465m80R4202O698l4356j4939k5603K5103P9083l6214j21092
591i0146M6964J47344n6148j56231O2302J47521o4467j23379O1634Q7563n3695
602I262m4592M0652L08k3245M0028L087p1591J8268R1336l8891r7109N6982Q8905
615G3400p0488o8497P8284L8907p9612m477P3853l0026o1963N9626M4889q0307
627b6411k4671Q9032L211q4465J7008O6992l3996l8550M6364K829n3114L6036
$$ y = [71977, 49988, -18977, -67886, -33977, 82412, 82421, -91110, -120742, 93870, 146812, -88646, -157312, 76618, 152795, -57316, -133778, 32472, 103313, -3736, -65006, -26922, 22774, 56027, 17799, -82036, -54120, 101232, 81518, -112773, -98906, 114394, 104666, -106199, -99363, 88582, 84917, -62548, -63028, 31174, 37872, 3516, -11423, -37026, -11923, 67160, 30946, -90146, -43182, 104162, 48014, -108217, -45915, 101606, 37139, -86240, -24606, 62957, 9262, -35330, 5322, 5630, -17615, 22413, 25500, -46091, -27823, 63513, 24622, -72487, -15505, 73400, 2912, -65585, 12699, 51606, -28006, -32483, 41370, 11344, -50619, 9007, 53896, -26411, -51082, 37950, 41161, -43304, -26296, 40696, 6700, -31850, 14514, 17343, -35771, 265]
639B65N4260p2882n0314J03222M2559j22709l2313J28638K1426j19616j1666R6187
651C7057M123o0720L77J6650j881L1015O03p7544K469J17652o307j46856R486
664g3876J61884j0708j60721Q822J43549l254j11477o152O8120J8913j7687l3392
676a5979l4969M8438Q4311o1674j25503P0867J54487p4346j68616P0216J66704
687A13936n8221j49068L7953J18013j1180p6978j9841L0161N2194J7751q2375
698b7655o2064J07166R8553j23085j24203J28491J36889j21478j36350J02602
708b1134J23371p3139j00007L5556O9358O455l5051m9013N29Q7880L0502j19300
720d3993n5429J39920P2232j47741q0199J41829P9391j22481p0958R1669N6839
$$ y = [265, 54525, -18357, -68671, 34551, 77110, -45599, -77912, 50726, 72152, -47464, -59130, 37057, 41180, -19540, -19163, -2513, -4394, 26621, 27224, -50320, -47851, 69801, 63494, -83362, -73876, 88008, 77300, -83421, -74599, 68950, 65696, -45781, -51933, 16187, 35100, 17413, -15979, -50948, -2510, 81801, 20127, -105376, -34509, 119978, 45632, -122984, -52768, 113936, 55715, -93353, -55400, 62613, 51433, -25545, -45386, -15225, 36969, 54720, -27655, -89719, 17447, 116000, -7085, -131288, -2797, 134092, 12614, -123736, -21134, 102237, 29098, -70909, -35353, 34005, 40460, 5409, -43604, -43075, 44805, 75307, -43993, -99422, 40498, 112730, -35011, -115210, 26619, 106010, -16471, -87429, 4240, 61079]
731F1079n2020l9457P856K1360L6614m363p7138r224J09417J8516j30544k2900
743h0804J38307K2706j32371j8802J13396J2469q4047n444M7480q32q135N131
755I054k9837o545O2347M836q6051nR8985p187j00154J6007R0003k4590p0550
768d3687L2059M4470l6740j5309L7806j3372l4732L8010K7362n5944j6208O4909
780B8624K196o4375J3051N4620k8279l7120M1656J4424n1713J0330N7418l3709
792G123n8055N2754N3431o4242m4055O6727L1047n9426j5511M3123r28j9451J6508
805I045q683l0175L7736M0714o4298m7477Q4612N0010r5972m8805R6713M3995
817F7415q6210l6660O5317K7527l5829j7560J116P928L5313J062o9569q662R7917
$$ y = [61079, 9059, -30398, -22542, -1182, 35432, 31069, -46069, -55293, 54124, 72640, -57904, -80804, 57503, 80209, -52162, -70964, 42432, 54901, -29146, -34590, 12890, 12058, 3923, 9054, -20783, -27328, 35019, 39855, -46196, -46201, 52784, 45597, -54557, -38550, 51453, 26863, -43687, -11628, 32842, -3898, -19207, 18599, 5227, -29505, 8505, 35867, -20077, -36285, 28624, 30820, -33555, -20504, 34116, 5837, -31283, 10373, 24797, -26916, -16586, 40832, 7123, -50932, 1822, 55253, -8989, -53044, 13683, 44730, -14696, -30207, 12916, 11988, -7463, 9045, 362, -29813, 7923, 48637, -15661, -63138, 21474, 71484, -24488, -73293, 23420, 67415, -18795, -55455, 9862, 37389, 1560, -16000, -14884, -6956, 28357, 29419, -40150, -48812, 49105]
830D9105J4796j17108j9310J24883K2595j20243k4957J03397K6545p5771k8102
841d4170M0038K9358K06l0586m1005L1447P8147l1374j07918K9769J27187k6044
853E5055j34080J9921J27996j0987j09580l23Q1025J3671m5380k7701O345M1292
865A7254L2016n3071o5896O1354R2082o5210j08208O3632J13051n6335j06888
876g6219M3578R0746k6390o6849N841L8183J6105p782l7527k1052N6697M5580
888F0911p1324o3426Q0068P3413q1751p5083P6089O8788o3296n6032M4548L8684
900C1589k1617j9106l416l84K8008J7297m9875l0000O6583L7258p6768l8372P9113
913B0310L4106p3727k5227O1289J3459m3134o81K1710j1133P98K0415k1844k5803
$$ y = [49105, 63901, -53207, -72517, 52366, 74961, -45282, -70239, 33158, 59703, -16068, -44170, -4132, 25226, 25432, -5154, -46159, -14712, 63435, 32061, -75857, -46088, 81099, 55055, -79025, -59104, 68892, 57905, -51675, -51998, 29027, 42698, -2682, -30383, -24038, 17254, 49270, -3801, -69697, -8343, 83739, 18529, -89679, -26047, 87004, 30669, -76219, -32641, 58105, 31715, -35134, -29293, 8890, 24995, 17213, -20314, -41366, 15331, 60911, -10413, -73839, 6229, 79642, -2109, -77192, -1103, 67685, 4389, -51643, -7095, 31589, 9972, -9134, -12550, -12934, 15074, 32371, -17504, -47504, 19079, 56337, -20431, -58803, 20310, 54416, -19311, -44538, 16751, 30210, -12924, -13605, 8105, -3028, -2230, 18185, -3659, -29462]
926b9462L9323K6456n1324k2528N6939J4400n5948l294M8624r270l6363K1541
938i06K0772l2022m030L9099j1797m1711K4707L9502l3357l2285L6739K0839l4235
951h685o291K6571r793j4686K5740L25l9699J4549N0140k7841n5851L7340N6279
964D8098m1966n1182M0490M1062l2977k6980J9833J0465k832O922j6229k3320
976b8616L4938L7359n0927m7610O2008N3458o6363n4450O3422N0846n2937m3281
988d2153L6024L2447j4078j9682j0721O183L5606O857n8109j8431P5512K7641
1000E7096q5874l4223Q8000L7693q1357l8308O6316L6415m4215l2338J7196K6855
1012A3256J2169k0511m0696J3861O5700p314q4311J165R4720M387r5730r322Q7298
$$ y = [-29462, 9861, 36317, -15007, -37535, 19404, 33804, -22144, -25438, 23186, 13916, -22447, -906, 19866, -12156, -16186, 22913, 11116, -30595, -5888, 33614, 257, -32028, 4711, 25550, -8685, -14976, 11595, 1802, -12884, 12856, 13181, -26518, -11969, 38171, 10330, -45521, -8181, 48098, 6132, -45050, -4560, 36502, 3525, -23455, -3622, 6843, 4011, 10933, -5296, -28616, 6322, 43681, -7246, -54856, 7152, 60610, -5753, -60203, 3219, 54065, 1128, -42153, -6129, 26318, 12240, -7442, -18163, -11980, 23626, 30483, -27626, -46057, 29455, 57096, -28778, -63001, 24999, 62692, -18665, -56973, 9343, 45758, 1543, -30795, -13599, 13256, 25425, 4914, -35782, -21921, 43779, 36465, -47846, -46681, 48039, 52426, -43304, -52626, 34672]
1025C4672J3602p0584j7294M7060K0316j9303k2972r546K4815L6674k5895n9391
1037d7846K5981P5404k4554q3529K1710Q3171j7119p4622J0872N9349l268l8918
1049a3369n197J5872J4008P412k2575k8518K9867M5402l5316n6520L8118O0829
1061E0013l7858n8540L4418N0095k7974l6812J8889K0474q017l038l720j3090
1073a5160J5165K6366k5273l5108L3051L8571l7590l6607L8568K9812l5971j9195
1085b3371L0029O497k1549O491J1381j8150p69K6754r329l1289J7634L1178k3461
1098B046k6407K6104J7898k5703o391K2462o564j6685J9163R676l0064k082L7835
1111B1288m926m1213J0377M0004j3808l3839J4353K3514j2247j0181P789n094
$$ y = [34672, 48274, -22310, -39604, 7456, 27772, 8469, -14503, -24049, 766, 37440, 11545, -47846, -21865, 53539, 28985, -54544, -32834, 50337, 33218, -41404, -30532, 28817, 25549, -13369, -18566, -2694, 11314, 18726, -3849, -32367, -2500, 42902, 7586, -48934, -10816, 50013, 12155, -46385, -11967, 38128, 10154, -26658, -7769, 12705, 4688, 1650, -2070, -15160, 5, 26371, 1098, -34010, -959, 37612, 22, -36585, 1983, 31795, -4176, -23371, 6658, 13155, -8394, -1903, 9478, -8672, -9441, 17313, 7984, -23305, -5671, 25507, 2046, -24361, 1743, 19641, -6062, -12453, 10009, 3445, -13240, 5923, 15599, -14465, -16547, 21288, 16362, -24851, -14474, 25530, 11722, -22117, -7764, 15750, 3503, -6678, 1111, -3983]
1123c983j496K0263n516l3956J2338M4323j7723n0476K0852N1578k0973m7397
1135c2166J7973L8356j1747k5357L072R827P300O603j8028k2271K7682L5716l5053
1148A907m5650L9051N1149l9039n1841L4501M7835k5869l9625J3583K8232R46
1160A5180j4813j6410N92L1297J3035m3724k4863N2413L4036n6192l9704N4556
1172E403M1645m7409l9817L5291L4759j9426k6940J060J7589J7639p530l5086
1184b2822k190M9289J0482n8611j7224O2488K1371o0054k3334N1787K3188l8554
1196d184k1028K1598J7743k789j3688j5940R540L2753n592m5937K187N4363M37
1209B9463n7181k505N4283L932m6108n096L3724N785j8442o446K042P119J3765
$$ y = [-3983, -5479, 14784, 9268, -24688, -12350, 31973, 14250, -36226, -15374, 36204, 15231, -32166, -14193, 24163, 12416, -12941, -9869, -42, 7258, 13861, -4167, -26438, 1244, 36960, 1907, -43743, -4692, 46457, 7418, -44423, -9922, 37913, 12044, -27581, -13998, 14234, 15180, 367, -16043, -15451, 15846, 28881, -14843, -39706, 12707, 46743, -9449, -49153, 5403, 47048, -361, -40178, -4887, 29872, 10446, -16494, -15434, 2155, 19794, 12264, -22822, -25012, 24277, 34759, -23852, -41076, 21412, 42783, -17271, -40605, 11182, 34370, -4184, -25212, -3614, 14129, 11340, -2348, -18288, -8748, 24005, 18413, -27524, -25337, 29026, 29463, -27718, -30223, 24060, 27992, -18116, -23212, 10512, 16297, -2145, -8591, -6549, 570, 14335]
1222A4335p891k7352Q610L7450r329m2848R744M3471r789l9273R437L1028q501
1235I092j9683O832O895m466N905J444j7105J870K5542n423l0199Q708L0525j1378
1249H559k7012J3342J9825j4109j0385J3720j27j2300J0515R744j9115o559K5205
1262A1303L036k7693N86K6371l738k1408O155J3472p827l387Q463p582q267J8014
1276G498P381k6754o143L2694M607l4872l280L3063K249k7327j668J8180J612
1289G240o577j947o230K615J8904l319k9919L952L8082m055m2393L423M2279j889
1303B0166l7859m54K9270L686j7783p280M232J0945R804j4404k2925J7041L3789
1316B8228j8304m1374J7928M4916j5560m4170J1373L9274n453l0650j664J9470
$$ y = [14335, 6444, -20908, -12298, 25152, 15823, -27025, -17281, 26190, 16401, -22872, -13435, 17593, 9092, -10591, -3759, 3136, -1330, 4575, 6019, -11086, -9216, 16326, 10903, -19296, -10588, 19937, 8559, -18453, -5111, 14714, 605, -9780, 3940, 3813, -8487, 2028, 11772, -7343, -13902, 11303, 14339, -13354, -12768, 13603, 9865, -11543, -5388, 8084, 257, -3130, 5333, -2249, -10516, 7498, 14879, -11875, -18018, 14676, 19283, -15589, -18869, 14194, 16443, -10884, -12552, 5628, 7240, 663, -1284, -7514, -4899, 14005, 10686, -19233, -15281, 22801, 18746, -23647, -20224, 22055, 20166, -17693, -18147, 11123, 14809, -2974, -10254, -6022, 4923, 14727, 323, -22602, -5561, 28228, 9924, -31450, -13522, 31394, 15834, -28336, -16963, 22311, 16858, -13792, -15456, 4014]
1328D014R277o676j6710o404K3132J8489k7773k8476L0030L5312k9613l8580K6240
1341g738L8070k0294l3910J2110K6847k643j7483p552P031J7359L357k5612j2793
1354b3251L1863K0171l5040k4961L5025K6875l1578k6130K5224K2881j6505j7627
1366a3053O111J1172M979m573j5360j829K4178P141l0560j1123L3845J3314l3729
1379i487j3759L0316J2658k3960j0169J5428O857n602l226m206l17J3248L259
1392A1040k0525n153K5127O029k6961n548K5680L989k1673j693J5362r97p767
1405c090L654m27n790Q034P251j4256p609J8367O750j9882m928J8906K189j5251
1419f082J011R778m348l058P444m086r857J0645J1366j5735j1875J8733J1205
$$ y = [4014, 13291, 6615, -10095, -16499, 6633, 25122, -2651, -31127, -1097, 34215, 4602, -33978, -7738, 30332, 10038, -23872, -11762, 15085, 12442, -5041, -12593, -5562, 11797, 15154, -10458, -23251, 8612, 28783, -6257, -31218, 3807, 30682, -896, -27026, -1802, 21079, 4574, -13053, -6942, 4230, 9209, 4636, -10724, -12553, 11625, 18766, -11794, -22917, 10928, 24242, -9487, -23246, 7070, 19728, -4232, -14401, 1027, 7884, 2282, -944, -5150, -5467, 7781, 11040, -9485, -14638, 10489, 16518, -10443, -15991, 9689, 13678, -7995, -9688, 5674, 4677, -3090, 564, 137, -5653, 2381, 9632, -4624, -12233, 6134, 12884, -6998, -11926, 6980, 9169, -6082, -5071, 4707, 359, -2699, 4745, 659, -9198, 1447, 12813, -2922, -14797, 3936, 15141]
1432A5141j9243r591J7084P103j2655l897O303L13J261L141q831o534J5845R318
1446A4758k1163j1286K4236J2386k4503j2489K1886J1644j6538r921R071P531
1458E612l14m671q966J627J7545J533k4805m276K9452O603l1235q525K9801R893
1472A9274k5191j0652J7899J0832q571j0514j662R670J2038q379k1237O645K8462
1485A8614m477l2913K062L4069O46l1933l589K6630O418j8731r087R135J1161
1498H005J158j2629j1163J3222J9901j2870k6468J1604L0272r301l1023O328K8645
1511A5681k650k3451j405J6259N435p728r232j150J2440R432j4745j6482J5939
1524a657K1495j5893k3988J4448K3902j1775k1384P890J6903l302j0992j608M261
$$ y = [15141, -4102, -13693, 3391, 10494, -2161, -6058, 245, 558, 1819, 4960, -3871, -10405, 5440, 14758, -6405, -17691, 6545, 18931, -5572, -18061, 3825, 15469, -1069, -10990, -1919, 5612, 5298, 627, -8339, -6712, 10833, 12366, -12439, -16715, 12737, 19340, -11895, -20420, 9381, 19274, -5917, -16569, 1330, 12162, 3591, -6923, -8585, 1085, 13123, 4744, -16493, -9848, 18614, 14137, -18776, -16714, 17355, 18001, -13932, -17521, 9109, 15527, -3204, -12291, -3156, 8005, 9163, -3466, -14629, -1407, 18494, 5624, -20844, -9240, 21032, 11731, -19292, -12964, 15681, 13031, -10420, -11825, 4434, 9869, 2141, -7091, -8241, 4199, 13631, -1114, -17596, -1657, 19838, 3945, -20043, -5595, 18307, 6532, -14852, -6962, 9941, 6639, -4353, -5961, -1700]
1537a700O570K240j0702q171J3984J2736j5864j5484J6317J6248j5104j5075J2463
1550a542J2172q677q172M283L378M41J446m895n775Q538R094j1175j1027J2531
1564F20J1235j2407j0011J0961P441q372l850N083k53j346M466k397p917N568
1578a179J0466p894j1687R023J1390q982r640P739O573n320k789K191j695J443
1592c61N962m854r789P755J2481r512j4038J0093J4211r297j2698P053R965l706
1606C265o160k56J682M475L173q531p683J1796J1311j3653j4141J4163J5491j2995
1620A937j5458J0245J3867o187j1101J167P305M407k983r750j453J4257N792j7646
1634e601r382J9342J2083j9021j3665J6834J4029j2788j3170P203J1379q90q596
$$ y = [-1700, 4870, 7110, -3592, -11763, 2221, 14957, -907, -16391, -74, 16174, 1070, -14005, -1542, 10630, 1953, -6219, -1936, 1442, 1883, 3329, -1566, -7341, 1197, 10291, -884, -11911, 620, 11855, -552, -10563, 398, 7839, -533, -4383, 700, 447, -899, 3567, 1170, -6747, -1179, 9287, 1393, -10294, -1271, 10119, 1137, -8503, -764, 5809, 489, -2300, -109, -1804, -361, 5601, 747, -9042, -1287, 11194, 1682, -12356, -2263, 11948, 2651, -10047, -2994, 6971, 3265, -2895, -3151, -1469, 3006, 6179, -2352, -10035, 1761, 13072, -581, -14722, -559, 14932, 1937, -13521, -3276, 10591, 4404, -6697, -5530, 1775, 6182, 3199, -6551, -8004, 6253, 12045, -5601, -14983, 4359, 16442, -2579, -16244, 590, 14619, 1831, -11339, -4136, 7243, 6353, -2243]
1647b243n815N245J2026j672j7267j761K0630N030k2151p590K1397R412j8480
1660c239j0358J3716J0486p613r783Q83Q271N966o319j2075M094J6906j630k0008
1674a0703p93K1165K945k0290m569J7249N850j2685o606O948O851p10o713n387
1688g448O078J0827n243j4918M140J7368k790j8043J526J6636p5j3518j276R241
1702B505K486m213l487j052M156N974m573r908M583J2576m361j3716L855J3067
1716G892k993j1046J940P818q73l743k86l77J190M414j873p782K492R938k656
1731D055j0835K608J0308k256q529J754N607j059j989L44j987L75N602r42q573
1746e517J239J0655j453j1326J253J0601p51q677J44N578P46j732j584k513K393
$$ y = [-2243, -8058, -2813, 9213, 7541, -9726, -11487, 9143, 14173, -7978, -15568, 5829, 15241, -3239, -13597, 119, 10605, 2992, -6791, -5908, 2363, 8329, 2010, -10065, -5971, 10935, 9305, -10703, -11496, 9669, 12614, -7676, -12245, 5004, 10854, -1831, -8437, -1489, 5362, 4652, -2061, -7448, -1370, 9457, 4214, -10704, -6564, 10804, 8014, -10029, -8503, 8133, 8058, -5460, -6736, 2505, 4991, 778, -2709, -3761, 395, 6369, 1796, -8112, -3529, 9047, 4686, -9030, -5175, 7892, 4899, -6147, -4207, 3611, 2738, -1005, -1291, -1668, -478, 3936, 2063, -5719, -3227, 6711, 4055, -6780, -4172, 6136, 3880, -4649, -2895, 2712, 1653, -336, 8, -1979, -1604, 3998, 3056, -5517, -4278, 6377, 4924, -6402, -5149, 5452, 4701, -3976, -3832, 1746, 2492, 760, -824, -3337, -944]
1761i44O492k786r845K830J2271k506j3308J759J2820n61j1050q54P895K463l944
1776G32l998m79N195M947o062q976O373J2206n989j4209M921J4854l363j3910
1790g758J138J1786J287q320l906M242O322K93q260m837R486Q911j0031j1960
1804a1607R589J3814q202j4333N834J3443k808j1322n73Q054M085m155p300J1
1818e470R890M054j1531p557J2181J0172j1636j1706R957J2046p217j1282L811
1831d288R493j00o786l758L688P199m61r892k774J1683N368j2306p336J1835Q444
1846A0009j0181q654P560P965m207o632N89M758L151k571o438K57R036J820j0597
1861d135l491J1114M640j0463n157Q677N010o079m413K939L260M80j852l727M03
$$ y = [-944, 5548, 2762, -7083, -4253, 8018, 5512, -7796, -6037, 6783, 6222, -4828, -5682, 2213, 4676, 732, -3266, -3745, 1450, 6397, 335, -8641, -2268, 9938, 3949, -10260, -5339, 9515, 6152, -7758, -6620, 5166, 6453, -1867, -5773, -1531, 4791, 5084, -3176, -8013, 1473, 10384, 353, -11607, -2018, 11796, 3594, -10739, -4905, 8538, 5730, -5592, -6165, 1889, 5974, 1819, -5481, -5470, 4420, 8474, -3057, -10614, 1567, 11739, 103, -11603, -1646, 10400, 3183, -8099, -4288, 5205, 5105, -1681, -5439, -1751, 5448, 4987, -4905, -7679, 4004, 9372, -2934, -10270, 1565, 10009, -172, -8826, -1266, 6699, 2492, -4140, -3551, 1207, 4358, 1787, -4651, -4394, 4642, 6462, -4135, -7626, 3488, 8128, -2335, -7492, 1185, 6195, 116, -4297, -1358, 1902, 2382, 530, -3197, -2794]
1876b794O295J067q150k134Q937K920q739l170P499L027n475k421K897J538J0
1891A307m92k693q07N149J776o762k690P545L177p420l335O416L058m541k462
1906b774K088J532O59m57l281q76N646K082p237l072Q083L913p990m272O832M186
1922E062m680l835J970L070J050j928m103N39O759Q43q813k163R861L339r830
1937b859m273Q689M842o563n000L644M876k39m335l111L325O390k172q940O55
1952e071J0813P07j1517k111J1042L471r547m530P027N236l784n530J01N312L675
1967E294m861o947L927R593k626j1364J186J1924L44j1120j943R322L466o707
1981e12m490L235N393L05n725l871N718O914n203r227M270J0547l044j0839J560
$$ y = [-2794, 3501, 4568, -3582, -5716, 3221, 6141, -2598, -5768, 1731, 4758, -717, -3138, -241, 1297, 1307, 815, -1878, -2685, 2464, 4240, -2522, -5212, 2333, 5510, -1910, -5245, 1171, 4229, -312, -2774, -686, 846, 1505, 1048, -2233, -3109, 2537, 4619, -2618, -5690, 2393, 6306, -1684, -5956, 876, 5062, 382, -3453, -1483, 1587, 2637, 709, -3394, -2855, 3904, 4747, -4066, -6229, 3632, 6971, -2859, -7132, 1557, 6399, -164, -5164, -1520, 3356, 3117, -1218, -4329, -1004, 5386, 3214, -5726, -5071, 5742, 6449, -5068, -7179, 3863, 7334, -2213, -6743, 284, 5520, 1736, -3794, -3693, 1619, 5294, 433, -6514, -2587, 7006, 4380, -6984, -5798, 6126, 6470, -4650, -6593, 2729, 6195, -512, -5002, -1767, 3626, 3931, -1794, -5665, 53, 6967, 1764, -7463, -3193, 7354, 4310, -6529, -4969]
1996d969R919J79q182j815N701L263k648m587m71N488L400n801n878N680P631
2011F910n052q546L967Q634k574p736R05O139O69l798k381J349L677J213m684
2026a308l466N214N081n046o264M566O581l645o118K387M874q03l164p73J232
2041f52K199Q67l338k711L958M291m297n114L994N321l246m978K223L996r78k492
2057i57m51P24J686J143k778k838L481M212l755n056L559N407k895n071J843M154
2073B408n11k729q92R42K269R32l395k785M155M315m399n454M203N929l361n910
2089d283K133N171m99m018j096K148K961l07m447j653N549L450n990m990N930
2104E9N982n212o276L733O209j990n419q7M131K285k602m250P55N853J120o904
$$ y = [-4969, 4950, 5129, -3053, -4868, 833, 4096, 1448, -3139, -3610, 1878, 5278, -523, -6401, -721, 6910, 1858, -6688, -2721, 5913, 3339, -4397, -3492, 2647, 3316, -482, -2863, -1514, 2163, 3376, -1308, -4774, 440, 5521, 475, -5789, -1223, 5358, 1713, -4405, -2018, 2856, 2053, -1111, -1884, -652, 1547, 2414, -924, -3635, 323, 4614, 317, -4797, -803, 4518, 1272, -3706, -1483, 2513, 1535, -957, -1408, -684, 1002, 2145, -633, -3471, 10, 4222, 467, -4589, -1030, 4377, 1482, -3589, -1746, 2408, 1897, -832, -1724, -782, 1487, 2419, -976, -3761, 394, 4709, 310, -5144, -941, 4988, 1627, -4283, -2150, 3021, 2522, -1496, -2592, -444, 2517, 2210, -2237, -3890, 1659, 5109, -881, -5871, 59, 6041, 829, -5447, -1714, 4495, 2505, -2914, -3001, 1130, 3415, 813, -3437, -2682, 3171, 4291, -2613]
2120b613k953P373M420p106n372N995N920m379n820K147N351J70m173k689K853
2135h76M876j256o602m24P662K025p948l396P515M353o313m854M415M902k110
2150A969m623l63L879K867k942m929J712O573m83p449p87P671J816p031k671N788
2166I97L270l972l537J783L551N47l194k739K452M707j844n856Q17O607K5o562
2182b948r08N875J617m558k130K745K427p12k487j285K227L124j768m540J257
2197b064N312n15n577r8N134P36m112j189K602J505q93j642r62J639K569j425
2213A020l915J073M695n38n024Q1M643M46l657j031K390J422q22j562r27J598
2229a08K502j431l821J098M761o22n097%M894O32m092j287K780J824j143k157
$$ y = [-2613, -5566, 1807, 6227, -879, -6251, -256, 5664, 1285, -4535, -2388, 2963, 3133, -1040, -3729, -876, 4000, 2744, -3858, -4282, 3380, 5405, -2543, -5939, 1576, 5929, -384, -5238, -823, 4079, 1969, -2654, -3017, 862, 3729, 787, -4142, -2430, 4143, 3660, -3789, -4576, 3095, 4911, -2120, -4791, 997, 4267, 295, -3242, -1459, 2092, 2639, -555, -3294, -842, 3865, 2021, -3835, -3018, 3589, 3614, -2948, -3856, 2019, 3636, -922, -3052, -307, 2120, 1408, -1079, -2364, -137, 2987, 1219, -3321, -2064, 3248, 2733, -2844, -2942, 2192, 2928, -1184, -2373, 229, 1734, 841, -801, -1763, -124, 2445, 1020, -2895, -1822, 2873, 2335, -2689, -2608, 2035, 2481, -1176, -2207, 183, 1605, 783, -779, -1706, -108, 2394, 963, -2858, -1760, 3001, 2379, -2718, -2718, 2176, 2808, -1284, -2571, 209, 2033, 890, -1267]
2245a267o65K221K466k153l934J812N079j274n700N30N634L48m927j292L859K048
2261B785k227k684L69L213J411l280l265L132M720k780n598K021N998j011n798
2276b994r5M944J346l793k361K026L328j76l906j648M108L413m046m655L436N638
2292D565k704n879J551N556j47m799j140L465K439j864l549O8M299J634m607l119
2308d231M484M276m006m947L113N132j975m759N59L987R67k866k314J516L435
2323B371m6m261j295M603K522m497l403M032L876l185l959J863L673n07k985q94
2339b092J982K210r03l205l02L934J333m190k212M053K767l361l044K439K941
2354B350j259k449m6J791J324r83k398R9L140Q66l679j655L653K196l193k433
$$ y = [-1267, -1932, 289, 2755, 602, -3332, -1520, 3559, 2285, -3415, -2885, 2749, 3097, -1830, -3122, 737, 2785, 558, -2126, -1757, 1456, 2867, -413, -3678, -546, 4174, 1394, -4204, -2183, 3815, 2804, -2994, -3089, 1855, 3201, -592, -2953, -927, 2401, 2225, -1681, -3329, 779, 4192, 146, -4509, -1073, 4565, 1861, -4018, -2467, 3089, 2942, -1857, -2997, 468, 2907, 1043, -2506, -2438, 1861, 3495, -1112, -4231, 253, 4529, 523, -4424, -1311, 3821, 1846, -2913, -2354, 1633, 2600, -266, -2580, -1064, 2371, 2325, -1936, -3231, 1372, 3894, -603, -4006, 26, 3902, 717, -3242, -1379, 2294, 1787, -1198, -2092, -110, 2100, 1197, -2008, -2310, 1624, 2957, -1233, -3445, 608, 3375, 14, -3030, -591, 2350, 1091, -1358, -1404, 387, 1711, 728, -1670, -1571, 1569, 2435, -1244, -2899, 754, 2950, -243, -2676]
2370b676K412K442j484k143K57J572J043q85k111J48K945N70l350j368L502J949
2386B823l197k260K502K375j626k123L57J769R10j201k057M36L031L36l613j158
2402b696L893J756l560k352K948K578j940k595O92K331P62j886k059J203L135
2417B210l38l951m66M364J254m273j939L710K513k871k839J640K823j84k616j278
2433b241K157K653j566l755Q24M517nm729q73M506J663l863k230K751K753j439
2449A123k927j74K911J644k486k935J855L997j124m640K48M806N54m450j322L658
2465G38J981k473k586J174K817L34k844j745K599K969k149l852J545M318p48m364
2481b286o2L927Q49l171j515K043K153p93k522m85K608J725k536k677K109L419
$$ y = [-2676, -264, 2178, 694, -1449, -1192, 380, 1423, 538, -1573, -1425, 1520, 2090, -1260, -2628, 874, 2823, -374, -2634, -132, 2243, 617, -1506, -1149, 620, 1530, 329, -1728, -1292, 1739, 2075, -1538, -2696, 1197, 2953, -607, -2959, -11, 2567, 627, -1968, -1276, 1055, 1817, -69, -2128, -925, 2210, 1872, -2079, -2545, 1819, 3073, -1200, -3139, 571, 3084, 213, -2626, -986, 1837, 1653, -963, -2241, -84, 2569, 1003, -2752, -1928, 2589, 2584, -2145, -3018, 1488, 3151, -712, -2942, -191, 2562, 1123, -1804, -1978, 933, 2577, 91, -2844, -989, 3008, 1884, -2756, -2508, 2298, 2852, -1598, -2920, 738, 2719, 246, -2340, -1166, 1651, 1985, -859, -2604, -5, 2964, 815, -3037, -1492, 2826, 2078, -2286, -2348, 1579, 2428, -743, -2258, -215, 1938, 1145, -1377, -1862, 746, 2471, -65, -2742, -633, 2786]
2497B786j588l762R11L593p5l149o85K374J385j362j892J67K286R22k273j988
2513b350K242K653j866l096J282L178o08k844k16K332Q77j470j456M61J803N71
2529A493k034j538K101K298j922k713J529K802q56k692K09K197N75j523j191O66
2545e99J736K22k097j165K264J876k064k547J713K793j115k751L62K391M37j771
2561c15j191J003J848r4k285q64K524J742k510k442K230K886j652l024Q99K799
2577A554Qk378r78J816J711q65k393q6K820R85k940j883K841K479k362k833J621
2594h83K979q41k677l43K381J266j664k125P93K853P7l273r27L335J704l004k361
2611b710K461K790j678k871O49K623M86k245j515J633K368q79l017J8L426Q09
$$ y = [2786, 1198, -2564, -1653, 1940, 1865, -1284, -1969, 405, 1790, 428, -1464, -1297, 989, 1911, -362, -2350, -108, 2545, 679, -2417, -1135, 2043, 1435, -1409, -1625, 707, 1584, 114, -1342, -881, 922, 1493, -541, -2079, 22, 2320, 398, -2315, -786, 2016, 1160, -1532, -1323, 874, 1449, -74, -1265, -599, 1137, 1359, -738, -1903, 361, 2237, 173, -2374, -661, 2132, 1017, -1734, -1372, 1019, 1456, -315, -1506, -503, 1345, 1251, -1034, -1898, 626, 2368, -142, -2584, -354, 2532, 880, -2144, -1245, 1554, 1562, -816, -1794, 22, 1733, 868, -1525, -1611, 1209, 2194, -746, -2629, 212, 2691, 329, -2504, -883, 2096, 1255, -1422, -1765, 616, 1882, 218, -1907, -1114, 1739, 1816, -1457, -2384, 951, 2655, -349, -2710, -249, 2541, 863, -2008, -1359, 1264, 1750, -495, -2010, -377, 1991, 1112, -1905, -1887, 1539, 2348]
2627B348l380j529L022K116k384k476J589K448m90k429n15K075J513j499k403
2642a994Q62K967q8l316n33L193J174k853j651K123K051j279k193L25K089P07
2658A584j714j743J368K413p62k873J20L031N34k803j097K365J451j640j763P85
2674g44J793J96j728j115J434J893j030k413M90K743M7k721n80K377J057j800
2690a01j358J018J537j46j588p35J477J521j171k084O59K532j57k688k27K376
2706H65P56j900j210J203J473l54j682m21J589J318j401j979R05K533n54k601
2722a460m9K565O25k163j172J573J565p60j804j58J868J028j803j708J390K356
2738A893r98k655M16K776J69k580p37K042J308j375j709N89J934L83k159j069
$$ y = [2348, -1032, -2561, 461, 2577, 193, -2283, -694, 1754, 1264, -1165, -1680, 395, 1908, 409, -1994, -1132, 1835, 1747, -1569, -2102, 1091, 2265, -588, -2239, -116, 1935, 656, -1537, -1212, 877, 1584, -130, -1873, -505, 1908, 1146, -1727, -1607, 1424, 1958, -845, -1942, 423, 1874, 234, -1529, -744, 1049, 1245, -483, -1598, -164, 1729, 699, -1714, -1224, 1519, 1566, -1155, -1735, 642, 1699, -101, -1459, -441, 1096, 950, -638, -1373, 104, 1625, 454, -1630, -971, 1561, 1404, -1284, -1511, 865, 1621, -279, -1489, -286, 1187, 833, -849, -1270, 319, 1637, 236, -1743, -838, 1695, 1141, -1460, -1509, 1056, 1681, -482, -1654, -81, 1484, 724, -1080, -1238, 630, 1658, -145, -1853, -463, 1893, 895, -1760, -1344, 1432, 1601, -979, -1716, 326, 1634, 259, -1450, -861, 1073, 1456, -703, -1772]
2754a772J871J892j564k430J113K648m44k751j26K467Q27j954j416J129J904l73
2770A021k137n33K278J329k122j991J700K452j143k639M53K619J82k237q83J707
2786E6J551r74k026K33K244N65k269j298K074J894j697k272J183K360m87k314
2802a177j95J913R43j443j502P81J984j28k194n51K163J206j949j806J654K032
2818A731j061k115M38J942L01j590j000J117J630n44j988q8K127O84k025j259
2834a700J771J638j314j860O86J833q9j533o28J302J162q26j607K35J890L45j973
2851f68q20J851J197j478j545R88J679l96j580l20J414Q43j034j382N52J841m6
2868A096j969n52J883J121j757j338J229J635o74j696NJ597O23j264j235Q19J773
$$ y = [-1772, 99, 1991, 427, -2003, -890, 1758, 1314, -1437, -1563, 904, 1731, -223, -1639, -510, 1394, 1021, -1116, -1649, 629, 1958, -164, -2155, -455, 1997, 854, -1785, -1332, 1287, 1469, -768, -1651, 56, 1607, 633, -1393, -1160, 1084, 1649, -620, -1918, 156, 2050, 353, -1919, -736, 1624, 1137, -1177, -1372, 541, 1484, 41, -1461, -680, 1304, 1176, -1018, -1569, 594, 1800, -149, -1955, -301, 1731, 670, -1445, -1007, 935, 1236, -354, -1354, -237, 1393, 849, -1139, -1227, 900, 1584, -441, -1700, 71, 1709, 395, -1465, -779, 1054, 965, -568, -1196, 106, 1268, 442, -1165, -930, 960, 1305, -668, -1488, 363, 1560, 82, -1463, -475, 1204, 808, -772, -1092, 322, 1165, 131, -1251, -699, 1142, 1096, -873, -1425, 458, 1579, -178, -1516, -287, 1348, 674, -1022, -1017, 580, 1203, -61, -1296, -477, 1296]
2885A296l12k037k56K126P10j953j172J559J488r83j702L83J711L13j524j025
2901a378J213J550p51j904J72K171K78k148q18J976J212j418j556Q53J643q7j706
2918f98n26J549J133j116j823P20K098j18k273l84K111Q86j760j330J260J643
2934A372o37j807k7J723P56j480j436J162J800o26k109J06K208M00j995r13J668
2951A65J279j122j550M80J653K97j732q65J471J416j138j832P22K023k11k027
2967i71l65J882Q40j433j274R42J477k56j638l90J653R27j324j553J061J778n17
2984H39j961OJ903N62j692r41J165J275o33j489j7J592O14j479j152J191J553
3001A336q10j736L52J854P8j623o20J323R95q98j266L46J490K06j466p49J305
$$ y = [1296, 984, -1053, -1309, 817, 1527, -426, -1598, -39, 1449, 466, -1236, -853, 858, 1171, -353, -1378, -165, 1385, 634, -1270, -1098, 1073, 1351, -797, -1615, 361, 1573, 155, -1401, -548, 1095, 1008, -698, -1224, 325, 1458, 342, -1481, -761, 1337, 1219, -1054, -1438, 673, 1559, -201, -1531, -271, 1372, 735, -1072, -1099, 624, 1380, -100, -1536, -374, 1426, 800, -1309, -1203, 1005, 1405, -590, -1503, 165, 1444, 322, -1228, -748, 905, 1202, -530, -1395, 76, 1492, 354, -1478, -756, 1267, 1056, -971, -1336, 546, 1386, -47, -1321, -379, 1098, 842, -796, -1186, 467, 1394, 70, -1483, -422, 1356, 839, -1122, -1116, 787, 1349, -343, -1284, -119, 1156, 523, -966, -983, 609, 1223, -256, -1408, -217, 1336, 526, -1210, -858, 996, 1074, -549, -1169, 154, 1149, 251, -1015, -669, 821, 1027, -439, -1188, 117]
3018A17J254j092j543O43J672j80j714k80J496P70j105j174O56J388j11j382n44
3035a129J428J044j254j371R16J550m20j710rJ600N06j271j017R00J292l59j558
3052h62j29J582N99j418j140J209J465p95j670L33J592K37j446o91J114J145p06
3069D19j434K05J584L87j600q66J455J244j179j482P05J622j70j619l13J339R02
3086A199j064j278N89J582j02j694m42J624R68j433j277J060J499n77j629k2J635
3103F38N19j304r93R26J369m36j717J2J699M54j507r73J327J295q99j541M49J498
3121H16P3j400n84J140J158q05j494M33J562J07j629n86J534R51j241j273Q39
3138c99J430k86j484j94J298P73j064j216P52J420k12j643k57J601P00j456r69
$$ y = [117, 1371, 279, -1264, -621, 1051, 871, -843, -1123, 373, 1143, 38, -1136, -480, 908, 797, -585, -1129, 299, 1343, 89, -1282, -366, 1184, 764, -946, -955, 645, 1151, -120, -1137, -237, 1055, 696, -862, -991, 591, 1190, -228, -1368, -159, 1306, 511, -1159, -826, 766, 1003, -443, -1134, -20, 1125, 419, -1015, -810, 774, 1161, -439, -1305, 150, 1394, 215, -1267, -562, 1060, 890, -729, -1042, 297, 1199, 135, -1143, -554, 1028, 926, -768, -1210, 414, 1382, -51, -1328, -268, 1231, 654, -975, -997, 638, 1157, -147, -1140, -214, 1155, 719, -998, -986, 713, 1167, -340, -1313, 14, 1309, 410, -1131, -682, 816, 889, -511, -1095, 45, 1203, 398, -1096, -663, 899, 1006, -623, -1209, 325, 1276, 35, -1238, -399, 1031, 745, -739, -933, 365, 1138, 74, -1142, -390, 1030, 818, -825, -1082, 519, 1219, -237, -1206]
3155a206J005J267n54j416Q8J388L81j242p95Q99J295n38j498Q0J604L12j443
3172c73p04J185J092q94j261L82J306R8j214o09J035J018p36j353L74J453O3j466
3190f04m54J377Q18j031j167O43J263j07j303l61J179P97r40j148O17J390k67
3207G02j462k39J480O05j280q95R07J137m64j247j0J294M31j087r24Q18J274m96
3225E44j417Q7J459K99j338p12J118J014p99j120K49J272J83j212o31J040J087
3242A123q73j281M23J501p2j467l72J325P75j036j001N50J246j62j327l20J270
3259C02P79j091j020O53J357l23j474r3J447M59j155r10R47J055m81j245K8J303
3277E38M14j187p94R19J162o16j378K64J363K04j350m52J041Q98p92j177L70J332
$$ y = [-1206, -201, 1066, 512, -904, -816, 572, 953, -289, -1084, -185, 1110, 572, -926, -846, 758, 1070, -373, -1077, 108, 1200, 306, -955, -573, 733, 831, -383, -992, 43, 1061, 325, -1028, -654, 799, 862, -604, -1058, 319, 1137, 106, -1061, -418, 845, 738, -565, -926, 253, 1050, 110, -1038, -421, 969, 702, -760, -999, 481, 1086, -194, -1089, -182, 955, 491, -756, -766, 528, 959, -128, -1052, -234, 1040, 544, -873, -786, 673, 972, -366, -1078, 40, 1054, 255, -865, -616, 656, 839, -373, -1004, 36, 1123, 250, -1031, -608, 893, 821, -646, -1018, 307, 1082, 46, -955, -405, 841, 679, -648, -968, 302, 1081, -10, -1030, -377, 980, 657, -817, -910, 537, 996, -159, -1069, -122, 933, 452, -793, -765, 538, 952, -235, -1029, -110, 1052, 436, -942, -678, 685, 889, -461, -913, 128, 1026, 234, -943, -573, 759]
3295G59Q7j323m97J127R44r29j203N69J360j48j372k84J269O26r77r26N62J197
3313H41k02j304j87J237O27j078r90P99J221m93j312J41J284L27j176o69Q68R46
3331H80n01j132N5J290K82j155p05J000J021p78j171L84J228M2j186m65J085P21
3349H95o73j047L36J210Q3j249m94J121Q16q96j055N38J206j49j250k02J108N88
3367H86q53q49M73J099k21j159j81J147N85r97r55Q19J092l86j172j3J247L02
3385H64j028o40P37R11m31j158R7J196L13j160o25R14R64o36j150L30J177P4j179
3404d30m85J029P58o73j059L40J194R1j208m43J085P63q68j003N59J142j54j237
3422e99j52J027O10q35r24O14J097k75j168j43J143N27j040q19Q10J032n01j099
$$ y = [759, 846, -477, -974, 153, 1097, 168, -1035, -466, 894, 746, -626, -910, 359, 985, 8, -918, -356, 841, 639, -665, -852, 385, 1012, -66, -1056, -257, 964, 471, -841, -700, 584, 911, -265, -934, -66, 880, 379, -753, -698, 592, 874, -281, -986, 14, 1035, 257, -914, -530, 698, 740, -446, -911, 174, 895, 222, -825, -489, 721, 804, -445, -939, 182, 998, 102, -953, -415, 791, 642, -608, -810, 298, 886, 33, -816, -343, 756, 535, -624, -805, 342, 927, -70, -1025, -206, 886, 500, -672, -685, 562, 864, -164, -804, -67, 844, 413, -745, -648, 548, 861, -299, -924, -10, 954, 318, -832, -502, 675, 749, -430, -915, 114, 872, 199, -860, -520, 674, 765, -443, -886, 199, 962, 94, -909, -350, 792, 638, -599, -751, 276, 886, 51, -873, -259, 838, 563, -605, -748, 395, 922, -118, -937, -127, 905, 404, -695]
3440f95L6J146L39j041o61Q05R43n27j130J38J264K03j178n38R56Q67p19j072
3458h64M07J160k0j123l84R73P87p82j043M77J146l6j277k32J100O45r33q84O53
3477b30J031l21j089o6J064L87p97q09O48R91l41j154N7J147K66j020o95Q76Q17
3496G62m61r84J56J012K20r67n47P41R23n77r95K12J098J21j122l83R06O90o75
3515A30r13M47R55l3r79l07R02O03p03q97M76R78j16j076j79J022M92q74p59N88
3535b43R50k36j010m8R41L53p12p95O55Q91l48j062M3J015L60r88n26P27P52m08
3555C11r77J55R68K01q86o18Q20Q20n36r93K93J053P7j006m38R08N95o58q51L16
3575d46J069k8r97l94Q96O70o44r70N25R91j22j041j53R46M69q44p47O06R01k04
$$ y = [-695, -659, 487, 826, -215, -876, -71, 872, 345, -785, -647, 617, 820, -358, -896, 60, 927, 208, -864, -457, 703, 683, -440, -824, 149, 936, 154, -889, -412, 734, 698, -579, -811, 289, 934, 1, -883, -230, 801, 480, -609, -675, 389, 776, -21, -830, -182, 809, 468, -686, -629, 518, 784, -236, -931, -55, 762, 301, -683, -527, 485, 705, -262, -809, -68, 855, 278, -717, -505, 593, 714, -408, -791, 115, 805, 130, -783, -336, 619, 586, -393, -700, 202, 805, 102, -795, -319, 659, 543, -533, -712, 310, 802, -72, -831, -243, 707, 471, -539, -587, 354, 707, -5, -800, -145, 746, 398, -664, -621, 394, 754, -234, -760, -33, 719, 311, -666, -511, 457, 658, -228, -846, -26, 794, 258, -735, -442, 611, 688, -318, -756, 152, 747, 89, -762, -446, 623, 595, -402, -796, 100, 770, 126, -844, -319, 672, 550, -491, -644, 302, 771, -73, -820, -214, 687, 483]
3595D83r79p8R34L91q41o77P30Q56m44j048J19J051K33q90n51O89P73m70r55J79
3615d95J022J35r44n31P96Q33o30r37K61J075P1j110l02R01O53o72q64M67Q48
3634E77Kr83k90R55N40p86q03N92R29l07r83k2R29L32p99o50O65P71k86r60J8
3655e59R32L51r39o27Q04P70m96q92J53R71K16r75l66O84P07n06q86K25R69R4
3675F30r46m57R01O31o28q23L71R43q7r81j67P92N09o15p40M11Q24q9q55k38Q37
3696B23M81o85o85M62Q04j99r08l9Q11L65p16o03N24P64k11q65j16R90K37q53
3716b19n33P54O92m62q47J80Q66J67q02m23O73N88m02q72K22R02Q6q40m53Q34
3736A11O23o42p74L99Q52o6r45j75Q14M86n93p79L62R21p2r62j73R18M67q00o81
$$ y = [483, -496, -574, 360, 751, -90, -767, -37, 819, 375, -673, -554, 497, 730, -160, -711, -22, 751, 281, -674, -495, 527, 662, -282, -813, -17, 816, 186, -751, -490, 585, 656, -454, -756, 145, 798, 126, -738, -271, 577, 579, -404, -694, 261, 801, 15, -788, -196, 733, 426, -557, -579, 350, 682, -117, -767, -102, 669, 383, -577, -559, 373, 724, -215, -842, -38, 732, 236, -656, -503, 468, 684, -291, -657, 27, 734, 228, -658, -433, 536, 630, -316, -773, 128, 759, 131, -692, -321, 622, 535, -446, -613, 179, 688, 73, -667, -256, 568, 479, -376, -614, 223, 704, 19, -666, -204, 600, 401, -507, -546, 265, 630, -86, -689, -165, 599, 388, -477, -593, 397, 634, -219, -752, 2, 694, 232, -615, -435, 431, 598, -204, -627, 46, 634, 232, -640, -418, 484, 570, -270, -723, 111, 734, 92, -682, -283, 569, 503, -442, -617, 197, 683, 90, -689, -327, 594, 522, -440, -613, 305, 772, -28, -709]
3757g09N56P65k59r17P4Q09L53p85n83O06Q08l39r81O1R55K43q80n61P95O97m80
3778B28q70K21R24P2q84l25O98O49n27q71K89R63Mr74k54Q59N52p02o89L45Q77
3799E85r1q51k14Q00M59p16o47M20R06k30r48oQ53L08p92n18O14P07l21q08N2
3820d38Q29K27p61n13N87P79m46q57J32R47R0q90l44P50N40m80o68J95Q15L2q09
3841b83l45P11N65n29p70L72Q13m6q62j74Q13L54n72o57M15O91p0p97j50P59L22
3862E60n85o17M59P55k21p79n3P64L06p31m89N40O55k46q04M5Q04K12o85m79N21
3883f8P12m25p67J04Q54M5o74l81O72N13m25o92K07Q05Q3r01k77P34N06n11p28
3904f14L40Q42j30q14j76P64M19o10o52M23P68j97p62j20Q12L53o93n65N09P30
$$ y = [-709, -153, 612, 353, -564, -490, 319, 672, -113, -696, -90, 718, 379, -602, -541, 414, 657, -223, -784, 11, 708, 228, -642, -421, 503, 575, -309, -634, 64, 713, 186, -685, -396, 567, 571, -403, -657, 202, 754, 52, -637, -292, 585, 494, -357, -571, 229, 688, -28, -675, -255, 651, 421, -527, -533, 320, 628, -164, -682, -68, 639, 318, -490, -438, 391, 618, -143, -656, -69, 710, 264, -593, -461, 486, 576, -314, -658, 92, 632, 152, -516, -321, 494, 526, -283, -628, 83, 648, 119, -651, -279, 534, 488, -374, -548, 265, 619, 47, -610, -195, 496, 426, -371, -521, 238, 560, -25, -642, -183, 572, 351, -428, -481, 283, 589, -142, -631, -91, 564, 318, -486, -441, 363, 575, -110, -589, -68, 644, 219, -548, -444, 410, 455, -219, -600, 72, 585, 160, -532, -325, 480, 563, -338, -615, 119, 625, 114, -614, -274, 568, 438, -376, -552, 212, 631, 21, -631, -208, 560, 363, -399, -519, 293, 646, -47, -612, -103, 627]
3924F27k81q20K4Q00K46p52m64N46O54l35p34J22Q01J53p83n30Q03N76n17p35
3944e99K89P85n8o58l75P19M86n34n89K62P34K3q44k87Q36M74o52o78M98P32k00
3965C64q00r1Q51J81n49n55M84O52j84q38j8P91K91o60n34O01O43l78p18P1P69
3986C73J45o95m13N72N59l18p37J41Q03R2q19l16O87N13n19o72L50P05k6p23k68
4007e66P26L57m83n46K66P05o0p48j01O42L29n09n95M47O44j43p57l3O32L05n80
4028f8m83M70O00j86p64l5Q01K08p14l98N16N95k79p59J21P06J88p05m24O05N73
4049E68l45o96Q3Q32J9p01k59N72N08m55o31K60O76k4o60k40O00N08n32o37L14
4070b40P00l6q29n8O57M32o00n25L43O34j35p79l8P12K99o53m75M45P01k41p83
$$ y = [627, 346, -474, -450, 350, 596, -156, -620, -74, 580, 245, -489, -367, 434, 587, -196, -726, 77, 653, 136, -599, -310, 475, 417, -241, -616, 103, 589, 55, -534, -272, 462, 485, -359, -646, 190, 664, 12, -666, -168, 564, 364, -436, -527, 324, 505, -44, -599, -115, 537, 353, -485, -503, 288, 579, -81, -615, -14, 629, 251, -467, -396, 373, 518, -177, -590, -18, 541, 223, -514, -373, 430, 522, -297, -613, 74, 587, 68, -604, -254, 451, 425, -298, -566, 160, 517, 34, -512, -246, 459, 399, -349, -450, 192, 521, 12, -583, -136, 508, 365, -392, -425, 207, 512, -68, -551, -81, 519, 333, -431, -466, 335, 543, -171, -569, -53, 542, 263, -496, -375, 331, 519, -186, -610, -5, 568, 223, -473, -390, 442, 461, -240, -499, 73, 581, 126, -505, -245, 431, 407, -253, -493, 107, 615, 83, -554, -240, 460, 424, -405, -463, 194, 626, 26, -499, -156, 478, 343, -436, -474, 238, 537, -116, -591, -146, 555, 314, -469]
4091d69L0P98J28o86l71N65N95m00p58K18P56J01o90l24N79M74m57o48K67Q14
4111E22r0p63j93O66M30n66n53L76O27j05p07j53O41M27n87m94L41O30j37p14
4131d02j3O73K73o73l90M54O22l12o63L1P87J15o39l93N52N24l66o76J72P47k1
4152D02o26l22O27M57l88n95J69O85pn98k74N70M78m90n82K90O56j21o65q0N42
4173A28L77m93m70K89N95j16o19j37O77L28n84n07M36O00k88o16O8O08J76n24
4193g2m10M23N26k50n97J7O93J59o12l79M85N10l60n92K10N90L6n57k63M66M32
4214D55l24o20K36O19po02j95N31M73n25n41L19O09j10o08j28N73L48n01m64L18
4235a44N98j42o87m7O54L23o50m25M62N49k27o74R9N96J41n61l49M36N71l06o60
$$ y = [-469, -439, 359, 487, -199, -570, -5, 590, 190, -568, -350, 406, 507, -183, -507, 72, 546, 89, -559, -292, 522, 432, -331, -524, 142, 572, 6, -547, -171, 456, 351, -356, -509, 132, 559, -28, -522, -181, 449, 312, -402, -415, 258, 531, -142, -532, -78, 544, 232, -431, -400, 387, 502, -137, -530, 22, 546, 180, -496, -324, 423, 402, -224, -546, 81, 538, 150, -445, -276, 409, 402, -196, -470, 100, 578, 88, -494, -204, 452, 331, -334, -414, 128, 505, 12, -458, -169, 426, 310, -309, -446, 231, 559, -25, -532, -96, 504, 216, -400, -332, 276, 452, -72, -482, -59, 467, 217, -380, -363, 330, 489, -123, -502, -17, 493, 133, -459, -249, 341, 377, -180, -443, 23, 455, 131, -489, -253, 366, 359, -243, -438, 93, 566, 41, -500, -181, 428, 318, -290, -418, 155, 503, 2, -462, -144, 454, 312, -375, -422, 232, 555, -95, -520, -58, 491, 264, -410, -311, 285, 426, -135, -484, -48, 523, 217, -443]
4256d43J18O53R5o48k82O34L75m21n34K40O10k2o38j68N33M15m34n46K25P10q9
4277C83o82j21O72K27m95m49M03N14j58o16k3N89K40n57l92M29M64k00o51Q0O65
4298C22O6n19l14M52M36l03n21J43N76L3n40k92N18M29l42o09K00O76m7o12j67
4319d15N12L77m46m93K72N69p0n31j71N68L03m79m23K68N71j82n79l5O01J63m64
4340h4l35L28M91k43m74p4O28J98n35l40M18M99k50n51K9O12J27o13k82M81M15
4361D45k99n75J47N48J01n86k52M80M68m02n30K50N77m8n91n0M27K76l79m57K54
4382a96M76M4o39n2M77L07m30m40L31N10j88n21J6N33K02m85l53L87M05j50n66
4403c32M3N54J59o07k92M28N29k98o42J84O01K7n86k01M81L80l33n11J55N84L8
$$ y = [-443, -325, 328, 423, -225, -507, 127, 502, 81, -453, -213, 397, 375, -263, -431, 102, 517, 83, -463, -238, 472, 383, -299, -420, 252, 479, -16, -465, -62, 452, 294, -322, -345, 244, 484, -73, -465, -36, 428, 228, -423, -343, 322, 388, -131, -445, 7, 443, 140, -381, -238, 338, 371, -169, -461, 57, 486, 144, -465, -265, 411, 364, -248, -415, 97, 474, 28, -465, -193, 376, 306, -225, -396, 172, 475, -4, -427, -159, 412, 230, -349, -384, 217, 380, -84, -419, -91, 400, 157, -317, -391, 237, 435, -100, -440, -22, 477, 227, -324, -295, 317, 444, -169, -451, 30, 445, 146, -429, -282, 266, 367, -219, -471, 9, 477, 75, -455, -205, 372, 324, -267, -317, 110, 386, 7, -450, -196, 280, 324, -315, -367, 110, 417, -13, -453, -122, 388, 200, -321, -305, 228, 430, -55, -408, -21, 384, 234, -332, -289, 265, 424, -183, -475, -47, 482, 184, -458, -274, 327, 354, -232, -433, 48, 428, 95, -416, -261, 323, 361]
4424C61n84j90N15L69m52m17K22N95j68n13r6N49K33m82k88K80M26j23n52n1N80
4445B14K74n84l89N10M05k37n27Q1N09J13n38k55M35L76k34n38J14N24Q5n20k80
4466d62N31L82m18m51K24N33o1m87j12M31K71k94m43K13N38j08n29j49N59J81
4486C49l65l75L18M76k06m65j4M45J97m15l40K54M70q6n83M0N54J58n09k98L96
4507AK87j72m60Q9M77J38m79k53L94L52k29n05J34N32km60j48L87K99l08m30J76
4529a80M87j7m96r8M04K97l44m66L17N12j65n26n2M66K06l72l53K58M33q2m86
4550b57p2N00J96m02l68L75L76j82m82jO06N6m83k54M10L71k43m75J27M79N8n07
4572a72j97L93L90k89n13J81N28kn82j5L70K84l68l28J13N34j05m09j22M25K86
$$ y = [361, -223, -413, 102, 471, 19, -398, -176, 419, 251, -262, -358, 191, 424, -58, -346, -66, 360, 237, -315, -366, 214, 488, -96, -485, 25, 430, 193, -334, -253, 256, 369, -169, -424, 11, 387, 153, -385, -271, 253, 338, -182, -462, 69, 451, 33, -418, -194, 339, 278, -209, -321, 110, 381, 87, -356, -143, 395, 287, -242, -391, 168, 349, -16, -391, -73, 403, 197, -268, -282, 163, 360, -55, -395, -141, 329, 243, -340, -300, 254, 412, -97, -395, 1, 288, 116, -344, -255, 222, 360, -119, -372, 22, 374, 145, -360, -226, 306, 304, -156, -304, 83, 382, 74, -356, -180, 307, 290, -206, -304, 100, 397, 53, -413, -96, 416, 251, -275, -327, 139, 345, -27, -380, -122, 311, 229, -257, -329, 171, 367, -35, -403, -28, 348, 166, -316, -317, 289, 345, -138, -392, 18, 389, 146, -329, -202, 277, 335, -172, -369, 24, 414, 125, -388, -207, 321, 319, -263, -278, 92, 376, 8, -320, -207, 327, 222, -187, -309, 116, 402]
4593D02m56l60K75M99j84n14L0M91J28m30k34L21L86j92m23J8M59J61m94k40L40
4614a7L79k84m20J80L96N9m33j90L54L43k80l82J43M19K9m71k27M95K72l43m01
4635c79K78M23j47m00l9L38K33l38k04J74K69jm07p7M08J97l62k23K37L79j72
4656A87m27N1L74R5l53j86K30L14j65m02R7M31L9m15k15L86L28l47l21J37L83
4677B21k1l19j66L00K85k58l33J23M99m9m55j44M50J94k76l60J94L84m3m06k6
4698b06L26J60k87k83K06L63p4m28qM03J71m44k70L33L47j65l56k1L80J55m25
4719a23k11L40L38k49m21J06M77M4m50k08M37K74l06l39J19M20Nl68j65L94K90
4740D04l95l14J82M26p8m43k7M19J66l70k55K05L14k7m38l1M29J06l21k70K66
$$ y = [402, -54, -414, -139, 360, 176, -338, -308, 183, 311, -119, -353, -32, 354, 162, -261, -243, 216, 377, -117, -357, -17, 362, 78, -342, -162, 234, 293, -140, -330, 24, 367, 87, -295, -152, 267, 296, -175, -402, 93, 365, 22, -379, -101, 322, 175, -225, -264, 74, 307, -31, -235, -61, 208, 207, -200, -277, 131, 328, -34, -257, -20, 359, 187, -240, -189, 185, 280, -73, -259, -29, 285, 120, -282, -185, 246, 285, -130, -345, 41, 369, 22, -299, -162, 221, 200, -119, -285, 15, 300, 42, -291, -168, 331, 282, -173, -317, 133, 327, 51, -309, -115, 269, 226, -180, -206, 120, 280, -7, -290, -84, 279, 205, -223, -231, 172, 343, -101, -371, -38, 309, 144, -212, -233, 147, 302, -123, -334, 6, 344, 95, -326, -220, 257, 301, -149, -357, 80, 354, 48, -291, -172, 248, 253, -115, -280, 114, 404, 9, -305, -123, 303, 225, -218, -245, 174, 340, -30, -285, -80, 234, 207, -231, -262, 167, 273, -48, -318, -52]
4761e2L99k00m38K8M80N7m10k09M02J73j39l81J03L50Q0l35k11L28L07k45m32
4782c45K16L92k4m14q5L35K58l69k21J70K46K2l43r2K87K46l17k68K04L81j69
4803A10l57L5L75N5k52j57J77K51j34k62j2L23J16l03k74L07K15j42k76O9L12
4824A76Kk68j17K27K31j65k76J6L25N9l20j28K92K27l09k61J45L34n2l25m0L22
4846I5J25k35k06O4L71m7k92j03K85K30l07k16J44L54j53k98j2L74N9k83j67J74
4868d4L28j38l32k1L83R3l57k07K55L07k14l23J21L36j0l14j11K60K03j58l17
4889b60J55L38Jm39o9M28J21k76l13K57K93m1l72k2L31J23k78k33J78L62j53l59
4911b28J2L97R9l93j34K06L20j56k52k2L01M3k88j70K58K68j62l44P3L50K7l40
$$ y = [-52, 347, 147, -291, -263, 217, 274, -136, -345, 57, 230, 91, -290, -187, 163, 243, -92, -303, 25, 332, 87, -345, -129, 263, 239, -175, -260, 75, 333, -36, -257, -87, 159, 181, -162, -254, 33, 279, -38, -306, -102, 279, 110, -247, -212, 163, 218, -34, -191, -14, 237, 103, -159, -171, 152, 268, -35, -309, -2, 213, 71, -205, -136, 176, 178, -90, -207, 20, 251, 86, -190, -174, 151, 210, -110, -238, 54, 281, -28, -289, -144, 190, 138, -187, -227, 95, 220, -15, -221, -157, 214, 167, -125, -228, 57, 287, -20, -236, -92, 262, 109, -189, -201, 173, 232, -51, -218, -44, 284, 146, -186, -207, 176, 269, -88, -295, -40, 267, 53, -270, -149, 187, 177, -137, -248, 12, 215, 57, -260, -105, 233, 234, -205, -274, 154, 275, -1, -314, -57, 236, 195, -177, -199, 132, 255, -23, -256, -78, 284, 131, -228, -216, 181, 280, -113, -247, -41, 279, 123, -129, -151, 150, 193, -95, -265, -7, 261, 99, -245, -172, 178, 205, -135]
4933a35j26L52J45k05k41J54L27j33l03l2K77J99l34j54R0K94o3l03L0K90M2k33
4955f2j11J78J99j29k50P8K25J21k95j87J67K92j46k75K2L10M8l26o3K30K15j83
4977E8j76m1K41N7j90j17J56K63k29k30J06K49Kk60q1L03N3j62j66O8K44m2k22
5000a16p0K54J06j61j93L0L64r5k58k3K40Q5j75j78J17K41n3k56m9K74J31k02
5022A3k75K13K47j05k97P6L21k3j92j21J11K77j79k14k0K64J32l22j91L00K70
5043B85k37l42K21L00j01k44n8K69J19j96k12O5K74Jk74o1K73K20l55k41K70K66
5065B42j75k98J08K86O5k63j61J83K02n5l51O1K90J02l14j54K91K38k77k36J21
5086i5L16o2k99j6K19J48j87j58LL55p4k99o7K97J56l14j38J92K04o4l08LK58
$$ y = [-135, -261, 91, 236, 31, -210, -56, 271, 138, -165, -197, 80, 279, -55, -209, -119, 175, 112, -191, -161, 129, 171, -62, -173, 5, 204, 75, -175, -97, 128, 249, -46, -233, -66, 226, 80, -195, -173, 137, 185, -141, -204, 26, 241, 58, -118, -159, 82, 139, -51, -168, -12, 251, 22, -208, -102, 147, 149, -111, -192, 111, 164, 2, -164, -96, 148, 106, -116, -186, 68, 174, 13, -180, -150, 214, 119, -139, -162, 78, 163, -12, -190, -73, 168, 115, -141, -190, 84, 215, 13, -262, -49, 198, 93, -204, -128, 193, 170, -22, -143, -32, 245, 66, -148, -168, 96, 228, -94, -285, 15, 285, 48, -294, -73, 227, 126, -118, -176, 93, 212, 16, -196, -131, 143, 144, -130, -191, 82, 302, -53, -294, -24, 242, 67, -231, -123, 163, 228, -35, -196, -13, 189, 134, -217, -156, 134, 236, -78, -232, 59, 297, 20, -216, -95, 221, 159, -140, -156, 63, 211, 24, -134, -131, 224, 150, -149, -216, 81, 237, -77, -215, -23, 181, 117, -191, -188, 70]
5109G0O2j24j94J56K58j03k69K3K43Q1l15o6K13J42j47j48M1J50M5j90o2L0K82
5132A78j02j73LJ92L6k69k9J95J44j61j52P2J28N6j74q8J37J59r3k48N4L15k6
5155A54k52o1K21Q5k14j02J17J36J2j95PJ42J42j89j48J28J39Pk50qK11R3k50
5178g5r0J79J39q6k02K0J50J19j90j68J87K22j15k63N8K80K9l14p4K46J40j57
5200C5j78M6K12L4k42o4J44K01j23k14M5L18j0l96P4K42M2k09j16J76J37o9k25
5223a40q1K74J42k22k33K59K17j49k81P8K98m5j94j02K11J47j51j49M6K26K8k58
5245g9j07K38J36j84k03J43K20r9k44P2K07O0k43p6J45J64m9j89l9J66J49k51
5267f3j02J71J70k11m6NJ86l5j72N9P2Q4n2j59o5K22R2k03p3J67O1l2k07P5J18
$$ y = [70, 132, 8, -186, -30, 228, 125, -144, -121, 122, 203, -112, -178, 35, 177, 30, -118, -77, 73, 118, -72, -134, -104, 178, 76, -97, -94, 98, 134, -135, -164, 31, 175, 14, -138, -66, 62, 118, -56, -144, -7, 152, 59, -189, -135, 180, 154, -98, -159, 62, 147, -67, -169, -52, 84, 96, -99, -92, 50, 192, 3, -145, -17, 122, 129, -121, -129, 82, 175, -75, -165, 14, 153, 67, -135, -115, 35, 154, -36, -204, -17, 205, 90, -173, -115, 165, 194, -120, -194, 52, 192, 35, -143, -97, 115, 149, -93, -157, -13, 188, 65, -149, -104, 214, 204, -192, -118, 124, 166, -43, -159, 17, 154, 85, -140, -221, 53, 195, -27, -260, -1, 216, 67, -214, -136, 162, 117, -77, -179, 32, 179, 28, -121, -75, 151, 179, -79, -186, 52, 188, 4, -199, -56, 164, 65, -179, -107, 100, 160, -83, -159, -14, 150, 101, -88, -127, 39, 188, -63, -165, 6, 176, -35, -81, -76, 110, 75, -97, -38, 34, 118, 66, -93, -158, 64, 156, -47, -120, 47, 108, 76, -131, -56, 62]
5292F2l5j16nJ59N6r6j02n3J92Qj68n5K07J23k02j16Q8J69o7r6j1Q2K2pj33J3
5318h1J48P5k08o8J72M7j26j12J30J70j03j21n0K46n4n2j11J7J96O3k84m4K30
5341H0R8k17j32J97J02p7j51K1J71L8j70j21J34J60j04j54L0J91Q8k79j6J30J69
5364A88k12j42J52J59j6k03k5J66P9j27k12J70J80m2k81P0J94N3k63p7K14Q1p3
5387C3k01Q7J89Oj39j25J84J59j42k14J43J54k1k56M1K26J1j85p2P2J76n8j81
5410a13l6J77J35j59j56J18K32j62j68K0K74m9j79k6P6J01j15m0mJ08N0j50p5
5433a41J53J19j11r0j2K01p1p0n4R4K7q1k3J0O3M2j07q1J51J28j48r6Q8O8jj06
5459d8J0R8M4j29nOM9N4j50m3R5J46q5j72J01J27k6j66N9N8L7k4l2j2J19k5j39
$$ y = [62, 27, -89, -94, 65, 121, 25, -77, -130, 62, 70, -98, -153, 54, 177, -25, -141, -53, 116, 49, -47, -58, 24, 46, 39, -94, -81, 67, 142, -66, -134, 38, 85, -41, -153, -23, 147, 44, -77, -127, 119, 65, 13, -98, -81, 115, 178, -106, -150, 80, 178, -39, -171, 26, 128, 51, -100, -79, 92, 130, -40, -161, -27, 133, 29, -125, -95, 96, 184, -95, -111, 19, 188, -24, -166, -14, 145, 129, -74, -99, 67, 146, 19, -193, -23, 157, 115, -166, -96, 98, 151, -112, -189, 25, 106, 33, -168, -81, 108, 114, -25, -150, 34, 193, 51, -163, -20, 134, 113, -143, -102, 124, 135, -50, -122, -50, 126, 68, -113, -149, 28, 163, 4, -152, -34, 198, 36, -132, -112, 162, 113, -66, -92, -16, 85, -30, -70, -74, 34, 84, -66, -141, 12, 131, 20, -70, -82, 119, 48, -22, -76, 18, 45, -36, -59, -49, 14, 56, -51, -132, 19, 147, -1, -97, -9, 59, 58, -48, -38, 60, 104, -25, -30, -24, 25, 79, -71, -114, -19, 127, 42, -130, -29, 98, 72, -94, -35, 23, 60, 36, 4, -8, 111, 86, -53]
5486e3n7R1J86j67q8O3J21n4j64N1J44j7j0o6m7J80o5j40j9J28J34j85j48K01
5510A9J33o8k19R7J05Qo9q9J23P6p8j41J5J80K6j90j16K56J01j95j54J91J36j44
5534Cj32L7J95K5j35o5R0J10n2j71JJ74L4k08n3K34P2j93r9J38R5n9j27k1J09
5559BQ9o5j25M2J78o8j77K8K39n1j41n8J68P6j76k1K7J26J2j08j06J20R1q7j73
5584a58J20J88n5j40l7J40l0k7o9P1P3m6o9l7M8R6m8j43J27L8k7j05P7J17n5j14
5610f5PL5M8K7o1l9K0J08k2j20L3J37l6j71L4J41l8p0K5J1M3j7l1k4NJ64q9j39
5638h4nJ73j4j70J1J29J8m9j09O8P1j4n4l7K9J45j02j49N9K13o1j45j6J59J6o8
5664A4o6O0M1l4j12M8R7O8q1j43J18J97k20j28R2J49J4j86l4J62pm1j41N2J48
$$ y = [-53, -110, -19, 167, 0, -88, -25, 96, 42, -122, -71, 73, 56, 46, -20, -67, 113, 48, -92, -111, 17, 151, -34, -182, 19, 152, 84, -135, -38, 67, 75, 6, -83, 40, 116, 38, -103, -88, 92, 118, -72, -188, 68, 169, -26, -180, 11, 147, 3, -129, -92, 103, 128, -7, -72, 18, 128, 76, -95, -94, 80, 114, -94, -147, 87, 159, -34, -133, 5, 100, 41, -86, -107, 2, 91, 26, -99, -57, 121, 53, -124, -96, 143, 92, -49, -107, 61, 137, -39, -60, -33, 93, 105, -3, -109, 11, 102, 15, -158, -38, 150, 95, -45, -82, 58, 28, 1, -68, 3, 76, 30, -39, -76, -28, 68, 20, -123, 4, 42, 15, -90, -13, 104, 49, -65, -58, -23, 25, 52, -9, -48, -28, 80, 58, -62, -29, 108, 72, -99, -65, 76, 38, -32, -7, 4, 47, 30, -1, -25, -20, 144, 55, -84, -89, 84, 70, -100, -89, 40, 58, 9, -100, -32, 39, 25, -29, -66, -37, 108, 6, -143, -84, 129, 68, -77, -93, 66, 82, 14, -52, 8, 49, 15, -97, -49, 48, 116, 35, -108, 10, 207, -13, -141, -49, 100, 114, -72, -106, 56, 49, 8, -133, -81, 67]
5689F7Lj95L5J45P3j73j48K30J33j24k14J63J02q7n2q3J65Q2j15j60R0J77k2j72
5713h0j2J36L7j51k9Q3J83j35j78R1R9k8m6o5O1R9l5j22k9J76O1k03l5J65N4j64
5739f7QQ7L9q0l2O3M7J2l7p0QR6l1j10K9J30j6j39RO6Q4j10l1M8K0J3op1pO3N7
5770G2j32j5J00K0j07mJ24j9r8J01k3o7Q8%p6K6N8j6l5m0N9P3o9o5L4N0n4l7K
5799e0K6M8M2j45K4J05L1j04o4J54M1j25o9J74p9J2j04M7M9P8j31q2R5J10Oj98
5825a09M9J59k7j35r2J41J73j20r0%J59lj37n1J10Q3j23r7M2K04l3j93J0J77K6
5850A23j38o0Q0J16q9o3o0J33L0r5j10J56R7r8j99J77J71j48j61P3J64o8q0kJ36
5875H5j7Rj81l2J53J16j67j26J33J44j46j06J24J20m6r4l6J35m9p0j0m8J52J2
$$ y = [67, 70, -125, -90, 55, 128, -45, -193, 37, 170, 46, -168, -5, 97, 10, -42, -125, 40, 122, 7, -153, -63, 114, 92, -80, -92, 44, 81, -70, -99, -16, 167, 32, -146, -55, 44, 16, -30, -95, -34, 65, 30, -92, -121, 55, 116, -87, -122, 43, 97, -67, -59, 28, 67, -13, -45, 18, 65, 77, 40, -30, -22, 74, 43, -67, -38, 92, 76, -63, -54, 12, 96, -14, -45, 3, 23, 36, 30, -41, -48, 15, 72, -60, -75, 25, 45, -62, -66, 58, 39, -59, 42, 19, -48, 40, 40, -36, -10, 48, 32, -3, -43, 16, 89, 20, -45, -11, 39, -15, -52, -50, -24, 24, 66, -79, -55, 50, 81, -23, -87, 67, 108, -17, -86, 88, 9, 21, -83, -36, 13, 91, -40, -122, -27, 83, 89, -109, -60, 99, 72, -63, -155, -14, 159, 39, -51, -51, 108, 105, -32, -83, 27, 110, -13, -110, -68, 136, 103, -90, -80, 97, 123, -15, -75, 5, 121, 32, -31, -91, 42, 72, -23, -133, 23, 120, 22, -177, 0, 171, 23, -138, -65, 99, 31, -49, -51, 85, 68, 77, -104, -136, 17, 133, -34, -160, -27, 117, -29, -135, -11, 109, 63, -31, -67, 68, 19, -51, -61, -109, 43, 55]
5899E5j49J7J49K5j07q6J55K1j77K5Q0lRk7jK7K8%q1M6L8Kq5j0P0M6j29Q3K2j6
5929B7q3P4J9o2K8L5l9p9J25j1r3QL9L1k2QpPJ5Pm9o9J15K7r5RK6J06p9j01J24
5960D1M4l4q1Q2m6kj2l6j7J18Op0j00P4J55j98n1J52Q4j02j07O0K9M2k6p9O3O0
5988D9Kj41k8K10L9j84q7J38Q8q7j32J60R0j01j14O6L2P9n6j22Q9J40q6j55M4
6013f7J77j7k02N3J03L3j40m7O7N2K4n9q8J58L9r6j30J10J18n0j83O4J78Jj83
6038h5O0J06j3r6l0L7Q4M4j35l6Q3Q0p5j25J07Q7o6j00J18J8p3l5K5N1L6o9j8
6065b0rK7O2r9l4J42K2j03m9N4P9j05m6Q8j6J1O1p4o3M6J02j01OO7j4mm2L6Q5
6094A09j17J7J%k5mN0o1m8J28n1o2L3O2L6q2rL9k2J5kr8O2J17q3j04N8J47j19
$$ y = [55, -94, -77, 72, 97, -10, -96, 59, 80, -97, -72, 8, 5, 14, -13, -14, 13, 41, 41, -40, 6, 44, 46, -39, -49, 21, 67, -62, 21, 43, 27, -56, 18, 37, -25, 3, 38, -1, -80, 45, 34, -59, -51, -12, 19, -3, 5, -2, 5, 20, 27, -22, -91, 24, 51, -44, -35, -9, 97, 18, -83, 41, 85, 51, -30, 52, 6, 4, -8, -44, -61, 57, 63, -7, -107, -33, 122, -76, -127, 25, 109, 7, -100, -40, -11, 31, 5, -74, -11, 49, 51, -90, -118, 92, 131, -53, -140, -2, 86, -1, -133, 27, 117, 16, -98, -32, 0, 79, 23, -99, -10, 130, 44, -111, -67, 110, 93, -109, -56, 47, 80, -60, -107, -40, 12, 36, -23, -111, 47, 86, -10, -140, -30, 88, 38, -145, -81, 97, 98, -85, -25, 81, 68, -28, -58, -21, 63, 107, -28, -64, 19, 99, 24, -101, 6, 93, 27, -73, 45, 63, -10, -45, -20, 31, 67, -2, -20, -29, -2, 60, -39, -73, 69, 91, -12, -61, -7, 72, -33, -79, 9, -7, 4, 65, -9, -72, -26, 76, -25, -19, 48, 34, 30, -12, 24, 109, -8, 9, 10, 10, -15, -19, 31, -30, -78, 50, -1, -63, -30, 32, 68, -14, -23, 16, -6, 9, 7, -91, -29, 88, 5, -99, -41, 106, -13]
6123a3p0pJ20K4j07LM0N2m0o0M6M6K5r3q0J38P1j40m0J18M9p7j02J11L9j9j27
6150i3O1Q0J0m5j64Q5J14M6j40o8J57M7j39p2J98M7j11j21P0J70j21p8J0P7L8
6175E8rj43N0J30l1j27m6K10L0j67o8J09R7p8q1O7L5m3K8j05J31M4l6j69N0J07
6201D3L1j26L2Q6l6o7k0P3RL7j00QM5P7j04q0J55Rn2r5P4Q6o0r1J6J01o9j3M8
6230A7jm1j0N4o7N1P7q4m5%P6n3p8J07L6q4K9K6m1J4J7j5j6K9KN0o8J5J5l4P1
6261D9j7pm1OJL1q3J20J0j34RP3k0n9J2P4K9q7L6n0Q5k3p1Ol9J53rj20m2J51l
6292D0j52N9J32j8o5m6Q8Nj1n7RM1J8n7r4J20N0j6j77R4J77j20j28N7J61o1j14
6319f5j0O8R1n4l3m0Q2Q6j13j16J03J48j55j53J57Q6o9o1L4P8Kq2nl2J43n6p3
$$ y = [-13, -83, -90, 30, 54, -53, -50, -10, 42, 2, -58, -12, 34, 59, -34, -114, 24, 95, -45, -85, 33, 82, 5, -97, 14, 53, 34, -93, -32, 48, 58, 13, -151, -66, 48, 94, -46, -114, 43, 90, -49, -121, 77, 124, 13, -108, -38, 132, 11, -67, -57, 20, 58, 49, -94, -44, 86, 55, -72, -118, 92, 122, -45, -113, -4, 93, 15, -66, 1, 36, -7, 21, -84, 47, 91, 55, -114, -64, 43, 74, -52, -20, 66, 30, -37, -57, 16, 25, 62, -38, -30, 15, 92, -12, -92, 63, 72, 20, -75, -1, 85, 25, -66, -50, 51, -18, -31, 17, 16, -25, -35, 19, -48, 3, 80, -4, -49, -49, 27, -26, -104, 3, 39, -45, -16, 10, -31, -17, 0, -15, -31, -2, 0, 50, -18, -3, 12, -22, 49, 32, 25, -16, -10, -9, 22, -61, 59, 69, -65, -56, 17, -3, -62, -50, 24, 53, -34, 2, -48, 37, 14, -57, -51, -90, 63, 54, -66, -108, 43, 40, -112, -53, 79, 61, -4, -50, 38, 43, 32, -25, -16, 25, 43, -14, -108, 12, 62, 46, -131, -37, 140, 20, -108, -51, 110, 49, -65, -75, -7, 84, 30, -3, -43, 39, 125, 12, -104, -1, 147, -8, -161, -4, 82, 13, -48, -14, 64, 66, -16, -21, -53, 90, 34, -39]
6346c9o7K27J0j77n4J34L9q4j02J52K5n2k6n1O6l1M9n2rO7K0j38J1J65K4j55m3
6373i1J27O4j37%J01jl1m3L4o1J14j03K3m3J10l1j34J10O9o4q0J24J9o9r2M4M8
6400Gk0OM4q8k1J51r1n3J4J21j17J7O7J2q1%P6or9Q5M9j19qJ5L7k1K6oLj1J7l8
6432c2L4L4L1p7Pj3N8m7n8M8J11j12l4J05l1l7K9j8lM6j1j01O0Q6l5j38K3J09
6460C4N1j11n6J10N4j29m0R2J0R2j04q9Q0R4p9q0K3J48k9j75O6J35j7j04j15K65
6486A26m8j21j4K0O3j0l7n6O0J26j09r9R6J51j16q9MJ10m1q8M8M4O0o3l0OK9N6
6514G8j43K7J20Q1j81q9J26O1r1m3N9M0k3m8K2kL0k8p1rP8K2m3l7J32K7q8q5M1
6543c7P6m1J6J3Kk9j5J7NK6rp2k5J23rj7J1L2m4n6l5J12lo5K8j2K3j5l1Q4j02
$$ y = [-39, -106, 121, 131, -46, -100, 34, 73, -11, -113, 39, 64, 12, -14, -65, 1, -30, 19, -33, -42, 25, 45, -93, -82, 83, 107, -48, -91, 36, 100, -37, -37, 64, 63, 32, -11, 23, -38, 76, -27, -4, -47, 63, 32, -102, 8, 77, 13, -67, 57, 76, 7, -85, -41, 7, -13, -7, 37, -51, -72, 79, -12, -65, -51, 70, -47, -30, 37, 49, -32, -32, 44, 38, -61, 24, 73, -46, -54, -39, -2, -23, 3, -3, 0, -11, 6, -32, 2, 36, 67, -10, -3, -16, 42, -5, -63, -15, 96, -16, -50, 55, 24, -13, 16, -2, -5, 41, 30, -71, -11, 75, 40, -98, -75, 34, 85, -26, -82, 28, 82, -47, -87, 5, 15, 107, 3, -86, -6, 88, 9, -71, -48, 100, 71, -104, -38, 97, 80, -24, -139, 126, 78, -43, -57, -37, 26, 16, -21, -77, -17, 109, 0, -99, -3, 148, 32, -57, -53, 57, 16, -72, -24, 20, 80, 17, -13, -7, 22, 78, -65, -38, 82, 163, -18, -107, 19, 80, -11, -54, 5, 45, 22, -26, -4, -6, 24, -4, -75, -84, -6, 16, -27, -64, 68, 95, 7, -78, -37, 39, -2, 14, 27, 29, 0, -15, 2, 7, 33, 24, -48, -73, 50, 41, 24, 35, 67, 23, -33, -68, 44, 41, -24, 4, -8, 15, 0, -31, 53, -49]
6574d9J11p7k9K7k0%OM6Jq6L5R1j02m9P3N5Qm0k6P7n6m8Q9l5K3j0Ko1N7Q9q9j10
6606i7J65n8m4K2M6K3n1n1R0J2k9m0J6l8M9l2l6j2Q8K3j32L7K0J13r6m5J19K7
6634H9o4j03L3M1N0rr6P2M3j2r7j7K06j03r2QJ69r1r5L1l4J44q5j6K3mK4oo7J6
6664d2J16m5j37J22O0k4r7k2J24J7n1o6J01oL5j00j4L1O7q2m6J15M7j04k6L0P9
6691H2%j66K2J42o2n6N8m8M0m5k6O5L2m1j5l3P9ln1n6R1L1p1k5O5m8L9l5M4j8
6721ikN7r3P1J1Knk2M7k3j00R1lm6LP3Pq0k0N0J8l7k2J2l0O0L8o5N2j5k2l5j2
6754d9J00l8p4K8M5K6p6N0N2n7j3pk6K3Qm3J9O7N2n8j47J93Qo3q8O0R6n5r9N0
6784a6Q2j44P0o3L9P8%q5n1Q3M5o4o1J19P0r9n5P0K4p6ok3P9K9l4j08N1J14m6
$$ y = [-49, 62, -15, -44, -17, -37, -37, -31, 15, 16, -70, -35, 56, -46, -95, -22, 33, 41, 1, -25, 52, -4, -52, 37, 2, 25, 15, 17, -44, 13, 102, 13, -97, 68, 10, -34, -12, 34, 57, 6, -45, 45, 57, 28, -12, 4, -34, 15, -17, -53, -65, 23, 46, -86, -49, -29, 84, -12, -57, 62, 89, 25, -78, -45, -4, 46, 37, -59, 13, 56, 44, -53, -70, 136, 33, -59, -51, 118, 27, -68, -37, -71, 73, -12, -28, -5, -9, 15, 9, -58, -42, 74, 29, -108, 14, 74, 50, -47, -69, 55, 72, 21, -45, 56, 50, 85, -15, -29, 2, 69, -13, -59, 56, 103, -1, -27, 3, 82, 82, -84, -62, 80, 18, -38, 20, -28, 12, -33, -59, 6, 38, -3, -18, -51, 28, 25, -26, -82, 9, 40, -31, -56, 9, -39, 0, -35, 9, -9, -11, 46, -47, 24, 35, 37, 32, 10, 57, 34, -66, 25, 22, -24, -21, 52, 59, -21, -41, 9, 27, -10, -32, -20, -50, 10, 48, -17, 35, 20, -2, -37, -49, 51, 13, -61, -33, 12, 38, -38, 12, 64, 7, -6, -13, -39, -16, -8, -51, -32, 35, 87, 29, -118, 75, 83, 20, -68, -8, 88, 33, -66, -16, 66, -78, -8, -71, -32, 46, 46, -39, -90, -7, 38, -26, -87, 32, 102, 3, -52, 18, 42, -34, -40, -63, 16, 45, 11, -97, -46, 68, 22]
6813B2p0N9N3j0j04m5J41Pj09l7N8M8k2l2K2L8O8j22n1M1J07k3j17O9N7l7r8N3
6841c4J17k2o2oj6J2Lj6mP4l4K7n3M8Mq3Lk3R0rm5L8Pk0M1ro7LK1M5n1mJ5L9n4
6876b5O0m0m4j7J00m5l1QO2o1M5OM6j00L9N2l2o9L5J3n1R0j4k1j3q7J39l2o5Q6
6906C4m5n1J13j0N1j28LoN0nj0j4L4J1k6p6M2M2K1n5k0PM3k8l8P1NJ9q6L6L5J7
6938C6nk4J2nj4m5N2R4m3j32Q1%N8n4k6N5m3j5J5l3O3J2o0m7Q4N4q5l0M5K3o6
6969d3j4M5L4O7r9l9L1O1K2j33MM6N2m2k7P6N1q7j03R5L7p0L8l3O6Om5n4KQ0M
7000B8o4J1Q1o3n7n3J84m2p9L7LM3o4j5J08p3oL0n4N3K9m6O2q4O6k7m9L6M3n1
7030a3OL1m6J7nl2N5l2J5J1n8J4O1l5l0M6kJ2j1Poq1Q0L6m9K0J9Kl1J1j4j4j2
$$ y = [22, -48, 11, 64, 54, -50, -95, 46, 53, -56, -93, -35, 13, -9, -41, -19, 19, 87, -35, -86, -45, 62, 39, -78, -9, 48, 11, -87, -34, 83, 61, -1, -7, -23, -11, -8, -24, -28, 46, 12, 39, -14, 34, 38, -45, -42, -65, 25, 16, -29, 9, 16, -4, 37, 28, -39, -36, -15, 30, -21, -25, -10, 29, -25, 35, -5, -49, -66, 34, -11, -42, -34, 28, -33, 12, 18, 64, -36, 3, 55, 23, -46, -11, 2, -49, 41, 27, 6, -7, -94, 45, 13, -52, 34, -11, -62, 51, 41, 92, -36, -33, -39, 11, 6, -4, -18, 16, 27, 1, -75, -33, 9, 30, -25, -45, -38, 5, -23, -61, 10, 15, 34, -52, -16, 19, 36, 31, 7, 19, 14, 0, -45, 7, 101, 58, -74, 7, 7, 65, 11, -15, 40, -3, -18, -3, -36, 27, 39, -21, -68, 16, 70, -15, -45, 0, 23, -43, -57, -12, 22, 89, -10, -49, -18, 43, 65, -68, -64, -18, 34, -8, -35, 41, 92, 5, -98, -3, 34, -36, 2, -31, 35, 41, -4, -58, -56, 24, 28, -36, -25, 56, -7, -64, -117, 67, 25, -54, -17, -14, 29, -35, -50, 58, -15, -21, 9, -45, 8, 37, -9, 53, -31, 35, 8, -41, -5, 38, -13, -7, 24, -22, -5, -10, -42, 13, -19, -4, 7, -51, -37, 24, -11, -41, 5, 3, 15, 4, 11, 5, -76, 4, 40, -9, 11, 30, 32, 1, 12, -2, -16, -28]
7063b8J1pJ3j0Qnj7L8J2j3n1N9J8k6j4j7R2n3l4K2m9J3L0k6%O5n2K1j5M3k0j0
7095bjO6k9p0M2QJ2l0k5L7K1k6n3k3O0M1J1o1NP2o0k3l7J23m2po3Q2k6j2o2K6
7127d6O4Ll5p0O9N7m3k4N9jJ1r9L9L1rp9L4P4M7m1l5n1M5L3o4j5K8O6l8l9L2%
7159Ck1m5O0j1J4M6n9j0OJ4l0j9O9%n2k4O6J2k4j2J4K6k4kQ1q0ln5K7k0J19m6
7191B0m2jL8j5J9n4N4k1mK7k8LN2o5l3K1J0J6j3j0l0P9r0K3J4PL0J2n4oK0N1J7
7224D7r4N7l5K1N0q8N4J8o0L8K6n1M8j9p5R7pl4NM3l1k6J3n5J7L1k9L7lM4l1L0
7256C8n6RO5j12L0M4L2k0o1KO5j7Jn4J5M5o6nN3lOk7j5P3kq7J9P4n6ok6M7K1r3
7290f7M2k3L4L2k8m7R7m1pj1jM3K6r4L6j8Oj8j8O6qL5qo5L2k4M6LK9j7q5K7k0
$$ y = [-28, -17, -24, -11, -21, -13, -18, -35, 3, 15, 2, -49, 10, 28, 2, -12, -29, 63, 10, -24, -2, -51, -38, -8, -34, -34, 31, -21, 0, -15, 28, 8, -2, -3, 63, 34, -36, 6, 14, 26, -4, -29, 8, 29, 3, -50, -73, -13, 28, 39, -22, -17, 55, -5, -28, -65, 58, 16, 9, -54, 28, 2, -10, -72, -46, 18, 21, -14, -84, -15, 42, -1, -25, 34, 33, 44, -55, -16, 15, 6, -73, -39, 35, 82, 41, 6, -45, 0, 33, -31, -46, -18, 48, 10, -29, 3, 3, -18, -63, -3, -14, 0, 46, -13, -23, -17, -3, -33, -52, 17, 17, -35, -59, 7, 19, -5, -17, -3, 23, -1, -3, 78, -2, -5, -60, -33, -53, 66, 20, -22, -23, 15, 0, 19, -35, 19, -2, -6, 21, -7, -4, 48, -17, -50, -29, -19, -3, -16, -26, -56, 23, -67, -44, -30, -23, 7, 19, -35, -41, -21, 30, 47, -47, 10, -25, -4, 46, -42, 12, 30, -30, 8, 34, -17, 31, 12, -63, 34, 27, -7, -2, 41, 10, -16, -3, -58, -41, -10, -39, -2, -5, 39, 8, 38, -18, -9, 56, -56, -26, 18, 50, 30, -31, -29, 36, 19, 20, -34, -19, 26, -40, -45, 8, 5, 11, -16, -31, 42, 40, -47, -28, 46, -10, -16, -42, 5, 26, -67, -25, -48, -14, 18, -10, -57, 40, -1, -8, -19, -20, 23, 49, -45, -9, -27, -21, -39, -57, 9, 1, 36, 28, -37, -5, -29, 17, 20, 49, 32, -53, -26, -46]
7323d6J09m5n6L5K3o1j0Q0k9L0o9M7o1P2j1rJ2k1j0%N1n3KO7q5O2rL7l3j3L0p6
7355d0P9r6J00k9L4o3J2K8J1Lk4L7l8l2J2QLjk0M0p6M1M7p0RrJ5jJ5K8k5J5m2
7388b9J9J4k1j8L1j3j5K5J1J0mL6m2j2l1mP9m4Mn5N5j5L2ql9L0K6j0M7q8K4K9
7420B4qpRJ1o9rK7M6l3j8M8J6k8n0K8K4K5Jm5J2L2n6L9l7M8l9M1l0L5n0Oj9K6
7453@LN0r0M3M5n7k8M1j1j5J9l2M5j9QN3p4mK5n2rO4K7o7O8j8n3M6Noj2k0M0m1
7487b6L9Kk1m7Q8J9n9J0qk2M1j3Lm0PK3L9p9JL9k5L0K4jOj6m1P6rr3Q8k3RLQl1
7523AprM9l7RNj2j0L9m4O2m3K0J9%j2l5L0n5mjJ1NQk8M2n4N3J1L0m7j7jQJ6nr
7560a2J6PM1j05K3N7Ok7l4k8P4j4K8n0N8r7O7j7NnL7n7N7k7l7kM7L0o2OmJ3j6
$$ y = [-46, 63, 18, -38, -3, 20, -41, -51, 29, 0, 30, -39, 8, -53, 19, 8, -1, 11, -10, -20, -20, 31, -22, -20, 47, -38, 24, 15, 52, 19, 6, 36, -40, 39, -57, 43, 14, 48, -15, -3, 25, 36, 39, 15, 52, 14, -18, -6, 2, 5, 4, -16, 24, -52, -11, 36, -34, -25, -34, -19, -20, -5, 23, -2, 13, -29, -10, 4, -17, -35, -4, -17, -32, -7, 4, 14, 10, 46, 4, -8, -39, -43, 36, -8, -4, -59, -4, -19, 13, 5, -34, -4, 22, 12, 59, -29, -5, 24, 16, 9, 18, 29, -40, -49, -22, 24, -9, -27, 21, 37, 9, -41, -13, 11, 36, 37, -8, 4, 36, -20, 19, -18, 30, -9, 32, 2, 37, -13, -7, -26, 0, 3, 53, -37, 6, 51, -6, -34, 7, -4, -19, 0, -32, 13, -6, 2, 55, -19, -23, 2, -50, -59, 5, 32, -35, 33, 15, -38, 8, 13, 7, -5, -25, 15, -26, 13, 15, -6, -53, 35, 54, -5, 5, -3, -25, 16, 3, 6, -34, -27, -4, 35, -44, -43, -4, -29, 1, 25, 24, 30, 14, -27, 49, 40, -53, 35, 12, 21, 24, 32, 1, -6, -15, 34, -3, 6, 11, -1, -11, 28, -16, 46, 3, 23, 42, 42, 30, -5, 25, -30, -34, -35, -24, -19, -11, -39, 3, -51, 2, 13, 43, -4, -21, -22, -14, 2, -3, -12, 4, 11, 52, -53, -30, 27, 33, 6, -28, -56, 18, 4, 32, -18, 40, -57, 10, -7, -2, -7, 30, -27, 30, 3, -34, -36, 11, 41, -21, -15, -19, -6, -22]
7593b2l4N2j5J3Q2r6RK2M9j12Q6l0k0j8J4PO0j4n8J6qJ6kK9k2Mj3l3N1Rl6j2L8
7626A2j4K9l1k3M0j7m3M1J0K3l4J3l0L8m6J1m4JQ8l6p2P7Ml7P6k7KJ7mj8k0K5
7658A1jl1L3k5n%l9J8L5Q5m1n1K0mLl0L9J2l2jk8M2J5m2M7j6Nk1M4j5k1Ll2K7
7692DprN0j3J8oj4N2p9j6L3k6O7n5J8J8n2m1oN3k7J5k5P1l3M3k5k8N1Rpn9l9N2
7726a3LK5j6k6P1n8M8k4rJ4J2l1m0MP0l2J1k5RM9J6j10P5o3M2L5Pn8mM2m1Rpk0
7760c5j7R2j06N5k5M5jO9p7L6m7J5j6L4Lk4J6Mo6L5J2pK7L0p2KQL1Mn4J0L5k2
7793fm9L1L8m0PM2o4N2J6n6M6J1l0qk5M8mm1MJN3l2Lj0J3n2J1RL9OJ1mm2N6k7
7828GM4r9N3N8r4K6k4L3J5n7L1L1n0j7L7L2n9L9j5pK2k8n8Q3JL9k0m8K2Jn3N1
$$ y = [-22, -56, -4, -19, -6, 76, -20, -11, 11, 60, -52, 34, 4, -16, -34, -20, -13, 47, 33, -25, -9, -17, -1, -3, 26, 4, 8, -5, -38, 13, 22, -14, -26, 12, -2, 27, -4, -27, 13, -4, -47, -6, 4, 27, -7, 6, -24, 14, -32, -21, -65, -64, 24, -12, -84, -7, -3, -40, 36, 9, 11, 28, 24, 6, -14, 11, 10, -21, 12, -13, -18, -18, -57, -39, -4, 81, 40, -11, 9, 5, 8, -22, 17, 29, -3, -4, -32, 10, 25, -17, 30, 14, 19, -2, 42, 27, 6, 9, -23, 4, -3, -12, 38, 25, 43, 37, 23, 75, -4, -20, 13, -13, 54, -1, 17, 35, -17, -58, -64, -11, -38, -23, -48, 23, -10, 33, 8, -20, 31, 40, 33, -26, -65, -13, -10, 15, -1, -27, 44, -14, 34, 10, 1, 15, 27, -4, -44, -40, 30, -2, 9, -16, -7, 42, 58, -52, 23, -40, 2, 37, 44, -14, -18, 24, -17, -8, -15, -35, -52, 40, -66, -11, -36, 9, 8, 77, 0, 36, -11, 4, -12, 22, 25, 1, 17, 21, -45, -10, 2, -5, 22, 52, -20, -18, -10, 21, 25, -29, -19, 16, -6, -55, -24, 14, -26, -19, 23, -41, 11, 27, -29, 17, 28, -2, -10, -35, 13, 9, -32, -28, -27, 26, -6, -3, -13, 0, -52, -41, -32, 7, 13, 24, 20, -22, 34, 7, 51, -48, 5, 63, -31, -5, -29, 4, 19, -38, -7, 24, -26, -43, -6, 26, -33, 6, -9, -16, 6, -22, -80, 3, 4, 43, 23, -25, -3, -2, -55, -4]
7860dj0K4J2l0RL2J0n5M3o8N9k3J6m7K5L0m6J1K0j0Plko0P0mk6L9n3L4l8L3QJ
7894DQj9pk3J0L5j9K5k1O8j0j05R3kk3M7l2J5m4j4J8k4lJ7orj3M5j0k0k1K6K9
7927A5l1k3J7J2rJ3Jj6K5j4J3k9J1J5n8O8OL5n4J9k4J2KJ9jk0k2P1j00N8k5rJ3
7960a0J9N7o2l2oK5oJ6m1Q1m3k8k6N6KKk6J5nRp8M0R1o8j4L7KK5o2ML7L0l2LJ4
7995B6k9K2l2j2%O5l7k2k1R5o7k8O3Npn9M2J1l9K0n0N3l2J01j04k4J21m7l0m7
8025f3J00jp7L0M1J8lo6J7k3N1J9j30J10K1o7J2PJ2pok2L2j5L1k6Lo%%N7jo7J6
8059cpk3L5k0k6K7k7L6J7Ok8N4o8m6N3O8o4O7p0J7J9rm0O3J4p0OM7l0Mjk4J8l5
8093d0m7Q9j7M2n5j0L0L8o8j7M4O7q0K3j7j2J6L8m8P1l2n1PO4j0j9m9M6J7j1N
$$ y = [-4, -14, 10, 22, -8, 1, 33, 43, -12, 31, -37, 22, -1, 15, -32, -7, 23, -23, -12, 8, -2, 5, 2, 0, -60, 10, 6, -20, 19, -34, 0, -38, -5, 3, 4, 12, -7, -14, -37, -27, 8, -11, 14, -7, 61, 51, -54, 39, 37, 14, 61, 29, 44, 0, -14, 4, -20, -23, -6, -12, -21, -34, 11, 1, -19, -40, -14, 15, -16, -39, -22, -10, -19, -6, -5, -21, 4, -10, 3, -26, -15, 0, -58, 10, 16, 51, -3, 16, -8, 4, 6, 25, 24, 4, -18, 53, -47, 11, -14, -23, -10, 9, 66, 4, -28, -34, -9, -15, 1, -40, 41, -2, -30, -56, 0, 2, 4, -22, -7, -12, -3, -81, -41, 50, -18, -32, 5, 7, 32, -30, -26, 11, 41, 9, 12, 26, -3, 19, -13, -25, -25, 40, 3, -19, -40, 55, -12, -40, 23, 28, 21, -38, 4, 15, -24, -4, -54, -1, -33, 68, -36, -60, 61, 14, -16, -63, 37, 36, -41, -11, 30, 48, 45, -21, -4, -27, 24, 43, -87, 23, 44, -23, -11, -4, 8, 1, -5, -27, 5, -10, 21, -5, -2, -8, -8, -8, 49, 48, -19, -3, -10, -33, 2, -18, -44, -17, -44, -8, 9, 15, -13, 41, -27, -73, -20, 48, -16, 51, -19, -2, 17, 8, -32, 31, 45, -25, -19, 28, -2, 2, 1, -23, -5, -40, -87, 2, -15, 27, -28, -38, -8, 30, -38, -55, -11, 56, -24, -1, -18, -30, -14, 24, -24, 47, 15, -36, -29, 35, 25, 6, -43, 3, 20, 9, 14]
8124A4m4PL3k1m7O5j4m1L2M5J9r4N9ko4O0l4m6K1J1L6j7K7L9ko6q3J34K7n3k1
8155b0K7O5j05j9K1J5M7l5L5q1N1K3m1k4L9j0L9rM9r9j9K6NJl2L8N0K9j07M3n0
8186d8P3j2n0j6L9
$$ y = [14, -30, -23, 10, -11, -58, 7, -7, -48, -16, 29, 48, -46, 13, 11, -53, 7, -27, -73, -52, -41, -5, -22, 5, 44, 42, -24, -107, 27, 54, 1, -20, 7, 72, -33, -52, -31, -16, 31, -4, 31, -50, 1, 24, -17, -41, -2, -12, 27, 18, 67, -32, -51, -25, -20, -19, -51, -13, 37, 66, -41, 2, -48, 25, 13, -37, -53, -14]
8191a4
$$ Imaginary data points
##PAGE= N=2
##DATA TABLE= (X++(I..I)), XYDATA
0@%%%%%%%%%%%%%%%%%%%%mPlMj0J0pPj0J0qRj1QoRj0QoOl%kKNpNqJ2j5J5j5J6
53Hj4J0lqK7n8J04j74K81m46P16j181K024l713P696k0349J24150N88616n99596
72I8090p47672N18934O37094l35217n02509J32541L21925R8644j38919l18600
82b35689m2039N19182J94357o70248l13788P64058L87183p83796m17008P31912
92A34124M01857o09101l52194M32391K75117k18088j85752j0340R4413K31636
102A94063j4307m24399m8138N71745Q6685o60510j02173O83870R6638o40273p5946
113c32745N36435M6577l84586j5411K03323r951j2596K4400j65923k3693L14407
124A80237O391m18179K5785M69362o8376m66130J14046M12073j55831l17180J85552
$$ y = [0, 0, 0, 0, 0, 0, 0, 0, 0, 0, 0, 0, 0, 0, 0, 0, 0, 0, 0, 0, 0, -4, 3, 0, 4, -6, 4, -3, 4, -6, 4, -4, 5, -6, 2, -4, 5, -5, 3, -3, 3, 0, 0, -2, 0, 5, -2, 3, -5, 7, -8, 7, -8, 8, -6, 4, 1, -7, 20, -38, 66, -108, 173, -273, 443, -738, 1286, -2427, 5269, -15080, 109070, 697686, 98090, -649582, -130648, 506446, 171229, -331280, -198739, 123186, 221830, 82911, -235689, -277728, 241454, 435811, -234437, -548225, 215833, 603016, -180780, -597788, 134124, 535981, -73120, -425314, 7077, 282194, 64106, -121646, -131986, -37573, 194063, 179756, -244643, -292781, 278964, 365649, -294861, -397034, 286836, 383474, -256799, -332745, 203690, 250267, -134319, -149730, 53593, 43642, 31046, 55446, -110477, -134170, 180237, 186628, -231551, -205766, 263596, 195220, -270910, -156864, 255209, 99378, -217802, -32250]
135c2250J94954j98294o1936J90067o5518j60504J71407J11717k43671m7213K75287
146A34046k6583k64304J03028K14786j73427j34941K30949L7567k68976O3769
156h4086K83249j54761k72620K22813K38296k58347j84226K55151J15286k12916
166e2161l8602J35134l9077l1102J10655q6828j70090K03361K12662l03230k35286
177b94564L73347K37797m02989k21557L87515J90290l26266j48238K24946J00926
187A21207r3325n2963n5103Q266K03966L0286l37413o1435M40323Q3996n01201
198b13396r9447N12492J08763m72738j13790L85234J16453k58618j17929J05356
208d7620J19093N9766j18929k20131J17080L60110j11112m65626R9474N26561
$$ y = [-32250, 162704, -35590, -97526, 92541, 27023, -133481, 37926, 149643, -94028, -141241, 134046, 107463, -156841, -53813, 160973, -12454, -147395, 83554, 121121, -147855, -84086, 199163, 44402, -228218, -5405, 232891, -25456, -209682, 45469, 160755, -52161, -90763, 44371, 5294, -25808, 84847, -1981, -172071, 31290, 243952, -59278, -294564, 78783, 316580, -86409, -307966, 79549, 269839, -56427, -204665, 20281, 121207, 27882, -25081, -80184, -71918, 132048, 162334, -175079, -236514, 203809, 287805, -213396, -312843, 199649, 308412, -164326, -278116, 107118, 223571, -35047, -152976, -47620, 71473, 131239, 12310, -207821, -90741, 269369, 158257, -307369, -207895, 318666]
218C18666q0262n36709N2286M95516j5842m08073k8104K83328P6993j34877j27851
229a04929k1988J75454J71257k15487k98521K42748L91938k52806m43376K42645
239a13065M49993k10898m13015J58844L39097q9220k37533P744J20813P8672j743
250H9689j62123j07312K34686J95836k88961k56939L18794K86302l20902k84178
260b95108K93964K53453k40054k00489J63811J32777p2415n9308k5281j0684J20041
271F0707O9587k02506j10990K64884J31749l01024j30711L08178J10499k86042
281h5669p5583K37594L2103j68404J2429Q6125n1197k00P7962q0763q8990J48072
293D3479Q1899j95016n7980K17582K0515k14787K5491J88362p3006j42875J15690
$$ y = [318666, 238404, -298305, -246019, 249497, 233655, -174418, -202522, 80806, 157799, 22922, -104929, -126917, 48537, 219794, 4307, -294214, -51466, 340472, 87666, -355710, -113065, 336928, 126030, -286985, -128141, 210956, 121736, -115797, -108053, 12760, 91432, 89689, -72434, -179746, 54940, 250776, -38185, -295124, 23670, 309972, -10930, -295108, -1144, 252309, 12255, -188234, -24423, 108354, 35939, -23369, -48650, -59334, 60707, 130294, -72212, -183202, 81682, 213431, -87593, -218304, 89874, 200373, -85669, -161252, 76342, 108445, -59959, -47530, 38595, -12602, -12802, 65160, -15603, -104593, 43479, 125378, -69638, -127618, 89964, 110479, -104308, -78817, 109545, 36539, -106336, 9354]
304I354Q5326j46955k3253J62402l5000j59050Q2548J36448j13335r6556J24112
315B6041M3073j14621J8357Q6648q1493m5069J39441m139j86295N3170K16651
326A51764r5018k27114J23161K16191j32666j84729J21750J35583r0161p3281
336e4520M1318M568J9605O4270q5165j26371J47189J75961j97533k08441K28591
347I472K21568k35810k14958K16026J90095j70233j50742J01784J01245j7414
357E1033m7108p4320o648J63723N5512k40709r5732K96565J25423l24421j43264
368b39946L20858J49483k84708j45102K19218J31839j30190j12181K6526Q8249
378B4046Q1740o2760j83530L7012K68538j3147l28199q436L56341K7058l50233
$$ y = [9354, 94680, -52275, -75528, 86874, 51874, -107176, -24628, 111820, -1515, -98071, 26041, 69114, -45507, -27150, 59498, -21995, -67064, 72377, 68238, -118057, -64887, 151764, 56746, -170368, -47207, 168984, 36318, -148411, -26661, 108922, 18761, -54520, -13202, -8634, 10971, 75241, -9924, -136295, 10894, 186855, -10678, -219119, 9472, 231040, -4770, -219728, -3702, 186393, 16160, -134582, -32798, 68447, 51033, 3925, -70395, -77043, 86680, 142192, -98517, -194249, 102316, 227739, -96682, -239946, 80912, 230395, -54313, -199415, 19803, 151642, 21452, -90729, -64203, 24046, 105786, 43026, -140504, -103492, 165046, 151899, -176300, -184736, 171605, 198663, -151570]
389a51570m2972L10419N6428k41335o7442J50094P6992m6247q4662n9568R0781
400i082J56895r4634k35578R5140K88897r1426l12118Q2199L03932o6666k66768
411a49209M4639K05377j6784j27608j5603M1807M9984M2472q3728j16641J13429
422a1865J73640j35816k08526J48301K19228j48717k06065J36692J72324j12400
432B6796j23003P7914O4967l5871n470r702m8566N4692R0751r5050j16997J26749
444G210J24689j46958j14312J53619Q8225j46760n0811J26821P896r6077L4288
455a2170N8120o9764j6627R3509k3766j01988N9303R4220q6178p0736J02141L4696
467F0760j05847R015R8040n5024q0316R6853N5714j29277k8126J47475J259j48874
$$ y = [-151570, -194542, 115877, 172305, -69030, -136472, 13622, 90614, 44367, -40295, -99863, -9082, 147813, 53179, -182399, -87259, 201638, 110212, -201906, -119707, 184225, 117559, -149209, -104570, 100807, 84023, -43585, -59188, -17381, 32603, 75075, -8653, -125294, -11865, 161775, 25959, -182567, -34266, 184962, 36245, -169820, -33128, 139196, 26796, -96207, -18293, 46674, 10803, 5333, -4369, -52935, 1757, 92508, -2542, -119539, 7210, 131899, -15059, -129371, 24248, 112473, -34287, -85098, 41723, 49619, -46458, -12170, 45950, -23814, -40441, 53068, 29302, -72686, -13383, 80837, -5341, -76077, 26064, 60760, -45087, -36072, 61968, 6944, -73372, 23481, 79195, -50082, -78208, 69267, 70526, -78348]
479g8348K0983J32439l6133r9513M2216N3324l8998J511K7411n8743r795J12798
491F9152j0802j57098L0765J87267m6628j99271N5312J91657n4586j64973M3664
502e5541J21514k2982o5807n756L359L9093N9245p3287j16072J03650J61378j25954
514B2840j91003J36376K02532j32454j95017J13052J70234p8752j30944L2487
524e0649Q1613K1804k7382p8374k6384J31313P4769j74388j14057K02464J41036
535A81765k11792j54344K00346J53766j68795j40575J19262J16906n6445q6142
545d6048j3440N1483Q3547j6570j46560j5455J96369M2295k27751o1853K37619
556H3636P3470k24670p7225J90500P4248j38181o6499P3322N5652k389m3938o7589
$$ y = [-78348, -57365, 75074, 38941, -60572, -18356, 34968, -4030, -2519, 24892, -33851, -43646, 69152, 58350, -98748, -67983, 119284, 72656, -126615, -71303, 120354, 65768, -99205, -55541, 65973, 42991, -22816, -28572, -25213, 13880, 73125, -162, -116234, -12584, 148794, 22840, -168163, -31787, 170745, 38291, -156726, -43674, 126560, 47808, -83136, -50649, 30964, 52768, 25386, -52988, -79372, 51941, 126710, -47678, -161735, 40729, 181765, -30027, -184371, 15975, 169741, 946, -139629, -20367, 96539, 40094, -46048, -59488, -8005, 75542, 58972, -87588, -103043, 93326, 135621, -92130, -153983, 83636, 157106, -67564, -144789, 45711, 119959, -18222, -84721, -11399, 44253, 41864, -2074, -69663]
568f9663L2787J29340k3530j77233J6573K06377j1646k14756Q213K01932n388
579I3006j69659J892J22110L325o4637j0559M095J9871N3488l0537j01829M1608
591c7826J36339n1820j53942N9629J53898o3972j37264O3656J06621n8332o6558
602d9571M7681K2223l2434K0630J3466n7156P599Q3152k8801r5953M8391R4731
614G3958o4392q0003P5288N4590p9810k1944P7649j3169o8596M5687N4001p1433
626a8174l5061Q6303J3879q8417P132P7128k6013n3990M0823K1332n0364J6504
638h918N4393n5057n2875Q9261M6822j14569l7505J27550K6803j25840j6322J09549
650D3292P542p9698j431L9462j551P017J492n4775P41R8686m461j33821P981J56291
$$ y = [-69663, -36876, 92464, 68934, -108299, -91726, 114651, 103005, -111751, -103538, 98394, 93006, -76653, -74761, 47349, 50674, -13963, -24522, -20427, -556, 52932, 22395, -79434, -37826, 98513, 46693, -107249, -47620, 106278, 42306, -94958, -31302, 75319, 16987, -49571, -1890, 20333, -12101, 8529, 21995, -35161, -27562, 55590, 26789, -69164, -20773, 73958, 9566, -70437, 4851, 59441, -20369, -42313, 35336, 22167, -46429, -742, 53259, -18174, -53235, 33068, 46947, -41470, -34338, 42790, 16777, -37213, 3610, 24942, -25422, -8918, 45475, -9582, -62457, 26804, 73626, -40943, -78448, 49102, 75905, -49935, -66257, 43292, 50834, -28864, -30295, 9167, 7616, 14633, 16125, -38650, -37909, 60777, 56316, -77505, -69524, 86767]
664H6767j0432j63453J0204J54105o469j29287r73R1091J2093m3387k6000q705
676c4446M1126O0332n5400j06104O6924J41782p3460j63579P3291J69638o5223
687E4881j59749M9024J35032k5413r8515l954N3992L6009o045o7815m0599R5623
699B2471Q1408j16345j12834J27252J32215j26409j38311J13553J31323q9111
709B5212j12718N5189Q5459j4893n2389k7909J7527O9133J5516j04716m3839J31104
721D2676O4838j45514p7459J46511Q0779j33662p6055J08296O4413p2670m8407
732d6254L0317L0284J4648j2459n7614k922R4565J4434j21511k1236J36180K3280
744H1712j36965k1145J24372J5859r9851q980O6292K163k7817L142j1331o197
$$ y = [86767, 76335, -87118, -76914, 77191, 70722, -58565, -59538, 31553, 43646, 259, -25741, -34446, 6680, 67012, 11612, -94492, -27568, 114214, 40754, -122825, -49534, 120104, 54881, -104868, -55844, 79188, 53775, -44740, -48694, 5298, 41307, 35262, -32553, -73152, 22471, 103879, -12466, -125300, 1952, 134167, 7758, -130553, -17000, 114323, 25212, -87506, -32317, 53142, 38249, -14140, -42049, -24522, 44611, 60127, -44589, -88428, 42676, 107514, -38000, -115459, 31052, 111831, -21831, -97886, 10410, 74823, 2153, -46254, -15937, 14347, 28995, 16536, -41078, -44000, 50565, 64999, -56512, -77748, 58432, 81712, -55253, -76398, 47974, 63833, -36018, -44998, 21294, 23457, -4360, -1218, -12549, -18746]
756a8746M6901O086p5525k688R3967l469j00973J1551R6372k0358q1294K8669
768a9507N8046l4689k9984L7780N99l6662K6350L1563m7942k2198O1564R465o5840
781c1455N276O0591k0824m6756L5274K6291m7209k143N5172k2528n8353M4018
793b646N6297n9549m9212O6671L7963o4236k3424N2358P333l1948Q879N687k3635
806a9462K3362L5834n1537m4574P5408M9180r1542m9791R7740M6625r2832m0596
818f2185P6914L2136n1478k2583J8956J2715J7059l266n2964m973Q4705J1910
830E6946j08747j7231J22576K1032j24087k3756J13232K5814r0728k7311N8663
841F403K8729k0299l0011k0805L1057O0302l1547r4167L0712J18926k8221j32246
$$ y = [-18746, 28155, 34241, -41284, -43972, 49995, 46526, -54447, -42896, 53476, 33118, -48176, -19507, 38539, 3850, -26134, 11646, 12245, -24417, 1933, 33496, -14446, -36644, 24920, 34385, -31455, -26179, 34412, 13588, -33168, 2106, 28397, -18812, -20955, 34217, 11689, -46664, -2646, 53651, -5898, -55110, 11561, 49524, -14712, -38136, 14222, 21555, -10393, -1514, 4173, -19462, 3900, 39734, -11803, -56377, 19031, 68211, -23331, -73122, 24618, 71243, -21589, -62185, 14729, 46865, -4613, -27196, -8240, 4475, 21534, 18268, -34696, -39669, 45036, 56946, -51801, -69032, 53544, 74576, -49511, -73267, 39965, 65779, -24949, -52260, 6403, 35132, 14833, -15178, -35983, -4926, 55376, 23829, -70338, -39626, 79300, 51079, -81167]
853h1167K3392J32495j5739j20192N580R6461O813o3873k0641K6098L4717J3160
865C7104m7508m9740N7778Q0101o3901j01468O5096J12043o0661j11347N0623
876c1880R9892l5629p9505J6435N2878M978k2964k6993p139M7662L4009o4689
888a2945n5397P6504O9431q1767p5215P9868P2845p0519o3111N4640M7800l3495
900H639k8989R217R197J5933R260l9527k4248N8979L4301p2661l8506P8912L6782
913E7289p7403l0083O8239J9635n2808p078L2735n481j0381J6186j1601k3566
925b4317L1160K6694m6030k5016N4993J8964n7273r138N2922k889m2950J5531
937g349K8807k7105j2481L5987m163m0955J8693M1193k9721l6438L5707K7042
$$ y = [-81167, -57775, 74720, 58981, -61211, -55631, 40830, 47643, -16230, -36871, -10773, 23944, 37104, -10404, -60144, -2366, 77735, 13834, -87634, -22538, 89505, 28844, -82503, -31880, 68012, 32383, -47122, -30687, 22191, 27169, 4205, -22788, -29927, 17735, 51744, -12945, -68342, 8162, 77593, -4174, -79389, 479, 73324, 2805, -60306, -5666, 42134, 8639, -20350, -11133, -1936, 13997, 23257, -16270, -40518, 18461, 52762, -19899, -58405, 20507, 57289, -20114, -50197, 18042, 37677, -15131, -22209, 10526, 5045, -5336, 10850, -751, -24317, 6843, 33537, -12493, -37509, 17484, 36448, -20825, -29963, 22959, 20070, -22880, -7349, 21458, -5647, -18128, 17859, 13696, -27259, -8566, 32627, 2906, -33532, 2175, 29217]
949B9217l6145j3851L0929j622k1020J7874P805l3058P168M5429k1413n3639L3219
962i107N6726m0401n4321M1996M6599l7403l4466K6913J8929j1662j799o661j5299
975a9956K5724L0758m3484m3013N7195N1096o5083n4480O5789N3271n9065m7541
987d8789M5275L8185k5461k6259J901J2963K3242N17m7292j2892O7529K3361q1685
1000b9405l1291Q7993L6287q5814l8250P4764L7558n6010l4603L1124K9740k601
1012A9492k3759k6620J7145N3833j0528p5898M240R0637J667r6374o921R2722
1024C9636J1434p9809j5484N9415J8884l3489k1706M820K3918K3459k5418m8775
1036d3115K5984O8314k5423q0502K3290Q4357j9575p9845J4176O7729p214m9591
$$ y = [29217, -6928, -20779, 10150, 8528, -12492, 5382, 13187, -19871, -12703, 32726, 11313, -42326, -9107, 47619, 7218, -47103, -5107, 41492, 4089, -30377, -3464, 15465, 3803, 2004, -4657, -19956, 5768, 36526, -6958, -49971, 7224, 58320, -6763, -61243, 4546, 57817, -1248, -48789, -3514, 34671, 9210, -17049, -15148, -2185, 21057, 21574, -25718, -38610, 28919, 52280, -29405, -60696, 27297, 63584, -22230, -60480, 14284, 51842, -4168, -38771, -7647, 22093, 19492, -4267, -30887, -13742, 40091, 29563, -46335, -42095, 48542, 50209, -46165, -53086, 39636, 51070, -28739, -44223, 15192, 34076, 587, -21119, -16299, 7619, 31078, 5660, -43115, -17131, 51183, 25760, -54742, -31452, 52905, 33330, -46515, -32339, 35390, 28176, -21415]
1048b1415q43K7624R630m123j8312j8421K6396L7678l2832n1703L7025N9475l8383
1061A1796o0533L6594N4927l1567m3924K3666K8879j3683j1760K167n266R521
1073H17K0198k0387l1393K9480L7550l5705l8283L8631L3776l7711k4874L3354
1085E453J3096k6050N6J6580j2554o120K2903m396k9606J3695L1836k0902k9434
1098b5443K5175K2614k6362j2378K4390qj9780J3003J3281k4942n839L4387j517
1111A6581m0124Q031M1217j2375l7539J4469K9221j3744j7108J0228K747m797
1123c193J2680j999k7355Q953L9656j5304m8044J9593N1695k1322n0161J9904
1135a4897M3382j5206l2265P703J7827K000j643j2667j4509K3100K9248l1742
$$ y = [-21415, -22258, 5366, 14996, 10873, -7439, -25860, 536, 38214, 5382, -46321, -9296, 50179, 11796, -48737, -12143, 42784, 11217, -32707, -9041, 19838, 6155, -5605, -3438, -8704, 817, 21015, 628, -30765, -1285, 36265, 560, -37723, 908, 34684, -3027, -27901, 5453, 18549, -7501, -7445, 9135, -3419, -9539, 13364, 8968, -20638, -6943, 24893, 3991, -25443, -268, 22346, -4016, -16394, 7996, 7988, -11792, 1211, 14492, -10450, -16289, 18098, 16581, -23543, -15512, 25705, 13330, -24209, -9740, 19481, 5737, -11371, -1143, 1604, -3193, 9487, 7488, -19867, -10914, 28742, 13438, -34606, -15013, 36682, 15360, -34801, -14897, 28485, 13279, -18986, -11283, 6544, 8544, 6901, -5766, -20275, 2825, 32073, 331]
1147C31m1058L7559M8894l9542n2080L7323N0328l0643m4189K0062L4278o598
1159A4665k1718q683P700K4074O298l7887j9261M8625K9793n4919l7310N6026
1171G403M1282n1722m1164M1979L7676k7749l1071J0390K2435Q383j2560k6677
1183b1395K608M2604O511n4593j4088O1261J9488o1875k2697N6525K3472m5665
1195g844k2319L0396J9508j2231j5822o710J1645K4673p502l9884L859N0856q23
1208B7802n6408j581N6419L262n0723m502M0294N435k6336o123J0277O778O056
1221A0650p603k0911Q250L2893r002m0765R634M3772r889m1907R737L5531q996
1234A1394k5629P720J3343n634m05L063j1746J86K1722l707k8307P137L0839j0180
$$ y = [331, -40727, -3168, 45726, 6184, -45896, -8573, 41755, 11112, -33077, -13015, 21263, 14665, -7053, -15736, -8036, 16038, 22336, -15551, -34812, 13813, 43606, -11313, -48623, 7403, 48685, -3037, -44201, -2222, 35454, 7705, -23366, -12976, 9459, 17842, 5282, -21395, -18787, 23817, 30328, -24265, -38353, 22908, 42396, -19479, -42176, 14349, 37821, -7844, -30163, 233, 19741, 7510, -8312, -15022, -3377, 21296, 13794, -26090, -22231, 28625, 27802, -28606, -30187, 26232, 29494, -21229, -25731, 14563, 19998, -6338, -12461, -2184, 4594, 10650, 3047, -17864, -9614, 23279, 14277, -26488, -16854, 26918, 17029, -24878, -15141, 20390, 11394, -14235, -6515, 6828, 1194, 789, 3852, -7894, -7708, 14014, 10307, -18000, -10863, 19976, 9796]
1248I796k9172J2455K3786j3883j5405J4089N128j3088N368J1116j5021q349K2620
1261I440M713k6824j147K7525k222k4352N157J7708p035q633Q312k068q509J2998
1275E063P879k2690o777L0094N395l4295l891L4329K774l0624j947K3080J544
1288I934j2538j799J88K324J2733l085k4692L753L4382m002m0664L764M2900k769
1302B0429m0578Q65L4064J960k3915n287J1047R085K821j2774j6557J5868K8651
1315B5679j7876l7980J8272M3679j7017m5045J3616M2187q508l5403K029K5358
1327H991N453j3194j3043J27K0094J2664k5713k3792K9287L2289l0196l7431K8241
1340f223L8863k3619l6473J6467L0657p451k2347k522J2356J2520j770k1794q192
$$ y = [9796, -19376, -6921, 16865, 2982, -12423, 1666, 6794, -6294, -926, 10190, -4831, -13180, 9440, 14153, -12671, -13818, 13707, 11485, -12867, -7710, 9998, 2963, -5670, 2642, 574, -7935, 5063, 12942, -9748, -16525, 13569, 18964, -15331, -19222, 15107, 17881, -12743, -14690, 8390, 9934, -2604, -4403, -4215, -1891, 10842, 7757, -16935, -13182, 21200, 17198, -23466, -19702, 23198, 20429, -20149, -19284, 14780, 16740, -7175, -12462, -1415, 7670, 10491, -2283, -18840, -2972, 25679, 7803, -30177, -11905, 31774, 14757, -30288, -16672, 25515, 17007, -18396, -16367, 8991, 14444, 1250, -11793, -11666, 8428, 21092, -4621, -28413, 874, 33163, 2967, -34464, -6223, 32640, 9021, -27452, -10985, 19672, 12221, -10126, -12648, -292, 12228, 10458, -11336, -19528]
1353a9528K9034J6751l3831k2824L5441K6269l3648k6911K8813K4775k1055k0412
1365a7126J1319J4506m57p990j0229J260K0108M571k7793r331L2611J2446l4199
1378a0304j3761L2450J3265k7407j1530J9876Q596j0627n014O38J373R003J873
1391H431j7175m329K3183N772k6441n865K6680M933k3972l011J8766L47j1619
1404d300K340L620m834M278O631j1329p568J6618P284j9515o001J9753L690j7416
1418f749n68J2715k679o508N944m94q685P428J0759j3331j1784J7522J1734j9320
1432d016j0562J8518Q423j5136n543R607K111k660J472n073m913J2457P946j8722
1446f091j0384K2982J1910k4614j2569K3526J2219j9568j0814J3069Q776m796
$$ y = [-19528, 9506, 26257, -7574, -30398, 5043, 31312, -2336, -29247, -434, 24341, 3286, -17126, -5807, 8699, 8242, 252, -9977, -8717, 11391, 15962, -11831, -21162, 11449, 23895, -10304, -24065, 8385, 21650, -5757, -17287, 2589, 11185, 558, -4456, -3818, -2445, 6558, 8431, -8744, -13073, 10110, 15882, -10559, -16424, 10256, 15189, -8783, -11794, 6972, 7319, -4300, -1960, 1660, -3174, 1104, 7735, -3594, -11162, 5456, 12740, -6775, -12776, 6977, 10667, -6749, -7317, 5398, 2719, -3789, 2155, 1661, -7024, 404, 11163, -2168, -13952, 3570, 15304, -4016, -14578, 3940, 12363, -2773, -8316, 1291, 3402, 742, 2214, -2859, -7772, 4685, 12631, -6091, -16475, 6507, 18417, -6197, -18766, 4760, 16979, -2589, -13403, -334, 8442, 3646]
1458C646o148m266L158J3334r9k1373k837K7403N507l0824p610L0903R257k7845
1472g794j0361K1900J0712j3462j0706L527J0159O861r045j6804P520K5265n616
1485A2156l1104L311L3959o95l3495k025K9665N010k3030p696J4101J0122m032
1498F247j1996o265J3042J5748j3195k3543J2354K8816j0672l0989P886L0184
1510A7617m535k6372P42K0080L439j2142p437L344J0929N483j3718j3203J5531
1523b42J9260j6088k3055J5325K4260j3175k3007R947J9397n777j4006P77P771
1536A387M005r58q698n436J2526J0641j5106j4295J6247J6137j5815j5975J4007
1549a333J3787j0702j0204O521N804j888r06k766l694O789P616j0047j0246J2078
$$ y = [3646, -2502, -6768, -3610, 9724, 9625, -11748, -14585, 12818, 18325, -12499, -20109, 10794, 20051, -7794, -18155, 3745, 14457, 995, -9711, -6184, 3975, 10836, 1791, -15013, -7493, 17772, 12156, -18948, -15637, 18322, 17627, -15868, -17893, 11772, 16782, -6248, -13944, 157, 10279, 6247, -5749, -12014, 1028, 16776, 3581, -19962, -7608, 21208, 10536, -20453, -12567, 17617, 13082, -13290, -12548, 7532, 10971, -1171, -8608, -5264, 5665, 11148, -2570, -15773, -242, 19018, 2930, -20125, -4800, 19460, 6285, -16722, -6775, 12622, 6845, -7161, -6384, 1387, 5392, 4434, -4264, -9700, 2826, 13467, -1639, -15934, 313, 16450, 635, -15340, -1333, 12454, 1752, -8452, -1931, 3873, 1985, 1079, -1687, -5381, 1408, 9024, -1023, -11269, 809]
1563H09J1358j2655j0975J1920Q842r840n662O811J765l251K376m64o307M033
1577a240R294o812j1148Q664J1690r279j0609Q506Q274o615m769L761N95l55L795
1592C752l166q014O440J1215q720j3442R847J4387r886j3671Q333J1509n481q146
1606e043J754L933K495P75o661n423J0319R617j2902j2925J4162J5016j3788j5663
1620a4334J1763J4870q366j2655L687R401J593n280p105P66J2058L651j6110p682
1634a3743J8689J0879j9363j3032J8106J4034j4939j3742J0203J2323m134j0051
1646d770k440O947R057l505j4767j01J9150L469k1672o377K2050Q559k0179j0048
1660a4627J6295J0548j0818j0227M290R103K571p329r193N234J4695k755j8727
$$ y = [809, 12167, -488, -11463, 457, 9299, -541, -6203, 608, 2373, -878, 1498, 1034, -5273, -1240, 8054, 1242, -9906, -1242, 10448, 1169, -9440, -934, 7340, 725, -4044, -283, 312, -43, 3752, 586, -7428, -988, 10227, 1507, -11935, -2088, 12299, 2413, -11258, -2925, 8584, 3103, -5043, -3289, 644, 3139, 3914, -2747, -8170, 2149, 11766, -1136, -14061, 101, 15117, 1329, -14334, -2571, 12299, 3933, -8722, -5035, 4366, 5959, 679, -6426, -5660, 6398, 10049, -6061, -13743, 4946, 15825, -3538, -16570, 1536, 15570, 631, -13111, -2908, 9415, 5281, -4770, -7210, -263, 8794, 5289, -9478, -9579, 9571, 13040, -8632, -15009, 7041, 15600, -4579, -14627, 1668, 12216, 1398, -8829, -4539, 4564, 7135, -194, -9387, -4153, 10542, 7787, -10940]
1673a0940L11K1009J898k1000l744J8864N323j5071o322R864O805l893o807k377
1687f080O380Q272n751j3011M715J6339l509j7884K199J7472q20j5295n46J1594
1701D075J865o803l018J569L872L633m457q031M662J1491m633j3294M091J3587
1715H609l414j2299K473R565j395n895K23J769O74K525j580o271K219R011k532
1730C682j0535K639J0829k508r543K056P102j379l897P51M8J6L779o56p198J196
1746c618R620j352j1104J377J1118j061r769M09P226L68l747j193m47J970M626
1761D423k577q334K910J1231k728j2934K174J3335j258j2119j28R606J725o085
1775g59l262J770M667K729n673p116O266J0733o203j3369N515J4709m207j4603
$$ y = [-10940, -10629, 10380, 12278, -8722, -12466, 6398, 11721, -3350, -9672, 192, 6997, 3104, -3703, -6080, 300, 8572, 2821, -10190, -5475, 10864, 7355, -10529, -8330, 9142, 8322, -6973, -7519, 4075, 5940, -863, -3881, -2312, 1560, 5193, 736, -7295, -2633, 8858, 4225, -9069, -4978, 8609, 5195, -7104, -4631, 4934, 3539, -2356, -2133, -364, 310, 2835, 1255, -5016, -2797, 6214, 3682, -6853, -4214, 6615, 4107, -5436, -3380, 3722, 2343, -1554, -803, -755, -739, 3040, 2384, -4814, -3618, 6002, 4650, -6454, -5077, 6041, 4980, -4789, -4380, 2846, 3214, -533, -1726, -2173, -203, 4423, 1846, -6488, -3578, 7653, 4925, -8009, -5835, 7500, 6242, -5877, -6005, 3601, 5326, -759, -4021, -2251, 2416, 5145, -528, -7644, -1378, 9355, 3152, -10217, -4702, 10007, 5800, -8803]
1789h803K281J3022J6j0140k595O391N090j958p262k644Q981O973r878j0544R915
1804a155J3077q973j4327P109J4122m471j2566J173R821K321o207n762K180Q645
$$ y = [-8803, -6522, 6500, 6516, -3624, -6219, 172, 5262, 3304, -3958, -6602, 2379, 9352, -526, -11070, -1155, 11922, 2949, -11378, -4269, 9853, 5382, -7184, -6011, 3810, 6131, -76, -5838, -3658, 4987]
$$ [...]
8191e3
##END NTUPLES=NMR FID
##END=
