##TITLE=1H_LY-DMAA.2.24
 CDCl3
 8 sc, 
 15.04.2022
##JCAMPDX= 6.0         $$ Bruker NMR JCAMP-DX V2.0
##DATA TYPE= NMR FID
##DATA CLASS= NTUPLES
##ORIGIN= UXNMR, Bruker Analytische Messtechnik GmbH
##OWNER= root
$$ XWIN-NMR		Version 3.5
$$ Fri Apr 15 14:29:59 2022 Russian Standard Time (UT+4h)  she@DPX200
##.OBSERVE FREQUENCY= 200.13135
##.OBSERVE NUCLEUS= ^1H
##.DELAY= (6, 6)
##.ACQUISITION MODE= SIMULTANEOUS
##.ACQUISITION SCHEME= undefined
##.AVERAGES= 8
##.DIGITISER RES= 18
##SPECTROMETER/DATA SYSTEM= spect
##.PULSE SEQUENCE= zg30
##.SOLVENT NAME= CDCl3
##.SHIFT REFERENCE= (INTERNAL, CDCl3, 0, 15.7039)
##AUDIT TRAIL= $$ (NUMBER, WHEN, WHO, WHERE, WHAT)
$$ ##TITLE= Audit trail, XWIN-NMR		Version 3.5
$$ ##JCAMPDX= 5.01
$$ ##ORIGIN= Bruker BioSpin GmbH
$$ ##OWNER= she
$$ F:/spectra/data/she/nmr/H-F/1/audita.txt
$$ ##AUDIT TRAIL=  $$ (NUMBER, WHEN, WHO, WHERE, WHAT)
(   1,<2022-04-15 14:28:50.46 +0400>,<she>,<DPX200>,
      <created by zg, POWCHK disabled, PULCHK disabled
       configuration hash MD5:
       00 E9 B6 7A A2 85 ED C7 34 08 36 98 17 FE 4E 26
       data hash MD5: 16K
       05 71 E2 E4 08 E1 E8 51 90 40 41 AB FA 60 2F 40>)
$$ ##END=
$$ 
$$ hash MD5
$$ 20 04 38 EA 86 48 B7 17 E2 6A 0E BC AD C0 C4 A0
##$RELAX= 
##$RELAX= 
##$RELAX= 
##$RELAX= 
##$RELAX= 
##$RELAX= 
$$ Bruker specific parameters
$$ --------------------------
##$DU= <F:/spectra>
##$EXPNO= 1
##$NAME= <H-F>
##$PROCNO= 1
##$TYPE= <nmr>
##$USER= <she>
##$AMP= (0..31)
100 100 100 100 100 100 100 100 100 100 100 100 100 100 100 100 100 100 
100 100 100 100 100 100 100 100 100 100 100 100 100 100 
##$AQSEQ= 0
##$AQ_mod= 1
##$AUNM= <au_zg>
##$AUTOPOS= <>
##$BF1= 200.13
##$BF2= 200.13
##$BF3= 200.13
##$BF4= 200.13
##$BF5= 200.13
##$BF6= 200.13
##$BF7= 200.13
##$BF8= 200.13
##$BYTORDA= 1
##$CFDGTYP= 0
##$CFRGTYP= 5
##$CHEMSTR= <none>
##$CNST= (0..31)
1 1 145 1 1 1 1 1 1 1 1 1 1 1 1 1 1 1 1 1 1 1 1 1 1 1 1 1 1 1 1 1 
##$CPDPRG= <>
##$CPDPRG1= <>
##$CPDPRG2= <>
##$CPDPRG3= <>
##$CPDPRG4= <mlev>
##$CPDPRG5= <mlev>
##$CPDPRG6= <mlev>
##$CPDPRG7= <mlev>
##$CPDPRG8= <mlev>
##$CPDPRGB= <>
##$CPDPRGT= <>
##$D= (0..31)
0 1.2 0 0 0 0 0 0 0 0.06 0 0.03 0 0 0 0 0.0002 0 0 0 0 0 0 0 0 0 0 0 0 
0 0 0 
##$DATE= 1650018529
##$DBL= (0..7)
120 120 120 120 120 120 120 120 
##$DBP= (0..7)
150 150 150 150 150 150 150 150 
##$DBP07= 0
##$DBPNAM0= <>
##$DBPNAM1= <>
##$DBPNAM2= <>
##$DBPNAM3= <>
##$DBPNAM4= <>
##$DBPNAM5= <>
##$DBPNAM6= <>
##$DBPNAM7= <>
##$DBPOAL= (0..7)
0.5 0.5 0.5 0.5 0.5 0.5 0.5 0.5 
##$DBPOFFS= (0..7)
0 0 0 0 0 0 0 0 
##$DE= 6
##$DECBNUC= <off>
##$DECIM= 32
##$DECNUC= <off>
##$DECSTAT= 4
##$DIGMOD= 1
##$DIGTYP= 9
##$DL= (0..7)
0 120 120 120 120 120 120 120 
##$DP= (0..7)
150 150 150 150 150 150 150 150 
##$DP07= 0
##$DPNAME0= <>
##$DPNAME1= <>
##$DPNAME2= <>
##$DPNAME3= <>
##$DPNAME4= <>
##$DPNAME5= <>
##$DPNAME6= <>
##$DPNAME7= <>
##$DPOAL= (0..7)
0.5 0.5 0.5 0.5 0.5 0.5 0.5 0.5 
##$DPOFFS= (0..7)
0 0 0 0 0 0 0 0 
##$DQDMODE= 0
##$DR= 18
##$DS= 0
##$DSLIST= <SSSSSSSSSSSSSSS>
$$ [...]
##$SUBNAM2= <"">
##$SUBNAM3= <"">
##$SUBNAM4= <"">
##$SUBNAM5= <"">
##$SUBNAM6= <"">
##$SUBNAM7= <"">
##$SUBNAM8= <"">
##$SUBNAM9= <"">
##$SW= 18.05172834244
##$SWIBOX= (0..15)
0 0 2 0 0 0 0 0 0 0 0 0 0 0 0 0 
##$SW_h= 3612.71676300578
##$TD= 16384
##$TD0= 1
##$TE= 0
##$TE2= 300
##$TE3= 300
##$TEG= 300
##$TL= (0..7)
0 120 120 120 120 120 120 120 
##$TP= (0..7)
150 150 150 150 150 150 150 150 
##$TP07= 0
##$TPNAME0= <>
##$TPNAME1= <>
##$TPNAME2= <>
##$TPNAME3= <>
##$TPNAME4= <>
##$TPNAME5= <>
##$TPNAME6= <>
##$TPNAME7= <>
##$TPOAL= (0..7)
0.5 0.5 0.5 0.5 0.5 0.5 0.5 0.5 
##$TPOFFS= (0..7)
0 0 0 0 0 0 0 0 
##$TUNHIN= 0
##$TUNHOUT= 0
##$TUNXOUT= 0
##$USERA1= <user>
##$USERA2= <user>
##$USERA3= <user>
##$USERA4= <user>
##$USERA5= <user>
##$V9= 5
##$VALIST= <valist>
##$VCLIST= <CCCCCCCCCCCCCCC>
##$VD= 0
##$VDLIST= <DDDDDDDDDDDDDDD>
##$VPLIST= <PPPPPPPPPPPPPPP>
##$VTLIST= <TTTTTTTTTTTTTTT>
##$WBST= 1024
##$WBSW= 4
##$XGAIN= (0..3)
0 0 0 0 
##$XL= 0
##$YL= 0
##$YMAX_a= 301097
##$YMIN_a= -307708
##$ZGOPTNS= <>
##$ZL1= 120
##$ZL2= 120
##$ZL3= 120
##$ZL4= 120
##$ABSF1= 10
##$ABSF2= 0
##$ABSG= 5
##$ABSL= 3
##$ALPHA= 0
##$AQORDER= 0
##$ASSFAC= 0
##$ASSFACI= 0
##$ASSFACX= 0
##$ASSWID= 0
##$AUNMP= <proc_1d>
##$AZFE= 0.1
##$AZFW= 0.1
##$BCFW= 1
##$BC_mod= 2
##$BYTORDP= 1
##$COROFFS= 0
##$CY= 11.3945322036743
##$DATMOD= 1
##$DC= 2
##$DFILT= <>
##$DTYPP= 0
##$F1P= 2.36226072786647
##$F2P= -0.459571619588291
##$FCOR= 0.5
##$FTSIZE= 0
##$FT_mod= 4
##$GAMMA= 1
##$GB= 0.15
##$INTBC= 1
##$INTSCL= 1
##$ISEN= 128
##$LB= 0.24
##$LEV0= 0
##$LPBIN= 0
##$MAXI= 10000
##$MC2= 0
##$MEAN= 0
##$ME_mod= 0
##$MI= 1.114404
##$NCOEF= 0
##$NC_proc= 0
##$NLEV= 6
##$NOISF1= 3.799351
##$NOISF2= 2.8
##$NSP= 1
##$NTH_PI= 0
##$NZP= 0
##$OFFSET= 15.70392
##$PC= 1
##$PHC0= -18304.11
##$PHC1= 12.80075
##$PH_mod= 1
##$PKNL= yes
##$PPARMOD= 0
##$PSCAL= 0
##$PSIGN= 0
##$REVERSE= no
##$SF= 200.130013532006
##$SI= 16384
##$SIGF1= 3
##$SIGF2= 2
##$SINO= 400
##$SIOLD= 16384
##$SREGLST= <1H.CDCl3>
##$SSB= 0
##$STSI= 0
##$STSR= 0
##$SW_p= 3612.71676300578
##$SYMM= 0
##$S_DEV= 0
##$TDeff= 0
##$TDoff= 0
##$TI= <>
##$TILT= no
##$TM1= 0
##$TM2= 0
##$TOPLEV= 0
##$USERP1= <user>
##$USERP2= <user>
##$USERP3= <user>
##$USERP4= <user>
##$USERP5= <user>
##$WDW= 1
##$XDIM= 8192
##$YMAX_p= 0
##$YMIN_p= 0
$$ End of Bruker specific parameters
$$ ---------------------------------
##NTUPLES= NMR FID
##VAR_NAME=  TIME,          FID/REAL,        FID/IMAG
##SYMBOL=    X,             R,               I
##VAR_TYPE=  INDEPENDENT,   DEPENDENT,       DEPENDENT
##VAR_FORM=  AFFN,          ASDF,            ASDF
##VAR_DIM=   8192,          8192,            8192
##UNITS=     SECONDS,       ARBITRARY UNITS, ARBITRARY UNITS
##FACTOR=    0.0002768,     1,               1
##FIRST=     0,             0,               0
##LAST=      2.2672688,     0,               0
##MIN=       0,             -307708,         0
##MAX=       2.2672688,     301097,          0
$$ Real data points
##PAGE= N=1
##DATA TABLE= (X++(R..R)), XYDATA
0 0 0 0 0 0 0 0 0 0 0 0 0 0 0 3 -8 8 -8 8 -8 15 -16 16 -23 24 -32 32 -40 45 -53 61 -68 77 -88 99 -109 125
36 125 -141 157 -174 194 -215 239 -264 292 -323 356 -394 433 -477 525 -578 637 -704 777 -859
55 -859 953 -1061 1188 -1336 1512 -1727 1998 -2346 2814 -3481 4497 -6222 9692 -19309 99754
70 99754 301097 -87409 -271919 44410 230366 -7557 -161440 -41160 87730 83246 -5798
81 -5798 -126754 -69108 156429 135367 -176852 -181465 179832 208040 -170409 -210713 145584
92 145584 195592 -108964 -162190 61647 118379 -8418 -65783 -45598 13454 95058 34847
103 34847 -135877 -72655 164602 98234 -179605 -110479 177854 109165 -160695 -96463 128286
114 128286 73678 -86133 -46074 37309 17289 12372 7988 -58970 -26861 98294 38145 -125755
126 -125755 -40122 139865 34377 -138556 -20767 124355 3320 -98823 15539 66051
136 66051 -31839 -29463 43146 -6952 -48291 38389 45341 -62400 -35309 75621 17750 -78725
148 -78725 4174 71229 -28593 -55716 51801 34237 -71190 -9790 84766 -13516 -90080 33003
160 33003 86976 -44844 -73912 48750 53258 -43177 -25943 29669 -4540 -9463 35451 -14824
172 -14824 -64201 39199 87089 -60916 -102921 75352 108816 -81365 -105478 76496 92470
183 92470 -61447 -72031 36804 46029 -4895 -16721 -30333 -12534 65609 40041 -95802 -62395
195 -62395 118232 78985 -129116 -88123 127450 90257 -112264 -85509 84623 74650 -47195
206 -47195 -59481 2947 40842 42808 -21511 -86611 1957 122986 15647 -148895 -31063
217 -31063 160898 43269 -157518 -51679 139161 56792 -106911 -57992 64672 56731 -15630
228 -15630 -52530 -34426 46890 81296 -39528 -119945 31011 146565 -21757 -159015 11528
239 11528 155751 -1195 -138410 -10086 108180 21152 -69174 -32361 24985 42553 19464
250 19464 -51313 -59826 57863 92578 -60929 -114402 60519 124406 -55324 -121536 46035
261 46035 107544 -32282 -83777 15450 53684 3454 -20806 -23166 -11605 41452 39628 -57398
273 -57398 -61341 68506 73909 -74680 -77439 74327 71561 -67958 -58081 55842 39172 -38928
285 -38928 -17368 19175 -3711 2244 22222 -22464 -35006 40403 41444 -53650 -40388 61653
297 61653 32728 -63563 -19912 59358 3603 -50169 13118 36548 -28577 -21097 39559 4638
309 4638 -45457 10046 44381 -22100 -36792 30028 23321 -33279 -5264 32170 -14744 -26732
321 -26732 35263 18866 -52778 -9101 66000 -182 -72363 8106 71415 -13118 -62600 14402
333 14402 46486 -11997 -25025 5574 -315 3178 26163 -13868 -50663 24070 70471 -32731
345 -32731 -84008 37863 89608 -38358 -86681 33694 75810 -23477 -57637 8979 34683
356 34683 9141 -8542 -28324 -17566 46965 41779 -62419 -61599 72675 75429 -76330 -82570
368 -82570 71986 82139 -60085 -75123 40820 61871 -16431 -44398 -11401 24086 39595
379 39595 -3031 -65338 -16764 86096 34012 -99090 -46900 103340 55243 -97520 -58066
390 -58066 82547 56276 -59212 -50140 30046 40919 2264 -29871 -34749 18014 63750 -6947
402 -6947 -87060 -3108 101694 10883 -106900 -16858 101708 20652 -87125 -22825 64609
413 64609 23867 -36414 -23844 5862 23740 24596 -22980 -51217 22418 72234 -21158 -85163
425 -85163 19524 89282 -17118 -84545 13566 71589 -9244 -52599 3455 29205 2743 -4813
437 -4813 -9912 -18497 16909 37865 -23648 -51701 29244 58659 -33126 -58202 35080 51229 -34193
450 -34193 -38489 30996 22560 -24910 -4903 16972 -11499 -7286 25067 -3042 -33933 13075 37080
463 37080 -22138 -34612 28944 26531 -33493 -14755 34680 303 -33226 14172 28838 -27091
475 -27091 -22567 36410 14907 -40680 -6727 39500 -784 -32341 7489 20460 -12196 -4583
487 -4583 15256 -12914 -16217 30404 15550 -45561 -13676 56342 11006 -61640 -8414 60073
499 60073 5946 -52109 -4699 37759 4196 -18944 -5124 -2874 6815 25171 -9038 -45691
511 -45691 11369 62410 -12779 -73019 13132 77042 -11342 -73240 7551 62570 -1408 -45669
523 -45669 -6569 24394 15693 -963 -25243 -22655 33635 43745 -40210 -60814 43348 71770
535 71770 -42730 -76165 37600 73437 -28202 -64155 15184 49504 595 -30814 -17307
546 -17307 10404 33920 10173 -48009 -28473 58696 43340 -64296 -53212 64268 57601 -58318
558 -58318 -56533 46604 50228 -30483 -40180 10833 27183 9942 -13409 -30484 -236 48335
570 48335 12063 -62021 -21326 70029 27418 -71381 -29943 66282 29608 -54703 -26341 38365
582 38365 21627 -18323 -15683 -2794 9868 23283 -4590 -40954 419 53977 2142 -61476
594 -61476 -3441 62385 3057 -57427 -2132 46707 470 -32213 887 15185 -1683 2169
606 2169 1529 -18041 -59 31021 -2344 -39384 5977 42998 -9800 -41138 13969 34871 -17244
619 -17244 -24775 19480 12524 -20001 325 18460 -12233 -15171 21366 9802 -27098 -3434 28281
632 28281 -3903 -25281 11012 18272 -17441 -8403 22476 -2887 -25511 14242 26535 -23719
644 -23719 -25177 30392 22077 -32729 -17098 30727 11178 -24145 -4682 13771 -1744 -905 7460
657 7460 -13281 -12382 26779 15782 -38283 -18004 45920 18577 -48987 -18042 46678 16432 -39090
670 -39090 -14130 26942 11616 -11123 -8895 -6308 6632 24215 -4308 -40100 2520 52671
682 52671 -587 -60263 -1319 62074 3459 -57830 -6193 47708 9218 -33054 -12874 14798
694 14798 16298 4623 -19737 -23836 22233 40548 -23551 -53257 23184 60821 -20708 -62345
706 -62345 16396 58259 -9770 -48490 1899 34805 7196 -18130 -16293 719 24911 16118
718 16118 -32003 -30678 36699 41421 -38707 -47895 37144 49224 -32526 -46086 24546 38569 -14220
731 -14220 -28119 2086 15732 10682 -2910 -22843 -8866 33473 18852 -41062 -25645 45280
743 45280 29397 -45084 -29464 40981 26693 -32865 -21326 21810 14473 -8835 -7106 -4775 22
756 22 17493 5630 -28398 -9699 35972 11360 -39945 -11078 39676 8808 -35634 -5231 28287
769 28287 1057 -18426 3195 7487 -6404 3668 8554 -13445 -8795 21281 7346 -26054 -4158
782 -4158 27573 -323 -25777 5434 20915 -10672 -13997 15017 5651 -18196 2682 19333 -10251
795 -10251 -18517 15750 15491 -18625 -10592 18557 4397 -15367 2709 9836 -9638 -2383 16115
808 16115 -5628 -21039 13329 24251 -19458 -25210 23156 23925 -23848 -20631 21096 15417 -15437
821 -15437 -9203 6966 2174 2841 4591 -13345 -10924 23038 16036 -30804 -19560 35693 21483
834 21483 -36782 -21484 34099 20138 -27274 -17220 17362 13520 -4861 -9159 -8683 4761 22100
847 22100 -548 -33837 -3290 42534 6399 -47414 -9055 47455 10884 -43065 -12300 34080
859 34080 13081 -21803 -13530 7142 13565 8190 -13152 -22644 12447 35001 -10975 -43628 9213
872 9213 48202 -6599 -47831 3516 43078 260 -34216 -4359 22398 8638 -8863 -12827
884 -12827 -5122 16430 17960 -19430 -28769 21006 36167 -21307 -39906 19769 39498 -16588 -35373
897 -35373 11794 28065 -5615 -18347 -1245 7658 8555 3220 -15306 -12740 21158 20331 -25188
910 -25188 -25041 27153 26641 -26706 -25229 23751 21025 -18784 -15013 11973 7704 -4319 -533 -3730
924 -3730 -6048 11198 11006 -17426 -13939 21881 14605 -24002 -12910 23848 9566 -21275 -4789
937 -4789 16917 -398 -11013 5457 4457 -9532 2093 12114 -8035 -12852 12565 11505 -15450
950 -15450 -8439 16140 3682 -15043 1858 12002 -7747 -7756 13069 2739 -17154 2284 19558
963 19558 -6525 -19663 9656 17735 -10828 -13446 10351 7673 -7843 -680 4019 -6521 814
976 814 13330 -5941 -19075 10454 22822 -13992 -24665 15596 23905 -15240 -21123 12552 16216
989 16216 -7987 -10000 1799 2918 5282 4319 -12360 -10927 18889 16610 -23619 -20455 26305 22629
1003 22629 -26102 -22649 23229 20913 -17513 -17485 9588 12811 -235 -7517 -9816 1830 19210
1016 19210 3364 -27368 -8100 32811 11590 -35290 -13948 34242 14998 -29788 -14840 22304
1028 22304 13751 -12464 -11745 1403 9409 10007 -6723 -20314 4153 28780 -1614 -34290 -632
1041 -632 36501 2573 -35195 -4302 30456 5687 -23039 -7014 13388 7974 -2868 -8896 -7763
1054 -7763 9518 17221 -9867 -24808 9801 29693 -9178 -31433 8048 30096 -6228 -25682
1066 -25682 3940 19039 -1016 -10707 -2114 1852 5407 6664 -8546 -13949 11183 19120 -13137
1079 -13137 -21924 13998 21942 -13865 -19574 12497 15034 -10078 -9171 6767 2738 -2854 3527 -1267
1093 -1267 -8727 5360 12530 -8772 -14172 11448 13936 -12879 -11628 13129 7825 -12161 -3047
1106 -3047 10046 -2147 -7176 6880 3707 -10777 -245 13027 -3048 -13646 5564 12174 -7334
1119 -7334 -9005 8016 4421 -7562 1102 6339 -6709 -4214 11997 1896 -15959 609 18439
1132 18439 -2572 -18686 4008 16899 -4459 -13035 3931 7589 -2555 -1198 276 -5637 2244
1145 2244 11929 -4950 -17348 7097 20973 -8558 -22643 8849 22086 -7909 -19361 5713
1157 5713 14878 -2285 -8852 -1772 2229 6376 4704 -10695 -10974 14474 16309 -16871 -19950 17758
1171 17758 21681 -16854 -21458 13967 19185 -9499 -15404 3607 10255 2866 -4617 -9639 -1275 15720
1185 15720 6629 -20569 -11040 23588 14174 -24332 -15708 22810 15900 -18842 -14502 13102 12183
1198 12183 -5819 -8966 -2052 5483 9923 -2032 -16862 -1191 22204 3810 -25494 -5831 26213
1211 26213 7003 -24527 -7598 20396 7487 -14412 -6953 7118 6124 692 -5079 -8256 4099
1224 4099 14870 -3075 -19735 2306 22589 -1564 -23002 995 21118 -478 -17109 -15
1236 -15 11507 552 -5065 -1303 -1646 2025 7648 -3059 -12643 3937 15808 -4883 -17050 5604
1250 5604 16248 -5963 -13573 5979 9601 -5361 -4598 4414 -458 -2856 5248 1144 -8964 863
1264 863 11397 -2748 -12125 4407 11163 -5711 -8792 6386 5069 -6617 -871 6114 -3612 -5252
1278 -5252 7506 3882 -10561 -2371 12207 775 -12188 734 10608 -1858 -7430 2748 3245
1291 3245 -3067 1757 3083 -6623 -2593 11120 1991 -14427 -1223 16246 530 -16267 -146
1304 -146 14367 -50 -10904 -283 5980 878 -409 -1834 -5538 2847 10990 -3823 -15479 4523
1318 4523 18506 -4671 -19673 4278 19011 -3047 -16367 1306 12245 1115 -6805 -3712
1330 -3712 869 6450 5201 -8798 -10695 10538 15104 -11450 -18076 11192 19154 -9847 -18507 7324
1344 7324 16026 -3935 -12139 -127 7233 4441 -1870 -8611 -3368 12289 8159 -14877 -11803 16286
1358 16286 14191 -16092 -15043 14447 14511 -11278 -12644 6912 9765 -1832 -6312 -3614 2524 8765
1372 8765 965 -13267 -4134 16493 6508 -18149 -8035 18080 8633 -16187 -8320 12838 7343
1385 7343 -8194 -5701 2947 3907 2647 -1916 -7662 196 11912 1243 -14778 -2204 16077 2605
1399 2605 -15773 -2633 13698 2082 -10488 -1425 6159 570 -1554 62 -3134 -576 7128 670
1413 670 -10162 -439 11946 -17 -12121 871 11064 -1641 -8577 2532 5343 -3049 -1523
1426 -1523 3470 -2250 -3375 5544 2964 -8012 -2229 9286 1196 -9361 -55 8019 -1258 -5736
1440 -5736 2367 2530 -3392 972 4059 -4448 -4444 7375 4474 -9355 -4115 10298 3510 -9743 -2565
1455 -2565 8009 1583 -5057 -449 1454 -533 2653 1457 -6616 -2174 10040 2627 -12502 -2982
1469 -2982 13545 3047 -13261 -3098 11375 3013 -8207 -2890 4043 2799 690 -2671 -5502
1482 -5502 2528 9944 -2227 -13364 1872 15626 -1230 -16206 416 15284 674 -12759
1494 -12759 -1892 8938 3179 -4340 -4491 -758 5568 5665 -6426 -10092 6748 13388 -6571 -15394
1508 -15394 5849 15849 -4447 -14737 2575 12311 -225 -8659 -2229 4425 4796 207 -7037
1521 -7037 -4501 8888 8313 -10031 -11101 10333 12661 -9747 -12992 8155 11990 -5829 -9968 2765
1535 2765 7038 551 -3742 -3979 278 7103 2941 -9570 -5559 11236 7484 -11698 -8322 11190
1549 11190 8405 -9457 -7442 6993 5909 -3712 -3794 268 1620 3224 534 -6235 -2385 8557
1563 8557 3666 -10046 -4382 10305 4326 -9712 -3787 8014 2642 -5593 -1334 2710 -75 407
1577 407 1414 -3263 -2351 5707 2932 -7321 -2919 8111 2499 -7786 -1606 6637 474 -4676 812
1592 812 2210 -2123 459 3168 -3003 -3908 5009 4152 -6424 -4006 6779 3390 -6300 -2349 4909
1607 4909 1023 -2860 487 350 -1952 2304 3290 -4650 -4318 6595 5047 -7700 -5246 7872 5002
1622 5002 -7010 -4340 5251 3290 -2770 -2041 -271 575 3388 809 -6380 -2145 8752 3223 -10311
1637 -10311 -4007 10801 4506 -10111 -4614 8318 4502 -5490 -3999 2088 3449 1813 -2585 -5514
1651 -5514 1674 8816 -731 -11255 -270 12600 1218 -12700 -2150 11451 2913 -9140 -3631
1664 -3631 5771 4057 -1921 -4350 -2121 4367 5933 -4119 -9143 3683 11519 -2874 -12599 1954
1678 1954 12622 -712 -11241 -541 8946 1931 -5733 -3230 2098 4418 1586 -5378 -5105 5896
1692 5896 7869 -6095 -9909 5742 10737 -4973 -10592 3634 9313 -2001 -7173 116 4465 1896
1706 1896 -1400 -3678 -1555 5264 4249 -6297 -6199 6876 7486 -6690 -7740 6031 7276 -4688
1720 -4688 -5941 2968 4099 -1046 -2019 -1038 -266 2880 2209 -4489 -3809 5503 4775 -6053 -5087 5929
1736 5929 4767 -5192 -3792 4001 2436 -2397 -752 635 -899 1265 2434 -2798 -3488 4040 4132 -4728
1752 -4728 -4202 4795 3667 -4289 -2678 3262 1237 -1839 335 145 -1971 1497 3384 -2923 -4400
1767 -4400 3900 4982 -4351 -4965 4254 4431 -3444 -3359 2219 1977 -559 -211 -1215 -1521 2912 3147 -4354
1784 -4354 -4501 5328 5400 -5704 -5880 5372 5683 -4383 -5031 2773 3874 -768 -2472 -1547 771 3779
1800 3779 950 -5728 -2519 7228 3925 -7953 -4792 7942 5344 -6963 -5347 5284 4985 -2925
1814 -2925 -4157 160 3098 2704 -1818 -5401 405 7529 850 -9048 -2123 9586 3060 -9256 -3774
1829 -3774 7845 4158 -5776 -4241 3075 4051 -62 -3576 -2927 2955 5697 -2052 -7798 1221 9271
1844 9271 -200 -9725 -620 9292 1458 -7915 -2259 5798 2799 -3193 -3304 220 3453 2563 -3504
1859 -3504 -5126 3265 7044 -2873 -8211 2263 8483 -1506 -7893 617 6505 386 -4442 -1238 2130
1874 2130 2173 413 -2805 -2670 3288 4585 -3470 -5874 3400 6466 -3018 -6294 2382 5420 -1612 -4042
1890 -4042 662 2284 351 -347 -1313 -1563 2092 3113 -2670 -4166 2994 4804 -2969 -4729 2714 4133
1906 4133 -2098 -2992 1347 1560 -417 107 -498 -1696 1327 3089 -1980 -4047 2308 4459 -2388 -4391
1922 -4391 2104 3677 -1586 -2539 829 1036 49 634 -969 -2224 1766 3637 -2265 -4551 2561 5108
1938 5108 -2437 -4995 2004 4403 -1229 -3317 223 1829 902 -164 -2066 -1611 2967 3114 -3692 -4442
1954 -4442 3955 5273 -3862 -5617 3253 5396 -2250 -4690 908 3567 675 -2007 -2225 379 3710
1969 3710 1342 -4795 -2852 5565 4131 -5676 -4902 5275 5276 -4253 -5121 2724 4478 -916 -3537 -1153
1985 -1153 2242 3106 -863 -4810 -611 6060 1877 -6796 -2937 6833 3698 -6194 -4085 4956 4177
2000 4177 -3167 -3846 1154 3330 1114 -2497 -3148 1582 4964 -564 -6258 -380 6957 1268 -6966
2015 -6966 -1983 6239 2452 -4985 -2766 3179 2792 -1146 -2690 -1046 2313 3038 -1814 -4666 1244
2030 1244 5797 -602 -6238 28 6073 546 -5241 -971 3921 1368 -2199 -1605 327 1731 1496
2045 1496 -1703 -3103 1558 4285 -1346 -4941 1026 4999 -655 -4575 273 3634 130 -2283 -477
2060 -477 767 856 837 -1034 -2216 1197 3385 -1175 -3999 1081 4218 -855 -3874 526 3100 -178
2076 -178 -1958 -195 482 511 946 -817 -2322 961 3320 -1009 -4037 871 4167 -629 -3851 273
2092 273 3065 156 -1830 -590 455 1081 1127 -1366 -2499 1642 3673 -1598 -4393 1445 4672 -1065
2108 -1065 -4482 476 3793 187 -2798 -954 1349 1625 159 -2286 -1750 2647 3082 -2863 -4150 2688
2124 2688 4819 -2282 -4983 1586 4671 -639 -3831 -402 2751 1550 -1248 -2510 -256 3360 1793
2139 1793 -3850 -3051 4007 4066 -3760 -4657 3121 4688 -2207 -4391 968 3628 377 -2633 -1795 1346
2155 1346 3023 -28 -4011 -1241 4658 2351 -4838 -3142 4590 3670 -3831 -3790 2765 3644 -1397 -3114
2171 -3114 -148 2368 1694 -1476 -3072 463 4099 523 -4758 -1380 4908 2028 -4607 -2500 3804
2186 3804 2659 -2694 -2577 1257 2275 244 -1783 -1719 1173 3001 -512 -3872 -137 4366 720 -4388
2202 -4388 -1164 3943 1419 -3144 -1561 1932 1505 -638 -1403 -779 1063 1948 -738 -2986 348 3591
2218 3591 -5 -3775 -311 3595 630 -2955 -788 2055 935 -890 -898 -336 822 1526 -591 -2462
2234 -2462 376 3142 -59 -3440 -229 3297 465 -2773 -736 1879 797 -843 -928 -411 808 1545
2250 1545 -690 -2552 431 3234 -142 -3526 -155 3456 530 -2960 -812 2171 1127 -1020 -1260
2265 -1260 -173 1375 1442 -1296 -2549 1121 3333 -891 -3860 469 3893 -29 -3604 -559 2879
2280 2879 1015 -1910 -1535 616 1843 658 -2054 -1914 2077 2988 -1853 -3710 1483 4102 -931 -4021
2296 -4021 264 3643 502 -2831 -1211 1740 1858 -469 -2373 -837 2671 1990 -2766 -2971 2554 3575
2312 3575 -2138 -3913 1491 3813 -743 -3368 -202 2613 1137 -1610 -1950 511 2629 621 -3065
2327 -3065 -1628 3227 2445 -3075 -3026 2661 3244 -1969 -3159 1066 2789 -39 -2143 -1005 1337 1921
2343 1921 -422 -2639 -497 3121 1313 -3241 -1954 3068 2367 -2575 -2514 1861 2431 -915 -2053 -54
2359 -54 1552 1077 -844 -1889 180 2539 510 -2921 -1066 2947 1473 -2709 -1772 2146 1751 -1441
2375 -1441 -1632 512 1291 420 -887 -1311 387 2045 130 -2500 -571 2732 984 -2579 -1218 2221
2391 2221 1365 -1515 -1294 739 1165 220 -827 -1079 404 1809 -11 -2386 -477 2585 834 -2561
2407 -2561 -1184 2190 1301 -1615 -1374 769 1245 133 -1023 -1029 690 1823 -285 -2405 -126 2808
2423 2808 597 -2803 -923 2575 1256 -1963 -1411 1210 1488 -279 -1422 -739 1231 1615 -941 -2392
2439 -2392 523 2884 -84 -3126 -399 3012 805 -2567 -1223 1841 1512 -918 -1645 -99 1716
2454 1716 1116 -1560 -2004 1312 2729 -883 -3151 417 3268 134 -3038 -658 2540 1156 -1761
2469 -1761 -1560 811 1824 179 -1945 -1185 1910 2037 -1708 -2663 1349 3022 -826 -3090 293 2863
2485 2863 302 -2304 -894 1577 1419 -687 -1850 -225 2068 1111 -2105 -1861 1927 2399 -1613 -2692
2501 -2692 1073 2663 -504 -2393 -165 1876 817 -1184 -1357 431 1793 389 -2020 -1068 2083
2516 2083 1726 -1875 -2043 1569 2258 -1011 -2139 471 1863 198 -1353 -807 775 1323 -106 -1740
2532 -1740 -544 1919 1026 -1960 -1529 1704 1706 -1370 -1797 846 1636 -240 -1321 -385 896 1004 -329
2549 -329 -1462 -200 1789 731 -1875 -1140 1797 1449 -1460 -1539 1020 1535 -381 -1322 -282 943 882
2566 882 -477 -1414 -26 1755 511 -1958 -981 1898 1273 -1669 -1499 1198 1556 -641 -1423 -13 1213
2583 1213 717 -813 -1275 377 1780 131 -2069 -546 2159 957 -1997 -1266 1649 1469 -1093 -1531
2599 -1531 402 1416 331 -1232 -1052 882 1683 -455 -2109 19 2353 465 -2314 -888 2071
2614 2071 1261 -1576 -1453 943 1588 -152 -1494 -585 1328 1316 -1027 -1888 634 2280 -195 -2465 -286
2631 -286 2339 678 -2060 -1083 1510 1341 -883 -1505 144 1556 659 -1400 -1287 1219 1878 -838 -2203
2648 -2203 452 2341 5 -2193 -419 1872 848 -1335 -1181 692 1395 52 -1492 -748 1427 1339
2664 1339 -1268 -1809 936 2032 -556 -2113 99 1891 322 -1544 -762 1035 1120 -384 -1329 -203
2680 -203 1474 833 -1367 -1278 1219 1668 -894 -1793 535 1791 -115 -1583 -356 1190 708 -722 -1064
2697 -1064 134 1249 364 -1386 -876 1311 1262 -1133 -1511 832 1648 -395 -1501 -26 1273 507 -835
2714 -835 -850 416 1196 133 -1369 -598 1387 1039 -1234 -1339 983 1500 -607 -1482 191 1320 275
2731 275 -1055 -765 605 1122 -140 -1395 -323 1492 784 -1426 -1126 1251 1385 -916 -1443 498 1424
2748 1424 21 -1239 -506 911 996 -509 -1332 79 1550 380 -1640 -802 1494 1131 -1258 -1376 849
2765 849 1434 -357 -1361 -185 1190 723 -865 -1185 492 1549 -5 -1707 -360 1779 781 -1570
2781 -1570 -1069 1268 1295 -770 -1379 241 1329 307 -1198 -869 860 1266 -569 -1614 147 1759
2797 1759 226 -1750 -608 1561 936 -1205 -1127 731 1265 -185 -1237 -344 1163 899 -884 -1316 606
2814 606 1604 -209 -1680 -154 1657 536 -1438 -830 1037 1035 -596 -1151 9 1191 522 -1056 -998
2831 -998 874 1326 -582 -1572 219 1611 148 -1472 -465 1220 777 -827 -944 384 1112 145 -1085
2848 -1085 -584 1010 1026 -769 -1262 545 1420 -210 -1436 -154 1277 451 -1003 -771 600 927 -188
2865 -188 -1051 -295 1089 710 -953 -1057 745 1302 -442 -1353 120 1304 258 -1094 -581 790 849
2882 849 -372 -1028 -76 1120 475 -1088 -856 928 1115 -676 -1275 388 1335 -5 -1224 -360 978
2899 978 718 -637 -934 281 1129 169 -1214 -562 1151 886 -935 -1107 677 1276 -286 -1264 -47
2916 -47 1118 427 -878 -755 551 1041 -190 -1215 -211 1229 589 -1163 -914 942 1172 -609 -1218
2933 -1218 272 1248 189 -1033 -548 872 880 -481 -1122 139 1308 245 -1290 -621 1191 886 -927
2950 -927 -1075 575 1147 -222 -1148 -224 970 570 -782 -931 460 1129 -141 -1305 -196 1274 533
2967 533 -1136 -792 895 1004 -489 -1072 141 1089 303 -907 -645 715 976 -437 -1155 96 1271
2984 1271 250 -1222 -551 1004 784 -763 -973 368 1009 -3 -971 -393 841 742 -635 -996 356
3001 356 1135 -76 -1186 -224 1101 530 -911 -726 610 888 -248 -949 -123 890 477 -785 -764 586
3019 586 1003 -308 -1101 35 1133 266 -1024 -531 805 744 -440 -908 134 946 273 -890 -607 767
3037 767 909 -544 -1049 256 1116 75 -1084 -348 918 595 -664 -813 309 897 15 -975 -378 887
3055 887 684 -733 -906 481 1048 -229 -1072 -57 1034 388 -811 -613 595 846 -272 -935 -80
3072 -80 992 423 -885 -680 725 925 -485 -1060 156 1055 119 -994 -437 768 672 -524 -870 194
3090 194 977 142 -999 -455 917 746 -701 -898 446 1040 -112 -978 -164 926 464 -686 -716 465
3108 465 925 -110 -1004 -171 976 470 -879 -675 683 845 -421 -948 92 913 214 -847 -517 616
3126 616 741 -365 -882 88 990 192 -937 -475 825 719 -562 -832 294 919 14 -882 -281 757
3144 757 596 -527 -798 304 915 -7 -957 -275 905 524 -761 -715 535 836 -222 -864 -96 826
3162 826 385 -689 -624 514 847 -268 -934 -23 930 293 -849 -500 687 688 -421 -807 148 819 186
3181 186 -786 -446 643 684 -442 -809 186 917 56 -891 -295 817 606 -597 -712 345 839 -17 -827
3200 -827 -227 762 529 -609 -727 378 880 -164 -939 -128 867 345 -750 -596 541 729 -290 -805
3218 -805 -32 829 275 -757 -541 629 762 -379 -857 173 899 142 -821 -337 709 582 -461 -732
3236 -732 232 809 51 -819 -334 746 553 -576 -750 351 824 -116 -872 -150 772 386 -632 -642 410
3255 410 758 -151 -816 -79 814 344 -719 -526 552 737 -292 -796 84 803 194 -700 -399 587 605
3274 605 -371 -735 145 781 106 -759 -375 669 548 -484 -685 259 770 -7 -742 -230 641 465 -514
3293 -514 -600 305 776 -74 -780 -174 747 412 -597 -567 424 729 -184 -722 -50 703 300 -614 -520 430 658
3314 658 -220 -762 -14 757 221 -699 -433 547 579 -343 -689 147 735 121 -661 -340 592 537 -396 -668 213
3335 213 773 24 -761 -276 656 446 -544 -626 302 680 -80 -730 -191 676 434 -556 -599 399 709 -149 -769
3356 -769 -59 795 319 -619 -478 483 656 -249 -699 32 715 221 -653 -440 526 620 -359 -729 138 737
3376 737 58 -724 -308 600 467 -460 -629 192 701 11 -722 -221 656 468 -489 -553 351 685 -113 -714
3396 -714 -74 682 337 -559 -470 396 644 -185 -711 -48 675 277 -624 -471 483 587 -284 -676 75 693
3416 693 122 -606 -330 503 489 -323 -628 138 689 106 -675 -269 564 468 -438 -587 269 649 -41 -617 -169
3437 -169 561 365 -424 -508 258 614 -76 -682 -111 648 315 -487 -461 393 566 -159 -591 -16 580 244 -507
3458 -507 -401 383 558 -217 -637 11 647 172 -588 -364 457 484 -314 -568 111 590 104 -581 -269 472
3478 472 451 -323 -580 179 634 28 -604 -192 548 396 -397 -495 263 585 -47 -560 -113 562 322 -464 -476
3499 -476 302 595 -145 -669 -76 591 241 -559 -427 395 520 -239 -617 13 593 205 -541 -384 450 534
3519 534 -278 -612 154 662 78 -586 -233 527 427 -376 -511 213 572 4 -605 -217 539 367 -457 -508
3539 -508 280 589 -103 -617 -103 567 252 -463 -409 337 527 -133 -566 -17 593 216 -517 -384 408 522
3559 522 -265 -595 89 595 103 -542 -265 439 437 -296 -521 121 573 68 -553 -261 484 411 -389 -498 225
3580 225 551 -47 -544 -120 460 273 -361 -421 208 508 -63 -551 -101 518 233 -443 -394 328 452 -183 -522
3601 -522 19 487 172 -415 -326 307 453 -165 -505 11 528 147 -462 -275 402 423 -284 -480 108 495 45
3622 45 -464 -260 377 355 -283 -481 106 513 46 -572 -204 450 321 -362 -433 227 479 -53 -469 -122 441
3643 441 281 -335 -395 201 509 -55 -516 -63 536 221 -419 -330 309 439 -180 -466 -4 476 174 -427 -343
3664 -343 321 433 -221 -536 59 537 83 -526 -238 445 353 -315 -456 108 504 36 -488 -173 411 369 -327
3685 -327 -469 228 534 -56 -543 -82 500 251 -425 -366 273 439 -120 -494 -43 459 195 -422 -339 290 439
3706 439 -185 -508 41 526 106 -474 -235 369 358 -268 -445 112 478 64 -466 -227 393 362 -305 -431 176
3727 176 473 -36 -487 -120 421 247 -347 -352 208 415 -37 -450 -113 395 249 -373 -347 296 454 -153 -433
3748 -433 9 443 113 -372 -246 245 328 -154 -403 -22 426 125 -423 -266 336 332 -236 -399 108 399 24
3769 24 -394 -141 348 291 -213 -352 114 434 56 -431 -152 396 283 -288 -331 211 411 -73 -403 -85 371
3790 371 208 -277 -328 188 397 -59 -431 -101 403 184 -379 -286 266 378 -160 -378 32 403 124 -323 -243
3811 -243 256 365 -150 -398 56 461 83 -394 -191 391 328 -262 -393 137 398 21 -386 -178 359 280 -277
3832 -277 -410 130 443 -37 -443 -108 417 216 -368 -344 264 396 -123 -387 -24 366 153 -343 -295 272 403
3853 403 -154 -439 25 446 102 -416 -197 333 293 -224 -358 104 375 54 -392 -180 310 302 -223 -375 131
3874 131 431 10 -438 -106 379 199 -309 -288 195 376 -71 -361 -92 350 209 -320 -321 226 368 -133 -425
3895 -425 -14 370 96 -365 -198 268 272 -143 -313 38 360 109 -332 -212 312 285 -197 -358 117 386 -3
3916 -3 -377 -126 303 205 -200 -294 97 325 -16 -327 -135 298 233 -269 -329 169 345 -95 -363 -33 347 165
3938 165 -262 -234 194 298 -48 -322 -42 343 155 -287 -262 235 310 -158 -336 37 305 74 -301 -192 230
3959 230 254 -135 -321 16 327 60 -355 -196 290 250 -226 -321 114 359 -15 -349 -72 287 201 -211 -282 140
3981 140 365 4 -349 -91 361 229 -296 -293 219 315 -126 -342 9 308 99 -280 -216 215 296 -102 -355 16
4003 16 370 71 -358 -185 310 254 -176 -293 98 342 -20 -339 -137 243 213 -197 -314 97 347 -1 -352
4024 -352 -102 359 196 -281 -264 206 292 -63 -295 -28 292 154 -243 -229 186 315 -101 -368 23 350 96
4045 96 -334 -167 255 236 -181 -279 61 257 52 -287 -165 229 223 -177 -314 89 331 18 -337 -83 270 157
4067 157 -213 -195 140 275 -14 -245 -70 281 186 -203 -228 152 312 -79 -318 -39 306 93 -249 -201 161
4088 161 210 -88 -273 -21 276 115 -252 -219 176 264 -137 -288 47 298 61 -275 -106 230 220 -110 -221
4109 -221 55 257 42 -271 -143 236 207 -206 -276 120 276 -35 -289 -54 255 138 -211 -203 144 248 -42
4130 -42 -274 -81 287 152 -242 -231 178 276 -94 -310 2 291 75 -245 -171 185 248 -98 -259 14 312 93
4152 93 -288 -157 226 245 -174 -282 89 324 -6 -268 -103 245 169 -168 -249 87 281 -2 -305 -98 256
4173 256 143 -248 -223 160 228 -102 -283 -30 234 91 -211 -189 139 219 -85 -281 -7 288 79 -284 -163
4194 -163 248 227 -153 -243 106 256 26 -216 -101 217 186 -149 -262 72 291 -28 -314 -64 258 128 -221
4215 -221 -220 117 245 -68 -254 -54 177 99 -214 -192 109 258 -57 -235 -15 286 102 -235 -132 177 213 -100
4237 -100 -203 11 230 41 -188 -151 160 197 -128 -269 38 257 5 -284 -128 194 158 -150 -208 55 211
4258 211 0 -223 -124 191 135 -127 -235 93 262 -24 -284 -25 230 91 -170 -167 118 176 -16 -230 -28 198
4280 198 117 -186 -186 171 210 -67 -249 20 242 33 -230 -120 180 190 -89 -199 23 235 77 -204 -132 176
4302 176 192 -143 -220 73 246 -35 -254 -86 200 117 -165 -210 57 239 -4 -226 -71 206 136 -162 -223 143
4324 143 260 -76 -254 -7 221 73 -184 -132 138 204 -64 -200 7 214 88 -234 -130 176 178 -141 -230 75
4346 75 220 -10 -235 -83 189 148 -155 -209 53 221 38 -235 -82 226 141 -198 -175 158 214 -45 -178 21
4368 21 207 75 -165 -152 97 204 -69 -221 -17 228 43 -230 -146 156 150 -120 -195 10 161 10 -160 -104
4390 -104 139 155 -91 -190 31 211 38 -197 -69 210 125 -157 -168 94 191 -4 -174 -66 164 117 -135 -144 51
4413 51 209 -35 -208 -7 193 93 -174 -118 132 186 -68 -182 -10 163 81 -169 -157 101 188 -74 -206 14
4435 14 179 18 -208 -106 147 132 -105 -142 44 171 28 -172 -100 137 152 -116 -182 54 226 8 -210 -24
4457 -24 210 124 -136 -116 98 178 20 -185 -57 185 96 -158 -148 95 190 -76 -221 -15 181 37 -173 -114 98
4480 98 138 -60 -175 14 191 40 -184 -104 171 173 -94 -197 79 206 -3 -192 -52 158 95 -115 -125 65
4502 65 168 -23 -179 -47 165 92 -190 -151 103 202 -91 -220 -24 211 27 -163 -116 117 161 -54 -186 10
4524 10 185 80 -183 -99 146 152 -118 -175 56 145 8 -138 -47 139 130 -84 -140 34 149 24 -200 -94 151
4547 151 90 -138 -140 97 151 -68 -154 -14 145 67 -127 -120 69 141 -1 -167 -32 170 33 -148 -98 129 118 -89
4571 -89 -126 34 129 45 -122 -80 108 116 -43 -155 11 154 36 -154 -52 128 114 -93 -121 59 134 14 -139
4594 -139 -79 101 97 -109 -148 45 134 14 -188 -40 145 94 -136 -134 77 130 -46 -142 -30 148 98 -96 -115 94
4618 94 168 -42 -180 1 203 60 -152 -88 125 98 -90 -140 28 137 14 -144 -85 106 130 -128 -168 16 181
4641 181 -9 -169 -83 161 74 -120 -96 91 123 -22 -140 -33 150 84 -100 -111 121 149 -47 -165 2 161
4663 161 24 -156 -67 103 134 -88 -148 10 139 36 -145 -101 101 112 -121 -166 41 148 -20 -162 -35 117
4685 117 65 -113 -109 56 128 0 -138 -58 115 117 -119 -125 76 139 -63 -134 41 133 45 -102 -63 71 100 -17 -98
4710 -98 -35 111 33 -109 -71 97 102 -80 -100 59 131 -14 -134 -23 83 98 -44 -112 -7 133 15 -139 -72 105
4734 105 101 -100 -97 56 88 -19 -131 -28 123 54 -57 -88 29 109 15 -112 -49 138 64 -125 -76 87 119 -28
4758 -28 -104 6 90 5 -76 -102 41 93 -22 -145 1 114 31 -145 -81 105 77 -70 -105 46 118 42 -98 -37 120
4783 120 89 -60 -128 7 135 3 -146 -26 135 47 -105 -116 52 108 -38 -110 -22 99 88 -99 -108 46 139 -33
4807 -33 -156 -29 144 38 -144 -67 116 102 -56 -96 5 110 54 -105 -83 113 124 -66 -136 29 152 -15 -140
4830 -140 -20 136 86 -71 -71 72 105 -21 -123 -33 98 90 -111 -101 75 141 -57 -139 0 149 -7 -129 -52 96
4854 96 71 -39 -91 8 89 27 -93 -58 81 93 -56 -131 41 129 -33 -99 -22 118 30 -55 -61 32 97 17 -85 -5 97
4881 97 76 -47 -89 61 106 -13 -100 -9 56 34 -87 -65 14 53 8 -78 -44 90 40 -100 -69 62 89 -42 -95 12
4907 12 101 -3 -70 -22 53 66 1 -90 -6 97 52 -115 -78 78 92 -67 -92 25 88 -3 -79 -43 62 47 -40 -90 6
4934 6 96 6 -124 -70 109 81 -72 -113 55 116 -5 -128 -14 84 39 -78 -74 60 108 1 -120 -30 124 46 -116
4959 -116 -55 92 97 -66 -130 24 89 26 -85 -66 57 84 -48 -119 19 115 0 -130 -51 107 66 -112 -97 58
4983 58 74 -31 -101 -7 81 67 -71 -80 67 108 -22 -126 21 116 20 -102 -45 76 99 -47 -82 19 78 0 -72 -61
5009 -61 64 83 -57 -105 54 98 3 -128 -4 100 36 -78 -50 52 50 -34 -79 -19 55 26 -67 -84 35 78 -22 -109
5035 -109 -38 84 10 -83 -39 67 57 -11 -42 -10 87 32 -50 -66 55 70 -65 -106 23 89 1 -67 -33 47 28 -10 -36
5062 -36 2 46 19 -48 -64 48 57 -42 -79 10 81 -22 -78 0 65 26 -37 -58 12 80 21 -64 -29 85 66 -55 -108 33
5090 33 71 -39 -96 16 105 22 -59 -59 -5 61 -2 -74 -33 100 77 -100 -77 80 96 -51 -73 29 90 3 -63 -59 75
5117 75 53 -18 -110 32 84 25 -96 -83 115 56 -81 -77 56 107 -38 -74 1 66 48 -61 -43 53 76 -29 -106 -16 97
5144 97 31 -116 -72 75 54 -79 -80 64 71 -31 -77 -27 60 39 -43 -71 27 116 9 -90 -2 95 55 -69 -51 64 51
5171 51 -21 -62 3 61 27 -54 -36 28 89 -21 -92 -7 78 10 -88 -11 75 40 -60 -10 31 24 12 -42 -30 36 75 -24 -58 35
5201 35 70 -4 -51 4 76 28 -29 -42 29 18 4 -33 -29 69 44 -38 -79 37 50 -14 -74 -2 58 -1 -31 -22 13 16 0 -49 -2
5232 -2 18 50 -41 -63 16 81 16 -68 -7 62 23 -34 -7 33 60 -11 -35 -19 21 26 -37 -75 35 81 -8 -69 2 76 12 -43 -27
5263 -27 53 44 -13 -63 11 79 17 -59 -61 47 76 -56 -95 43 76 11 -83 8 42 29 -72 -26 31 61 -2 -50 -25 90 51
5292 51 -74 -54 72 99 -81 -67 45 84 -11 -40 -19 57 60 -47 -97 18 96 19 -100 -35 93 45 -89 -88 59 93
5318 93 -58 -82 9 33 -6 -45 -16 38 49 -5 -62 28 99 21 -67 -19 104 53 -62 -56 51 61 -4 -38 -1 18 29 -39 -71
5347 -71 9 60 17 -90 -20 77 30 -72 -25 37 8 -30 -20 -1 47 14 -11 -29 0 56 19 -47 3 60 26 -26 1 38 27
5376 27 -33 -34 -12 28 11 -15 -36 11 51 1 -64 -22 47 -7 -55 -17 56 -3 -28 -20 -29 -3 11 -33 -46 -3 56 20 -45 1 50 4
5408 4 -59 -7 43 16 -52 -36 21 20 23 -34 -22 24 71 -7 -74 7 78 -2 -85 -15 69 17 -53 -24 17 22 -32 -37 -33 20 63 -42 -80
5441 -80 37 61 -32 -93 5 81 -3 -59 -24 71 66 -34 -39 35 61 27 -62 -60 59 67 -54 -73 63 99 -31 -64 25 75 -2
5470 -2 -66 -43 38 49 -8 -66 -15 66 23 -75 -51 59 57 -89 -87 40 63 -39 -57 2 54 -7 -22 -12 14 40 5 -70 -8 95
5500 95 49 -70 -53 50 39 -57 -42 29 45 -19 -39 -11 15 -13 -21 -73 -3 46 -13 -61 -18 47 19 -46 -30 35 9 -44 -28 -23
5530 -23 2 23 8 -28 -15 40 -5 -55 -9 37 33 -22 1 28 25 -4 -2 -23 -3 30 5 -29 -27 22 11 -31 -51 28 32 -23 -9 30 8
5563 8 11 18 -21 -19 37 8 -47 -13 49 27 -81 -31 45 29 -49 -33 24 5 -12 -37 4 37 47 -12 -50 11 64 17 -115 -16 64
5594 64 35 -63 -35 62 50 -46 -50 -4 48 -4 -49 -56 -8 52 -50 -84 3 97 -11 -93 -8 95 16 -54 -48 68 54 -10 -41 -42
5624 -42 62 43 -60 -50 62 63 -28 -74 7 65 -21 -87 28 70 -1 -34 -9 24 40 -6 -56 -47 75 30 -59 -72 65 65 -50
5653 -50 -42 37 59 -22 -31 9 37 16 -9 -40 21 59 22 -60 -12 49 36 -37 -41 67 43 -40 -34 5 3 -12 -30 -1 -35 16 21 -14 -42
5686 -42 15 10 -62 -28 33 7 -53 -2 42 -27 -19 -1 -7 -18 13 45 -37 -30 43 32 -25 -17 29 27 -18 -17 2 -4 28 11 16 -45 5 22 -18
5721 -18 -23 17 42 -29 -48 24 15 -34 -46 -15 17 -3 -3 -53 -22 21 46 -52 -41 21 50 -60 -46 58 44 -30 -57 24 26 10 -48
5752 -48 -5 19 45 -4 -86 -5 75 19 -81 -40 65 33 -33 -72 31 33 -44 -66 -29 52 -3 -15 -79 8 98 -14 -101 -4 95
5781 95 -13 -78 -32 90 35 -52 -42 32 61 -7 -39 -22 35 44 -46 -71 0 67 -19 -83 -1 73 -3 -87 -15 64 -9 -45 -34 3
5811 3 45 14 -45 -38 56 41 -39 -57 52 40 -33 -76 38 48 -22 -26 15 39 -7 -6 -23 26 35 11 -29 -33 47 41 -45 -48 28 32 -54 -14
5845 -14 47 11 -35 8 12 -24 20 13 -19 -29 10 9 -42 -26 25 3 -55 -5 -3 -7 -27 8 -5 -45 5 17 -11 -36 -11 23 -1 -23 34
5878 34 16 -13 1 18 -17 11 46 9 -42 4 55 10 -52 31 53 -7 -66 7 34 -14 -11 -33 -1 6 -6 -18 -44 53 29 -62 -76
5909 -76 41 83 -30 -53 70 64 -9 -25 9 40 5 11 -28 -17 58 17 -73 -8 89 45 -92 -43 66 44 -40 -46 36 38 -17 -36
5939 -36 -29 5 42 -20 -90 2 53 9 -105 -21 80 7 -73 -51 69 28 -41 -50 -3 12 3 -19 -45 39 48 -19 -58 20 74 -27
5969 -27 -103 30 82 -17 -62 -4 30 18 -18 -37 -15 27 0 -2 -59 35 53 -31 -58 30 75 -18 -81 22 30 -13 -41 -3 10 -7
5999 -7 -13 -49 -23 12 22 1 3 42 44 -25 -28 64 23 -51 -25 38 -9 -24 23 12 -25 -3 11 -1 -1 -5 30 -39 -21 7 -20 -27 5 41
6033 41 -17 -41 12 -1 -58 -5 22 25 -31 6 19 24 -16 9 31 9 10 32 -7 -10 57 17 -50 -9 73 -10 -60 4 40 -31 -73 -30
6065 -30 67 7 -4 -29 -7 10 15 -29 -53 6 64 -72 -54 21 75 -11 -76 43 68 25 -39 5 34 -5 21 -24 -18 30 42 -42
6095 -42 -40 61 56 -71 -83 68 67 -43 -66 44 23 11 -38 -25 11 38 -19 -58 -7 77 26 -80 -34 60 36 -46 -25 60 45
6124 45 -41 -22 5 41 9 -25 -46 34 53 2 -70 8 71 -15 -77 30 70 5 -42 -7 53 23 -35 3 10 18 -4 -37 -35 30 55
6155 55 -43 -67 -2 42 -8 -53 31 33 -28 -40 -7 22 1 -7 3 10 12 66 6 -55 19 44 -27 -23 28 13 -47 -3 26 7 -44 6 26
6188 26 -37 -26 1 -9 -22 8 19 -24 1 12 -8 -25 12 49 -29 -40 26 32 -60 -58 74 37 -41 -28 26 -1 -9 -1 11 4 8 25 -23
6221 -23 6 34 16 -47 -10 75 19 -83 -25 49 9 -39 -23 25 -4 -4 -7 -4 4 28 -14 -59 11 66 -32 -86 7 109 -28 -72 1
6252 1 54 -3 -34 -9 29 23 -4 -47 -22 47 13 -44 -69 64 69 -33 -70 36 58 -26 -75 3 22 -16 -31 -40 5 32 11 -51 -8
6283 -8 40 43 -70 -73 51 26 -56 -31 51 55 -28 -16 0 16 -6 -1 -24 45 69 7 -61 12 76 16 -58 -9 68 17 -52 -21 43 -14
6315 -14 -32 -2 -17 -18 7 -8 -67 7 28 -8 -54 -5 44 -46 -60 45 34 -39 -17 28 12 -27 -30 2 -19 1 -13 -12 -26 28 16
6346 16 -48 9 18 35 -33 -20 50 -18 -58 15 13 -19 -47 -3 28 -23 10 -15 -13 1 10 -16 -44 28 11 -67 -43 28 52 -66 -55 17
6378 17 27 -59 -43 31 5 -8 4 18 13 26 15 -9 -14 70 33 -62 -1 42 17 -72 -25 57 31 -21 -31 17 -1 -14 -9 -26 4 46
6410 46 -18 -45 5 58 -20 -62 8 71 3 -55 13 69 18 -29 0 26 26 15 -24 -18 22 51 -27 -72 41 90 -32 -52 8 56
6440 56 -21 -31 -2 28 -2 -26 0 -4 8 25 -44 -25 18 38 -56 -43 51 51 -45 -48 56 13 -27 -26 44 7 15 14 -15 -18 36 -8 -49
6473 -49 -19 37 16 -47 6 48 17 -49 -32 19 -8 -26 -8 -4 -16 -24 8 -39 -17 7 -4 -29 4 45 -48 -55 11 17 -39 -27 11 18 -25
6506 -25 2 26 -5 -2 4 2 1 -2 18 -19 -15 26 7 -56 -28 53 3 -50 -4 56 -23 -33 1 39 -11 3 12 0 10 -12 12 -40 28 36
6540 36 -28 -71 36 35 -37 -63 35 33 -29 -50 39 21 12 22 -22 18 26 11 -33 -19 43 47 -59 -34 78 32 -78 -28 57 34 -60
6571 -60 -15 -7 20 -14 -30 -30 -38 33 4 -67 7 45 -15 -102 -30 83 4 -56 -6 49 8 -22 -15 11 28 9 -27 -39 25 70 -45
6602 -45 -47 11 67 -35 -80 1 57 -10 -51 3 25 -1 -1 -22 -4 23 34 -79 -47 20 26 -36 -47 38 53 -73 -32 24 36 -24
6632 -24 -29 9 21 7 -9 -12 -4 33 1 -43 -3 45 16 -53 -25 49 8 -49 -19 21 -6 -22 1 0 -4 11 14 -30 -2 22 -11 -30 26
6665 26 27 -41 -37 13 47 -30 -22 34 35 -50 -21 32 31 -25 5 26 8 10 21 -38 -10 25 15 -30 -7 58 1 -17 -21 50 1 -13 9 30
6699 30 -16 -21 -22 -14 6 8 -26 -39 3 42 -30 -72 17 54 -6 -34 21 41 -23 -26 20 25 -9 -10 11 17 55 27 -4 -29 36 52 -45 -55
6733 -55 61 22 -42 -38 27 52 -8 -39 9 -4 -2 -29 -27 18 9 -36 -60 -10 55 18 -37 -9 67 21 -55 -9 28 27 -12 -11 5 -4 32
6766 32 -17 -53 32 62 -25 -46 18 82 -13 -54 28 50 -7 -42 21 37 -10 5 9 6 38 15 -22 -16 15 19 -21 -7 53 37 -22 -36
6798 -36 41 26 -22 -3 17 2 2 0 -2 16 5 9 -18 -11 58 9 -53 1 47 29 -61 1 53 -3 -30 -29 15 17 11 -1 -18 -17 18 -8 -50
6833 -50 3 11 -21 -33 29 33 -27 -20 39 35 -22 10 30 48 2 10 -4 10 18 16 -23 9 24 17 -42 -33 43 13 -49 -23 45 7 -45 -8 10
6868 10 6 -40 -40 -17 22 9 -33 -41 7 44 -17 -53 -1 37 -27 -58 10 50 -7 -48 -8 32 -12 -4 -11 -19 10 58 -28 -40 54 45 -32 -53
6902 -53 55 56 -39 -30 9 23 -30 -32 -13 19 31 1 -22 1 44 24 -35 3 58 24 -45 -4 55 19 -51 -40 40 5 10 -10 0 23
6934 23 15 -29 -31 3 41 -7 -45 -3 58 17 -43 8 68 19 -30 11 18 14 1 -11 -1 6 28 -19 -36 -13 40 -32 -33 19 41 -32 -46
6967 -46 38 31 4 -8 18 13 11 17 -4 6 5 -22 -17 -17 35 17 -23 4 37 -5 -20 13 49 -12 -9 7 19 -10 -3 4 -10 -16 5 7 -17 28
7003 28 36 -13 -76 23 39 -10 -32 48 37 -8 -26 26 32 5 32 7 4 8 4 -17 -25 63 8 -38 -36 34 5 -35 -20 43 -1 -28 1 16
7037 16 -8 -16 -24 1 9 20 -9 -33 4 55 -7 -46 34 58 0 -51 10 66 -6 -17 20 27 25 -3 5 -27 49 29 -5 -21 36 58 -23
7070 -23 -62 16 68 -34 -33 32 58 -10 -40 -1 12 7 -24 -13 -5 24 10 -38 -19 47 36 -53 -44 57 47 -36 -24 36 14 -3 0 -3
7102 -3 11 6 -2 -19 2 33 27 -56 22 48 6 -24 9 53 -14 -23 -7 24 2 -22 -8 0 -5 40 -42 4 14 15 -16 -43 6 71 -33 -26
7136 -26 25 5 13 -8 24 34 -19 8 -7 9 16 8 -7 -26 30 18 -35 -23 49 9 -21 -4 39 11 -46 -5 54 3 -26 -7 -13 -11 3
7169 3 -15 -42 9 39 -1 -22 24 50 -17 -38 12 51 0 -13 50 38 6 -6 -15 15 34 7 -12 -16 14 14 -27 -15 35 27 -60 -15 34
7202 34 29 -34 -22 -4 9 33 -15 -17 12 4 3 -30 17 35 11 -57 -1 82 16 -34 -7 37 17 -19 -1 10 10 25 -9 16 19 39 -24
7235 -24 -20 26 47 -19 -48 17 60 -13 -51 4 25 6 -44 -17 40 31 -12 -19 -5 27 20 -46 -8 52 29 -28 -12 37 21 -28 -3 15
7267 15 32 0 -11 0 12 21 32 -13 -14 25 11 -24 -5 37 1 -58 8 58 -35 -37 -8 23 2 -10 -1 7 5 1 -6 -15 5 25 -13 -27 56
7302 56 37 -13 -14 16 43 -4 -18 35 29 22 10 -1 12 24 6 -17 4 37 -5 -26 -16 32 10 -31 -31 29 -19 -20 -14 13 8 -17 -5 -19
7336 -19 -3 4 -23 -6 5 40 -15 -34 20 24 -3 -59 23 55 -5 -16 9 20 1 2 5 21 50 17 -41 17 35 29 -15 -29 38 20 -13
7369 -13 -22 41 7 3 -25 -3 9 19 -17 -6 -18 24 19 -32 23 39 2 -42 -4 37 13 -29 5 26 23 -45 17 23 8 -5 2 18 31
7402 31 10 -12 -30 18 36 -18 -27 12 9 -10 -34 0 46 -6 -5 -8 -2 -1 13 -9 -26 21 -12 -9 3 31 15 -28 6 28 24 -9 -14 11 16
7437 16 6 19 19 -4 1 -10 -6 -1 28 17 -14 25 36 -28 -26 5 13 -7 -41 8 16 0 -11 -15 -18 2 -14 -8 -5 17 13 -24 -18 22 36 -6 -4
7474 -4 29 27 9 -9 28 30 -13 14 11 -3 7 18 -6 12 11 15 -19 -36 6 8 -36 -10 33 -27 -38 -35 0 3 -16 -23 -12 0 30 -11 -20 -8
7510 -8 49 -8 -12 1 16 -16 -11 1 28 -18 -35 13 14 14 -9 -1 8 2 28 -26 -7 29 -3 -27 -39 8 35 -7 -21 18 34 -25 -14 -2
7544 -2 3 12 -11 -24 8 25 -13 -33 6 32 2 -51 -7 22 15 -32 6 29 23 -8 -24 40 12 -8 -11 -18 1 18 -36 -24 37 37 -3 -53
7578 -53 14 23 -13 -26 19 54 4 -35 -5 23 3 7 -12 -12 14 16 -35 1 18 23 -25 9 23 43 -25 9 3 22 -28 -7 10 35 -10
7611 -10 15 -15 -3 51 11 -37 -17 21 -9 -39 -22 42 -22 -5 -17 -6 2 -42 -12 -6 -1 15 -32 -10 15 20 -12 -23 9 37 -15 -66
7643 -66 10 52 -10 -24 18 33 5 -15 0 9 11 -3 -3 1 24 8 -22 -9 39 18 -51 -20 35 2 -3 -7 17 1 15 -35 8 -9 -6 5
7677 5 -1 -12 33 -26 -27 -7 47 -1 -27 0 2 10 -1 4 27 10 -23 -9 21 12 8 -15 -20 -24 17 -12 -25 15 18 -17 -27 -6 21 -3 -26 34
7713 34 26 -12 -20 -11 -27 -6 -1 -9 2 27 12 -18 -1 43 12 -26 2 3 35 2 -12 1 20 12 9 -12 26 26 -7 -5 3 32 18 -14 -14 32
7749 32 3 -44 -15 23 16 -34 -6 15 9 -6 -23 8 17 9 -4 -28 23 26 7 -13 44 14 -9 -28 -1 29 3 -9 23 7 -3 -19 -21
7782 -21 -26 3 4 -35 -4 32 4 -59 2 19 -5 -31 -11 37 -5 12 1 13 -13 11 -17 -20 -3 1 17 -7 27 30 8 -34 -3 25 -16
7815 -16 -6 30 25 -2 -7 -13 20 6 -2 -28 -6 1 27 -29 -9 27 7 -17 -25 12 -3 -20 -44 18 2 -33 -8 -7 0 10 -8 -15 -23 -7 -21
7850 -21 -32 -8 22 29 -9 1 40 17 -8 1 4 8 13 -12 -18 0 16 -11 -10 8 -9 -23 -21 12 18 -25 -41 15 0 4 -28 14 15 -5 -20 -15
7886 -15 30 17 3 -10 -9 4 10 -43 -20 18 13 11 -1 -6 3 11 -12 19 2 -4 -4 -19 -10 0 -35 -12 2 10 -7 -22 0 13 -6 -20 -15 18
7922 18 2 -33 8 -16 1 20 -22 26 -19 21 -44 -44 10 -4 22 -28 40 17 -9 -29 -6 22 -12 -11 14 16 3 3 2 15 17 37 -7
7955 -7 -5 3 4 -17 -11 15 17 -27 -8 -6 -7 1 6 -4 23 23 3 13 -1 23 -2 -21 8 39 -3 -17 17 45 6 26 12 43 -12 -6 -5 7 18
7992 18 3 -18 10 37 11 -27 -21 5 2 -14 -23 13 20 -18 17 -21 1 1 -6 11 -9 24 2 5 -4 33 -22 -6 18 41 0 -14 11 24
8026 24 22 8 20 22 39 -16 7 -9 35 16 -14 -35 4 42 -4 -33 3 39 1 -25 -1 20 -12 -11 -15 -8 2 -49 -17 -15 -3 13 -20
8059 -20 -7 38 -6 -9 4 -5 13 -5 -11 15 -8 31 -4 1 10 15 -1 -1 -10 8 -14 -3 6 24 -10 -26 -21 18 10 -24 6 4 8 -33 -3 -10 30
8096 30 5 6 -2 13 20 -26 -9 12 25 20 9 20 6 3 -24 11 20 4 -18 -10 3 -9 -6 0 14 26 18 -10 1 29 5 -23 2 2 -2 -24
8132 -24 -23 6 10 -21 2 16 -1 -13 -23 19 -12 -7 14 -12 -11 41 6 -8 19 39 8 -8 14 7 3 3 -7 8 -8 0 2 0 -10 -11 -33 2
8168 2 -7 12 -10 -14 13 3 -28 -22 -12 10 -2 -19 14 4 7 -17 -5 -2 16 -15 -11 0 22
8191B2
$$ Imaginary data points
##PAGE= N=2
##DATA TABLE= (X++(I..I)), XYDATA
0 0 0 0 0 0 0 0 0 0 0 0 0 8 -8 8 -8 9 -16 16 -24 24 -32 40 -48 54 -64 73 -88 97 -113 130 -151 169 -193
33 -193 221 -248 280 -315 352 -394 440 -489 545 -604 671 -740 817 -904 997 -1098 1208 -1332
51 -1332 1468 -1619 1786 -1972 2182 -2422 2696 -3015 3388 -3836 4383 -5071 5961 -7167 8899
66 8899 -11609 16475 -27875 110532 -65617 -307708 79108 245085 -19087 -203560 -11303
77 -11303 121267 66321 -50126 -102886 -35399 145218 101712 -166686 -162958 181615 195809
88 195809 -175819 -213476 160538 204206 -128010 -181623 87084 140873 -34807 -93076 -18224
99 -18224 39044 71711 11534 -116206 -55195 152442 87104 -173640 -106017 181109 111384
110 111384 -171047 -104217 146176 85878 -108336 -60489 62003 31218 -12528 -4233 -36550
121 -36550 -18567 79625 33356 -113832 -40348 134598 38203 -140976 -28226 133114 12531
132 12531 -112588 6382 83367 -23952 -47753 38464 11149 -46457 23609 47876 -51515
143 -51515 -41236 70348 27271 -78591 -7350 75969 -16493 -64569 40344 45386 -62315
154 -62315 -22277 78718 -2319 -88618 23905 89635 -39907 -81521 48012 64656 -46921
165 -46921 -40049 37564 11091 -20038 20377 -2178 -50127 27327 76551 -50648 -96068 69125
177 69125 107052 -79690 -108470 80135 99876 -70423 -83256 50013 59405 -21687 -31733
188 -31733 -12571 1909 48218 26701 -81530 -51870 108325 71628 -125090 -84317 130104
199 130104 90224 -121374 -88507 100047 80895 -66823 -67449 25681 50474 19943 -31272 -65362
211 -65362 11538 105804 6972 -137653 -23875 156547 37398 -161327 -48051 150085 54619
222 54619 -124646 -57833 86854 57688 -40593 -54798 -9373 50080 58783 -43216 -101755 35564
234 35564 135084 -26323 -154552 16840 159372 -6398 -148817 -4448 124631 15531
244 15531 -89621 -26921 47287 37474 -2652 -47320 -40568 54785 77275 -59927 -105021 61218
256 61218 120958 -58486 -124450 51271 115967 -39510 -96524 24371 69471 -5985 -37246
267 -37246 -13213 4378 32661 26396 -49786 -51437 63607 68763 -72388 -76956 75179 75471 -72016
280 -72016 -65766 62411 48975 -47997 -28509 29191 6528 -8514 13498 -12535 -29355 31906
292 31906 39185 -47587 -41702 58525 37488 -63237 -26744 62306 12110 -55245 4889 43825
304 43825 -21159 -28985 34673 12790 -43382 2855 45651 -16619 -41528 26487 30614 -32369
316 -32369 -14871 33168 -4672 -29962 25132 23098 -44449 -13994 60164 4449 -69997 4531
328 4531 72976 -10869 -67829 14370 55464 -13633 -36291 9223 12653 -1497 13297 -8482
340 -8482 -38897 19015 61158 -28847 -78284 35702 87729 -38842 -89322 36604 82156 -29289
352 -29289 -67517 16709 46693 -164 -21729 -18603 -4515 38009 30167 -55081 -52186 68443
364 68443 69476 -75361 -79836 75224 83288 -66975 -79486 51239 69104 -29248 -53692 2612
376 2612 34334 25472 -13662 -53065 -7226 76424 25770 -93695 -41077 102380 51725 -101585
388 -101585 -57244 91252 57867 -71683 -53584 45320 45967 -13979 -35443 -18614 24017 49914
400 49914 -12311 -76311 1706 95532 7205 -105636 -14207 105433 18871 -95665 -22054
411 -22054 76620 23330 -51142 -24002 21207 23789 9553 -23367 -38512 22789 62679 -21743
423 -21743 -79686 20530 88459 -18305 -87882 15605 79054 -11462 -62671 6532 41251
434 41251 -462 -17012 -6320 -7193 13358 28718 -20493 -45712 26505 55993 -31548 -59377
446 -59377 34327 55431 -35016 -45481 32946 30842 -28240 -13692 21259 -3489 -12169 18863
458 18863 2270 -30051 8259 36344 -17743 -36483 25892 31188 -31572 -21053 34416 7635
470 7635 -34369 6948 31239 -21057 -26040 32185 18758 -39301 -10924 40749 2816 -36637
482 -36637 4321 26990 -10052 -12805 14057 -3961 -15857 21923 16194 -38279 -14652 51696
494 51696 12432 -59707 -9634 61722 7088 -56913 -5220 45594 4246 -28910 -4611 8154
506 8154 5715 13960 -7983 -35913 10152 54569 -12262 -68554 13138 75984 -12448 -76023 9810
519 9810 68812 -4652 -54684 -2279 35581 11165 -12709 -20422 -10945 29677 33659 -37265 -52952
532 -52952 42228 67046 -43639 -74917 40621 75560 -33477 -69647 22010 57351 -7627
543 -7627 -40593 -8948 20684 25737 11 -41294 -19642 53960 36521 -62126 -48848 65126
555 65126 56179 -61906 -57637 53204 54017 -39006 -45570 21002 33941 -504 -20356 -20437 6384
568 6384 39740 6342 -55910 -17158 66694 24716 -71618 -29166 69599 30106 -61232 -28261
580 -28261 47071 24174 -28602 -18639 7855 12805 13343 -7030 -32484 2409 48191 1116 -58419
593 -58419 -2918 62732 3359 -60633 -2723 52643 1271 -39914 173 23766 -1463 -6498
605 -6498 1669 -10482 -1019 24964 -1045 -35813 4048 41829 -7851 -42647 11994 38599 -15640
618 -15640 -30105 18660 18906 -19885 -5975 19556 -6455 -17007 17210 12675 -24755 -6793 28200
631 28200 -260 -27377 7411 22107 -14455 -13707 20078 2761 -24275 8613 26234 -19311
643 -19311 -26152 27494 23876 -32046 -19681 32380 14319 -27869 -7879 19465 1518 -7469 4772
656 4772 -6102 -10015 20254 14289 -32872 -17079 42585 18373 -48167 -18499 48416 17260 -43611
669 -43611 -15409 33487 12807 -19473 -10299 2496 7709 15371 -5422 -32446 3446 46979 -1487
682 -1487 -57044 -223 62010 2421 -60613 -4698 53518 7715 -40853 -10958 24255 14602
694 14602 -5166 -18147 -14467 21057 32515 -23142 -47576 23535 57674 -22300 -62395 18762
706 18762 60959 -13319 -53983 6025 42100 2570 -26655 -11728 9502 20804 7969 -28606
718 -28606 -23709 34740 36617 -38031 -45203 38351 49202 -35271 -48263 28857 42733 -19730 -33706
731 -33706 8215 21978 4233 -9377 -16960 -3212 28400 14126 -37699 -22647 43674 27979
743 27979 -45690 -29794 43606 28469 -37309 -24169 27743 18098 -15408 -10735 2067 3480 11353
756 11353 2997 -23274 -7928 32581 10740 -38489 -11516 40233 10051 -38196 -7199 32231
768 32231 3108 -23615 1092 13011 -4934 -1812 7687 -8724 -8856 17716 8368 -24014 -5858
781 -5858 27302 2122 -26981 2900 23729 -8040 -17667 12996 9916 -16814 -1426 18992 -6708
794 -6708 -19248 13210 17183 -17634 -13331 18893 7582 -17372 -953 12852 -6242 -6255 13017
807 13017 -1563 -18737 9696 22981 -16603 -24945 21739 24893 -23823 -22428 22924 18272 -18562
820 -18562 -12398 11478 5715 -2251 1230 -8146 -7913 18292 13553 -27284 -18052 33599 20663 -36754
834 -36754 -21747 35906 20972 -31175 -18809 22701 15477 -11285 -11338 -1794 7012 15537 -2560
847 -2560 -28199 -1393 38670 4981 -45467 -7765 48049 10034 -45851 -11692 39023 12699
859 12699 -28357 -13402 14618 13499 406 -13442 -15626 12822 29164 -11813 -39833 10192
871 10192 46486 -7935 -48567 5147 46059 -1631 -39035 -2202 28655 6541 -15691 -10710
883 -10710 1882 14749 11755 -18055 -23716 20367 32878 -21401 -38580 20713 40158 -18443
895 -18443 -37956 14337 32013 -8889 -23470 2233 13044 4946 -2130 -12026 -8130 18461 16921
908 16921 -23348 -23000 26519 26278 -27173 -26237 25600 23457 -21507 -18204 15559 11462 -8247 -4109
922 -4109 217 -2977 7499 8699 -14581 -12819 19857 14493 -23303 -14057 24201 11412 -22868
935 -22868 -7273 19318 2243 -14075 3077 7843 -7580 -1064 11108 -5138 -12679 10547 12486
948 12486 -14220 -10157 16086 6206 -15867 -970 13675 -4867 -10033 10432 5234 -15363 -248
961 -248 18527 -4579 -19929 8209 18930 -10458 -15811 10829 10768 -9262 -4228 6139 -2847 -1610
975 -1610 10070 -3321 -16330 8358 21249 -12378 -23969 15050 24595 -15697 -22792 14131 18835
988 18835 -10521 -13303 4972 6456 1628 709 -8909 -7798 15763 13919 -21514 -18759 25293 21793
1002 21793 -26535 -22880 25041 22071 -20630 -19342 13864 15317 -4977 -10202 -4750 4688 14647
1015 14647 842 -23534 -5839 30352 9915 -34475 -12969 35148 14580 -32480 -15122 26343
1027 26343 14363 -17654 -12837 6982 10625 4376 -8075 -15351 5465 24913 -2789 -31902 513
1040 513 35890 1687 -36245 -3446 33261 5057 -27027 -6366 18404 7489 -8212 -8493 -2546
1053 -2546 9186 12647 -9778 -21379 9838 27568 -9594 -30996 8640 31119 -7244 -28222
1065 -28222 5188 22656 -2494 -14938 -458 6330 3811 2575 -6930 -10430 9990 16846 -12248
1078 -12248 -20841 13711 22243 -14112 -21053 13307 17511 -11455 -12297 8435 5899 -4892 425
1091 425 709 -6332 3331 10807 -7146 -13585 10245 14294 -12268 -12958 13225 9921 -12752 -5488
1105 -5488 11277 490 -8646 4645 5514 -8939 -1952 12117 -1455 -13552 4381 13093 -6618
1118 -6618 -10848 7750 6802 -7951 -1751 6986 -3959 -5325 9450 3067 -14175 -606 17440
1131 17440 -1678 -18796 3461 18070 -4316 -15148 4387 10534 -3291 -4452 1520 -2201 948
1144 948 8901 -3632 -14827 6066 19366 -7970 -22111 8841 22585 -8594 -21007 6971
1156 6971 17282 -4160 -11981 338 5590 4074 1257 -8567 -7921 12734 13854 -15807 -18254 17600
1170 17600 21083 -17506 -21749 15666 20546 -11918 -17467 6693 12947 -472 -7516 -6345 1613
1183 1613 12758 4002 -18384 -9039 22299 12743 -24288 -15164 23839 15974 -21102 -15325 16214
1196 16214 13489 -9540 -10589 1965 7280 6108 -3664 -13481 394 19806 2587 -24115 -4850
1209 -4850 26168 6468 -25699 -7400 22708 7584 -17672 -7338 10822 6525 -3274 -5639 -4559
1222 -4559 4550 11710 -3611 -17581 2683 21454 -1861 -23070 1308 22358 -699 -19292
1234 -19292 293 14493 311 -8332 -855 1737 1652 4736 -2521 -10355 3445 14417 -4480 -16685
1248 -16685 5239 16851 -5859 -15159 5976 11682 -5767 -7166 4905 2054 -3670 2935 2038
1261 2038 -7229 -106 10410 -1796 -11920 3670 11903 -5076 -10093 6158 7078 -6558 -3013
1274 -3013 6426 -1395 -5748 5622 4579 -9247 -3178 11536 1508 -12466 -21 11597 -1385
1287 -1385 -9203 2349 5435 -2957 -797 3135 -4168 -2821 9014 2363 -12916 -1578 15571 938
1301 938 -16424 -290 15556 12 -12841 -78 8567 515 -3317 -1366 -2648 2295 8297 -3404
1315 -3404 -13434 4212 17176 -4706 -19380 4545 19569 -3767 -17913 2264 14529 -115
1327 -115 -9630 -2304 3961 5123 2222 -7600 -7987 9812 13088 -11077 -16788 11447 18830 -10684
1341 -10684 -19065 8709 17439 -5817 -14296 1928 9758 2213 -4638 -6584 -829 10536 5861 -13711
1355 -13711 -10111 15750 13234 -16344 -14773 15487 14998 -12974 -13705 9276 11354 -4384 -8040 -892
1369 -892 4438 6273 -723 -11172 -2634 15022 5376 -17566 -7420 18294 8407 -17393 -8596 14675
1383 14675 7891 -10666 -6616 5607 4808 -174 -2894 -5174 1020 9938 621 -13485 -1757 15659
1397 15659 2521 -16086 -2617 14954 2424 -12223 -1772 8401 990 -3888 -264 -859 -380
1410 -380 5191 626 -8810 -624 11182 215 -12217 403 11731 -1238 -9929 2075 7059
1423 7059 -2799 -3434 3357 -342 -3440 4022 3256 -6871 -2607 8848 1756 -9473 -602 8854 -625
1438 -625 -7005 1835 4160 -2939 -817 3741 -2764 -4337 5929 4481 -8497 -4351 9961 3847
1452 3847 -10191 -3044 9057 2103 -6637 -964 3399 0 628 1064 -4627 -1776 8464 2457 -11387
1467 -11387 -2815 13201 2992 -13594 -3111 12458 3026 -9995 -2996 6188 2824 -1756 -2802
1480 -2802 -3182 2559 7774 -2399 -11780 2101 14675 -1563 -16073 898 15968 136 -14144
1493 -14144 -1227 11038 2574 -6687 -3836 1833 5082 3271 -6050 -7999 6617 11873 -6789 -14625
1507 -14625 6251 15778 -5235 -15527 3530 13656 -1459 -10644 -977 6599 3540 -2105 -5913
1520 -5913 -2385 8047 6533 -9556 -9792 10329 12059 -10119 -12945 9091 12652 -7050 -11077 4358
1534 4358 8559 -1138 -5428 -2320 1965 5543 1340 -8476 -4371 10505 6598 -11630 -8047 11557
1548 11557 8478 -10440 -7993 8315 6747 -5369 -4858 2026 2746 1544 -456 -4747 -1505 7535
1562 7535 3096 -9415 -4087 10317 4429 -10155 -4159 8933 3220 -6925 -2037 4157 580 -1190
1576 -1190 753 -1915 -1954 4562 2671 -6592 -2993 7851 2825 -8046 -2086 7376 1098 -5683 198
1591 198 3506 -1477 -863 2685 -1777 -3538 4089 4094 -5829 -4160 6710 3720 -6701 -2962 5685 1697
1607 1697 -4014 -320 1635 -1252 965 2646 -3534 -3849 5719 4752 -7221 -5199 7903 5246 -7502
1622 -7502 -4700 6256 3879 -4066 -2630 1313 1329 1864 119 -4926 -1494 7626 2704 -9678 -3693
1637 -3693 10662 4252 -10628 -4644 9334 4565 -7052 -4290 3843 3748 -162 -3021 -3669 2141 7280
1652 7280 -1188 -10167 274 12114 748 -12771 -1640 12246 2558 -10385 -3267 7540 3828
1665 3828 -3918 -4244 -123 4344 4017 -4306 -7703 3910 10421 -3306 -12218 2417 12736 -1376
1679 -1376 -12027 144 10211 1234 -7367 -2540 3986 3861 -224 -4889 -3378 5687 6608 -6064
1693 -6064 -8992 5995 10451 -5438 -10834 4339 10054 -2896 -8369 1040 5847 856 -2989 -2850
1707 -2850 -114 4506 2916 -5872 -5305 6658 6969 -6825 -7721 6464 7651 -5393 -6656 3884
1721 3884 5094 -1984 -3034 -5 837 1985 1287 -3715 -3100 5027 4358 -5869 -5060 6032 4977 -5678
1737 -5678 -4363 4621 3128 -3235 -1639 1502 -44 336 1706 -2044 -2998 3511 3908 -4417 -4215 4872
1753 4872 4045 -4615 -3194 3858 2017 -2578 -466 984 -1186 684 2661 -2279 -3972 3458 4724
1768 4724 -4271 -5083 4334 4771 -3938 -3995 2893 2701 -1417 -1095 -302 -631 2128 2431 -3671 -3834 4938
1785 4938 5068 -5563 -5675 5651 5854 -4956 -5411 3676 4504 -1869 -3222 -377 1615 2642 66
1800 66 -4819 -1789 6515 3211 -7683 -4404 8043 5118 -7565 -5416 6233 5239 -4143 -4594 1609
1815 1609 3680 1307 -2429 -4056 1143 6546 278 -8391 -1520 9443 2621 -9528 -3478 8626
1829 8626 3964 -6942 -4253 4463 4133 -1607 -3837 -1470 3248 4357 -2525 -6857 1642 8634 -720
1844 -720 -9589 -157 9639 1100 -8684 -1869 6957 2561 -4501 -3046 1723 3406 1201 -3563 -3919
1859 -3919 3387 6162 -3127 -7785 2586 8433 -1952 -8319 1056 7247 -184 -5531 -802 3321
1873 3321 1733 -824 -2483 -1610 3085 3723 -3361 -5296 3510 6285 -3246 -6427 2771 5939 -2017
1888 -2017 -4780 1123 3176 -164 -1323 -850 -654 1692 2334 -2440 -3734 2854 4546 -3040 -4850 2852
1904 2852 4488 -2433 -3604 1776 2336 -893 -720 -4 -894 948 2468 -1649 -3601 2189 4354 -2389
1920 -2389 -4502 2287 4084 -1885 -3170 1191 1824 -402 -250 -532 -1486 1361 2944 -2060 -4179 2449
1936 2449 4916 -2542 -5142 2271 4809 -1646 -3888 783 2627 366 -1012 -1460 -704 2555 2422 -3345
1952 -3345 -3830 3861 4920 -3972 -5519 3594 5579 -2823 -5134 1603 4123 -167 -2840 -1446 1189
1967 1189 3011 500 -4313 -2133 5273 3560 -5691 -4570 5547 5187 -4794 -5222 3547 4864 -1854
1982 -1854 -4053 -116 2928 2170 -1581 -4010 119 5483 1249 -6540 -2455 6869 3339 -6625 -3962
1997 -3962 5659 4168 -4142 -4045 2164 3600 -28 -2953 -2125 2078 4143 -1037 -5654 108 6717 847
2013 847 -7027 -1643 6698 2254 -5698 -2634 4084 2791 -2185 -2800 14 2475 2062 -2099 -3946 1496
2029 1496 5262 -939 -6106 298 6259 295 -5711 -765 4648 1214 -3107 -1493 1325 1710 637
2044 637 -1711 -2346 1668 3771 -1459 -4680 1213 5036 -870 -4881 453 4112 -77 -3030 -354
2059 -354 1526 637 21 -972 -1579 1101 2849 -1231 -3758 1103 4193 -957 -4078 736 3562 -316
2075 -316 -2547 14 1284 423 240 -692 -1663 937 2871 -1006 -3749 925 4126 -798 -4076 437
2091 437 3475 -75 -2505 -395 1126 814 317 -1254 -1853 1515 3133 -1610 -4067 1548 4612 -1242
2107 -1242 -4643 831 4210 -150 -3344 -544 2080 1304 -592 -1978 -994 2500 2453 -2823 -3678 2813
2123 2813 4512 -2569 -4993 1947 4868 -1153 -4312 129 3363 967 -2030 -2067 499 3004 1095
2138 1095 -3610 -2417 3968 3645 -3933 -4401 3502 4749 -2710 -4622 1590 4032 -320 -3179 -1103
2153 -1103 1976 2432 -723 -3590 -666 4372 1798 -4787 -2773 4756 3478 -4237 -3749 3362 3775 -2074
2169 -2074 -3399 694 2802 973 -1907 -2386 993 3637 53 -4491 -944 4903 1708 -4830 -2308
2184 -2308 4251 2578 -3344 -2675 1968 2462 -521 -2056 -1021 1490 2389 -823 -3491 161 4198 451
2200 451 -4446 -928 4223 1345 -3565 -1484 2591 1598 -1289 -1429 -76 1220 1400 -915 -2504 576
2216 576 3319 -182 -3747 -188 3710 485 -3349 -757 2521 850 -1495 -891 285 837 968 -698
2232 -698 -2037 511 2872 -201 -3330 -64 3419 388 -3035 -593 2356 793 -1354 -873 188
2247 188 870 992 -786 -2081 581 2921 -295 -3456 -33 3545 366 -3264 -682 2582 961 -1606
2263 -1606 -1205 451 1343 849 -1340 -1991 1270 3005 -1031 -3654 698 3929 -267 -3802 -254 3306
2279 3306 762 -2425 -1287 1237 1693 -16 -1962 -1308 2072 2474 -1999 -3384 1713 3927 -1216 -4115
2295 -4115 619 3884 151 -3231 -826 2341 1557 -1097 -2138 -177 2576 1440 -2740 -2521 2700
2310 2700 3309 -2416 -3804 1846 3894 -1152 -3654 261 2992 607 -2146 -1554 1053 2284 58
2325 58 -2904 -1140 3206 2048 -3186 -2751 2930 3164 -2313 -3231 1544 3052 -529 -2498 -444 1782
2341 1782 1479 -867 -2325 -46 2879 919 -3237 -1674 3166 2186 -2881 -2484 2235 2498 -1410 -2270
2357 -2270 405 1810 560 -1201 -1478 510 2271 233 -2742 -796 2985 1336 -2880 -1640 2482
2372 2482 1777 -1830 -1733 969 1486 -43 -1132 -888 639 1679 -152 -2317 -368 2657 746 -2691
2388 -2691 -1118 2437 1321 -1901 -1368 1157 1279 -233 -977 -635 640 1497 -214 -2101 -226 2518
2404 2518 653 -2632 -1021 2394 1257 -1933 -1347 1212 1323 -344 -1182 -584 859 1439 -506 -2160
2420 -2160 91 2648 375 -2845 -745 2742 1108 -2277 -1298 1635 1499 -722 -1469 -212 1370 1190
2436 1190 -1090 -2039 720 2683 -321 -3076 -171 3113 640 -2841 -1068 2230 1365 -1436 -1627 423
2452 423 1696 625 -1659 -1576 1456 2415 -1088 -2949 686 3293 -124 -3156 -377 2846 946 -2157
2468 -2157 -1356 1298 1710 -301 -1903 -711 1966 1607 -1820 -2407 1531 2880 -1126 -3133 569 2983
2484 2983 9 -2597 -623 1968 1163 -1123 -1633 226 1967 737 -2076 -1499 2062 2177 -1770 -2570
2500 -2570 1402 2743 -815 -2571 187 2180 474 -1564 -1104 792 1564 -16 -1950 -778 2068
2515 2068 1411 -2036 -1935 1737 2186 -1334 -2195 772 2032 -116 -1588 -497 1089 1100 -417 -1539
2531 -1539 -215 1843 819 -1979 -1319 1857 1658 -1573 -1791 1122 1706 -565 -1510 -79 1098 703
2547 703 -603 -1264 37 1661 490 -1856 -940 1873 1340 -1670 -1519 1277 1587 -707 -1404 99 1137
2564 1137 583 -702 -1154 259 1600 272 -1900 -755 1937 1129 -1816 -1432 1428 1527 -950 -1484 298
2581 298 1342 367 -1008 -988 612 1564 -126 -1934 -319 2166 776 -2106 -1118 1859 1432 -1361 -1524
2598 -1524 789 1504 -35 -1332 -687 1042 1351 -675 -1929 230 2235 225 -2389 -727 2226 1074
2614 1074 -1850 -1375 1272 1547 -561 -1535 -190 1459 980 -1190 -1591 872 2113 -396 -2391 -9
2630 -9 2464 507 -2220 -891 1824 1224 -1205 -1443 486 1531 268 -1497 -1006 1304 1608 -1038 -2060
2647 -2060 655 2294 -227 -2312 -221 2081 645 -1605 -999 1059 1333 -333 -1446 -384 1496
2662 1496 1047 -1370 -1573 1137 1973 -754 -2115 318 2037 118 -1772 -570 1304 950 -729 -1221
2678 -1221 96 1390 524 -1410 -1047 1335 1519 -1077 -1723 737 1824 -301 -1707 -99 1392 559
2694 559 -957 -916 429 1200 89 -1352 -652 1341 1061 -1239 -1424 979 1569 -646 -1565 187 1393
2711 1393 258 -1091 -689 648 1078 -112 -1301 -361 1408 851 -1344 -1172 1168 1456 -826 -1493 408
2728 408 1428 88 -1194 -532 785 923 -392 -1295 -126 1437 550 -1481 -1001 1350 1235 -1108 -1443
2745 -1443 690 1461 -210 -1323 -265 1092 747 -713 -1141 315 1461 173 -1568 -588 1624 984
2761 984 -1405 -1266 1078 1405 -591 -1426 94 1285 454 -1037 -978 692 1394 -286 -1657 -159 1750
2778 1750 602 -1663 -942 1442 1199 -1010 -1326 527 1359 32 -1230 -582 1056 1086 -704 -1464 337
2795 337 1687 87 -1783 -458 1669 810 -1387 -1086 978 1215 -485 -1298 -77 1219 640 -1011
2811 -1011 -1116 771 1458 -386 -1656 50 1705 373 -1557 -681 1249 975 -816 -1145 315 1200
2827 1200 248 -1135 -757 979 1176 -709 -1455 378 1590 -69 -1585 -338 1367 627 -1021 -885
2843 -885 632 1102 -114 -1083 -364 1092 813 -889 -1140 711 1392 -392 -1444 22 1373 297 -1148
2860 -1148 -607 822 838 -410 -1047 -69 1082 489 -1045 -920 849 1170 -606 -1344 304 1380 96
2877 96 -1235 -395 963 733 -574 -926 198 1090 260 -1114 -665 1042 1019 -815 -1216 520 1307 -202
2895 -202 -1297 -198 1107 481 -837 -818 454 1035 -34 -1180 -372 1144 720 -1039 -1005 811 1195
2912 1195 -521 -1261 181 1233 266 -1007 -614 738 965 -380 -1118 -29 1231 425 -1237 -778 1075
2929 1075 1034 -792 -1196 450 1248 -42 -1166 -377 960 741 -687 -1014 332 1231 55 -1288 -409
2946 -409 1264 766 -1069 -950 781 1166 -390 -1144 8 1072 412 -855 -775 639 1070 -297 -1229
2963 -1229 -27 1285 372 -1214 -688 1014 897 -704 -1040 330 1062 103 -979 -452 849 857 -545
2980 -545 -1078 268 1269 55 -1236 -388 1119 665 -886 -867 590 991 -198 -995 -221 921 583
2997 583 -744 -892 511 1084 -215 -1180 -88 1159 410 -1004 -637 799 830 -459 -887 94 949 310
3015 310 -836 -610 715 917 -458 -1063 180 1123 84 -1096 -415 908 648 -663 -846 296 926
3032 926 81 -926 -450 838 744 -654 -968 414 1092 -93 -1124 -189 1021 507 -784 -728 515 913
3050 913 -170 -941 -181 948 516 -820 -802 624 1003 -373 -1083 64 1056 226 -958 -512 725 755
3068 755 -439 -906 88 976 261 -941 -546 814 834 -605 -962 366 1104 -4 -1027 -277 859 568
3086 568 -670 -794 345 917 -22 -1011 -314 929 612 -818 -859 570 984 -274 -1020 -13 976 342
3104 342 -817 -595 593 820 -289 -921 -20 1008 329 -925 -594 764 796 -545 -933 257 941 46
3122 46 -919 -361 692 614 -513 -840 237 929 65 -966 -349 899 591 -707 -760 515 891 -128
3140 -128 -903 -158 861 448 -678 -682 443 869 -147 -960 -118 941 398 -859 -608 628 777 -388
3158 -388 -883 58 848 217 -789 -514 593 748 -371 -859 111 973 151 -880 -380 786 652 -522
3176 -522 -755 314 839 26 -803 -306 726 569 -540 -760 323 894 -83 -927 -194 853 421 -711
3194 -711 -641 469 780 -197 -853 -94 799 393 -696 -626 541 825 -275 -917 33 937 265 -825 -455
3213 -455 664 681 -411 -790 132 855 163 -810 -440 703 636 -524 -820 311 896 -35 -880 -233 766
3232 766 496 -624 -660 369 811 -83 -841 -198 789 470 -676 -657 492 809 -262 -857 -16 842 270
3251 270 -705 -519 531 692 -312 -819 41 790 235 -768 -487 636 663 -414 -747 225 823 85 -754
3270 -754 -257 656 541 -457 -659 250 789 26 -776 -252 732 444 -571 -641 366 730 -171 -778 -105 696
3290 696 365 -592 -555 404 691 -189 -777 -73 796 286 -685 -517 511 665 -300 -734 78 753 217 -664
3310 -664 -402 548 617 -342 -721 98 768 142 -746 -344 629 528 -502 -650 243 734 4 -709 -233 621
3330 621 481 -486 -621 317 724 -86 -767 -109 738 369 -588 -552 438 679 -177 -714 -48 699 296 -614
3350 -614 -528 477 689 -263 -761 38 759 194 -672 -392 570 589 -368 -684 145 751 114 -693 -338 635
3370 635 533 -463 -699 245 747 -28 -750 -176 661 426 -549 -571 335 679 -116 -722 -133 682 342 -607
3390 -607 -531 424 669 -216 -712 11 721 222 -614 -407 527 588 -289 -660 91 713 178 -673 -381 553 566
3411 566 -412 -672 160 709 33 -682 -256 572 425 -441 -570 247 665 -49 -675 -185 645 380 -477 -517
3431 -517 354 606 -149 -641 -53 628 265 -478 -437 380 576 -166 -634 -44 638 207 -593 -416 457 505 -289
3452 -289 -599 68 626 142 -567 -324 441 507 -268 -601 141 658 90 -610 -247 548 455 -377 -542 249 596
3473 596 7 -584 -197 532 354 -400 -520 213 625 -51 -658 -143 608 299 -496 -432 332 550 -158 -590
3493 -590 -22 559 239 -491 -387 384 562 -214 -631 47 635 148 -593 -322 472 461 -325 -550 119 620
3513 620 97 -582 -311 509 467 -388 -567 205 661 8 -647 -155 583 378 -451 -431 314 551 -56 -596 -131
3534 -131 581 306 -488 -471 354 561 -211 -613 4 588 160 -536 -363 410 439 -228 -571 21 588 150 -555
3555 -555 -326 461 474 -348 -533 182 632 27 -557 -193 498 368 -356 -473 223 549 -26 -602 -201 530
3575 530 328 -439 -469 283 507 -138 -566 -41 515 203 -416 -361 298 472 -121 -549 -4 546 195 -474 -287
3596 -287 385 453 -242 -472 103 482 84 -435 -244 378 392 -244 -465 115 508 65 -507 -256 442 360 -327
3617 -327 -447 179 487 -17 -467 -154 427 327 -312 -432 204 521 -32 -520 -106 518 257 -438 -377 319
3637 319 455 -139 -465 -56 424 186 -392 -344 292 463 -162 -522 -1 526 156 -466 -262 414 381 -220 -483
3658 -483 106 514 81 -461 -238 379 407 -291 -487 137 538 9 -556 -168 456 262 -380 -424 218 494 -65
3679 -65 -485 -138 482 282 -400 -432 275 527 -150 -536 -5 559 176 -472 -304 342 409 -199 -429 59 490
3700 490 127 -431 -291 366 395 -263 -481 118 489 6 -485 -158 420 290 -329 -402 177 463 23 -457 -128
3721 -128 448 269 -320 -411 261 494 -77 -462 -21 481 184 -361 -295 268 402 -111 -452 -16 447 155 -428
3742 -428 -310 306 388 -227 -483 67 428 38 -422 -182 335 301 -219 -374 76 423 62 -408 -211 361 278
3763 278 -290 -385 186 420 -14 -425 -121 340 195 -285 -335 179 415 -7 -440 -117 422 230 -337 -358 232
3784 232 398 -115 -429 -15 397 155 -351 -255 214 358 -106 -432 -16 448 135 -405 -262 333 323 -250 -378
3805 -378 74 390 27 -357 -185 330 283 -194 -366 131 431 42 -417 -149 402 266 -324 -329 215 410 -46
3826 -46 -413 -65 380 212 -295 -352 175 420 -80 -461 -50 476 156 -408 -272 331 368 -193 -399 40 415
3847 415 120 -344 -191 320 369 -186 -415 146 456 36 -441 -137 399 256 -265 -335 166 364 -35 -381 -110
3868 -110 364 253 -296 -345 195 409 -109 -430 -24 410 157 -338 -244 262 334 -122 -352 13 386 150 -329
3889 -329 -237 272 365 -186 -388 76 429 51 -373 -148 323 250 -231 -295 98 348 39 -360 -173 293 245 -222
3911 -222 -324 176 369 -46 -348 -41 344 177 -259 -227 134 318 -53 -341 -68 334 182 -295 -292 200 357
3932 357 -117 -381 30 363 81 -304 -193 235 274 -84 -340 18 363 118 -327 -203 281 278 -197 -322 106
3953 106 333 3 -305 -103 276 214 -188 -282 81 326 6 -361 -163 298 191 -282 -318 178 337 -69 -346
3974 -346 -15 326 153 -235 -239 186 358 -71 -331 -38 363 161 -338 -230 269 321 -171 -344 65 351 59
3995 59 -321 -173 234 265 -176 -353 38 345 32 -363 -149 305 219 -267 -295 147 314 -36 -293 -61 302
4016 302 185 -245 -287 154 350 -54 -331 -39 357 143 -321 -228 224 257 -152 -322 44 322 99 -307 -204
4037 -204 227 286 -152 -342 49 361 42 -332 -99 297 210 -201 -248 111 292 -11 -294 -113 260 209 -204
4058 -204 -270 141 325 -30 -322 -35 296 116 -259 -202 189 245 -27 -279 -41 277 137 -218 -209 204 279 -100
4080 -100 -330 31 334 68 -303 -149 233 214 -143 -223 20 270 47 -271 -139 197 223 -176 -285 82 305
4101 305 -3 -296 -74 272 156 -186 -209 98 255 -9 -261 -101 271 174 -204 -227 188 305 -68 -292 -6
4122 -6 261 84 -230 -188 162 222 -57 -266 -32 258 146 -260 -183 204 263 -139 -279 46 313 37 -267 -112
4144 -112 214 227 -120 -261 59 304 48 -282 -130 288 202 -190 -251 151 295 -42 -305 -35 233 112 -230
4165 -230 -200 131 277 -53 -298 -32 284 115 -267 -181 227 234 -127 -251 45 295 58 -219 -133 195 223 -145
4187 -145 -260 58 294 36 -273 -129 254 192 -209 -232 107 282 -27 -268 -68 256 156 -170 -221 123 285
4208 285 -22 -273 -64 290 127 -241 -157 177 213 -85 -234 18 244 75 -210 -167 129 219 -87 -269 51
4229 51 299 56 -245 -116 232 157 -142 -226 63 217 36 -210 -120 223 198 -143 -226 73 253 3 -259 -48
4251 -48 232 126 -179 -188 108 185 -19 -226 -70 224 124 -169 -235 112 243 -59 -261 -7 253 89 -223 -127
4273 -127 167 207 -78 -186 25 220 89 -197 -135 159 219 -137 -236 63 256 31 -257 -91 195 149 -138 -240
4295 -240 65 245 5 -215 -110 231 159 -173 -214 111 255 -34 -235 -30 214 93 -186 -144 153 229 -42
4316 -42 -223 -38 223 130 -195 -164 173 204 -95 -251 49 239 32 -214 -106 162 183 -107 -193 65 217 54
4338 54 -216 -137 215 156 -160 -219 125 235 -58 -228 -37 196 120 -140 -179 101 222 -10 -235 -45 246 125
4360 125 -211 -178 177 209 -75 -205 53 217 47 -165 -108 124 199 -51 -209 46 234 66 -208 -101 166
4381 166 167 -137 -171 55 166 -24 -188 -46 152 125 -136 -177 71 205 6 -207 -80 223 113 -165 -139 146
4403 146 195 -31 -157 -13 189 104 -133 -140 125 202 -73 -202 -9 217 75 -202 -116 148 134 -88 -179 36 176
4426 176 36 -182 -86 149 154 -90 -167 48 219 21 -181 -75 163 92 -139 -173 88 171 9 -146 -54 140 118
4449 118 -124 -175 91 208 -40 -213 -17 191 76 -182 -123 111 166 -31 -172 -16 183 66 -166 -141 147
4470 147 183 -85 -205 15 190 20 -170 -96 193 159 -91 -154 31 169 16 -155 -80 153 133 -103 -159 93
4492 93 214 -35 -188 0 173 99 -147 -118 108 183 -39 -160 -13 182 106 -153 -119 116 175 -103 -190 38 193
4515 193 27 -169 -66 129 135 -102 -195 32 183 35 -174 -82 157 130 -131 -142 92 167 -9 -161 12 162
4537 162 95 -131 -133 60 180 -11 -182 -45 189 89 -149 -117 126 137 -77 -161 -3 146 23 -128 -103 93
4559 93 122 -49 -147 15 154 39 -169 -84 168 110 -106 -143 67 148 1 -122 -53 139 122 -100 -136 24 154
4582 154 12 -181 -58 140 122 -119 -124 83 160 -28 -137 -30 118 80 -114 -123 59 149 -4 -167 -32 173 71
4605 71 -124 -112 99 126 -59 -119 15 124 40 -128 -109 97 117 -33 -172 20 186 57 -158 -61 162 110 -114
4628 -114 -148 50 127 5 -135 -78 152 107 -102 -172 48 155 -27 -144 -31 142 85 -123 -108 103 150 -28 -149
4651 -149 -10 143 66 -121 -120 101 135 -76 -148 34 166 35 -154 -40 126 94 -87 -124 48 142 11 -136 -59
4674 -59 109 114 -141 -149 56 146 -57 -156 -21 154 44 -106 -95 86 89 -17 -133 -36 97 57 -108 -79 102 98 -53
4699 -53 -133 50 158 30 -92 -55 91 114 -26 -122 9 148 23 -142 -62 126 121 -99 -122 54 122 -37 -130 -26
4723 -26 102 74 -74 -101 32 132 9 -110 -29 135 96 -100 -104 63 129 -48 -126 -13 110 25 -100 -87 43 92
4747 92 -22 -129 -25 129 73 -120 -75 97 115 -79 -114 1 102 6 -114 -63 59 113 -46 -137 -26 141 0
4770 0 -145 -72 87 87 -94 -113 77 113 -13 -107 -21 116 76 -43 -87 49 142 9 -145 -7 145 82 -121 -85 86
4795 86 112 -20 -119 12 83 20 -102 -114 73 113 -58 -126 9 140 15 -144 -78 87 65 -81 -82 63 108 -4
4819 -4 -131 -24 89 113 -77 -125 68 149 -18 -144 9 108 63 -118 -80 73 79 -62 -118 -23 103 45 -75 -100 76
4844 76 93 -50 -145 9 131 4 -138 -39 91 62 -59 -71 20 83 7 -88 -58 97 79 -61 -101 47 117 5 -122
4869 -122 15 86 39 -90 -60 52 75 -24 -69 -1 110 64 -58 -75 70 96 -35 -92 10 109 13 -82 -60 61 76
4894 76 -21 -67 -3 84 30 -86 -75 77 74 -38 -97 35 104 -6 -77 -5 65 61 -30 -51 -14 108 -2 -112 -28 90 49
4921 49 -80 -94 44 99 -19 -89 -22 72 29 -52 -117 35 80 -4 -92 -55 99 65 -109 -106 92 85 -47 -114 1 112
4947 112 27 -91 -71 70 80 -26 -100 11 114 33 -112 -69 83 62 -50 -93 58 81 -21 -91 -44 58 57 -61
4971 -61 -113 44 115 16 -143 -21 93 39 -104 -98 66 93 -61 -81 31 110 53 -85 -87 67 97 -40 -121 21 132
4996 132 12 -103 -17 99 50 -72 -90 51 74 -16 -94 -43 81 65 -73 -85 24 112 -42 -97 4 108 30 -125
5020 -125 -46 80 46 -20 -68 8 86 32 -50 -69 51 89 -29 -82 16 89 -27 -75 -11 68 55 -27 -48 29 71 22 -68 -55
5048 -55 68 60 -41 -87 34 86 -29 -78 -29 64 17 -67 -44 22 55 -1 -44 -51 37 51 -46 -95 38 77 -21 -72 -22 55 32
5077 32 -33 -42 35 71 17 -83 -18 70 61 -60 -73 68 62 -29 -92 14 82 -15 -57 -36 44 57 -14 -89 -30 68 34 -115 -79
5106 -79 74 98 -82 -98 46 116 15 -107 -10 83 56 -36 -53 16 95 28 -79 -20 115 59 -66 -89 66 70 -76 -69
5132 -69 2 68 -9 -71 -27 51 69 -38 -84 16 119 22 -94 -26 118 57 -78 -81 51 102 -15 -58 -1 56 84 -37
5158 -37 -44 55 90 -3 -100 -14 115 33 -110 -35 74 50 -22 -54 -9 46 5 -47 -57 65 65 -23 -72 16 95 14 -98 -39 86
5187 86 45 -73 -30 48 44 -7 -42 -44 32 26 -48 -61 24 54 -34 -68 17 51 13 -49 -15 47 39 -19 -4 -1 19 25 -30 -60 44 77
5219 77 -7 -92 13 55 -1 -54 -17 29 42 -8 -29 -22 8 19 -15 -52 31 79 -33 -71 0 63 33 -48 -10 37 34 2 -44 16
5249 16 29 24 -41 -58 43 71 -20 -102 37 73 -24 -82 -4 64 44 -26 -58 3 69 11 -64 -26 79 64 -62 -76 18 86 -39
5278 -39 -90 -4 98 14 -62 -10 34 49 -16 -79 -19 68 22 -89 -48 84 82 -59 -85 53 88 -33 -102 19 52 17 -40
5305 -40 -13 26 92 -23 -78 -3 110 41 -117 -38 73 81 -78 -84 23 56 8 -48 -21 62 70 -15 -79 16 79 -1 -101 -24
5333 -24 72 37 -59 -41 65 44 -20 -47 2 27 15 -25 -37 12 53 -5 -75 -3 73 20 -71 -27 62 29 -41 -48 20 23 -18 -18 -20 17
5365 17 27 19 -55 10 89 -2 -81 -2 73 57 5 7 -3 14 39 7 1 -3 22 2 -47 -30 58 7 -54 -17 55 -8 -47 -47 13 7 -20
5398 -20 -9 -34 30 47 -2 -64 -11 72 6 -68 2 38 43 -24 -2 26 32 16 -19 -16 41 41 -31 -84 11 69 -33 -96 -10 61 9 -73
5430 -73 -14 52 24 -37 -55 -8 53 45 -39 -42 54 97 -18 -87 22 95 -11 -84 11 71 18 -24 -38 16 73 23 -42 -3 77 56
5460 56 -50 -73 50 97 -19 -68 22 71 -16 -57 -7 47 32 -38 -40 20 81 39 -65 -42 52 62 -69 -77 62 68 -32 -50
5488 -50 1 52 2 -51 -41 22 41 9 -78 -29 81 20 -86 -30 64 24 -50 -17 62 41 -49 -25 10 26 13 -5 -62 11 56
5517 56 -7 -63 -17 45 3 -67 -36 34 29 -17 -34 -2 -5 0 31 -31 6 39 19 -12 -6 30 14 -6 -4 22 28 -3 22 1 -8 31 20 -43
5551 -43 -37 59 27 -63 -32 20 25 -47 -39 7 26 -19 -13 -11 -25 8 -15 -45 0 53 17 -49 -31 49 16 -41 -42 41 32 -45 -36 -11 16 -3
5585 -3 -14 -35 1 84 24 -69 6 96 34 -44 -32 53 24 -60 -42 45 47 25 -25 -44 35 51 -35 -71 24 90 -7 -90 -11 104 -2
5616 -2 -59 -18 65 48 -48 -29 4 76 32 -43 -36 74 72 -32 -66 54 87 -21 -78 -12 84 28 -47 3 29 24 -17 -47 -3 56
5646 56 28 -37 -62 67 57 -55 -89 45 86 -26 -52 12 33 9 -18 -30 20 50 25 -43 -20 59 34 -61 -30 60 43 -44
5674 -44 -31 29 19 -13 -21 6 -8 0 -3 -41 -20 16 -2 -36 -22 32 16 -59 -2 16 21 -34 0 6 -39 -1 41 -7 -24 42 13 -17 -9
5707 -9 31 30 -34 1 43 -6 -19 21 21 -41 2 41 -32 -46 36 59 -56 -14 21 42 3 -24 13 19 -7 14 14 -15 13 33 -44 -39 71
5740 71 56 -32 -50 60 39 -46 -27 25 40 13 -6 -33 -23 26 14 -40 4 83 30 -69 -21 75 45 -83 -33 62 29 -32 -41 6
5770 6 39 35 -16 -35 44 55 -10 -80 1 104 21 -92 -16 97 -1 -71 -27 42 47 -21 -53 -15 47 37 -31 -44 30 86 -29 -61
5800 -61 24 75 -13 -61 1 68 11 -51 -14 22 13 -17 -39 -36 29 40 -48 -45 72 62 -42 -68 25 71 -26 -52 18 27 8 -15 -11 -19
5832 -19 23 29 -41 -23 48 38 -61 -42 71 31 -17 -32 59 9 -16 -4 3 3 8 21 -19 -20 44 1 -22 -38 28 11 -45 21 11 -21
5864 -21 -4 13 13 -18 -5 52 15 -25 9 31 -36 -19 17 -10 -10 24 27 8 -22 13 -1 -31 15 59 -5 -45 48 64 23 -25 17 47
5896 47 -13 -37 -21 14 2 -4 -18 -15 17 31 -43 -49 56 72 -47 -70 23 62 -22 -60 35 42 26 8 -9 8 73 12 -77 -11 79
5927 79 32 -64 -19 68 52 -47 -46 61 68 -38 -50 3 16 35 -28 -36 4 52 4 -90 -9 105 21 -80 -19 98 51 -53 -42
5956 -42 42 14 5 -14 -18 33 25 -1 -52 38 75 -3 -67 29 86 -19 -99 -1 61 4 -23 -18 9 15 -2 -15 -46 33 33 -37 -72 19 66
5989 66 -23 -31 37 44 -24 -16 35 49 4 23 7 -16 23 36 -1 -20 43 50 -29 -21 65 44 -23 4 31 -3 -29 7 35 -28 -18 21 28
6022 28 -44 2 10 -27 8 19 4 -10 6 27 -1 -17 27 0 -24 -16 31 22 -54 -11 53 15 -46 2 -13 -5 -4 14 13 8 53 -7 -33 -9
6056 -9 93 4 -60 25 54 -4 -36 6 63 13 -42 -10 -15 17 29 -38 -30 4 56 -56 -32 60 89 -2 -65 14 66 -7 -28 14 53
6087 53 0 -16 -19 1 56 27 -30 -35 78 68 -54 -71 60 69 -43 -59 18 60 -42 -39 -20 20 12 8 -39 6 75 2 -72 -28 82
6118 82 34 -62 -43 66 26 -27 -38 33 31 1 -29 -17 21 43 -12 -74 17 81 24 -54 -1 69 15 -75 17 60 0 -14 -23 19 18
6149 18 4 8 1 8 55 16 -37 36 50 -25 -54 12 50 2 -27 7 18 6 8 11 -25 19 32 7 -26 31 40 -22 -40 37 40 -38 10 5
6183 5 24 -32 19 38 -4 -4 18 8 0 -18 12 -22 1 4 25 -5 -3 28 -32 -33 42 36 -33 -20 53 29 -17 2 40 48 -6 0 9 6 16 10
6219 10 -22 1 55 15 -43 -6 73 16 -49 -35 42 3 -38 -12 29 20 -41 -13 -22 8 26 -19 -77 24 86 -41 -72 19 78 -11
6249 -11 -59 36 78 -8 -45 11 63 8 12 -46 -26 38 30 -46 -34 78 53 -62 -52 57 80 -16 -43 22 35 -10 -26 1 10 33
6279 33 11 -47 5 78 16 -58 -40 96 43 -112 -36 61 44 -44 -24 28 28 17 -22 1 26 35 18 -33 7 76 6 -53 4 78
6309 78 18 -54 16 26 19 -42 14 -1 2 15 1 -27 24 40 1 -41 25 43 -10 -31 36 61 5 -19 35 5 -20 10 27 -2 26
6340 26 38 23 0 21 35 -20 -6 17 50 -27 -26 35 9 -34 16 47 -15 -34 11 25 -7 -14 14 -14 -27 12 -18 -1 11 24 -6
6371 -6 -41 56 41 -35 -31 32 56 -32 -36 16 43 2 5 23 17 15 -25 -34 -10 35 1 -49 -30 51 20 -34 -33 69 17 -52 -39 37 20 -14
6405 -14 -27 -6 6 26 -29 -40 34 62 -15 -89 32 95 2 -56 -12 76 7 -52 11 0 15 4 -20 -14 40 44 -38 -52 34 52 -45
6436 -45 -46 39 71 -51 -73 28 70 -6 -18 -9 4 25 20 -48 -40 24 34 -69 -31 60 25 -93 -47 72 14 -22 -23 36 25 -11
6466 -11 -28 -5 28 21 7 -35 12 47 1 -50 -39 73 0 -50 17 38 -19 -27 16 20 17 -10 -18 -6 -22 21 -16 -55 29 42 -19 -38
6498 -38 36 56 -53 -2 27 2 -33 1 15 -3 -29 0 32 2 -7 16 1 14 40 26 -36 -12 37 2 -63 16 64 -26 -57 -6
6528 -6 30 -4 -15 -4 -11 4 11 -10 -39 28 34 -26 -48 27 54 3 -59 19 61 -27 -44 30 54 2 -25 1 28 29 24 -33 -8 44 30
6561 30 -25 -52 69 26 -54 -45 39 37 -32 -16 42 47 -7 8 16 8 19 0 -70 14 70 33 -68 -13 84 21 -77 13 70 18 -51 -16
6593 -16 37 27 -5 -22 -20 36 52 -24 -36 32 78 -44 -74 14 57 -6 -53 -3 57 -10 -51 -6 4 16 12 -33 -30 35 55 -27 -66
6624 -66 54 44 -49 -27 47 45 -19 -12 42 21 -8 1 0 15 26 18 -13 4 34 8 -28 -15 60 -2 -41 -21 47 -1 -46 -12 16 10 -11
6657 -11 26 -13 -9 10 -11 -31 24 35 8 -24 37 53 -14 -21 38 21 -10 -10 36 10 2 21 17 25 5 12 -21 -8 54 13 -22 -20 47 41 -43
6692 -43 -26 63 -11 -49 28 42 -5 -27 25 -1 0 -10 -2 -19 9 44 -11 -27 40 46 -20 -28 54 56 -11 -55 34 58 -2 -13 -9 1 29
6725 29 11 -39 -23 11 49 -36 -59 66 24 -23 -49 36 38 -20 -34 1 3 -9 -27 -41 4 19 3 -23 -12 61 34 -67 -13 53
6755 53 4 -62 -20 38 36 -31 -8 14 29 26 -2 -29 36 42 -12 -45 26 76 -1 -53 7 60 -8 -43 16 41 -7 -49 -15 -1 8 10 -22
6788 -22 -24 23 23 -42 -30 43 31 -45 -17 45 12 -22 -2 38 18 16 14 6 -12 0 -1 -14 -4 45 4 -43 2 18 28 -27 -28 44 -2 -34
6822 -34 -6 44 -24 -32 2 20 3 5 -3 -37 2 23 -11 -12 38 39 -32 -38 12 38 -21 -13 20 11 1 -1 3 18 -6 -6 -11 -17 41 6 -30 -7 40
6859 40 48 -31 2 52 23 -53 -8 30 -10 1 -13 13 40 27 1 -11 17 39 -3 -40 10 58 -16 -50 15 61 -25 -33 35 33 20 -9
6891 -9 -3 -2 36 9 -17 -36 28 41 -28 -33 31 40 -32 -56 54 47 -20 -31 -2 34 6 -40 -47 4 14 2 -19 15 35 19 -84 -15 66
6924 66 36 -55 0 56 21 -23 -18 38 3 19 -2 -18 8 42 -6 -38 4 57 -10 -51 -5 56 9 -38 11 60 -12 -40 -8 3 5
6955 5 1 -10 -17 32 26 -32 -20 23 54 -12 -36 35 40 -47 -23 43 15 5 9 -5 -6 36 20 -16 -14 40 20 -49 -10 65 12 -58 -4 28
6989 28 21 -42 -8 37 9 -23 2 16 22 -10 -23 -15 19 39 -13 -28 49 32 17 -17 26 49 -12 -34 60 29 -15 8 -20 4 10 12 -19
7022 -19 -7 33 14 -46 3 25 35 -23 -14 52 8 -14 -19 25 24 -22 -24 1 23 21 17 -37 -1 47 -14 -38 16 58 2 -28 7 63 12
7055 12 -16 17 43 -9 -17 9 18 22 21 -10 -26 33 31 -18 -47 38 65 -33 -61 13 24 -19 -45 24 20 14 -8 24 8 16 19 -25 -5 51 40
7090 40 -25 -51 43 53 0 -24 31 26 -30 4 18 19 15 -1 -15 4 10 -9 -48 1 36 -22 -50 -8 48 15 -32 16 52 23 -25 -1
7122 -1 14 15 20 -8 -3 25 6 -7 -33 31 52 17 -5 49 31 -14 -3 35 18 -3 17 44 4 14 -4 9 18 27 36 -12 -12 50 14 -40
7156 -40 17 37 -6 -43 -10 24 3 0 -4 14 -11 18 -7 -1 16 26 -6 -33 32 57 -12 -18 4 42 -2 -37 17 35 8 11 12 6 5 -6
7190 -6 -26 7 24 43 -31 -23 45 48 -52 -28 43 9 -34 -18 19 -10 -33 -17 23 19 16 4 -22 42 36 13 -49 -2 61 0 -24 36 39
7223 39 12 -15 16 30 27 -23 -11 -8 28 24 -23 -13 9 36 -38 -45 22 35 -19 -50 10 21 -28 -26 -2 4 -9 -15 -17 8 37 12 -18 -32
7257 -32 28 12 -32 -8 49 39 -28 -23 30 32 -9 -5 12 -1 4 -3 -18 6 25 32 -17 -7 40 20 -50 21 55 21 -36 -15 26 -27 -40
7290 -40 26 2 2 9 -19 1 18 -4 -13 -37 21 16 -10 -12 26 47 -17 3 14 30 18 -13 23 -1 19 0 2 7 33 24 -30 9 63 11
7324 11 -48 -9 20 -10 -32 -19 30 -5 -6 12 12 18 14 -1 10 7 16 19 -38 30 43 -9 -30 15 44 -9 -26 7 51 -9 0 10 17 -2 27
7359 27 -43 1 31 36 -18 -14 14 26 -12 -27 21 19 -20 -38 24 8 -8 -32 17 2 28 -8 -14 14 23 -1 -23 7 70 10 -31 49 47
7392 47 1 -27 -10 32 30 13 -4 12 38 11 -19 -15 21 27 -31 -34 -3 35 -11 -20 14 21 -4 -14 1 34 25 -4 -12 3 4 -5 -44 -17 11
7427 11 32 -22 -24 19 14 -37 -34 14 34 -3 -11 17 30 14 -4 -5 -1 25 10 -23 -13 53 1 -72 26 56 10 -25 -18 34 9 -11 -14 12
7461 12 18 12 -9 -17 -4 35 -1 -6 15 44 -11 -35 33 32 -2 -25 21 48 17 5 27 24 16 4 -4 9 7 6 -40 -7 35 19 -38 -19 58
7496 58 29 -26 5 38 22 -15 -6 6 11 12 -12 11 5 9 -13 -8 19 23 22 -27 -3 45 -8 -21 -9 42 2 -14 -14 8 22 -5 8 -6 22
7531 22 27 -23 -40 24 15 -27 -26 23 26 -19 -44 17 36 -11 -7 -1 -10 3 -3 -9 -3 18 10 -27 -27 27 15 -21 -13 29 -2 -30 22 26 -2 -5 7 18
7569 18 15 15 3 -15 13 23 12 -33 7 44 -12 -46 -9 17 14 -12 17 20 -32 -26 -28 19 28 -9 -23 -14 29 5 -32 -18 11 23 -16 -25 25
7604 25 30 -27 -11 5 14 27 13 2 6 8 0 -23 -22 20 -8 -41 19 51 -7 -53 -11 25 8 -16 11 -9 0 24 6 -27 4 27 -6 -15
7638 -15 7 13 -2 -16 17 48 -12 -32 41 18 -11 -27 13 25 -19 -4 16 -5 35 11 5 -5 22 -1 -8 1 34 20 -15 -27 30 29 4
7671 4 10 10 25 -8 8 -21 10 5 8 -26 1 36 5 -7 5 8 0 -15 4 24 4 -5 6 20 3 42 16 -10 35 32 -3 -24 4 28 -38
7706 -38 -37 20 15 -25 -31 4 19 3 -7 -19 -6 6 3 -28 7 34 22 -43 -13 34 -12 -16 -4 33 11 -10 -4 33 24 -16 19 0 12 6
7740 6 -7 -15 3 36 -6 -25 12 18 -5 -48 -1 26 11 -26 -39 56 4 7 13 -9 31 0 -15 8 20 29 -7 -17 23 34 -22 -6 3 33
7774 33 -10 7 8 3 9 1 -7 8 23 28 -15 -11 9 -15 4 -18 32 10 -23 -12 13 3 -10 7 11 1 -5 -9 10 14 19 -18 -45 -9 45 1
7810 1 -9 26 43 12 -1 22 29 -13 -9 5 7 40 3 -9 -8 20 13 -30 -2 27 26 -18 -10 32 6 -16 -7 17 -1 -12 -17 -3 9 3 -1 4 9
7847 9 4 0 -21 -24 21 12 -8 -6 47 21 -18 0 32 12 -1 -7 26 14 11 2 -5 22 7 -1 -6 14 22 -8 -19 24 13 0 -20 -16 25 6 -14
7884 -14 13 22 34 -6 10 9 21 9 -16 11 10 14 -13 -10 12 18 -25 -5 30 14 10 19 -20 20 0 -11 -37 -5 20 -38 -14 -9 12 -2 2
7919 2 17 12 -22 8 18 7 27 -18 -4 -15 9 22 -6 -6 8 2 -4 -8 -5 21 -3 -3 18 16 -2 11 2 30 5 -9 -5 14 8 -17 -12 7 5
7956 5 9 -13 -2 19 2 -37 -8 14 -1 -11 -5 -3 0 7 -22 22 24 7 18 3 5 19 -6 -33 25 13 31 -15 18 27 19 -7 1 16 13 9 -21
7993 -21 7 20 20 -6 14 20 28 -43 -14 -9 37 -13 -23 19 30 4 -10 -4 6 -15 -16 3 31 22 21 2 9 55 14 -13 2 24 16 -14 6
8028 6 11 12 16 7 38 11 -8 -47 -2 -27 6 16 -16 6 -4 2 -8 2 4 -3 -4 6 12 2 4 19 2 4 12 0 10 13 1 -16 12 37 21
8065 21 -15 13 7 -1 -19 -18 22 13 -7 8 -10 7 4 -7 -22 13 16 4 -3 17 23 -16 12 8 4 13 -19 -23 15 28 3 2 6 20 -1 0 -4 23
8103 23 19 -28 -2 -1 19 -18 -13 8 42 0 4 -7 36 3 24 19 -2 38 -4 -34 11 22 5 -5 -10 -1 14 -6 -3 -19 0 -2 20 37 6
8138 6 -30 -18 10 16 5 -15 -22 15 16 7 -15 34 26 7 -1 7 17 5 4 -9 -5 0 23 -8 17 4 12 -16 1 -4 19 7 0 25 0 10 -1
8175 -1 5 -11 -4 6 3 8 -19 -19 -13 0 15 -2 -21 -2 33 14
8191A4
##END NTUPLES=NMR FID
##END=
