##TITLE=1H_LY-DMAA.2.20
 CDCl3
 8 sc, 
 17.03.2022
##JCAMPDX= 6.0         $$ Bruker NMR JCAMP-DX V2.0
##DATA TYPE= NMR FID
##DATA CLASS= NTUPLES
##ORIGIN= UXNMR, Bruker Analytische Messtechnik GmbH
##OWNER= root
$$ XWIN-NMR		Version 3.5
$$ Thu Mar 17 13:29:17 2022 Russian Standard Time (UT+4h)  she@DPX200
##.OBSERVE FREQUENCY= 200.131346
##.OBSERVE NUCLEUS= ^1H
##.DELAY= (6, 6)
##.ACQUISITION MODE= SIMULTANEOUS
##.ACQUISITION SCHEME= undefined
##.AVERAGES= 8
##.DIGITISER RES= 18
##SPECTROMETER/DATA SYSTEM= spect
##.PULSE SEQUENCE= zg30
##.SOLVENT NAME= D2O
##.SHIFT REFERENCE= (INTERNAL, D2O, 0, 15.7039)
##AUDIT TRAIL= $$ (NUMBER, WHEN, WHO, WHERE, WHAT)
$$ ##TITLE= Audit trail, XWIN-NMR		Version 3.5
$$ ##JCAMPDX= 5.01
$$ ##ORIGIN= Bruker BioSpin GmbH
$$ ##OWNER= she
$$ F:/spectra/data/she/nmr/H-F/1/audita.txt
$$ ##AUDIT TRAIL=  $$ (NUMBER, WHEN, WHO, WHERE, WHAT)
(   1,<2022-03-17 13:28:00.51 +0400>,<she>,<DPX200>,
      <created by zg, POWCHK disabled, PULCHK disabled
       configuration hash MD5:
       00 E9 B6 7A A2 85 ED C7 34 08 36 98 17 FE 4E 26
       data hash MD5: 16K
       EA 94 18 57 B0 28 8D EB EA 7E 0E 5D CA AF 6E 80>)
$$ ##END=
$$ 
$$ hash MD5
$$ E8 1A 94 56 07 DC 94 EE 59 20 2D 7E 12 AC 59 F5
##$RELAX= 
##$RELAX= 
##$RELAX= 
##$RELAX= 
##$RELAX= 
##$RELAX= 
$$ Bruker specific parameters
$$ --------------------------
##$DU= <F:/spectra>
##$EXPNO= 1
##$NAME= <H-F>
##$PROCNO= 1
##$TYPE= <nmr>
##$USER= <she>
##$AMP= (0..31)
100 100 100 100 100 100 100 100 100 100 100 100 100 100 100 100 100 100 
100 100 100 100 100 100 100 100 100 100 100 100 100 100 
##$AQSEQ= 0
##$AQ_mod= 1
##$AUNM= <au_zg>
##$AUTOPOS= <>
##$BF1= 200.13
##$BF2= 200.13
##$BF3= 200.13
##$BF4= 200.13
##$BF5= 200.13
##$BF6= 200.13
##$BF7= 200.13
##$BF8= 200.13
##$BYTORDA= 1
##$CFDGTYP= 0
##$CFRGTYP= 5
##$CHEMSTR= <none>
##$CNST= (0..31)
1 1 145 1 1 1 1 1 1 1 1 1 1 1 1 1 1 1 1 1 1 1 1 1 1 1 1 1 1 1 1 1 
##$CPDPRG= <>
##$CPDPRG1= <>
##$CPDPRG2= <>
##$CPDPRG3= <>
##$CPDPRG4= <mlev>
##$CPDPRG5= <mlev>
##$CPDPRG6= <mlev>
##$CPDPRG7= <mlev>
##$CPDPRG8= <mlev>
##$CPDPRGB= <>
##$CPDPRGT= <>
##$D= (0..31)
0 1.2 0 0 0 0 0 0 0 0.06 0 0.03 0 0 0 0 0.0002 0 0 0 0 0 0 0 0 0 0 0 0 
0 0 0 
##$DATE= 1647509279
##$DBL= (0..7)
120 120 120 120 120 120 120 120 
##$DBP= (0..7)
150 150 150 150 150 150 150 150 
##$DBP07= 0
##$DBPNAM0= <>
##$DBPNAM1= <>
##$DBPNAM2= <>
##$DBPNAM3= <>
##$DBPNAM4= <>
##$DBPNAM5= <>
##$DBPNAM6= <>
##$DBPNAM7= <>
##$DBPOAL= (0..7)
0.5 0.5 0.5 0.5 0.5 0.5 0.5 0.5 
##$DBPOFFS= (0..7)
0 0 0 0 0 0 0 0 
##$DE= 6
##$DECBNUC= <off>
##$DECIM= 32
##$DECNUC= <off>
##$DECSTAT= 4
##$DIGMOD= 1
##$DIGTYP= 9
##$DL= (0..7)
0 120 120 120 120 120 120 120 
##$DP= (0..7)
150 150 150 150 150 150 150 150 
##$DP07= 0
##$DPNAME0= <>
##$DPNAME1= <>
##$DPNAME2= <>
##$DPNAME3= <>
##$DPNAME4= <>
##$DPNAME5= <>
##$DPNAME6= <>
##$DPNAME7= <>
##$DPOAL= (0..7)
0.5 0.5 0.5 0.5 0.5 0.5 0.5 0.5 
##$DPOFFS= (0..7)
0 0 0 0 0 0 0 0 
##$DQDMODE= 0
##$DR= 18
##$DS= 0
##$DSLIST= <SSSSSSSSSSSSSSS>
$$ [...]
##$SUBNAM2= <"">
##$SUBNAM3= <"">
##$SUBNAM4= <"">
##$SUBNAM5= <"">
##$SUBNAM6= <"">
##$SUBNAM7= <"">
##$SUBNAM8= <"">
##$SUBNAM9= <"">
##$SW= 18.0517287032376
##$SWIBOX= (0..15)
0 0 2 0 0 0 0 0 0 0 0 0 0 0 0 0 
##$SW_h= 3612.71676300578
##$TD= 16384
##$TD0= 1
##$TE= 0
##$TE2= 300
##$TE3= 300
##$TEG= 300
##$TL= (0..7)
0 120 120 120 120 120 120 120 
##$TP= (0..7)
150 150 150 150 150 150 150 150 
##$TP07= 0
##$TPNAME0= <>
##$TPNAME1= <>
##$TPNAME2= <>
##$TPNAME3= <>
##$TPNAME4= <>
##$TPNAME5= <>
##$TPNAME6= <>
##$TPNAME7= <>
##$TPOAL= (0..7)
0.5 0.5 0.5 0.5 0.5 0.5 0.5 0.5 
##$TPOFFS= (0..7)
0 0 0 0 0 0 0 0 
##$TUNHIN= 0
##$TUNHOUT= 0
##$TUNXOUT= 0
##$USERA1= <user>
##$USERA2= <user>
##$USERA3= <user>
##$USERA4= <user>
##$USERA5= <user>
##$V9= 5
##$VALIST= <valist>
##$VCLIST= <CCCCCCCCCCCCCCC>
##$VD= 0
##$VDLIST= <DDDDDDDDDDDDDDD>
##$VPLIST= <PPPPPPPPPPPPPPP>
##$VTLIST= <TTTTTTTTTTTTTTT>
##$WBST= 1024
##$WBSW= 4
##$XGAIN= (0..3)
0 0 0 0 
##$XL= 0
##$YL= 0
##$YMAX_a= 476787
##$YMIN_a= -414236
##$ZGOPTNS= <>
##$ZL1= 120
##$ZL2= 120
##$ZL3= 120
##$ZL4= 120
##$ABSF1= 10
##$ABSF2= 0
##$ABSG= 5
##$ABSL= 3
##$ALPHA= 0
##$AQORDER= 0
##$ASSFAC= 0
##$ASSFACI= 0
##$ASSFACX= 0
##$ASSWID= 0
##$AUNMP= <proc_1d>
##$AZFE= 0.1
##$AZFW= 0.1
##$BCFW= 1
##$BC_mod= 2
##$BYTORDP= 1
##$COROFFS= 0
##$CY= 11.3945322036743
##$DATMOD= 1
##$DC= 2
##$DFILT= <>
##$DTYPP= 0
##$F1P= 2.36226072786647
##$F2P= -0.459571619588291
##$FCOR= 0.5
##$FTSIZE= 0
##$FT_mod= 4
##$GAMMA= 1
##$GB= 0.15
##$INTBC= 1
##$INTSCL= 1
##$ISEN= 128
##$LB= 0.24
##$LEV0= 0
##$LPBIN= 0
##$MAXI= 10000
##$MC2= 0
##$MEAN= 0
##$ME_mod= 0
##$MI= 1.114404
##$NCOEF= 0
##$NC_proc= 0
##$NLEV= 6
##$NOISF1= 3.799351
##$NOISF2= 2.8
##$NSP= 1
##$NTH_PI= 0
##$NZP= 0
##$OFFSET= 15.70392
##$PC= 1
##$PHC0= -17109.31
##$PHC1= 14.20078
##$PH_mod= 1
##$PKNL= yes
##$PPARMOD= 0
##$PSCAL= 0
##$PSIGN= 0
##$REVERSE= no
##$SF= 200.130013532006
##$SI= 16384
##$SIGF1= 3
##$SIGF2= 2
##$SINO= 400
##$SIOLD= 16384
##$SREGLST= <1H.CDCl3>
##$SSB= 0
##$STSI= 0
##$STSR= 0
##$SW_p= 3612.71676300578
##$SYMM= 0
##$S_DEV= 0
##$TDeff= 0
##$TDoff= 0
##$TI= <>
##$TILT= no
##$TM1= 0
##$TM2= 0
##$TOPLEV= 0
##$USERP1= <user>
##$USERP2= <user>
##$USERP3= <user>
##$USERP4= <user>
##$USERP5= <user>
##$WDW= 1
##$XDIM= 8192
##$YMAX_p= 0
##$YMIN_p= 0
$$ End of Bruker specific parameters
$$ ---------------------------------
##NTUPLES= NMR FID
##VAR_NAME=  TIME,          FID/REAL,        FID/IMAG
##SYMBOL=    X,             R,               I
##VAR_TYPE=  INDEPENDENT,   DEPENDENT,       DEPENDENT
##VAR_FORM=  AFFN,          ASDF,            ASDF
##VAR_DIM=   8192,          8192,            8192
##UNITS=     SECONDS,       ARBITRARY UNITS, ARBITRARY UNITS
##FACTOR=    0.0002768,     1,               1
##FIRST=     0,             0,               0
##LAST=      2.2672688,     0,               0
##MIN=       0,             -414236,         0
##MAX=       2.2672688,     476787,          0
$$ Real data points
##PAGE= N=1
##DATA TABLE= (X++(R..R)), XYDATA
0 0 0 0 0 0 0 0 0 0 0 0 8 -8 8 -16 16 -17 24 -32 40 -42 56 -64 74 -89 105 -122 143 -165 193 -219 249 -283
32 -283 323 -366 412 -466 522 -585 654 -730 811 -902 1002 -1110 1224 -1355 1495 -1648 1816
49 1816 -2000 2204 -2426 2675 -2953 3263 -3613 4011 -4469 5000 -5630 6387 -7312 8482
63 8482 -10012 12104 -15152 20018 -29033 51238 -221125 -133666 476787 132303 -344875 -203630
75 -203630 243204 187830 -81476 -172440 -51793 99638 193389 -20706 -284046 -85118 348413
86 348413 176148 -351992 -255730 324400 295863 -254622 -304273 171136 268455 -74076 -203007
97 -203007 -15000 104340 89337 5430 -136731 -120618 155238 217145 -147085 -290147 119524
108 119524 327187 -79200 -328500 36129 293428 4370 -226151 -30639 138170 41684
118 41684 -39461 -32750 -54165 10867 134573 20386 -193325 -52719 226998 79551 -235651
129 -235651 -96289 219034 96096 -185620 -80524 139519 48444 -91737 -7842 45638
139 45638 -36642 -6182 78189 -25280 -111072 49001 132793 -63770 -137802 74821 128570
150 128570 -82180 -104454 90704 72676 -98737 -36667 106096 1496 -110980 28204
160 28204 110030 -51704 -103190 64915 85641 -71209 -59181 70078 21750 -66976 21763
171 21763 63590 -67247 -61953 109504 63432 -141865 -65581 161952 69653 -163646 -69968
182 -69968 148425 65741 -115458 -51785 70447 27495 -19218 6429 -32073 -48625 75318
193 75318 92805 -107302 -136244 121606 169975 -119310 -190338 99673 190928 -68318 -170129
204 -170129 30709 128636 7209 -68717 -37403 -1772 57204 77517 -60716 -147034 49640
215 49640 203542 -24464 -237876 -8757 245507 43425 -225762 -73545 179428 91023
225 91023 -114132 -93253 35758 75734 43234 -41666 -115000 -6347 169152 60644 -200030
236 -200030 -112853 205565 155487 -185191 -179991 145253 183382 -90234 -161494 30643 118074
247 118074 26311 -56336 -71989 -15339 101154 87625 -111971 -152609 103193 200270 -79983
258 -79983 -226525 45433 225858 -8336 -199961 -26064 151177 50779 -86062 -61636
268 -61636 13385 57903 59151 -38869 -121116 10270 167636 24787 -191994 -58167 194210
279 194210 84880 -174857 -99025 138492 97478 -91644 -80794 39808 49179 8417 -9001
290 -9001 -49670 -36000 78069 77914 -93634 -111852 96208 132883 -88073 -137974 73600 127776
302 127776 -55202 -102337 38400 67194 -23711 -25102 14565 -17054 -9699 55436 8922 -85795
314 -85795 -10130 104836 10453 -113115 -9143 109400 3023 -97591 6454 78550 -20493
325 -20493 -56981 36006 34655 -51137 -13903 63358 -3538 -69202 18736 68646 -30357 -59252
337 -59252 41335 43752 -50705 -22425 60591 -785 -70043 23065 78200 -41875 -84298 53552
349 53552 84853 -58756 -79995 55423 66297 -46868 -45325 33665 16492 -19683 17394 7613
361 7613 -53003 756 87217 -2817 -114158 279 131902 7766 -135648 -17194 125552
372 125552 26279 -100995 -31162 64821 29147 -21302 -19635 -25164 1049 67493 23262 -102000
384 -102000 -51964 122593 79086 -128546 -101248 118435 113386 -94613 -112022 61344 96478
395 96478 -22571 -65869 -14380 24700 46044 24090 -66697 -72992 75248 116939 -70589 -149291
407 -149291 54627 165423 -31465 -163595 4262 142132 19946 -104991 -38813 54699
417 54699 46965 1073 -44214 -56688 30198 104905 -6876 -139552 -21112 157867 50049
428 50049 -156667 -73297 138470 87865 -104978 -89141 62356 76776 -15873 -51206 -28083
439 -28083 15418 63635 25163 -88079 -66250 97847 100233 -94958 -124037 80002 132545
450 132545 -57912 -125583 32413 103397 -7919 -68599 -11218 26501 23690 18926 -27182 -60566
462 -60566 23937 95182 -14206 -117716 2019 126853 10247 -122329 -19685 105175
472 105175 23415 -79323 -21311 47080 11815 -14192 1984 -16950 -19457 42224 36413 -60336
484 -60336 -50681 70315 59718 -72214 -60999 68538 55343 -59796 -41743 49921 23548
495 23548 -39058 -1973 29613 -19301 -21335 38291 13986 -52605 -7494 60109 -215 -61858
507 -61858 8482 56902 -19086 -48027 30390 35962 -42528 -23344 53582 11759 -61592 -1585
519 -1585 65611 -5712 -63125 11686 54908 -15521 -39524 19768 19782 -24100 3166 29883 -26351
532 -26351 -37196 46659 44852 -62247 -52696 69834 57596 -69899 -58995 61192 53973 -46227
544 -46227 -42443 26583 23900 -5452 570 -13473 -27920 28430 56489 -36099 -80915 37364
556 37364 99428 -31079 -107712 20355 104909 -6885 -90089 -6248 64411 15906 -30996
567 -30996 -20778 -7338 18309 44677 -9772 -77844 -4783 101649 22165 -113948 -39800 113176
579 113176 54333 -99227 -62117 75151 61932 -42805 -51348 8007 32236 25938 -5213 -53576
591 -53576 -25541 72296 56506 -80105 -83302 76247 101242 -63241 -108482 42726 102144
602 102144 -19851 -83770 -2766 54329 20674 -18132 -31725 -20626 34869 57472 -29680 -87037
614 -87037 18795 107020 -3419 -113992 -11795 108751 25146 -91319 -32806 64942 33766
625 33766 -32995 -27441 -639 14071 31234 3426 -56475 -23648 72680 42181 -80018 -57113
637 -57113 77557 65159 -67374 -65217 51742 56984 -32873 -40524 14691 19062 1857 5927
649 5927 -13546 -30007 20997 51149 -23355 -66200 22112 73662 -18931 -73259 14879 64691
661 64691 -12377 -50594 11129 31911 -12800 -12170 15773 -7272 -19953 23870 23652 -36361 -25625
674 -25625 44535 25230 -47650 -20892 47475 13839 -43659 -3333 38656 -8400 -32489 20481
686 20481 26275 -31078 -20163 38309 13922 -41906 -7795 40300 312 -35083 7552 25824
698 25824 -17063 -14977 27210 3585 -37637 6606 47073 -14061 -53670 18692 56862 -19282
710 -19282 -54261 17643 46742 -13570 -33128 9650 15347 -6438 5263 5278 -26659 -7094 45753
723 45753 10965 -61020 -17026 69331 23037 -70688 -28332 63791 30355 -50033 -28435 31042
735 31042 21598 -8924 -9495 -12870 -6154 32443 24836 -46290 -43034 53936 59171 -53681 -69911
748 -69911 46785 73379 -34345 -68664 18484 55061 -2558 -34522 -11755 8284 21130 19621
760 19621 -25358 -46624 23218 68866 -15934 -83430 5214 88972 7096 -84042 -17741 70283
772 70283 25510 -48376 -27491 22232 23936 5724 -14313 -31440 318 52124 16096 -65976
784 -65976 -32791 70871 46331 -67925 -55463 56986 57114 -41172 -51683 22077 38597 -3008
796 -3008 -19754 -13442 -2505 25825 25980 -32198 -46752 33301 63112 -28903 -71917 21412 72962
809 72962 -11988 -65452 3248 50932 3282 -31305 -6662 8736 5837 13016 -2201 -32655
821 -32655 -4421 46941 11461 -55689 -18059 57874 22204 -54113 -22867 45749 19929 -33811
833 -33811 -12802 21060 3342 -7961 8252 -3110 -19449 12169 29278 -18359 -36109 21820
845 21820 38885 -23510 -37555 23406 31716 -23056 -23065 22223 11692 -22009 -201 21532 -10821
858 -10821 -20954 19880 19826 -25904 -16938 29140 12737 -28969 -6072 27065 -1876 -23054 11349
871 11349 18958 -20734 -14767 29253 11218 -35583 -8658 38438 6206 -37848 -4271 32693
883 32693 1290 -24488 2367 13238 -7669 -928 14236 -11094 -21608 21459 29264 -28474
895 -28474 -35527 32073 39844 -31074 -40290 26701 36757 -19223 -28423 10476 16100 -1837 -763
908 -763 -5509 -16439 9843 32885 -11384 -47205 9148 56492 -4810 -60334 -1373 57305 7275
921 7275 -47981 -11602 33231 13347 -14649 -11130 -4772 5827 23753 3149 -38929 -13498 49371
934 49371 24456 -53438 -33713 51106 39582 -43232 -41006 30646 36675 -16065 -27550 506
946 506 13436 12954 3234 -23367 -21186 29107 37762 -29959 -50716 26480 58572 -19211 -59486
959 -59486 10562 54017 -1195 -41765 -6119 24983 10936 -5287 -11905 -14561 9140 32320
971 32320 -3559 -46170 -4206 53864 11942 -55697 -18767 50944 22470 -41383 -22688 28063
983 28063 18846 -13032 -11111 -1386 1084 14189 10719 -23287 -21798 28957 31435 -30227 -37375 28316
997 28316 39257 -23773 -36556 17807 29457 -11695 -19175 6084 6285 -2367 6579 -137 -18951
1010 -18951 552 28643 -130 -35123 -818 37668 1504 -36009 -937 31297 -663 -23746
1022 -23746 4109 15292 -8146 -6193 13106 -1807 -17351 8532 20478 -13426 -21880 16391
1034 16391 20529 -18178 -17090 18499 11149 -18642 -4211 18085 -3647 -17770 10949 17386 -16765
1047 -16765 -16496 20683 15212 -21920 -12511 21009 8739 -17702 -3002 13252 -3704 -7976 11497
1060 11497 2977 -19356 1205 26355 -3972 -31736 4985 34008 -4923 -33371 3520 28785
1072 28785 -2322 -21171 1220 10637 -1520 1167 3291 -13044 -6328 23801 10867 -31470 -15281
1085 -15281 35812 19648 -35605 -22018 31679 22400 -24161 -19621 14409 13807 -3832 -5259 -6421
1098 -6421 -5472 14465 16633 -20004 -27576 21846 35997 -20617 -41153 16289 41963 -10067 -37838
1111 -37838 3429 29554 2957 -17283 -7145 3085 9325 12148 -8250 -25842 4799 36907
1123 36907 546 -43553 -6909 45100 12609 -41688 -16778 33392 17943 -22210 -16201 8840
1135 8840 10970 4165 -3145 -15784 -6363 24519 16255 -29522 -24846 30784 31267 -27876 -33832 22510
1149 22510 32659 -14966 -27180 7159 18398 89 -7145 -5650 -5241 8771 17105 -9762 -27420
1162 -27420 8259 34266 -5618 -37638 1926 36494 1323 -31705 -3512 23697 4196 -13586
1174 -13586 -2736 2961 -164 7379 4654 -15701 -9225 21895 13646 -24940 -16455 25252 17270
1187 17270 -23203 -15807 19255 11820 -14596 -6259 9440 -756 -5162 7707 1375 -14267 1165
1200 1165 19048 -3031 -21816 4335 22274 -5359 -20163 6702 16358 -7975 -10936 10016
1212 10016 5269 -11855 562 13925 -5445 -15317 9040 15643 -11363 -14789 12055 12031 -12099
1225 -12099 -8012 10963 2253 -10023 3931 8748 -10353 -8125 16009 7853 -19999 -7692 22161
1238 22161 7681 -21617 -6825 18992 5364 -13984 -2400 7902 -1486 -1151 6543 -5272 -12146
1251 -12146 10421 17370 -13897 -21954 15009 24442 -14241 -25028 11503 22618 -7759 -17658 3548
1264 3548 10198 188 -1089 -2773 -8532 3865 17992 -3046 -25405 1056 30599 2328 -32148
1277 -32148 -5579 30291 8502 -24985 -10064 16891 9468 -7350 -6947 -2904 2109 12034 3872
1290 3872 -19448 -10909 23966 17241 -25316 -22123 23528 24866 -18989 -24321 12807 20846 -5636
1303 -5636 -14168 -863 5647 6520 4355 -9929 -14157 11311 22696 -10528 -29022 7780 31942
1316 31942 -4193 -31518 -22 27308 3230 -20401 -5526 11137 5832 -1189 -4381 -8623 1198
1329 1198 16995 3165 -22883 -7641 26105 12010 -25861 -14585 23176 15555 -18051 -13953
1341 -13953 11702 10204 -4965 -4714 -1369 -2091 6130 8735 -9592 -15121 10945 19552 -10988 -22016
1355 -22016 9553 21809 -7694 -19139 5726 14404 -3975 -8066 3128 1316 -2792 5545 3386
1368 3386 -11169 -4133 15409 5065 -17729 -5522 18065 5153 -16720 -3979 13861 1447
1380 1447 -10418 1590 6353 -5302 -2834 8804 -234 -11878 2505 13846 -3941 -14293 4932
1393 4932 13257 -5402 -10502 6122 6844 -6733 -2119 7869 -2399 -9001 6637 10238 -9764 -11111
1407 -11111 11449 11161 -11938 -10377 10708 8051 -8744 -4721 5929 146 -3334 4893 882 -10222
1421 -10222 779 14967 -1399 -18273 1456 20176 -431 -19657 -386 17204 1475 -12603
1433 -12603 -1655 6628 1043 110 580 -6770 -3184 12341 6388 -16665 -9926 18475 12719 -18291
1447 -18291 -14653 15805 14683 -11710 -12908 6540 9153 -1047 -3701 -3678 -2758 7447 9729 -9361
1461 -9361 -15794 9689 20678 -8150 -23256 5567 23327 -2394 -20736 -825 15536 3272
1473 3272 -8730 -4632 653 4336 7189 -2800 -14479 -44 19599 3571 -22498 -7103 22825
1486 22825 10140 -20381 -11586 15969 11561 -9796 -9411 3316 5724 3024 -544 -8219 -5264 11762
1500 11762 10875 -13318 -15643 12873 18590 -11020 -19521 7876 17939 -4558 -14309 1195 8839
1513 8839 1219 -2393 -2683 -4288 2966 10533 -2061 -15219 647 18307 1394 -19029 -2907
1526 -2907 17896 4004 -14747 -4029 10407 2990 -5354 -1017 203 -1918 4180 4905 -7901 -8055
1540 -8055 9961 10174 -10842 -11402 10385 11149 -8991 -9482 7285 6591 -5341 -2731 3836 -1330 -2598
1555 -2598 5476 2121 -8853 -1654 11222 1582 -12129 -1472 11631 803 -10064 119 7434
1568 7434 -1936 -4580 3823 1508 -6224 996 8421 -2989 -10068 4277 10850 -4742 -10410 4753
1582 4753 8834 -4182 -6001 3738 2480 -3336 1748 3357 -5558 -3756 9109 4557 -11650 -5415
1596 -5415 12691 5948 -12406 -6173 10444 5419 -7619 -3837 3895 1201 -145 2058 -3256 -5790
1610 -5790 5747 9566 -6991 -12510 7180 14655 -6144 -14948 4417 13779 -2134 -10743 89
1623 89 6409 1590 -1167 -2469 -4511 2131 9614 -1014 -13956 -996 16430 3214 -17222 -5339
1637 -5339 15913 6763 -12866 -7286 8461 6486 -3152 -4307 -2066 1218 6850 2848 -10187 -6943
1651 -6943 12177 10816 -12284 -13545 10803 14849 -8148 -14317 4644 11707 -1343 -7863 -1879
1664 -1879 2623 3860 2969 -4884 -8442 4499 12805 -3158 -15762 1213 16985 1100 -16067
1677 -16067 -2968 13518 4328 -9346 -4399 4556 3598 623 -1740 -5247 -955 8944 3828 -11371
1691 -11371 -6770 12153 8759 -11667 -9956 9747 9679 -7147 -8102 4067 5299 -1185 -1679 -1231 -2418
1706 -2418 2961 6414 -3580 -9460 3621 11678 -2815 -12311 1948 11640 -963 -9618 458 6547
1720 6547 -429 -3168 863 -569 -2101 3713 3190 -6185 -4538 7611 5444 -8133 -5746 7763
1734 7763 5282 -6593 -3948 5170 2077 -3484 629 2181 -3180 -916 5741 319 -7684 8 8704
1749 8704 -139 -8883 134 7872 -368 -6057 820 3441 -1789 -694 2914 -2096 -4413 4248 5905
1764 5905 -5715 -7083 6367 7738 -5991 -7469 4974 6386 -3426 -4249 1922 1587 -478 1793
1778 1793 -450 -5115 787 8049 -543 -10314 -292 11229 1237 -11212 -2320 9620 2822 -7050
1792 -7050 -2929 3562 2240 142 -723 -3694 -1312 6766 3872 -8731 -6139 9594 8300 -9055
1806 -9055 -9361 7520 9485 -5076 -8202 2289 5836 400 -2487 -2780 -1608 4137 5458 -4664
1820 -4664 -9206 4039 11696 -2834 -13013 1051 12789 851 -11024 -2440 7965 3413 -4014
1833 -4014 -3316 -197 2632 4426 -819 -7755 -1308 10172 3754 -11221 -5940 10828 7403 -9253
1847 -9253 -8047 6608 7320 -3613 -5684 367 2996 2333 249 -4424 -3865 5553 7050 -5614 -9462
1862 -9462 4942 10981 -3441 -10865 1852 9616 -204 -7092 -956 3822 1597 -163 -1459 -3405
1876 -3405 659 6300 493 -8484 -1971 9327 3143 -9249 -3989 8040 4120 -6038 -3486 3685
1890 3685 2246 -1318 -325 -824 -1816 2613 4028 -3469 -5773 3878 7073 -3600 -7325 3055 6756
1905 6756 -2296 -5433 1622 3348 -1244 -1009 1029 -1614 -1373 3673 1735 -5500 -2401 6293 2803
1920 2803 -6366 -2963 5703 2621 -4394 -1597 2946 288 -1194 1607 -131 -3427 1280 5125 -1762
1935 -1762 -6378 1796 6999 -1451 -6824 945 5717 -480 -4020 113 1630 -308 772 744 -3264
1950 -3264 -1608 5201 2640 -6414 -3715 6925 4625 -6377 -4842 5231 4710 -3392 -3612 1455 1999
1965 1999 617 250 -2162 -2833 3215 5139 -3629 -7303 3197 8426 -2392 -8842 1053 7951 222
1980 222 -6282 -1345 3602 1896 -550 -1883 -2603 1280 5441 -38 -7534 -1460 8761 3076 -8855
1995 -8855 -4372 7835 5078 -5979 -5142 3433 4346 -809 -2854 -1808 505 3844 1951 -5227 -4537
2010 -4537 5644 6653 -5227 -8134 4123 8704 -2488 -8055 776 6416 851 -3880 -1923 998
2024 998 2520 2182 -2225 -4913 1454 7132 -244 -8466 -1265 8563 2407 -7861 -3326 6071 3496
2039 3496 -3799 -3119 1093 2030 1271 -322 -3392 -1571 4696 3500 -5304 -5000 5237 6091 -4407 -6210
2055 -6210 3285 5693 -1867 -4339 623 2448 404 -197 -1093 -2200 1156 4142 -928 -5750 217
2070 217 6455 382 -6502 -1096 5606 1414 -4275 -1285 2464 819 -621 270 -1080 -1368 2558 2683
2086 2683 -3281 -3663 3645 4326 -3315 -4474 2739 3962 -2003 -2942 1149 1278 -606 519 147 -2342
2102 -2342 -173 3767 317 -4884 -773 5283 1202 -5094 -1425 4283 1457 -2967 -1023 1447 355
2117 355 229 812 -1638 -2104 2717 3344 -3188 -4488 3128 4992 -2723 -5128 1769 4398 -905 -3332
2133 -3332 -73 1396 642 598 -903 -2734 747 4496 -131 -5712 -617 6363 1577 -6003 -2169 5173
2149 5173 2721 -3491 -2610 1617 1996 539 -824 -2430 -695 3784 2333 -4624 -3903 4723 5012 -4231
2165 -4231 -5746 3072 5695 -1724 -4937 238 3402 1047 -1450 -1920 -939 2368 3209 -2107 -5070 1519
2181 1519 6442 -460 -6867 -714 6617 1795 -5455 -2545 3634 2643 -1511 -2322 -800 1324 2720
2196 2720 -69 -4346 -1556 5121 2975 -5322 -4172 4799 4898 -3603 -4752 2268 4187 -632 -2892
2211 -2892 -695 1151 1853 914 -2403 -2838 2438 4418 -2006 -5582 1215 5913 -385 -5634 -559 4553
2227 4553 1126 -3100 -1467 1241 1269 694 -648 -2316 -194 3631 1340 -4295 -2272 4454 3066 -3890
2243 -3890 -3300 3043 3134 -1839 -2414 701 1260 290 119 -1087 -1720 1395 2971 -1426 -4011 1003 4359
2260 4359 -677 -4318 148 3700 233 -2642 -377 1306 310 308 159 -1599 -744 2647 1481 -3269
2276 -3269 -2093 3380 2568 -3134 -2768 2421 2408 -1535 -1789 500 714 185 576 -926 -1892 1018 3110
2293 3110 -967 -3927 560 4324 -47 -4129 -479 3438 892 -2238 -916 878 834 716 -177 -2003
2309 -2003 -585 3048 1514 -3670 -2374 3633 3011 -3259 -3430 2285 3200 -1357 -2559 131 1464 912
2325 912 -61 -1649 -1477 1961 2895 -1902 -4015 1456 4766 -681 -4778 -82 4331 932 -3287 -1475
2341 -1475 1848 1641 -153 -1397 -1589 691 3006 179 -4019 -1292 4322 2289 -4259 -3078 3442
2356 3442 3425 -2364 -3266 1043 2660 318 -1485 -1403 119 2294 1505 -2529 -2904 2491 4019 -1892 -4598
2373 -4598 1089 4619 -180 -4116 -651 3047 1234 -1614 -1547 -35 1417 1650 -874 -2975 225 3850
2389 3850 732 -4182 -1561 4048 2297 -3289 -2558 2371 2524 -1005 -1897 -209 946 1281 200 -1945
2405 -1945 -1465 2278 2551 -2257 -3361 1760 3660 -1119 -3646 324 3012 176 -2076 -693 756
2420 756 830 595 -684 -1771 311 2774 324 -3261 -857 3385 1436 -2992 -1615 2330 1721 -1421
2436 -1421 -1319 475 695 485 90 -1240 -1131 1593 1927 -1724 -2681 1477 2964 -1037 -3007 475 2538
2453 2538 40 -1640 -357 651 566 580 -375 -1574 57 2416 432 -2898 -1053 2978 1497 -2626
2469 -2626 -1773 2008 1729 -1175 -1419 134 688 662 112 -1305 -1164 1681 1966 -1773 -2747 1502 3160
2486 3160 -897 -3134 403 2730 278 -1908 -726 887 1017 417 -947 -1563 568 2490 -27 -3177
2502 -3177 -632 3295 1284 -3109 -1840 2387 2021 -1578 -1950 321 1416 657 -667 -1529 -373 2123
2518 2123 1411 -2226 -2296 2086 3061 -1565 -3333 911 3228 -60 -2606 -650 1709 1136 -554 -1368
2534 -1368 -804 1240 1846 -979 -2842 274 3326 395 -3468 -1134 3039 1666 -2335 -1885 1348 1851
2550 1851 -154 -1281 -848 662 1776 385 -2221 -1205 2458 2088 -2272 -2683 1692 2884 -967 -2801
2566 -2801 138 2152 488 -1301 -1031 186 1226 904 -1197 -1936 853 2639 -267 -2924 -257 2988
2582 2988 912 -2541 -1172 1865 1342 -917 -1178 -101 838 930 -207 -1630 -570 1973 1266 -2042
2598 -2042 -1870 1741 2200 -1366 -2215 703 1878 -66 -1296 -434 476 793 442 -845 -1296 771 2021
2615 2021 -389 -2395 -11 2500 531 -2197 -859 1670 1031 -936 -980 117 659 662 -137 -1279 -530
2632 -530 1616 1101 -1706 -1685 1550 2013 -1146 -2072 629 1797 -12 -1186 -396 561 801 327 -870
2649 -870 -1155 773 1847 -349 -2260 -62 2443 549 -2261 -935 1678 1104 -969 -1171 91 865
2665 865 654 -427 -1394 -270 1759 956 -1894 -1530 1724 1916 -1326 -2124 809 1999 -72 -1589 -490
2682 -490 875 958 -15 -1174 -908 1134 1629 -808 -2242 278 2507 87 -2539 -741 2047 1047
2698 1047 -1471 -1286 601 1256 226 -874 -1081 376 1676 305 -1937 -981 2071 1605 -1720 -1951
2714 -1951 1235 2088 -605 -1929 -174 1363 673 -659 -1152 -257 1257 1031 -1244 -1787 860 2224
2730 2224 -414 -2459 -180 2269 733 -1739 -1037 1133 1206 -326 -1058 -426 755 1200 -184 -1667
2746 -1667 -370 1869 953 -1847 -1440 1505 1698 -1016 -1707 379 1509 129 -998 -691 290 970 421
2763 421 -1112 -1144 995 1681 -667 -1992 286 2017 271 -1770 -562 1295 897 -608 -876 -104 709
2780 709 776 -368 -1286 -101 1589 564 -1688 -1076 1422 1288 -1115 -1411 576 1309 -1 -917 -442
2797 -442 426 800 247 -905 -860 924 1309 -658 -1694 387 1795 74 -1606 -401 1249 667 -723
2814 -723 -846 -57 682 561 -478 -1151 2 1444 369 -1595 -872 1436 1228 -1074 -1340 646 1359
2831 1359 -50 -956 -408 567 790 70 -951 -679 980 1197 -814 -1584 401 1793 -78 -1726 -377
2848 -377 1357 668 -942 -894 257 890 346 -698 -980 358 1364 155 -1530 -589 1581 1086 -1256
2865 -1256 -1280 865 1401 -259 -1184 -210 871 722 -352 -1018 -264 1132 866 -1069 -1433 695 1629 -369
2883 -369 -1726 -132 1571 573 -1202 -876 631 1009 23 -902 -643 630 1208 -260 -1486 -184 1645
2900 1645 735 -1481 -1059 1188 1217 -732 -1243 106 1036 383 -681 -796 131 1033 370 -1108 -949 927
2918 927 1391 -709 -1579 262 1515 194 -1308 -568 877 840 -318 -842 -255 737 796 -494 -1219 137
2936 137 1420 332 -1455 -737 1184 970 -879 -1153 333 1049 149 -782 -527 370 873 98 -1007 -596
2954 -596 980 1039 -725 -1210 471 1370 -28 -1236 -290 897 591 -517 -718 9 704 455 -549 -959
2972 -959 212 1182 114 -1320 -555 1136 782 -940 -956 480 966 -5 -823 -384 556 746 22 -888
2990 -888 -384 973 785 -748 -1101 559 1269 -138 -1206 -219 941 552 -589 -746 95 771 276 -667
3008 -667 -807 326 1136 -33 -1225 -311 1203 671 -978 -821 630 991 -152 -871 -247 640 637 -280
3026 -280 -835 -136 982 598 -904 -968 605 1156 -302 -1232 -139 995 390 -853 -648 348 753 160
3044 160 -742 -535 567 996 -208 -1132 -69 1209 485 -1035 -685 799 918 -367 -953 -51 769 486
3062 486 -469 -745 123 893 276 -907 -753 728 922 -545 -1148 207 1075 162 -906 -484 533 683
3080 683 -140 -685 -230 652 703 -450 -990 132 1153 123 -1117 -549 854 751 -601 -878 110 756
3098 756 237 -646 -607 283 779 51 -879 -487 809 733 -660 -938 316 1039 42 -906 -293 662 580 -319
3118 -319 -667 -91 666 452 -535 -756 263 962 -65 -1017 -318 883 550 -685 -782 301 707 50 -651
3137 -651 -447 401 628 -131 -800 -235 832 568 -663 -772 466 1042 -93 -890 -171 774 443 -383 -630
3156 -630 71 669 219 -606 -598 348 796 -102 -979 -165 893 438 -705 -619 419 689 -155 -684 -221 529
3176 529 525 -280 -655 -24 797 376 -707 -634 518 846 -311 -890 -73 755 259 -543 -616 191 575 111
3196 111 -686 -467 477 689 -254 -853 -31 852 300 -740 -566 544 724 -241 -701 -63 619 383 -385
3215 -385 -667 84 752 123 -746 -541 587 645 -403 -827 90 739 117 -638 -406 338 518 -34 -666 -251
3235 -251 550 577 -383 -653 158 814 155 -794 -359 641 562 -352 -647 77 611 240 -479 -586 264 653
3255 653 -1 -709 -307 620 503 -503 -690 201 819 -10 -720 -330 478 551 -208 -570 -129 601 387 -474
3275 -474 -618 242 761 35 -787 -205 616 403 -498 -562 201 674 70 -581 -362 376 511 -133 -718 -229
3295 -229 675 418 -501 -541 344 688 -35 -608 -169 532 398 -324 -564 49 595 224 -522 -514 322 668 -144
3316 -144 -751 -130 639 327 -545 -539 296 571 -49 -552 -195 437 493 -270 -573 26 639 222 -557 -425 475
3337 475 613 -194 -680 -71 580 310 -417 -534 210 558 10 -566 -340 410 497 -353 -683 16 668 181
3357 181 -612 -385 357 525 -132 -528 -130 498 394 -319 -492 176 594 124 -650 -360 492 521 -313 -628
3377 -628 48 573 142 -483 -402 270 453 -102 -535 -160 476 374 -336 -531 153 574 65 -550 -264 476
3397 476 504 -226 -523 -78 513 240 -456 -369 190 567 -9 -584 -219 542 395 -374 -565 147 567 77 -502
3418 -502 -283 384 446 -146 -492 -40 467 245 -416 -415 242 612 10 -551 -224 502 350 -327 -503 99 476
3439 476 95 -415 -302 242 406 -110 -550 -109 494 279 -337 -450 185 565 3 -502 -192 351 358 -223 -470
3460 -470 17 512 217 -403 -377 305 507 -154 -523 -75 489 232 -356 -429 179 429 -77 -431 -264 383 386
3481 386 -216 -435 8 533 164 -407 -318 290 518 -59 -414 -56 470 288 -356 -382 97 467 1 -458 -258
3502 -258 348 400 -230 -488 -11 483 129 -465 -376 269 430 -146 -481 -70 441 312 -291 -367 151 468 87
3523 87 -426 -315 382 396 -189 -442 39 457 171 -394 -355 245 390 -81 -423 -186 362 301 -301 -424 129
3544 129 430 56 -426 -237 343 371 -182 -462 39 456 161 -313 -322 190 432 -10 -446 -135 385 263 -319
3565 -319 -467 78 416 62 -464 -308 273 321 -145 -416 -33 427 170 -254 -279 208 444 -17 -426 -149 359
3586 359 306 -258 -359 136 394 62 -399 -253 220 332 -61 -405 -85 420 161 -345 -378 180 371 35 -395
3607 -395 -161 309 225 -215 -397 -44 398 141 -372 -288 236 383 -57 -396 -105 370 259 -308 -350 123 371
3628 371 18 -347 -170 282 296 -149 -370 39 313 125 -308 -298 161 405 -75 -395 -127 354 266 -227 -280
3649 -280 122 438 73 -372 -209 271 263 -222 -376 -23 357 175 -330 -294 198 339 -91 -401 -83 343 232
3670 232 -248 -368 116 327 107 -348 -151 239 312 -114 -373 -49 402 162 -274 -270 132 317 -66 -367 -98
3691 -98 331 190 -222 -355 55 330 49 -360 -195 192 338 -94 -345 -6 347 147 -267 -282 165 341 -24
3712 -24 -304 -117 268 186 -201 -380 119 338 74 -347 -240 204 275 -146 -341 5 301 165 -292 -313 128
3733 128 297 -38 -300 -180 278 225 -179 -304 119 307 98 -296 -165 186 270 -54 -275 -88 302 147 -265
3754 -265 -297 87 256 -16 -312 -157 234 237 -169 -228 35 301 104 -229 -217 126 293 -96 -304 -31 278 162
3776 162 -232 -266 49 236 39 -283 -173 188 190 -162 -245 1 242 93 -214 -218 130 276 -46 -258 -32 319
3798 319 214 -184 -280 71 276 35 -250 -111 150 241 -114 -266 -39 276 123 -209 -284 121 253 -70 -299
3819 -299 -79 254 154 -185 -321 14 224 47 -220 -166 118 267 -119 -291 -19 316 172 -225 -272 122 263
3840 263 -42 -274 -32 252 213 -141 -273 5 295 71 -291 -200 179 243 -44 -289 -40 276 44 -255 -197
3861 -197 67 229 7 -262 -68 201 232 -137 -234 62 321 69 -221 -160 185 159 -95 -246 -26 228 86
3882 86 -189 -214 106 212 50 -262 -149 152 230 -108 -223 29 331 61 -236 -144 191 201 -83 -227 -45 241
3904 241 149 -161 -216 92 306 -26 -244 -131 166 175 -164 -248 84 227 75 -227 -156 166 203 -20 -190 -74
3926 -74 208 210 -190 -243 84 184 16 -219 -72 167 155 -138 -223 17 180 141 -195 -180 74 185 -114 -317 -66
3949 -66 233 148 -180 -227 67 171 1 -198 -95 163 150 27 -151 -58 266 171 -126 -121 99 247 -40 -209 -23
3972 -23 209 91 -95 -231 6 213 27 -152 -158 108 152 -75 -266 -101 244 91 -154 -166 123 228 35 -184
3994 -184 -99 171 143 -108 -207 63 189 114 -185 -146 115 186 -41 -269 -40 207 46 -191 -214 107 235 62
4016 62 -175 -115 175 198 -111 -219 23 239 63 -211 -100 169 162 -108 -198 -47 170 68 -183 -171 46 157
4038 157 4 -205 -117 201 170 -95 -242 5 244 56 -155 -115 129 172 -44 -178 -80 221 113 -125 -191 115
4060 115 248 36 -235 -103 169 142 -151 -230 33 186 92 -160 -148 106 87 -88 -168 -49 184 140 -167 -131 85
4083 85 204 -5 -214 -8 109 127 -81 -120 -11 134 88 -157 -143 111 165 -2 -155 -70 144 100 -167 -146 24
4106 24 97 -10 -126 -47 65 157 -32 -183 35 195 126 -183 -103 105 178 -36 -190 -72 144 62 -83 -147 -27
4129 -27 132 72 -186 -136 106 126 -56 -182 -7 159 127 -135 -125 112 135 26 -121 -43 122 110 -80 -152 8
4152 8 169 61 -155 -154 69 137 -39 -190 3 113 42 -130 -122 78 129 -30 -140 -75 103 134 -31 -210 10 189
4176 189 94 -148 -78 110 132 6 -131 -5 133 97 -47 -126 41 173 23 -128 -133 105 104 -91 -110 -1 164
4199 164 4 -150 -90 48 144 -35 -186 -7 163 136 -112 -154 30 215 -6 -202 -66 145 79 -87 -133 15
4221 15 96 38 -125 -96 74 146 -44 -151 -40 116 92 -150 -121 131 122 24 -128 -68 160 126 -43 -117 31 108 78
4246 78 -92 -110 36 140 -52 -224 -28 110 131 -104 -89 31 99 1 -132 -84 96 126 -51 -154 13 180 23
4269 23 -142 -76 96 124 -2 -104 8 115 58 -17 -59 -14 105 38 -139 -117 55 77 -61 -97 -54 113 26 -122
4293 -122 -97 101 124 -21 -105 -60 44 73 -84 -96 23 149 73 -132 -94 123 118 -62 -108 38 89 28 -112 -53 47
4318 47 100 -2 -129 -22 67 111 -53 -119 -3 139 -4 -135 -47 79 112 -49 -120 -18 123 113 -72 -71 24 159
4342 159 1 -141 -82 109 47 -101 -121 64 170 -2 -84 -42 91 93 44 -136 -41 117 111 -15 -156 49 86 -19
4366 -19 -115 -54 95 118 -38 -91 -28 72 90 -140 -73 73 148 15 -177 -30 85 73 -111 -127 40 100 24 -77
4390 -77 -73 87 101 -1 -98 -43 156 40 -74 -39 73 183 -58 -123 -45 93 125 -43 -91 69 46 27 -77 -104 13
4415 13 63 6 -123 -20 143 7 -121 -46 120 75 -18 -82 -11 132 77 -70 -77 -28 70 6 -97 -57 89 79 -44
4440 -44 -147 -15 95 19 -122 -65 41 108 35 -89 -74 93 84 -65 -80 -47 144 33 -79 -72 58 94 -1 -43 16
4465 16 112 60 -60 -97 5 69 -29 -110 -24 62 65 -79 -77 46 117 -4 -95 -25 77 89 -3 -72 -39 34 71 -71 -22 15
4493 15 130 -8 -138 -48 70 29 -106 -113 -27 86 -19 -91 -105 -1 13 -42 -132 -38 64 75 -74 -93 47 60 -23
4518 -23 -71 -37 93 67 -12 -69 7 97 78 -49 -82 -3 124 14 -118 -36 76 80 -59 -84 17 46 14 -50 -77 14 72
4545 72 5 -52 -46 80 33 -101 -73 58 56 -27 -37 -27 64 89 -58 -46 17 57 25 -61 -43 44 15 6 -104 -10 77 35 -57
4574 -57 -81 77 86 -35 -99 -29 106 -19 -43 -126 45 82 53 -104 -49 30 90 -26 -112 -9 93 18 -112 -35 40 92
4600 92 9 -56 -38 64 88 22 -41 20 70 6 -133 -67 28 57 -50 -86 21 94 33 -106 -56 27 51 -17 -75 -48 14 97
4628 97 -45 -125 -19 72 5 -128 18 47 71 24 -37 -5 46 74 -74 -90 5 101 54 -62 -11 54 14 -16 -60 20 95
4655 95 32 -63 -56 58 29 -1 -58 -65 39 -16 -3 -123 16 58 -17 -96 -61 67 19 -12 -54 -24 108 41 -45 -10 -9 101
4683 101 0 -40 -54 81 42 -78 -43 32 93 12 -26 -32 31 84 33 -2 -26 78 19 -56 -79 66 50 -13 -34 -30 71 0
4711 0 -26 -73 58 105 61 -25 4 18 43 -22 -104 1 100 11 -69 -55 28 68 -53 -53 -50 78 54 53 -74 -6 97 49 -66
4740 -66 -37 9 88 -19 -109 10 72 69 -25 -18 -3 118 -2 -66 -40 9 24 -65 -80 2 46 31 -88 -40 23 30 -26 -45 -10
4769 -10 64 41 45 2 33 107 18 -27 -12 67 29 -9 -60 23 73 -4 -73 -7 -9 39 -20 -61 -22 90 50 -56 -111 32 66 -4
4799 -4 -66 33 57 -4 -39 -89 -29 71 27 5 9 10 84 -20 -52 14 81 72 -24 -53 73 54 -35 -36 -16 7 23 -31 -39 -39 33 -8
4831 -8 -17 -84 42 20 4 -34 14 46 6 -2 -27 12 53 -30 -9 -54 49 59 7 -24 -38 59 -23 -27 4 37 22 52 -37 23 4
4862 4 14 -78 -39 13 31 30 -30 -28 -8 95 -33 -36 8 82 19 -75 -118 39 5 -7 -36 -21 44 26 -6 -65 -27 50 42 -43 -41 62
4894 62 73 8 -30 9 93 39 37 -37 17 -10 3 -37 -78 42 25 -38 -67 19 59 10 -52 1 14 46 -41 -52 -71 30 42 -31
4924 -31 -48 24 88 53 -16 -36 58 21 -60 -41 44 7 -54 -14 -31 -23 67 16 18 7 29 12 -53 -29 56 40 -28 -21 7 60 45 -32
4956 -32 -30 -16 1 -26 -54 -73 1 20 -22 -66 -36 28 14 -49 -57 4 -36 18 -58 -3 44 30 87 -48 42 -10 75 -39 -64 56
4986 56 79 -23 -67 56 59 14 -33 37 61 32 4 9 -37 55 43 0 -79 12 25 -23 -70 2 21 3 -16 -69 -8 -16 47 -17 -10
5017 -10 27 33 4 -31 -39 55 62 -8 -24 4 43 0 -27 -23 57 23 -5 39 1 33 13 13 -52 -28 -16 49 -60 -26 -12 33 -13 -29
5049 -29 -16 79 28 -33 1 28 2 7 6 -4 58 24 -10 -57 -22 -3 -14 -63 -34 20 22 37 14 44 54 29 -1 -17 75 59 -16 -41
5081 -41 -48 46 60 -27 -46 -14 -6 16 6 -42 -44 30 12 -63 -10 97 12 -67 -29 -19 62 -54 -50 -11 94 35 -55 17 -33 11 19
5112 19 -74 -27 20 48 -33 -9 3 52 22 5 -58 21 33 42 -24 -39 14 46 -9 9 5 26 53 -57 -39 54 55 -33 -19 -37 9
5143 9 6 -16 -23 43 29 24 -15 3 25 -29 10 -29 45 19 40 -20 -61 45 -1 20 -19 -43 -20 3 -23 -26 17 23 29 11 -59 9 25
5176 25 -56 -93 15 65 22 -17 -42 44 -8 33 -25 -6 49 5 -19 -70 36 -21 6 -51 -4 -23 21 -1 -30 -25 -26 9 -18 21
5206 21 -12 19 -30 -32 -32 13 29 -34 -95 -36 38 39 -34 41 88 13 -36 -42 -15 11 1 -29 -36 -8 26 34 -60 -56 61 6 31 -7 25
5239 25 40 16 -7 4 0 41 18 -29 -28 2 49 -38 -19 26 19 -6 -33 -39 29 5 23 -32 10 7 -34 17 -35 -26 61 48 -86 -53 6
5272 6 42 -50 -66 -50 2 1 -7 -41 90 60 -50 -1 22 10 6 -68 -21 6 51 9 -4 -47 -21 0 5 -30 8 44 -3 2 -27 40
5304 40 8 -5 -27 -8 39 9 -14 -27 11 -36 -40 -16 -20 -4 45 23 -30 30 60 75 -44 -54 83 32 -19 -29 30 4 48 -7
5334 -7 -4 12 2 -28 8 -54 15 -19 13 -63 -4 66 -49 8 36 25 -4 -57 -46 -12 21 55 -74 -12 -33 10 44 -34 53 20
5364 20 2 1 -19 28 -4 7 1 24 19 -24 -30 4 15 -32 4 -61 -31 6 23 -11 -13 -57 10 4 -23 -18 -19 -28 16 -26 -25 11 13 6 -42 -40 70
5401 70 30 4 -64 -11 -9 32 18 9 26 1 5 -17 -24 47 -14 3 -29 -2 25 -17 35 5 1 9 -40 -73 45 65 9 23 -20 -33 24
5434 24 13 -52 -58 44 26 7 -42 -11 36 -15 -14 38 24 61 -8 -4 15 22 25 -18 -29 -5 25 -6 -67 6 18 18 -72 -9 -11 -18 -41 -74
5468 -74 -22 -34 50 -14 -59 -43 -11 36 -36 12 32 33 -81 -42 -2 4 -26 -13 25 -16 4 35 35 19 16 2 -22 -32 -30 73 -43
5499 -43 -75 2 -10 1 -52 33 15 -12 27 -68 -7 -11 24 -10 -74 40 30 1 -11 -47 -40 6 -84 17 10 -14 -22 13 -30 36 37 23
5531 23 27 -26 12 11 -25 22 -36 -13 49 -61 -3 -3 -29 -35 16 -24 -11 6 19 -24 -23 15 -7 -50 -31 -29 -25 3 21 -22 12 14 -16 12
5565 12 -8 45 1 3 21 -9 50 12 -42 -9 6 -33 -8 -27 -7 -9 19 31 -19 4 4 7 -37 -21 45 19 -62 -31 -28 16 6 -72 22
5598 22 -35 -4 31 7 -55 49 -34 -15 -32 24 54 -7 -38 -17 -18 -36 18 17 20 42 5 -6 22 -29 26 23 -1 -1 47 -12 41 -11
5630 -11 -7 -25 -18 -29 -30 -41 -5 23 2 -16 36 -4 -46 -44 68 17 15 10 39 26 -24 29 -51 25 -48 -46 -20 28 18 20 19 -37 -23 51
5664 51 -2 -1 -5 12 -10 -13 50 26 20 -34 0 -31 -52 22 8 -55 32 -29 0 -45 0 -3 5 20 -22 -14 3 21 -29 23 43 -83 0
5697 0 26 35 -28 8 -17 -60 -11 29 -42 24 -25 43 55 -5 44 11 -7 -20 19 11 9 -21 -28 -28 -55 15 41 -42 -39 21 9 -10 9 46
5731 46 24 36 47 -3 2 -22 52 22 -97 17 1 38 29 33 6 19 10 7 38 9 35 6 -34 -10 -8 9 -10 -23 -3 11 -13 -48
5763 -48 23 -8 42 8 -48 12 27 -9 -21 -20 -12 23 -30 -49 22 31 17 17 -19 18 -8 14 -19 28 30 39 27 -2 27 21 32 -21 -44 5
5797 5 53 -10 -17 -47 2 -28 -95 32 14 31 26 5 64 36 5 -41 -78 -11 -22 -6 -7 45 65 26 -55 35 20 -9 -31 -10 9 40
5829 40 -30 -27 -64 3 34 18 -3 -27 50 -17 -24 -6 -15 43 -23 14 0 59 -2 -32 -37 0 -37 0 1 -52 -22 -16 -7 -28 -14 13 -14 -27
5863 -27 45 7 14 25 32 -1 -50 -25 -7 10 6 15 25 9 -23 19 -29 0 5 17 53 -1 1 -55 -44 13 -1 -4 -31 -2 20 0 -61 -62
5897 -62 21 18 -1 32 -12 -12 6 -17 35 -30 27 15 -48 -28 -25 22 17 12 9 66 -30 27 -37 54 -65 -39 47 -34 -19 -4 23 2 22
5930 22 24 -4 -52 18 57 -7 -16 -24 -5 -48 7 26 10 14 -9 37 -45 6 -15 19 -10 -59 -5 -32 -32 -39 10 -5 30 33 -19 -11 -26 34
5964 34 -9 8 -37 3 25 -42 -63 23 -14 6 -44 -19 -24 -11 -10 -43 -20 38 -7 -57 -61 -12 27 13 -59 42 41 3 -31 -5 4 28
5996 28 26 -39 1 26 -14 8 -18 77 35 -15 -36 -33 28 -4 8 8 -3 21 3 -39 -8 16 -38 -27 -49 -59 74 22 9 -32 -14
6027 -14 24 -12 21 -4 -16 -33 29 49 20 42 -19 8 12 43 8 26 20 63 0 18 39 -7 55 -11 8 -28 18 -30 29 15 10 -59
6059 -59 43 -48 -82 -40 -57 -16 51 -33 0 11 23 -9 9 -21 15 -10 -16 28 -12 8 -1 19 6 23 -6 13 -43 8 12 4 19 22
6091 22 -36 5 0 8 -15 17 -32 -34 -7 -40 72 -10 -38 8 -9 0 2 -14 4 -11 -8 -50 -6 -31 58 9 -39 -76 -5 -48 -25 -38 -53
6124 -53 -46 -7 -23 -3 1 8 -14 5 -25 36 -12 29 -14 13 13 -27 -16 12 9 -66 3 -31 -68 -1 0 -15 -43 -28 0 -43 -32 -15 39
6157 39 17 -64 29 19 2 -41 -9 -14 29 30 9 -15 8 -6 8 -54 -18 7 -26 -6 -35 27 -35 -29 -46 31 9 20 -27 -48 17 -55
6189 -55 43 -46 -35 22 -17 9 -10 -27 7 22 -74 5 25 36 37 -38 -28 31 -14 20 19 0 24 -3 -1 45 4 35 -4 -6 -21 18
6221 18 27 25 6 0 -18 53 -2 -34 34 28 26 -54 20 -72 -14 -52 -34 26 2 -10 18 -15 0 14 -17 31 -29 -2 -6 43 -13 -3 -1 -23
6255 -23 60 -47 -10 33 10 17 -49 -23 12 8 5 -25 23 -22 -7 -10 -6 -50 -3 7 -14 -60 -16 1 5 -2 -5 61 -1 -16 -31 -13 -27 -2
6289 -2 12 -3 -56 -69 -51 12 37 36 -35 -3 -58 84 -10 -56 23 71 -34 -34 -5 -10 10 -26 30 10 -45 -55 50 -9 -90 -47 -20
6320 -20 6 -2 37 -34 -25 16 -55 -3 13 -1 -19 35 -23 10 43 23 -33 35 56 -67 38 33 -10 12 -28 10 1 -14 -30 32 -26
6351 -26 0 8 -22 66 -21 35 -5 -6 -55 -8 -11 -39 -3 -50 -8 -6 -43 3 -14 -20 -2 -35 -6 19 -34 -10 -6 23 -13 -14 9 -9 -15 0
6385 0 -62 40 -5 4 -18 26 53 12 38 -18 -13 -6 -41 54 -42 -1 13 34 -28 3 24 -37 55 -19 -61 -19 -23 -20 -67 -17 19 -16 19
6418 19 -2 -46 -42 24 12 -34 9 -25 0 30 -1 0 32 -38 38 -25 25 -2 3 -33 4 -5 1 8 14 2 -17 54 -7 -37 -2 0 41 26
6452 26 11 52 -4 -8 -61 6 -3 27 1 15 -13 17 -13 -10 16 -7 63 27 28 -22 3 -39 12 -1 -32 70 2 1 -42 -71 7 2 14
6485 14 -24 16 10 -51 -38 58 -8 17 21 -9 -33 -6 -6 -16 21 52 -37 0 -2 8 25 -13 22 18 -33 -12 57 1 7 17 -12 16 -68
6518 -68 -14 27 20 -11 -56 16 -17 -11 -21 -18 -38 16 -60 -1 2 -17 2 -17 -14 -22 -31 11 -38 -17 17 2 -26 22 -16 -15 49 -51 17 10
6552 10 16 2 -2 -39 6 -16 -15 5 40 -5 2 15 22 15 -21 -14 -52 -13 -35 3 -49 -5 -10 11 39 3 -27 -32 13 -18 15 -5 15 3 51
6587 51 -38 0 27 35 -69 30 -17 10 30 -17 62 7 9 -25 -72 -26 5 -47 23 -40 14 14 22 -3 -43 13 27 -58 39 10 -24 4
6619 4 7 -69 -53 -18 -28 -7 -35 -10 33 -3 -51 -27 -5 -46 -23 24 -23 19 -27 6 -19 -22 33 -47 16 45 13 -26 -6 -10 -26 -4
6651 -4 -9 -2 9 -45 -28 -19 -46 -34 22 26 15 6 32 43 3 -14 -20 -24 54 -24 21 -20 -5 -26 -27 15 17 -3 19 -11 28 17 -30 3 -20
6686 -20 62 32 13 -22 54 -15 -19 -16 15 -14 58 -2 18 20 -70 -17 -29 -47 21 -17 -12 -21 32 -15 -16 -11 25 25 -27 16 -10 -7 -28 18 35
6721 35 28 44 1 -13 -1 -23 37 -12 -17 30 -21 7 -31 -15 -10 12 -24 -17 -3 17 -35 -19 -27 -19 38 -37 -38 37 42 -3 -20 -24 -10 2 -22
6756 -22 -6 5 -3 20 1 11 -46 9 -7 1 55 25 8 -3 -11 -20 -76 -18 -11 19 -45 9 -5 17 14 10 16 -22 -53 -29 19 -3 -4 -39 -20
6791 -20 -48 -50 21 -63 -40 4 -51 -42 19 19 -35 -11 7 15 -28 -69 -1 27 0 -10 -3 -5 0 0 9 -17 -40 -19 -22 -11 -12 -13 -20 -29 -9 22 -34
6828 -34 -7 11 -10 -6 0 -11 9 -34 -1 -32 28 -41 -1 9 -9 -11 30 -34 -19 -42 24 40 39 48 -15 -49 -34 53 -23 -47 -21 19 32
6861 32 -52 12 -26 -26 -30 11 -3 21 -31 -20 3 35 19 36 -28 11 8 3 -23 -36 -23 48 30 28 -11 17 -37 -2 10 -14 21 30 42
6894 42 -31 33 -1 6 -10 -13 2 6 -71 37 -13 22 -34 9 41 10 -25 -12 -4 2 18 10 2 9 4 15 -11 4 6 -60 -25 33 -2 -15 -5
6929 -5 38 -13 -48 -44 -19 31 -6 76 -33 -6 -18 -36 11 20 68 -8 46 20 18 9 -22 -3 -19 -39 -32 -13 -7 -57 -47 9 -44 -69 -8
6962 -8 -13 6 -10 23 15 -49 42 4 -18 -16 22 -16 -5 15 -24 -2 -7 17 19 36 -31 -4 -1 -6 37 -18 -19 -9 -14 -2 5 31 6 -12 -18 22
6998 22 -67 24 -21 -33 3 24 24 -18 26 -43 34 1 11 31 9 17 34 -26 -18 -20 33 -8 -60 -3 27 19 -37 -20 -9 6 -54 -52 11
7031 11 -62 -7 -12 -33 -25 -36 -9 -13 1 12 -50 -7 -3 7 6 12 -51 -15 20 -26 2 -21 28 -17 -43 5 8 -28 -2 -51 -8 12 3 -11
7065 -11 -33 -46 -9 15 27 3 -47 -5 -8 -52 -90 -8 -49 -21 -51 12 28 -1 -2 -34 19 10 67 -31 -39 26 -10 0 -36 4 -18 40
7097 40 -24 4 7 51 5 0 0 34 -22 -8 39 19 -2 3 -12 15 -13 -14 28 30 -47 -36 -48 -1 -37 -21 -20 25 -14 -10 -21 -26 16 50 9
7132 9 1 -58 -13 41 -6 -52 -15 -4 -44 20 86 29 -28 0 4 -11 58 -2 -21 -14 8 43 -46 24 23 -8 -2 -13 -14 20 39 -21 -20 -4
7166 -4 -1 -36 4 -9 0 -33 -5 -24 -32 2 -3 -14 -74 -25 0 2 17 -2 -78 12 -12 55 51 32 -49 8 30 27 -26 -31 12 -8 0 31 66
7201 66 28 -39 -21 -9 14 -17 2 8 -5 17 18 3 8 -2 -2 -34 48 -5 3 -28 -47 32 -15 -14 27 -13 -12 9 17 -3 13 6 21 51 -9
7236 -9 -25 -10 0 -26 -2 -23 -9 -20 13 -52 -38 -29 -29 -43 -21 3 32 48 -30 30 -8 -19 -1 -2 16 -71 20 -24 50 30 -10 36
7268 36 -17 -8 -39 49 13 15 -11 27 31 -9 -45 0 18 23 -31 27 -5 -19 46 40 12 -31 29 -21 3 -15 5 -34 -18 26 -6 -3 19
7301 19 11 34 7 20 23 -36 -12 46 -3 -29 1 25 -4 -46 37 -7 6 34 -13 12 44 10 23 30 23 -28 69 27 13 62 -8 -1 2
7334 2 -34 12 -25 -4 -11 -23 28 -24 42 22 -19 40 4 -4 16 13 10 26 -26 -27 -27 -40 13 -42 -6 -10 -8 -12 -13 -19 -24 -60 -5 -47 -36 -57 19
7371 19 21 -42 -10 -8 -76 1 -10 8 31 3 76 -9 53 -43 -82 -1 4 -58 -11 2 -14 -4 42 31 60 43 -13 13 -34 12 -53 -14
7403 -14 -2 8 -6 12 5 30 -48 15 20 -39 36 -16 28 21 -10 -43 -20 -64 -37 13 -26 -11 -23 -21 12 -5 -29 11 2 20 -12 -1 11
7436 11 31 -7 38 45 18 55 -2 -23 55 11 20 29 -1 2 -19 16 -19 10 -45 44 28 33 -2 -1 -10 -53 -39 -34 22 -39 17 25 -3 8 -13
7471 -13 -46 -8 -44 -13 52 11 6 -29 9 35 24 11 6 31 -29 39 -5 -20 25 50 21 58 2 32 16 28 3 -6 37 -65 30
7502 30 -32 -4 14 -58 -16 -6 -47 25 -59 -20 -47 -1 -5 13 -13 -30 -8 -4 4 -29 -20 8 6 -8 -50 -14 8 29 -14 -71 38 8
7534 8 13 20 62 -25 37 -8 3 -74 5 0 -25 -5 4 -29 -15 -46 39 -27 27 -21 -25 29 -57 11 -29 3 -36 -19 52 -7 -35 15 19 -37
7568 -37 18 51 9 -27 78 -46 8 58 -14 -10 41 -3 -18 -21 17 -11 -26 -35 11 -22 29 -55 -36 -23 15 -10 -22 -18 23 12 -14
7599 -14 46 -16 31 -40 -10 -29 3 -3 10 17 -5 9 14 7 0 1 17 -6 51 6 68 10 -49 -3 -29 -25 -76 14 -36 -58 29 -43 -18 -19
7633 -19 -5 -26 48 11 -16 -31 -1 11 -29 -65 -18 -29 -66 14 61 -14 -46 -10 18 32 -33 -41 -14 -58 1 -7 30 14 -26 2 15
7664 15 51 -7 -21 -4 -29 -36 24 -22 -8 -18 -1 -9 1 -19 17 -64 18 -53 -37 31 13 -59 17 -32 -1 -27 6 47 -29 -3 -7 -28
7696 -28 -1 -5 -101 -12 51 5 -5 30 -1 2 18 46 -21 -13 34 -20 -13 -27 -29 16 -42 -62 31 -10 -21 11 3 -51 -72 -3 42 7 -8
7729 -8 -35 -28 2 -14 -8 1 -5 46 10 -16 0 17 13 28 -36 -22 -6 -45 52 -62 11 -7 -17 29 21 -2 37 -74 -37 9 -7 -29 -76
7762 -76 -40 -16 -60 -15 3 -80 -8 -23 5 4 -34 32 15 44 13 2 -48 -26 -13 -41 -3 57 -21 24 72 84 -17 -9 38 -23 -25
7793 -25 9 3 21 -20 -26 13 31 4 -26 -22 -6 -5 -62 25 22 -35 70 -22 8 25 -34 -31 -24 1 17 2 -7 -7 -42 12 -3 46 -2 -2 11
7828 11 16 48 -40 -3 74 -13 7 -47 9 -27 -24 -19 -48 -32 -19 3 20 -17 -44 44 24 -42 4 -8 -37 11 -33 8 4 -18 -56 -35
7860 -35 -25 -20 -16 33 31 8 34 -7 39 9 -1 -27 -3 7 0 49 -9 -14 -48 16 18 -42 29 5 -6 -19 25 -41 -9 14 18 -18 1 14
7894 14 -3 -14 5 -7 -16 -8 8 -40 3 -26 -52 -45 27 -47 14 -10 14 0 39 -2 -17 28 -33 -29 12 26 -29 -10 -23 34 11 -94
7926 -94 -21 42 4 -32 -33 18 0 38 41 9 -55 32 -3 -20 23 -22 16 -17 25 11 -37 36 -22 -44 -8 24 -6 24 12 0 17
7957 17 -3 -6 -19 -4 -1 -23 4 -28 -11 -12 -32 5 -49 -48 -31 -14 -14 0 43 25 -13 -4 1 13 -21 18 28 -2 14 34 10 35 -2 -51
7991 -51 -42 -43 -22 0 1 24 9 15 -17 -37 -25 29 -70 3 16 8 41 -45 -42 11 -11 -1 -10 8 28 22 -36 -5 -12 7 -5 54 -3 1 82
8026 82 27 -8 12 -11 9 43 -1 18 -13 -35 21 -2 -13 -64 -4 -44 24 44 -7 -9 19 29 -53 -48 1 -26 31 -30 3 -31 -60
8057 -60 -8 27 -17 -21 -5 2 21 20 5 -14 18 -21 8 -4 -8 -12 -27 -27 18 -32 -11 21 -2 14 -38 -44 -21 -24 -37 26 -3 -8 -40 3 -3
8092 -3 -25 13 17 6 78 18 -57 -22 -22 -47 27 -32 30 24 19 -31 -43 52 -6 17 -40 1 -7 23 31 64 2 -28 -26 16 -21 -7 20 -28
8126 -28 28 18 33 22 22 16 10 7 -11 4 -29 -7 -17 1 -31 40 52 -28 -31 31 -59 -33 -5 -12 -36 -49 -16 -36 -29 -22 21 -17 -25 -27 3
8161 3 36 -2 1 31 -27 -43 33 15 -12 13 -14 13 -31 7 -28 -4 24 16 53 -52 -24 -27 3 -48 25 -49 -18 9 13 -77
8191g7
$$ Imaginary data points
##PAGE= N=2
##DATA TABLE= (X++(I..I)), XYDATA
0 0 0 0 0 0 0 0 0 0 0 0 0 0 0 0 0 0 0 0 0 0 0 0 0 0 0 -4 4 -3 4 -8 8 -9 12 -12 13 -14 21 -22 23 -30 33 -34 42 -46 51 -55
46 -55 63 -71 79 -85 95 -105 113 -125 136 -147 159 -171 180 -189 195 -191 174 -130 31 186 -713
67 -713 2143 -7489 60930 459879 127933 -414236 -173768 297490 199258 -164112 -185176 13192
79 13192 139097 124894 -63003 -243782 -31669 321950 132287 -355918 -219030 343336
89 343336 280850 -292401 -304251 215337 291671 -122315 -239328 28529 156932 55283 -50325
100 -50325 -116642 -63958 149304 171228 -154581 -258046 134747 312713 -100897 -333155 57057
111 57057 314794 -15194 -263523 -19545 184122 38592 -89009 -39155 -8266 23699 97169
122 97169 4685 -166343 -36271 213940 67539 -234190 -89275 230343 98465 -204129
132 -204129 -90503 163223 65757 -115994 -29347 67665 -14842 -25502 57566 -11115 -96355
143 -96355 37802 123420 -57442 -137348 69876 135208 -78454 -117690 86734 89805 -94234
154 -94234 -54277 103090 19134 -108625 14454 111544 -40780 -107537 59529 95682 -69129
165 -69129 -73985 70882 41168 -69048 -954 64715 -45044 -62950 88746 61960 -127450
176 -127450 -64541 153751 67729 -165070 -70137 158576 69064 -133509 -59601 94639 41466
187 41466 -44748 -11252 -6568 -26500 55179 70752 -93127 -115163 116555 154274 -122981 -182594
199 -182594 111011 192911 -85597 -183588 49540 151493 -11644 -100799 -23702 34357 48982
210 48982 39687 -60828 -113312 57283 177878 -38141 -223416 8910 245589 26672 -238759
221 -238759 -59385 205702 84164 -148775 -94306 75738 86664 3897 -60979 -81091 18595
232 18595 144296 32849 -188125 -87812 205745 135665 -198525 -170401 167480 184713 -118880
243 -118880 -175315 60839 142681 -978 -88633 -50526 21551 89192 52292 -108704 -121513
254 -121513 109938 179041 -93280 -216667 63526 229328 -27159 -216374 -10050 177730
264 177730 39544 -120508 -58430 49825 61396 23395 -50176 -91833 25705 146886 7138
275 7138 -182362 -41837 196196 73137 -186695 -93337 158862 100616 -115712 -90836 65953
286 65953 66569 -14947 -30020 -30377 -13502 65289 57318 -87900 -96638 96076 123951 -93569 -137716
299 -137716 81210 134570 -64723 -116702 46568 85951 -30385 -46417 18775 4054 -11294
310 -11294 37450 9353 -71508 -9154 97046 10666 -110260 -10108 112553 6619 -104502
321 -104502 1066 88525 -13345 -68279 27789 45391 -44128 -24250 57537 4537 -67332
332 -67332 11412 69832 -24795 -64844 36097 52483 -45837 -33360 55926 11196 -65066 12602
344 12602 74620 -32851 -81478 48738 85352 -57110 -83353 57952 74083 -51993 -57057
355 -57057 40346 31416 -26911 -308 13043 -35454 -3024 70425 -2649 -101835 2183 124558
367 124558 3386 -135400 -12202 132663 22362 -114684 -29123 84555 31473 -43387
377 -43387 -25228 -1824 11428 47187 10444 -86150 -37559 113960 65682 -127802 -91463 125047
389 125047 108477 -108337 -114853 78670 105889 -42358 -82928 3573 46495 31307 -699
400 -699 -57610 -48600 72892 96298 -74219 -134517 64170 159882 -43499 -166725 18064
411 18064 155171 8372 -125478 -30460 80857 44047 -27477 -47324 -29668 38176 81772
422 81772 -19643 -124361 -6977 150848 35691 -159629 -62616 149698 82092 -123077
432 -123077 -90089 84686 84968 -38936 -65237 -6501 34531 47386 4747 -77340 -46092 94667
444 94667 84323 -98089 -113908 88536 129992 -69913 -131309 45017 116005 -20050 -87494
455 -87494 -2596 48107 18373 -3815 -26435 -40382 26592 79320 -19464 -107803 8596 124336
467 124336 4528 -125970 -15284 115359 22459 -93100 -23132 63614 17259 -30654 -5554
478 -5554 -2058 -10685 30173 27902 -52532 -44418 66102 55843 -72340 -61428 70906 59023
490 59023 -64542 -49266 55113 33331 -44216 -12748 34325 -8617 -25007 29493 17770 -45935
502 -45935 -10545 57362 3887 -61839 4147 59960 -13676 -53097 24450 41985 -36703 -29935
514 -29935 48011 17100 -58349 -6543 64177 -2470 -65290 8898 59861 -13658 -47818 17891
526 17891 30397 -21612 -8329 27078 -14642 -33146 37214 41199 -55129 -48788 67151 55602
538 55602 -71026 -59048 66379 57192 -54591 -49297 36487 33721 -16212 -12456 -4537 -14116 21527
551 21527 42302 -33198 -69278 37699 91305 -34895 -104733 26413 108039 -13575 -98734
562 -98734 314 78644 11798 -48346 -18966 12115 20379 26281 -14934 -62277 2905 90860
574 90860 13019 -109666 -31433 115004 47457 -107907 -59316 88234 63121 -59627 -57872
585 -57872 25546 42990 9561 -19280 -40502 -9688 64386 41545 -77443 -70508 79635 93680
597 93680 -70677 -106447 53586 106914 -31523 -94595 8021 70017 12218 -37092 -27418
608 -27418 -1447 34105 39417 -33396 -73417 24826 98407 -11413 -112090 -4250 113086
619 113086 19098 -101123 -29500 79378 34434 -49254 -31323 16287 21655 16608 -5705 -44752
631 -44752 -13541 65685 33126 -77713 -50486 79682 61912 -73545 -66482 59877 61935 -42624
643 -42624 -49737 23484 30311 -5968 -6767 -8194 -18027 18050 41381 -22467 -59409 23316 71119
656 71119 -20568 -74266 16994 69992 -13330 -58243 11463 41614 -11806 -22179 13928 2032
668 2032 -17984 15771 21688 -30807 -25093 40860 25618 -46724 -23556 47943 17795 -45790 -8769
681 -8769 41491 -2261 -35472 14685 29575 -25843 -22970 35288 17157 -40537 -10830 41744
693 41744 4166 -38248 3356 30610 -12302 -20708 21890 9042 -32627 1632 42429 -10905
705 -10905 -50882 16696 55717 -19407 -56231 18798 51334 -15598 -40454 11794 24906 -7738
717 -7738 -5016 5766 -15895 -5736 36689 8845 -54026 -13839 66052 20048 -71168 -26065
729 -26065 68012 29579 -57895 -30154 40906 25473 -20272 -16274 -2256 2039 23148 15327 -40107
742 -40107 -34027 51157 51758 -54570 -65176 51192 72824 -40983 -72025 26826 63049 -10335
754 -10335 -45547 -4975 21924 17031 5499 -24150 -33616 24869 58314 -20354 -77396 10733
766 10733 87290 806 -87867 -12843 78176 22146 -60061 -27177 35705 26547 -8103 -19676
778 -19676 -18824 8044 42757 7921 -59836 -24519 69628 40141 -70421 -51700 63253 57161
790 57161 -49699 -55522 31688 45824 -12574 -29964 -5827 8715 20171 14260 -29843 -36913
802 -36913 33446 55753 -31565 -68458 25537 73591 -16581 -70002 7644 59131 541 -41478
814 -41478 -5345 20279 6732 2369 -4368 -23359 -953 40376 7759 -52336 -15101 57398
826 57398 20327 -56791 -23225 50264 21762 -40172 -16832 27509 8408 -14324 2404 2246
838 2246 -13815 8155 24834 -15434 -33024 20562 38169 -22726 -38690 23608 35156 -23244
850 -23244 -27741 22579 17495 -22228 -6137 21611 -5694 -21493 15439 20363 -23331 -18709 27837
863 27837 14990 -29419 -9638 28300 2356 -25066 6628 21151 -15922 -16628 25340 13052
875 13052 -32592 -9716 37558 7503 -38628 -5243 35742 2820 -29096 291 18989 -4933
887 -4933 -7332 10613 -5368 -17945 16473 25395 -25554 -32664 30779 38061 -32036 -40526 29410
900 29410 39202 -23168 -33077 15138 22881 -5915 -8570 -1977 -7658 8154 24918 -10976 -40424
913 -40424 10672 52414 -7290 -59331 1720 59550 4214 -53516 -9857 41033 12703 -24430
925 -24430 -12763 4931 8866 14548 -1623 -31757 -8112 45006 19197 -52040 -29248 53214
937 53214 37273 -47718 -40829 37473 39581 -23475 -32798 8159 20901 6464 -5439 -18772 -12382
950 -12382 26708 29631 -30261 -44960 28564 55287 -23272 -59934 15053 57577 -5750 -48490
962 -48490 -2633 34011 9093 -15164 -11647 -4593 11101 24014 -6539 -39784 -86 50827
974 50827 8181 -55637 -15657 54017 20878 -46893 -23243 34888 21109 -20736 -15517 5564
986 5564 6248 8056 4719 -19228 -16424 26685 27015 -29970 -34797 29776 39050 -26170 -38315 21024
1000 21024 33603 -14590 -24521 8819 12994 -4000 132 854 -13038 453 24090 -567 -32500
1013 -32500 -543 36760 1112 -37408 -1460 34008 264 -27826 2220 19676 -5962 -10667
1025 -10667 10688 2148 -15197 5536 19283 -11100 -21299 15222 21635 -17358 -19064 18456
1037 18456 14397 -18639 -7858 18283 142 -18101 7301 17492 -14170 -17121 18977 15887
1049 15887 -21732 -14010 21741 10794 -19570 -5980 15658 -155 -10536 7629 5519 -15314
1061 -15314 -588 23177 -2686 -29277 4790 33359 -5058 -34191 4288 31464 -2947 -25413
1073 -25413 1528 16071 -1314 -4856 2119 -7342 -4707 18633 8461 -28058 -13051 34112 17659
1086 17659 -36154 -20955 34186 22704 -28130 -21269 19642 17195 -9055 -9796 -1416 136 10707
1099 10707 11064 -17637 -22346 21272 32043 -21737 -39210 18582 42016 -13497 -40635 6646
1111 6646 34087 -190 -23913 -5389 10376 8663 4602 -9056 -19189 6955 31929 -2157
1123 -2157 -40704 -3628 45057 9947 -43874 -14858 38085 17751 -28118 -17550 15563 13861
1135 13861 -2293 -7412 -10372 -1585 20515 11233 -27685 -20865 30581 28394 -29799 -33000 25538
1148 25538 33807 -18844 -30275 11148 23279 -3285 -12852 -2949 1093 7614 11387 -9476 -22551
1161 -22551 9236 31287 -7103 -36539 3719 37556 -346 -34725 -2727 27920 3964 -18937
1173 -18937 -3810 8159 1453 2389 2346 -11794 -6906 19305 11706 -23681 -15195 25511 17331 -24330
1187 -24330 -16773 21472 14180 -16962 -9114 11997 2758 -7274 4233 3053 -11202 -123 16776
1200 16776 -2352 -20868 3619 22256 -4946 -21557 5961 18472 -7273 -13783 9025 8142
1212 8142 -10826 -2118 13036 -2995 -14646 7564 15737 -10267 -15371 11942 13690 -12163 -10248
1225 -10248 11542 5239 -10513 651 9282 -7267 -8505 13176 7855 -18350 -7852 21261 7613
1238 7613 -22228 -7360 20587 6283 -16642 -3932 11102 691 -4416 4037 -2126 -9171 8172
1251 8172 14911 -12370 -19787 14738 23499 -14838 -25106 12997 24087 -9748 -20570 5581 14066
1264 14066 -1672 -5874 -1724 -3809 3446 13342 -3704 -21980 2240 28405 597 -31741 -3834
1277 -3834 31784 7298 -27939 -9424 21350 10122 -12194 -8485 2268 4762 7620 700 -16151
1290 -16151 -7482 22078 14096 -25129 -20048 24654 23774 -21619 -25065 15999 22944 -9273 -17793
1303 -17793 2304 10124 3954 -676 -8380 -9164 11045 18745 -11087 -26110 9395 30948 -5966
1316 -5966 -32167 2038 29830 1756 -24220 -4692 15857 5853 -6271 -5394 -3936 2866 12977
1329 12977 779 -20293 -5476 24840 9940 -26385 -13485 24873 15359 -20721 -14903 15056
1341 15056 12442 -8189 -7539 1810 1463 4033 5478 -8007 -12095 10446 17576 -11165 -21222 10298
1355 10298 22150 -8826 -20843 6567 16919 -4852 -11428 3404 4682 -2920 2229 3005 -8486
1368 -8486 -3707 13588 4719 -16732 -5265 18205 5548 -17523 -4615 15496 2820 -12168
1380 -12168 5 8416 -3402 -4581 7054 1157 -10499 1380 12939 -3401 -14292 4424
1392 4424 13927 -5332 -12111 5782 8831 -6350 -4517 7297 -75 -8339 4704 9731 -8226
1405 -8226 -10649 10882 11320 -11854 -10885 11465 9400 -9863 -6607 7318 2531 -4670 2255 1916
1419 1916 -7670 -70 12597 -1305 -16878 1473 19437 -1031 -20169 0 18722 1049
1431 1049 -15009 -1557 9814 1606 -3230 -291 -3415 -1690 9777 4806 -14658 -8186 17864
1444 17864 11434 -18737 -13916 17240 14826 -14038 -14133 9115 11171 -3813 -6643 -1538 496 5735
1458 5735 6220 -8618 -12880 9775 18534 -9024 -22242 7102 23717 -3900 -22218 817 18484
1471 18484 2174 -12231 -4036 4735 4684 3299 -3774 -11065 1418 17217 1652 -21509 -5456
1484 -5456 22947 8686 -21915 -11133 18414 11845 -13027 -10732 6619 7835 7 -3211 -5680
1497 -5680 -2280 10273 8114 -12693 -13389 13387 17331 -12090 -19298 9627 19030 -6307 -16394
1510 -16394 2743 11757 84 -5744 -2172 -1040 2893 7476 -2704 -13116 1390 17058 380
1523 380 -18907 -2097 18764 3611 -16428 -4063 12774 3733 -7893 -2057 2872 -347 2188
1536 2188 3386 -6167 -6552 9032 9118 -10685 -11045 10702 11436 -9852 -10567 8114 8158 -6328 -4835
1551 -4835 4525 758 -3120 3504 2336 -7195 -1764 10239 1759 -11722 -1430 12148 1266 -10948
1565 -10948 -343 8875 -985 -6073 2861 3021 -5164 -239 7361 -2258 -9459 3689 10533 -4679
1579 -4679 -10841 4747 9674 -4486 -7565 3971 4314 -3437 -336 3376 -3596 -3410 7527 4196
1593 4196 -10510 -4877 12498 5766 -12715 -6097 11554 5872 -9222 -4756 5733 2554 -2097
1606 -2097 307 -1687 -3993 4466 7653 -6541 -11168 7230 13746 -6780 -14978 5387 14654 -3221
1620 -3221 -12415 1147 8819 908 -3843 -2065 -1629 2441 7184 -1652 -11906 70 15370 2003
1634 2003 -17136 -4341 16753 6175 -14634 -7256 10743 6988 -5957 -5650 467 2924 4564
1647 4564 743 -8681 -4844 11464 9008 -12344 -12275 11767 14473 -9581 -14727 6551 13246 -2916
1661 -2916 -9935 -357 5234 2937 117 -4523 -5785 4739 10681 -4082 -14587 2221 16488 -75
1675 -75 -16671 -2172 14989 3815 -11539 -4442 7132 4275 -1928 -2703 -2954 528 7325 2429
1689 2429 -10283 -5301 12012 7909 -12111 -9560 10825 9923 -8535 -9150 5548 6763 -2639 -3642
1703 -3642 -182 -451 2168 4394 -3400 -8062 3736 10758 -3260 -12110 2457 12136 -1362 -10679
1717 -10679 711 8274 -314 -4810 656 1367 -1405 2208 2606 -5037 -3962 6974 4972 -8126
1731 -8126 -5765 7965 5561 -7313 -4785 5886 3041 -4389 -772 2792 -1923 -1508 4568 662
1745 662 -6716 -48 8392 -44 -8865 190 8546 -231 -6984 606 4836 -1222 -2100 2310 -717
1760 -717 -3704 3159 5082 -5095 -6620 6093 7460 -6259 -7771 5523 7043 -4264 -5489 2720
1774 2720 3076 -1186 141 84 -3477 722 6690 -653 -9208 204 11054 811 -11437 -1815 10573
1789 10573 2624 -8491 -3039 5305 2600 -1846 -1649 -2051 -310 5285 2532 -7891 -5082 9302
1803 9302 7309 -9482 -8870 8451 9619 -6340 -8940 3833 7229 -902 -4177 -1606 535 3599
1817 3599 3563 -4570 -7398 4505 10543 -3606 -12599 1893 13014 -145 -12134 -1751 9635
1830 9635 2961 -6163 -3518 1882 3097 2417 -1722 -6171 -161 9170 2632 -10796 -4837 11239 6823
1845 6823 -10070 -7794 8064 7891 -5051 -6569 1928 4410 1017 -1351 -3560 -2161 5089 5461 -5743
1860 -5743 -8485 5326 10349 -4215 -11094 2597 10375 -933 -8473 -428 5544 1438 -2010 -1574
1874 -1574 -1604 1131 4977 -74 -7480 -1210 9062 2577 -9480 -3680 8790 4147 -7249 -3922
1888 -3922 4888 2946 -2540 -1395 170 -756 1708 2914 -3078 -4935 3736 6492 -3712 -7122 3362
1903 3362 7230 -2572 -6128 1917 4510 -1319 -2163 1114 -335 -1147 2750 1516 -4772 -2139 5896
1918 5896 2603 -6529 -2988 6104 2822 -5185 -2172 3684 1002 -2067 592 508 -2474 822 4359
1933 4359 -1483 -5799 1856 6884 -1628 -6944 1236 6401 -653 -4967 282 2914 -198 -439 461
1948 461 -2158 -1196 4197 2004 -5965 -3264 6705 4145 -6840 -4803 5953 4840 -4385 -4145 2486
1963 2486 2923 -364 -816 -1379 -1444 2834 4065 -3508 -6257 3521 7976 -2799 -8745 1751 8556 -472
1979 -472 -7245 -890 4987 1622 -2151 -2028 -1033 1645 4068 -719 -6578 -677 8322 2319 -8923
1994 -8923 -3700 8516 4892 -6923 -5210 4838 4865 -2133 -3660 -522 1779 2924 693 -4608 -3264
2009 -3264 5435 5643 -5558 -7536 4688 8479 -3374 -8467 1564 7310 31 -5261 -1429 2525
2023 2525 2316 653 -2423 -3598 1953 6179 -786 -7855 -456 8732 1902 -8275 -2908 7071 3459
2038 3459 -4989 -3404 2409 2571 62 -1268 -2479 -573 4059 2495 -5174 -4360 5295 5541 -4915
2053 -4915 -6235 3946 6098 -2544 -5052 1273 3509 68 -1288 -772 -940 1240 3272 -1067 -5012
2068 -5012 571 6182 107 -6567 -806 6108 1214 -5090 -1394 3325 1085 -1630 -330 -330 -866 1851
2084 1851 2039 -2991 -3194 3480 4082 -3476 -4424 3141 4333 -2390 -3377 1648 2143 -828 -321 419 -1429
2101 -1429 -95 3144 262 -4477 -627 5084 989 -5265 -1448 4705 1495 -3636 -1352 2217 736
2116 736 -607 248 -958 -1422 2274 2818 -3023 -3881 3291 4781 -2962 -5147 2279 4878 -1297 -3946
2132 -3946 331 2405 347 -476 -852 -1698 851 3617 -537 -5161 -238 6099 1092 -6323 -1931 5695
2148 5695 2534 -4356 -2665 2587 2480 -491 -1428 -1451 181 3206 1532 -4300 -3099 4795 4546 -4540
2164 -4540 -5516 3646 5809 -2475 -5424 915 4242 425 -2543 -1603 253 2213 2086 -2323 -4127 1869
2180 1869 5835 -958 -6819 -125 6911 1391 -6075 -2190 4685 2702 -2591 -2573 387 1870 1786 -823
2196 -823 -3635 -808 4746 2236 -5399 -3689 5029 4516 -4294 -4942 2910 4584 -1460 -3637 -78 2024
2212 2024 1329 -141 -2156 -1814 2496 3708 -2239 -5036 1697 5875 -807 -5843 -125 5100 865
2227 865 -3907 -1433 2193 1395 -343 -1070 -1632 167 3030 725 -4040 -1809 4419 2698 -4218 -3185
2243 -3185 3577 3333 -2477 -2794 1304 1949 -163 -567 -697 -894 1278 2347 -1420 -3581 1277 4198
2259 4198 -958 -4431 409 4018 22 -3245 -383 1885 351 -490 -106 -970 -411 2178 1132 -3000
2275 -3000 -1780 3428 2447 -3294 -2663 2844 2644 -1949 -2161 1100 1301 -190 -117 -556 -1286 944 2502
2292 2502 -1051 -3659 730 4084 -351 -4318 -246 3802 674 -2890 -925 1560 910 -76 -434 -1383
2308 -1383 -146 2668 1089 -3357 -1933 3751 2791 -3479 -3193 2935 3356 -1910 -2958 673 2063 332
2324 332 -857 -1315 -721 1864 2204 -2017 -3560 1683 4441 -1111 -4842 296 4684 540 -3898 -1181
2340 -1181 2622 1642 -950 -1604 -706 1186 2386 -291 -3547 -704 4270 1791 -4406 -2699 3903 3265
2356 3265 -3017 -3453 1674 3014 -386 -2148 -940 817 1906 715 -2456 -2131 2628 3486 -2193 -4309
2372 -4309 1598 4767 -676 -4373 -190 3646 1024 -2297 -1429 763 1535 891 -1231 -2429 599 3431
2388 3431 215 -4153 -1187 4194 1934 -3776 -2437 2866 2605 -1665 -2217 427 1522 811 -354 -1621
2404 -1621 -781 2279 2020 -2277 -3008 2043 3628 -1461 -3714 733 3298 -1 -2598 -554 1401 755
2420 755 -218 -850 -1251 489 2272 -69 -3041 -591 3399 1168 -3250 -1501 2700 1760 -1822 -1456
2436 -1456 974 1077 112 -284 -903 -643 1458 1564 -1681 -2348 1650 2877 -1286 -3076 735 2742 -194
2453 -194 -2136 -285 1159 501 -46 -491 -1058 233 2069 184 -2683 -714 3030 1261 -2773 -1627
2469 -1627 2409 1831 -1526 -1579 646 1078 297 -361 -1087 -603 1541 1562 -1823 -2390 1653 2938 -1226 -3236
2487 -3236 645 2980 -40 -2295 -507 1412 875 -184 -996 -897 806 2169 -322 -2841 -266 3333
2503 3333 1037 -3267 -1595 2794 1991 -2022 -2034 915 1671 133 -1126 -1189 173 1846 859 -2267 -1970
2520 -1970 2196 2692 -1852 -3208 1265 3337 -492 -2954 -223 2261 913 -1076 -1233 -60 1431
2535 1431 1358 -1103 -2414 621 3116 14 -3432 -852 3247 1361 -2782 -1874 1830 1854 -774 -1645
2551 -1645 -362 962 1317 -125 -2041 -818 2450 1766 -2332 -2366 2022 2890 -1354 -2837 580 2530
2567 2530 275 -1767 -791 747 1136 282 -1265 -1477 1000 2254 -599 -2888 -62 3000 511 -2804
2583 -2804 -1032 2211 1300 -1407 -1322 476 1014 517 -485 -1297 -158 1826 931 -2014 -1533 1975 2025
2600 2025 -1607 -2264 977 2102 -370 -1695 -204 953 607 -36 -823 -888 812 1652 -598 -2237 180
2617 180 2514 293 -2386 -679 2012 1010 -1337 -970 589 848 319 -387 -1018 -221 1511 834 -1780
2634 -1780 -1510 1621 1843 -1407 -2092 850 1957 -312 -1553 -214 893 592 -147 -783 -712 864 1578
2651 1578 -562 -2023 193 2476 258 -2343 -651 2053 1052 -1371 -1156 554 1021 295 -698 -1035
2667 -1035 9 1549 548 -1921 -1297 1770 1762 -1619 -2086 1034 2101 -393 -1836 -233 1324 766
2683 766 -467 -1067 -421 1206 1300 -955 -1957 608 2451 -49 -2572 -385 2320 914 -1835 -1267
2699 -1267 1020 1293 -186 -1150 -674 691 1378 -76 -1909 -626 2001 1270 -1919 -1796 1580 2093 -875
2716 -875 -1993 218 1664 425 -1044 -986 220 1203 624 -1238 -1404 1026 2028 -676 -2412 23
2732 23 2358 405 -2115 -873 1497 1164 -736 -1173 -165 969 879 -517 -1442 -26 1853 699 -1854
2749 -1854 -1162 1707 1634 -1269 -1688 766 1580 -74 -1306 -469 613 877 45 -1115 -847 1097 1342
2766 1342 -801 -1880 410 2033 0 -1901 -434 1557 779 -886 -855 316 926 523 -568 -1029
2782 -1029 193 1477 394 -1646 -840 1575 1236 -1261 -1446 805 1370 -313 -1188 -230 701 587 -161
2799 -161 -873 -534 972 1089 -802 -1510 526 1810 -91 -1725 -213 1510 649 -956 -794 466 802
2816 802 241 -619 -783 255 1311 280 -1537 -642 1469 1034 -1292 -1391 852 1373 -371 -1200 -197
2833 -197 807 616 -263 -928 -373 1018 992 -854 -1397 630 1741 -257 -1767 -141 1530 556 -1168
2850 -1168 -842 576 906 100 -804 -742 465 1163 -121 -1530 -374 1579 835 -1447 -1185 1100 1427
2867 1427 -554 -1338 88 1093 546 -609 -808 84 1171 597 -1073 -1071 882 1579 -578 -1732 86
2884 86 1656 313 -1443 -710 870 866 -337 -1025 -393 835 866 -448 -1340 18 1601 470 -1573 -863
2902 -863 1386 1154 -849 -1226 425 1245 178 -912 -546 468 999 102 -1135 -702 1058 1139 -847
2919 -847 -1501 402 1543 -92 -1437 -420 1096 693 -613 -870 72 825 522 -586 -967 284 1305
2936 1305 166 -1387 -493 1394 892 -997 -1058 639 1088 -97 -930 -340 573 656 -162 -1003 -395 954
2954 954 789 -931 -1175 621 1346 -226 -1250 -105 1147 464 -705 -681 314 774 260 -646 -729 460
2972 460 1128 -53 -1249 -361 1220 653 -1107 -915 698 875 -255 -964 -252 670 538 -287 -855 -167
2990 -167 963 619 -834 -995 674 1269 -228 -1207 -44 1162 399 -773 -610 361 759 112 -747 -546
3008 -546 520 924 -264 -1194 -196 1226 493 -1138 -821 761 944 -416 -949 -37 748 407 -402 -749
3026 -749 84 1010 440 -938 -742 798 1127 -452 -1225 130 1196 290 -972 -544 593 750 -81 -790
3044 -790 -403 627 749 -425 -1078 94 1193 273 -1157 -667 901 799 -537 -896 200 929 271
3061 271 -619 -610 271 901 133 -949 -510 841 841 -706 -1072 378 1125 6 -1013 -403 733 590 -376
3080 -376 -739 -103 655 567 -555 -832 328 1089 64 -1101 -375 1024 727 -743 -750 414 885 14 -750
3099 -750 -427 450 708 -149 -849 -321 830 604 -805 -911 451 1009 -177 -1006 -130 759 446 -520 -588
3118 -588 88 724 245 -585 -572 469 946 -126 -985 -145 979 461 -783 -657 524 741 -113 -708 -231
3137 -231 552 544 -326 -794 -71 782 412 -759 -717 548 907 -239 -945 0 867 325 -592 -506 306 710
3157 710 133 -632 -442 562 748 -277 -891 -28 935 277 -895 -540 547 639 -228 -703 -112 583 403
3176 403 -425 -664 95 772 254 -784 -460 647 766 -372 -851 154 839 166 -678 -452 377 598 -40
3195 -40 -669 -321 584 582 -448 -832 133 869 177 -824 -399 664 635 -381 -735 64 685 248 -477 -465
3215 -465 248 751 105 -757 -358 693 607 -524 -741 268 747 -28 -714 -299 506 517 -248 -675 -165 605
3235 605 351 -550 -685 275 775 -19 -816 -252 717 509 -471 -578 240 645 150 -514 -342 401 622 -72
3255 -72 -706 -179 758 458 -578 -648 339 706 -99 -725 -204 536 389 -395 -576 82 586 199 -512 -473 415
3276 415 711 -113 -717 -96 756 367 -572 -471 364 596 -61 -594 -243 468 429 -256 -642 -96 654 280
3296 280 -626 -497 384 655 -235 -689 -16 575 304 -403 -491 220 582 118 -553 -374 447 589 -214 -718
3316 -718 -23 700 248 -576 -417 411 522 -189 -591 -105 492 343 -385 -565 88 652 168 -605 -350 515
3336 515 585 -285 -611 33 642 181 -448 -370 278 516 -44 -538 -247 475 431 -360 -653 117 707 92 -691
3357 -691 -352 449 454 -233 -599 29 540 246 -440 -482 246 577 -15 -616 -188 580 518 -340 -551 180 646
3378 646 83 -514 -218 383 419 -266 -576 -98 512 267 -443 -503 215 577 -36 -577 -198 473 380 -355 -464
3399 -464 102 493 134 -466 -351 329 476 -111 -601 -144 490 329 -450 -512 262 541 -88 -564 -194 407
3419 407 413 -291 -525 32 503 216 -476 -366 311 525 -91 -545 -77 523 290 -337 -424 186 497 -8 -438
3440 -438 -268 356 420 -206 -552 36 486 177 -485 -415 268 425 -152 -560 -105 471 275 -364 -411 170 478
3461 478 114 -439 -280 361 460 -213 -490 18 568 199 -384 -370 271 443 -99 -491 -117 410 321 -300 -427
3482 -427 83 447 61 -517 -267 367 386 -201 -496 31 518 179 -302 -314 237 428 -45 -467 -170 422 370
3503 370 -238 -446 72 597 75 -471 -278 360 400 -248 -479 -17 468 204 -392 -414 234 499 56 -449 -181
3524 -181 443 316 -295 -436 66 479 74 -430 -211 356 406 -177 -436 -39 407 192 -355 -385 196 458 -14
3545 -14 -463 -169 379 340 -240 -419 128 419 100 -404 -228 255 392 -107 -466 -46 402 305 -291 -315 208
3566 208 415 -38 -441 -157 309 274 -250 -372 94 415 94 -383 -280 264 352 -75 -455 -37 408 241 -254
3587 -254 -372 156 373 29 -366 -107 332 364 -146 -356 32 360 115 -362 -312 174 333 -84 -417 -122 399
3608 399 237 -261 -283 43 310 42 -392 -201 277 348 -129 -361 39 388 231 -264 -294 196 395 13 -378
3629 -378 -137 332 267 -245 -355 72 394 100 -336 -174 289 310 -143 -369 -43 351 146 -330 -272 174 321
3650 321 -36 -333 -117 335 263 -176 -336 76 388 106 -352 -259 208 312 -157 -366 5 370 201 -285 -320
3671 -320 174 341 -59 -347 -108 348 284 -171 -341 126 441 118 -343 -193 283 356 -103 -345 21 302 195
3692 195 -269 -232 100 401 45 -374 -170 313 231 -242 -364 55 375 43 -323 -212 213 288 -174 -319 3
3713 3 398 225 -253 -220 171 317 2 -351 -92 349 234 -244 -305 49 316 88 -279 -203 163 278 -51 -351
3735 -351 -131 303 197 -240 -306 148 330 -12 -282 -146 263 254 -161 -289 -2 283 98 -272 -194 150 312
3756 312 -12 -330 -72 300 229 -225 -277 68 330 3 -297 -160 224 287 -139 -288 -36 277 122 -289 -225
3777 -225 168 331 -30 -307 -63 276 205 -169 -298 68 284 79 -236 -207 159 232 -109 -309 -46 319 159
3798 159 -278 -195 179 305 -17 -248 -76 244 230 -119 -215 51 290 96 -278 -174 227 257 -104 -302 -22
3819 -22 294 125 -220 -208 117 265 -10 -258 -176 169 298 -148 -267 23 343 118 -270 -217 200 252 -81 -253
3841 -253 -47 311 147 -195 -224 57 311 36 -231 -185 197 236 -142 -280 0 283 15 -237 -141 161 224 -61
3863 -61 -218 -69 213 139 -157 -309 78 311 31 -282 -108 242 267 -123 -269 75 240 108 -205 -133 156
3884 156 209 -76 -265 -101 258 165 -150 -249 63 271 29 -240 -69 206 194 -112 -230 20 267 125 -249
3905 -249 -174 111 213 -62 -267 -88 254 154 -174 -175 45 181 -6 -210 -152 167 155 -142 -243 40 227 118
3927 118 -220 -184 96 216 -91 -217 -1 220 168 -153 -160 38 221 74 -194 -150 178 149 -128 -256 -4 222
3949 222 65 -191 -208 123 208 -35 -203 -43 161 200 -71 -199 8 206 109 -211 -142 159 223 -80 -232 43
3971 43 205 125 -146 -144 37 216 26 -210 -120 106 184 -107 -310 1 204 33 -243 -133 157 176 -100 -173 -6
3994 -6 180 89 -152 -191 32 175 65 -216 -110 176 190 -85 -241 -44 227 25 -210 -98 115 193 -40 -222
4016 -222 -84 117 139 -129 -186 53 241 53 -263 -73 173 147 -118 -162 73 199 36 -136 -176 129 203 -21
4038 -21 -219 -73 162 125 -190 -205 123 254 -14 -267 -124 116 136 -99 -160 26 215 111 -128 -175 138 236
4060 236 -27 -173 -51 202 106 -157 -178 30 233 23 -188 -64 131 126 -104 -201 -35 158 86 -130 -171 127
4082 127 236 -52 -172 -12 183 101 -98 -80 68 139 59 -121 -99 107 152 -45 -185 27 201 60 -193 -83
4104 -83 111 111 1 -169 -11 90 84 -57 -135 33 210 26 -112 -109 153 92 -42 -156 -44 154 96 -88 -74 98
4128 98 188 -44 -140 -31 116 145 -107 -194 17 212 33 -171 -109 140 149 -104 -120 -20 150 105 -73 -95 -6 152
4152 152 82 -156 -102 158 131 -68 -76 48 163 46 -146 -45 89 114 -28 -163 -92 56 151 -130 -173 5 170
4175 170 20 -178 -57 160 121 -55 -136 14 128 32 -94 -92 85 213 30 -197 -71 142 108 -166 -124 50
4197 50 110 -27 -190 -57 64 111 21 -110 -38 108 31 -127 -150 77 176 -22 -148 -12 194 96 -117 -95 22
4220 22 144 5 -67 -86 107 154 -53 -140 -27 182 107 -157 -126 153 152 9 -174 -69 185 97 -90 -141 42 185
4244 185 3 -122 -46 96 168 -16 -158 44 167 66 -132 -148 73 114 -21 -170 0 114 131 -29 -91 12
4266 12 130 22 -178 -140 122 178 -90 -128 -13 160 78 -74 -97 17 88 58 -120 -32 110 146 -16 -95 69 141
4290 141 32 -200 -76 21 75 -29 -84 -4 43 91 -31 -83 -15 112 42 -119 -42 118 130 -44 -96 37 118 18
4314 18 -49 -41 120 90 -19 -109 -28 98 108 -74 -172 59 90 21 -163 -117 69 62 -34 -125 56 87 86 -92 -70 75 140
4341 140 9 -153 -41 90 84 -107 -85 9 170 41 -142 -51 74 92 -48 -130 -33 122 98 -67 -109 45 100 -43
4365 -43 -109 -24 117 71 -54 -132 71 87 67 -44 -75 44 131 -22 -104 -32 112 85 -78 -50 71 78 -2 -121 -52 114
4391 114 58 -87 -33 57 136 60 -96 -77 122 123 -81 -145 -47 138 79 -90 -29 81 112 5 -146 -68 79 110 -84
4416 -84 -145 15 95 -5 -133 -63 44 116 -94 -149 17 71 69 -63 -151 49 152 29 -100 -25 76 106 -32 -134
4440 -134 32 85 -34 -76 -33 71 108 -17 -26 -23 95 61 -99 -133 30 83 28 -112 -20 106 99 -23 -46 40 57 13
4466 13 -83 -50 76 95 -30 -96 -59 97 72 -64 -78 9 140 -62 -84 0 38 52 -29 -38 29 39 69 -106 -14 90 107
4493 107 18 -105 18 78 44 -63 -73 -17 83 -30 -81 -23 25 59 -33 -96 -27 65 57 -136 -110 25 59 -53 -98 -52
4519 -52 157 12 -55 -70 -7 93 -34 -63 -41 17 87 -38 -103 -34 67 62 -92 -8 24 21 -15 -114 -35 48 70 -62 -103
4546 -103 -36 110 30 -83 -95 44 96 -18 -129 -2 78 14 -15 -95 42 125 12 -67 10 95 114 -35 -63 23 116
4571 116 28 -39 -14 36 36 -37 -134 -49 33 62 -55 -30 16 46 42 -104 -26 68 76 -51 -119 34 121 -28 -123 -48 88 59
4599 59 -1 -90 32 37 21 -43 -120 31 117 22 -110 -29 66 75 -88 -18 -32 19 -27 -36 -12 14 52 -31 -119 -47 32 24 -17 -93
4629 -93 29 58 37 -67 -72 51 4 -2 -73 -23 65 14 -39 -32 1 84 -1 -72 -4 90 86 -53 -51 9 101 8 -41 -68 22 100 -5
4660 -5 -63 -29 13 5 -48 -59 23 25 25 -115 -22 81 30 -71 -48 23 59 51 -50 1 59 81 20 -85 -11 122 67 -31 -39 95
4690 95 19 -13 -71 25 0 32 -28 -114 32 66 49 -74 -56 64 103 -22 -83 -26 53 34 -58 -75 -24 66 16 -68 -76 21 48
4719 48 -14 -101 6 77 26 -123 -26 23 112 -67 -88 10 103 39 -45 -8 14 32 66 -33 -50 51 116 14 -17 19 78 58
4747 58 -83 -6 66 95 23 -109 30 104 -6 -77 -95 -51 92 31 -79 -102 21 75 -68 -100 -39 52 54 -27 38 64 58
4774 58 -10 -69 -6 37 36 -7 -52 94 100 -16 -42 -38 3 11 -7 -73 -22 91 -12 -70 -56 11 54 -27 -89 -50 112 7 -35
4803 -35 -54 65 23 -15 -71 -21 30 45 27 -47 -11 92 12 -37 -49 76 53 -37 0 -16 36 -32 -18 -9 29 57 15 13 -62 10
4833 10 120 -9 -13 -6 36 64 -79 -43 35 -5 36 -19 -26 6 51 -38 -34 -18 50 27 -42 -73 29 46 -11 -34 -11 42 8 -3
4863 -3 -44 23 11 -9 -70 -10 30 -16 -3 -84 24 90 33 -78 -56 78 -19 -26 -4 -13 27 56 -80 -63 -41 52 45 -55 -44 57
4893 57 28 -57 -42 39 68 39 -32 -53 1 17 5 22 17 59 42 -86 -49 -51 45 61 -81 -11 41 36 -10 -49 -16 9 50 -21 -13
4924 -13 -12 49 -68 -45 5 48 15 -38 -43 16 36 -23 -20 -44 14 3 10 -68 52 89 66 -44 -75 27 58 14 -79 -5 71 22
4954 22 -22 -53 18 50 -13 -34 24 37 44 -33 -28 -6 87 55 -76 -71 54 36 53 -40 -54 33 6 -60 -37 -2 14 -32 27 -39 60
4985 60 -6 30 -6 19 74 10 -49 -6 31 24 9 -9 -1 17 45 44 -93 -17 0 17 -16 -19 20 17 -4 -56 37 51 36 -18 -13 -14 55
5018 55 34 -6 -44 52 98 -52 -46 11 157 -39 -35 -22 65 83 -52 7 -25 20 59 -23 -35 54 13 18 -102 -19 -15 -17 -37 -47
5048 -47 4 38 -31 -19 -41 -23 50 45 -57 -26 46 26 -16 -55 -2 103 -13 -6 -13 2 28 -57 -14 -44 71 37 -51 37 -35 56
5078 56 29 -92 -22 -3 64 -53 -44 3 19 -6 12 -27 27 35 17 54 -49 19 52 -54 -46 55 66 -79 -8 -44 64 0
5106 0 -58 -47 9 48 -33 -8 -12 -4 72 38 -17 3 50 36 -17 -80 74 61 -1 3 16 20 -36 -1 -35 -1 -12 -18 -71 -12 17 12 -2
5139 -2 5 16 12 18 -60 -8 -23 23 -3 -42 -43 41 29 -15 -26 4 43 -48 -35 -47 50 -11 10 -58 55 38 13 -56 -20 1 60 37
5171 37 51 -27 54 9 -55 0 27 -13 25 -25 -19 66 -26 14 -54 -20 29 23 3 -105 -3 91 -37 -31 -47 37 15 18 -11 10 -16
5202 -16 31 -28 -62 3 7 21 -45 -90 82 68 -21 -8 17 42 -33 -11 29 1 2 -4 -46 25 15 61 17 -41 -21 44 -29 -55 -33
5233 -33 79 -1 -20 22 22 3 -1 -50 -2 -16 -5 -29 -17 -56 71 96 2 -16 43 87 -20 -33 -45 68 -2 29 -35 12 58
5262 58 3 -45 -31 2 97 -49 -95 -20 0 47 -31 -47 30 46 -14 -15 -7 36 1 1 -2 -52 42 15 -54 -17 15 21 -16 -96 13 5
5294 5 50 -12 -11 -5 59 16 -28 -61 -25 16 -54 -7 1 11 -46 -28 -13 44 69 4 -24 29 1 38 21 -92 53 40 22 -91 -38
5325 -38 47 2 -13 -37 71 47 34 -71 14 -13 -38 19 -29 -67 24 16 -35 -44 -10 34 -2 -41 42 51 9 30 -16 48 39 -4 -12 -13
5357 -13 11 -20 -33 9 -2 0 61 -43 -45 21 37 2 11 40 -12 -1 -16 -47 -4 -15 61 -15 -9 -3 54 -29 -37 11 35 -31 -44 23 18
5390 18 -24 22 59 -68 26 -7 -9 -36 -22 32 20 28 -20 15 84 -22 9 15 3 2 -30 -19 -32 -21 26 28 1 18 -16 -7 -64 -34
5422 -34 21 18 -59 18 -4 16 -15 -64 -40 15 78 -23 -14 30 89 6 -24 16 -32 55 -3 -68 -57 33 -18 -4 4 -25 -10 16 -36
5453 -36 -30 60 14 13 -18 42 40 29 -27 -11 -7 30 -8 -10 -22 14 -8 -72 -68 -35 -14 20 -37 5 79 45 -28 -1 -18 65 -31 14 13 27
5487 27 53 23 25 -19 31 49 29 -65 27 15 9 -16 30 15 2 -15 -13 -8 34 -35 -7 -3 22 47 -45 -30 -23 59 9 -8 15 -32 40
5520 40 -8 -45 44 29 26 -11 -21 12 35 3 15 -20 16 35 -16 -15 54 1 -27 14 23 3 12 32 4 3 25 -18 25 -27 -36 1 26
5553 26 10 11 -58 -14 44 24 1 -16 13 33 56 -45 -7 55 27 -16 -40 -17 -3 9 -34 45 25 -24 87 10 -47 -20 4 23
5583 23 -10 22 44 -46 -2 46 4 -24 -24 11 -7 -12 16 -16 -27 -5 -34 -22 -15 -8 22 -49 -72 -15 54 1 -40 -2 9 -30 -12 -9 -21
5616 -21 40 28 -46 -9 8 17 23 74 14 41 3 19 31 7 28 -56 -4 -12 -20 -20 -52 -42 -23 -31 6 37 -19 54 4 -33 -28 0 17 -31
5650 -31 -64 -29 29 16 -43 -42 40 -13 15 -19 -8 -3 17 68 -28 29 80 -10 8 -34 60 39 -42 14 -24 65 3 38 23 -36 -17
5681 -17 12 14 21 -45 -1 -6 20 40 -1 58 -1 -1 28 8 15 -4 -40 12 -46 -24 30 -41 3 -6 -54 -3 78 34 -17 38 18 35 20
5714 20 65 2 -18 4 -22 10 -9 29 11 41 -12 24 -22 -12 16 19 36 -24 38 -3 -35 30 64 32 -40 18 10 15 -38 -19 7 17
5746 17 -29 -8 -50 19 50 35 7 38 -23 70 -1 -14 5 42 1 -24 14 6 13 31 -37 14 21 29 -65 -28 -3 52 35 -34 19 51
5778 51 62 -10 -38 24 11 -29 -60 17 -51 21 26 61 23 30 21 17 -71 -6 9 31 2 16 102 -81 -25 37 31 -6 17 -22 -19 12 12
5811 12 -41 -7 -29 59 15 -49 24 39 39 34 -15 28 18 19 -36 -24 20 11 37 2 -2 12 24 -25 -33 7 -25 4 -31 41 16 27 -29
5844 -29 42 -3 -4 -23 10 13 -22 14 -17 8 30 -14 -26 -60 -31 20 -22 -12 -9 14 -9 -31 -3 -35 -4 -8 45 -49 18 28 6 -10
5876 -10 51 48 -16 7 30 19 -2 1 8 -10 -21 -7 15 34 -27 -4 21 -25 2 14 -30 -2 -34 2 -5 23 21 45 5 42 -22 -7 17
5909 17 -32 -38 4 26 -20 56 -16 -17 -33 19 -12 -34 42 27 -41 30 1 18 7 -72 25 20 -46 17 -15 65 7 25 3 -14 17 -19
5941 -19 14 -12 9 43 -16 -2 16 9 44 -24 0 36 39 -45 -27 26 -20 12 10 -13 -28 7 -14 -6 9 33 42 -53 16 54 8 -32 -9
5974 -9 46 -81 0 -17 -32 47 55 -2 -36 -61 35 -17 -6 39 33 9 -17 -47 -19 -30 35 27 16 23 -8 29 39 30 -27 -18 25 -39 16
6007 16 32 23 -54 66 -5 80 -96 -2 14 16 -2 3 -23 22 41 -5 -6 50 -6 -37 4 -49 -21 14 -20 -42 -46 -20 28 -33 1 9
6039 9 -7 6 -42 -52 26 36 -8 -97 9 -3 -12 7 -47 16 1 14 -5 -2 -60 -46 25 18 -38 25 -4 2 -32 -52 93 -17 8
6070 8 -18 3 -11 32 13 20 21 12 -5 -16 -23 1 -16 -33 33 11 -10 2 7 5 -24 22 25 36 26 22 -11 28 23 68 13 -19 6 18 -11
6105 -11 -15 -6 -85 -58 31 36 -5 -6 -5 34 -3 -18 -10 15 25 -19 15 10 -29 -7 -14 -14 -27 44 4 -14 -13 -13 -19 -1 -9 -31 4 24 -67 52
6141 52 4 -38 -20 -16 -23 61 3 14 5 -28 -22 3 -59 13 72 -34 -35 31 65 15 -52 -19 23 34 29 21 14 72 21 8 -50 6 -16 1
6175 1 -6 -13 -29 -29 -33 -30 19 -18 25 -15 20 12 -22 12 -3 -15 24 41 -36 -30 -34 45 -37 -18 18 41 17 3 2 18 36 -25 30 -29 2
6210 2 3 -31 17 20 -10 -17 12 -30 39 19 -61 4 43 -42 -26 -25 1 21 43 -9 -24 -42 -24 42 37 0 -33 -29 -44 58 2 -11 -15 -20
6244 -20 10 9 14 -30 15 40 28 -15 -12 11 -27 -11 14 -5 18 17 30 71 22 -10 0 4 42 -50 30 -30 -20 2 -33 13 13 27 -13
6277 -13 -7 15 -1 9 13 -16 -53 25 -23 -2 7 -21 27 10 -36 24 31 6 -30 25 -17 64 -24 -42 10 19 10 13 -57 -59 62 0 -16 44
6311 44 -9 19 9 24 -31 37 -13 -18 29 -29 45 -24 -30 -73 12 17 9 -14 0 74 -16 -44 -18 14 -9 -23 22 42 27 5 70 12
6343 12 19 32 -19 19 31 41 -30 -41 1 -3 -23 8 4 37 2 -16 13 38 -18 -11 -20 -3 -10 30 31 -54 11 22 5 29 -5 -18 23 0
6377 0 -14 42 -21 -12 37 -37 -7 1 -10 -30 -26 -51 -5 -22 6 26 38 -19 18 13 17 24 1 -9 -5 -44 16 -19 6 9 5 10 -26 -18 -12 36 -15
6414 -15 -1 16 -11 20 37 -11 14 -16 -6 7 34 -31 18 6 -5 -56 -13 -1 -5 72 -4 -7 40 2 -28 20 24 -25 5 7 -10 0
6446 0 25 43 -13 -22 -86 28 -46 -30 -29 -26 -15 -52 -21 -15 2 9 -13 -2 13 -4 44 -27 -13 26 12 11 -7 16 72 26 -41 33 37 -42
6480 -42 2 -2 -18 35 4 0 14 11 16 27 -22 -30 -2 -13 -9 18 -4 39 -60 -26 22 -29 9 -20 -17 36 0 -19 -39 22 41 2 34 -18
6514 -18 16 -1 -28 -32 42 -1 -20 29 27 42 3 35 -50 29 -73 -19 -23 18 34 13 -36 -6 38 15 -14 -63 -47 -20 23 -4 -74
6545 -74 -25 6 24 6 11 -6 -19 7 2 42 7 -39 -21 6 4 -9 -26 -14 -15 -42 12 -25 -23 -38 4 -15 -11 -69 10 -58 2 -2 -6 -18
6579 -18 -37 35 9 28 14 -33 6 -3 -1 -55 57 2 -13 43 18 -43 -68 35 -34 18 42 27 23 23 26 17 -15 23 26 12 -3 13 2
6612 2 -14 16 -1 -18 -26 -30 -52 12 31 -39 -10 -8 -32 -8 29 -19 -13 -3 -7 9 -10 23 4 -44 -23 18 -2 -56 9 -32 46 40 15 8
6646 8 12 46 -13 22 24 31 -2 9 -25 21 12 -33 -32 25 -32 -3 41 -2 -13 -15 11 22 -41 -17 15 20 -3 27 15 5 -27 18 -9 26
6680 26 20 4 54 -23 21 -16 -24 -20 26 29 36 -22 11 23 10 -19 -50 -16 12 14 10 -52 36 -14 -36 -98 -50 -13 18 -31 8 40 24 51
6714 51 -16 -8 -17 34 -27 -13 -18 -28 7 10 21 55 -5 4 0 75 5 -22 16 27 -7 0 -19 -76 -66 -53 -33 -3 9 -24 -24 -24 -29 -33 -6 12
6750 12 15 -13 3 24 32 15 -20 -15 -1 11 -3 -37 0 29 38 -2 9 -75 -6 39 13 -41 -19 15 55 -40 4 -12 8 7 30 -21 -68
6783 -68 -41 1 -7 -22 -8 -43 -38 -4 6 -3 -14 3 5 38 -25 10 39 10 -9 34 -23 -20 -24 -51 12 -58 6 17 -37 -40 36 89 71 1
6817 1 -3 -22 -13 53 17 -48 82 13 -14 -32 -45 2 -49 -10 -42 -2 17 -16 -16 10 -1 -14 47 -13 18 48 -19 -16 15 -48 49 11
6849 11 -6 -65 19 19 -6 43 42 -28 -40 -13 -10 -26 -35 -6 13 3 -3 -6 -11 24 11 70 -33 6 3 26 -13 47 7 8 -39 -38 34 19 48
6884 48 -37 -2 -35 19 10 65 14 -38 15 -23 -50 17 24 -2 0 34 23 2 9 -45 37 6 5 14 9 30 27 -16 8 -16 -6 -52 -8 22
6918 22 11 -25 -19 -5 18 -31 -20 -67 -17 -6 -102 -42 30 62 14 -23 5 -49 17 43 -8 8 -14 -2 -61 -10 3 6 47 -50 42
6949 42 -42 19 35 3 -19 -21 0 12 7 14 28 0 1 12 -33 -22 -17 45 0 -74 1 -5 -7 -2 7 -36 -4 37 -12 -26 -6 -38 12 -32 44
6984 44 -31 -64 0 -22 22 23 -25 -12 -47 8 14 -6 9 -27 50 14 23 33 12 17 -8 11 -57 -1 -32 -35 7 -37 20 -32 -11 2 -32
7017 -32 36 -17 -12 -2 4 26 21 29 -43 1 -9 -10 12 -41 27 1 69 -21 21 35 -35 -2 3 -2 -25 29 -2 20 32 8 12 -3 -1 -1 -11
7052 -11 -48 -40 16 -1 -36 -7 -2 -41 21 5 3 -17 25 32 16 -32 31 -1 22 -20 15 -21 -13 -30 -2 31 -6 24 -9 30 -12 39 -26
7085 -26 -2 -17 33 10 -13 15 -71 -19 31 28 -3 27 -21 13 3 12 1 7 57 18 47 34 47 -19 29 28 -22 -9 7 4 -10 -1 26
7118 26 -32 35 -55 12 -42 -1 -29 1 -37 3 4 6 9 -9 4 25 5 13 16 -9 11 2 4 -2 29 -7 -34 -20 -36 54 39 -19 3 34
7152 34 28 10 48 -1 22 45 -27 14 -4 24 23 -6 -5 -25 23 -16 -54 -76 21 0 -21 26 -17 20 -16 -19 -43 62 33 -60 52
7183 52 -55 -18 -47 9 -10 32 28 -6 -9 -48 -5 17 22 14 -52 29 -18 -41 -8 -27 -19 -75 1 44 25 -45 -4 41 44 -26 33 13 19
7216 19 -3 -3 -55 -38 -15 1 -24 -31 14 68 63 -34 1 -17 8 -32 19 -1 -12 75 10 43 -82 22 6 6 9 -3 7 -13 7 51
7248 51 -46 -9 11 -39 -56 14 22 -31 16 -13 -2 59 27 -7 27 21 21 -55 12 -58 84 -1 -11 -34 -29 -18 47 13 55 2 -4 -22
7280 -22 30 23 31 -8 22 9 11 -19 69 30 0 -42 22 -13 -13 11 -17 -18 4 -25 -45 3 64 -29 38 -6 -12 62 31 3 -37 -54 -11
7313 -11 25 -13 -2 33 59 22 8 14 47 12 35 -6 1 46 21 5 -12 -6 23 8 5 12 20 -18 7 -26 9 -17 26 -25 -42 -27 -20 22
7347 22 30 8 23 13 -19 17 5 17 -1 -1 40 -4 -8 6 -20 42 5 -53 15 3 4 -5 19 -26 -2 3 -30 5 30 -6 -25 0 -58
7380 -58 25 44 13 -45 -40 28 31 -41 7 -32 -2 40 -60 -14 26 1 -11 25 -19 34 -37 7 -1 -17 21 1 45 15 39 10 2 11
7412 11 34 6 -28 8 21 40 2 59 -21 0 13 6 -12 -42 -44 -88 23 -22 14 -36 -4 -33 2 -65 -22 3 -1 -20 -14 28 2 30
7444 30 10 -22 -36 -4 45 -21 -42 43 1 -28 7 6 -30 -7 52 -3 -24 33 -32 -16 75 -36 27 34 15 -10 -10 12 39 -13 -9 5
7476 5 38 27 37 -5 25 27 24 -26 -12 12 -2 21 26 19 -39 11 -29 -38 6 -20 -43 -6 12 -21 -29 -3 -9 -38 -13 -10 11 -19 11 1 0
7511 0 -38 30 -3 -51 41 4 0 25 -25 -17 14 35 8 7 -1 -47 11 8 -13 66 46 10 17 -20 46 -49 45 -24 4 -49 -46 22 26 19 -36
7546 -36 -22 -23 52 2 3 3 -25 -18 -37 -52 -3 -16 -21 -8 10 5 3 -6 -17 -18 -17 24 -64 25 -31 23 -17 17 -9 6 14 51 -9 35 -6 -74
7582 -74 -24 -5 -73 -26 16 44 69 -25 -11 25 -26 -32 28 -29 30 3 9 13 18 -29 82 1 -7 -18 -7 16 34 29 -1 39 36 -35 -18
7615 -18 6 -1 -1 -14 20 -6 20 -21 -17 -11 -27 40 12 -21 10 50 -2 -45 -6 -44 51 -25 14 -31 -18 -24 13 38 0 -13 22 -19 45
7648 45 16 -5 -32 -27 5 -31 21 -52 22 3 38 23 -43 -59 26 -6 42 -41 -24 -5 62 -21 9 5 -15 7 -24 48 3 -1 -17 -53
7680 -53 43 -75 19 -9 3 -5 -4 -4 11 24 19 -27 2 13 -54 -1 39 51 -4 -53 15 -16 5 61 -23 51 38 -61 31 -8 -38 -29
7712 -29 0 -4 26 16 -30 -7 25 1 -5 7 12 45 89 22 4 30 8 45 17 28 11 -37 -26 -4 5 0 -46 18 -30 -53 -10 -18 -1
7745 -1 30 39 -32 -19 34 -25 -7 -18 -27 1 -28 -49 15 -21 15 5 -37 -19 4 -25 9 -4 -13 -1 -35 2 21 57 23 -12 8 34
7777 34 18 -6 9 -38 -3 59 23 8 9 5 -11 45 10 39 -23 27 -6 -48 -8 30 -30 -34 20 17 -63 16 4 42 43 16 -13 35 2
7810 2 -2 -24 -17 18 40 15 -24 42 -22 23 18 46 -7 -5 3 17 24 -19 -5 14 29 2 -16 43 -16 14 -19 6 -19 5 12 -16 -13 43 -41
7845 -41 28 -22 8 -39 7 30 -6 -19 -18 -11 17 18 26 2 23 61 41 3 17 -8 -5 10 -11 -13 49 -18 4 11 3 -33 9 -45 -49 33 10
7880 10 41 29 6 27 6 -55 1 8 18 -32 37 -75 -7 -18 10 -15 6 -7 -20 -43 -11 -16 41 14 16 16 -5 13 -54 15 -17 15
7912 15 -21 -6 12 -19 14 7 12 23 -45 -7 0 -39 44 25 38 21 -10 26 2 47 5 23 -28 -18 41 -10 -14 23 4 26 18 -43 -3
7945 -3 -22 40 40 19 -8 13 59 51 11 40 11 -15 -36 -20 19 25 16 17 41 8 -20 9 -34 63 -10 9 3 6 -31 52 2 -3 17 -6 19
7980 19 -12 45 25 5 -16 -9 -14 4 -31 -1 -6 3 39 17 0 -9 55 -49 -29 10 34 -2 -18 -37 -20 30 -33 -13 5 25 -46 2
8012 2 8 32 -44 -9 7 -65 33 16 -48 1 -21 -6 -23 23 7 11 4 -26 -9 6 -5 -12 -38 2 -16 -27 7 43 46 14 -41 27 23 -25
8046 -25 3 55 25 2 0 -13 2 28 9 -29 -31 -11 -8 -4 22 -12 -27 -2 0 8 19 -4 29 18 -34 20 -22 10 33 30 8 -15 5 0
8080 0 -27 -31 49 -3 -23 27 -34 8 28 -10 27 16 21 21 39 -1 20 -3 22 20 -10 -18 -24 21 49 24 -2 2 -1 17 13 -62 -26 13 -2
8115 -2 12 -18 83 -14 55 -39 -7 42 3 30 7 1 30 -77 -12 23 3 40 -1 -11 -58 -2 43 -44 0 -21 30 63 -35 -36 -24
8146 -24 -17 -16 60 -23 13 7 -39 -27 26 8 7 -14 -11 -23 14 47 20 1 0 27 -3 -2 9 -10 35 -22 9 -38 -12 2 37 38 -57 -39
8180 -39 -24 -17 17 -20 38 10 12 12 -18 -22 14
8191A4
##END NTUPLES=NMR FID
##END=
