##TITLE=1H_LY-DMAA3.27
 CDCl3
 8 sc, 
 5.04.2022
##JCAMPDX= 6.0         $$ Bruker NMR JCAMP-DX V2.0
##DATA TYPE= NMR FID
##DATA CLASS= NTUPLES
##ORIGIN= UXNMR, Bruker Analytische Messtechnik GmbH
##OWNER= root
$$ XWIN-NMR		Version 3.5
$$ Tue Apr  5 16:05:33 2022 Russian Standard Time (UT+4h)  she@DPX200
##.OBSERVE FREQUENCY= 200.131346
##.OBSERVE NUCLEUS= ^1H
##.DELAY= (6, 6)
##.ACQUISITION MODE= SIMULTANEOUS
##.ACQUISITION SCHEME= undefined
##.AVERAGES= 8
##.DIGITISER RES= 18
##SPECTROMETER/DATA SYSTEM= spect
##.PULSE SEQUENCE= zg30
##.SOLVENT NAME= CDCl3
##.SHIFT REFERENCE= (INTERNAL, CDCl3, 0, 15.7039)
##AUDIT TRAIL= $$ (NUMBER, WHEN, WHO, WHERE, WHAT)
$$ ##TITLE= Audit trail, XWIN-NMR		Version 3.5
$$ ##JCAMPDX= 5.01
$$ ##ORIGIN= Bruker BioSpin GmbH
$$ ##OWNER= she
$$ F:/spectra/data/she/nmr/H-F/1/audita.txt
$$ ##AUDIT TRAIL=  $$ (NUMBER, WHEN, WHO, WHERE, WHAT)
(   1,<2022-04-05 16:04:36.96 +0400>,<she>,<DPX200>,
      <created by zg, POWCHK disabled, PULCHK disabled
       configuration hash MD5:
       00 E9 B6 7A A2 85 ED C7 34 08 36 98 17 FE 4E 26
       data hash MD5: 16K
       35 B8 22 CA AB CC F7 74 42 D6 9D F3 82 62 81 99>)
$$ ##END=
$$ 
$$ hash MD5
$$ 93 05 6A 4F ED 73 14 18 6D EC 14 79 DA 84 66 BA
##$RELAX= 
##$RELAX= 
##$RELAX= 
##$RELAX= 
##$RELAX= 
##$RELAX= 
$$ Bruker specific parameters
$$ --------------------------
##$DU= <F:/spectra>
##$EXPNO= 1
##$NAME= <H-F>
##$PROCNO= 1
##$TYPE= <nmr>
##$USER= <she>
##$AMP= (0..31)
100 100 100 100 100 100 100 100 100 100 100 100 100 100 100 100 100 100 
100 100 100 100 100 100 100 100 100 100 100 100 100 100 
##$AQSEQ= 0
##$AQ_mod= 1
##$AUNM= <au_zg>
##$AUTOPOS= <>
##$BF1= 200.13
##$BF2= 200.13
##$BF3= 200.13
##$BF4= 200.13
##$BF5= 200.13
##$BF6= 200.13
##$BF7= 200.13
##$BF8= 200.13
##$BYTORDA= 1
##$CFDGTYP= 0
##$CFRGTYP= 5
##$CHEMSTR= <none>
##$CNST= (0..31)
1 1 145 1 1 1 1 1 1 1 1 1 1 1 1 1 1 1 1 1 1 1 1 1 1 1 1 1 1 1 1 1 
##$CPDPRG= <>
##$CPDPRG1= <>
##$CPDPRG2= <>
##$CPDPRG3= <>
##$CPDPRG4= <mlev>
##$CPDPRG5= <mlev>
##$CPDPRG6= <mlev>
##$CPDPRG7= <mlev>
##$CPDPRG8= <mlev>
##$CPDPRGB= <>
##$CPDPRGT= <>
##$D= (0..31)
0 1.2 0 0 0 0 0 0 0 0.06 0 0.03 0 0 0 0 0.0002 0 0 0 0 0 0 0 0 0 0 0 0 
0 0 0 
##$DATE= 1649160276
##$DBL= (0..7)
120 120 120 120 120 120 120 120 
##$DBP= (0..7)
150 150 150 150 150 150 150 150 
##$DBP07= 0
##$DBPNAM0= <>
##$DBPNAM1= <>
##$DBPNAM2= <>
##$DBPNAM3= <>
##$DBPNAM4= <>
##$DBPNAM5= <>
##$DBPNAM6= <>
##$DBPNAM7= <>
##$DBPOAL= (0..7)
0.5 0.5 0.5 0.5 0.5 0.5 0.5 0.5 
##$DBPOFFS= (0..7)
0 0 0 0 0 0 0 0 
##$DE= 6
##$DECBNUC= <off>
##$DECIM= 32
##$DECNUC= <off>
##$DECSTAT= 4
##$DIGMOD= 1
##$DIGTYP= 9
##$DL= (0..7)
0 120 120 120 120 120 120 120 
##$DP= (0..7)
150 150 150 150 150 150 150 150 
##$DP07= 0
##$DPNAME0= <>
##$DPNAME1= <>
##$DPNAME2= <>
##$DPNAME3= <>
##$DPNAME4= <>
##$DPNAME5= <>
##$DPNAME6= <>
##$DPNAME7= <>
##$DPOAL= (0..7)
0.5 0.5 0.5 0.5 0.5 0.5 0.5 0.5 
##$DPOFFS= (0..7)
0 0 0 0 0 0 0 0 
##$DQDMODE= 0
##$DR= 18
##$DS= 0
##$DSLIST= <SSSSSSSSSSSSSSS>
$$ [...]
##$SUBNAM2= <"">
##$SUBNAM3= <"">
##$SUBNAM4= <"">
##$SUBNAM5= <"">
##$SUBNAM6= <"">
##$SUBNAM7= <"">
##$SUBNAM8= <"">
##$SUBNAM9= <"">
##$SW= 18.0517287032376
##$SWIBOX= (0..15)
0 0 2 0 0 0 0 0 0 0 0 0 0 0 0 0 
##$SW_h= 3612.71676300578
##$TD= 16384
##$TD0= 1
##$TE= 0
##$TE2= 300
##$TE3= 300
##$TEG= 300
##$TL= (0..7)
0 120 120 120 120 120 120 120 
##$TP= (0..7)
150 150 150 150 150 150 150 150 
##$TP07= 0
##$TPNAME0= <>
##$TPNAME1= <>
##$TPNAME2= <>
##$TPNAME3= <>
##$TPNAME4= <>
##$TPNAME5= <>
##$TPNAME6= <>
##$TPNAME7= <>
##$TPOAL= (0..7)
0.5 0.5 0.5 0.5 0.5 0.5 0.5 0.5 
##$TPOFFS= (0..7)
0 0 0 0 0 0 0 0 
##$TUNHIN= 0
##$TUNHOUT= 0
##$TUNXOUT= 0
##$USERA1= <user>
##$USERA2= <user>
##$USERA3= <user>
##$USERA4= <user>
##$USERA5= <user>
##$V9= 5
##$VALIST= <valist>
##$VCLIST= <CCCCCCCCCCCCCCC>
##$VD= 0
##$VDLIST= <DDDDDDDDDDDDDDD>
##$VPLIST= <PPPPPPPPPPPPPPP>
##$VTLIST= <TTTTTTTTTTTTTTT>
##$WBST= 1024
##$WBSW= 4
##$XGAIN= (0..3)
0 0 0 0 
##$XL= 0
##$YL= 0
##$YMAX_a= 464905
##$YMIN_a= -403397
##$ZGOPTNS= <>
##$ZL1= 120
##$ZL2= 120
##$ZL3= 120
##$ZL4= 120
##$ABSF1= 10
##$ABSF2= 0
##$ABSG= 5
##$ABSL= 3
##$ALPHA= 0
##$AQORDER= 0
##$ASSFAC= 0
##$ASSFACI= 0
##$ASSFACX= 0
##$ASSWID= 0
##$AUNMP= <proc_1d>
##$AZFE= 0.1
##$AZFW= 0.1
##$BCFW= 1
##$BC_mod= 2
##$BYTORDP= 1
##$COROFFS= 0
##$CY= 11.3945322036743
##$DATMOD= 1
##$DC= 2
##$DFILT= <>
##$DTYPP= 0
##$F1P= 2.36226072786647
##$F2P= -0.459571619588291
##$FCOR= 0.5
##$FTSIZE= 0
##$FT_mod= 4
##$GAMMA= 1
##$GB= 0.15
##$INTBC= 1
##$INTSCL= 1
##$ISEN= 128
##$LB= 0.24
##$LEV0= 0
##$LPBIN= 0
##$MAXI= 10000
##$MC2= 0
##$MEAN= 0
##$ME_mod= 0
##$MI= 1.114404
##$NCOEF= 0
##$NC_proc= 0
##$NLEV= 6
##$NOISF1= 3.799351
##$NOISF2= 2.8
##$NSP= 1
##$NTH_PI= 0
##$NZP= 0
##$OFFSET= 15.70392
##$PC= 1
##$PHC0= -17837.88
##$PHC1= 23.60078
##$PH_mod= 1
##$PKNL= yes
##$PPARMOD= 0
##$PSCAL= 0
##$PSIGN= 0
##$REVERSE= no
##$SF= 200.130013532006
##$SI= 16384
##$SIGF1= 3
##$SIGF2= 2
##$SINO= 400
##$SIOLD= 16384
##$SREGLST= <1H.CDCl3>
##$SSB= 0
##$STSI= 0
##$STSR= 0
##$SW_p= 3612.71676300578
##$SYMM= 0
##$S_DEV= 0
##$TDeff= 0
##$TDoff= 0
##$TI= <>
##$TILT= no
##$TM1= 0
##$TM2= 0
##$TOPLEV= 0
##$USERP1= <user>
##$USERP2= <user>
##$USERP3= <user>
##$USERP4= <user>
##$USERP5= <user>
##$WDW= 1
##$XDIM= 8192
##$YMAX_p= 0
##$YMIN_p= 0
$$ End of Bruker specific parameters
$$ ---------------------------------
##NTUPLES= NMR FID
##VAR_NAME=  TIME,          FID/REAL,        FID/IMAG
##SYMBOL=    X,             R,               I
##VAR_TYPE=  INDEPENDENT,   DEPENDENT,       DEPENDENT
##VAR_FORM=  AFFN,          ASDF,            ASDF
##VAR_DIM=   8192,          8192,            8192
##UNITS=     SECONDS,       ARBITRARY UNITS, ARBITRARY UNITS
##FACTOR=    0.0002768,     1,               1
##FIRST=     0,             0,               0
##LAST=      2.2672688,     0,               0
##MIN=       0,             -403397,         0
##MAX=       2.2672688,     464905,          0
$$ Real data points
##PAGE= N=1
##DATA TABLE= (X++(R..R)), XYDATA
0 0 0 0 0 0 0 0 0 0 0 0 8 -8 8 -11 16 -17 24 -32 34 -41 54 -64 73 -88 105 -121 137 -161 185 -211 242 -275
32 -275 315 -356 401 -452 507 -568 635 -707 788 -876 972 -1075 1188 -1312 1449 -1597 1758
49 1758 -1941 2137 -2354 2596 -2864 3166 -3505 3890 -4335 4850 -5459 6191 -7089 8223
63 8223 -9704 11728 -14674 19383 -28087 49495 -213157 -120990 464905 125453 -336086 -200143
75 -200143 235305 187219 -74909 -169692 -56957 90546 192284 -3106 -272409 -108367
85 -108367 324689 202151 -318376 -282397 282847 321313 -207204 -323789 122499 277301
95 277301 -32493 -199130 -41050 89998 94024 26164 -117806 -143467 113050 238083 -84287
106 -84287 -305138 41043 332983 7080 -323249 -48070 278281 75985 -205145 -81065
116 -81065 117536 65789 -25575 -29418 -56686 -18491 122677 71770 -165482 -120228 183656
127 183656 154631 -180903 -170591 160417 163180 -131613 -136695 97756 91843 -67602 -37891
138 -37891 42770 -19254 -25874 71521 15720 -112576 -8899 140357 4667 -150615 3233
149 3233 147690 -14045 -131543 31275 108915 -51502 -82382 73378 55813 -93598 -32608
160 -32608 106798 11937 -111752 4261 103759 -20649 -86010 36260 57712 -54637 -24044
171 -24044 75475 -10867 -98056 42414 120873 -64583 -138120 77063 148453 -76276 -145178
182 -145178 66203 128338 -47905 -95167 27611 48497 -9969 7011 -1722 -66658 2808
193 2808 121494 4923 -166665 -22754 193309 44096 -199566 -65795 182780 81145
203 81145 -145260 -85131 92153 74921 -29083 -47270 -33022 6498 88299 45801 -127196
214 -127196 -100466 146914 151362 -144052 -189057 120939 206310 -83144 -199996 36253 167025
225 167025 9135 -112504 -47487 39940 69532 39266 -73866 -116285 59023 180161 -28549
236 -28549 -222268 -10720 238331 52406 -224695 -86102 186087 107053 -126319 -108337
246 -108337 55955 89887 16601 -52327 -81327 671 129446 57072 -157101 -113723 160525
257 160525 158681 -143394 -186934 108248 191432 -63652 -171951 16793 129984 24567 -70362
268 -70362 -53506 1859 67659 68508 -63815 -129339 46310 175041 -17786 -198399 -13783
279 -13783 198628 42667 -176341 -62736 135223 68686 -83179 -60406 25969 37004 26650
290 26650 -4296 -70739 -34378 100241 71425 -114250 -101352 113430 119716 -100074 -122534
301 -122534 79816 110979 -55208 -84654 32888 49125 -14161 -7692 2568 -32985 2778
312 2778 68664 -2951 -95726 -644 110556 3789 -114299 -5736 106070 2409 -90418
323 -90418 4729 68749 -16753 -45331 31200 22817 -45504 -2663 57764 -12947 -63886 26094
335 26094 64325 -35514 -56657 44230 43369 -51864 -25110 60036 5279 -68237 13030 74775
347 74775 -28359 -79223 37552 77966 -41798 -71184 39623 56062 -34631 -34019 27869 5889
359 5889 -22036 25834 19377 -56940 -20114 84972 25737 -104137 -33134 113429 41849 -109697
371 -109697 -47563 94087 48402 -67901 -41693 34206 25765 1152 -2206 -34980 -28533 60785
383 60785 61048 -76802 -92617 79863 116830 -71169 -129886 52713 128534 -28132 -111072
394 -111072 3085 79703 19164 -36147 -32702 -12744 36625 62251 -29008 -104882 12270 135570
406 135570 10683 -150515 -35882 147014 57166 -127265 -71347 92393 73215 -49240
416 -49240 -62830 2230 39152 41139 -5449 -75646 -33821 97288 73718 -103152 -107008 94951
428 94951 130059 -73482 -136990 44792 127662 -13042 -101304 -15330 61792 35828 -14073
439 -14073 -45918 -36100 43382 81164 -31005 -116769 10111 136922 13301 -141076 -35509
450 -35509 128500 51425 -102171 -57536 66490 52872 -26053 -36520 -12336 12394 45700
461 45700 17743 -68803 -47713 81074 74297 -81623 -92553 72495 99707 -56816 -95156
472 -95156 37177 78284 -18650 -52705 2762 20281 6860 13209 -10943 -44762 9044 70213
484 70213 -2984 -86629 -4279 93369 11281 -89474 -14336 77976 13627 -59885 -7219 39240
496 39240 -3074 -18115 16291 -796 -30068 15745 41556 -27080 -49526 33820 51443 -38219
508 -38219 -48082 40085 38772 -41604 -25862 42795 10811 -43945 4442 45017 -17329 -44189
520 -44189 27556 41687 -33007 -35018 35358 25083 -34175 -10876 31457 -5983 -28352 24259
532 24259 25769 -42304 -25312 56628 25629 -66479 -27469 68870 28164 -64338 -27200 52298
544 52298 22415 -34774 -12996 14285 -924 6935 19233 -24834 -39101 38367 59118 -44422
556 -44422 -75026 43684 85110 -36100 -86250 24024 77505 -10040 -59357 -3332 32456
567 32456 12347 -1033 -16353 -32593 12993 62865 -3933 -86944 -10012 100848 26046 -102882
579 -102882 -40445 93226 50814 -72276 -53172 44416 47369 -12080 -31709 -18777 8775 44940
591 44940 19500 -62627 -48832 69767 74694 -66549 -93765 53412 101600 -34523 -97625
602 -97625 12496 80747 7759 -53801 -23191 19513 31102 17542 -30214 -52166 21736 80796
614 80796 -6450 -98653 -11061 105123 28649 -98666 -41734 81627 48214 -56232 -46167
625 -46167 26275 35049 3404 -16936 -30014 -6747 49278 31703 -60597 -55130 62228 72574
637 72574 -55951 -81878 43471 81467 -27553 -70684 11786 51709 2099 -25968 -10518
648 -10518 -1895 13876 29398 -11399 -52308 4948 68506 3742 -76405 -12480 75240 18265
660 18265 -66925 -20608 52191 17459 -34682 -10090 15938 -1277 900 14449 -14692 -27330
672 -27330 24744 38244 -30147 -44631 32589 46646 -31804 -42681 30196 34588 -27853 -22687
684 -22687 26163 8944 -25035 4619 24134 -17020 -23690 26020 21501 -32173 -18281 34327
696 34327 12158 -34103 -4133 31445 -6040 -27986 17159 24628 -27616 -21442 36603 19346
708 19346 -41586 -16896 43065 14591 -39360 -10527 31852 4726 -21037 3627 8689 -14269
720 -14269 3212 26069 -13662 -38496 20240 48792 -23344 -56161 21857 58179 -17404 -54288
732 -54288 10910 44105 -3900 -27983 -1360 8049 4197 14199 -2731 -35288 -1879 53351
744 53351 10047 -65266 -19545 69808 28774 -66145 -35451 54797 37360 -37675 -33865 16601
756 16601 23557 4274 -8172 -23182 -11459 36681 32137 -43684 -51191 43582 65881 -36704
768 -36704 -73142 25342 72348 -11070 -62228 -2363 44681 13373 -21029 -19433 -5287 19634
780 19634 31179 -14341 -53616 3946 68916 8604 -76416 -21994 74269 32440 -64084 -38644
792 -38644 46755 38450 -25340 -31458 2804 18521 18086 -422 -34031 -19326 44060 38899 -46477
805 -46477 -54361 42594 64204 -33236 -66093 20887 59781 -8194 -46340 -2978 26830 10042
817 10042 -4893 -12975 -17795 10672 37218 -4901 -51889 -3379 59893 11821 -60714 -18536
829 -18536 55220 22312 -44135 -21463 30104 16592 -14376 -7382 -50 -3945 12398 16409 -21015
842 -21015 -27931 25699 36490 -27023 -41403 25138 41023 -21978 -36400 17856 27344 -14727
854 -14727 -15838 12331 2921 -11476 9608 11867 -19929 -12310 27822 12756 -31725 -11542 32904
867 32904 8921 -30867 -4060 27214 -2455 -22601 9896 17847 -17359 -13707 23473 9888
879 9888 -27833 -6967 28962 3637 -27352 -200 22664 -4384 -15833 9957 8137 -16518
891 -16518 -63 23783 -6416 -30155 11348 35479 -13372 -37751 13419 36925 -11282 -31968
903 -31968 8179 23047 -5288 -11119 3030 -3157 -3168 17346 4935 -30647 -9185 40363 14261
916 14261 -45749 -19694 45666 23725 -40336 -25079 30824 23053 -17839 -16404 4242 6554 8983
929 8983 6580 -18975 -20682 25369 34318 -26948 -45280 24086 51713 -17863 -52798 9044 47192
942 47192 -415 -36374 -7428 20347 11838 -1881 -12618 -17098 9339 34276 -2271 -47029
954 -47029 -6637 54364 16627 -54770 -24731 49134 30116 -37647 -30659 22782 26219 -6339
966 -6339 -16850 -9145 3449 21437 11823 -29622 -27435 32148 40251 -30036 -49072 23492 51924
979 51924 -14689 -48636 5158 39355 3136 -25233 -8601 8482 10784 9276 -8893 -25076
991 -25076 4214 37807 2852 -45421 -10365 47605 16975 -44389 -21230 36451 21839 -25707
1003 -25707 -18891 13005 11855 -970 -2542 -9494 -8641 16929 19572 -21069 -28671 21962 34927
1016 34927 -19782 -36745 16211 34582 -11620 -28114 7902 18818 -5074 -7468 4091 -3945
1028 -3945 -4704 14243 6301 -22372 -8496 27260 9753 -29289 -10230 28126 8669 -25011 -5429
1041 -5429 20134 517 -14942 5408 9938 -11295 -5431 16857 2122 -20467 764 22335
1053 22335 -2816 -21485 5116 18521 -7478 -13692 10491 7829 -14146 -1959 17707 -3639
1065 -3639 -21387 7398 23542 -10075 -24360 10651 22605 -10236 -18556 8840 11913 -7418
1077 -7418 -3357 6716 -5886 -6799 15386 8343 -23114 -10471 28595 13362 -30648 -15452 29286
1090 29286 16401 -24626 -15312 17246 11594 -8639 -5526 -515 -2840 8207 12208 -13991 -21911
1103 -21911 16759 30135 -16498 -35916 13606 38009 -8500 -35749 2921 29378 2620 -19028
1115 -19028 -6159 6418 7611 7411 -6092 -20468 1891 31068 4138 -38024 -11188 39975
1127 39975 17444 -37513 -22020 30422 23148 -20436 -20812 8637 14578 2975 -5248 -12751 -5888
1140 -5888 19803 17813 -22782 -28054 22442 35877 -18399 -39335 12395 38398 -5272 -32664
1152 -32664 -1422 23076 6373 -10785 -8966 -2994 8384 15845 -5498 -27014 -1 34284
1164 34284 6114 -37570 -12190 36339 16706 -31020 -18623 22797 17475 -12641 -12950 2643
1176 2643 6012 6619 3015 -13316 -12231 17389 20799 -18345 -27121 16625 30166 -13328 -29880
1189 -29880 8908 25561 -4981 -18677 1724 9550 -273 181 188 -9487 -1752 17242 4065 -22507
1203 -22507 -6392 25168 8367 -24804 -8842 22374 8033 -17921 -5263 12854 1196 -7409
1215 -7409 3798 2682 -9072 911 13615 -3662 -17194 5119 18588 -6108 -18169 6562
1227 6562 15632 -7320 -11581 8317 6576 -9734 -1239 11703 -3407 -13268 7335 14584 -9541
1240 -9541 -14605 10733 13388 -10453 -10348 9556 5822 -8404 -165 7270 -6169 -6879 12053 6852
1254 6852 -17117 -7663 20146 8370 -21159 -8899 19674 8564 -16077 -6949 10778 3998 -4532
1267 -4532 700 -1391 -6168 6828 12566 -10239 -18391 11955 23167 -11369 -25811 9005 25705
1280 25705 -5634 -22740 1605 16687 1441 -8641 -3610 -1000 3658 10489 -1880 -19072 -1563
1293 -1563 25371 5967 -28424 -10340 28338 14129 -24502 -15738 18293 15288 -10023 -11841 1421
1306 1421 6252 6639 1398 -12935 -9904 16664 18005 -17783 -24785 15815 28763 -12071 -29747
1319 -29747 6590 26841 -1140 -20817 -3652 12062 6712 -1735 -7451 -8635 5983 18111 -2306
1332 -2306 -24972 -2384 28966 7730 -29033 -12003 25899 14733 -19914 -15002 12116 12491 -3797
1345 -3797 -7657 -4006 787 10033 6672 -14032 -14189 15303 20178 -14404 -23862 11573 24793 -7682
1359 -7682 -22486 3849 17803 -317 -10620 -1686 2689 2342 5529 -1413 -12730 -753 18049
1372 18049 3425 -21163 -6148 21626 7937 -19917 -8682 16144 7545 -11443 -5074 6200
1384 6200 1172 -1482 3547 -2285 -8243 4963 12476 -6142 -15126 6510 16278 -5916 -15231 5337
1398 5337 12817 -4900 -8795 5066 4123 -5703 492 6706 -4810 -8129 7883 8927 -9883 -9360
1412 -9360 10464 8408 -10061 -6539 8848 3451 -7375 566 6083 -4826 -4993 9084 4709 -12274
1426 -12274 -4516 14548 4681 -14900 -4525 13790 4063 -11070 -2686 7168 328 -2896 2760
1439 2760 -1444 -6827 4716 10705 -7104 -14438 7774 16906 -7184 -17815 5487 16766 -3105
1452 -3105 -13516 909 8610 930 -2287 -1488 -4346 862 10875 1042 -16024 -3765 19289 6817
1466 6817 -20242 -9631 18682 11306 -15124 -11529 9720 9651 -3746 -6185 -2335 923 7324 5127
1480 5127 -10756 -11319 12202 16927 -11460 -20708 9092 22345 -5329 -21138 1317 17472 2453
1493 2453 -11381 -4899 4025 5752 3930 -4875 -11383 2161 17130 1530 -20842 -5805 21633
1506 21633 9424 -19974 -12021 15915 12723 -10301 -11273 4021 7975 2092 -2760 -6863 -3186 10289
1520 10289 9455 -11501 -14808 10894 18635 -8697 -20216 5510 19232 -2157 -16098 -934 10827
1533 10827 2794 -4594 -3608 -2339 2690 8432 -809 -13453 -1970 16420 4953 -17388 -7312
1546 -7312 16339 8871 -13307 -8632 9475 7199 -4907 -4016 895 161 2555 4343 -4810 -8507
1560 -8507 5671 11662 -5731 -13700 4726 13795 -3642 -12548 2453 9648 -1912 -5924 1833
1573 1833 1757 -2505 2282 3695 -5564 -4955 8108 6204 -9216 -6640 9396 6520 -8400 -5169 6947
1588 6947 3022 -5317 -183 3727 -3181 -2627 6177 1921 -8897 -1803 10313 1769 -10781 -1915
1602 -1915 9838 1576 -7812 -750 5037 -800 -1885 3033 -1040 -5442 3446 8166 -4790 -10273
1616 -10273 5276 11680 -4711 -11819 3549 10586 -2100 -7908 615 4090 157 249 -409 -5040
1630 -5040 -494 8989 1955 -12164 -3887 13755 5921 -13610 -7408 11900 8159 -8667 -7429 4748
1644 4748 5588 -375 -2322 -3427 -1682 6322 6235 -7974 -10464 8028 13735 -6821 -15676 4349 15511
1659 15511 -1619 -13612 -1185 9750 3147 -4881 -4169 -871 3878 6313 -2128 -11051 -354 14349
1673 14349 3597 -15482 -6498 14994 8838 -12420 -9867 8708 9459 -4172 -7422 -386 4029
1686 4029 4210 352 -7239 -5189 8507 9528 -8504 -13118 6968 15005 -4614 -15161 1765 13329
1700 13329 915 -9849 -2763 5258 3789 98 -3326 -4978 1978 9370 426 -12144 -2977 13409
1714 13409 5472 -12878 -7167 10789 7729 -7813 -7126 4133 5068 -802 -2224 -2256 -1469 4149 5001
1729 5001 -5098 -8169 5039 10424 -4117 -11276 2902 11001 -1407 -9136 350 6413 333 -3018
1743 -3018 -139 -500 -600 3677 1776 -6209 -3285 7596 4407 -8188 -5252 7607 5158 -6422
1757 -6422 -4349 4644 2675 -2895 -360 1458 -2209 -349 4748 -57 -6695 240 7981 139 -8100
1772 -8100 -378 7423 442 -5713 -101 3552 -787 -1155 2100 -1170 -3797 2825 5391 -3998 -6851
1787 -6851 4229 7628 -3883 -7627 2973 6626 -1794 -4642 864 2090 -74 1090 78 -4148
1801 -4148 -390 6896 1459 -8616 -2695 9485 3956 -9061 -4842 7455 4945 -5081 -4335 2139
1815 2139 2623 705 -264 -3324 -2769 4902 5741 -5544 -8420 5212 10247 -3958 -10927 2186 10308
1830 10308 -16 -8146 -1556 5128 2862 -1270 -3016 -2731 2292 6343 -755 -9201 -1457 10773
1844 10773 3695 -10997 -5787 9699 7009 -7450 -7324 4256 6398 -834 -4337 -2299 1367 4817
1858 4817 2189 -6175 -5673 6456 8697 -5577 -10655 3896 11346 -1696 -10551 -435 8291 2163
1872 2163 -5150 -3309 1256 3310 2637 -2364 -6126 638 8638 1395 -9969 -3629 9961 5351 -8585
1887 -8585 -6326 6522 6386 -3635 -5181 934 3285 1659 -439 -3395 -2393 4416 5263 -4443 -7511
1902 -7511 3733 8724 -2507 -9035 986 7985 205 -6186 -1210 3475 1450 -647 -1028 -2185
1916 -2185 73 4569 1355 -6027 -2677 6766 3988 -6388 -4493 5543 4488 -3927 -3508 2375 2104
1931 2104 -883 -98 -337 -2083 941 3974 -1166 -5535 722 6297 -308 -6320 -265 5483 438
1946 438 -4132 -340 2311 -114 -333 1136 -1348 -2247 2769 3499 -3390 -4450 3592 5113 -3134 -5005
1962 -5005 2407 4350 -1501 -2953 597 1018 -118 1119 -49 -3293 -389 4961 932 -6183 -1843
1977 -1843 6472 2599 -5924 -3125 4669 3113 -2774 -2390 816 1159 1203 666 -2687 -2664 3587 4657 -3723
1994 -3723 -6282 3219 7188 -2222 -7407 819 6429 457 -4780 -1595 2273 2074 405 -2036 -3192
2009 -3192 1185 5398 168 -6977 -1686 7651 3349 -7215 -4537 6000 5229 -3938 -4913 1609 3833
2024 3833 793 -1959 -2818 -441 4055 2957 -4621 -5411 4189 7101 -3163 -8131 1642 7890 52
2039 52 -6779 -1540 4669 2518 -2022 -2823 -834 2429 3660 -1256 -5652 -228 7019 1997 -7357 -3544
2055 -3544 6751 4671 -5328 -5079 3311 4653 -1224 -3493 -1018 1570 2568 644 -3589 -2999 3813
2070 3813 4951 -3312 -6346 2314 7007 -972 -6630 -216 5487 1366 -3523 -1745 1322 1729 1029
2085 1029 -1050 -3075 -60 4547 1294 -5335 -2552 5244 3394 -4656 -3858 3396 3509 -2078 -2753 613
2101 613 1385 538 321 -1330 -2030 1687 3539 -1524 -4575 1028 5120 -280 -4853 -197 4118 669
2117 669 -2787 -711 1240 347 367 362 -1796 -1324 2688 2271 -3211 -3127 3037 3614 -2669 -3603 1835 3061
2135 3061 -943 -1972 216 612 372 1131 -356 -2565 159 3853 401 -4488 -1039 4556 1576 -4088
2151 -4088 -2068 3003 1917 -1700 -1466 87 502 1199 684 -2333 -2125 2815 3356 -2887 -4432 2332
2167 2332 4892 -1538 -4721 564 4066 523 -2615 -1181 977 1554 1101 -1235 -2886 648 4325
2182 4325 380 -5128 -1540 5221 2550 -4733 -3296 3496 3507 -1983 -3134 181 2163 1343 -687 -2590
2198 -2590 -1075 3335 2860 -3318 -4337 2784 5415 -1832 -5621 542 5209 680 -4045 -1521 2362
2213 2362 2148 -341 -2160 -1798 1595 3518 -579 -4795 -604 5274 1941 -5155 -3017 4378 3601 -3035
2229 -3035 -3667 1465 3190 216 -1984 -1637 418 2620 1403 -2982 -3032 2837 4279 -2121 -5023 1181
2245 1181 5104 -105 -4480 -899 3248 1572 -1735 -1813 -151 1485 1796 -821 -3158 -222 4024 1260
2261 1260 -4190 -2172 3927 2827 -3055 -2972 1969 2743 -657 -1842 -388 737 1267 594 -1727 -1983
2277 -1983 1751 3059 -1445 -3857 745 3976 -116 -3693 -542 2818 865 -1676 -986 377 670
2292 670 904 -30 -1888 -801 2574 1673 -2770 -2233 2576 2772 -1893 -2681 1162 2231 -338 -1411 -281
2309 -281 245 653 966 -782 -2115 505 2922 -113 -3417 -505 3332 1035 -2922 -1336 2063 1324
2325 1324 -999 -1012 -199 448 1212 501 -1842 -1451 2263 2360 -2186 -3074 1687 3364 -993 -3205 152
2342 152 2483 474 -1524 -966 176 1204 1123 -963 -2412 410 3247 429 -3661 -1227 3585 1989
2358 1989 -2953 -2357 2047 2460 -750 -2023 -428 1161 1502 17 -2242 -1309 2531 2406 -2327 -3357
2374 -3357 1728 3852 -951 -3898 -23 3285 873 -2339 -1496 998 1734 492 -1470 -1873 987 3040
2390 3040 -67 -3646 -893 3784 1870 -3371 -2475 2544 2827 -1373 -2634 128 1904 970 -991 -1905
2406 -1905 -400 2271 1604 -2291 -2818 1831 3440 -1159 -3759 216 3556 655 -2782 -1249 1716
2421 1716 1639 -355 -1510 -900 1127 2065 -364 -2850 -518 3236 1330 -3050 -2078 2487 2370 -1742
2437 -1742 -2413 727 1968 191 -1235 -1066 130 1538 936 -1627 -1979 1359 2650 -851 -3011 228
2453 228 2986 406 -2495 -856 1736 1065 -638 -1061 -349 639 1275 -2 -1954 -682 2192 1317 -2219
2470 -2219 -1927 1759 2125 -1206 -2053 538 1608 191 -914 -643 19 915 938 -806 -1717 647 2368
2487 2368 -186 -2525 -311 2458 788 -2031 -1052 1279 1078 -465 -951 -464 323 1131 239 -1650 -1050
2504 -1050 1791 1685 -1662 -2172 1172 2260 -547 -2098 19 1657 591 -766 -938 -95 1067 1073 -745
2521 -745 -1881 304 2413 214 -2626 -877 2413 1344 -1993 -1686 1120 1572 -278 -1344 -602 651
2537 651 1288 146 -1717 -1024 1877 1782 -1612 -2408 1168 2672 -393 -2519 -206 2102 905 -1190
2553 -1190 -1243 302 1292 834 -1091 -1760 597 2374 97 -2701 -831 2501 1411 -2115 -1898 1393
2569 1393 1966 -514 -1718 -375 1141 1173 -321 -1597 -553 1837 1513 -1650 -2128 1255 2586 -531
2585 -531 -2658 -89 2310 756 -1665 -1227 762 1292 138 -1230 -1122 780 1794 -187 -2283 -565
2601 -565 2333 1165 -2031 -1635 1532 1851 -716 -1760 73 1348 719 -628 -1159 -195 1383 1045 -1339
2618 -1339 -1747 1023 2153 -564 -2282 -84 2072 554 -1582 -914 920 1054 -126 -935 -702 568
2634 568 1358 -29 -1705 -525 1856 1072 -1621 -1443 1244 1619 -664 -1461 159 1182 459 -599 -816
2651 -816 -89 921 808 -934 -1455 583 1791 -276 -1895 -268 1695 635 -1277 -924 652 930
2667 930 -20 -759 -610 383 1120 209 -1414 -690 1488 1255 -1241 -1548 852 1652 -316 -1463 -148 1069
2685 1069 536 -465 -855 -204 955 871 -726 -1463 352 1749 109 -1866 -542 1698 956 -1195 -1165
2702 -1165 622 1162 83 -935 -634 455 1159 147 -1378 -739 1390 1278 -1216 -1739 707 1807
2718 1807 -207 -1711 -374 1211 737 -655 -1017 -66 1028 812 -843 -1350 435 1801 144 -1860
2734 -1860 -624 1768 1100 -1320 -1303 792 1366 -39 -1156 -544 739 1028 -122 -1335 -541 1361 1146
2751 1146 -1208 -1602 712 1843 -205 -1756 -269 1453 754 -930 -1020 259 1085 459 -858 -1047 547
2768 547 1559 6 -1749 -483 1677 966 -1321 -1272 845 1332 -263 -1219 -365 842 770 -271 -1134
2785 -1134 -338 1141 925 -1020 -1350 719 1589 -297 -1638 -96 1447 627 -985 -845 372 1003 226
2802 226 -745 -792 533 1227 -45 -1397 -441 1401 821 -1154 -1162 691 1244 -310 -1087 -227 740 595 -318
2821 -318 -900 -224 886 755 -780 -1172 528 1444 -101 -1385 -267 1186 629 -861 -824 293 836
2838 836 182 -684 -721 362 1033 28 -1173 -545 1106 858 -885 -1125 540 1184 -161 -1038 -328 689
2856 689 636 -301 -776 -178 734 713 -641 -1074 301 1294 88 -1326 -422 1083 740 -797 -907 197
2874 197 873 149 -682 -653 265 956 107 -1103 -579 1083 983 -857 -1208 440 1220 46 -1149 -350
2892 -350 848 755 -337 -860 -227 827 729 -640 -1023 289 1298 99 -1322 -535 1098 799 -811
2909 -811 -1038 321 959 123 -746 -610 459 925 23 -1022 -485 1004 840 -773 -1128 492 1322 -23
2927 -23 -1125 -366 859 683 -465 -865 -37 825 514 -647 -950 314 1173 66 -1226 -511 1120 773
2945 773 -813 -958 372 955 68 -798 -450 528 770 -105 -951 -282 935 705 -706 -991 470 1162
2963 1162 -2 -1141 -309 848 594 -504 -781 64 761 428 -646 -757 384 1006 57 -1039 -383
2980 -383 978 747 -724 -915 423 909 66 -760 -384 552 628 -110 -779 -276 785 661 -591 -932 344
2999 344 1064 -15 -1047 -362 770 536 -458 -726 82 688 333 -529 -531 301 875 64 -898 -367 864
3018 864 637 -565 -871 298 900 114 -713 -364 499 580 -128 -749 -301 674 546 -571 -902 224 1007
3037 1007 56 -938 -451 754 627 -412 -723 107 746 320 -534 -640 261 849 149 -857 -396 784
3055 784 713 -538 -862 273 905 63 -721 -401 489 590 -185 -751 -174 677 540 -524 -846 229 891
3074 891 134 -928 -426 724 705 -448 -730 112 736 275 -512 -588 270 763 40 -852 -480 697 634 -501
3094 -501 -900 165 858 85 -778 -395 533 651 -190 -718 -181 687 489 -462 -735 210 896 141 -831 -390
3114 -390 686 601 -443 -724 93 682 167 -576 -561 268 671 -26 -762 -348 658 565 -475 -795 201 851
3134 851 75 -781 -417 566 551 -185 -642 -135 627 477 -414 -650 171 783 113 -743 -407 622 549 -447
3154 -447 -718 97 631 203 -540 -465 270 556 -6 -638 -302 638 551 -362 -658 129 757 119 -624 -398 466
3175 466 505 -187 -533 -77 564 399 -390 -600 124 756 139 -681 -402 506 578 -355 -626 113 618 220 -519
3196 -519 -441 345 587 9 -618 -301 579 507 -324 -682 158 715 134 -653 -364 452 503 -193 -643 -114 542
3217 542 314 -421 -553 211 634 117 -644 -377 528 581 -304 -619 71 668 228 -499 -336 294 597 -13
3237 -13 -569 -216 501 470 -364 -631 75 686 131 -632 -421 431 552 -231 -611 -110 565 262 -407 -531 143
3258 143 666 87 -604 -307 487 527 -319 -589 33 618 183 -480 -329 329 521 -116 -542 -187 498 438 -334
3279 -334 -574 127 589 37 -618 -321 454 419 -283 -541 -8 521 269 -394 -487 169 520 81 -568 -238 468
3300 468 503 -256 -582 84 630 189 -493 -376 339 484 -103 -488 -150 468 399 -312 -536 77 623 142 -519
3321 -519 -321 400 507 -136 -506 -12 489 287 -336 -415 239 561 68 -508 -259 436 440 -237 -554 24 516
3342 516 95 -509 -359 252 460 -30 -511 -157 439 381 -281 -462 91 601 154 -536 -297 388 527 -140
3362 -140 -516 -93 464 259 -305 -447 187 524 57 -501 -248 417 396 -254 -501 33 530 129 -490 -343
3382 -343 255 458 -70 -449 -75 391 371 -316 -481 92 528 187 -515 -304 443 432 -194 -508 -63 509 261
3403 261 -395 -458 185 478 51 -526 -226 385 391 -254 -507 40 544 98 -461 -307 266 441 -73 -491 -121
3424 -121 422 273 -240 -391 144 506 52 -509 -248 352 347 -193 -426 31 469 232 -410 -356 202 473 -15
3445 -15 -439 -180 394 340 -246 -425 56 453 139 -395 -255 290 353 -74 -418 -90 369 238 -262 -370 90
3466 90 517 8 -448 -311 313 366 -252 -447 10 370 144 -329 -310 193 419 -54 -368 -136 366 315 -238
3487 -238 -424 72 429 95 -360 -224 230 359 -98 -392 -97 382 279 -354 -363 82 403 43 -412 -179 346
3508 346 351 -177 -439 -18 440 175 -277 -357 202 387 40 -440 -188 378 321 -212 -420 19 452 92 -410
3529 -410 -239 267 334 -127 -397 -94 389 270 -267 -318 93 390 80 -389 -220 310 387 -133 -414 -21 389
3550 389 174 -359 -256 180 377 17 -398 -116 327 293 -190 -383 78 426 117 -334 -223 283 327 -101 -381
3571 -381 -51 400 235 -216 -368 150 427 35 -358 -170 267 347 -148 -362 12 399 129 -356 -326 218 358
3592 358 -78 -389 -106 306 232 -270 -358 113 349 102 -341 -187 271 364 -125 -357 -25 338 220 -210 -299
3613 -299 116 430 -11 -368 -168 256 297 -187 -396 44 393 106 -301 -222 153 308 -118 -366 -79 322 219
3634 219 -209 -304 102 373 39 -287 -156 274 320 -85 -313 -20 334 159 -240 -273 71 340 37 -331 -155
3655 -155 236 207 -224 -287 31 314 97 -250 -190 111 287 8 -351 -108 289 243 -174 -323 51 343 72
3676 72 -313 -188 213 282 -105 -292 -34 272 147 -264 -252 102 324 42 -329 -157 258 289 -176 -301 52
3697 52 275 84 -268 -246 158 249 -9 -293 -107 283 192 -222 -288 61 315 86 -300 -193 236 228 -123 -352
3719 -352 -61 276 110 -245 -290 162 344 46 -325 -150 279 299 -176 -372 64 320 185 -261 -208 194 265
3740 265 -55 -343 -87 234 229 -211 -311 68 323 49 -379 -190 238 202 -141 -315 11 293 154 -153 -196
3761 -196 133 295 13 -261 -79 301 252 -155 -311 86 329 88 -331 -167 225 242 -62 -281 -92 224 139
3782 139 -185 -289 67 378 14 -322 -209 278 234 -163 -251 -13 295 113 -296 -186 167 277 -11 -278 -122
3803 -122 208 222 -120 -292 33 261 59 -209 -214 171 200 -103 -243 -69 253 98 -199 -179 68 323 20 -228
3825 -228 -116 191 263 -144 -276 46 229 122 -168 -196 70 224 30 -249 -88 181 187 -176 -238 -4 248 87
3847 87 -267 -161 240 235 -55 -231 -66 182 184 -127 -212 71 245 47 -224 -97 193 225 -56 -262 -2 248
3869 248 86 -214 -209 31 228 -4 -200 -133 195 216 -110 -270 -2 241 86 -205 -176 138 204 -51 -244 -76
3891 -76 200 174 -78 -248 16 235 35 -243 -166 183 201 -66 -197 -41 224 112 -245 -194 68 214 -11 -245
3913 -245 -62 214 167 -115 -268 20 255 120 -196 -164 155 233 -28 -203 -40 177 137 -142 -222 44 208 56
3935 56 -210 -118 230 191 -133 -286 21 220 -4 -185 -120 70 181 32 -183 -161 156 204 -130 -203 74 258
3957 258 29 -249 -132 161 177 -91 -224 -83 262 90 -151 -215 22 249 18 -238 -151 179 235 -117 -200 45
3979 45 215 102 -149 -193 121 136 -50 -220 -73 154 112 -84 -205 81 197 26 -153 -103 130 178 -37 -167
4001 -167 15 157 46 -113 -151 67 201 20 -177 -149 159 195 -39 -173 42 148 50 -136 -99 68 206 -15
4023 -15 -176 -70 155 142 -87 -208 4 171 25 -182 -89 130 188 -36 -179 -54 107 139 -89 -175 31 199
4045 199 49 -164 -74 91 203 -33 -224 39 181 124 -164 -139 32 163 33 -160 -102 122 123 -83 -184 -10
4067 -10 224 89 -188 -87 136 232 -39 -150 -4 136 125 -92 -158 3 143 65 -169 -146 115 180 -55 -213
4089 -213 -59 210 10 -180 -137 131 165 -69 -182 -84 116 142 -121 -193 3 131 60 -196 -144 159 215 -62 -173
4112 -173 -18 162 65 -107 -159 24 148 74 -198 -129 87 133 -94 -196 -64 151 45 -153 -133 98 130 21
4134 21 -144 -16 145 96 -28 -145 11 183 81 -150 -67 152 216 -1 -180 -10 173 8 -93 -110 44 178
4156 178 24 -147 -133 100 121 -75 -228 -72 199 84 -116 -96 61 110 -32 -126 -64 80 105 -88 -171 11 112
4179 112 53 -149 -115 52 135 -77 -200 -13 91 67 -29 -101 67 149 6 -147 -29 114 89 -68 -136 8 136
4202 136 92 -79 -142 66 129 -5 -156 -59 83 103 -40 -153 -34 126 76 -147 -75 157 106 -47 -206 -23 93
4225 93 65 -109 -97 74 101 58 -104 -61 136 155 -46 -127 -4 131 67 -78 -151 42 72 -27 -148 -17 37 52 -73
4250 -73 -103 -15 138 19 -131 -127 106 126 -56 -175 27 118 64 -133 -111 45 109 16 -95 -67 77 145 -65 -103 2
4275 2 171 123 -150 -139 95 62 -69 -171 -29 109 51 -115 -140 16 132 56 -135 -91 92 129 -65 -96 -28 136
4299 136 27 -112 -122 65 92 4 -101 -67 99 131 -14 -119 5 111 28 -172 -63 122 97 -70 -95 -27 122
4322 122 30 -72 -93 0 163 11 -122 -42 82 109 0 -192 -20 126 36 -104 -144 31 103 -10 -104 19 99
4345 99 102 -74 -160 -25 145 19 -121 -103 114 108 27 -74 -12 106 80 -32 -97 35 112 61 -123 -57 77 96 -49
4370 -49 -151 -34 97 6 -84 -100 70 75 -18 -109 -59 48 84 -34 -80 -60 140 -4 -82 -64 53 96 -27 -68 -24 102
4396 102 42 -108 -74 19 125 2 -77 -85 88 55 35 -112 -37 75 31 -123 -92 69 38 -4 -148 -68 66 134 -42
4421 -42 -68 -18 104 57 -91 -82 92 118 -33 -111 -11 105 175 -77 -73 29 111 34 -103 -51 67 57 -13 -91 -9 131
4447 131 73 -37 -79 68 86 -3 -57 -37 94 51 -35 -122 -34 94 33 -76 -116 -8 64 -10 -189 -18 142 37 -96
4472 -96 -116 -4 96 59 -73 -48 28 89 -81 -97 21 106 55 -85 -65 48 105 36 -140 -35 112 98 -71 -77 23
4497 23 100 17 -48 -128 84 98 -74 -127 8 104 53 -40 -99 48 133 -22 -70 -10 63 152 -47 -78 23 60 37 -87
4523 -87 -77 83 55 17 -131 -20 70 47 -46 -92 33 94 49 -96 -62 26 105 -10 -91 42 79 66 -60 -64 63 86
4549 86 5 -105 -49 34 50 -30 -53 -8 70 49 -115 -84 55 29 -12 -87 -8 66 36 -91 11 -20 81 84 -58 -26 75
4576 75 107 -78 -135 8 90 26 -51 -97 56 75 35 -97 -21 99 32 -17 -97 -54 49 68 -62 -89 53 46 -15 -95 18
4603 18 57 73 -20 -24 -13 1 57 -100 -72 56 76 24 -124 -48 106 104 -94 -70 27 21 20 -89 -20 58 54 -49 -63 -35 48
4632 48 24 -100 -70 54 90 52 -108 -32 92 71 -82 -47 28 65 61 -32 -27 65 71 -31 -55 -43 150 19 -58 -21 42 84
4660 84 15 -58 -4 78 20 -27 -104 21 109 3 -34 -37 54 76 -10 -49 13 36 40 -87 -84 6 104 36 -71 -57 131 49 12
4689 12 -66 -67 32 16 -71 -76 81 56 54 -26 37 85 54 -48 -52 -27 60 65 -40 -66 57 35 23 -85 -29 45 55 37 -46 8
4719 8 81 -26 -53 -101 12 61 -60 -27 25 61 95 -33 -63 50 31 69 -43 -51 50 35 17 -42 28 79 77 -38 -59 -12
4747 -12 94 -4 -87 -24 65 55 -1 -6 19 82 36 -60 -75 30 40 -17 -108 -30 43 30 -12 -28 26 101 -31 -34 -31 42 13 -15
4777 -15 -76 5 38 72 -118 -33 41 27 3 -51 -23 52 68 -64 -88 -3 29 -21 -28 -76 17 14 11 -93 -28 52 64 -15 -54 45
4807 45 64 -6 -61 4 44 9 -59 -17 1 31 48 -70 -42 8 40 31 -45 -20 56 17 -32 -47 26 94 -15 -28 -42 16 26 15
4837 15 -66 -25 -2 16 -26 -31 58 56 -28 -88 -38 68 52 -40 13 33 78 40 -92 -29 64 33 -10 -56 31 45 15 -41 -56 93
4867 93 66 -6 -40 -28 55 0 34 -64 -40 -22 44 -28 -99 30 51 -32 -60 0 9 44 -7 -21 52 49 -14 -36 -43 37 45 59 -77
4898 -77 -21 10 22 -36 -9 65 29 6 -73 13 14 15 8 -5 8 40 50 -27 -49 -22 29 18 -52 4 -25 33 -108 -71 21 -19 -3
4929 -3 -74 -72 -17 56 -13 -4 -45 74 40 -9 -12 40 -60 -18 -48 -54 10 4 41 -7 -18 92 56 -23 -63 6 55 54 -70 17 9 19
4961 19 -53 -50 22 44 -40 -42 -43 -7 26 -2 -56 -29 0 32 -62 -103 -35 51 16 -69 2 -6 64 -19 -96 -24 54 -3 -13 -36 14 53
4993 53 39 -74 -80 -7 0 -57 9 34 84 -3 2 -20 -18 46 -17 -88 -12 46 4 -44 -2 55 114 -12 -79 30 21 59 5 -10 -10 30
5025 30 -36 9 -60 17 86 -12 -46 -26 82 -17 -38 -41 35 54 -13 -18 -54 19 -9 7 -3 15 26 -3 -58 -16 27 71 -4 -53 15
5056 15 39 86 -88 -72 28 6 11 -30 -40 31 43 16 -30 5 32 38 -4 -2 76 54 -6 -8 -37 70 13 18 43 29 50 17 -48
5087 -48 -36 15 6 24 -43 -11 -7 33 9 -12 -40 -25 10 -19 -24 15 15 88 -32 -58 19 -22 -14 -60 48 14 38 -16 41 -31 30 -38
5119 -38 -71 -45 -7 -11 16 -39 -16 70 0 -82 1 15 30 -23 -24 25 34 15 -24 -11 -5 41 57 -30 -13 10 27 -53 -49 -14 -16 55 -13
5152 -13 -29 4 39 21 -38 -2 51 38 7 -37 30 69 12 -46 15 12 61 -49 -50 30 40 -49 -26 -20 -38 16 -9 21 0 48 65
5183 65 -26 -60 6 93 26 -67 -2 52 -3 -11 -9 -33 66 29 -46 -36 10 47 12 -16 22 43 36 -21 0 8 51 7 -112 -1 -9 65
5215 65 -13 -57 38 82 -45 -71 -41 45 46 -52 -68 45 14 28 -1 -31 21 75 25 -50 -21 44 18 29 -43 -27 70 5 -44 -51
5245 -51 36 56 26 3 27 -20 4 -42 -18 -23 45 45 1 -34 13 28 7 -10 -4 41 -18 -10 5 -6 -9 -26 -40 -19 -33 -21 41 -29 53
5278 53 10 19 -48 25 50 88 31 2 -9 -4 -7 8 -18 28 44 -4 -19 -21 55 68 4 31 -9 31 35 -67 -11 10 -14 8 -60 -6
5310 -6 6 59 35 -65 -21 20 34 -5 -6 12 53 -1 26 -13 7 13 25 1 -13 57 -8 -65 -57 -34 29 1 -27 -50 -2 24 -14 -10
5342 -10 39 39 18 -16 -11 -5 7 22 -25 -34 84 30 45 -39 -29 52 -34 -43 -6 50 14 46 -18 9 57 26 10 -47 -20 29 40 -25
5374 -25 -32 86 36 -59 -37 -15 -13 -43 28 -11 -37 1 27 -41 13 37 45 -48 -45 43 44 23 -56 3 46 -32 34 10 27 43 43 3 0
5407 0 -66 10 19 -6 14 37 59 10 -13 42 -54 -45 -10 2 -4 -7 19 -52 -1 -12 -9 -23 6 -12 5 -14 -99 13 -12 -12 16 -4 -21
5440 -21 -10 12 20 -26 -20 13 7 -42 27 13 23 20 -64 26 13 -15 11 21 -30 6 18 19 -48 2 59 -8 -24 16 56 33 7 30 3
5473 3 5 -39 20 -23 3 45 -5 -11 39 -6 -13 12 1 14 6 39 -11 24 49 17 -35 -16 15 16 3 16 -41 34 70 -13 -84 -15 17
5506 17 19 -32 -56 18 -19 -9 -83 1 38 40 48 -24 3 27 -1 -35 -37 84 -27 -17 -98 -10 29 -21 -6 -18 -20 17 -15 -1 6 66
5538 66 47 3 -16 -10 51 -28 -60 -64 11 3 11 -48 -4 37 31 -9 -44 17 17 5 -49 -1 26 -10 -54 -53 62 16 -13 -53 51 -1 57
5571 57 -43 23 16 39 10 -4 -21 30 25 -28 -3 32 53 50 -33 -28 -6 -4 -7 -15 0 2 -34 -42 -16 -20 -30 -19 -69 -8 -24 31 -3 -44 61
5606 61 36 -63 -9 -13 -8 44 44 20 -13 -19 22 13 -25 -35 -29 0 -24 23 -36 36 -5 12 50 -28 9 -35 -36 -34 20 42 11 -62 26 -13
5640 -13 22 42 -28 0 -40 -7 -15 -16 16 -10 -15 -28 -28 -8 -39 6 -9 -22 27 16 -17 -49 20 -16 -24 -8 -24 -53 49 55 18 -4 52
5673 52 -12 -51 -9 -43 -15 2 9 55 19 0 5 41 -39 -10 33 -32 13 23 18 -25 -16 -20 58 -31 0 -11 38 -21 -27 -3 1 3 -22 39
5707 39 -9 19 4 -28 -41 -34 -2 19 -42 -7 25 9 -29 6 -19 3 -38 -10 -6 13 10 27 8 -19 41 10 6 16 18 64 -18 -11 7
5740 7 15 14 26 -20 26 -58 14 -39 -64 31 12 44 -5 -4 13 -10 -32 26 48 -28 -28 5 14 25 25 17 -68 -34 30 3 -24 37 -8 2
5774 2 -16 23 51 -9 -20 -37 24 -11 -40 36 13 32 18 24 47 -15 1 38 -25 23 -1 20 28 -21 -12 -21 -1 -22 14 -32 -46 7 27
5807 27 -3 -28 -18 -28 -12 -19 29 -3 4 -20 20 28 23 36 -17 -8 17 -1 -27 29 4 38 -40 -15 16 20 5 38 -69 69 -5 0 8
5840 8 -36 -63 37 13 -35 -79 32 23 9 25 13 36 23 8 25 -55 1 58 -15 -55 12 71 72 -5 -30 -10 19 -25 -10 -6 47
5871 47 17 -3 -18 22 31 -19 8 27 -36 -7 -16 -64 3 13 17 -66 34 -21 41 3 -49 -12 67 49 -22 -39 4 19 12 -66 -5 -47
5903 -47 19 34 -47 -13 47 0 -59 -30 -7 -3 73 -8 -10 21 36 -13 -40 -2 34 -15 -11 -6 20 25 -47 -12 19 -6 -40 39 -44 -32 -1
5936 -1 3 -29 -12 17 15 -34 -35 -37 37 40 6 -33 84 -10 -3 8 -52 -5 38 -25 14 -13 6 16 -55 15 -28 9 -68 -16 -29 56 -75
5969 -75 -11 0 -14 -37 -49 -22 -29 17 -26 24 -24 29 -22 -16 8 3 1 -104 -7 31 30 -47 -20 38 -18 -25 -50 -25 14 -33 34 -17 9
6002 9 -10 8 -9 -5 -21 37 -3 -41 -34 12 -3 -11 11 16 4 -5 29 34 -10 0 18 4 15 6 -5 -25 58 33 -16 9 -1 13 -17 -28
6036 -28 12 29 -45 -34 29 28 -23 37 -29 67 3 36 -34 31 11 38 23 -47 6 7 24 -58 -73 -1 -25 22 45 49 24 25 5 -8
6068 -8 -6 12 -11 -63 -73 -27 25 -10 16 -31 81 24 36 -18 62 -6 8 39 -6 -16 -9 -5 -39 40 23 12 -41 -34 96 31 26 -1
6100 -1 -45 31 29 20 22 -16 58 -4 -11 -8 -16 44 -35 12 32 -30 -19 -15 -4 -46 -20 -31 -53 50 1 1 -44 -27 27 19 6 -69 9 25 -9
6135 -9 -47 -49 -11 31 -32 -13 -62 0 26 -8 13 -33 -13 0 4 32 36 20 27 7 29 21 9 -20 -49 9 -72 -34 -30 -5 3 -8 15 -63
6169 -63 69 48 6 -7 22 36 -12 -47 33 -5 -35 -38 -50 12 -32 -35 17 20 -59 28 -41 -34 -2 30 30 -4 -7 -58 55 -26 18 -22
6201 -22 -27 -22 -13 25 2 -3 -21 53 18 13 -5 -26 75 14 -13 -22 -23 16 73 -46 -6 -14 9 -12 -34 6 2 -13 4 6 -67 1 18 26 0
6236 0 -15 -20 6 -11 -12 50 -40 -11 2 112 27 30 -4 10 14 -6 -24 13 25 11 17 -18 10 -28 -20 -8 -28 21 44 -3 -30 -34 -13 -13
6270 -13 -7 13 31 12 -16 19 -54 35 2 -19 -31 -10 50 -31 -53 -24 -10 26 -30 20 -6 -26 29 7 -19 -42 51 -21 -60 -44 22
6301 22 -48 -34 19 -11 -40 -60 -6 19 10 -3 24 -6 47 26 -43 11 -12 23 26 -3 49 42 -17 -56 14 -12 12 6 -67 6 26 -11
6333 -11 -21 -37 -28 -26 1 -7 -35 25 -48 -7 20 -12 1 -56 -24 -38 5 16 -5 19 55 -15 18 -42 13 45 8 -13 1 21 34 12
6365 12 30 29 37 -4 -14 40 -18 59 6 19 3 -6 -20 68 34 -43 -25 -17 -27 -2 11 37 -57 -3 50 34 -25 -20 -12 -26 -40 29 6
6398 6 -16 -15 -52 -20 -37 15 -25 40 -54 -36 11 -13 -54 12 5 8 6 -10 2 -2 8 -1 -29 21 29 -21 5 -14 9 -26 -55 -4 -13 -17 -60
6433 -60 -44 26 -3 18 -13 7 -20 28 42 45 -7 -6 54 -13 -9 -6 10 -5 0 3 -1 -2 -11 -9 44 -45 2 27 -43 42 17 48 -42 -47 34 -9
6469 -9 -2 5 14 14 -49 -14 -27 48 -20 17 44 -60 -5 36 -46 -36 27 18 -58 0 -37 13 -17 12 -13 -45 -41 -44 29 -12 -17 30 -48 -29
6503 -29 -40 8 13 27 -36 24 -21 -25 28 20 -20 25 -22 5 -8 -32 -37 1 -33 -34 15 10 59 9 -1 10 44 25 -20 59 11 1 1 -5
6537 -5 8 -4 -1 15 -18 -10 -3 51 -41 6 -4 0 30 -39 -18 49 33 -48 1 11 26 -35 -16 -45 1 -10 -4 -19 -40 9 -18 -31 -66
6570 -66 -8 -17 12 -19 -8 29 -27 -21 28 -36 7 7 -49 -20 11 -67 35 -5 -16 10 9 3 -7 16 -14 -16 -6 -31 -3 -17 -20 8 22
6603 22 13 25 -29 -19 -2 19 -7 -21 6 -2 -21 -43 57 8 7 17 -36 55 -11 -60 13 -1 50 -10 -31 -2 22 -32 -55 -7 -32
6634 -32 34 9 -49 -27 47 -21 -12 11 33 43 9 20 4 -1 13 -27 -57 -13 -4 -2 -8 13 13 4 -32 -14 14 -35 37 -7 -4 15 19 4 3
6669 3 14 -10 -24 2 0 -8 -36 23 -18 53 -10 16 -18 -6 -51 3 -40 -42 -24 2 46 15 -9 -5 10 -21 41 -25 15 -17 0 17 -14
6702 -14 -4 20 19 18 17 45 -39 24 18 1 -7 2 16 38 -4 66 -4 -24 52 -11 11 20 31 26 -21 -29 -18 28 -32 -16 36 -60 -14 -8 16
6737 16 6 30 -3 -4 48 -20 23 39 9 63 -38 -28 41 34 4 -9 3 19 15 16 -20 -21 -10 -14 -26 7 -3 -45 24 -26 -7 9 3
6770 3 13 20 2 24 8 49 -16 -11 -24 11 -20 -54 44 27 51 -13 61 22 36 -4 -31 29 27 -77 64 79 -59 -33 -17 -14 29
6801 29 7 -57 -43 -21 -65 -4 -17 81 -31 0 19 -26 -8 -1 -27 17 24 12 4 -8 -63 -8 37 68 4 21 55 -32 -25 -28 11 -16
6833 -16 -54 -2 -12 23 50 1 -34 38 -5 12 -48 -32 -3 20 21 -29 -30 -37 4 -13 -14 14 -52 -26 18 42 -24 -50 12 55 -86 4
6865 4 -9 -13 -17 48 47 -19 -8 10 17 -49 22 38 -18 4 -27 13 0 -4 -6 -63 0 16 78 -20 4 -4 8 -47 30 22 -26 -15 -13 38 -17
6900 -17 6 -2 32 -37 -45 9 33 -6 -16 -1 -10 -4 -12 72 -16 -33 -24 20 2 -36 -2 14 9 13 -11 34 13 2 -20 -53 11 -2 -51 -51 -26
6935 -26 -4 7 15 -11 -19 42 -33 24 16 -26 -42 -26 -56 21 4 -22 22 -41 30 88 44 -12 -10 42 12 -9 -14 57 -26 -41 23 3 -1
6968 -1 3 -3 9 -46 23 14 5 34 -17 46 26 -21 -5 -27 17 -50 28 58 -43 -6 -35 31 -14 19 21 -10 16 -17 16 -3 -14 32 5
7001 5 14 8 3 -11 37 2 12 26 -22 -26 -16 64 14 -6 -3 19 28 -32 -31 11 -23 -12 16 47 -2 10 4 46 -2 14 2 -39 9 -37 -30
7036 -30 -20 18 -21 -37 6 18 -13 -9 -45 -14 -19 13 54 -23 -22 10 -40 6 -32 -10 -12 5 -20 7 15 26 18 -74 22 2 -6 6 -15 -21
7070 -21 -21 9 34 0 -3 3 -34 4 9 -10 -13 51 3 38 27 -1 -11 26 12 19 -16 24 23 1 3 -21 3 29 -41 -5 34 -15 39 -98
7104 -98 -44 11 -27 23 25 -59 8 42 17 3 -3 12 -41 17 -52 -12 18 -57 2 41 5 42 29 18 -25 5 -12 -1 -3 -19 29 4
7136 4 3 34 26 -23 -54 -59 30 37 11 -23 17 33 -59 12 -16 6 -4 -52 -9 -20 86 16 -3 -37 7 -41 -34 7 37 -21 78 23 14
7169 14 -19 0 20 22 -38 -14 -9 -24 38 -24 -13 -22 -13 -22 16 5 17 23 16 15 27 -52 -8 -30 22 -54 -35 4 -13 -12 2 -6 30 -6 -16
7204 -16 -38 -41 -38 -4 19 -4 3 -1 22 15 -9 45 19 5 3 27 -10 8 26 -46 -46 -4 -25 38 -33 71 20 -36 48 22 -21 1 -27
7237 -27 41 21 -11 24 31 -28 -15 -9 17 28 18 29 -15 39 -13 -44 -39 20 22 12 -12 -3 1 5 -1 -5 5 -15 -10 5 -33 -21 -6 31 0
7272 0 38 -13 48 21 23 36 41 28 24 9 -4 -38 33 15 -9 20 -22 -28 -24 28 61 -10 26 6 -33 3 44 14 -2 -6 9 29 -11 32
7306 32 -1 4 -68 -49 2 9 15 -7 87 -12 -14 25 20 11 -9 41 20 -2 -14 4 19 14 8 7 -16 2 40 23 37 31 -7 -9 -11 20 -35 41
7342 41 -54 29 -26 24 16 27 -10 44 -29 7 -19 -26 -21 21 -1 -11 26 3 7 33 12 8 -35 -5 23 -10 -37 -14 -8 -34 -23 15 -28
7375 -28 -14 22 -1 31 16 -63 22 -6 11 37 31 14 -17 20 55 34 -39 -17 7 20 -5 13 49 -29 21 -14 14 -32 35 11 -41
7406 -41 -28 -30 -6 5 -46 51 19 5 4 27 6 14 26 39 -4 8 3 3 35 8 -49 51 4 40 13 -3 -28 -34 31 11 -7 12 20
7439 20 -38 -31 5 1 -17 27 -5 19 1 -24 -31 -9 -2 25 18 -23 52 -25 7 -8 -21 31 -20 39 -20 -17 -2 10 -4 -19 -24 94 27
7472 27 23 12 3 37 -14 59 12 32 21 24 10 -6 -12 6 -5 -14 50 9 48 7 37 2 30 -43 -16 -4 -30 -29 21 1 25 4 33
7505 33 -67 -17 -7 -68 6 -2 -43 19 -8 -8 18 8 -10 -67 28 -10 10 8 8 -6 -44 -4 -16 -34 -21 7 -19 -13 8 -29 -2 -22
7537 -22 -12 6 8 -74 -9 8 -37 23 15 -4 33 3 5 20 30 18 -47 -6 37 6 16 -39 -30 47 20 3 -42 22 22 -31 39 -16 11
7570 11 -52 -22 14 19 16 34 78 -6 -57 55 -30 -26 -24 -1 -71 16 28 50 9 -31 -62 -36 22 31 -2 -3 10 11 31 36 26 -30 -17 37
7604 37 -26 67 -40 4 53 -64 12 39 9 -6 -40 -40 6 -47 3 -26 12 -29 10 50 16 -11 27 -38 1 -45 -20 -30 -16 10
7634 10 16 23 -16 30 -7 -4 -4 7 -3 9 -8 -8 -31 -10 -25 10 -30 0 34 -25 14 -34 29 4 -2 -16 -28 -18 -37 19 -24 31 3
7667 3 -6 4 -21 22 26 27 21 13 13 -38 28 20 38 13 -12 1 25 7 22 -17 -60 46 17 14 -41 -4 -13 3 49 -7 -57 45 -23 9
7701 9 -39 41 -26 -12 -23 -46 39 16 39 -19 -2 -36 -7 -10 45 12 3 -6 9 10 -57 32 -2 8 -28 -29 24 -34 -38 -23 1 -13 3 -18
7735 -18 -9 10 -33 36 -17 -32 32 -51 34 10 15 -45 -29 -9 -46 -18 -8 -8 25 -19 26 -15 2 -45 -60 52 19 -9 36 -3 -20
7766 -20 7 0 27 56 -42 -28 -12 -8 31 -3 -25 9 56 5 -18 -29 22 -27 -4 8 -14 52 -18 -37 34 -11 19 36 -39 9 -25
7797 -25 -23 12 -30 -15 34 -10 3 4 20 -17 -20 1 -53 17 -6 7 7 6 -13 -13 -44 4 17 34 -18 50 29 15 -15 -36 11 20 -31 2
7831 2 17 -4 11 10 25 -1 19 22 -32 21 41 -4 -2 -12 4 28 29 6 31 11 -54 2 -18 -19 55 -3 18 18 -44 -27 -5 -33 -1 10
7865 10 -54 -16 38 -35 -16 -22 36 -3 -30 55 23 22 23 30 -8 0 31 -15 20 24 58 -4 -22 -5 -13 58 -13 -38 8 49 35 -7 -14 50
7899 50 -10 54 -4 16 -24 -9 -62 -7 31 -36 -19 -7 10 -3 25 36 -24 -9 16 34 75 -35 38 -41 -1 9 41 -23 -5 17
7929 17 20 28 32 50 -3 -2 -31 -16 0 5 -28 43 2 -29 -13 -20 5 15 8 -8 -3 -6 7 38 19 49 10 65 -19 21 -10 -37 31 2 -6
7964 -6 -2 -3 -6 -22 -17 56 -14 3 0 -10 27 -34 -14 27 -20 -1 18 -20 41 -30 40 7 -14 -2 9 15 14 12 37 44 10 93 24 -17 -7
7999 -7 17 3 52 -7 -2 38 -30 0 43 19 15 -4 13 14 -28 17 -8 -33 -16 -41 22 -35 -16 -10 22 17 -41 16 6 6 -19 -39 -25 42
8033 42 4 -21 -29 -24 -16 -58 7 -16 -25 57 42 47 -11 36 82 -7 -26 -10 -20 -8 1 -22 -26 -53 28 -1 34 -30 -5 -29 2 -3 -7 46 17
8068 17 40 -46 -42 -3 -5 0 -26 -3 -3 30 -4 -19 7 -61 16 -57 -4 1 -10 1 -41 -15 42 19 -10 -6 0 -17 -33 63 35 -28 6 39
8102 39 25 12 -17 -5 -3 21 -7 24 24 -2 12 13 32 -25 7 -54 4 17 6 -4 19 -3 2 -9 -60 9 7 40 11 14 39 20 28 33
8136 33 32 -5 -7 20 -35 0 12 -56 32 14 33 38 3 -18 -31 -41 13 3 -15 -13 -6 6 14 10 59 -17 -18 5 22 15 -2 -24 -5 2 9 -54
8172 -54 36 -18 -12 51 -21 -19 -16 23 -22 19 -53 1 -28 -19 31 -16 40 -12 -26
8191b6
$$ Imaginary data points
##PAGE= N=2
##DATA TABLE= (X++(I..I)), XYDATA
0 0 0 0 0 0 0 0 0 0 0 0 0 0 0 0 0 0 0 0 0 0 0 0 0 0 0 0 0 0 0 -1 1 -1 2 -3 4 -4 5 -6 6 -7 9 -10 13 -18 18 -20 23 -26 27 -31 34
51 34 -38 40 -44 45 -47 49 -47 43 -34 21 7 -52 134 -283 572 -1204 2815 -8542 64365 449619 117251
72 117251 -403397 -169096 289659 197441 -156620 -184402 6936 133246 127593 -49680 -237658
83 -237658 -52519 304362 157054 -327145 -245835 305492 307248 -247307 -327288 166563 306318
94 306318 -76234 -241907 -6203 147436 71324 -32063 -109487 -86440 118428 193443 -101600
105 -101600 -276383 63579 323533 -17463 -333530 -29587 304082 63880 -244529 -81274
115 -81274 162574 76116 -71134 -49568 -17003 7080 92874 45883 -146456 -96701 177892
126 177892 139889 -184447 -164926 172688 169902 -146715 -152417 114383 115511 -82523 -66078
137 -66078 53899 8806 -33840 45824 19493 -94250 -12371 128250 6825 -147414 -997
148 -997 150933 -7890 -140629 22397 121347 -40389 -95157 63051 69250 -83798 -43521
159 -43521 101458 22139 -110382 -3454 109225 -12748 -96653 27809 72461 -45418 -41665
170 -41665 64291 5979 -87147 26897 109311 -54982 -130364 72303 144631 -78025 -148460
181 -148460 72497 138957 -57289 -113144 38328 73889 -17809 -21327 3283 -36589 3736
192 3736 95217 -21 -145957 -13152 182156 32742 -199624 -55706 193683 74211 -166819
203 -166819 -85205 119862 81577 -61441 -63223 -2418 28546 62284 18853 -109909 -72979
214 -72979 140097 127431 -147657 -171794 135199 200923 -103311 -206218 60330 186853 -12821
225 -12821 -142277 -29924 77562 60302 -1037 -74467 -79040 68379 150072 -45791 -204761
236 -204761 9264 233599 31758 -235069 -70548 208490 98763 -158121 -110034 92301
246 92301 102077 -18767 -72823 -50087 28192 107960 28090 -145985 -86033 161899 138028 -154497
258 -154497 -175606 127260 191805 -87086 -184960 39739 153249 4679 -102252 -41213 36527
269 36527 62548 33762 -67754 -100388 56822 154728 -32818 -189338 2396 201901 29407
280 29407 -189674 -53817 157964 67735 -110099 -66318 54710 50345 1157 -21835 -50537
291 -50537 -15140 87086 53109 -109472 -87891 115298 111987 -108347 -123329 90516 118558
302 118558 -67542 -99254 43783 68013 -22650 -28565 7785 -12554 1278 52129 -3087 -83277
314 -83277 1551 104758 2430 -113777 -5102 111356 4546 -99382 225 79705 -10617
325 -10617 -57383 23591 33530 -38852 -12568 51862 -5840 -61715 19943 65129 -30963 -61266
337 -61266 40086 50922 -47800 -34329 56257 15607 -63851 4474 71974 -21204 -77440 33823
349 33823 79439 -40349 -75607 41068 64282 -37792 -46210 31033 20329 -24962 9500 19948
361 19948 -41888 -19401 71538 22419 -95618 -29069 110452 37800 -113086 -44948 103682
372 103682 49166 -81716 -45783 51942 34981 -16398 -14894 -18568 -12408 49048 44638 -70467
384 -70467 -77615 79663 105588 -77232 -125185 62732 130921 -41228 -122034 15236 96999
395 96999 8812 -59069 -27021 12216 36175 38076 -33964 -84423 21999 122370 -1029 -145020
407 -145020 -23248 151237 47395 -139065 -65520 111313 73874 -71755 -69905 25441 52148
418 52148 19970 -23555 -60051 -14055 88051 53940 -102383 -91582 100766 120290 -85502
429 -85502 -135474 59960 134682 -28682 -116189 -1616 83241 27139 -38338 -42111 -11075 46187
441 46187 59703 -38345 -100521 21232 128735 1256 -141389 -25103 136525 44247 -117051
452 -117051 -56044 85022 56484 -46650 -46131 6315 25424 30143 2357 -58465 -32775 76563
464 76563 62020 -82482 -84368 78383 97866 -65062 -98907 47308 88203 -27632 -66508
475 -66508 10123 36972 2671 -3726 -9932 -29852 10357 58318 -6595 -79932 -808 91157
487 91157 7909 -92680 -13357 84741 14672 -69393 -10882 49895 2732 -28298 9738 8549
499 8549 -23009 9032 36368 -21802 -46089 30917 51218 -36329 -50583 39207 43860 -41176
511 -41176 -32910 41954 18273 -43616 -3222 44398 -11367 -44966 22767 43274 -30724 -38799
523 -38799 34801 30745 -34904 -18244 33197 2999 -29646 15307 27069 -33390 -25236 50038
535 50038 25348 -62286 -26555 68516 27854 -67671 -28247 58843 25127 -44418 -18533 24560
547 24560 6409 -3687 9572 -16418 -29166 32431 49452 -42152 -67564 45135 81207 -40378
559 -40378 -86617 30754 83366 -16886 -69441 3137 46857 8572 -17133 -15100 -15907 15402
571 15402 48221 -9369 -76225 -2865 95050 17744 -103624 -33760 99372 46190 -84031
582 -84031 -53058 59053 51488 -28297 -40470 -3547 21249 32928 5153 -54860 -34079 67768
594 67768 62609 -69311 -85308 61052 99132 -44589 -101194 23505 90583 -2129 -68660
605 -68660 -16520 37086 27982 -1254 -31950 -35573 26722 67408 -14755 -91175 -2094 103623
617 103623 20315 -103287 -35673 91557 46142 -69546 -48019 41809 41883 -11054 -26764 -17339
629 -17339 5589 40648 19243 -56183 -44040 62346 64543 -60269 -78693 50074 82803 -35854
641 -35854 -77424 19335 61999 -4389 -39454 -6897 12234 13068 16119 -13158 -41394 8797 61578
654 61578 -524 -73341 -8085 77024 15910 -71954 -20075 60096 19562 -43776 -14428 25126
666 25126 4540 -7405 7532 -8518 -21228 20077 33078 -28022 -42144 31724 46306 -32459
678 -32459 -45293 31227 39335 -28871 -28821 27149 16168 -25323 -1794 24755 -10974 -23903 21959
691 21959 22799 -29598 -20206 33597 15439 -34656 -8658 32807 -975 -29988 11389 26114 -22636
704 -22636 -23052 32315 20229 -39663 -18093 42949 15920 -41567 -12652 36271 8068 -26615
716 -26615 -669 15143 -8508 -2469 20165 -8716 -32312 17414 43941 -22337 -53120 22981
728 22981 57768 -20182 -57225 14137 49811 -7529 -36778 912 18307 3073 2955 -3935 -24943
741 -24943 911 45091 5811 -60027 -14582 68709 24512 -68851 -32493 61531 37180 -46810
753 -46810 -36350 27368 29400 -6108 -16499 -14293 -1428 30485 21590 -41256 -42260 44376 59159
766 59159 -40968 -70600 31378 73870 -18287 -68363 4218 54507 8506 -33307 -16956 8151
778 8151 20432 18728 -17575 -42887 9755 62274 2209 -73790 -15526 76398 27505 -70325
790 -70325 -36342 56036 39176 -36592 -35977 13839 25541 7950 -10025 -26791 -9312 39914
802 39914 29343 -46083 -47155 45430 60282 -38295 -65980 27482 64150 -14285 -53782 2330
814 2330 37223 7102 -16015 -12119 -6738 12308 27836 -8325 -45452 796 56618 7562 -61307
827 -61307 -15703 58607 20869 -50297 -22496 37398 19608 -22208 -12359 7021 2089 6763 10312
840 10312 -17058 -22256 24017 32821 -26615 -39405 26411 41860 -23712 -39336 19867 32299
852 32299 -16294 -21976 13236 9168 -11907 3371 11386 -15157 -12161 24239 12633 -30202 -12349
865 -12349 32765 10539 -32098 -6593 29370 1101 -24872 6182 20357 -13488 -15599 20679
877 20679 11778 -25977 -8448 28716 5236 -28637 -2123 25121 -2061 -19674 6941 11890
889 11890 -13336 -4084 19998 -3458 -27119 9151 33081 -12657 -36966 13834 37982 -12401
901 -12401 -34820 9961 28157 -6488 -17275 4130 4224 -2789 10339 3765 -24332 -6897 35854
914 35854 11525 -43783 -17209 46198 21805 -43849 -24925 35924 24421 -24636 -20228 11044
926 11044 11949 2627 -188 -14352 -13425 22927 27856 -26639 -40127 26253 49302 -21315 -52972
939 -52972 13705 50847 -4669 -42497 -3852 28740 9940 -11477 -12923 -7787 11343 25945
951 25945 -6350 -41440 -2049 51435 11677 -55420 -20976 52715 27972 -43982 -30944 30641
963 30641 29272 -14511 -21956 -1524 10654 15840 4140 -26088 -19753 31576 34260 -31728 -45374
976 -45374 27098 51144 -19421 -51179 9796 44542 -939 -32902 -6362 17033 10117 404
988 404 -10346 -17436 6924 32043 -787 -42148 -6485 47330 13996 -46517 -19387 41028 22057
1001 22057 -31343 -20818 19389 15814 -6964 -7534 -4624 -3161 13530 14130 -19634 -24607 21804
1014 21804 32233 -21175 -36479 18073 36179 -13927 -31791 9720 23871 -6191 -13136 4504
1026 4504 1842 -4145 9407 5543 -18570 -7285 25311 9269 -28720 -10225 29027 9603 -26864
1039 -26864 -7402 22581 3040 -17668 2219 12182 -8502 -7667 14170 3641 -18913 -632
1051 -632 21703 -1807 -22101 4045 20362 -6150 -16115 9119 10967 -12131 -4780 16007 -872
1064 -872 -19567 5744 22651 -9017 -24290 10426 23751 -10714 -20992 9503 15367 -8221
1076 -8221 -7935 6885 -1281 -6643 10741 7463 -19472 -9360 26225 11985 -29978 -14392 30562
1089 30562 16266 -27214 -16042 21289 13878 -12986 -8766 3963 1563 4550 7352 -11498 -17209
1102 -17209 15707 26186 -17139 -33565 15247 37353 -11336 -37547 5676 33058 -106 -24685
1114 -24685 -4641 13021 7353 562 -7001 -14053 4372 26277 1054 -34973 -7590 39689 14544
1127 14544 -39355 -20042 34398 22944 -25830 -22493 14507 18010 -2819 -10382 -8257 -303 16632
1140 16632 11867 -21854 -23245 23010 32394 -20779 -38152 15686 39566 -8751 -36037 1920
1152 1920 28455 4233 -17057 -7896 4027 9055 9622 -7197 -21771 2867 31008 2884 -36569
1165 -36569 -9402 37409 14487 -34266 -18090 27114 18365 -17895 -15637 7518 9756 2270 -1628
1178 -1628 -10242 -7569 15785 16858 -18131 -24181 17834 29203 -15088 -30443 11205 28246 -6901
1191 -6901 -22532 3132 14244 -851 -4727 -54 -5053 -961 13481 2707 -20278 -5366 24109
1204 24109 7441 -25327 -8800 23864 8698 -20351 -6745 15531 3444 -10022 1350 5076
1216 5076 -6356 -690 11557 -2378 -15494 4477 18111 -5743 -18721 6293 17084 -6981
1228 -6981 -13929 7663 9101 -9080 -4032 10655 -1254 -12552 5522 14037 -8674 -14807 10404
1241 10404 14262 -10681 -11964 10234 8334 -8920 -3012 7876 -2909 -6926 9264 6747 -14752
1254 -14752 -7183 18846 7938 -21060 -8784 20643 8767 -18212 -8023 13471 5584 -7789
1266 -7789 -1847 1509 -3333 4293 9372 -8722 -15508 11509 21042 -11889 -24676 10499 26152
1279 26152 -7391 -24515 3672 20082 29 -12870 -2730 3879 3714 5698 -3131 -15079 262
1292 262 22415 3588 -27435 -8317 28737 12410 -26866 -15193 21650 15929 -14259 -13867 5766
1305 5766 9443 2844 -2512 -9996 -5571 15264 14100 -17543 -21642 17116 27170 -14152 -29696
1318 -29696 9327 28670 -3918 -24344 -1546 16580 5337 -7104 -7390 -3569 6946 13569 -4388
1331 -4388 -21915 84 27437 5134 -29381 -9963 27981 13779 -23124 -15094 16208 14164
1343 14164 -7876 -10277 -208 4453 7259 2853 -12478 -10597 14996 17365 -15192 -22451 13071
1356 13071 24691 -9776 -24079 5682 20377 -1949 -14423 -834 6726 2225 1565 -1948 -9199
1369 -9199 536 15679 2121 -19874 -4725 21762 7218 -21021 -8507 18205 8312 -13903
1381 -13903 -6595 8709 3143 -3863 1099 -693 -6051 3753 10373 -5761 -13972 6401 15891 -6262
1395 -6262 -16035 5685 14261 -5038 -10865 4987 6624 -5170 -1693 6284 -2721 -7360 6508 8576
1409 8576 -9047 -9286 10287 8999 -10477 -7754 9465 4964 -8211 -1620 6624 -2731 -5613 6941
1423 6941 4711 -10843 -4473 13656 4633 -14865 -4540 14636 4468 -12462 -3416 9278 1758
1436 1758 -4959 1223 751 -4696 3193 8752 -6075 -12731 7627 15797 -7758 -17654 6369 17478
1450 17478 -4402 -15434 1882 11222 112 -5564 -1355 -1011 1377 7797 24 -13566 -2263
1463 -2263 17974 5379 -20024 -8238 19819 10632 -17079 -11601 12590 10859 -6819 -8227 538
1476 538 3635 4934 1951 -9344 -8324 11692 14256 -12110 -19091 10433 21869 -7284 -22106
1489 -22106 3368 19704 719 -14588 -3761 7889 5602 35 -5446 -7732 3709 14561 -418
1502 -418 -19272 -3644 21577 7668 -21220 -11000 18085 12592 -13309 -12420 7104 9748 -974
1515 -974 -5549 -4675 -139 8837 6406 -11083 -12198 11493 17040 -9943 -19524 7339 20101 -3757
1529 -3757 -17870 593 13743 2047 -7727 -3453 1072 3317 5442 -1980 -11228 -598 15067
1542 15067 3404 -17291 -6306 17016 8149 -15021 -8974 11534 8138 -7138 -5770 2882 2267
1555 2267 1056 2177 -3732 -6429 5469 10262 -5804 -12854 5322 13956 -4219 -13426 3027 11189
1569 11189 -2162 -7891 1685 3768 -2134 310 2933 -4125 -4350 6956 5607 -8845 -6493 9462
1583 9462 6719 -8990 -5891 7839 4299 -6103 -1533 4574 -1394 -3071 4741 2218 -7606 -1804
1597 -1804 9768 1771 -10760 -1871 10402 1678 -9067 -1283 6397 -17 -3515 1778 312 -4207
1611 -4207 2375 6839 -4259 -9297 5265 11158 -5074 -11833 4257 11441 -2806 -9382 1354
1624 1354 6090 -175 -1954 -322 -2647 -1 7051 1068 -10800 -2962 13040 4851 -13937 -6799
1638 -6799 12866 7888 -10466 -7985 6782 6638 -2546 -4063 -1551 449 5090 4042 -7245 -8364
1652 -8364 8247 12359 -7545 -14864 5758 15874 -2988 -14853 137 11915 2187 -7477 -3919
1665 -3919 1961 4079 3650 -3213 -8913 926 12839 1904 -15141 -5106 15474 7782 -13860 -9489
1679 -9489 10832 9984 -6483 -8571 1973 5971 2472 -1878 -5875 -2741 8039 7468 -8701 -11562
1693 -11562 7834 14216 -5900 -15350 3115 14477 -413 -11832 -2036 7594 3368 -2607 -3752
1706 -3752 -2641 2791 7378 -789 -10837 -1561 13076 4331 -13284 -6365 12016 7681 -9321 -7597
1720 -7597 5993 6283 -2495 -3752 -845 347 3263 3221 -4807 -6775 5111 9387 -4689 -11073 3463
1735 3463 11330 -2114 -10152 780 7930 132 -4743 -238 1393 -74 2254 1200 -4985 -2507
1749 -2507 7057 3865 -8032 -4884 7925 5208 -7066 -4960 5471 3498 -3861 -1590 2117 -948
1763 -948 -871 3524 34 -5839 149 7452 13 -8156 -185 7926 509 -6580 -317 4765 -184 -2302
1779 -2302 1469 -27 -2893 2071 4617 -3483 -6230 4157 7328 -4135 -7827 3362 7143 -2474
1793 -2474 -5785 1208 3474 -439 -522 -7 -2703 -163 5571 983 -7794 -2080 9255 3365 -9371
1808 -9371 -4342 8447 5034 -6399 -4741 3656 3550 -695 -1568 -2127 -1287 4188 4204 -5464 -7216 5516
1824 5516 9515 -4753 -10805 3062 10716 -1068 -9413 -850 6789 2339 -3200 -2987 -642 2804
1838 2804 4680 -1545 -7871 -245 10223 2562 -11095 -4771 10516 6470 -8770 -7374 5835 6900
1852 6900 -2590 -5523 -860 2876 3654 360 -5615 -3965 6443 7285 -6151 -9808 4886 11164 -2753
1867 -2753 -11038 614 9613 1408 -6704 -2798 3242 3317 784 -2927 -4479 1521 7458 289 -9510
1882 -9510 -2587 10025 4458 -9461 -5994 7545 6394 -5153 -5893 2284 4301 385 -1955 -2658
1896 -2658 -936 4093 3893 -4449 -6337 4179 8290 -3108 -9018 1763 8657 -354 -7194 -802
1910 -802 4832 1411 -2155 -1343 -867 526 3440 506 -5440 -2094 6483 3289 -6714 -4335 6046
1925 6046 4553 -4752 -4078 3222 2936 -1531 -1028 320 -963 760 3190 -1064 -4854 952 5984 -507
1941 -507 -6388 12 5955 307 -4836 -543 3194 94 -1355 553 -578 -1640 2106 2866 -3162
1956 -3162 -3976 3591 4871 -3382 -5113 2848 4817 -1905 -3631 1064 2038 -298 16 -46 -2223 -122
1972 -122 4197 569 -5684 -1442 6323 2263 -6374 -3023 5315 3084 -3807 -2873 1811 1822 205 -267
1988 -267 -1930 -1670 3248 3799 -3699 -5513 3658 6887 -2749 -7350 1626 7011 -128 -5683 -1115 3590
2004 3590 1941 -1045 -2167 -1860 1602 4375 -651 -6393 -932 7440 2486 -7572 -4018 6769 4951
2019 4951 -5021 -5173 2793 4588 -345 -3004 -1851 876 3614 1745 -4429 -4261 4518 6348 -3777
2034 -3777 -7784 2387 8124 -787 -7521 -876 5744 2068 -3447 -2885 509 2676 2283 -1905 -4703
2049 -4703 532 6477 1118 -7244 -2757 7228 4235 -6068 -4949 4365 4963 -2192 -4133 119 2595
2064 2595 1812 -566 -3202 -1831 3696 4018 -3649 -5793 2797 6756 -1696 -6973 389 6081 748
2079 748 -4553 -1604 2531 1809 -104 -1451 -2110 559 3901 703 -5014 -1933 5426 3097 -5010 -3742
2095 -3742 4058 3747 -2743 -3255 1285 2059 -5 -626 -1042 -1272 1561 2823 -1678 -4117 1299 4901
2111 4901 -668 -5058 53 4633 558 -3493 -691 2072 668 -401 -51 -1087 -834 2349 1829 -3057
2127 -3057 -2739 3126 3396 -2911 -3723 2226 3324 -1464 -2593 499 1265 80 241 -380 -1882 284
2143 284 3253 155 -4175 -633 4633 1407 -4378 -1851 3657 2071 -2341 -1756 868 1067 614 24
2159 24 -1842 -1369 2621 2745 -2982 -3960 2652 4649 -2021 -4951 939 4464 -22 -3434 -923 1778
2175 1778 1405 110 -1425 -1965 984 3685 -92 -4761 -878 5253 2052 -5082 -2990 4182 3527 -2806
2191 -2806 -3449 1075 2666 595 -1497 -2131 -265 2951 2006 -3464 -3674 3129 4965 -2288 -5627 1249
2207 1249 5542 78 -4618 -1069 3319 1937 -1384 -2181 -715 1950 2712 -1128 -4206 -3 5102
2222 5102 1329 -5397 -2535 4819 3310 -3773 -3694 2167 3517 -565 -2644 -1046 1252 2182 450 -2938
2238 -2938 -2211 3006 3717 -2528 -4677 1749 5135 -568 -4836 -468 3928 1318 -2498 -1765 739 1690
2254 1690 964 -1232 -2619 248 3655 684 -4243 -1791 4097 2503 -3507 -3009 2528 2939 -1295 -2354
2270 -2354 123 1395 907 -6 -1526 -1302 1816 2625 -1610 -3508 1164 4010 -473 -3917 -252 3301
2286 3301 712 -2388 -1063 961 841 276 -420 -1538 -435 2238 1213 -2725 -2024 2727 2572 -2242
2302 -2242 -2730 1559 2566 -756 -1835 14 875 559 383 -786 -1570 710 2562 -326 -3275 -228
2318 -228 3414 737 -3231 -1236 2481 1340 -1574 -1257 357 751 724 26 -1565 -917 2095 1974 -2254
2335 -2254 -2697 2001 3310 -1424 -3322 607 2939 162 -2084 -825 831 1142 455 -1078 -1851 681
2351 681 2768 -37 -3607 -854 3670 1588 -3356 -2275 2541 2459 -1414 -2254 175 1638 1046 -559
2367 -559 -1878 -552 2436 1894 -2413 -2913 2043 3634 -1331 -3933 416 3651 473 -2917 -1264 1666
2383 1666 1573 -289 -1678 -1302 1274 2456 -502 -3399 -432 3757 1412 -3601 -2221 3046 2758 -1927
2399 -1927 -2787 798 2315 530 -1387 -1532 345 2152 972 -2296 -2299 2015 3196 -1520 -3666 625
2415 625 3635 187 -3297 -1007 2308 1428 -1099 -1551 -284 1295 1503 -715 -2525 6 3131 984
2431 984 -3160 -1710 2861 2293 -2152 -2465 1216 2288 -234 -1671 -658 622 1259 340 -1614 -1493
2447 -1493 1495 2354 -1176 -2940 544 2978 117 -2823 -692 2131 1021 -1181 -1124 155 919 882
2463 882 -290 -1635 -316 2101 1039 -2253 -1651 2041 2038 -1571 -2173 840 1828 -182 -1336 -454 442
2480 442 779 461 -949 -1374 784 2068 -383 -2495 -47 2591 547 -2213 -904 1672 1136 -805
2496 -805 -978 -46 641 854 -33 -1442 -671 1748 1357 -1770 -1968 1419 2228 -912 -2279 250 1905
2513 1905 302 -1266 -775 360 993 647 -924 -1495 622 2206 -34 -2540 -458 2657 1162 -2235
2529 -2235 -1487 1604 1668 -745 -1449 -192 993 948 -294 -1636 -578 1771 1398 -1749 -2161 1380 2558
2546 2558 -767 -2574 120 2366 558 -1661 -1019 749 1345 275 -1241 -1279 872 2090 -238 -2582
2562 -2582 -468 2668 1159 -2419 -1696 1789 1924 -969 -1860 12 1408 751 -766 -1408 -127 1791
2578 1791 1007 -1744 -1790 1543 2421 -855 -2647 262 2540 444 -1997 -961 1292 1281 -266 -1269
2594 -1269 -678 1017 1496 -477 -2124 -163 2315 885 -2292 -1465 1797 1777 -1120 -1837 353 1566
2610 1566 370 -1024 -992 246 1420 675 -1399 -1398 1252 1995 -757 -2210 248 2224 343 -1895 -798
2627 -798 1274 1051 -484 -1016 -325 746 1004 -350 -1538 -268 1800 803 -1813 -1244 1418 1509 -978
2644 -978 -1624 387 1362 234 -846 -610 277 957 475 -971 -1105 772 1653 -423 -1900 2 1831
2661 1831 449 -1529 -808 971 879 -365 -892 -323 558 964 -84 -1310 -445 1453 987 -1426 -1427 1076
2679 1076 1654 -589 -1556 101 1344 437 -775 -756 127 926 519 -860 -1168 542 1638 -192 -1842
2696 -1842 -341 1770 735 -1445 -1076 900 1205 -279 -1076 -354 703 938 -223 -1252 -411 1486
2712 1486 1104 -1279 -1509 978 1775 -443 -1706 -117 1486 539 -1027 -894 268 1016 421 -995 -1116
2729 -1116 632 1564 -159 -1899 -319 1849 913 -1574 -1192 1031 1336 -353 -1304 -214 1011 869
2745 869 -435 -1204 -187 1361 903 -1319 -1375 982 1738 -559 -1816 -42 1567 455 -1248 -893 588
2762 588 1087 107 -1024 -775 740 1358 -291 -1622 -188 1745 782 -1515 -1146 1146 1335 -525 -1228
2779 -1228 -18 1076 644 -541 -990 45 1187 588 -1135 -1163 858 1462 -472 -1657 -42 1494
2795 1494 367 -1193 -720 698 936 -72 -907 -455 691 998 -245 -1259 -177 1425 682 -1263
2811 -1263 -1027 939 1208 -505 -1202 12 944 403 -552 -795 -35 878 541 -876 -1013 606 1328 -311
2829 -311 -1417 -127 1376 471 -1041 -695 651 860 -26 -719 -479 514 885 -85 -1128 -309 1161 691
2847 691 -1035 -1067 689 1183 -330 -1181 -162 873 473 -544 -769 -13 831 504 -712 -943 530 1185
2865 1185 -126 -1326 -186 1292 594 -943 -826 576 924 -11 -800 -436 521 853 -165 -1090 -316
2882 -316 1086 767 -948 -1142 605 1246 -268 -1194 -218 983 521 -591 -774 72 877 453 -730 -830
2900 -830 543 1189 -59 -1294 -301 1265 651 -977 -913 585 967 -64 -962 -410 643 739 -256 -1072
2918 -1072 -271 1064 650 -960 -1075 611 1192 -178 -1223 -156 1062 579 -700 -737 217 894 315
2935 315 -744 -729 481 1027 -150 -1187 -288 1151 640 -960 -887 617 960 -146 -935 -280 623 686
2953 686 -336 -846 -130 960 528 -818 -834 588 1141 -275 -1116 -119 997 475 -709 -703 335 774
2971 774 134 -729 -593 496 871 -150 -1140 -157 999 528 -921 -815 581 987 -164 -870 -218 694
2989 694 584 -277 -730 -88 805 507 -679 -778 532 1061 -138 -1013 -213 893 485 -702 -687 270 693
3008 693 87 -668 -545 452 755 -102 -915 -206 940 620 -778 -732 532 909 -103 -829 -213 665 543
3027 543 -298 -667 -82 747 471 -664 -745 342 924 -77 -1009 -300 828 528 -594 -743 227 742 141
3046 141 -675 -507 408 746 -69 -818 -237 834 629 -637 -822 355 884 -55 -839 -281 651 543 -324
3065 -324 -684 -47 688 347 -628 -706 303 850 -50 -990 -258 830 525 -632 -737 301 734 97 -639
3084 -639 -450 463 688 -93 -781 -210 784 548 -657 -791 343 885 -65 -847 -311 596 453 -437 -696
3103 -696 -43 665 290 -566 -628 322 868 -50 -850 -296 801 486 -596 -635 257 706 68 -661 -342 426
3123 426 534 -129 -703 -236 717 453 -589 -738 348 787 -60 -789 -274 629 438 -386 -617 54 649
3142 649 273 -516 -516 285 714 -9 -738 -271 717 486 -467 -646 248 708 99 -599 -342 410 550 -195 -692
3163 -692 -183 609 424 -455 -655 307 737 -23 -716 -206 622 450 -324 -577 55 586 237 -490 -495 292 647
3184 647 -43 -734 -226 679 486 -448 -645 218 648 56 -598 -371 426 446 -189 -582 -184 574 400 -496
3204 -496 -625 243 779 43 -685 -216 557 476 -336 -561 93 587 221 -522 -438 217 575 -48 -663 -228 589
3225 589 446 -444 -618 195 616 46 -586 -275 456 457 -168 -533 -72 590 370 -400 -511 253 707 9 -646
3246 -646 -266 580 495 -314 -619 122 571 209 -439 -454 283 542 -72 -614 -256 562 412 -393 -572 171 595
3267 595 58 -613 -297 448 460 -191 -498 -56 539 281 -413 -467 179 646 5 -619 -238 519 390 -340 -476
3288 -476 121 507 156 -448 -324 255 511 -85 -594 -198 513 389 -386 -511 191 599 93 -509 -216 421
3308 421 437 -181 -539 -23 467 255 -365 -458 203 589 -13 -572 -240 473 397 -362 -502 57 518 148 -455
3329 -455 -330 283 477 -62 -517 -184 456 371 -300 -507 154 548 54 -522 -274 311 430 -198 -542 -36
3349 -36 436 238 -405 -415 167 524 31 -569 -221 453 361 -260 -486 58 562 190 -426 -355 272 519 -40
3370 -40 -510 -153 442 350 -301 -495 118 504 25 -516 -321 371 391 -180 -521 -63 468 266 -378 -441 227
3391 227 474 -33 -519 -194 439 398 -276 -477 103 549 148 -385 -338 279 440 -71 -485 -101 459 319 -362
3412 -362 -473 126 509 18 -527 -225 403 343 -181 -474 -94 475 193 -351 -301 239 463 -30 -456 -137 458
3433 458 320 -254 -395 94 469 66 -421 -261 267 400 -99 -453 -78 446 283 -373 -395 145 451 20
3453 20 -444 -169 348 358 -177 -385 14 405 167 -346 -320 217 409 -22 -434 -165 438 272 -333 -436 64
3474 64 464 47 -417 -254 252 306 -119 -422 -63 399 227 -298 -340 189 416 27 -417 -180 364 326 -205
3495 -205 -406 41 406 162 -320 -343 211 407 -22 -421 -193 330 270 -305 -409 17 384 72 -403 -285 229
3516 229 376 -65 -394 -120 404 229 -254 -332 204 433 -10 -384 -187 328 377 -198 -356 -2 390 149 -344
3537 -344 -311 213 370 -17 -414 -116 349 286 -269 -418 61 409 114 -350 -204 263 351 -89 -375 -41 410
3558 410 225 -313 -350 156 454 -30 -411 -183 320 299 -226 -406 -9 379 151 -293 -319 138 399 -55 -390
3579 -390 -123 331 268 -250 -345 98 367 29 -353 -189 310 329 -130 -396 -28 346 143 -313 -347 136 378
3600 378 -74 -404 -164 325 227 -240 -359 17 359 120 -320 -268 252 373 -40 -404 -92 356 231 -223 -295
3621 -295 168 397 55 -370 -174 242 276 -106 -368 -81 303 169 -233 -332 125 352 -32 -366 -89 314 198
3642 198 -171 -304 49 332 101 -286 -231 148 325 -57 -363 -83 353 194 -205 -274 71 299 91 -350 -164
3663 -164 237 241 -95 -359 -80 312 161 -276 -310 176 299 -15 -403 -107 277 186 -130 -262 23 310 84
3684 84 -267 -212 135 234 -52 -297 -140 279 253 -198 -273 119 287 -6 -329 -158 211 257 -51 -365 -62 321
3706 321 203 -206 -285 121 313 15 -328 -82 318 253 -140 -286 46 319 58 -287 -247 158 260 -40 -357
3727 -357 -63 283 176 -177 -307 31 318 49 -244 -103 215 286 -30 -257 -52 273 157 -231 -218 114 357
3748 357 9 -313 -117 241 175 -153 -305 55 283 25 -249 -203 149 239 -125 -322 -49 307 190 -245 -294
3769 -294 113 303 23 -297 -145 248 253 -83 -264 -12 268 157 -237 -222 180 256 -43 -285 -87 252 183 -175
3791 -175 -290 -12 267 32 -286 -143 123 261 -26 -273 -13 297 137 -190 -233 114 259 -51 -231 -88
3811 -88 188 218 -155 -251 -8 241 95 -198 -207 139 311 1 -301 -87 224 192 -169 -186 65 248 50 -232
3833 -232 -173 110 294 -75 -257 -55 260 192 -213 -197 95 243 -27 -255 -164 120 157 -100 -195 -29 191 99
3855 99 -161 -251 133 248 -1 -249 -114 240 154 -142 -234 69 245 92 -163 -140 164 177 -44 -244 -52 178
3877 178 176 -169 -239 64 217 25 -254 -133 187 159 -141 -312 -28 200 111 -165 -222 128 292 -23 -259 -76
3899 -76 218 179 -157 -201 47 266 62 -245 -117 132 195 -34 -257 -56 219 183 -116 -167 87 243 -7 -226
3921 -226 -120 175 162 -116 -254 -31 198 87 -210 -191 138 263 22 -284 -77 216 188 -114 -251 54 254
3942 254 26 -263 -148 117 212 -97 -205 -55 189 118 -205 -226 68 232 37 -262 -104 183 156 -78 -178
3963 -178 11 218 106 -203 -145 82 210 -13 -243 -105 162 152 -134 -256 74 205 20 -186 -131 128 153
3984 153 -89 -223 -70 168 101 -184 -138 136 260 63 -242 -66 214 197 -109 -203 41 211 31 -175 -167 89
4006 89 162 -6 -212 -62 182 147 -98 -235 66 198 24 -133 -59 127 168 -75 -118 -96 164 134 -148 -215 15
4029 15 186 32 -175 -105 101 128 -85 -163 1 193 41 -112 -158 18 172 -1 -131 -113 171 125 -127 -184 29
4052 29 231 40 -159 -127 154 153 -15 -165 16 168 67 -96 -182 45 217 56 -191 -137 81 143 -107 -201 -61
4075 -61 168 86 -122 -87 103 186 31 -151 -67 135 178 -100 -209 72 231 23 -152 -109 90 176 -127 -156 -61
4098 -61 136 125 -107 -233 59 259 43 -152 -93 135 126 -29 -159 13 164 81 -145 -61 62 196 -29 -205
4120 -205 -47 103 138 -105 -176 32 264 18 -192 -146 111 126 -79 -141 -47 168 111 -115 -127 34 155 5 -173
4143 -173 -115 162 135 -60 -159 42 188 47 -165 -105 71 125 32 -204 -63 125 115 -122 -185 49 231 31 -159
4166 -159 -58 163 114 -25 -133 20 124 67 -95 -120 -12 139 14 -115 -73 142 135 -113 -175 17 184 23
4188 23 -131 -120 14 156 -12 -197 -46 86 98 -66 -146 63 214 67 -83 -98 91 87 -30 -158 -12 96
4210 96 49 -81 -78 70 126 50 -166 -75 110 83 -59 -174 -53 136 67 -110 -106 35 156 -19 -113 -81 83 134 -82
4235 -82 -124 51 138 94 -114 -63 65 180 26 -123 -32 91 48 -119 -44 38 127 27 -119 -101 85 123 -41 -127
4259 -127 -29 136 34 -114 -65 67 114 1 -144 -35 67 61 -39 -127 31 144 32 -104 -89 30 138 -61
4281 -61 -140 38 129 50 -75 -94 33 70 -21 -132 -77 124 107 -49 -167 -8 137 52 -148 -81 74 121 4 -146
4305 -146 -21 96 41 -107 -72 -9 128 52 -123 -65 111 98 -48 -121 -39 82 79 -147 -113 9 105 14 -116 -41 87
4330 87 111 -74 -160 22 163 54 -46 -45 97 153 -15 -110 -32 69 84 -83 -142 95 101 -32 -125 -75 82 85 -49
4355 -49 -134 -24 112 9 -94 -40 57 89 68 -98 -74 120 103 -70 -97 28 124 42 -22 -61 102 91 -47 -144 -27
4380 -27 73 83 -61 -88 -3 106 12 -107 -52 62 107 -77 -128 31 93 86 -79 -122 53 102 -37 -100 -110 62 47
4405 47 -72 -132 25 83 49 -86 -99 111 108 -38 -96 -46 75 49 -6 -126 11 102 43 -150 -97 94 67 -57 -98
4430 -98 53 89 33 -73 -65 60 110 -26 -118 -117 60 48 -21 -86 17 93 -5 -114 -126 77 152 -35 -81 -5 78 109 -32
4457 -32 -51 50 126 32 -88 -40 76 92 -24 -89 -78 102 43 -128 -112 108 72 -52 -62 -50 76 37 -83 -101 -8
4482 -8 110 51 -109 -80 79 116 -22 -140 -25 108 34 -82 -59 48 101 -33 -86 -55 98 96 -51 -139 -25 49 -19
4507 -19 -101 -102 47 63 -3 -126 -6 45 75 -69 -92 -8 90 -28 -38 -96 82 146 -48 -123 -23 127 82 -81 -79 -33
4533 -33 72 -64 -100 -77 32 61 -64 -101 37 105 54 -88 -59 65 57 39 -120 -45 32 85 -26 -23 7 96 -13 -99
4559 -99 -89 105 47 -56 -121 -10 134 37 -45 -46 49 78 -27 -46 -28 59 46 19 -57 9 22 12 -55 -67 45 41 25 -71
4587 -71 -57 29 106 -11 -124 -46 110 5 -99 -97 15 62 -55 -136 -25 64 -17 -87 -59 14 98 6 -111 -111 9 107
4613 107 -38 -83 48 35 -30 -53 -65 108 35 22 -93 -33 34 60 -46 -84 -6 60 37 -89 -64 59 67 -24 -48 19 134
4640 134 22 -77 -28 46 66 -3 -52 -14 83 124 -12 -53 -39 68 34 -58 -55 63 31 6 -115 -27 53 31 -28 -69 -8 103
4668 103 -8 -80 -78 69 71 -32 -55 -15 69 24 -44 -22 10 16 -86 -56 -35 -32 28 -31 -46 -12 75 22 -21 -105 21 98 -23
4697 -23 -46 -23 49 26 -49 -41 -6 66 41 -49 3 28 28 4 -88 -19 77 39 -66 -65 85 94 -30 -55 -50 27 58 27 -80 -16 50
4728 50 22 -62 -13 17 51 6 -57 -60 72 88 -5 -35 -1 92 59 4 1 53 40 30 -61 -65 50 45 19 -30 -10 55 -3 -35 -17
4759 -17 37 39 -8 -76 -5 50 28 -88 -49 48 64 47 -24 -25 33 1 5 -72 14 -10 32 -50 7 46 8 -14 -52 -9 91 25 -66
4790 -66 -73 38 104 30 -23 -4 41 63 -22 -33 -13 72 105 -60 -58 2 82 -60 -77 -16 50 59 -26 -43 -8 63 3 -111 -60 25
4820 25 23 -36 -92 23 62 25 -51 -42 59 127 23 -62 6 47 37 -4 -110 -4 68 0 -60 -63 4 65 -89 -65 -31 47 -2
4849 -2 -51 -87 -7 54 -1 -62 -52 59 85 -31 -23 61 74 54 -64 -5 37 57 3 -24 -6 38 12 -12 -25 -32 47 -2 -18 -76
4879 -76 33 44 -20 -88 -1 18 8 -54 -74 60 88 -14 -27 -62 8 51 0 -71 1 55 -10 -50 -61 -62 52 2 -66 -20 40
4908 40 42 -2 -10 -72 22 2 -35 -75 22 29 -4 7 19 63 47 -16 -31 15 -4 -47 -40 -32 -19 22 0 -12 -30 64 37 -33 -70 -12 34
4941 34 23 -39 -17 102 36 -37 -53 16 51 37 -86 -46 -6 15 38 -19 -27 20 81 -86 -52 4 49 35 -84 -32 21 71 30
4970 30 -93 -65 13 17 -92 -97 52 8 -14 -75 -36 28 30 -60 -54 -6 28 55 -25 -19 35 82 -29 -84 22 46 69 -96 -10 29
5000 29 17 27 -63 -14 29 25 -24 -50 -22 25 15 -25 -78 -4 56 2 -73 -29 32 36 -50 24 10 -14 22 -51 -46 -13 -4 10 -150 3
5032 3 20 49 -67 -61 -11 78 -31 -17 -10 4 68 -18 0 4 28 31 -36 -66 -46 98 -11 -69 5 33 33 -26 -29 52 51 14 -4 -29
5064 -29 34 1 -20 -16 17 62 -7 -16 -61 -22 6 -54 -32 -12 -6 -27 -76 -39 -34 65 5 -10 -31 -1 -24 60 -122 9 47 48 35 -68
5096 -68 1 9 17 -17 -10 -13 31 -8 -120 -64 42 30 -2 -9 40 7 -20 0 34 -17 67 -16 -37 -62 17 42 33 -24 -19 17 44 -65
5128 -65 -23 48 54 -75 3 12 18 -16 -14 -23 -20 58 -3 -42 -23 21 56 -30 -49 -47 42 13 -13 -13 24 77 -18 35 -32 6 -29 21 -64 18
5162 18 51 -22 -55 4 32 18 1 -63 59 23 11 -9 -25 24 1 13 -26 -26 45 19 -23 -35 65 40 -21 -58 -6 56 54 -20
5192 -20 -34 -16 25 1 -64 -11 54 21 3 -45 -22 66 37 -65 -29 -14 82 0 -31 -21 36 51 3 -18 -22 20 45 -33 -37 8 7
5223 7 23 -22 12 43 -38 -86 -31 -16 39 -52 -19 -61 -10 -1 -44 -18 -28 0 12 -33 -8 19 45 3 -11 -4 7 37 52 4 -80 56
5255 56 46 -40 3 -7 54 -4 -60 -10 -53 73 -18 22 8 5 6 2 18 -19 46 16 -45 -3 -37 -11 -54 0 50 7 4 -10 -4 9
5287 9 12 -23 16 -10 51 -15 22 -36 3 4 50 -42 -11 -11 41 7 -16 39 14 0 -4 -78 16 12 43 -55 -85 31 24 -43 -47 -18 -24 22
5321 22 28 -24 -10 55 -9 -16 14 -10 52 -38 4 27 1 16 -68 11 27 47 -12 34 -31 34 56 -38 -13 -24 52 42 -8 -35 60
5352 60 -24 28 -22 29 36 28 -19 -21 -55 -4 33 -41 -7 -38 24 4 -20 0 0 2 -27 -39 55 1 5 -24 -24 36 -25 -20 8 -20 -2 -27
5386 -27 -53 -37 -32 44 -4 -57 17 -38 -33 -39 -27 46 -15 -57 -3 -27 3 26 -53 19 18 28 59 -29 -64 85 -36 -34 -11 10 22 -24
5418 -24 -10 -16 25 -65 0 6 -25 -5 23 0 -50 11 11 -1 -8 -37 28 -10 -14 13 40 -38 28 -2 -48 32 5 -23 -13 38 41 75 -42
5451 -42 -9 21 -2 -1 -22 13 12 -9 58 -52 -38 31 8 30 10 0 -40 7 -37 -6 -1 37 40 -33 0 -45 29 16 -37 34 0 11
5483 11 -35 -9 19 -1 -20 -14 -29 16 10 -9 -38 -11 -34 0 -22 12 2 8 -14 -26 -27 23 79 -39 -18 8 18 -62 -68 -29 4 -10
5515 -10 -13 -23 25 -43 53 -49 -54 15 -20 -57 -15 -24 32 27 42 -45 -1 54 -28 -25 -20 17 21 -58 -28 32 0 -8 -14 24 -1 -34 -25 -21 -42
5550 -42 21 -10 17 -37 -4 -39 9 -24 -64 -1 -66 -44 -88 -52 16 -29 -86 10 41 -18 30 -34 4 -42 10 -2 -49 9 12 3 23
5581 23 39 43 0 3 25 39 62 12 7 -45 -32 64 0 1 -39 -5 0 -26 8 11 -45 19 -31 3 1 -25 38 -41 27 -5 14 -36 15 16
5615 16 -7 41 -31 10 -20 8 -27 30 30 -21 18 9 32 0 -23 -7 15 -38 31 -2 -9 -24 -8 13 -27 -29 45 13 23 0 36 -24
5647 -24 43 15 65 -6 -29 29 52 -38 -7 96 38 12 8 -22 10 4 -37 17 2 28 -4 -16 -30 23 47 29 -30 -1 4 9 -19 -18
5679 -18 24 58 -7 -41 10 -25 16 84 -47 -10 -13 -6 -43 -43 72 -12 7 -33 16 39 -10 -20 -10 -5 48 19 -28 -46 35 78 -25
5710 -25 -15 49 44 17 27 -19 8 43 -53 15 -31 63 -16 -16 -57 -8 33 -16 -37 -34 55 55 -9 -42 -2 13 -24 -16 -30 0 5 21 17 28
5744 28 14 -29 -20 -12 27 37 84 -37 21 50 -52 -29 5 19 -26 -17 17 -13 -10 11 -4 -30 6 38 59 16 -14 9 59 -58 13
5775 13 23 25 2 -50 -44 -7 8 -12 -13 -33 -54 10 -5 2 -11 2 10 -42 -22 3 33 6 31 27 51 -4 24 9 -50 -37 -18 4 -7
5808 -7 14 -48 -6 -3 27 20 -38 -19 11 2 -27 57 41 5 0 -1 41 -26 9 55 -15 41 30 -26 -29 45 40 -11 -25 13 51 11 -50 -58 37
5843 37 -31 -2 0 23 -12 -44 1 2 -40 4 -50 -32 13 19 18 -9 20 29 24 -49 -29 -30 -3 -16 -22 69 21 5 -21 -33 -1 6 -48 29 9
5878 9 7 7 -13 -23 -10 26 4 -42 13 70 44 21 -9 26 -13 16 36 -22 17 10 24 -10 -26 17 1 0 4 -18 28 -4 -37 -25 0
5911 0 -5 10 -46 17 31 44 18 2 21 30 34 -8 41 49 -19 -9 24 -5 32 -7 53 51 14 72 -37 -20 7 45 -3 -3 -58 26 -6
5944 -6 -52 18 11 -11 -11 -44 -39 -8 24 43 -57 -19 9 15 -3 -52 12 32 -17 25 64 42 36 -25 31 8 33 9 16 18 -19 -27 -33 -29 -15
5979 -15 52 -41 19 2 31 11 -29 -21 -5 29 -22 -18 36 32 -18 21 12 13 0 -24 29 -16 -6 21 -23 -22 -34 3 -9 10 11 19 -10 -37
6013 -37 -49 14 -60 -8 -4 34 -16 36 22 0 30 -16 -23 53 -30 -1 -73 -12 -4 36 -5 -29 -81 71 -27 -18 10 -12 -22 43 -19 -11
6045 -11 9 29 -27 57 -8 26 38 -38 -47 11 31 -46 -5 -8 11 27 21 1 -19 -24 30 -102 8 59 36 -40 -3 35 -11 -50 -15
6076 -15 17 50 42 29 19 1 17 35 41 -12 46 -14 -19 -81 11 42 36 -35 9 32 13 16 -28 -29 16 28 6 -6 -77 -61 12 2 -7 99
6110 99 28 -30 -70 46 15 18 -15 65 15 23 -56 33 19 -4 36 45 61 10 49 -13 -41 22 -10 12 -20 22 38 43 -10 -4 -34 2
6142 2 -13 -1 15 19 -1 8 18 -41 21 10 -13 -32 -20 23 -22 -31 -27 -54 -36 30 15 8 -2 18 -35 -37 19 27 15 -4 -39 64 5 -24
6176 -24 59 42 -30 -9 14 30 -7 5 20 2 7 -31 -7 8 0 -48 7 -7 -32 -63 6 0 10 59 -3 -41 3 31 -71 23 -38
6207 -38 4 11 -12 7 -9 8 32 -8 27 9 8 -14 -24 -19 38 3 -17 1 64 -3 -56 -69 -33 31 1 -4 17 -24 67 13 -48 -7
6239 -7 3 25 1 -9 4 30 -30 -28 4 20 28 -58 53 -6 30 55 -7 30 33 34 -23 -79 18 18 -16 -14 5 12 -19 -22 -24 -2 -7 36 -37
6274 -37 -58 -22 30 11 6 33 -7 10 11 -10 -74 -57 23 -1 17 73 23 19 15 -26 40 22 -26 -42 19 -4 19 13 -32 16 30 -19 -29
6307 -29 38 -2 -9 14 -48 -24 -22 40 4 -44 26 -18 2 -1 28 -29 23 -43 -6 7 -12 12 51 -51 11 11 11 16 -9 7 -27 13 -37
6340 -37 3 23 -37 -4 -9 4 43 -43 6 -29 2 41 28 -29 -11 -30 8 -1 -21 3 -32 19 -10 -37 21 47 -1 15 37 44 56 -5
6372 -5 -16 -2 39 -2 49 -32 -14 9 32 64 -39 -18 15 49 -9 -46 -19 -38 -12 10 24 17 -41 -10 -40 31 -7 -29 -8 -52 -20
6403 -20 -1 6 -43 29 20 -85 -6 53 28 -6 -58 -66 -7 23 -7 33 12 -6 -18 -7 -36 46 -36 -4 -11 -41 14 -13 23 -11 30 -4
6435 -4 -16 -8 -51 6 -23 -38 19 -33 53 -37 17 30 44 -42 7 -13 44 -58 -7 -24 13 16 52 -15 12 5 22 4 -8 36 22 30
6467 30 22 -18 -73 -40 51 -25 -18 -3 36 1 -3 -11 22 -11 -28 -24 -31 20 3 24 0 19 14 -14 1 -1 26 -25 7 70 15 21 35 -2 -16
6502 -16 -50 30 -21 -45 3 30 39 57 -20 67 -35 11 6 16 -17 -15 0 -12 13 -8 4 -28 43 -6 -19 -16 56 35 -17 -9 1 56
6534 56 -41 -17 -37 6 25 -34 18 19 -26 -12 -14 6 1 -12 2 10 30 3 5 -13 29 -22 31 27 -54 -3 48 -1 -23 -20 18 -5 -10 -8 5
6569 5 22 9 3 -22 -5 41 -68 -7 12 -8 -6 10 -19 56 -23 -31 8 5 -14 -11 21 -14 80 -42 12 2 11 -15 0 2 -24 12 5 -30
6603 -30 -7 -12 51 -49 -62 -20 1 -17 -31 -4 -8 1 10 -12 37 13 53 -4 -18 60 32 14 23 27 54 -32 -19 -16 0 55 -18 9 25
6636 25 -49 50 10 -38 11 3 22 -45 -17 4 -6 -12 13 -14 -3 15 -22 13 -59 -42 28 6 15 -28 19 0 9 13 32 -8 28 -8 29
6669 29 24 23 -23 -21 -12 21 -37 31 -1 -51 24 -38 -28 12 35 -21 12 -30 12 -33 10 -51 -57 47 4 1 -2 -11 16 -26 -9 36 7 4
6703 4 8 13 -3 -9 4 33 -23 39 -59 32 10 -3 25 -51 -11 -11 39 -39 -25 10 0 -21 -40 -29 64 16 18 -31 127 3 7 -33 -26
6736 -26 8 46 -1 5 -29 16 28 8 -16 4 21 -36 17 40 -3 -28 -1 66 1 1 16 -34 42 -44 -37 28 -46 31 18 -12 32 -13
6768 -13 -19 6 13 20 -10 10 -25 -31 -9 -20 -3 -64 -46 -18 25 15 -11 -12 25 -14 -11 67 32 -23 -3 23 16 -56 10 -12 13 26 52 -6
6802 -6 -26 5 29 -2 3 1 15 -14 -16 -24 -35 -20 -43 13 5 17 -50 -19 -20 -45 -7 -24 -40 7 -11 -9 -51 -32 21 20 -2 -18 19 16 -5
6837 -5 -48 4 -8 33 -2 35 -3 6 3 -26 2 -6 4 -18 41 31 39 19 11 -13 -20 8 -6 44 22 -26 19 14 -11 -26 3 42 28 -48
6871 -48 -20 -9 -28 26 53 12 42 16 -19 -13 -11 12 10 26 -5 6 14 -24 35 70 42 -3 -57 4 -15 23 -23 -18 -28 7 41 -16 -8
6904 -8 24 27 1 -7 -18 25 -20 5 -18 11 -33 -17 -11 17 -2 33 -29 1 -27 -26 14 -20 -43 1 17 -20 3 -6 31 -26 -51 13 -5
6937 -5 -17 -6 -15 69 -28 35 -54 -2 27 -12 -44 17 -1 15 6 16 27 -3 16 1 30 15 37 33 -25 30 -12 8 -15 1 -12 11
6969 11 29 -9 -4 -9 19 -3 53 49 -10 3 40 40 -3 -36 13 14 -11 24 24 43 -49 -62 2 -13 -17 -31 11 -52 38 -9 -56 -20 -20 -26 -69
7004 -69 2 36 4 32 -70 0 -7 -7 29 -33 -3 39 14 43 9 21 59 -36 6 -24 -28 61 5 13 6 47 26 -34 -5 -9 28 10 24
7037 24 13 -34 23 -5 48 10 25 14 -11 10 16 -2 27 17 -29 4 -11 -42 1 -24 -4 42 -30 72 -8 19 -27 18 -30 -2
7067 -2 38 -17 -30 2 10 -23 -10 -44 -9 12 -43 -27 -24 -15 -7 -40 24 -19 50 30 21 33 -2 -3 -16 -22 -26 -17 9 16 -17 -49 -7 -8 11 14 34
7104 34 -42 -47 -13 20 -25 31 15 12 -44 16 -11 -20 -20 -29 -16 5 11 -5 26 46 -14 40 -18 21 -37 7 -19 2 31 44 12 9 -2 15
7138 15 -58 10 -5 -17 42 -11 42 -33 9 -20 24 27 11 14 1 4 21 -13 26 12 -37 -52 -11 -72 24 -29 4 12 -34 8 -4 19
7170 19 -5 10 -45 43 -16 51 10 3 21 -24 -45 -34 72 -22 -26 52 -58 -27 -37 -19 8 -26 10 -32 -8 3 3 -8 11 23 22
7201 22 -19 35 26 24 -27 18 11 33 18 0 9 45 -24 -38 26 -58 50 -28 10 -6 -29 12 -30 8 -21 -27 -9 39 26 -7 18 -13
7233 -13 -43 -16 -47 -4 -8 -60 -21 -39 8 14 -20 -9 -4 -5 -45 -1 -11 -19 -10 22 -48 18 -26 -44 25 2 0 -6 -43 27 -22 13 -57 -30
7267 -30 -9 -50 11 -13 -22 -6 12 -46 -7 20 -3 12 7 10 33 -30 -56 -41 34 -19 -19 -49 -14 16 13 24 -60 -33 16 42 50 75 14
7300 14 -14 -6 10 -21 2 19 28 6 36 10 -7 -6 -89 30 -14 12 -21 30 4 -42 -1 -10 -19 -5 -1 -50 13 23 -20 -31 -15 -45 -48
7333 -48 -18 56 30 45 19 1 -1 8 -27 -8 -37 2 -7 -2 15 -3 -26 -4 37 7 -29 -18 -8 -53 -7 90 55 -58 -8 -38 -10 -16
7365 -16 19 25 -8 -24 -17 -2 -2 -49 0 3 -60 10 2 11 36 1 8 6 -65 59 21 -23 -5 9 -1 -21 14 -48 -62 -5 35 0 13 -31
7399 -31 31 7 20 -19 -17 7 -3 1 -52 -22 -5 26 -11 6 2 -10 31 8 -44 29 31 -42 33 27 -17 48 30 -2 0 8 -24 24 8 -30
7433 -30 -65 -6 -12 -14 -19 26 -29 -61 -39 -96 3 -32 31 0 18 15 -14 -32 -16 2 -31 80 -23 11 -10 -2 -8 -47 14 -38 48 9
7465 9 4 -9 28 35 41 69 -7 9 1 23 2 38 25 12 29 -5 -28 11 -2 -29 40 5 55 -21 -21 -3 33 -15 17 -4 28 13 -20
7498 -20 5 12 4 23 -22 13 22 -5 58 -18 64 5 24 46 -48 -30 -49 55 -21 -60 0 9 -26 -26 6 2 -6 -6 14 -71 -47 -2 -81 -46
7532 -46 5 -13 47 -77 -16 50 15 9 9 -57 -44 -51 29 -1 -13 53 1 -59 -29 46 45 19 57 50 -21 -24 -25 14 8 43 33 10 -11 -38
7566 -38 5 6 -4 3 -57 -75 -11 16 14 -26 -10 23 -22 -18 3 -28 17 -19 2 19 -8 77 -2 37 1 -12 52 31 -36 -22 17 26 15
7599 15 -29 53 30 7 0 -18 28 -32 4 30 11 25 -35 -20 11 6 -22 -61 -41 0 -12 -90 -71 12 -4 -9 14 -58 -30 -43 -8 -85
7631 -85 29 26 -15 7 -9 -42 -6 -36 -52 19 21 1 -43 11 -13 -51 -32 31 -66 -39 14 28 18 15 -35 -9 -14 18 6 -18 -13 -5 -35
7664 -35 16 -5 13 22 -18 -24 -13 23 21 14 3 -22 1 14 41 -17 40 -3 -1 28 -15 -3 -21 -15 -50 -37 -19 -19 -6 4 -51 -27 16 -20
7698 -20 -31 47 4 -27 -10 1 -15 6 12 14 -13 4 24 27 71 -17 39 31 -23 32 84 24 32 -1 -9 17 -18 14 86 7 -9 -2 -38 -56
7732 -56 -10 2 20 -33 -38 -15 17 7 10 20 28 -7 6 0 21 -9 -23 -13 -14 21 27 24 32 -14 40 -16 0 10 -29 15 -78 49 19 -23
7766 -23 -28 12 -5 -40 -17 -11 -11 -12 -24 -9 20 60 64 -14 -25 -1 -20 -47 15 -45 -10 -16 -17 1 46 -9 -16 1 42 64 -1 -3 -25 17 2
7801 2 -13 -10 -60 16 21 -17 41 1 -79 -40 -3 10 46 -28 6 4 -31 28 0 -20 0 6 -20 23 56 -24 -4 -15 -17 -39 42 -8 17
7834 17 29 -21 -15 -52 -14 -19 37 11 -20 21 25 21 -14 -10 7 -43 -9 19 26 -12 -19 2 -69 -5 23 -28 -36 -40 38 12 -34 -6 -19 13 0
7869 0 -81 -5 46 18 -5 47 -57 26 3 22 28 24 -20 23 -6 -23 46 9 -14 -8 -26 45 12 13 3 8 15 31 21 -26 -48 8 -21
7902 -21 -14 -3 -14 39 1 -7 -5 30 -6 59 -2 -3 6 -19 14 10 6 -2 2 -26 13 -36 -6 9 -18 -7 -3 18 -22 9 29 18 -16 5 43
7937 43 -29 -49 -13 14 33 27 2 -57 18 -62 -1 53 47 -30 -24 -52 8 -1 1 8 -17 -4 -26 -38 83 31 -1 46 26 -3 58 24 44
7970 44 17 -15 1 -33 28 -23 -14 34 -34 -22 -9 27 -29 4 -35 1 -23 -19 -7 -13 23 -11 -14 6 -3 30 37 -1 -22 7 -2 24 -47 -21
8004 -21 -14 34 2 -8 38 -52 -3 36 13 -4 -48 17 76 37 3 -11 -19 -21 21 -3 -55 40 -2 -16 -12 30 -36 28 45 -17 -5 0 -31
8037 -31 -17 -8 59 54 45 -8 23 19 1 4 37 -19 -16 37 31 -3 18 19 24 49 -23 42 -49 -1 49 6 -35 -15 -9 11 -44 -3 -18 5 -35
8072 -35 -20 36 -29 36 4 -27 10 -6 69 -52 0 -21 -10 -19 5 -6 -42 51 24 -19 -20 -20 -22 41 -13 -46 8 -6 -43 23 -12 -35
8104 -35 -13 6 36 -91 28 -18 20 7 5 -41 22 -39 -51 -32 1 41 -3 20 -27 -37 15 -9 38 -12 19 22 22 11 19 -33 -2
8135 -2 10 16 12 -4 38 28 19 -2 8 61 -12 28 -45 -19 -19 -61 -29 11 39 -59 -52 -33 -13 34 -16 49 27 -14 13 0 -19 -4 -20
8168 -20 -27 12 5 -44 -36 18 1 29 -25 -25 17 -10 4 -22 29 -74 -26 -13 12 -4 17 -22 -8
8191h
##END NTUPLES=NMR FID
##END=
