##TITLE=1H_LY-DMAA2.27
 CDCl3
 8 sc, 
 5.04.2022
##JCAMPDX= 6.0         $$ Bruker NMR JCAMP-DX V2.0
##DATA TYPE= NMR FID
##DATA CLASS= NTUPLES
##ORIGIN= UXNMR, Bruker Analytische Messtechnik GmbH
##OWNER= root
$$ XWIN-NMR		Version 3.5
$$ Tue Apr  5 15:59:12 2022 Russian Standard Time (UT+4h)  she@DPX200
##.OBSERVE FREQUENCY= 200.131346
##.OBSERVE NUCLEUS= ^1H
##.DELAY= (6, 6)
##.ACQUISITION MODE= SIMULTANEOUS
##.ACQUISITION SCHEME= undefined
##.AVERAGES= 8
##.DIGITISER RES= 18
##SPECTROMETER/DATA SYSTEM= spect
##.PULSE SEQUENCE= zg30
##.SOLVENT NAME= CDCl3
##.SHIFT REFERENCE= (INTERNAL, CDCl3, 0, 15.7039)
##AUDIT TRAIL= $$ (NUMBER, WHEN, WHO, WHERE, WHAT)
$$ ##TITLE= Audit trail, XWIN-NMR		Version 3.5
$$ ##JCAMPDX= 5.01
$$ ##ORIGIN= Bruker BioSpin GmbH
$$ ##OWNER= she
$$ F:/spectra/data/she/nmr/H-F/1/audita.txt
$$ ##AUDIT TRAIL=  $$ (NUMBER, WHEN, WHO, WHERE, WHAT)
(   1,<2022-04-05 15:57:48.53 +0400>,<she>,<DPX200>,
      <created by zg, POWCHK disabled, PULCHK disabled
       configuration hash MD5:
       00 E9 B6 7A A2 85 ED C7 34 08 36 98 17 FE 4E 26
       data hash MD5: 16K
       7B FC 6B D2 C4 84 49 C1 F4 46 18 1D C0 82 7B 5D>)
$$ ##END=
$$ 
$$ hash MD5
$$ 5B FE 54 D2 0B BE C5 F8 C1 72 17 AC 10 9F 7C 9B
##$RELAX= 
##$RELAX= 
##$RELAX= 
##$RELAX= 
##$RELAX= 
##$RELAX= 
$$ Bruker specific parameters
$$ --------------------------
##$DU= <F:/spectra>
##$EXPNO= 1
##$NAME= <H-F>
##$PROCNO= 1
##$TYPE= <nmr>
##$USER= <she>
##$AMP= (0..31)
100 100 100 100 100 100 100 100 100 100 100 100 100 100 100 100 100 100 
100 100 100 100 100 100 100 100 100 100 100 100 100 100 
##$AQSEQ= 0
##$AQ_mod= 1
##$AUNM= <au_zg>
##$AUTOPOS= <>
##$BF1= 200.13
##$BF2= 200.13
##$BF3= 200.13
##$BF4= 200.13
##$BF5= 200.13
##$BF6= 200.13
##$BF7= 200.13
##$BF8= 200.13
##$BYTORDA= 1
##$CFDGTYP= 0
##$CFRGTYP= 5
##$CHEMSTR= <none>
##$CNST= (0..31)
1 1 145 1 1 1 1 1 1 1 1 1 1 1 1 1 1 1 1 1 1 1 1 1 1 1 1 1 1 1 1 1 
##$CPDPRG= <>
##$CPDPRG1= <>
##$CPDPRG2= <>
##$CPDPRG3= <>
##$CPDPRG4= <mlev>
##$CPDPRG5= <mlev>
##$CPDPRG6= <mlev>
##$CPDPRG7= <mlev>
##$CPDPRG8= <mlev>
##$CPDPRGB= <>
##$CPDPRGT= <>
##$D= (0..31)
0 1.2 0 0 0 0 0 0 0 0.06 0 0.03 0 0 0 0 0.0002 0 0 0 0 0 0 0 0 0 0 0 0 
0 0 0 
##$DATE= 1649159867
##$DBL= (0..7)
120 120 120 120 120 120 120 120 
##$DBP= (0..7)
150 150 150 150 150 150 150 150 
##$DBP07= 0
##$DBPNAM0= <>
##$DBPNAM1= <>
##$DBPNAM2= <>
##$DBPNAM3= <>
##$DBPNAM4= <>
##$DBPNAM5= <>
##$DBPNAM6= <>
##$DBPNAM7= <>
##$DBPOAL= (0..7)
0.5 0.5 0.5 0.5 0.5 0.5 0.5 0.5 
##$DBPOFFS= (0..7)
0 0 0 0 0 0 0 0 
##$DE= 6
##$DECBNUC= <off>
##$DECIM= 32
##$DECNUC= <off>
##$DECSTAT= 4
##$DIGMOD= 1
##$DIGTYP= 9
##$DL= (0..7)
0 120 120 120 120 120 120 120 
##$DP= (0..7)
150 150 150 150 150 150 150 150 
##$DP07= 0
##$DPNAME0= <>
##$DPNAME1= <>
##$DPNAME2= <>
##$DPNAME3= <>
##$DPNAME4= <>
##$DPNAME5= <>
##$DPNAME6= <>
##$DPNAME7= <>
##$DPOAL= (0..7)
0.5 0.5 0.5 0.5 0.5 0.5 0.5 0.5 
##$DPOFFS= (0..7)
0 0 0 0 0 0 0 0 
##$DQDMODE= 0
##$DR= 18
##$DS= 0
##$DSLIST= <SSSSSSSSSSSSSSS>
$$ [...]
##$SUBNAM2= <"">
##$SUBNAM3= <"">
##$SUBNAM4= <"">
##$SUBNAM5= <"">
##$SUBNAM6= <"">
##$SUBNAM7= <"">
##$SUBNAM8= <"">
##$SUBNAM9= <"">
##$SW= 18.0517287032376
##$SWIBOX= (0..15)
0 0 2 0 0 0 0 0 0 0 0 0 0 0 0 0 
##$SW_h= 3612.71676300578
##$TD= 16384
##$TD0= 1
##$TE= 0
##$TE2= 300
##$TE3= 300
##$TEG= 300
##$TL= (0..7)
0 120 120 120 120 120 120 120 
##$TP= (0..7)
150 150 150 150 150 150 150 150 
##$TP07= 0
##$TPNAME0= <>
##$TPNAME1= <>
##$TPNAME2= <>
##$TPNAME3= <>
##$TPNAME4= <>
##$TPNAME5= <>
##$TPNAME6= <>
##$TPNAME7= <>
##$TPOAL= (0..7)
0.5 0.5 0.5 0.5 0.5 0.5 0.5 0.5 
##$TPOFFS= (0..7)
0 0 0 0 0 0 0 0 
##$TUNHIN= 0
##$TUNHOUT= 0
##$TUNXOUT= 0
##$USERA1= <user>
##$USERA2= <user>
##$USERA3= <user>
##$USERA4= <user>
##$USERA5= <user>
##$V9= 5
##$VALIST= <valist>
##$VCLIST= <CCCCCCCCCCCCCCC>
##$VD= 0
##$VDLIST= <DDDDDDDDDDDDDDD>
##$VPLIST= <PPPPPPPPPPPPPPP>
##$VTLIST= <TTTTTTTTTTTTTTT>
##$WBST= 1024
##$WBSW= 4
##$XGAIN= (0..3)
0 0 0 0 
##$XL= 0
##$YL= 0
##$YMAX_a= 673395
##$YMIN_a= -595525
##$ZGOPTNS= <>
##$ZL1= 120
##$ZL2= 120
##$ZL3= 120
##$ZL4= 120
##$ABSF1= 10
##$ABSF2= 0
##$ABSG= 5
##$ABSL= 3
##$ALPHA= 0
##$AQORDER= 0
##$ASSFAC= 0
##$ASSFACI= 0
##$ASSFACX= 0
##$ASSWID= 0
##$AUNMP= <proc_1d>
##$AZFE= 0.1
##$AZFW= 0.1
##$BCFW= 1
##$BC_mod= 2
##$BYTORDP= 1
##$COROFFS= 0
##$CY= 11.3945322036743
##$DATMOD= 1
##$DC= 2
##$DFILT= <>
##$DTYPP= 0
##$F1P= 2.36226072786647
##$F2P= -0.459571619588291
##$FCOR= 0.5
##$FTSIZE= 0
##$FT_mod= 4
##$GAMMA= 1
##$GB= 0.15
##$INTBC= 1
##$INTSCL= 1
##$ISEN= 128
##$LB= 0.24
##$LEV0= 0
##$LPBIN= 0
##$MAXI= 10000
##$MC2= 0
##$MEAN= 0
##$ME_mod= 0
##$MI= 1.114404
##$NCOEF= 0
##$NC_proc= 0
##$NLEV= 6
##$NOISF1= 3.799351
##$NOISF2= 2.8
##$NSP= 1
##$NTH_PI= 0
##$NZP= 0
##$OFFSET= 15.70392
##$PC= 1
##$PHC0= -17836.71
##$PHC1= 21.00078
##$PH_mod= 1
##$PKNL= yes
##$PPARMOD= 0
##$PSCAL= 0
##$PSIGN= 0
##$REVERSE= no
##$SF= 200.130013532006
##$SI= 16384
##$SIGF1= 3
##$SIGF2= 2
##$SINO= 400
##$SIOLD= 16384
##$SREGLST= <1H.CDCl3>
##$SSB= 0
##$STSI= 0
##$STSR= 0
##$SW_p= 3612.71676300578
##$SYMM= 0
##$S_DEV= 0
##$TDeff= 0
##$TDoff= 0
##$TI= <>
##$TILT= no
##$TM1= 0
##$TM2= 0
##$TOPLEV= 0
##$USERP1= <user>
##$USERP2= <user>
##$USERP3= <user>
##$USERP4= <user>
##$USERP5= <user>
##$WDW= 1
##$XDIM= 8192
##$YMAX_p= 0
##$YMIN_p= 0
$$ End of Bruker specific parameters
$$ ---------------------------------
##NTUPLES= NMR FID
##VAR_NAME=  TIME,          FID/REAL,        FID/IMAG
##SYMBOL=    X,             R,               I
##VAR_TYPE=  INDEPENDENT,   DEPENDENT,       DEPENDENT
##VAR_FORM=  AFFN,          ASDF,            ASDF
##VAR_DIM=   8192,          8192,            8192
##UNITS=     SECONDS,       ARBITRARY UNITS, ARBITRARY UNITS
##FACTOR=    0.0002768,     1,               1
##FIRST=     0,             0,               0
##LAST=      2.2672688,     0,               0
##MIN=       0,             -595525,         0
##MAX=       2.2672688,     673395,          0
$$ Real data points
##PAGE= N=1
##DATA TABLE= (X++(R..R)), XYDATA
$$ [...]
1857e33R11Q2n43k05L01K36k0j45l72J13P15p0r94l5R99J76j067k21R22K62o46
$$ -533 378 460 -83 -288 13 249 229 84 -288 -175 540 470 -524 -559 440 616 -451 -672 250 512 -134
1878a34l63L63K51J14k30m12R4P56R6r95k21J245J98j223l00J158L53r28l35N29
$$ -134 -497 -134 117 231 1 -411 -317 439 535 -460 -681 564 762 -461 -761 397 750 -178 -513 16
1898A6L68j91k94j97J04O19q6r79j1J227J01j304k11J317K40j198j56Q47K98o17
$$ 16 384 193 -101 -298 -194 425 339 -640 -651 576 677 -627 -838 479 719 -479 -635 212 510 -107
1918a07j16J60J40K72o4p01J9R69Q4j158j02J228J06j311NJ026kq39RN55j37j34
$$ -107 -223 -63 77 349 285 -416 -397 572 656 -502 -604 624 730 -581 -576 450 448 -391 -382 173 36 -98
1940i8R7j90k6N09Op92N9R70r6j079K63J105l71r16M25P77n12n33N02J93l48n5
$$ -98 -1 -191 -217 292 298 -494 -435 535 439 -640 -377 728 357 -559 -134 643 131 -402 100 293 -55 -110
1962a10L46l60j13N43j65o73L59P82n96q14Q44O66r56n43R85M86r45l12Q27J34
$$ -110 236 -124 -237 306 141 -532 -173 609 13 -801 43 709 -247 -790 195 681 -264 -576 251 385
1982C85n24L8K46k44J77K59n56l24Q91L96j205l67J366L38j482k99J386K25j149
$$ 385 -139 -101 145 -99 78 337 -219 -543 348 744 -461 -828 538 876 -606 -905 481 706 -443
2001d43k17Q36J23l55k1j49m4O89M0j062p7J474Q7j701p8J756R9j605j63J349
$$ -443 -660 176 299 -56 -77 -226 -270 419 459 -603 -680 794 881 -820 -898 858 957 -648 -811 538
2021E38J26r36j62M17J67J52j75p36J96J164j64j578J96J821k12j830J58J695
$$ 538 664 -272 -434 -17 150 302 127 -609 -413 751 587 -991 -795 1026 814 -1016 -858 837
2039H37j46j346J28R35Ml94j30j39J70P22k22j246L55J519m16j678L91J660l96
$$ 837 691 -655 -527 408 412 18 -112 -251 -81 641 419 -827 -472 1047 631 -1047 -656 1004 608
2058F08j476L55J155l23p74K50K31j32L07L9p72J60J064k54j307L85J398n13j195
$$ 608 -868 -513 642 319 -455 -205 26 -106 201 240 -532 -372 692 438 -869 -484 914 401 -794
2077g94N01J082n89o78N86K56n14J12M00n39l06Q87J50j062j8J108j92j002M09
$$ -794 -293 789 200 -478 108 364 -150 -38 362 -177 -483 404 554 -508 -526 582 390 -612 -203
2096b03P17n60m48P29j2p32L37Q84p08q06R67P26j021o01R60M13q09j28N09j75
$$ -203 514 -46 -494 235 223 -509 -172 712 4 -802 165 891 -130 -731 229 642 -167 -295 214 39
2116C9j17M07k80o56N83R45r85j130J237J141j262j157J208J043j039p22N69N42
$$ 39 -78 329 49 -607 -24 921 -64 -1194 43 1184 -78 -1235 -27 1016 -23 -745 -176 366
2134C66j67k9m24k93R05P15j360r91J632J172j745j375J731J351j429j304J082
$$ 366 199 170 -254 -547 358 1073 -287 -1278 354 1526 -219 -1594 137 1488 59 -1245 -163
2151a63R67m06p72k35L76P84J49j389n21J868Q06k032j214K201J379k046j394
$$ -163 804 398 -374 -609 -233 551 700 -689 -1210 658 1464 -568 -1782 419 1798 -248 -1642
2168a642J594J436j105j164L78Q94L47m48j104K2J753L05k105p58K296J079k308
$$ -1642 -48 1388 283 -881 -503 391 738 290 -814 -792 961 1266 -839 -1597 699 1778 -530
2185e30j279K050J362j670j271J059J040l05p22m35L92J169N9j827l57K100P48
$$ -530 -1809 241 1603 -67 -1338 -279 761 456 -266 -701 -309 860 919 -908 -1265 835 1583
2202A583k293r14K213J081j961j033J446Q62p47p43J05M15N17k7j201k02J657
$$ 1583 -710 -1624 589 1670 -291 -1324 122 984 237 -506 -401 14 531 504 -697 -899 758
2219G58L67j886o85K021P29j860o81J537O65j103m50N78J37J26J04o46l46J061
$$ 758 1125 -761 -1446 575 1304 -556 -1237 300 965 -138 -588 -10 127 253 357 -289 -635 426
2237D26O28j469o12J472P11j533o59J285N19r66k37N10j19rM02l31q02P91R53
$$ 426 1054 -415 -1027 445 1156 -377 -1036 249 768 -198 -435 75 -44 -53 349 18 -784 7 960
2256I60j041j085J178J109j151q63Q57O83n44k60K31k36J29O54n49r37P49J278
$$ 960 -81 -1166 12 1121 -30 -893 -36 647 103 -157 74 -162 -33 621 72 -865 -116 1162
2274A162r47j506R73J533r20j406P52J034l37o52l9R4M19N42q32r97J074J489
$$ 1162 215 -1291 -318 1215 295 -1111 -359 675 338 -314 -353 -259 160 702 -130 -1127 -53 1436
2292A436j187j772J117J966r22j969P14J650k68j249k32O92O63k1j078o96J309
$$ 1436 249 -1523 -406 1560 638 -1331 -617 1033 765 -484 -716 -24 639 618 -460 -1156 153
2309A53J328j508j847J553K113j343k231J011K177o28j748L6J309M74o05j063
$$ 153 1481 -27 -1874 -321 1792 449 -1782 -771 1406 778 -970 -934 375 849 244 -819
2325h19N1J351Q07j719j429J902J859j705k221J490K214j026k155N53J700R2j236
$$ -819 -768 583 1390 -329 -1758 144 2003 298 -1923 -433 1781 755 -1400 -847 853 945 -291
2342b91o41M38J290J40j636q78J898J409j828j890J790K120j424k109R23J894
$$ -291 -932 -494 796 936 -700 -1578 320 1729 -99 -1989 -199 1921 497 -1612 -689 1205
2358A205l65j482j81Q48Q00k09j245m29J583R63j702j512J712J791j637j777J172
$$ 1205 840 -642 -823 25 825 616 -629 -1058 525 1488 -214 -1726 -14 1777 140 -1637 -465
2375d65J735p65j351K06R82K56l76p41j63J097P19j382j062J410J434j384j539
$$ -465 1270 505 -846 -640 342 598 222 -519 -682 415 1134 -248 -1310 100 1534 150 -1389
2392a389J113J518q14j259M82P50pl28l50k27O67O73q51j125R64J396j018j384
$$ -1389 -276 1242 428 -831 -349 401 394 66 -284 -511 156 829 -22 -1147 -183 1213 195 -1189
2410a189P80J411o25j026K70O29N2j12k94l83M83Q77o09j308O86J506o01j606
$$ -1189 -409 1002 377 -649 -379 250 302 190 -104 -487 -4 873 264 -1044 -358 1148 547 -1059
2428a059M59J448k32j158n3P14J86n8m62m69N43J096o78j526O63J820n23j889
$$ -1059 -600 848 616 -542 -595 119 305 247 -215 -684 -141 955 277 -1249 -586 1234 711 -1178
2446a178K80J859k9j495k12R33N43l97p14l27Q75J013r18j599Q08J984n47k275
$$ -1178 -898 961 932 -563 -775 158 701 304 -410 -737 138 1151 233 -1366 -558 1426 879 -1396
2464a396L38K165K4j946l81J475P16q03r69N2J115P67j186j427J068J983q96k357
$$ -1396 -1058 1107 1131 -815 -1196 279 995 192 -777 -725 390 1157 -29 -1456 -388 1595 699 -1658
2482a658O58K456j61k360k03J948N69j311r76O16J126K34j290j062J335J716j224
$$ -1658 -1000 1456 1295 -1065 -1268 680 1249 -62 -1038 -422 704 938 -352 -1414 -79 1637 413
2499D13k193J025K410o00k464J70K185K79j663p38J084J032l15j257m92J445J158
$$ 413 -1780 -755 1655 1055 -1409 -1239 946 1225 -438 -1176 -92 940 625 -632 -1124 321 1479
2516A479j282j793J096K138p47k358M12K270m7j871m30J346P02o90r00r0J124
$$ 1479 197 -1596 -500 1638 891 -1467 -1055 1215 1168 -703 -1133 213 915 225 -675 -765 359
2533C59P85j177j381J058J822q47k089O24K096l52j740j40J416M85q84o99K12
$$ 359 1144 -33 -1414 -356 1466 619 -1470 -846 1250 898 -842 -982 434 919 35 -664 -452
2550d52R01L76r19r92Q18J523o95j769M53J760j43j686o5J288K95p68m98J49O67
$$ -452 449 825 -94 -1086 -268 1255 560 -1209 -756 1004 861 -825 -890 398 693 -75 -573 -424 243
2569B43M74o18j080O22J405m30j639K04J692Q9j587k66J211M24o86n60N7O45N07
$$ 243 717 99 -981 -359 1046 616 -1023 -819 873 962 -625 -891 320 744 58 -502 -445 200 707
2588G07n49j084M22J461k65j672j7J767K45j625m46J243P03p78p37J33P41N74
$$ 707 158 -926 -504 957 692 -980 -997 770 1015 -610 -1056 187 890 112 -625 -492 249 823
2606H23o86j128M66J624k04j896j45K034M10j827o90J429R29r54j037K85J072
$$ 823 137 -991 -525 1099 895 -1001 -1146 888 1298 -529 -1219 210 1139 185 -852 -567 505
2623E05L65r67j073P72J674m32k051K7K187M33k163p53J872R63j265j239O67J285
$$ 505 870 -97 -1170 -398 1276 844 -1207 -1180 1007 1440 -723 -1476 396 1359 94 -1145 -478 807
2641H07Q7j244p63R97J476p47j962K74K335R2k340n97K174Q72j584j201J017J358
$$ 807 894 -350 -1113 -116 1360 613 -1349 -1075 1260 1352 -988 -1585 589 1461 -123 -1324 -307 1051
2659A051l74j318m38J169J183r60j702N69K139j40k290k28K195O64j891j018J378
$$ 1051 677 -641 -1079 90 1273 313 -1389 -820 1319 1179 -1111 -1339 856 1520 -371 -1389 -11
2676a1J237p01j330p4J268P26r75j429P39J875m25k078m6K084M72j946p08J466
$$ -11 1226 525 -805 -879 389 1115 140 -1289 -550 1325 900 -1178 -1224 860 1332 -614 -1322 144
2694A44J032r24j144K96J088M18j001r66P03J511l84j794j2J933K88j763o54J397
$$ 144 1176 252 -892 -596 492 910 -91 -1057 -354 1157 773 -1021 -1033 900 1188 -575 -1229 168
2712A68R33j019r62M04R40K55q28q13N58J362k97j648k7J771L32j613o78J343
$$ 168 1101 82 -880 -476 464 719 -109 -922 -364 998 701 -947 -974 797 1129 -484 -1162 181
2730A81Q79r16r38L92Q98K01p67p03M60J199j94j500j71J654M92j578p46J254
$$ 181 1060 144 -794 -402 496 697 -70 -773 -313 886 692 -808 -979 675 1167 -411 -1157 97
2748I7R94r04j038M14R23J48p60p29N39J127p3j498k17J548O66j513r90J297J139
$$ 97 1091 187 -851 -437 486 634 -126 -855 -316 811 738 -760 -977 571 1237 -276 -1266 31 1170
2767A170q64j280M43J123K14r15q36O43J232j68j641k21J775O65j745j085J559
$$ 1170 306 -974 -531 592 806 -109 -945 -302 930 762 -879 -1100 675 1340 -405 -1490 69
2784F9J276j023j494N46J358J22j180o92Q43J247m41j650J4J850N55j921j015
$$ 69 1345 322 -1172 -626 732 854 -326 -1018 -175 1072 631 -1019 -1005 845 1400 -521 -1536
2801a536J745J295j276j566P50J605k45j367m70J124J034o53j579K33J828K82
$$ -1536 209 1504 228 -1338 -588 1017 772 -595 -1065 59 1093 440 -1139 -906 922 1204
2817A204j881q07J854J180j507j507J030J625m46j563j80J315P85q89j319M60
$$ 1204 -677 -1484 370 1550 43 -1464 -434 1191 745 -818 -998 317 1102 213 -1106 -646
2833f46J671Q5j909n75J856R84j563j402J236J486o60j512J05J282N11r28j097
$$ -646 1025 1110 -799 -1374 482 1466 -97 -1499 -263 1223 563 -949 -844 438 949 21 -1076
2850a076O30J463j43j670l67J744P73j593j159J271J417p94j464K21J310L57j030
$$ -1076 -446 1017 874 -796 -1163 581 1354 -239 -1398 -127 1290 496 -968 -747 563 920 -110
2867a10q36O02J241j56j561k22J509P71j511j034J133J382p83j411L03J234K72
$$ -110 -946 -344 897 741 -820 -1042 467 1238 -273 -1307 -174 1208 425 -986 -683 551 823
2884H23r34p49N90J148j78j373l36J500P19j340j098J090J287o62j416L03J234
$$ 823 -111 -860 -270 878 700 -673 -1009 491 1210 -130 -1228 -138 1149 487 -929 -626 608
2901F08J88r98o19N57J100k19j275k66J350O83j254j082J090J305p51j396L16
$$ 608 796 -202 -821 -264 836 617 -658 -924 426 1109 -145 -1227 -137 1168 417 -979 -663
2918f63J327K02j069o77O70J071k41j311l07J470P13j323j149J145J408p49j596
$$ -663 664 866 -203 -880 -210 861 620 -691 -998 472 1185 -138 -1287 -142 1266 517 -1079
2935a079L55J439K30j261p11Q61J064l41j384j13J467O66j385j178J278J485q75
$$ -1079 -724 715 945 -316 -1027 -166 898 557 -827 -940 527 1193 -192 -1370 -92 1393 518
2952E18j665M56J619Qj398n40J078J019o63j313M5J471N38j519j001J299J408
$$ 518 -1147 -691 928 936 -462 -1002 76 1095 432 -881 -836 635 1173 -346 -1347 -48 1360
2969A360j052j622O09J728j02j581l92J179R73q08j280K85J437L82j591q27J439
$$ 1360 308 -1314 -705 1023 921 -660 -1052 127 1100 292 -988 -703 734 1116 -475 -1302 137
2986A37J212j042j638P28J710k10j688k61J402P07r07j203M71J447O7j509o69
$$ 137 1349 307 -1331 -603 1107 897 -791 -1052 350 1057 150 -1053 -582 865 932 -577 -1246
3003a246J463J042j142j427Q05J675m44j570q2J478M78j018r56N92J280j71j394
$$ -1246 217 1259 117 -1310 -505 1170 726 -844 -926 552 1030 12 -944 -352 928 757 -637
3020f37l81J356Q98j210j275R04J449m67j512j1J392M30j091q55P10J170k32j254
$$ -637 -1018 338 1236 26 -1249 -345 1104 637 -875 -886 506 936 -155 -1010 -300 870 638 -616
3038f16l75J356P71j143j137Q13J457m84j477j2J415M43j190p79Q15R72k63j193
$$ -616 -991 365 1136 -7 -1144 -331 1126 642 -835 -847 568 1011 -179 -958 -143 829 566 -627
3056f27k14J194P31j107j148Q48J362n11j424J10J377L79j258o82Q25J020l60
$$ -627 -841 353 1084 -23 -1171 -323 1039 528 -896 -786 591 970 -288 -970 -145 875 515
3073E15j185j39J184O66j101j026Q41J375n22j582J70J466L46j286p32Q55J087
$$ 515 -670 -809 375 1041 -60 -1086 -245 1130 608 -974 -804 662 1008 -278 -1010 -155 932
3090I32m11j260q2J226O55j180j028Q40J443n86j492J33J557K37j354p08J073
$$ 932 521 -739 -821 405 1060 -120 -1148 -308 1135 549 -943 -810 747 984 -370 -1078 -5
3107eJ030n83j269J06J234N04j209r12R20J348o47j513K16J543J83j437o57J201
$$ -5 1025 442 -827 -721 513 1017 -192 -1104 -184 1164 517 -996 -780 763 946 -491 -1148 53
3125E3R41o70j191J60J299L47j291p73J063J244p34j499L50J566P8j477n11J257
$$ 53 994 324 -867 -707 592 939 -352 -1125 -62 1182 448 -1051 -701 865 943 -534 -1045 212
3143B12Q50q87j081L43J278J29j234p24J183J125r39j396M86J542m4j446m47J345
$$ 212 1062 175 -906 -563 715 844 -390 -1114 69 1194 255 -1141 -655 887 843 -603 -1050 295
3161B95P87r78j083N39J218k0j268m39J164Q75q00j345N64J383j07j397l00J269
$$ 295 1082 104 -979 -440 778 758 -510 -949 215 1090 290 -1055 -491 892 785 -612 -912 357
3179C57O70j032r09N42J187j41j207l75J108Q38r61j171O29J405k06j475j91J329
$$ 357 1027 -5 -914 -372 815 674 -533 -908 200 1038 77 -1094 -465 940 734 -741 -932 397
3197C97N81r88r46O60J110k02j120l37J125O62q78j023N48J254j95j344k21J297
$$ 397 978 -10 -956 -296 814 612 -508 -845 280 942 64 -959 -411 843 648 -696 -917 380
3215C80N90j128q02O51J125k76j147j57J022O36r29r45O07J285k84j388o1J353
$$ 380 970 -158 -960 -309 816 540 -607 -764 258 894 -35 -980 -373 912 628 -760 -821 532
3233E32L85j053q25P80J045l58j177p5J140N27r37r29O27J229k93j380j07J304
$$ 532 917 -136 -961 -181 864 506 -671 -746 394 921 -16 -945 -318 911 618 -762 -869 435
3251D35N41j203p94Q79J015l88j187k7J177M32j014q36Q19J100m18j306M4J273
$$ 435 976 -227 -1021 -142 873 485 -702 -729 448 880 -134 -970 -151 949 531 -775 -731 542
3269E42M13j168p95R54R85n62j214J79J183L13j021p54Q05J027m59j261R6J379
$$ 542 955 -213 -1008 -54 931 369 -845 -666 517 830 -191 -945 -140 887 428 -833 -737 642
3287F42K38j210o44J014R51o79j136K52J170K99j121o79Q52R96n61j223J55J368
$$ 642 880 -330 -974 40 991 312 -824 -572 598 897 -224 -903 -51 945 384 -839 -684 684
3305F84J70j250n67J047R07p41j122K99J205R5j065n92R86Q42o31j109K40J286
$$ 684 854 -396 -963 84 991 250 -872 -573 632 727 -338 -930 56 898 267 -842 -602 684
3323F84J53j249n12J075Q21p73j034L84J114K3j095m22R24P93o67j104L55J242
$$ 684 837 -412 -924 151 972 199 -835 -451 663 686 -409 -831 93 886 219 -885 -530 712
3341G12K7j228m06J103P37p81j059M91J090j3j053m76R96P07o97r93L88J211n8
$$ 712 739 -489 -895 208 945 164 -895 -404 686 673 -380 -856 140 847 150 -843 -455 756 698
3360F98j211l75J112P37r21r12M97J048n8j141k57R94O29p78r03M04J169n3j276
$$ 698 -513 -888 224 961 40 -872 -375 673 615 -526 -783 211 840 62 -841 -437 732 679 -597
3379e97j97J093O22r21q77N71J066k69j004k26R85O22q31q42N15J059j81j173
$$ -597 -794 299 921 0 -877 -306 760 491 -513 -739 246 868 37 -805 -290 769 588 -585
3397e85k04J135N52r45q50O59R64k20j062j46J028N26q90q57O36J019k21j114
$$ -585 -789 346 898 -47 -897 -238 726 506 -556 -702 326 852 -38 -895 -259 760 539 -575
3415e75j46J076N14r81p88P42R86l77j098LR76M64r36p00O80R30l18j041q5J098
$$ -575 -721 355 869 -112 -900 -158 828 451 -647 -644 332 796 -140 -840 -160 770 452 -589 -674 424
3435D24L46r33p25Q05R00m66r98J6J052L26r38o42P10R05l97j021l0J119L61r79
$$ 424 770 -163 -888 -83 817 351 -647 -631 421 747 -191 -833 -123 782 385 -636 -666 453 814 -165
3455a65o47P26Q95m46j079J30J074K45r25o68P26R43m23j084P5J034L25r52n77
$$ -165 -812 -86 809 363 -716 -586 488 733 -192 -860 -134 809 386 -698 -623 411 736 -216 -793
3474g93P29Q22m39r91J81J010J89r54n12P69P39n26q79J26J021K06r46m71P57
$$ -793 -64 758 319 -672 -491 519 708 -246 -758 11 750 224 -655 -529 492 698 -248 -719 38
3493C8P71o27q78K52R25J47r02n65R12O58m92r26J74J041R9r27m43Q10P40o18
$$ 38 809 182 -696 -444 481 628 -274 -839 73 731 239 -687 -513 528 627 -300 -743 67 807 189
3513A89r02K78J005R5r71m47Q87N91n25q76K60R39M0q74m27P95O56n43q77K93
$$ 189 -713 -435 570 665 -306 -753 134 725 200 -676 -416 523 563 -311 -738 57 713 170 -707 -414
3533d14R38m8q50k68P98N99o06q18K68R45J5r76k78Q45N95o33p82M01Q30pr70
$$ -414 524 476 -374 -642 156 755 149 -669 -401 544 559 -417 -695 150 745 112 -670 -269 561 554 -416
3554d16k68Q42N60o94p74M48R04r8r34k37Q39N38p15p20M37R45j70q99j56P87
$$ -416 -684 158 718 24 -750 -302 602 504 -430 -667 172 710 -5 -725 -288 657 487 -412 -568 219
3574B19N10o63p73N22Q03j43r48j59R31M06o99p15M79Q21k34q50j10Q55L94o95
$$ 219 729 66 -707 -185 618 475 -473 -632 299 705 6 -709 -230 591 357 -493 -603 252 646 -49
3594d9o01M64Q03k49q43r2Q92L52p27o27N31P95k82q58o2R14L28p27o16N05Q10
$$ -49 -650 -186 617 368 -475 -567 325 677 -50 -677 -146 649 367 -491 -553 361 689 -38 -654 -149 661
3615F61k83q45l7Q13L42p58n82N76P35l14q22j0Q59K83p95n26N84P18k85q22j
$$ 661 378 -467 -504 309 651 -107 -689 -113 622 308 -514 -524 335 618 -177 -703 -119 599 314 -508 -509
3636e09R26K29p89m50N79O49l87p66M6Q38K07o96m61N34O60l64p68L9R21J12p14
$$ -509 417 646 -143 -593 -14 635 248 -518 -472 366 573 -123 -584 -50 610 246 -522 -483 438 550 -164
3657a64m83N84O45l57p72P3Q69K20p94m91O57O65l66q23J30Q34J60q36l81O87
$$ -164 -647 -63 582 225 -547 -474 395 615 -179 -670 -13 652 286 -537 -407 427 587 -249 -630 57
3677E7N41m00p28J38Q02R3p45l60N77O50m72p27J49Q12Q2p48l21O36N80n17o33
$$ 57 598 198 -530 -392 410 503 -242 -602 -25 625 153 -574 -425 387 469 -279 -600 36 616 99 -534
3698e34J85P80P4p48l34P08M44m44p60L22P66O0q36k66O79M91m94o44K11Q14J3
$$ -534 -349 431 505 -243 -577 131 575 131 -629 -307 459 519 -317 -583 96 587 93 -551 -340 474 487
3719D87q08k69P14N12n18o47K33P78m2p79k37P34M04n34o33L64P39o4p99j91P15
$$ 487 -321 -590 124 636 118 -529 -296 482 440 -339 -576 158 562 28 -605 -241 498 434 -365 -556 159
3740A59M65o27n44L22P14j12p45j68P11L61n56n73M28O55j64p00r2O80L57n71
$$ 159 624 -3 -547 -225 489 377 -368 -536 175 536 -20 -593 -165 490 326 -374 -466 214 571 0
3760@n75L71P24j37q33k5P27L44o44m68L52O53j70p61KO35L78o25m98L32P17k10
$$ 0 -575 -204 520 383 -450 -475 252 596 -48 -516 -164 489 319 -442 -440 195 573 -52 -550 -218 499 289
3782B89p33K3O27L41o26n21N11N84j70o88k1O62K61o04m23L65O39k16p09LO77
$$ 289 -444 -421 206 547 -79 -600 -89 495 325 -363 -384 278 539 -65 -488 -123 516 300 -409 -406 271
3803B71J97n70m35M99N04j85p50P6O78J94o07m09M72N58k33o94O5O61K10o25l70
$$ 271 468 -102 -537 -38 466 281 -469 -393 285 479 -128 -537 -65 493 260 -434 -369 292 502 -123 -493
3824d93M75M99k30o59J06O07J23n39l94M41O00l66o61J22P21J52o73m14O04M63
$$ -493 -18 481 251 -408 -302 305 428 -111 -505 -64 536 170 -491 -369 352 504 -169 -583 21 484
3844D84l55o21J34O59J31n98l22N20M71l24o52J72O50P7o11l04N11M84l94n92
$$ 484 129 -492 -358 301 432 -166 -488 32 503 179 -473 -301 349 426 -185 -489 22 506 112 -480
3864d80J73O25M0n90k45N11M00l24o18K66O40k6o84j98N74M25m19n39K73N57N4
$$ -480 -307 318 358 -232 -477 34 434 110 -508 -242 398 372 -312 -510 64 489 70 -469 -196 361 415
3885D15o92j68N52M34m51n90K05P43p0o49j69N60L59l98n81K25O63o3o16j47N61
$$ 415 -277 -445 107 541 90 -500 -295 448 378 -271 -440 120 479 81 -500 -275 388 325 -291 -438 123
3906A23L67m92m94L43N47r6o09j39N95L15m49m29K55N56j23n65m9N53J93l81m21
$$ 123 490 -2 -496 -153 394 298 -311 -450 145 460 11 -418 -163 393 270 -295 -344 209 402 21 -400
3927d00K51N31j37n65k0N24K06l53m94L07N55j77n57j6N37J90m18m22L74M92j77
$$ -400 -149 382 245 -320 -340 184 390 37 -457 -150 405 228 -329 -345 192 382 -36 -458 -84 408 231
3948B31n72k9O05J63m24l33K67M94j77n50L8M80J85m23l65K99M74j65n72jN78
$$ 231 -341 -370 235 398 -26 -359 -92 402 225 -325 -287 193 378 -45 -410 -111 363 198 -374 -375 203
3969B03K42n21l56L86L76j21n96J21N17J31m70l23L83M46k00n71L1N79J45n02
$$ 203 445 -76 -432 -46 330 209 -387 -266 251 382 -88 -411 -28 418 218 -353 -322 257 402 -100
3989a00l22L99M04k12n41P9N57N6m18l41L77M89k66n48O3N55J41n34k47M19L88
$$ -100 -422 -23 381 169 -372 -293 264 320 -98 -439 -62 427 161 -387 -324 231 372 -162 -409 10 398
4010C98k52m97J15M93R1m91k47M27L94l19n01J56M71R0n08k70N09L53k90n30J89
$$ 398 146 -351 -236 257 348 -143 -390 37 431 112 -389 -233 238 328 -180 -450 59 412 122 -408 -219
4031b19N32O3n64k22M59L65l30m06J02N49M1n26j95M07L64l97m08K44N04j30m57
$$ -219 313 376 -188 -410 49 414 84 -322 -220 329 370 -156 -351 56 420 23 -385 -141 363 233 -224
4052b24j07M25K69l21m16J79N00l5m87j42L94L17l65l40K05M81r6m08j34M14L09
$$ -224 -331 94 363 42 -374 -195 305 270 -217 -359 35 352 -13 -353 -148 333 237 -171 -305 109 418
4073D18l33m33J98M51j4m90j31M32K62l47m09K65M70j67l78o7L91K31l90l16K74
$$ 418 85 -348 -150 301 287 -203 -334 98 360 13 -396 -131 339 172 -206 -273 118 349 -41 -357 -83
4094h3L78l7n19n8M57J95l52l52K87M33j35m58k5L83K09l86k76K40L89j08l74
$$ -83 295 258 -261 -319 138 333 -19 -371 -84 349 214 -244 -269 114 323 -63 -339 -99 290 182 -192
4115a92r7M52J58l90k71K44M18j29m57j8M03J64l14k84K67L39r2m02q3M52J89
$$ -192 -289 163 321 -69 -340 -96 322 193 -264 -282 121 285 -29 -313 -46 293 201 -201 -284 168 357
4136C57m32k44K84L66j64m14k0M41J49l62k98L29L36j85m07l1M72J17l55k64L08
$$ 357 -75 -319 -35 331 167 -247 -267 174 323 -39 -337 -8 328 143 -264 -295 177 294 -61 -325 -17
4157a7L83j73m79O5L85J08m05k08L39K98j11m69N8M15Q9l75j92L01K90j82m13
$$ -17 366 193 -286 -221 164 272 -133 -341 -2 296 185 -284 -226 189 278 -97 -289 12 302 120 -293
4178b93J18L77J04m18k11L27L42k65l95J15M17O7m54j38L66K93k85l44R6M77o
$$ -293 -175 202 306 -112 -323 4 346 81 -314 -199 218 285 -169 -307 59 352 67 -277 -181 296 290
4199B90m91q8L31K99k70l02J08M34p2m34q7L44K47l13l29K06L34j8l83o0L35K38
$$ 290 -201 -289 42 341 71 -231 -123 311 239 -195 -282 62 309 -4 -333 -127 207 189 -194 -254 81 319
4221C19k71l34J52M36j19l69q3L65J76k54l30J98M06q9l69q5L72J27k51l20K36
$$ 319 48 -286 -134 302 183 -186 -269 96 272 18 -312 -114 292 203 -166 -251 121 248 -3 -323 -87
4242h7K89l5l81o4L68J81k84l43L26K44n4l83JL67J20k98k82K50L37p0l97o6L83
$$ -87 202 167 -214 -278 90 271 -13 -356 -30 214 160 -223 -222 145 265 -33 -315 -65 272 202 -195 -261 122
4265A22J73l14k21K04K93j15l29p8M27L6k48k07J59K65l8l48K1L37M9k84j67J82
$$ 122 295 -19 -240 -36 257 142 -187 -265 162 198 -50 -257 -98 167 129 -219 -198 139 188 -96 -263 -81
4287h1L61j10l55L4K88J12l45j82K65K74j26l65N1L09J17l11k64L30K61j72l23
$$ -81 280 170 -185 -151 137 249 -96 -278 -13 261 135 -230 -179 130 247 -64 -328 2 263 91 -232
4308b32P2L00M7l22j76K88K74k01k53%L32J49l74j64K78K50j88l10P6L34M6l68
$$ -232 -160 140 187 -135 -311 -23 251 50 -203 -203 129 278 -96 -260 18 268 80 -230 -154 180 226 -142
4330a42j07K43K98k20l64J49L09O7l12j91K64K93k26l39J66L00K1l60r8L08J75
$$ -142 -249 -6 292 72 -292 -143 166 233 -79 -270 -6 287 61 -278 -112 188 209 -151 -249 59 234
4351B34j74k90J01L60Nl24j58K49K92k68l13J30L92m6l67q0L27J69k42k21J46
$$ 234 60 -230 -129 231 236 -88 -246 3 295 27 -286 -156 236 190 -177 -257 70 239 -3 -224 -78
4372g8K42l4l47l7L17J61k28k38J12L04nl09p5L76M7k43j65J47L14r2l11r6L83
$$ -78 164 130 -217 -254 63 224 -4 -242 -130 174 169 -140 -215 161 208 -35 -200 -53 261 169 -142 -238 145
4395A45J24k23l27K19K72r8l01jK92J39l00k41K53K51j10k95LK80J71k83k20K46
$$ 145 269 46 -281 -62 210 112 -189 -190 102 241 -59 -300 -47 204 94 -201 -198 82 253 -30 -250 -4
4417dK02o8l06J8K81J33k70j96J92K56j25l03K4K66J08k28k33K72K25j23k99J0
$$ -4 198 130 -176 -158 123 256 -14 -210 -18 238 113 -190 -166 100 208 -20 -253 19 244 121 -178 -168
4439a68L11P1k84j06J48K50j45k24OK49R2k38j70J72K39j24k43PL17M3l34j16
$$ -168 143 214 -70 -176 -28 222 77 -147 -141 108 200 -38 -208 -36 203 79 -164 -157 160 203 -131 -247
4461b47L00J39q1l32O3L23M1l46n2J88K06j47k79R6K99L6l19j46L20J64k10j74
$$ -247 53 192 111 -221 -158 165 206 -140 -192 -4 202 55 -224 -128 171 207 -112 -258 62 226 16 -158
4483a58M8K91K1k73j22K58J59j53l16J15L41o1k74n9K39J78k04k78J61K27Ok86
$$ -158 -110 181 202 -71 -193 65 224 71 -245 -130 211 150 -124 -183 56 234 30 -248 -87 140 146 -140
4505a40q6K78J86k72j64J07K71j7l04o3K43J96k42k22J75K17J0l16o7K90J39k06
$$ -140 -226 52 238 -34 -198 -91 180 163 -141 -204 39 235 -7 -229 -54 163 173 -143 -210 80 219 13
4527A3k81J68K87m3l56M0J97J62k49j54J65K49r0k60K9K44J45k92j66J57K20n1
$$ 13 -268 -100 187 144 -212 -172 25 187 -62 -216 -51 198 108 -152 -123 121 266 -26 -192 -35 185 134
4549A34l33K0K55O4j71j79K05K46j91j87k9K63R5k05k53K23K95j34k87L2K71Q8
$$ 134 -199 -179 76 140 -31 -210 -5 241 50 -137 -166 97 192 -13 -266 -43 252 118 -169 -137 134 222
4571B22k70j81J75K43p6l03Q5K15J39k75k33K33K85j68k83K8K35P4k53p9K33J20
$$ 222 -48 -229 -54 189 113 -190 -105 110 249 -26 -259 -26 259 91 -192 -164 71 145 -108 -187 46 166
4593A66r6k43M8K17Q0k39j32J82K21r5k78J5L33nj96j89K30K23j99k27N4K56J6
$$ 166 70 -173 -125 92 172 -67 -199 -17 204 109 -169 -154 179 174 -22 -211 19 242 43 -184 -130 126 142
4616A42k19j61K50K01j77k43P0K39J3j95j20J99J74j03k68R4K21Q5k84j68K81
$$ 142 -77 -238 12 213 36 -207 -137 102 115 -80 -200 -1 173 70 -198 -104 117 202 -82 -250 31
4637C1K04j76k28M6L06rl07j1J97J55j78k79J55K03L3k75p6K51J41j62k75J26
$$ 31 235 59 -169 -123 183 174 -133 -144 53 208 30 -249 -94 109 142 -133 -209 42 183 21 -254 -128
4659a28L24p0k90l0K90M6k00j56J44K77k1k75j19K90J31j87l16K73J80k2k43o5
$$ -128 196 126 -164 -194 96 142 -58 -214 -70 207 186 -89 -208 82 213 26 -290 -17 163 141 -102 -167
4681a67K25K01k73k29J59K55n7k58l2K71J28k03k60J59K74m8l29L7L06O9l15j31
$$ -167 58 259 -14 -243 -84 171 114 -144 -176 95 223 20 -240 -81 193 145 -184 -147 159 228 -87 -218
4703b18J70K97j57k54k8L09J09k23k70J73K33k7l41O4L00O5k96j18J99K12j18
$$ -218 -48 249 92 -162 -190 119 228 5 -265 -92 141 114 -227 -163 137 202 -94 -212 -13 199 81
4724H1k66P1K02J37k54j26J01K37p7k94L0L05Rj90j61K04J92j72j86Q8K13m9j22
$$ 81 -185 -114 88 225 -29 -155 -54 183 106 -188 -158 147 156 -34 -195 9 201 29 -157 -69 144 95 -27
4747b7j36J38K35j35k26j8L23J3k22j47K18J23o0k29M5K50Lk43n2R4K30q1k96
$$ -27 -163 -25 210 75 -151 -169 154 167 -55 -202 16 139 79 -150 -105 145 148 -95 -147 -53 177 96 -200
4770b00P6K34Q8k93j40K51J85j93j40N1K13O1l12r2J80K26k02k07N6L01O2k80
$$ -200 -124 110 198 -95 -235 16 201 8 -132 -81 132 193 -119 -211 -31 195 -7 -214 -158 143 205 -75
4792g5j43K14J98j00k70O0K54rk20j15K05J98j08l00J16K38J4k67r5K57K06j72
$$ -75 -218 -4 194 94 -176 -116 138 129 -91 -206 -1 197 89 -211 -95 143 157 -110 -205 52 258 86
4814H6k61P3K87n0k70p4K52J67j27k33N3K56Mk72p7K65J63k28k15J05L14j7l33
$$ 86 -175 -102 185 135 -135 -209 43 210 83 -150 -97 159 163 -109 -186 79 242 14 -201 -96 218 201 -132
4837a32l6J93J53j37k34N1K85ok09j50L08J65k50k27K07K16p4k43m5K77Q8j83
$$ -132 -168 25 178 41 -193 -142 143 137 -72 -222 86 251 1 -226 -19 197 123 -120 -165 112 200 17
4859A7j60R1K47r6k44p4L23J19k86j59J66K76j29k75K8K52P5j83j63J02L07j81
$$ 17 -143 -52 195 99 -145 -219 104 223 -63 -222 -56 220 91 -184 -156 96 171 -12 -175 -73 234 53
4881E3k04j2K81R5k67j36J68K10j08k09J7K64l6k02j19K07J54l8k78K1K29Q3k10
$$ 53 -151 -163 118 213 -54 -190 -22 188 80 -129 -112 152 116 -86 -205 2 156 118 -160 -139 90 173 -37
4904c7j53J35K34j27k29N7K25O6k31r4J61Q9N0k56J2J62J21j46k09J52K31j49
$$ -37 -190 -55 179 52 -177 -120 105 171 -60 -154 7 96 146 -110 -98 64 185 39 -170 -18 213 64
4926F4k43L5K64K6k08j20J49K04n2k49m4K92L5j77j77J61K26j26k58N5K56M8k03
$$ 64 -179 -144 120 146 -62 -182 -33 171 119 -130 -174 118 153 -24 -201 -40 186 60 -198 -143 113 161 -42
4949d2j53K33Q1o9j98QK51J14k93j45K31K03j59k48N8K12N3k34o5J75J75j62j86
$$ -42 -195 38 119 50 -148 -140 111 225 -68 -213 18 221 62 -186 -128 84 137 -97 -162 13 188 26 -160
4972a60JL06M4k21k21K85J78j77k73J22L00n2k71n1K03J94j97k00P5K55m4k55
$$ -160 -159 147 191 -30 -251 34 212 35 -238 -116 184 132 -139 -190 13 207 10 -190 -115 140 96 -159
4994a59r7K78K17j95k70J04L14p7k73k9K50J32j88k35J40K18L2k09j35K22J83
$$ -159 -256 22 239 44 -226 -122 192 115 -158 -187 63 195 7 -228 -88 130 162 -47 -182 40 223
5015B23k69j96J82K45j34k27j8K56J28k26j66J20K56o3k50n7L08O9k04j82J53
$$ 223 -46 -242 -60 185 51 -176 -194 62 190 -36 -202 -82 174 111 -139 -196 112 181 -23 -205 -52
5036e2L49k27k61M9K75N6k25j50J83J91j28j78L9J80J55l14j71J60K94j88k15
$$ -52 297 70 -191 -142 133 189 -36 -186 -3 188 60 -118 -79 101 256 -58 -229 -69 225 37 -178
5057a78L2K83M7k64p0J14K04j28j19m8J48J32j51j90J55J98r7k60O6K37N4j92
$$ -178 -146 137 184 -80 -150 -36 168 40 -79 -127 21 153 2 -188 -33 165 68 -192 -126 111 165 -27
5079b7j01J20J32m7j67o2K04O8r2k28J52J59j6k66L9K65j5j54j09J17J73l6j80
$$ -27 -128 -8 124 77 -90 -152 52 120 28 -200 -48 111 95 -171 -132 133 118 -36 -145 -28 145 109 -71
5102g1p3K09N8j08j51J44J60p7k36NL08mj73j46J44J10l8j98k2K11R0j71j49J07
$$ -71 -144 65 123 15 -136 8 168 91 -145 -140 168 164 -9 -155 -11 99 61 -137 -159 52 142 -29 -178 -71
5126g1K62p3l23Q9K48K8k56j36K58J36q4k48oK78R5k65j8N0K45r7l21j5L65N1
$$ -71 191 118 -205 -116 132 160 -96 -232 26 162 78 -170 -176 102 197 -68 -86 -36 209 112 -209 -224 141 192
5150A92k55o6K07O2p5k55J08K18lk15q1J70K41j72k41M6K59Ok30j47K67J52k11
$$ 192 -63 -129 78 140 65 -190 -82 136 133 -82 -163 7 248 76 -165 -119 140 146 -84 -231 36 188 -23
5173b3q4L8K56n9j97j16J66J81r6k69J08K64k8k72n3L08J09l04j19J04K61l7k69
$$ -23 -107 -69 187 128 -69 -185 -19 162 66 -203 -95 169 141 -131 -184 124 233 -71 -190 -86 175 138 -131
5196a31J4J76J44k04j32Q6K49r5k57qL04O3k35j53J62J71Ok23n8J95O1r8j76J08
$$ -131 -117 59 203 -1 -133 -47 202 107 -150 -158 146 209 -26 -179 -17 154 160 -63 -121 74 135 37 -139 -31
5220c1J91p5j60j9K13Qk02m3J16J36j00j29M5J01P6j69p7P5J95o6k33k0K74N9
$$ -31 160 85 -75 -94 119 127 -75 -118 -2 134 34 -95 -50 51 127 -42 -119 -44 151 85 -148 -168 106 165
5244A65j93r4R3J93r7j43PJ20Q9j46j34J02J48j5j86m2K70M4j87j69J24J92n0
$$ 165 -28 -122 -29 164 67 -76 -69 51 140 -6 -140 -38 110 95 -91 -133 137 181 -6 -175 -51 141 91
5267I1k11K7K06K6j33j86Q4K90n8k33p1K08J51k23j20J15J40m0k14N4J29J11j14
$$ 91 -120 -93 113 139 6 -180 -96 194 136 -97 -168 40 191 -32 -152 -37 103 63 -151 -97 32 143 29
5290B9j67J03K13m8k20j09K65J05k24j16J20K36j18j37p4K68K0j53k11J50K05
$$ 29 -138 -35 178 130 -90 -199 66 171 -53 -169 -49 187 69 -68 -142 126 146 -7 -218 -68 137
5311A37k5k32m7L31K4k41j63K19K04j45k19O6K22J0j87q4J30J89l5l37O9K38L2
$$ 137 112 -120 -167 164 188 -53 -216 3 207 62 -157 -91 131 141 -46 -130 0 189 154 -183 -114 124 156
5334A56k55q9K68J32j97k07J45K05ok45k4P8J82p9k40P5K46L4l11l5K70Q3k20
$$ 156 -99 -188 80 212 15 -192 -47 158 152 -93 -117 -39 143 64 -176 -101 145 179 -132 -167 103 186 -34
5357c4j29J04K03r3j54K2Q1J46j22j23K7K01m1j68q9K48J08k41q4R9J95j18j21
$$ -34 -163 -59 144 51 -103 -81 0 146 24 -99 -72 129 88 -80 -169 79 187 -54 -138 -39 156 38 -83
5380h3J4J34J7m0j37N2J87lk22q0K05J51k18j19J23J40n1j36K2J29J5r5p0k3J77
$$ -83 -69 65 82 42 -95 -43 144 141 -81 -161 44 195 -23 -142 -19 121 70 -66 -44 85 100 5 -65 -88 89
5405H9J0j77l7J82O5j22j26P4J31l8j36J4J03J9j0j41L8J39Q5j73p2J06J33j36
$$ 89 99 -78 -115 67 132 10 -116 -42 89 51 -85 -71 32 51 41 -100 -62 77 162 -11 -83 23 156 20
5429B0j93J26J53k2j52J8Q7O3k9j70qK24J0j76l0J24J43j56j82J16J72o9j87J
$$ 20 -173 -47 106 84 -68 -50 37 100 71 -99 -107 117 127 -49 -79 45 188 32 -150 -34 138 69 -118 -117
5453a17J80P5j11j58J06J07K1j59j16J91J72k25j96J73K11q4j56j8J96P0k27r5
$$ -117 63 138 27 -131 -25 82 103 -56 -172 19 191 -34 -230 -57 154 70 -86 -104 92 162 -65 -160
5475a60J36J00L4j99k5K38P2k64j47J87K81j36k98R5J89O4k01j22J90J19r7k12
$$ -160 -24 76 110 -89 -114 124 196 -68 -215 -28 253 117 -181 -86 103 167 -34 -156 34 153 56 -156
5497a56Q7J54O4j75j28J78J74j84j70L6K61l1k30J5J50M0p6j66L1K44K2k27j07
$$ -156 -69 85 149 -26 -154 24 198 14 -156 -120 141 110 -120 -105 45 85 9 -157 -126 118 140 -87 -194
5520a94K22J74j94j85J62J55l9k08RJ90mj03r3J40Q3m4j86jJ00J84j71j53R0K00
$$ -194 28 202 8 -177 -15 140 101 -107 -98 92 88 -15 -108 32 115 71 -115 -116 -16 168 -3 -156 -66 134
5544A34o3k08O2J34J3j13k4M0N6J1n4j57J80J35r7j93J81M3m9q7K8J08Jj17J0
$$ 134 71 -137 -75 59 72 -41 -65 -25 31 42 -12 -169 11 146 49 -144 37 80 31 -56 -28 80 81 -36 -26
5569b6j1N6P3r4j78J27J38j30o4N6J42k2j57rR7Q3l3q5M0P9K3j03r1J25N4p2j19
$$ -26 -37 19 92 -2 -180 -53 85 -45 -109 -53 89 67 -90 -99 -2 81 48 -37 3 82 105 2 -89 36 90 18 -101
5596a01M7J81q7j04m9J86K8l9j86O9R9K5r7m8O6J93j47j87R0J66K5j82k1J39K6
$$ -101 -54 127 40 -64 -113 73 101 62 -124 -55 44 69 -28 -76 -10 183 36 -151 -61 105 130 -52 -73 66 92
5621I2r1j14L9J11N7j77l7J43J34j55j80J18K33p5j90o0K50Mj69p8J94Q9p0j88
$$ 92 1 -113 -74 37 94 -83 -120 23 157 2 -178 -60 173 98 -92 -152 98 102 -67 -145 49 138 68 -120
5645a20MJ36J18j71j38J66J84p8k76R0K26K2k28q5K17N1j02q9j8J50J41k53p7
$$ -120 -116 20 138 -33 -171 -5 179 101 -175 -85 141 163 -65 -150 67 118 16 -73 -91 59 200 -53 -130
5668a30J33K05j90j77J13J41j8j72j0J53L3j03p5M7R0j2q6o6J25J42j29j23N5
$$ -130 3 208 18 -159 -46 95 77 -95 -105 48 81 -22 -97 -50 40 28 -58 -124 1 143 14 -109 -54
5691e4J77o0j91L6J13P0j29o1J03L1Pr1o0J44Q0p2j56J14J29r4j51J02P4j1r1
$$ -54 123 63 -128 -92 21 91 -38 -99 4 35 42 -49 -109 35 115 43 -113 1 130 36 -115 -13 61 50 -41
5716d1MO5mL3o5l8R2M6n6j49N5J37p0q5k3J10K9q0K3LO7mn6k6J1R9Mj38k9J37
$$ -41 -37 28 24 57 -8 -46 46 92 36 -113 -58 79 9 -76 -99 11 40 -40 -17 -14 53 49 -7 -33 -22 77 81 -57 -86 51
5746E1Q1j06r5J40J5r4j5j6O9N6q8r0N9J28j5k13K8J77N8j92m8J35M5p4p6P0N3
$$ 51 132 26 -69 71 86 -8 -23 -39 30 86 -2 -92 -33 95 80 -133 -105 72 130 -62 -110 25 70 -4 -80 -10 43
5773D3Rl7j26J17N9M6k05m4K45L0j77j35K81nj27q3N3J80p6j23j7J40L1j7j48
$$ 43 52 15 -111 6 65 111 -94 -138 107 137 -40 -175 106 101 -26 -109 -56 124 48 -75 -92 48 79 62 -86
5798h6N8J44n6k07K5K22N6k01q8J10J49j31n2l7J31P1p2j32L3J74n9j95KJ96R7
$$ -86 -28 116 60 -147 -122 100 156 -45 -133 -23 126 -5 -57 -94 37 108 36 -96 -63 111 52 -143 -141 55 152
5823A52k08q1K02N9j58j8k1J15J8q8o3L2J77r3j44Q3J84m3k33K9J46O1j35o1J57
$$ 152 -56 -137 65 124 -34 -52 -73 42 60 -28 -91 -59 118 25 -119 -36 148 105 -128 -99 47 108 -27 -88 69
5848F9K6l6j28K2O5N7o8o8L1J06Jk04J9J58M2j18o2J27Qn6L0m2J7P8j14k8M1R1
$$ 69 95 59 -69 -47 18 75 7 -61 -30 76 77 -127 -108 50 92 -26 -88 39 47 -9 21 -21 -4 74 -40 -68 -27 64
5876F4j2j33lJ51L3j70mJ07oq7N4l7nP3Rl1o5R5K8l7j26J36J0n4k3O0n9K9L9p0
$$ 64 52 -81 -84 67 100 -70 -74 33 27 -60 -6 -43 -48 25 34 3 -62 33 61 24 -102 34 44 -10 -33 27 -32 -3 36 -34
5906c4k6R2P9j44n3J42Q5j42q2Q6M1o1m8O8J9j0Qo8M0R3j9q2j19J82O4j66m6J48
$$ -34 -60 32 111 -33 -86 56 141 -1 -83 3 44 -17 -65 3 22 12 20 -48 -8 85 66 -16 -135 47 111 -55 -101 47
5934D7N8j00j32J63M3k8p1k1M4L7Oj17KJ38L3j89o5K02M9j42j05J34J23p8m4o8
$$ 47 105 5 -127 36 79 51 -20 -41 3 40 46 -71 -69 69 102 -87 -152 50 99 -43 -148 -14 109 31 -13 -81
5960h1R7P6o5j22P7J12J4k22j6J97O1k05o5J13J64j35q1Q2O2J2n4j75R5J54%k32
$$ -81 16 92 27 -95 -18 94 108 -114 -130 67 128 -77 -142 -29 135 0 -81 1 63 75 21 -154 -59 95 95 -137
5986a37N0J92K1k36LJ58M1j06q8J04Q2k2o6l4N1Q8p1j18%J94k7k18R0J25J4j66
$$ -137 -87 105 126 -110 -107 51 92 -14 -102 2 84 62 -4 -38 13 101 30 -88 -88 106 79 -139 -49 76 90 -76
6012g6J0J14M1j10j4M3pk7N5j26P8O4p0lk1J49l8j44J0J44n1j3m1K8kj7L6n0L3
$$ -76 -66 48 89 -21 -35 8 1 -26 29 -97 -19 45 -25 -28 -49 100 62 -82 -72 72 21 8 -33 -5 -7 -24 12 -38 -5
6041eL1K1p9j8Q0j3mr0R1L9n7L2m9nJ7J0L3r0O0L0mr3J03Qk7m2M0KQj2o8O2K0
$$ -5 26 47 -32 -50 30 17 13 -77 14 53 -4 28 -21 -26 -9 1 34 -56 4 34 30 -63 40 48 21 -21 19 21 29 17 -51 11 31
6074C1K5p8j07J25N7q2q6P8R1n2p4K7Q1k4n6PL0K1K6r4mP9R9j58q7J29J41j04
$$ 31 56 -22 -129 -4 53 -29 -115 -37 54 2 -72 -45 36 12 -44 -37 -7 14 40 -54 -58 21 120 -38 -125 4 145 41
6102D1j12J3J39mr7j7L0N8Pj32M6O6M7r4p2J13Q7j15j21J55O0o9j12M4J13j6j03
$$ 41 -71 -58 81 77 -20 -37 -7 51 58 -74 -28 38 85 -9 -81 32 119 4 -117 38 98 29 -83 -39 74 58 -45
6129d5oR1M9L6j90l6J59N7k19j6J61M5q7o7J15L3o5n8oP0J4p4k1J6R7K2j27k9
$$ -45 -51 40 89 125 -65 -101 58 115 -104 -120 41 86 -1 -68 47 80 15 -43 -49 21 35 -39 -60 -44 53 75 -52 -81
6157h1J08P5j20r6J53M6o9m6J6Q7qo1k6J6Q9n7q2%R7J4j15n5J89j5q4p1J37j8
$$ -81 27 102 -18 -114 39 85 16 -30 -14 73 65 4 -22 -6 83 26 -56 -56 41 55 -60 -115 74 59 -25 -96 41 23
6185B3l2j6K5k1k4O1k3KL9k5p5O7M2j9o9LL7M5o5L0K5k6J0L6p8k7P5M8j02M9%
$$ 23 -9 -25 0 -21 -45 16 -7 -5 34 9 -66 1 43 24 -45 -42 -5 40 -25 5 30 4 14 50 -28 -55 20 68 -34 15 15
6216A5K4l0n7j0K6m6P6O4j19J9P8J5j09O3M4j9o0L3P7p5j7n0L0R9j5l6j07M5J04
$$ 15 39 9 -48 -58 -32 -78 -2 62 -57 -38 40 55 -54 9 53 34 -26 7 84 9 -8 -58 -28 71 56 20 -87 -42 62
6245F2j4j21M9J21o3p9L9P7J9j18PRL8J3p2n9J44l3j0r3O9R2j4k19J64P4o3o8
$$ 62 48 -73 -24 97 34 -45 -6 71 90 -28 -21 -12 26 39 -33 -92 52 19 9 -84 -15 77 63 -156 8 82 19 -49
6273d9L3M6K7q5n5L5J59o0j01k4J18L2j14n8J17J00j06q1M5J23o4p7p2J11N5N
$$ -49 -16 30 57 -28 -83 -48 111 51 -50 -74 44 76 -38 -96 21 121 15 -66 -21 102 38 -39 -111 0 55 60
6299F0r8j5J20k3j06n4J14Q4j47l4J10J02j29r1J20O4n8o3n3J18M8l3q2L5P8R
$$ 60 -38 -53 67 44 -62 -116 -2 82 -65 -99 11 113 -16 -107 13 77 19 -44 -97 21 69 36 -46 -11 67 76
6325G6j20m8J16N2j12j04J24Q1p9mmN7j4n4N0l3N1J2j19K3P8Nj34M0J25k1m5p2
$$ 76 -44 -92 24 76 -36 -140 -16 65 -14 -18 -22 35 21 -33 17 -16 35 47 -72 -49 29 34 -100 -60 65 44 -1 -73
6353g3J43l7l3lJ7m5O%K6Jk3P4j42L6R6l8l7RN4j8n8N0Q0p7o6R0Lq4P2J0m3K6
$$ -73 70 33 0 -3 14 -31 -25 -25 1 2 -21 53 -89 -53 43 5 -32 -23 31 13 -45 5 85 8 -58 32 35 -49 23 33 -10 16
6385A6j1k5pL5N2j35L4O8L8j00o3J92o5j38R3J6N7l7m7P7o1K5k1l2O6K5j2j45
$$ 16 5 -20 -27 8 60 -75 -41 27 65 -35 -98 94 29 -109 -16 0 57 20 -27 50 -11 14 -7 -39 27 52 40 -105
6413a05N0J29k1j40N4M6L8j16K4J11L1p6r0J06lK9l6j42J04R4j0k11J37J12r7
$$ -105 -55 74 53 -87 -33 13 51 -65 -41 70 101 25 -65 41 38 67 31 -111 -7 87 77 -134 3 115 18
6438A8j18M7J26k6p9mN7l5J6n7K6R3K8j07m5J8J29r8j23J16J73j10j59N1J44n0
$$ 18 -100 -53 73 47 -32 -36 21 -14 2 -55 -29 64 92 -15 -60 -42 87 -11 -134 -18 155 45 -114 -63 81 31
6464C1p2k3K7O7k4k8j12J62N6j09n6J16O7j02j43J71Q8j17o9M6Q2m6n5j8J1J26
$$ 31 -41 -64 -37 30 6 -22 -134 28 84 -25 -81 35 102 0 -143 28 116 -1 -70 -24 58 12 -43 -61 -50 76
6490G6L8j51p2J56R1j57q3J20P8j47k5P3O5j06l9M5M7J7M5n6o5R1Nj09N4J08k4
$$ 76 114 -37 -109 47 138 -19 -102 18 96 -51 -76 -3 62 -44 -83 -38 9 26 71 15 -50 41 46 -63 -9 99 75
6517G5j21j0J02m0q7O5Q6p7J2J4J3m7J2K8J2n7O8Po3k8P4j1q4O7L3n9K8j6O9p4
$$ 75 -46 -56 46 6 -81 -16 70 -7 5 19 32 -15 -3 25 37 -20 48 55 -8 -36 38 27 -57 10 43 -16 12 -4 65 -9
6547io1Q8M1n3p2O9l7J07o2j3n3R9ko7qP0Pp3o9J36J1j01QM4Kk1m8N0K2j5M6o1
$$ -9 -70 18 59 6 -66 3 -34 73 11 -2 -55 44 42 -25 -33 37 44 -29 -98 38 49 -52 -44 0 2 -19 -67 -17 5 -10 36 -25
6579b5K1O7Lj76k2K34o2j42N5R8J2j20j3Q4L0l4m0l5P1O9p1j35J04J74n2k10R9
$$ -25 -4 63 66 -110 -132 102 40 -102 -47 51 63 -57 -70 14 44 10 -30 -65 6 75 4 -131 -27 147 95 -115 -16
6606a6J60r5r6l7J71M9j84m9O2J13Nj28j4O4J09j41o7R9P9l8j60P1J57r1j06k
$$ -16 144 49 -47 -84 87 136 -48 -97 -35 78 83 -45 -59 5 114 -27 -94 5 84 46 -114 -43 114 23 -83 -85
6632h5J78o1l5l7k1P3O0r4q6J02P3q2j15J00J74j22j05L5J22k2j14J7J01J9j22
$$ -85 93 32 -3 -40 -61 12 72 -22 -108 -6 67 -15 -130 -30 144 22 -83 -48 74 52 -62 -45 56 75 -47
6657d7PJ5O6M8j15q1J59N2j30o4Q9J31j73l3O5O7m7n5N8n1P4n2pjL5N8j45l0J31
$$ -47 -40 -25 41 89 -26 -107 52 104 -26 -90 -1 130 -43 -76 -11 56 9 -46 12 -39 35 -17 -24 -25 10 68 -77 -107 24
6686B4N5j00k8J16k4n9k0J9K9p8P9ko1M5j7J8m3J15l6q1P3k3N5o9oJ7k4j1pJ20
$$ 24 79 -21 -49 67 43 -16 -36 -17 12 -66 13 11 -50 -5 -22 -4 -47 68 32 -49 24 1 56 -13 -19 -2 -26 -37 -44 76
6716G6q8j9P9rl4J2n4QM0Km1j6Q1K9j08qL3R9j27p0R3R0n4q7N0J20j24j1L0L8
$$ 76 -12 -31 48 39 5 17 -37 -29 11 13 -28 -44 37 66 -42 -50 -17 82 -45 -115 -22 68 14 -73 -23 97 -27 -38 -8 30
6746C0M2kj51n4K36J4j97n0J80L5j53m8J33J25j09j51R6P4m3l1o9R7M6%j78R3
$$ 30 72 70 -81 -135 101 115 -82 -132 48 83 -70 -118 15 140 31 -120 -24 50 7 -24 -93 4 50 50 -128 -35
6772c5J09l9j26%J58K0j35m8P8P1l9r2P9P2Rj32m0Q7J80n1k69N6J83J8k34O1J91
$$ -35 74 35 -91 -91 67 87 -48 -96 -18 53 14 -78 1 73 82 -50 -90 -3 177 126 -143 -87 96 114 -120 -59 132
6799A32K1k09l6L5J09l1m8n2J11N2o7j52J32J09m9k32R8J90n0j62N4J51n7j07
$$ 132 153 -56 -92 -57 52 21 -27 -79 32 84 17 -135 -3 106 57 -175 -77 113 63 -99 -45 106 49 -58
6823e8j9Q4N7j3r7k4R0J04j49k7O0Q9o7j38J26J11j22l5O6L1j19NL8m8L3Q7o2
$$ -58 -77 7 64 51 -46 -70 20 124 -25 -52 8 97 30 -108 18 129 7 -28 38 69 -50 -45 -7 -55 -22 65 3
6850Cn5P8N6j24q0J68J00j91p2J38lr3O7L3Lp5P2j1J7n3M4n1JO4Mq5L4M9J8j31
$$ 3 -52 26 82 -42 -122 46 146 -45 -117 21 18 -75 -8 25 28 -47 25 14 31 -22 22 -29 -28 36 40 -45 -11 38 56 -75
6880g5N4J07o3l7N6J8m3o4Q0j0Jrl7n0O4P7r0m5J13P1j36p5J20R1j34p3J20N6
$$ -75 -21 86 23 -14 42 60 17 -47 33 23 24 15 -22 -72 -8 69 -21 -66 47 118 -18 -93 27 118 -16 -89 31 87
6908H7r5p4K4R7j4K1o9pM0J07j50q3J45Q6j71n5J29P5q5j22J16Q9o1o2K2pL4J2
$$ 87 -8 -82 -58 39 25 46 -23 -30 10 117 -33 -116 29 115 -56 -111 18 93 8 -114 2 91 30 -32 -10 -17 17 29
6936B9j36mK30j5k24KJ73J11k03q2J54O5j51m5N9J11l1m6m3K2J22oj87J7J66K3
$$ 29 -107 -111 119 104 -120 -118 55 166 -37 -119 35 100 -51 -96 -37 74 43 -3 -46 -24 98 92 -95 -78 88 111
6962A11k42j2K19K7j52q1J35J09r1j05O0K0L7l2k6l7J21j4j50O8J43n3k22Q3K32
$$ 111 -131 -143 76 103 -49 -130 5 114 23 -82 -22 -2 35 3 -23 -60 61 47 -103 -35 108 55 -167 -84 148
6987A48j07j33NJ10J0J8r2M3l8R0n6r3J27N6n9j44J38J34j54r2N8J03j9q4K1J7
$$ 148 41 -92 -87 23 33 51 -41 2 -36 54 -2 -95 32 88 29 -115 23 157 3 -89 -31 72 53 -31 -10 7
7013Gm4P7n3L9l2N0n4k8K2L5j2j08J71J6j42k9P5Q1q4m5J14j0p1K3J5J3Kl4K0
$$ 7 -37 40 -13 26 -6 44 -10 -38 -16 19 7 -101 70 86 -56 -85 -10 71 -13 -58 56 46 -25 -2 13 26 28 -6 14
7042A4p3J05jj06J6O4M9j31K4J47p5q9M3J08q4l8jJ2L9K4n4k2J5Q8q6p8N7J26
$$ 14 -59 46 45 -61 -45 19 68 -63 -39 108 33 -56 -13 95 11 -27 -28 -16 23 47 -7 -29 -14 74 -12 -90 -33 93
7070I3o4j96J34J50o4j32R3M3j2j29N9J4O9n1o9k2R6J06j58j12J83R6j15r9M1
$$ 93 29 -167 -33 117 53 -79 14 57 45 -84 -25 -11 58 7 -62 -84 12 118 -40 -152 31 127 12 -87 -46
7095d6J73r4j62J02P7J5j06J9LJ14o8j09J5J10Q6j56j19J68J65k09r5N1K16j21
$$ -46 127 33 -129 -27 50 65 -41 -22 -19 95 27 -82 -67 43 129 -27 -146 22 187 -22 -117 -66 150 29
7119B9j19N8L3M1J7j25rJ82l4j38p8J93Q6j96r4K03P2j29r8J08J04j29jK0K4N9
$$ 29 -90 -32 1 42 59 -66 -75 107 73 -65 -143 50 136 -60 -154 49 121 -8 -106 2 106 -23 -24 -4 20 79
7145G9p9j25K8J54j5j31m8K24pj80mJ49P7j93N7K9JJ4n8k8P6N4j9j10j8J84m5
$$ 79 0 -125 -97 57 42 -89 -137 87 80 -100 -104 45 122 -71 -14 15 16 30 -28 -56 20 74 55 -55 -73 111 66
7172F6r4oJ41o0j03Q7P0j14n4J30k8l5J4j7nj9O2r2n5R7Q9p9q4Q4Q2r1n4J22L
$$ 66 -28 -34 107 47 -56 31 101 -13 -67 63 35 0 14 -3 -8 -27 35 -57 -112 -15 74 -5 -89 -5 77 -14 -68 54 57
7201E7j09L7J23q7o0N8J1q3R4j6j07M7P3k0j06O1J09k8j41J4J38K5j31J4P1j5
$$ 57 -52 -15 108 21 -39 19 30 -53 41 25 -82 -35 38 18 -88 -27 82 54 -87 -73 65 90 -41 -27 44 29
7227B9q6K8j8O2K6n2r3O1J87j21j50N1J40p3r9L5J51K3j40jJ45j0l3j20K2Q0L7
$$ 29 -57 -29 -47 15 41 -11 -104 -43 144 23 -127 -76 64 -9 -108 -73 78 101 -39 -40 105 95 62 -58 -36 44 81
7254H1r0r6J24J45j08k03J00K14r9k24J67O7n2j05RO0M9k2m4q8J68N0q5j71K07
$$ 81 -9 -105 19 164 56 -147 -47 167 68 -156 11 78 26 -79 -70 -10 39 17 -27 -115 53 103 18 -153 54
7279E4J39k54o1R5J66q6j74O2J22k5k7q8P8P5m5o8p1J58O6j76j35K28Q5j21j57
$$ 54 193 -61 -122 -27 139 53 -121 -59 63 38 11 -77 1 76 31 -37 -108 50 116 -60 -195 33 118 -3 -160
7304a60J86N6q9n3P5P2m4q3k5L3R7K0j71L9R7J1j23n5J95Q1j73j04J93J3j41M4
$$ -160 26 82 -7 -60 15 87 43 -40 -65 -32 65 85 -86 -47 50 61 -62 -117 78 159 -14 -118 75 88 -53 -9
7330iM6K0m9qn1N5M1L0j12n1J30J1r9J7J28m9r7l2J85j20m6N3Mj7j6R1j32Q7L6
$$ -9 37 57 8 0 -51 4 45 75 -37 -88 42 53 -46 -29 99 50 -47 -79 106 -14 -60 -7 -3 -20 -36 55 -77 10 46
7359D6l4p0P2M5q8p0O8M4l0r2J47L9j41j8R7Mqm9L1L9k4kr4MJ22K7j08n9J74n
$$ 46 12 -58 14 59 -29 -99 -31 13 -17 -109 38 77 -64 -82 15 19 11 -38 -7 32 8 6 -88 -84 38 65 -43 -102 72 67
7389F7j47o2K30K4j87K5mO6J7n4rM6P5p1j40M2J91Lk13J5J93j2j48m7J60K7j03
$$ 67 -80 -142 88 112 -75 -50 -54 12 29 -25 -34 12 87 16 -124 -82 109 112 -101 -86 107 95 -53 -100 60 87 -16
7416a6q6J20K8j2q0p4R7J10l3j48O6J96q7k27L2K92q1j71J2J04M5o4o8qR6Kr8
$$ -16 -102 18 46 34 -46 -120 -23 87 54 -94 -28 168 81 -146 -114 178 97 -74 -62 42 87 23 -45 -53 43 45 -53
7443e3m2J7K25j18j50O9K02j16j70N2J85m3j33M9P2mm1m5NR2K7m4j71J33J39j77
$$ -53 -95 -78 147 29 -121 -52 150 34 -136 -84 101 58 -75 -26 46 42 1 -44 -39 53 80 36 -135 -2 137 -40
7469d0q7J19J17p3j37J07J10r3p2pM9O5p6j0nM6M4j05o3J37M8p2j13J45L5q6m5
$$ -40 -127 -8 109 36 -101 6 116 23 -49 -56 -7 58 -18 -28 -33 13 57 -48 -111 26 74 2 -111 34 69 -17 -62
7496f2O1Q0p2k8J0J2J8n0oM5N9J9r1o0J37j1p8l0Q1M5j47L8R9m5j16R8K9Nk4M1
$$ -62 -1 79 7 -21 -11 1 19 -31 -37 8 67 86 -5 -65 72 61 -17 -47 34 79 -68 -30 69 24 -92 6 35 40 16 57
7526E7q0OL5j1q4O2P9l9m9J5J45o5j42P8K7Pj11QQ6L6n7j2n1M7P8o4q0J35Pj22
$$ 57 -23 -17 18 7 -77 -15 64 25 -24 -9 136 71 -71 7 34 41 -70 -62 24 60 3 -9 -60 -13 65 1 -79 56 63 -59
7556e9m9J28J11j25o7N3P7p0m2j4Q8L8l6o8M8P2m2j15jJ53j6j17n7J95J6j62o0
$$ -59 -108 20 131 6 -61 -8 69 -1 -43 -57 31 69 33 -35 13 85 43 -72 -73 80 64 -53 -110 85 101 -61 -121
7583a21J35P1p6p9R8Lnj4p9QJ72p1j69L5J58J18l14MK47l7j30l6Q2Q1p7k1n4J11
$$ -121 14 85 9 -70 28 31 26 12 -67 -59 113 42 -127 -92 66 184 -130 -126 121 84 -46 -82 0 81 4 -17 -71 40
7611D0jl8o6M9J29m1j84J6J88Mj75LJ37M3j05r6J20J6Op2pQ3N7p9p0K6J18m5j53
$$ 40 39 1 -65 -16 113 72 -112 -96 92 96 -79 -76 61 104 -1 -97 23 39 45 -27 -34 49 106 27 -43 -17 101 56 -97
7640i7J1J75k7j94R7N0L5j11O0j6k9M0L2q3O0O2r0NJ1P1q6k5O4P7j02m6M7K5n0
$$ -97 -86 89 62 -132 -35 15 50 -61 -1 -17 -46 -6 26 -57 3 65 -25 -20 -9 62 -24 -49 15 92 -10 -56 -9 16 -34
7669c4L0J8kmrJ8p6O8J2m8k6P0M5j40N3Q9o4o7K5O6J4m1n1L1Q9r8M0l2MQ7k7q3
$$ -34 -4 14 12 8 -1 17 -59 9 21 -27 -53 17 62 -78 -25 64 0 -67 -42 24 38 -3 -54 -23 66 -32 8 -24 -20 67 40 -43
7701d3MP6L3j61P8J46j33q7M2P4K1r5RP2j7l5kk6M7J08j24r1J21J7J6j33Q1J10
$$ -43 -39 37 70 -91 -13 133 0 -87 -45 29 50 -45 -36 36 19 -16 -18 -44 3 111 -13 -104 17 34 50 -83 -2 108
7729A08q0j07M2P2ko0pJR8n9m8j9J40P6j92q3J16J42j09k16K05J01r3j02O7Q8
$$ 108 28 -79 -37 35 33 -27 -34 -33 65 6 -42 -61 79 155 -37 -120 -4 138 29 -187 18 119 26 -76 -9 79
7755G9Rj12n6N9P1mp6n3J56K3j63pO6J67j80q1J01P4p5k2K1O7j4l0k3j8P5mj27
$$ 79 88 -24 -80 -21 50 46 -30 -83 73 96 -67 -74 -8 159 -21 -102 -1 73 -2 -24 -3 64 50 20 -3 -21 54 50 -77
7784g7K8J12J9j31r1K01Mq6p1J19P8j32l4P1m4J06n4r0R9Q9n4j75O0J19Oj49j8
$$ -77 -49 63 82 -49 -140 61 65 -21 -92 27 105 -27 -61 10 -34 72 18 -72 27 116 62 -113 -53 66 72 -77 -95
7811i5J50Mj08K0P7Rp5M5m5j0M1pm5L0N5k3j28J16N2l9r5J7Q7l6l7M1K3L0qr6
$$ -95 55 59 -49 -29 48 57 -18 27 -18 -28 13 6 -39 -9 46 23 -105 11 63 24 -71 -54 33 -3 -40 1 24 54 46 -50
7841e0J03oq2N8n4P9j6m7l2M9Q1j49p7J37J13j00n8N8N0p5k9N7L0J5m9k7jN0K7
$$ -50 53 47 -35 23 -31 48 32 -15 -47 2 83 -66 -143 -6 107 7 -51 7 57 -18 -47 10 40 55 6 -21 -22 28 55
7870E5j41O3Q3L2j53k5J22J6q4k0P0P1j03n6N4K5onl6j3J19o3p9M7J30k0k04J34
$$ 55 -86 -23 60 92 -61 -86 36 52 -32 -52 18 89 -14 -70 -16 9 3 -2 -38 -51 68 5 -74 -27 103 83 -121 13
7898A3j9M3r8j7P9Q4k2o2l6R2K5j02j00O5J81j24j15J04J13q0j63K4K05m4o6m5
$$ 13 -6 37 -61 -78 1 85 63 1 -35 57 82 -20 -120 -55 126 2 -113 -9 104 24 -139 -115 90 46 -20 -65
7924f5J65kr7n5OP9L7r1n1J42R9j74j28J39J28j22j21R0P7m9m4LN2PL0q8n3J19
$$ -65 100 98 1 -54 -48 31 68 -23 -74 68 167 -7 -135 4 132 10 -111 -21 56 7 -37 -34 18 25 55 -33 -86 33
7952C3N8j00r0J13P6j16j9K4R9r0k8N8L5K0j20O0m9Q3l8l4o0J62k7q5pO4P1j67
$$ 33 91 -9 -99 14 90 -26 -45 -21 78 -12 -40 18 53 73 -47 13 -36 47 9 -25 -85 77 50 -35 -42 22 93 -74
7980g4K1J14L0j43J4O4K8k7m3J7l6P2k2m9N6L9o2o5N1Q2o6o4M9J08n6n5PP5q0
$$ -74 -53 61 91 -52 -38 26 54 27 -16 1 -35 37 15 -34 22 61 -1 -66 -15 67 1 -63 -14 94 38 -17 -10 65 -15
8009a5MLk5P0l0j4n4R5l5M6j13L5J25j46l7P8Q2j07n1Q8N1p5J3K1m5J11j11Jk4
$$ -15 -11 -8 -33 37 7 -7 -61 34 -1 45 -68 -33 92 -54 -91 -13 69 -38 -89 -1 50 -25 -12 9 -36 75 -36 -35 -59
8038e9O8POo2R5rm3q7J15M7p9o4N1P5l8Rq2R6Lk0j11L6J47p3l9PK0J1n5j1K6K4
$$ -59 9 16 22 -40 55 46 3 -84 31 78 -1 -65 -14 61 23 32 -50 46 49 29 -82 -46 101 28 -11 -4 16 27 -28 -39 -13 11
8070A1J5j14N8O7o4j3oJ2J05m4j18Q1O7m7j21L3J65r5l0K5M6P4j00k3l6Q4J2j04
$$ 11 26 -88 -30 37 -27 -40 -46 -34 71 27 -91 -10 57 10 -111 -78 87 -8 -38 -13 33 107 7 -16 -52 32 44 -60
8098f0oM7R1k9j96R1J71n5j09J3R4J6r6M2Q3p5m2K8o8Q9Rr0p1J62N1n8j09O9J12
$$ -60 -66 -19 72 43 -153 -62 109 54 -55 -42 52 68 -28 14 97 22 -20 8 -60 29 38 -52 -123 39 90 32 -77 -8 104
8127A04j03m3L9P7n3q6N1L7l6K1J4m2Q0k3p1j4P8L0q4nO9Rm4k9L0L5o4jl8R7n
$$ 104 1 -42 -3 74 21 -65 -14 23 -13 8 22 -20 60 37 -34 -48 30 60 -24 -29 40 49 5 -24 6 41 -23 -24 -62 35 30
8158C0m7K6LM2k9k1j1K9N2j07OJ04o1n7L4kM7r8RJ8O0j7PonJ9j3k8L0M3k7r3N1
$$ 30 -17 9 12 54 25 4 -7 22 74 -33 -27 77 16 -41 -7 -9 38 -60 -51 -33 27 10 17 11 6 25 12 -16 14 57 30 -63 -12
8191a2
$$ Imaginary data points
##PAGE= N=2
##DATA TABLE= (X++(I..I)), XYDATA
0@%%%%%%%%%%%%%%%%%%%%mM%LpQnNqQpOoNmMk%%kOqQj0J6k0K1k6L2l4L4l6M1m2
$$ 0 0 0 0 0 0 0 0 0 0 0 0 0 0 0 0 0 0 0 0 0 -4 0 0 3 -4 4 -1 4 -4 4 -3 3 -3 2 -2 2 0 0 0 -2 4 -4 4 -6 10 -10 11 -15 17 -17 17 -19 22 -20
54b0L9l6L0j9mM2r7J84l24N58r64J703l199O759j8141J12008N44182n36025p02201
$$ -20 19 -17 13 -6 -10 32 -65 119 -205 353 -611 1092 -2107 4652 -13489 98519 642701 106676 -595525
73e95525M49052O05075k72958m76805Q8407K95477J12920j02988k94817r3299
$$ -595525 -146473 458602 185644 -291161 -202754 92723 205643 102655 -192162 -285461
83b85461M52481K64711n62556m02549O22841M90317o22258n26720N66332N07910
$$ -285461 167020 431731 -130825 -533374 89467 579784 -42474 -569194 -2862 505048
93E05048m56777m41617L08273L33916j33810k00252m7475N3758K18868Q7078l63427
$$ 505048 48271 -393346 -85073 248843 115033 -85219 -132694 -78936 139932 227010 -136417
104a36417k08767M68998K97001n27532l44819N36455L48635m96863l12049M15661
$$ -136417 -345184 123814 420815 -106717 -451536 84919 433554 -63309 -375358 40303
114D0303K42131l01055j50062J65973M9016k2374M8587j15860j30752K36905J88498
$$ 40303 282434 -18621 -168683 -2710 46306 23932 72519 -43341 -174093 62812 251310
125B51310l29830k15729L87323K10334m06292j74759L87027J13984l34562l7922
$$ 251310 -78520 -294249 93074 303408 -102884 -277643 109384 223368 -111194 -149116
135a49116K56750m3388j63704J17435O5430j73884K8657K04212j10482k03534
$$ -149116 107634 64246 -99458 17977 83407 -90477 -61820 142392 31910 -171624
145a71624J74750J71711k17538j12249K37979L3310k36236N5727K15403j43358
$$ -171624 3126 174837 -42701 -154950 83029 116339 -119897 -64170 151233 7875
155G875j79013K18528J32338k71598q0771K94912K9708k84530J5415K39057n1575
$$ 7875 -171138 47390 179728 -91870 -172641 122271 151979 -132551 -117136 121921 70346
166G0346j62247P6320O0765r0191N4770R4190j72153r0456K77662Q2047l58232
$$ 70346 -91901 -15581 45184 -45007 9763 103953 -68200 -158656 119006 201053 -157179
177a57179p0911M03714N9634m07139m9179L67252M0881k86667l4612J73759L0095
$$ -157179 -228090 175624 235258 -171881 -221060 146192 187073 -99594 -134206 39553 69648
188F9648l9814k6823j01473K3414K35523j8958l48695J1519M28920p77m68039
$$ 69648 29834 3011 -98462 -75048 160475 141517 -207178 -195659 233261 232484 -235555
199b35555j4171M61153L2523m08287n3402L14123P4157j87183r2158M0557J04743
$$ -235555 -249726 211427 243950 -164337 -217739 96384 170541 -16642 -108800 -68243 36500
210C6500J11879j09454k54142J05272L72328r1323m54141O8602M91496l8379m80823
$$ 36500 148379 38925 -215217 -109945 262383 171060 -283081 -214479 277017 238638 -242185
221b42185K831M23137L4849l24592p2011J94910J05019m7753j31113j02724J47668
$$ -242185 -239354 183783 218632 -105960 -177971 16939 121958 74205 -56908 -159632 -11964
232a1964K40935j52758l53529J45668M29272j26406m61090R6713M46909n8593
$$ -11964 228971 76213 -277316 -131648 297624 171218 -289872 -193159 253750 195157
242A95157l88969J5727K94686K8734j74267p0978M1416J07578R0491j35917k08298
$$ 195157 -193812 -178085 116601 145335 -28932 -99910 -58494 49084 139575 3658 -204640
253b04640J53691L00429j59525l59438J52768L80601j34360l63691J05162L11575
$$ -204640 -50949 249480 89955 -269483 -116715 263886 129526 -234165 -129003 182572
263A82572o7949k31091K5570J31490J8516k3587o0478q1300R7645J72183j26430
$$ 182572 114623 -116468 -90898 40592 59108 35521 -24957 -106257 -8612 163571 37141
274C7141k39905J45680K78599j53835k85275J51053K60973j37779k09916J15124
$$ 37141 -202764 -57084 221515 67680 -217595 -66542 194431 56652 -153264 -38140
284c8140J39396q5213n8623M9489k2678j1107R5147k8103j51095O5167J84460
$$ -38140 101256 16043 -42580 6909 -15769 -26876 68271 40168 -110927 -45760 138700
295A38700r7502j93074J22958J77231j39612j40114J46603Q7726j43276k7042
$$ 138700 41198 -151876 -28918 148313 8701 -131413 15190 102916 -40360 -67402
305f7402J30218l3278j08151Q5943P8844j23983m4089J42865O242j40630L2241
$$ -67402 62816 29538 -78613 7330 86174 -37809 -81898 60967 67209 -73421 -41180
316d1180J17807o8974p7949J01004K6281j26602L0044J43470q3835j50526J27846
$$ -41180 76627 7653 -70296 30708 56989 -69613 -39569 103901 20066 -130460 -2614
327b614J46569j56085j31767J64548J06873j51212p3258J17292L3508o5796R635
$$ -2614 143955 -12130 -143897 20651 127524 -23688 -96946 20346 53854 -11942 -2307
338b307L049n2824O4296R2810j28059j25843J80076J49290k14005j60868K24805
$$ -2307 742 -52082 12214 105024 -23035 -148878 31198 180488 -33517 -194385 30420
349C0420J59153k10531j44425J71668J17402j12207q0728L7706L7513M3846Q484
$$ 30420 189573 -20958 -165383 6285 123687 11480 -69248 -31542 5971 49817 58301
360E8301j23821n3335J93468R3510k44785j25627K72465J47210k72187j56673
$$ 58301 -65520 -118855 74613 168123 -76662 -202289 70176 217386 -54801 -211474
370b11474K43951J53370j89732j37551J14757J10654k6533p4916o6336L3482J53916
$$ -211474 32477 185847 -3885 -141436 -26679 83975 57442 -17474 -83810 -50328 103588
381A03588R810k27330n1459K78735Q7194l02927j14117K97153J29777k62064j33016
$$ 103588 113398 -113932 -165391 113344 200538 -102389 -216506 80647 210424 -51640 -184656
392a84656K01193J24141j20600j04524K8714P6837O5701m4116j52545R686K24046
$$ -184656 16537 140678 20078 -84446 -55732 21105 86806 42690 -109855 -100169 123877
403A23877K2666k72509n0410K94019P0885k86524q3094K51263Q6351j92531q1500
$$ 123877 146543 -125966 -176376 117643 188528 -97996 -181090 70173 156524 -36007 -117507
414a17507J16246O9675l0937n2770n5380L3220J33678j3357j96548m703K38460
$$ -117507 -1261 68414 37477 -15293 -70673 -37453 96225 82868 -113680 -118383 120077
425A20077J9311k55664k9237K47744L4065k15915l3821J64701K9415r9490k2243
$$ 120077 139388 -116276 -145513 102231 136296 -79619 -113440 51261 80676 -18814 -41057
436d1057K7872J3712M2897n542j05951m67J54812L055j85771j575J95974l924
$$ -41057 -13185 527 43424 37882 -68069 -68536 86276 89331 -96440 -98015 97959 94035
448I4035j86202J2898J57980k3654j15842L4314O4871m2504j0979M6524l9612
$$ 94035 -92167 -79269 78711 55057 -60785 -26471 38400 -4104 -15083 31441 -8171
459h171m4691Q2125L6380j12230k1308J27651Q78j27587K3038J13304m7926q7565
$$ -8171 -52862 29263 65643 -46587 -67895 59756 60634 -66953 -43915 69389 21463 -66102
471f6102P0919N4190q9375j7817J00264j6912j02309M5701R4117o5587p5822P4590
$$ -66102 4817 59007 -30368 -48185 52079 35167 -67142 -21441 72676 7089 -68733 5857
483E857M8221p2089j3636N9295k4802l8502O3767J3095r8971J3360J26871l6729
$$ 5857 54078 -18011 -31647 27648 2846 -35656 28111 41206 -57765 -44405 82466 45737
495D5737j44134N4254J48242o3113j38162O2241J14099n1678p8035L2632L2688
$$ 45737 -98397 -44143 104099 40986 -97176 -34935 79164 27486 -50549 -17917 14771
506A4771p476J7191k0694o7333M8152J12304p1263j47760Q6840J69988r2592j76253
$$ 14771 7295 24486 3792 -63541 -15389 96915 25652 -122108 -35268 134720 42128 -134125
518a34125Q7079J65929p0300j39444M3816R9704j0268m9783k6916n005O3473N9762
$$ -134125 -47046 118883 48583 -90861 -47045 52659 42391 -7392 -34308 -39313 24160 83922
530H3922r5071j09075J17830J48175j29021j73480J26641J82320j10748j74148
$$ 83922 -11149 -120224 -2394 145781 16760 -156720 -30079 152241 41493 -132655
540a32655Q2526J49436m4887j10966J439O2256M3457q409q4862m5281J18703R3733
$$ -132655 -50129 99307 54420 -56546 -55107 7149 50606 42197 -42665 -87946 30757 124490
552A24490j41340j31777J50422J56308j44941j64722J25570J56880r4031j33804
$$ 124490 -16850 -148627 1795 158103 13162 -151560 -25990 130890 36859 -96945
562i6945N3398R8211p620n4437l8894O858Q1624L9227j16783p9322J40606J09730
$$ -96945 -43547 54664 47044 -7393 -46287 -39429 42195 81422 -35361 -114683 25923 135653
574A35653j51393j27673J47865J31782j30397j22401J00876J01361o2223p1160
$$ 135653 -15740 -143413 4452 136234 5837 -116564 -15688 85673 23450 -47710
584d7710J8567L5545K6192J399o7241l5672J00981O3892j24348q3076J35310R1774
$$ -47710 -29143 6402 32594 33993 -33248 -68920 32061 95953 -28395 -111471 23839 115613
596A15613j33621q9438J19589P6942r5474n6379O3609L0624k7705l359q624k2478
$$ 115613 -18008 -107446 12143 89085 -6389 -62768 841 31465 3760 401 -8223 -30701
608c0701M2376M3314p0353n6819R0514O1524j01244n7046J02482M4436r4392k5413
$$ -30701 11675 54989 -15364 -72183 18331 79855 -21389 -78435 24047 68483 -25909 -51322
620e1322P8597K914n6970K0050L1767m0066n823N4337j8532o1005L9064N8749
$$ -51322 27275 30189 -26781 -6731 25036 -15030 -20853 33484 14952 -46053 -6989 51760
632E1760n4344m7816O3144K9199o5419n271O1622k1233n2733M6669M0523o7999
$$ 51760 -2584 -50400 12744 41943 -23476 -28747 32875 11642 -41091 5578 46101 -21898
644b1898k6320Q2395J2136q7451P54Q2356j1104o7006J8443M2974k2707j2252
$$ -21898 -48218 34177 46313 -41138 -40384 41972 30868 -36138 -17695 25279 2572 -9680
656i680K3891k1590k2812N4846K0107q4098j6565J05392J2989j16460j0038J15301
$$ -9680 14211 -7379 -30191 24655 44762 -39336 -55901 49491 62480 -53980 -64018 51283
668E1283Q038j01861p114P6963P249m2968q043L398R073L8248r798p7175R643
$$ 51283 59321 -42540 -49654 27309 34558 -8410 -16453 -13055 -3982 34266 24468 -52707 -43064
681d3064J09606q131j31677N074J40925k01j36200o046J17577J3235q6827k0825
$$ -43064 66542 58411 -73266 -68192 72733 72532 -63668 -69714 47863 61098 -25729 -46554
693d6554M6699K7746j559l3241m4239L6182Q5861l5971j19362L2473J41001k5379
$$ -46554 145 27891 26332 -6909 -51148 -14966 70895 34924 -84438 -51965 89036 63657
705F3657j48704J5509J41652l407j20695r513Q8062K2385m7138l3541K121M2196
$$ 63657 -85047 -69538 72114 68707 -51988 -61501 26561 48946 1808 -31733 -29612 12584
717A2584M2373m7297q2109M8531J12914m5674j32169L8918J37792k8858j29924
$$ 12584 54957 7660 -74449 -25918 86996 41322 -90847 -51929 85863 57005 -72919
728g2919J6328J09241k277p8398j2127M0585K5747J86l7409l9683M6210P4203
$$ -72919 -56591 52650 50373 -28025 -40152 433 26180 26366 -11043 -50726 -4516 69687
740F9687n1372r9911N2368J14809m9018j17514M1841J08315l1263q8456J8132
$$ 69687 18315 -81596 -29228 85581 36563 -80951 -39110 69205 37942 -50514 -32382
751c2382O0606m007k7817j0521n958K3563L7256l4608o2895M2427Q0283m6745
$$ -32382 28224 24217 -3600 -14121 -20079 3484 40740 6132 -56763 -14336 65947 19202
763A9202q7990M7375Q5766m4508p4232L8538N5388k9979l1521J9676O060q492
$$ 19202 -68788 -21413 64353 19845 -54387 -15849 39539 9560 -21961 -2285 3775 -4717
775d717J8538k954l9191J3973N3700k3610o0898L1540O0016l7247n1696M0289
$$ -4717 13821 10867 -28324 -14351 39349 15739 -45159 -13619 46397 9150 -42546 -2257
787b257L7113m0690j8605L8272j672l3416K0848K6384l6700j7494M6970P673n0518
$$ -2257 34856 -5834 -24439 13833 12161 -21255 -407 25977 -10723 -28217 18753 26426 -24092
800b4092K785M7002j2908l6700K2205K1253k9903k553L5757j7067l9091L4786
$$ -24092 -21307 25695 12787 -23913 -1708 19545 -10358 -12911 22846 5779 -33312 1474
812A474L9984m8468l8212N6258L3498n6810k6674N0209J7611l7008p184J8488
$$ 1474 41458 -7010 -45222 11036 44534 -12276 -38950 11259 28870 -8138 -15322 3166
824C166m004K965J5143k5134k5360M5451L3928o1361l9837P0807M2971p2629m2598
$$ 3166 -838 2127 17270 -7864 -33224 12227 46155 -15206 -55043 15764 58735 -13894 -56492
837e6492O6401L8884n2444l1986L2089K2426p349j1091j9170j245M4659J3409
$$ -56492 9909 48793 -3651 -35637 -3548 18878 11529 438 -18732 -19977 24682 38091
849C8091o6376k4568Q1768L3569q9022l9849Q7093M2731p6081m1944N6934L7675
$$ 38091 -28285 -52853 28915 62484 -26538 -66387 20706 63437 -12644 -54588 2346 40021
861D0021l1590l0212K735K0442K6807r154n3683k658P5453J3818q9423k3485R4427
$$ 40021 8431 -21781 -19046 1396 28203 19049 -34634 -37292 38161 51979 -37444 -60929 33498
874C3498L0742r0065l4991P6585L6006n5766l3805K9434K8779o33k1540k8021
$$ 33498 64240 -25825 -60816 15769 51775 -3991 -37796 -8362 20417 19784 -1756 -29777
886b9777J2885N3449l534p3461n486Q6132J3272q9958j9216Q5113K2979p1953
$$ -29777 -16892 36557 33023 -40438 -45924 40208 53480 -36478 -55694 29419 52398 -19555
898a9555k4274N1998K3332k7315k0424O23J5978K5536j0729m8473N200O5789p4
$$ -19555 -43829 8169 31501 4186 -16238 -15615 363 25899 15170 -33303 -28103 37686 37612
911C7612p6109m120P8256P009p2620q500N9980Q366m1672p287K0258N288K086
$$ 37612 -38497 -42617 35639 42648 -29972 -38472 21508 29874 -11798 -19085 1173 6461 8547
924H547k920k2959Q76M0429N30n2525r48N8556L83n8202J311N1799l752m0500
$$ 8547 5627 -17332 -16456 23973 24503 -28022 -28970 29586 29969 -28233 -26922 24877 21125 -19375
938a9375O594K5722r414r270J1338o805j2346K0902J1897l1798r747L8247N794
$$ -19375 -12781 12941 3527 -5743 5595 -1210 -13556 7346 19243 -12555 -22302 15945 21739
951B1739l9918l11L6756o026k9496J2803J9337j9063p522K4298m423k7442J4958
$$ 21739 -18179 -18490 18266 12240 -17256 -4453 14884 -4179 -11701 12597 8174 -19268 -4310
964d310K8066k2685k5902K6947K0832k7297j3195K3709L550j6996P161P921j7830
$$ -4310 23756 1071 -24831 2116 22948 -4349 -17544 6165 9715 -7281 -120 7801 -10029
977a0029J881K7496j1436l5027J9191L9490k4136m0428K5847L7416k3696l0670
$$ -10029 -8148 19348 7912 -27115 -7924 31566 7430 -32998 -7151 30265 6569 -24101
989b4101J8311K0731j0118q396K62m996J0097J8428j9701l0489K7286L9955l1915
$$ -24101 -5790 14941 4823 -3573 -3311 -8307 1790 20218 517 -29972 -2686 37269 5354
1002E354m5979L2891M7644l0031m4864K3270L7855j3732k6975J919J3427J0739
$$ 5354 -40625 -7734 39910 9879 -34985 -11715 26140 12408 -14567 -12648 779 11518
1014A1518J378k2567j6249L2600K9628l9413m0003M2265M6520m0679m8334L4786
$$ 11518 12896 -9671 -25920 6680 36308 -3105 -43108 -843 45677 4998 -43336 -8550
1026h550M5528k5058l8331J2558K7366J505j4128j5466l49K8036J4297l7844k6744
$$ -8550 36978 11920 -26411 -13853 13513 15018 890 -14576 -14925 13111 27408 -10436 -37180
1039c7180M3966L6107m5831m1637M2973M3126l5976m0337K5406L3746j2283k4190
$$ -37180 6786 42893 -2938 -44575 -1602 41524 5548 -34789 -9383 24363 12080 -12110
1051a2110j785J2666J5760m19k8083j1260L7685K1389m3453k8875M4900L3160
$$ -12110 -13895 -1229 14531 14112 -13971 -25231 12454 33843 -9610 -38485 6415 39575
1063C9575m2069l3835L5223L0842k5160k4853J2836J6566K51p093j3044k633K4153
$$ 39575 -2494 -36329 -1106 29736 4576 -20277 -7441 9125 9376 2283 -10761 -13394 10759
1076A0759J1370l2594j8138L7676K2311l8700k3546L6114K1938l0163j7660K1640
$$ 10759 22129 -10465 -28603 9073 31384 -7316 -30862 5252 27190 -2973 -20633 1007
1088A007J1549j1473m425Q22k764R246R086j7841j3905K4127J6508k7633j6862
$$ 1007 12556 1083 -3342 -2520 -5284 3962 13048 -4793 -18698 5429 21937 -5696 -22558
1101b2558K8264J4666k6055j0567K1526M996j5317J281Q205p432q28J2643n887
$$ -22558 5706 20372 -5683 -16250 5276 10272 -5045 -3764 4441 -2991 -3819 8824 2937
1114B937j6151J1331J7595j5071j6601J6983J3275j6802p874J4775J130j1506
$$ 2937 -13214 -1883 15712 641 -15960 1023 14298 -2504 -10378 4397 5527 -5979
1126e979O304P201j3393k797J9183j336k3061M679K4394p061k2766Q061J8347
$$ -5979 325 7526 -5867 -8664 10519 9183 -13878 -9199 15195 8134 -14632 -6571 11776
1139A1776p754j1520O264L126m050O148J480j5105J235K2744l245k8236M507L1006
$$ 11776 4022 -7498 -1234 1892 -2158 3990 5470 -9635 -8400 14344 11099 -17137 -12630 18376
1153A8376m887l0472M068K6816k465k0189J0J1283K723j071n475r691P869J9509
$$ 18376 13489 -16983 -12915 13901 11436 -8753 -8743 2540 5263 4192 -1283 -10974 -3105 16404
1167A6404r259k7697R610L3207q732l5469O758L4119l655k9263r4K1422M219j1376
$$ 16404 7145 -20552 -10942 22265 13533 -21936 -15178 18941 15286 -13977 -14071 7351 11570 194
1181A94p964J30J1212J1226j3538k1305J4456K9285j4066l4285J2142L5707q971
$$ 194 -7770 -7640 3572 14798 1260 -20045 -5589 23696 9630 -24655 -12513 23194 14223
1194A4223l3587M795K7966k2j9737m920R700R483J202j3321j1577J5830K0829
$$ 14223 -19364 -14569 13397 13375 -6362 -11282 -1582 7901 9103 -4218 -15795 35 20864
1207B0864j7005k7629J6528L1664j4475l2314J0984K9837o385k4570J233J6985
$$ 20864 3859 -23770 -7242 24422 9947 -22367 -11383 18454 12069 -12501 -11268 5717
1219E717L882p871q762j649J2595J0702j5330j8335J6556K3667j6148k6511J4333
$$ 5717 9599 1728 -7034 -8683 3912 14614 -716 -19051 -2495 21172 5024 -21487 -7154
1232g154K6377j1219k3397P274J8148k793j1210j573L362N729M370r019j1260
$$ -7154 19223 8004 -15393 -8119 10029 7236 -3974 -5547 -2185 3544 7914 -1105 -12365
1245a2365J1502J6454j2778j9667J2965K0311j1961j8674R899J4977p246r831
$$ -12365 -863 15591 2813 -16854 -3889 16422 4461 -14213 -4314 10663 3417 -6414
1257f414M212L828j078K382k071p841M653J2080o600j4655P859J5350q370j4012
$$ -6414 -2202 1626 548 2930 859 -6982 -2329 9751 3151 -11504 -3645 11705 3335 -10677
1271a0677Q233J0916p251o612N940J691m438L453K710q042j036J1449l24j3497
$$ -10677 -2444 8472 1221 -5391 549 2240 -2198 1255 3965 -4077 -5113 6336 6012 -7485
1285g485J548J3575k482j1957L078Q672l458m247L656q45l725N938L727j0405
$$ -7485 -5937 7638 5156 -6801 -3723 4949 1491 -2756 900 55 -3670 2268 5995 -4410
1299d410l544J3670L396j5349l059J5161K727j3038k269R337J565m366p30j277
$$ -4410 -7954 5716 9112 -6237 -9296 5865 8592 -4446 -6715 2622 4187 -179 -909 -2186
1313b186k86P029J213j2077k364J5969L442j8207m406J8377N212j6685n626J3018
$$ -2186 -2472 4557 5770 -6307 -8671 7298 10740 -7467 -11873 6504 11716 -4969 -10595 2423
1327B423N696p899n279J859M501M558l231j0454J505J5458M59j8908k357K0335
$$ 2423 8119 220 -5059 -3200 1301 5859 2628 -7826 -6321 9137 9596 -9312 -11669 8666
1341H666M197j9630n741J6810O802j2300p275O502O929L1o065o596M670J2369
$$ 8666 12863 -6767 -12508 4302 11104 -1196 -8471 -1969 4960 4991 -1074 -7670 -3000 9369
1355I369k816j6934P19J9720J460k0356l474J9023N131j5737o249J0921O854n047
$$ 9369 6553 -10381 -9662 10058 11518 -8838 -12312 6711 11842 -3895 -10144 777 7631 2584
1369B584o741j237O145P323n085j2571L485J6407j681j8500l17J8732J981j6984
$$ 2584 -4157 -5394 751 8074 2989 -9582 -6097 10310 8629 -9871 -10188 8544 10525 -6459
1383f459l606J3609M721q924n358L507N435K059m884p181L935J1427k642j4193
$$ -6459 -10065 3544 8265 -659 -6017 -2510 2925 4984 100 -7081 -3146 8281 5639 -8554
1397h554J216J5473J49j5024j349J2995K302r755k714N539K887j112k639l382
$$ -8554 -7338 8135 8284 -6740 -8089 4906 7208 -2547 -5261 278 3165 2053 -586 -3968
1411c968K096P161j532r944Q21J1574k51j1846j96J0696O01q526o09N534M67k026
$$ -3968 -1872 5289 3757 -6187 -5366 6208 5957 -5889 -6085 4611 5212 -3314 -3923 1611 2078 52
1427E2n0j520k85M605P19p019j016Q390J241q721j340Q140R44o404n58M024j66
$$ 52 2 -1518 -1803 2802 3521 -3498 -4514 3876 5117 -3604 -4944 3196 4140 -2264 -2822 1202 1036
1444A036j237J015j589j938M052K739n841l367O898L622o914l576O210K975m555
$$ 1036 -201 814 -775 -2713 1339 4078 -1763 -5130 1768 5390 -1524 -5100 1110 4085 -470
1459d70k058K409Q03J84O54k649k219M779L634o355m781P126N411p016n602O006
$$ -470 -2528 -119 684 868 1522 -1127 -3346 1433 5067 -1288 -6069 1057 6468 -548 -6150 -144
1475a44N244m322m329J937L021O14j222l292o41N527K617p209m280Q104N628q053
$$ -144 5100 778 -3551 -1614 1407 2021 799 -2493 -3134 2393 5010 -2199 -6479 1625 7253 -800
1491h00o420P095O691n368o170K889N177j96l618k565J619N066M61p035k572Q209
$$ -800 -7220 -125 6566 1198 -4972 -2083 3094 2898 -720 -3285 -1666 3400 3861 -3174 -5746 2463
1507B463M377q549n782P991O521o475o657M315O187j722m999j055L420L692j453
$$ 2463 6840 -1709 -7491 500 7021 546 -6111 -1796 4391 2669 -2330 -3385 35 3727 2274
1522B274n864o38P589K506q412m075Q381N282p530n924N904N880l711n347J058
$$ 2274 -3590 -4228 3361 5867 -2545 -6620 1761 7043 -487 -6411 -507 5373 1662 -3685 -2627
1537b627M296J543k827m029J129N894O56p154k231P635L592p297m473O259M890
$$ -2627 1669 3212 385 -3644 -2515 3379 4035 -3119 -5350 2285 5877 -1420 -5893 366 5256
1552E256m564m691K463M156k81l038j922J646L797j87n133j311N978K375n993
$$ 5256 692 -3999 -1536 2620 2339 -699 -2621 -975 2822 2635 -2498 -3809 2169 4544 -1449
1567a449l298N477L649m448l644K956L217j336k352m33J287K148j70l332r94M207
$$ -1449 -4747 730 4379 -69 -3713 -757 2460 1124 -1228 -1661 -374 1774 1604 -1728 -2722 1485
1583A485J990m562k588M377K866l667k871K702K383j312j741m8P34J345K86k398
$$ 1485 3475 -1087 -3675 702 3568 -99 -2970 -268 2115 803 -938 -986 -252 1093 1379 -1019
1599a019j297L112K026l314k682L222K843k622k694J722K269p45j380l61M86J235
$$ -1019 -2316 796 2822 -492 -3174 48 2891 269 -2425 -703 1566 821 -559 -920 -434 801
1615H01P83k113j688K436K624k568l163K342L336j761l201R81K577r0j685r49
$$ 801 1584 -529 -2217 219 2843 275 -2888 -546 2790 1029 -2172 -1191 1386 1296 -389 -1338
1631a338O69J622N62k246j710K608K677k550l427K289L769j656l721Q65L253J14
$$ -1338 -669 953 1515 -731 -2441 167 2844 294 -3133 -844 2925 1269 -2452 -1587 1666 1780
1647A780k427j076J362J981j28k550j152K850K295k890l189K477L732j914l826
$$ 1780 -647 -1723 -361 1620 1492 -1058 -2210 640 2935 45 -3144 -667 3065 1151 -2675
1662b675R64L619mk986r79K077J836r63k462l58K883J557k879k549K675L252k106
$$ -2675 -1711 1908 1904 -1082 -2061 16 1852 889 -1573 -1931 952 2509 -370 -2919 -244 3008 902
1679I02l631J354L649m29l260n60K641J327j591k110M70K590N89k782j647K685
$$ 902 -2729 -1375 2274 1845 -1415 -1975 666 1993 402 -1708 -1238 1352 1941 -841 -2488 197
1695A97K456k314k991J606L289r15l045k5K607Q51j861j513R58K140l9k313r47
$$ 197 2653 339 -2652 -1046 2243 1328 -1717 -1742 865 1716 -145 -1658 -700 1440 1401 -912 -1859
1712a859K308J792k027k373J489K714r15k708J62K366N23j793j161J069J546j67
$$ -1859 449 2241 214 -2159 -670 2044 1129 -1579 -1417 949 1472 -321 -1482 -413 1133 966
1728I66j881n59J846J249j620j709J212K096o65k167J03K048M35j641r59J107
$$ 966 -915 -1474 372 1621 1 -1708 -496 1600 935 -1232 -1129 919 1354 -287 -1246 -139
1744a39J370m74j581k34J536R02j379j355R14J785o03j892NJ796M38j455q93J010
$$ -139 1231 757 -824 -1058 478 1380 1 -1354 -440 1345 742 -1150 -1145 651 1089 -366 -1259 -249
1762b49J234m31j402j21J430P36j269j105Q61J466l61j632j13J620N40j396q90
$$ -249 985 554 -848 -969 461 1197 -72 -1177 -316 1150 789 -843 -956 664 1204 -192 -1082
1779a082R48J214n27j392Q0J277M30j130q71Q39J116m20j278j10J316N32j165
$$ -1082 -134 1080 553 -839 -759 518 948 -182 -1053 -214 902 482 -796 -906 410 942 -223
1796b23r04R80J152o37j254K90J246J34j061n33Q64P64m31r81j1J136L24j006
$$ -223 -1127 -147 1005 368 -886 -596 650 784 -277 -810 54 818 387 -594 -605 531 855 -151
1814a51p09P94R69o03j121L17J081lr73k42O67M49l52n32pO17M20o29o69N25R38
$$ -151 -860 -66 903 300 -821 -504 577 574 -399 -641 26 475 123 -409 -416 201 621 -8 -677 -152 786
1835G86m04r77K47R03o4q14q8N34K34k27l22j11K86N33l94p17K53R01j31j064
$$ 786 382 -595 -348 555 491 -323 -411 123 357 130 -192 -303 -17 516 122 -595 -342 559 428 -636
1855f36J20R12J4p08j03N24J64j71k05j33R0O46j91q00Q2Q86J34j042j71R69K42
$$ -636 -516 396 410 -298 -401 123 287 116 -89 -222 -132 514 323 -477 -395 491 625 -417 -588 381 623
1876F23p64l76N35K43j78k03k35J79N09M9r38q7J141J78j145l34J234L38j041
$$ 623 -141 -517 18 261 83 -120 -355 -176 333 382 -556 -643 498 676 -469 -803 431 769 -272
1895b72l69P89L90m64k67O8J03M77j61p27N8R53O1j200k16J296K75j349k05J104
$$ -272 -641 148 538 74 -193 -125 -22 455 294 -433 -375 578 639 -561 -777 519 794 -555 -760 344
1915C44J75p05k27M11J18Jj5m71N0P91L9j082n6J266O6j292j3J175L0j009L9O93
$$ 344 519 -186 -413 -2 116 117 102 -369 -319 472 511 -571 -627 639 705 -587 -600 575 605 -404 -365 328
1937C28j13l29J04n5j04L82L1n83r4Q89l0j048J57J084l15j036M89Q47m47o86
$$ 328 215 -114 -10 -65 -169 213 244 -339 -433 456 426 -622 -465 619 304 -732 -243 604 157 -529
1957e29M48M73m84m0L44j91j83M28n5o13K07P77m48q69P37P41q60o88R75N50j009
$$ -529 -81 392 -92 -132 212 21 -162 266 211 -402 -195 582 134 -735 2 743 -117 -805 170 720 -289
1978b89l80Q96J71o54j8M32j74JK46k64m06P43L68j102l30J301L86j412l61J432
$$ -289 -669 227 398 -256 -274 158 -16 -15 231 -33 -439 304 672 -430 -760 541 927 -485 -846 586
1998E86K47j276j25R49M6n69j21J45M9L37J6r06j6J274O5j533j16J720J38j684
$$ 586 833 -443 -568 381 427 -142 -263 -118 -69 268 284 -622 -638 636 701 -832 -948 772 910 -774
2018g74o2J480J53j219p7O82J33j60j34m34K00R75k51j372J96J700j74j923K48
$$ -774 -836 644 797 -422 -499 183 316 156 22 -412 -212 763 512 -860 -664 1036 862 -1061 -813
2037h13J671j16j562J30J111K1o71p2J37J45N13l20r63L50J399l30j700M51J696
$$ -813 858 742 -820 -690 421 442 -229 -301 -164 -19 494 174 -789 -439 960 630 -1070 -619 1077
2056A077l78j595L49J343l62r50K79M76j97K8P9n36j0R86j93j189K93J331m02
$$ 1077 699 -896 -547 796 434 -516 -237 239 42 70 149 -387 -397 589 396 -793 -500 831 429
2075D29j337N06J213n50r30O20M45n21p5N25l10m64P43K64r47j64J087q0j015
$$ 429 -908 -402 811 261 -669 -49 396 -125 -200 325 15 -449 294 558 -389 -553 534 454 -561
2094e61K66R48n92n76O88J81p67J31Q72n38q84P94Q60r22p70J093N05r37k22O49
$$ -561 -295 653 61 -515 173 354 -413 -282 590 52 -832 -38 822 -100 -870 223 728 -209 -431 218
2114B18j4l36M12j60n64N08P39p83j043J140J136j290j198J272J073j161r12Q65
$$ 218 204 -132 280 120 -444 64 803 20 -1023 117 1253 -37 -1235 37 1110 -51 -963 -98
2132i8O23l96k86o1j77O95M19j085q30J565J113j782j321J772J457j655j313J267
$$ -98 525 129 -157 -218 -395 300 719 -366 -1196 369 1482 -300 -1621 151 1608 -47 -1360 -93
2150i3J204p66q94J20N86M04j27j136k60J598P52k029j022K128J303k099j402
$$ -93 1111 345 -549 -429 157 561 434 -702 -962 636 1388 -641 -1663 465 1768 -331 -1733
2167a733J784J438j372j294P81J033r0o27o83K38J381K08j901n83K242R46k357
$$ -1733 51 1489 117 -1177 -396 637 547 -80 -763 -525 856 1064 -837 -1420 822 1768 -589
2184e89j232K242J321j850j358J299J236o67r78q0N88Q36k27j495j38J923O30
$$ -589 -1821 421 1742 -108 -1466 -167 1069 402 -576 -656 -68 768 541 -954 -1092 831 1461
2201A461k285q10K245J089k137j040J703R78j135q09N09N12K58k73q50o9J376
$$ 1461 -824 -1634 611 1700 -437 -1477 226 1204 69 -740 -231 281 539 266 -584 -653 723
2218G23L29j807n16J927P33j988p61J668P63j328n46Q56K34j85o0l33k30R10M90
$$ 723 1052 -755 -1271 656 1389 -599 -1360 308 1071 -257 -803 53 287 102 42 -291 -521 389 879
2237H79j261o53J507O65j450p43J407N63j146k91P28R2l60K82j88o22N77Q55q85
$$ 879 -382 -1035 472 1137 -313 -1056 351 914 -232 -523 205 297 -63 219 31 -591 -14 841 -44
2256d4j074J107J033j088r39R86P58p70l83L60K7L1L93l26q09P04J091q69j383
$$ -44 -1118 -11 1022 -66 -1005 -19 739 -31 -414 -54 -27 4 397 71 -738 -34 1057 188 -1195
2275a195R96J542j007j452P77J238n24q23R7L66K76J69o39p97R96J247j146j642
$$ -1195 -199 1343 336 -1116 -339 899 375 -448 -351 15 291 460 -179 -976 20 1267 121 -1521
2293a521J154J925j090j946Q33J806m32j525R9R61M05l35q55l39J286R34j455
$$ -1521 -367 1558 468 -1478 -645 1161 729 -796 -697 264 669 334 -521 -860 426 1360 -95
2310i5j567J490K018j456k244J234K178q27j953K84J578K72j050p33L04J247M51
$$ -95 -1662 -172 1846 390 -1854 -620 1558 731 -1222 -938 640 912 -138 -871 -567 680 1131
2327A131j603j126J796J726j860k002J604K203j189k201P36J936k39j466l57Q64
$$ 1131 -472 -1598 198 1924 64 -1938 -334 1869 680 -1521 -785 1151 912 -554 -911 -47
2343d7R12j47j429o35J810J215j927j722J829K048j557k142J139K036o09j638
$$ -47 865 718 -711 -1346 464 1679 -248 -1970 -141 1907 350 -1792 -653 1383 774 -864
2359h64J7J145N44n75j003r2J428P33j674j204J687J702j679j831J311J805r64
$$ -864 -847 298 842 267 -736 -828 600 1333 -341 -1545 142 1844 165 -1666 -355 1450 486
2376D86j616N50J169k4o53n52J21R53N01j262r39J411J278j446j452J276J507
$$ 486 -1130 -580 589 565 -88 -640 -519 434 935 -327 -1266 145 1423 -23 -1475 -199 1308
2393A308j001j361P04J021k87n22j38j0O01M27p88r93R94J219r37j467R23J399
$$ 1308 307 -1054 -350 671 384 -138 -276 -286 315 742 -46 -1039 -45 1174 237 -1230 -307 1092
2411A092p60j137M12Q67j84l54k13j08L72P36n87j119O73J417o19j573N68J511
$$ 1092 332 -805 -393 474 290 -64 -277 -385 -13 723 136 -983 -310 1107 488 -1085 -517 994
2429I94l86j321J35R82O7l45m28j80N27P47n91j314O09J755n61j941L88J909j75
$$ 994 608 -713 -578 404 471 126 -302 -482 45 792 201 -1113 -504 1251 690 -1251 -863 1046 871
2448H71j668j01J274L78o76n77qQ17O40q45j335Q77J799o98k180M20K343k07k128
$$ 871 -797 -898 376 754 78 -499 -507 310 950 105 -1230 -353 1446 748 -1432 -1012 1331 1124 -1004
2467a004k13J816N35j210q49M43J116K74j180j111J169J712r92k153P82K429m65
$$ -1004 -1217 599 1134 -76 -925 -482 634 908 -272 -1383 -214 1498 506 -1647 -865 1564 1099
2484A099k441J11K142L56j652p64J036J037j69j310n67J359J292j275j983J160
$$ 1099 -1342 -1231 911 1267 -385 -1149 -113 924 755 -555 -1122 237 1529 254 -1729 -569
2500e69K271q32k387L17K369J03k009n11J422Q53o98j199pJ338Q27j361j482J184
$$ -569 1702 870 -1517 -1200 1169 1272 -737 -1248 174 1027 329 -870 -877 461 1288 -73 -1555 -371
2518c71J985q78k289O72K283k78k074j12J556N64r96r17L58J042L75j108j038
$$ -371 1614 736 -1553 -881 1402 1124 -950 -1062 494 1058 62 -855 -497 545 920 -188 -1226
2535a226J066J611j033j923P25K089m17j985J43J573K55j156n15N56P58J69q43
$$ -1226 -160 1451 418 -1505 -780 1309 892 -1093 -950 623 878 -278 -793 -237 521 690 -153
2552a53q48R19J300p92j649N62J854l97j721R7J432K44j054l95M16O03J50o70
$$ -153 -1001 -82 1218 426 -1223 -661 1193 796 -925 -828 604 848 -206 -601 -185 418 568 -102
2570a02p78O80J194m81j573L44J695p7j641j70J390L94r68n12L36O44K09n74q43
$$ -102 -880 -200 994 513 -1060 -716 979 902 -739 -909 481 875 -93 -605 -269 375 584 10 -833
2589h33N56J273l50j633J18J793Q8j730l78J492N27r81p11M04P55K58p47q25N79
$$ -833 -277 996 646 -987 -869 924 1012 -718 -1096 396 923 -58 -769 -365 390 648 -99 -924 -345
2608c45J445l83j778Q6J937L05j980n20J610Q87j225j011N96J027J20j020p83
$$ -345 1100 717 -1061 -975 962 1267 -713 -1233 377 1264 39 -972 -376 651 771 -249 -1032
2625a032Q14J423n84j892K52K164J56k290n43K022R56j664j046R77J259k69j243
$$ -1032 -218 1205 621 -1271 -1019 1145 1301 -989 -1532 490 1446 -218 -1264 -287 972 703 -540
2642e40m62J106J121q24j780N74K148j12k290l27K220P20j891j135J402J250p47
$$ -540 -1002 104 1225 401 -1379 -805 1343 1231 -1059 -1386 834 1554 -337 -1472 -70 1180 433
2659D33j335KJ273Q14j100j476P78J954l62k174j36K286M78k037q79J631J177
$$ 433 -902 -900 373 1187 87 -1389 -611 1343 981 -1193 -1329 957 1435 -602 -1481 150 1327
2676A327j061j239L14J272M10j125j155R78J616n54k017J49K130K23k010o11J679
$$ 1327 266 -973 -659 613 1023 -102 -1257 -279 1337 783 -1234 -1085 1045 1268 -742 -1353 326
2693C26R23j254j080O21J144R3j119o31P78J337n88j697K31J934J62j935m84J681
$$ 326 1249 -5 -1085 -464 680 773 -346 -977 -199 1138 550 -1147 -916 1018 1180 -755 -1239 442
2711D42P33j258q68O99R28j16q52n66P59J069m37j530R5J751J80j691n52J488
$$ 442 1175 -83 -951 -252 676 560 -292 -858 -99 970 533 -997 -902 849 1029 -662 -1214 274
2729B74Q05j160q96O83R05l5p98n61O73J027l84j325j7J573M04j673o41J422R07
$$ 274 1079 -81 -977 -294 611 576 -222 -783 -110 917 533 -792 -809 764 1168 -505 -1146 276 1183
2748A183j115j018N82J053q7r11m76O68R17k93j339r0J593M91j684q14J530J062
$$ 1183 68 -950 -368 685 598 -313 -789 -121 796 503 -836 -926 667 1158 -526 -1340 190 1252
2766A252j083j235O31J214l2j112m96P75J040l54j489m1J752M46j845q43J658
$$ 1252 169 -1066 -435 779 747 -365 -861 -86 954 600 -889 -930 822 1268 -577 -1420 238
2783B38J206j329j386Q58J373k53j343l69J027J098p41j476K43J702L42j914p18
$$ 238 1444 115 -1271 -413 960 707 -636 -1005 22 1120 379 -1097 -854 848 1190 -724 -1442
2800a442J804J166j519j445J068J532m95j437j83J280Q10r36j360M82J737Kj912
$$ -1442 362 1528 9 -1436 -368 1164 669 -768 -951 329 1139 203 -1157 -675 1062 1064 -848
2817h48n46J913J023j711j343J234J560p00j592J05J390O02j102j114O68J570
$$ -848 -1394 519 1542 -169 -1512 -278 1282 582 -1010 -905 485 1087 -15 -1129 -461 1109
2833A109j55j837l69J911Q59j811j208J444J416r12j559L57J488J65j173p82Q05
$$ 1109 954 -883 -1252 659 1518 -293 -1501 -57 1359 447 -1112 -755 733 898 -275 -1057 -252
2850b52J276k98j702r4J783O15j724j019J434J324j048j462N70J408m2j085n75
$$ -252 1024 726 -976 -1070 713 1328 -396 -1415 19 1343 295 -1167 -597 811 769 -316 -891
2867h91Q29J053l80j444l7J566M71j477j043J364J310j062j379N87J306n9j174
$$ -891 -62 991 611 -833 -870 696 1167 -310 -1353 11 1321 259 -1120 -533 773 714 -460
2884d60m70Q22R68l96j239q8J474N04j455q86J259J206r64j356N69J296p0j100
$$ -460 -930 -108 860 464 -775 -863 611 1115 -340 -1226 33 1239 275 -1081 -512 784 714 -386
2902c86m23Q01Q57m12j200k7J324N57j396r39J246J238r49j380M97J434n4j222
$$ -386 -809 -8 849 437 -763 -790 534 1091 -305 -1244 2 1240 291 -1089 -592 842 788 -434
2920d34m51R01R22n15j155n6J386M72j385r04J238J306r61j541O23J480j21j349
$$ -434 -885 16 938 423 -732 -788 598 1070 -315 -1219 19 1325 364 -1177 -554 926 805 -544
2938e44m22J003R58o80j223Q9J487L68j430r64J401J310j073j555O76J610q7j610
$$ -544 -966 37 995 315 -908 -819 668 1036 -394 -1358 43 1353 280 -1275 -599 1011 924 -686
2956f86l06J299P57q30j205L30J414K58j513q00J432J259j204j537P85J668l41
$$ -686 -992 307 1064 234 -971 -641 773 1031 -482 -1282 150 1409 205 -1332 -547 1121 780
2973G80j637j74J402P24j080j092N77J364j1j505n54J456J149j383j372R45J687
$$ 780 -857 -1031 371 1095 15 -1077 -500 864 853 -652 -1206 250 1399 16 -1356 -411 1276
2990A276m73j717o6J562N52j280q83P27J302j81j565l23J432Q75j361j253J094
$$ 1276 803 -914 -980 582 1134 -146 -1029 -302 1000 819 -746 -1069 363 1238 -123 -1376 -282
3007b82J491o94j560J73J538L01j206p77Q47J129m06j259k26J384O96j344j049
$$ -282 1209 515 -1045 -872 666 967 -239 -1016 -169 960 554 -705 -931 453 1149 -195 -1244
3024a244J069J410p01j536K70J475J79j257o38R16R73m60j190j06J270O26j209
$$ -1244 -175 1235 534 -1002 -732 743 922 -335 -973 -57 916 456 -734 -840 430 1056 -153
3041a53j035J004J360o63j545K82J482J30j245n63R17R94n12j143p3J235N25j157
$$ -153 -1188 -184 1176 513 -1032 -750 732 862 -383 -946 -29 965 453 -690 -763 472 997 -160
3059a60r74R63J292o72j446K58J474J25j316n32J016Q71o11j079P8J224M45j186
$$ -160 -1134 -171 1121 449 -997 -739 735 860 -456 -988 28 899 288 -791 -713 511 956 -230
3077b30q77R62J253o68j482K96J559Q3j307n80J061R33o89j143K16J223L55j297
$$ -230 -1107 -145 1108 440 -1042 -746 813 896 -411 -991 70 1003 314 -829 -613 610 965 -332
3095c32p75J033J218p42j518M31J528Q0j444n55J248Q41q02j125L19J287K60j304
$$ -332 -1107 -74 1144 402 -1116 -685 843 923 -521 -1076 172 1013 211 -914 -595 692 952 -352
3113c52p35J202J115q85j415M16J610q0j497l91J331P27r18j147M37J347O0j289
$$ -352 -1087 115 1230 345 -1070 -654 956 876 -621 -1012 319 1046 128 -1019 -582 765 825 -464
3131d64n73J168R92r34j325N95J543j65j556l17J365P54j102j001O15J248l8j364
$$ -464 -1037 131 1123 189 -1136 -541 1002 837 -719 -1036 329 1083 -19 -1020 -405 843 805 -559
3149e59m58J235R34j002j255O27J495j87j548k48J418O63j219r75Q60J139l14
$$ -559 -1017 218 1152 150 -1105 -478 1017 830 -718 -966 452 1115 -104 -1079 -219 920 606
3166F06j231k97J264P09j094j048P20J376l13j485j9J402M37j195q74Q53J115
$$ 606 -625 -922 342 1051 -43 -1091 -371 1005 692 -793 -812 590 1027 -168 -1042 -189 926
3183I26m29j126j51J177N69j075r60P31J314l98j430M0J348M14j183p70R24R78
$$ 926 497 -629 -780 397 966 -109 -1069 -338 976 578 -852 -812 536 950 -233 -1003 -79 899
3201H99m81j142J2J172M71j064q38P87J157m39j333K5J326L61j134p46Q72J040
$$ 899 418 -724 -712 460 931 -133 -971 -184 973 534 -799 -774 552 913 -221 -967 -95 945
3219I45n79j087K5J115M14j058p40P41J141m44j319O1J352K91j169o65R45R71
$$ 945 366 -721 -696 419 833 -225 -965 -224 917 473 -846 -785 567 858 -311 -976 -31 940
3237I40n83j118J36J155L32j020q10Q73J093m96j314N9J351K40j190o22R00J053
$$ 940 357 -761 -625 530 862 -158 -968 -95 998 502 -812 -753 598 838 -352 -974 -74 979
3255I79o98j134K52J158K12j015p40R56R54m88j311J80J391K16j298n77J043R56
$$ 979 281 -853 -601 557 769 -246 -986 -30 924 436 -875 -695 696 912 -386 -963 80 1036
3273A036q31j038K61J221J00j129n55R53R41o45j210K16J410Q7j316n48J222Q07
$$ 1036 205 -833 -572 649 749 -380 -935 18 959 314 -896 -680 730 817 -499 -1047 175 982
3291I82q23j049L81J222J5j162m61J055Q29p13j200M16J253J3j291m03J142P88
$$ 982 159 -890 -509 713 728 -434 -895 160 989 276 -924 -508 745 758 -533 -936 206 994
3309I94q98j030N58J095m0j201l67J051P45p81j036M48J256j28j254k44J117O93
$$ 994 96 -934 -376 719 679 -522 -889 162 907 126 -910 -462 794 666 -588 -832 285 978
3327I78r27r72O35J067k36j118j73J023O44q24j007N63J118j10j194k39J120N21
$$ 978 51 -921 -286 781 545 -573 -746 277 921 97 -910 -347 771 661 -533 -772 348 869
3345H69r06q72O59J015k70j139p9J054M91q11r31N85J116j90j174j91J157N22
$$ 869 -37 -909 -250 765 495 -644 -723 331 822 11 -920 -335 781 591 -583 -774 383 905
3363I05r70q06O95J038l94j031j34J074M46q84p55N64J040l11j082j25J104M63
$$ 905 -65 -871 -176 862 468 -563 -697 377 823 -61 -816 -252 788 477 -605 -730 374 837
3381H37r90p53P84R10l36j183M8J082L60q88o69O17J016l54j137l1J145M12j077
$$ 837 -153 -906 -122 788 452 -731 -683 399 759 -129 -798 -181 835 481 -656 -687 458 870 -207
3400b07o68P88R87n04j051M0J078L57r99p24P75R31m08j122N7J172L41j076o51
$$ -207 -875 -87 900 396 -655 -615 463 820 -179 -903 -128 803 395 -727 -670 502 843 -233 -884
3419h84Q20R46n55j066J66J089J63r01n52P37Q45m33j108J39J137K23j037n50
$$ -884 -64 882 327 -739 -573 516 679 -222 -774 -37 808 375 -733 -594 543 766 -271 -821
3437h21Q48P96o09r90K76J009J89r97n28P84Q52n87r73K86J015J61j048m55Q30
$$ -821 27 823 214 -776 -500 509 698 -299 -827 -43 809 222 -751 -465 550 711 -337 -792 38
3456C8Q42o25j019L42J079K5j035m32Q97O72n53r63K58J054Pj013l28Q36P03o65
$$ 38 880 255 -764 -422 657 682 -353 -785 112 784 231 -732 -474 580 587 -426 -754 82 785 120
3476A20r10M14R94k8j001l20Q27O06n96q17L14R88M1r99l76R17O10o79q18L81
$$ 120 -790 -376 618 590 -411 -731 96 702 106 -711 -397 591 632 -367 -743 174 784 105 -713 -332
3496c32R55o8j002k74R03N70o22q41L47R01L2r97k84Q77O25p65q01M34R83j02
$$ -332 623 555 -447 -721 182 752 130 -711 -364 537 569 -428 -712 165 790 25 -776 -342 641 539
3516E39r68k07P99N51o60p78L97R95j73r70k12R05N67p59p14L84R46j77r83j23
$$ 539 -429 -636 163 714 54 -724 -327 668 495 -475 -687 218 785 26 -688 -304 642 465 -518 -641
3536f41Q89M81p31p15M77R02k45q91j57Q86N27q18p47O24Q30j90r64j56R17M17
$$ -641 248 729 -2 -717 -240 662 417 -474 -631 255 782 -36 -783 -159 671 481 -483 -639 278 695
3556F95o96p00M75Q84k01j054J0R15L47q02n52M81Q47k10r79rQ86L27p98n96O16
$$ 695 -1 -701 -226 658 457 -597 -587 328 675 -127 -679 -198 649 439 -540 -549 337 664 -134 -730 -114
3577a14P64k66r13j6R22K95p61o21O18P74l10q90oQ88K35q11n04O25P62l99q47
$$ -114 650 384 -529 -545 377 672 -89 -710 -92 682 372 -518 -524 364 599 -212 -716 -91 671 272 -575
3598e75P3Q67J93p95m56O15P38m02q53J01R15J83q28m59O69P26n10p40J06Q75
$$ -575 -502 365 558 -237 -693 -78 660 258 -595 -494 421 604 -224 -683 -14 712 202 -538 -432 443
3618D43J90q06m58N89O94m08p99J56P88K26q89l68O46O28m28p67J36Q81M1p77
$$ 443 633 -173 -631 -42 652 244 -555 -399 389 615 -274 -642 4 632 204 -563 -427 454 495 -282
3638b82m13O97O27m65p61J98Q48O9q00l65P64N28m62p68K90P76L0p66l19P12N02
$$ -282 -695 2 629 164 -597 -399 449 518 -282 -647 117 645 183 -585 -295 481 511 -255 -574 138 640
3659F40n41o80L11P26L8p85l59P26N58m82p48K34Q38Jq42k19P03N39n63o89K68
$$ 640 99 -581 -270 456 494 -291 -650 76 634 152 -596 -362 476 477 -365 -584 119 658 95 -594 -326
3680c26Q18m4p55k76P31M75n90o93L81P90o7q10j94O92M88n47o76L48P78p1q59
$$ -326 492 448 -307 -583 148 623 33 -660 -279 511 444 -366 -560 132 620 73 -603 -255 523 452 -407
3701d07j17P29M38n52o73L36P66q5p99r1P00L46n60o15L86O99j35p99j62Q36L47
$$ -407 -524 205 643 91 -582 -246 520 435 -364 -455 245 591 31 -584 -198 501 366 -433 -595 241 588
3722E88o45n50M27P29j70q59k4P55L39o74n67N43O76j98q15l8P60K54o06n47N50
$$ 588 -57 -607 -180 549 379 -480 -504 251 590 -84 -651 -108 568 370 -445 -483 277 531 -75 -622 -72
3743g2O11j51q17k7P41K62o36m70M73O45k73o86j2P35J79o47m60N40N76k20p46
$$ -72 539 388 -429 -456 285 547 -89 -559 -86 559 286 -400 -412 323 502 -145 -605 -65 511 291 -455
3764d55k0P38K25o14m19N28N56l00o47M1O78J42n59m46M75O40l23o90J5P48J70
$$ -455 -475 263 488 -126 -545 -17 539 239 -408 -367 311 453 -106 -552 -77 563 240 -450 -435 313 483
3785D83o30l90N19N61l47o91J41O80J51o77k52M00N25k89o11J18O45L8n57l20
$$ 483 -147 -537 -18 543 196 -495 -354 326 477 -200 -452 -52 473 184 -427 -309 336 374 -183 -503
3805e03N01N37l92n67P7P25O3o79k68N37M96l28o48R4P08M1n99l02N81M33l99
$$ -503 -2 535 143 -424 -347 378 441 -238 -506 31 527 199 -449 -355 353 394 -205 -507 74 507 108
3826A08n38J46O89L1o79k36N46M96m15o24J96P02K4p24j82N22M55m44n56K04O37
$$ 108 -430 -284 405 436 -243 -479 67 563 148 -476 -280 422 446 -278 -460 62 517 73 -483 -279 358
3847C58K0o70k19N87L76m11n52K49P42j14o43j81N77M46n26n70L86O15j54n74
$$ 358 378 -292 -511 76 452 41 -511 -262 480 366 -277 -458 119 565 39 -531 -145 470 316 -258
3867b58j64N11M18m72m91K17O82q7p25j18O33M26n95m74L56O36j98o36q4N82L17
$$ -258 -422 89 507 35 -456 -239 443 356 -369 -487 146 572 -23 -497 -141 495 297 -339 -423 159 476
3888D76m93m38L22N72j26o35o3O56K13n26m75M24N33j55n95m5N82K15n06m28L60
$$ 476 -17 -455 -133 439 313 -322 -385 271 484 -42 -517 -93 440 285 -310 -355 227 442 -64 -492 -132
3909a32N38j15o31o8O96J37n69k88L48N53k63n62j2N53K57n22l66L95M88k31n09
$$ -132 406 291 -340 -408 288 425 -144 -432 -84 469 206 -356 -368 185 442 -80 -446 -51 437 206 -303
3930c03n7O18J57n68k58L73M53k04n74k8O32J54n39k89L43M80j81n93J2O27J58
$$ -303 -360 258 415 -153 -411 -38 415 211 -363 -391 241 395 -144 -433 -90 390 209 -384 -372 255 413
3951D13n33l04M38M83l44n44J06N56J18m76k89L90M19k40n71J21N42L0n04k01
$$ 413 -120 -424 14 497 153 -391 -285 271 389 -87 -376 14 433 193 -378 -257 285 315 -189 -390
3971c90M10L56k69n26J90N13L9n37k07M13M51l31m89J16N23P4m93k56N00L27l49
$$ -390 20 376 107 -419 -229 284 323 -214 -421 -8 443 112 -377 -261 262 336 -157 -413 87 414 65
3992F5m45J55N83k7m96k72N26L24l41m69J52N44on19j67M52L35l30m71K13M79
$$ 65 -380 -225 358 331 -165 -437 89 413 72 -397 -245 299 293 -226 -393 59 394 64 -407 -194 285
4013B85j0m92j30M00L02k93l89O1N70k1n41j27M88L27l98m58K47N00m0n36j23
$$ 285 275 -217 -347 53 355 62 -327 -266 304 283 -258 -385 103 430 32 -426 -179 321 281 -255 -378
4034c78M90L10m07m10K33N29r6m96j22N16K94m66m17L67M39j46m94q0M85K23l76
$$ -378 112 422 15 -395 -162 367 271 -225 -347 169 463 -3 -420 -53 386 240 -254 -334 151 374 -2
4055bl51K44L85k0m92j24N00K84n01l04K58M58j75m73L7M59J53l67l31K71M17
$$ -2 -353 -109 276 256 -236 -360 140 424 -77 -381 -123 335 160 -313 -276 183 336 -31 -362 -91 326
4076C26q7n47RM55K30m45l62L56M24j09n38M3M26J62m06k28K56L46j79m22J3M86
$$ 326 239 -308 -299 156 386 -59 -421 -65 359 250 -288 -245 181 343 -63 -291 -35 311 132 -290 -277 209
4098B09J29m02l11L37L54j97m05jM89J03m10k31K67L86j82m28N1N07J03m73k62
$$ 209 338 -64 -375 -38 316 119 -286 -287 202 305 -105 -336 -69 317 135 -293 -242 265 368 -105 -367
4119c67L77K94k02l56jM12J68m46j80L27K50j47m07P3L52J42m33k29L80L55k87
$$ -367 10 304 102 -254 -255 157 325 -121 -301 26 276 129 -278 -205 147 289 -144 -373 7 362 75
4140G5m03J10M20L6l71k07L54L48k38m17J15M00M1m25k15L90L25k61m06J81L61
$$ 75 -328 -218 202 238 -133 -340 14 362 124 -293 -178 222 263 -162 -377 13 338 77 -329 -148 213
4161B13J4l31k63M35K71k30m05J27M66j3m14j69M34K06l15l61J77M14m6m30q1
$$ 213 227 -104 -367 68 339 109 -296 -169 297 284 -130 -299 135 341 26 -335 -158 256 210 -220 -301
4182c01M24J88k37m14K37L74l7m65j01L96K81k79m21K26M47j27m43l6M03J84l28
$$ -301 123 311 74 -340 -103 271 234 -231 -332 64 345 66 -355 -129 318 191 -252 -288 115 299 -29
4203b9k98K17L38l0l67j11L84J93k75l64K33L73n2m94j3M34J65l29l02K13L68
$$ -29 -327 -110 228 198 -169 -280 104 297 22 -342 -109 264 212 -282 -295 139 304 -25 -327 -114 254
4224B54q2l82pL74J06l54k06K49L24p8m63J7M52O8k61k89K29L14j01l76J9L23
$$ 254 172 -210 -217 157 263 -91 -297 -48 276 198 -265 -248 204 272 11 -278 -49 265 164 -212 -193 130
4246A30J29k85k87K68L78k03l36N9L40P8l83k04L40K43j63l51L7L69P3l15k18
$$ 130 259 -26 -313 -45 333 130 -206 -147 193 271 -112 -316 24 267 104 -247 -210 159 232 -83 -301
4267c01L08K90k33k92L9L87J5k91j74K77J74q9l19rL28J32k98j81K54K63j75l46
$$ -301 7 297 64 -228 -189 198 213 -78 -252 25 199 110 -209 -218 110 242 -56 -237 17 280 105 -241
4289b41R1L67l4l34r3K35K97k23l11Q3L76N1l86j63K86K79k07k82N4L69nl36j36
$$ -241 -150 217 183 -151 -244 -9 288 65 -246 -163 213 264 -122 -285 1 280 73 -209 -155 214 209 -127 -263
4312b63K93J44r5k81K6L28O3l62j35L22K51k51k70J39L45J3m06r9L27J51k22k64
$$ -263 30 174 79 -202 -176 152 215 -147 -282 40 291 40 -230 -91 254 267 -139 -238 89 240 18 -246
4334b46J09L39K4m09o7L01K40k02l87J56L84m5l45r0L25J81l52j75J58L40n4m00
$$ -246 -137 202 226 -183 -250 51 291 89 -298 -142 242 197 -148 -238 87 268 -84 -259 -101 239 185 -215
4356b15l5L52J85l18k61K49L32j76l41l0L96R3k85k11K22K78j25l09j3L30N2j92
$$ -215 -250 102 287 -31 -292 -43 289 113 -228 -258 138 231 -54 -265 -43 235 110 -199 -212 118 170 -22
4378b2k21K23K79j61l48J09K49J10l43j09K08L01j61l04k3L94L9k86j89K60K46
$$ -22 -243 -20 259 98 -250 -141 108 218 -125 -234 -26 275 114 -190 -213 181 220 -66 -255 5 251
4399B51j38l39K4L87Jk82j73K56K34j23k98O2L05K4k74j13J92K47j59k94N5L13
$$ 251 113 -226 -202 185 186 -96 -269 -13 221 98 -200 -138 167 191 -83 -196 -4 243 84 -210 -155 158
4421A58N8l06p0K28J39p8k69%K49Q9k70j46J99K56j63k54LL66O7l86q4K48J44
$$ 158 216 -90 -160 68 207 129 -140 -140 109 198 -72 -218 -19 237 74 -180 -177 189 256 -130 -214 34 178
4444A78j74k57J30K92J5k78j54K61K39k01k68R5L17j5k37j58L05J72j84k86R1
$$ 178 4 -253 -123 169 184 -94 -248 13 252 51 -217 -122 195 180 -57 -215 90 262 78 -208 -117
4465a17K85j7k01j61K95J32j89k11R3K85q2l11l8K83J29j42k90J27L16o2k32r1
$$ -117 168 151 -50 -211 84 216 27 -184 -91 194 112 -199 -237 46 175 33 -257 -130 186 124 -108 -199
4487a99L18J14k06k67J23M07j37k90m6L30Q6k27k10J87K09m3l03m0K97J19j86
$$ -199 119 233 27 -240 -117 290 153 -137 -183 147 233 6 -204 -17 192 149 -154 -194 103 222 36
4508C6k90J58L24j70k31r1L66Q1k73j14J62K56j41k26n2K85J34k51k16J78L33
$$ 36 -254 -96 228 58 -173 -264 102 183 -90 -204 -42 214 73 -153 -205 80 214 -37 -253 -75 258
4529B58j51k80n5L68J19l26j54K00K52r8k79L6K48R8k73j95J64L04j56k65K8K65
$$ 258 107 -173 -228 140 259 -67 -221 -21 231 133 -146 -110 138 236 -37 -232 -68 236 80 -185 -157 108
4551A08J03k63j87K57K30j83k32J7L20k0j95k15K78J76j03l14L2L54N4l37q5K44
$$ 108 211 -52 -239 18 248 65 -167 -150 170 150 -45 -260 18 194 91 -223 -191 163 217 -120 -205 39
4573C9J75j24k69N7K79J8k93p6K43J78j50k38M3L08ok83j28K38K16j52k13K0K30
$$ 39 214 90 -179 -122 157 175 -118 -194 49 227 77 -161 -118 190 184 -99 -227 11 227 75 -138 -118 112
4596A12j6k12k7J54J34j68j72Q4K76j8k54q8K86J15k11j75J11K02K5k41j59K72
$$ 112 96 -116 -143 11 145 -23 -195 -111 165 147 -107 -195 91 206 -5 -180 -69 133 158 -83 -242 30
4618C0K27k11k05O6L07p8k71o8K92J28k43j36R6K02k6k28q0K51J25j76k23Q2K69
$$ 30 257 46 -159 -93 214 136 -135 -203 89 217 -26 -162 -66 136 110 -118 -198 53 178 2 -221 -139 130
4641A30O0l44j4K20J58j95j94R3K67q1k63n0K73J78k63j70J03K47kl01QK21J73
$$ 130 190 -154 -168 52 210 15 -179 -86 181 100 -163 -213 60 238 -25 -195 -92 155 153 -148 -140 81 254
4664B54k31k35J37L03j03k99j4K90J11k61j59J80K47r4k86J4K70J17l11j71K66
$$ 254 23 -212 -75 228 125 -174 -188 102 213 -48 -207 -27 220 126 -160 -146 124 241 -70 -241 25
4685B5J97j66j68l2K89k6j61j77J39K89r7l19OL47M9k94j59K68K18j64k61O5K66
$$ 25 222 56 -112 -144 145 119 -42 -219 -80 209 112 -207 -201 146 195 -99 -258 10 228 64 -197 -132 134
4708A34M1k45r5J94J98j18l21P7K73P4k97j34K76J44j54k76Q6K94n6k32p8J97
$$ 134 175 -70 -165 29 227 109 -212 -135 138 212 -85 -219 57 201 47 -229 -143 151 95 -137 -215 -18
4730a8J82j26k32J00K45k3k42j35L25J48k12k32R4L19K9l39k3J89J59j15k06J8
$$ -18 164 38 -194 -94 151 128 -114 -249 76 224 12 -220 -126 193 222 -117 -140 49 208 93 -113 -95
$$ [...]
8191A13
##END NTUPLES=NMR FID
##END=
