##TITLE=1H_LY-DMAA1-PER.3
 
 8 sc, 
 20.1.2022
##JCAMPDX= 6.0         $$ Bruker NMR JCAMP-DX V2.0
##DATA TYPE= NMR FID
##DATA CLASS= NTUPLES
##ORIGIN= UXNMR, Bruker Analytische Messtechnik GmbH
##OWNER= root
$$ XWIN-NMR		Version 3.5
$$ Thu Jan 20 11:16:47 2022 Russian Standard Time (UT+4h)  she@DPX200
##.OBSERVE FREQUENCY= 200.131346
##.OBSERVE NUCLEUS= ^1H
##.DELAY= (6, 6)
##.ACQUISITION MODE= SIMULTANEOUS
##.ACQUISITION SCHEME= undefined
##.AVERAGES= 8
##.DIGITISER RES= 18
##SPECTROMETER/DATA SYSTEM= spect
##.PULSE SEQUENCE= zg30
##.SOLVENT NAME= CDCl3
##.SHIFT REFERENCE= (INTERNAL, CDCl3, 0, 15.7039)
##AUDIT TRAIL= $$ (NUMBER, WHEN, WHO, WHERE, WHAT)
$$ ##TITLE= Audit trail, XWIN-NMR		Version 3.5
$$ ##JCAMPDX= 5.01
$$ ##ORIGIN= Bruker BioSpin GmbH
$$ ##OWNER= she
$$ F:/spectra/data/she/nmr/H-F/1/audita.txt
$$ ##AUDIT TRAIL=  $$ (NUMBER, WHEN, WHO, WHERE, WHAT)
(   1,<2022-01-20 11:15:44.10 +0400>,<she>,<DPX200>,
      <created by zg, POWCHK disabled, PULCHK disabled
       configuration hash MD5:
       00 E9 B6 7A A2 85 ED C7 34 08 36 98 17 FE 4E 26
       data hash MD5: 16K
       33 00 9C BD 3E 5D C8 E4 C7 CD 76 21 87 37 05 DF>)
$$ ##END=
$$ 
$$ hash MD5
$$ 05 EF D5 B1 50 30 4C 2E 1A 3D AD 3A CA F3 AC AE
##$RELAX= 
##$RELAX= 
##$RELAX= 
##$RELAX= 
##$RELAX= 
##$RELAX= 
$$ Bruker specific parameters
$$ --------------------------
##$DU= <F:/spectra>
##$EXPNO= 1
##$NAME= <H-F>
##$PROCNO= 1
##$TYPE= <nmr>
##$USER= <she>
##$AMP= (0..31)
100 100 100 100 100 100 100 100 100 100 100 100 100 100 100 100 100 100 
100 100 100 100 100 100 100 100 100 100 100 100 100 100 
##$AQSEQ= 0
##$AQ_mod= 1
##$AUNM= <au_zg>
##$AUTOPOS= <>
##$BF1= 200.13
##$BF2= 200.13
##$BF3= 200.13
##$BF4= 200.13
##$BF5= 200.13
##$BF6= 200.13
##$BF7= 200.13
##$BF8= 200.13
##$BYTORDA= 1
##$CFDGTYP= 0
##$CFRGTYP= 5
##$CHEMSTR= <none>
##$CNST= (0..31)
1 1 145 1 1 1 1 1 1 1 1 1 1 1 1 1 1 1 1 1 1 1 1 1 1 1 1 1 1 1 1 1 
##$CPDPRG= <>
##$CPDPRG1= <>
##$CPDPRG2= <>
##$CPDPRG3= <>
##$CPDPRG4= <mlev>
##$CPDPRG5= <mlev>
##$CPDPRG6= <mlev>
##$CPDPRG7= <mlev>
##$CPDPRG8= <mlev>
##$CPDPRGB= <>
##$CPDPRGT= <>
##$D= (0..31)
0 1.2 0 0 0 0 0 0 0 0.06 0 0.03 0 0 0 0 0.0002 0 0 0 0 0 0 0 0 0 0 0 0 
0 0 0 
##$DATE= 1642662943
##$DBL= (0..7)
120 120 120 120 120 120 120 120 
##$DBP= (0..7)
150 150 150 150 150 150 150 150 
##$DBP07= 0
##$DBPNAM0= <>
##$DBPNAM1= <>
##$DBPNAM2= <>
##$DBPNAM3= <>
##$DBPNAM4= <>
##$DBPNAM5= <>
##$DBPNAM6= <>
##$DBPNAM7= <>
##$DBPOAL= (0..7)
0.5 0.5 0.5 0.5 0.5 0.5 0.5 0.5 
##$DBPOFFS= (0..7)
0 0 0 0 0 0 0 0 
##$DE= 6
##$DECBNUC= <off>
##$DECIM= 32
##$DECNUC= <off>
##$DECSTAT= 4
##$DIGMOD= 1
##$DIGTYP= 9
##$DL= (0..7)
0 120 120 120 120 120 120 120 
##$DP= (0..7)
150 150 150 150 150 150 150 150 
##$DP07= 0
##$DPNAME0= <>
##$DPNAME1= <>
##$DPNAME2= <>
##$DPNAME3= <>
##$DPNAME4= <>
##$DPNAME5= <>
##$DPNAME6= <>
##$DPNAME7= <>
##$DPOAL= (0..7)
0.5 0.5 0.5 0.5 0.5 0.5 0.5 0.5 
##$DPOFFS= (0..7)
0 0 0 0 0 0 0 0 
##$DQDMODE= 0
##$DR= 18
##$DS= 0
##$DSLIST= <SSSSSSSSSSSSSSS>
$$ [...]
##$SUBNAM2= <"">
##$SUBNAM3= <"">
##$SUBNAM4= <"">
##$SUBNAM5= <"">
##$SUBNAM6= <"">
##$SUBNAM7= <"">
##$SUBNAM8= <"">
##$SUBNAM9= <"">
##$SW= 18.0517287032376
##$SWIBOX= (0..15)
0 0 2 0 0 0 0 0 0 0 0 0 0 0 0 0 
##$SW_h= 3612.71676300578
##$TD= 16384
##$TD0= 1
##$TE= 0
##$TE2= 300
##$TE3= 300
##$TEG= 300
##$TL= (0..7)
0 120 120 120 120 120 120 120 
##$TP= (0..7)
150 150 150 150 150 150 150 150 
##$TP07= 0
##$TPNAME0= <>
##$TPNAME1= <>
##$TPNAME2= <>
##$TPNAME3= <>
##$TPNAME4= <>
##$TPNAME5= <>
##$TPNAME6= <>
##$TPNAME7= <>
##$TPOAL= (0..7)
0.5 0.5 0.5 0.5 0.5 0.5 0.5 0.5 
##$TPOFFS= (0..7)
0 0 0 0 0 0 0 0 
##$TUNHIN= 0
##$TUNHOUT= 0
##$TUNXOUT= 0
##$USERA1= <user>
##$USERA2= <user>
##$USERA3= <user>
##$USERA4= <user>
##$USERA5= <user>
##$V9= 5
##$VALIST= <valist>
##$VCLIST= <CCCCCCCCCCCCCCC>
##$VD= 0
##$VDLIST= <DDDDDDDDDDDDDDD>
##$VPLIST= <PPPPPPPPPPPPPPP>
##$VTLIST= <TTTTTTTTTTTTTTT>
##$WBST= 1024
##$WBSW= 4
##$XGAIN= (0..3)
0 0 0 0 
##$XL= 0
##$YL= 0
##$YMAX_a= 50230
##$YMIN_a= -48773
##$ZGOPTNS= <>
##$ZL1= 120
##$ZL2= 120
##$ZL3= 120
##$ZL4= 120
##$ABSF1= 10
##$ABSF2= 0
##$ABSG= 5
##$ABSL= 3
##$ALPHA= 0
##$AQORDER= 0
##$ASSFAC= 0
##$ASSFACI= 0
##$ASSFACX= 0
##$ASSWID= 0
##$AUNMP= <proc_1d>
##$AZFE= 0.1
##$AZFW= 0.1
##$BCFW= 1
##$BC_mod= 2
##$BYTORDP= 1
##$COROFFS= 0
##$CY= 11.3945322036743
##$DATMOD= 1
##$DC= 2
##$DFILT= <>
##$DTYPP= 0
##$F1P= 2.36226072786647
##$F2P= -0.459571619588291
##$FCOR= 0.5
##$FTSIZE= 0
##$FT_mod= 4
##$GAMMA= 1
##$GB= 0.15
##$INTBC= 1
##$INTSCL= 1
##$ISEN= 128
##$LB= 0.24
##$LEV0= 0
##$LPBIN= 0
##$MAXI= 10000
##$MC2= 0
##$MEAN= 0
##$ME_mod= 0
##$MI= 1.114404
##$NCOEF= 0
##$NC_proc= 0
##$NLEV= 6
##$NOISF1= 3.799351
##$NOISF2= 2.8
##$NSP= 1
##$NTH_PI= 0
##$NZP= 0
##$OFFSET= 15.70392
##$PC= 1
##$PHC0= -15953.16
##$PHC1= 16.60078
##$PH_mod= 1
##$PKNL= yes
##$PPARMOD= 0
##$PSCAL= 0
##$PSIGN= 0
##$REVERSE= no
##$SF= 200.130013532006
##$SI= 16384
##$SIGF1= 3
##$SIGF2= 2
##$SINO= 400
##$SIOLD= 16384
##$SREGLST= <1H.CDCl3>
##$SSB= 0
##$STSI= 0
##$STSR= 0
##$SW_p= 3612.71676300578
##$SYMM= 0
##$S_DEV= 0
##$TDeff= 0
##$TDoff= 0
##$TI= <>
##$TILT= no
##$TM1= 0
##$TM2= 0
##$TOPLEV= 0
##$USERP1= <user>
##$USERP2= <user>
##$USERP3= <user>
##$USERP4= <user>
##$USERP5= <user>
##$WDW= 1
##$XDIM= 8192
##$YMAX_p= 0
##$YMIN_p= 0
$$ End of Bruker specific parameters
$$ ---------------------------------
##NTUPLES= NMR FID
##VAR_NAME=  TIME,          FID/REAL,        FID/IMAG
##SYMBOL=    X,             R,               I
##VAR_TYPE=  INDEPENDENT,   DEPENDENT,       DEPENDENT
##VAR_FORM=  AFFN,          ASDF,            ASDF
##VAR_DIM=   8192,          8192,            8192
##UNITS=     SECONDS,       ARBITRARY UNITS, ARBITRARY UNITS
##FACTOR=    0.0002768,     1,               1
##FIRST=     0,             0,               0
##LAST=      2.2672688,     0,               0
##MIN=       0,             -48773,          0
##MAX=       2.2672688,     50230,           0
$$ Real data points
##PAGE= N=1
##DATA TABLE= (X++(R..R)), XYDATA
0@%%%%%%%%%%%%%%%%%%%%%%%%%%%%%lJ1j6J6j6J6j6J6j6J6k0K8l2L2l2L6m4M8
$$ 0 0 0 0 0 0 0 0 0 0 0 0 0 0 0 0 0 0 0 0 0 0 0 0 0 0 0 0 0 0 -3 8 -8 8 -8 8 -8 8 -8 8 -12 16 -16 16 -16 20 -24 24
47B4n1N8o3O8p5Q3r1R9j12J27j42J59j82K10k43K89l49M35n73Q06j283K593j2318
$$ 24 -27 31 -32 36 -39 44 -47 52 -60 67 -75 84 -98 112 -131 158 -191 244 -329 477 -806 1787 -10531
70a0531l8242M4664M8029l1660m5478J6156L6024o44k1287j1714K323J9713J7552
$$ -10531 -48773 -4109 43920 12260 -33218 -17062 18962 18318 -2969 -14683 -12360 7353 24905
83B4905k1793l6013J8785M9847j1639n7838K470N8625O896n2644j4180M0727J7778
$$ 24905 3112 -32901 -14116 35731 24092 -33746 -31276 27349 34245 -18399 -32579 8148 25926
96B5926k5042j6728P974J1261Q142k061k1317r307L0163K1032l3897l0962L2827
$$ 25926 884 -15844 -7870 3391 11533 9472 -11845 -21152 9011 30043 -3854 -34816 -1989
109a989L7444k7931l9303K0607L6186j2552k8435N239J7135l4l969k547r267K348
$$ -1989 35455 7524 -31779 -11172 25014 12462 -15973 -10734 6401 6367 2398 -149 -9416 -7068
123g068K0904l2k9611l531L4565P140l5521r655L2901J0333k7533q712K0595M952
$$ -7068 13836 13804 -15807 -19338 15227 22367 -13154 -22809 10092 20425 -7108 -15820 4775 9727
137I727j3127M63O243o674n40J2752l658j7819O411K1134q080k2344R083K1331
$$ 9727 -3400 -2937 3306 -3368 -3908 8844 5186 -12633 -6222 14912 6832 -15512 -6429 14902
151A4902r959j8494J0950J4315j2257r477J3734M594j5063j75J5845l454j5633
$$ 14902 4943 -13551 -2601 11714 -543 -10020 3714 8308 -6755 -6930 8915 5461 -10172
164a0172O283J4210q443j1377J0253P378j1932k600J3767k371j5746O906J7593
$$ -10172 -3889 10321 1878 -9499 754 8132 -3800 -6400 7367 4996 -10750 -3844 13749
177A3749j0382j9012J2386J9381j2766j8359J1662J5511r558j0795P028M500m846
$$ 13749 3367 -15645 -3259 16122 3356 -15003 -3341 12170 2612 -8183 -1155 3345 -1501
190a501K946L459j0625l285J7681M399k3144o404K6235Q829k6448j0830K3761
$$ -1501 1445 4904 -5721 -9006 8675 13074 -10070 -16474 9761 18590 -7858 -18688 5073
203E073J1719j8523j0837J1499P778l739k661l590m196R408J1989j3066j9635
$$ 5073 16792 -1731 -12568 -1069 6709 2970 309 -3281 -7477 1931 13920 854 -18781
216a8781J4034K5928j2477k9758Q884L0339m162k7306n89K0916M292j1875n994
$$ -18781 -4747 21181 8704 -21054 -12170 18169 14007 -13299 -13888 7028 11320 -555 -6549
229f549J387N330R180k197j8387k877K5045Q977k8304j4913K7866J9460k4108
$$ -6549 -5162 168 9348 7151 -11236 -14113 10932 19909 -8395 -23308 4558 24018 -90
242i0k1575J7708K0621r927j6459K022R429M716m51r381r322J1407J8509j0642
$$ -90 -21665 -3957 16664 6737 -9722 -7700 1729 6445 5994 -3387 -12709 -1302 17207 6565
256F565k5850P643L0260l133l1083j758K8274N959k2206q467J3802Q664m255o377
$$ 6565 -19285 -11642 18618 15485 -15598 -17356 10918 16877 -5329 -13796 6 8670 4415 -1962
270a962n074J843J2972M170j8513j0716K1086J6606k0743k0757J7823K2363j3195
$$ -1962 -7036 -5193 7779 11949 -6564 -17280 3806 20412 -331 -21088 -3265 19098 5903
283E903k1012P840J6828k791j0288j087K321L381N901l746j3393K517J9208j77
$$ 5903 -15109 -7269 9559 6768 -3520 -4607 -2286 1095 6996 3250 -10143 -7626 11582 11405
297A1405k2609k583K3369M983k1635o359J7845O284j2733m651P071J609j690K419
$$ 11405 -11204 -13787 9582 14565 -7070 -13429 4416 10700 -2033 -6684 387 1996 306 2725
311B725k885o767O121J0838p998j3958Q629J5665q304j5691P481J4099o549j1104
$$ 2725 -160 -6927 -806 10032 2034 -11924 -3295 12370 4066 -11625 -4144 9955 3406 -7698
325g698N890P182n640k880N901j379o329N019O783p844o955R701O530j0698n402
$$ -7698 -1808 5374 -266 -3146 2755 1376 -4953 66 6849 -995 -7950 1751 8281 -2417 -7819
340g819J0968L496j0769j074J0330j647r765M283R107o466q306Q017P190q704
$$ -7819 3149 6645 -4124 -5198 5132 3485 -6280 -1997 7110 644 -7662 355 7545 -1159
354a159n574Q602L397p824o05O711k671n460O139M417r471l802J2255L571j4085
$$ -1159 -6733 1869 5266 -2558 -3163 3548 877 -4583 1556 5973 -3498 -7300 4955 8526 -5559
369e559l687J4614L818j3700l702J1377K988p946j505L918r77L19M179l986p848
$$ -5559 -9246 5368 9186 -4514 -8216 3161 6149 -1797 -3302 616 -361 -42 4137 151 -7697
384g697O678J1568q059j4656Q039J6594o786j6877M692J5263k332j1764K20O771
$$ -7697 -1019 10549 2490 -12166 -4127 12467 5681 -11196 -6504 8759 6427 -5337 -5117 1654
398A654J053q01j210n370Q6J0910K129j5173n005J7523P963j7754j0329J5894
$$ 1654 2707 1906 696 -4674 -4588 6322 8451 -6722 -11727 5796 13759 -3995 -14324 1570
412A570J1535j2281j1123P617Q872k564m941k037k72N546O096p425j1795P609
$$ 1570 13105 824 -10299 -2682 6190 3626 -1315 -3352 -3624 1922 8018 593 -11202 -3593
426c593J6485o213j9442L609K0211n38j8606k329J4796M304r349m876K954L886
$$ -3593 12892 6679 -12763 -9154 11057 10519 -8087 -10416 4380 8684 -665 -5541 -2587 1299
440A299L405j352q957k288J3029O410j5087j0250J5095J3103j3236j4347J0036
$$ 1299 4704 3352 -5605 -7893 5136 11546 -3541 -13791 1304 14407 1171 -13176 -3140
453c140J3687o168j1060K296O835Q83j472k993m262L702R595l175j3881J645J6499
$$ -3140 10547 4379 -6681 -4385 2450 3333 1861 -1132 -5394 -1692 7903 4728 -9153 -7508 8991
468H991M07j7218k432J5998L944j3148m474R126L869m571k068J10o66L755L891
$$ 8991 9398 -7820 -10252 5746 9690 -3458 -7932 1194 5063 492 -1576 -1466 -2132 1623 5514
483E514o473p158Q017R877q323j1609P649J2020o327j1068M770Q820l381n710
$$ 5514 -959 -8117 -100 9777 1454 -10155 -2506 9514 3187 -7881 -3111 5709 2328 -3382
497c382K459K022k119J770K244n090k760P662L374r286l798R968L783r734l196
$$ -3382 -923 1099 -1020 750 2994 -2096 -4856 2806 6180 -3106 -6904 3064 6847 -2887 -6083
512f083Q861K018p547l41O067j605m626L625L262n374k065O644R52p324J18P351
$$ -6083 2778 4796 -2751 -3092 2975 1370 -3256 369 3631 -1743 -3808 2836 3788 -3536 -3418 3933
528C933j292o797K591N806m011m570N450L297o756k144P752J205q234m63Q080
$$ 3933 2641 -4156 -1565 4241 230 -4340 1110 4407 -2349 -4493 3259 4464 -3770 -4233 3847
543C847j86p159Q29N650j668l559K752J171m104J150N636l144p151M504Q454n184
$$ 3847 3661 -3498 -2669 2981 1313 -2246 506 1677 -2427 -1277 4359 1215 -5936 -1432 7022 1838
559A838r245N107R256m439q328L399O444k278l694J383L02r34L356J057o691j774
$$ 1838 -7407 -2300 6956 2517 -5811 -2412 4032 1754 -1940 -557 -255 -1189 2167 3224 -3467 -5241
575e241R393K931j1097m227J1543N367j0709n962Q695N718n856m537K650K321
$$ -5241 4152 7083 -4014 -8241 3302 8669 -2040 -8002 693 6411 555 -3982 -1332 989
589I89M55P26l044m181M663P623n244j0536M775J2452l463j3011J690J2080J38
$$ 989 1444 2170 -874 -5055 -392 7231 1987 -8549 -3774 8678 5215 -7796 -6106 5974 6112
604F112r706j537O241K208k097j885k203O09O039J403q915l845J0578O198j0846
$$ 6112 -3594 -5131 1110 3318 1221 -664 -2867 -2258 3781 5184 -3731 -7576 3002 9200 -1646
619a646q047R792Q927p689q649M967P076k106m403m32Q98K267L039l207o742L135
$$ -1646 -9693 99 9026 1337 -7312 -2345 4731 2625 -1778 -2210 -1312 955 3994 787 -5955 -2820
635b820R823k255j1817Q68J2459O97j1664k026R621K768o644k714L162J755L54
$$ -2820 7003 4748 -7069 -6201 6258 6955 -4709 -6735 2886 5654 -990 -3704 -542 1213 1567
650A567j5l451k185N662M544o915o648P161Q077o532q583N284Q066l772o512K304
$$ 1567 1552 -1899 -4084 1578 6122 -793 -7441 -280 7797 1265 -7318 -2034 6032 2260 -4252 -1948
666a948M196j136j375M84j628l17M363O22o518j179P870J798q392k220Q068K269
$$ -1948 2248 1112 -263 221 -1407 -1724 2639 3261 -3257 -4436 3434 5232 -3160 -5380 2688 4957
682D957p080j854N594R56l913L58K217j916p01L473m97m803J360N723j931o064
$$ 4957 -2123 -3977 1617 2573 -1340 -982 1235 -681 -1382 2091 1594 -3209 -1849 3874 1943 -4121
698d121K287N901k575n181K869M070l230k707L657J265m059M8M365j180m463K030
$$ -4121 -1834 4067 1492 -3689 -820 3250 20 -2687 970 2235 -1824 -1776 2589 1409 -3054 -1024
714a024M245k667l655L097K713l441j483L754Q8m078J292M407k493m656L393M732
$$ -1024 3221 554 -3101 -4 2709 -732 -2215 1539 1627 -2451 -1159 3248 755 -3901 -508 4224
730D224l843m542L881M025l586l028L037J621k399J58J791k113j400M003J294
$$ 4224 381 -4161 -280 3745 159 -2869 168 1789 -610 -452 1339 -774 -2174 1829 3123
745C123n667j395O769J692p245k035O983K209n990k114M441J541k489m77M65j040
$$ 3123 -2544 -3939 2830 4522 -2723 -4758 2225 4434 -1556 -3670 771 2312 -177 -654 -189 -1229
761a229J403K826k776m630L549O234l677p332L209P733k346p265J281N962l00
$$ -1229 174 3000 224 -4406 -857 5377 1700 -5632 -2423 5310 2964 -4301 -3020 2942 2642
776B642l958l54J407N17J322j40l885p35N943J897p212l194P628M307p173m911
$$ 2642 -1316 -1670 -263 254 1576 1436 -2449 -3184 2759 4656 -2556 -5750 1878 6185 -988 -5899
792e899N912M896m094m138K072K630r5n05j511j951K520M355k825o445K491P877
$$ -5899 13 4909 815 -3323 -1251 1379 1284 779 -732 -2683 -163 4192 1367 -5078 -2587 5290
808E290j709q417O65Q002L58o699j124M686J389k234j034l37J57K667J150m422
$$ 5290 3581 -4836 -4171 3831 4189 -2510 -3634 1052 2441 207 -827 -1164 -1007 1660 2810 -1612
824a612k636N473M043n756n092N336N585m396n375L119M481j824k938O74R21J44
$$ -1612 -4248 1225 5268 -488 -5580 -244 5341 945 -4430 -1311 3170 1346 -1592 -918 3 147
840A47J267n53l332N16N012j51o140l76O564R04o303j242N463J271m161q73K587
$$ 147 1414 861 -2471 -1955 3057 2906 -3234 -3610 2954 3858 -2445 -3687 1776 3047 -1114 -1987 600
857F00J30r98R18m12k100J536L205k251m070K583M555k626m596K475M129k253
$$ 600 730 -268 650 238 -1862 -326 2879 628 -3442 -859 3696 1070 -3526 -1051 3078 825
873H25l267K069K085j976p83J991n10k090J653K190k514k227L107K088l358j764
$$ 825 -2442 -373 1712 -264 -1047 944 434 -1656 -3 2187 -327 -2554 553 2641 -717 -2481
889b481L394J219l261m52L026m23k739J327K442k139k170K758J840l118j438L167
$$ -2481 913 2132 -1129 -1581 1445 1022 -1717 -390 2052 -87 -2257 501 2341 -777 -2215 952
905I52R38k996k57K564n40k039J472J483k426r84L307O24l982m02M370K54m337
$$ 952 1890 -1106 -1363 1201 661 -1378 94 1577 -849 -1833 1474 2098 -1884 -2286 2084 2338 -1999
922a999j80L913O0l097J92K005o36p59J254m83k016J538K835k305l607K710M147
$$ -1999 -2179 1734 1794 -1303 -1111 894 258 -501 753 270 -1746 -208 2627 322 -3285 -575 3572
939C572k690m388K376M163j818l476J188K334o03q51K26p94j45K448L49l844p95
$$ 3572 882 -3506 -1130 3033 1215 -2261 -1073 1261 658 -193 33 -761 -906 1542 1891 -1953 -2748
956b748M820J391n259j970N091K371m403k445L265K098j871j324M48J18Q26J305
$$ -2748 2072 3463 -1796 -3766 1325 3696 -707 -3152 113 2211 340 -984 -536 -418 408 1713
972A713j751k784K226M112k255n035J883N453j235n268N19M499R3l189m53J547
$$ 1713 -38 -2822 -596 3516 1261 -3774 -1891 3562 2327 -2941 -2422 2077 2170 -1019 -1472 75
988G5M77K38j30j926n33L256J402m136k304M460L032m258l461L598L444k642k944
$$ 75 552 790 660 -1266 -1799 1457 2859 -1277 -3581 879 3911 -347 -3808 -210 3234 592 -2352
1005b352J563J976n19o44l10q52Q15K349r77l623Q21M514m37m892k1M739M25m088
$$ -2352 -789 1187 668 24 -286 -1138 -323 2026 1049 -2574 -1753 2761 2324 -2568 -2589 2150 2575 -1513
1023a513o28L043N68j795j95M61m38P64J184j707k001K318K713k594l143K530
$$ -1513 -2141 902 1470 -325 -520 -59 -497 267 1451 -256 -2257 61 2774 180 -2963 -433
1039d33L267k243l032J863K430j433j585J128N12r07N76Q28j546q47K320R42k858
$$ -433 2834 591 -2441 -578 1852 419 -1166 -38 474 -433 143 971 -575 -1422 898 1840 -1018
1056a018r95L060R72l002q22K721M70k271QJ773o17j245J236P89j805m02K237
$$ -1018 -2013 1047 2019 -983 -1805 916 1386 -885 -877 896 279 -966 270 1059 -746 -1148 1089
1073A089Q3k472K00K500m72k287P78J897j120j385J489Q36j883l08K212j35k446
$$ 1089 1172 -1300 -1100 1400 928 -1359 -581 1316 196 -1189 300 1136 -747 -1055 1157 1022 -1424
1090a424M53K500o72k371Q25K007r42j448J065P51j246L4J471p66j735J399J997
$$ -1424 -971 1529 857 -1514 -689 1318 376 -1072 -7 744 -502 -468 1003 237 -1498 -99 1898
1107A898j818k198K023K279j969k187J752J838j399j252R96M43o35N03L67j475
$$ 1898 80 -2118 -95 2184 215 -1972 -220 1618 219 -1033 -37 406 -229 274 641 -834
1123h34k57K327L19k980n16L346P30l350r13K997R80k350q33J503M54n54J64l56
$$ -834 -1091 1236 1555 -1425 -1941 1405 2135 -1215 -2128 869 1849 -501 -1334 169 623 69 233 -123
1141a23r20J096J731j549k490J716L058j623l347J303L287q68k841M02K070n5
$$ -123 -1043 53 1784 235 -2255 -539 2519 896 -2451 -1148 2139 1271 -1570 -1168 902 847
1157H47j044j13j30O0J270J99k228o35K922J137l234j601L176J918k758j994K095
$$ 847 -197 -310 -440 -380 890 1089 -1139 -1774 1148 2285 -949 -2550 626 2544 -214 -2208 -113
1174a13J748j269j228M68M19K30N62p40j553R75K435r85l047P56L357m31l299
$$ -113 1635 366 -862 -394 25 255 817 77 -1476 -501 1934 949 -2098 -1342 2015 1584 -1715
1191a715J01K853J68k132k56J205J61k07J53p25o04J474J132j990j619K213J995
$$ -1715 -1614 1239 1407 -725 -981 224 385 178 331 -394 -998 476 1608 -382 -2001 212 2207
1208B207k173k145J899K050j492j708J045J131o38m05L31m28j56J200J22j846
$$ 2207 34 -2111 -212 1838 346 -1362 -317 814 176 -229 102 -326 -482 718 840 -1006
1224a006j70K276K98k464l99K404M39k122l37J668J24j147K24O08o41j22J075
$$ -1006 -1176 1100 1398 -1066 -1465 939 1378 -744 -1081 587 711 -436 -212 396 -245 -367 708
1241G08k61j464N29J737p10j830P80J743q22j517Q77J124r36o60J026J75j144
$$ 708 447 -1017 -488 1249 539 -1291 -511 1232 410 -1107 -230 894 -42 -702 324 499 -645
1258f45K92J240o58j296R28J284j087j142J134R23j140n70J107J42j058L22J022
$$ -645 -353 887 229 -1067 -139 1145 58 -1084 50 973 -167 -737 370 512 -546 -224 798
1275G98p69j010J141R95j370r95J475R03j435p55J281M94j021j21P14l35m37Q40
$$ 798 29 -981 160 1155 -215 -1210 265 1168 -267 -1022 259 753 -268 -389 325 -10 -447 393
1293C93K26j329p9J702N2j964p1K052J10j902j44J564J09j078K0N06k67Q3O09
$$ 393 619 -710 -789 913 965 -999 -1070 982 1092 -810 -954 610 719 -359 -339 167 -100 -17 592
1312E92o28r93J017J389j248j699J286J877j162j868R00J689o15j262L32O55q6
$$ 592 -36 -1029 -12 1377 129 -1570 -284 1593 431 -1437 -537 1152 537 -725 -393 262 176
1329A76L0J1p65m6J393K08j866m63K129P22k144r20J912J011j521r26R86O37l84
$$ 176 206 217 -548 -594 799 1007 -859 -1322 807 1529 -615 -1535 377 1388 -133 -1059 -73 564 180
1348A80k23j26l49N43R50p90j498Q71J910p59k147N72K128l09j878P3J433O9q21
$$ 180 -43 -169 -518 25 975 185 -1313 -442 1468 709 -1438 -866 1262 953 -925 -852 581 650 -171
1367a71r6J22j1N49K30j108n51J507Q68j691j143J673J312j491j316J160J147
$$ -171 -267 -145 -156 393 623 -485 -1036 471 1339 -352 -1495 178 1490 -1 -1317 -157 990
1384I90p78p90L89L02p4K75j26q14J84J307j58j629O1J781P3j751j80J527K11
$$ 990 212 -578 -189 113 39 314 188 -626 -442 865 707 -922 -861 920 993 -758 -938 589 800
1403H00j176j42P33k1l03K78j22n81M64Q65o70j103P74J255p99j253P47J113o54
$$ 800 -376 -518 215 194 -109 169 47 -534 -70 795 125 -978 -204 1051 252 -1001 -254 859 205
1422B05q67N85N21n20j33N06k47n23N83N62q44o01R95N97j043n49J004M06q99
$$ 205 -662 -77 444 -76 -209 297 50 -473 110 672 -172 -773 222 819 -224 -773 231 637 -262
1441b62k04P63n2o12L38M93o20l97Q48L27r92k66J060J79j000j00Q86n6o64K31
$$ -262 -466 297 245 -367 -29 464 -156 -553 295 622 -370 -636 424 603 -397 -497 389 333 -331 -100
1461a00M39m63k26P12L3r36R5J100j78j171K16J134k12r95J95P54k28m22K89O3
$$ -100 339 -124 -350 362 395 -541 -446 654 476 -695 -479 655 443 -552 -357 397 169 -253 36 99
1481I9l85K92N58o04p05Q01Q73r02r81Q84J010p85r16N99O98l88m00K02J2q7M13
$$ 99 -286 6 564 -40 -745 56 929 27 -954 -70 940 155 -761 -162 536 148 -252 -50 -38 -125 288
1502B88L6q08o3J115J58j318k87J370M14j272m61J044M36o99l26L34J08M1J95
$$ 288 324 -484 -547 568 726 -592 -879 491 905 -367 -828 216 652 -47 -373 -39 69 110 305
1521C05l58n33N58Q77o60j136O38J293n24j330L51J204j76r42L2N50L5r7m1l44
$$ 305 -53 -586 -28 849 189 -947 -309 984 460 -870 -519 685 509 -433 -401 149 184 87 46 -298
1541b98m8P45K23j028m32J181O09j168p52J052P94q35p01N48M99k49k15Rj40J64
$$ -298 -346 399 622 -406 -838 343 952 -216 -968 84 878 43 -658 -110 389 140 -75 -66 -206 -42
1561d2N03k51q40K51J081j75j204O1J200L3j062j04Q09J26m95m7J46q1J71K67
$$ -42 461 210 -630 -379 702 527 -677 -616 584 617 -445 -549 260 386 -109 -156 -10 -91 80 347
1581C47m25m73O08O44o89p75O85Q36o12p87M91O27l61m11K48J37j84J64J64m35
$$ 347 -78 -551 57 701 12 -763 -78 758 146 -641 -150 477 116 -295 -47 90 -94 70 234 -201
1601b01j73O49K15p83k62Q30K84p88k44O67J87n35n0L66r6k22K82J10m83qO04
$$ -201 -374 275 490 -293 -555 275 559 -229 -473 194 381 -154 -204 162 66 -156 126 236 -247 -255 349
1622C49m8p00P1P18j00o42J21N29j58l84K44J76l20j3M19j31n11K30N93k83o16
$$ 349 301 -399 -328 390 290 -352 -231 298 140 -244 0 176 -144 -157 262 131 -380 -150 443 160 -456
1643d56L16N70k92m81K87L10k59j23K54r5k75K87L29m47l86N50M40n94m59N66
$$ -456 -140 430 138 -343 -56 254 -5 -128 126 31 -244 43 372 -75 -461 89 529 -65 -524 42
1663D2M29m91l38L53K04k14k4R9j79k6M19j0o08J0P29N0q11q8P69J35o62j53M83
$$ 42 471 -20 -358 -5 199 -15 -39 60 -119 -145 274 264 -344 -334 395 445 -366 -454 315 450 -212 -365 118
1686A18J31k64l9J9q2J74K54l51m33M51N87m63o97M14P49l35o76J94N70r8l56
$$ 118 249 -15 -54 -35 -117 57 311 -40 -473 -22 565 102 -595 -181 568 233 -443 -249 321 223 -133
1707a33J7R4L1J67Lm35o1O14J84p46k71P39L76o93m13N36M00l59l08J72J47K2
$$ -133 -116 -22 9 176 179 -256 -317 297 481 -265 -536 203 579 -114 -527 9 409 50 -258 -86 61 83
1729H3M3j48k67K39M68k43o41K11P38j35p50M7O76L4n31o6L13O6q9j7j18q9K98
$$ 83 126 -22 -289 -50 418 175 -466 -255 483 348 -402 -355 321 355 -176 -242 71 137 48 31 -87 -176 122
1752A22K06m34l46N06M23m96m91M51M87l39m15K33K85j26j11L6o2lK63Mm22m2
$$ 122 328 -106 -452 54 477 -19 -510 -59 428 89 -326 -93 192 66 -45 -9 -71 -74 189 193 -229 -271
1774b71N31Q4n77j20N51J44m65j47L57P7k15j2J04j14K5K17r1l32J43M12j69m47
$$ -271 260 344 -233 -353 198 342 -123 -270 87 164 -51 -63 41 -73 -48 169 78 -254 -111 301 132 -315
1796c15J63M39j44l69J23K89j27j63J38K6j64J00K05j93k57K59K90k93l08K82
$$ -315 -152 287 143 -226 -103 186 59 -104 34 60 -104 -4 201 8 -249 10 300 7 -301 -19
1816a9K83k59k12K12J26j74j1J42j19j18K22J38l16j43L77J48l81j51L31J55k80
$$ -19 264 5 -207 5 131 -43 -54 88 -31 -149 73 211 -105 -248 129 277 -104 -255 76 231 -49
1837d9r8J97K1j17O5L0j63K5K70m4l67N2M23l7m38K4L81J1l14kJ82Pn9L2n5r6
$$ -49 -147 50 71 -46 19 49 -114 -89 181 137 -230 -178 245 208 -230 -206 175 186 -128 -130 52 59 0 32 -23 -119
1863a19J72J75k46k67K94L26k77l78K40L67j83k99R7J96l3p5lo4OK25j1l26n1
$$ -119 53 228 -18 -285 9 335 58 -320 -80 287 104 -195 -98 98 65 -10 -13 -77 -71 154 143 -183 -234
1886b34M17R2m30j57M14J96l42k01K53J61j22j10K5j0Q7J22j52k30J74L35j68
$$ -234 183 275 -155 -312 102 298 -44 -245 8 169 47 -63 -38 -48 39 161 9 -221 -47 288 120
1907A20l98J17M36p9m08J6L20L6k12m5O9L8O3J1j91p0K76J45l14k11L15K68k78
$$ 120 -278 -161 275 196 -212 -196 124 160 -52 -97 -28 10 73 84 -107 -177 99 244 -70 -281 34 302 24
1930B4k75K04K60j33j89N8Q6MK4m2j53N7K42l8l04j2L61M4l59p0L08R1k27q1J41
$$ 24 -251 -47 213 80 -109 -51 35 39 63 21 -132 -75 167 129 -175 -187 174 218 -141 -211 97 188 -39 -120 21
1955B1L2l7Ql4p2R9J54j43k10J42K64j40k70J16K33o3k20N3J27l0l5L0m4n1J18
$$ 21 53 16 24 -10 -82 17 171 28 -182 -40 224 84 -186 -70 163 100 -120 -67 60 30 -5 25 -19 -70 48
1980D8Q6j77j22K13J34j96j55J82J49j59r5J00N6o5J5L3q3k1J44K1k07j9K15L8
$$ 48 134 -43 -165 48 182 -14 -169 13 162 3 -92 8 64 -1 14 47 -36 -57 87 108 -99 -118 97 135
2004A35k29l0J98L2j55j7Q9Jl6L6or3M3J58o5j88O5K16n4k16M9J84k1j51J3Q7
$$ 135 -94 -124 74 106 -49 -66 23 24 -12 24 18 -75 -32 126 61 -127 -62 154 100 -116 -67 117 96 -55 -42 45
2030D5l5oM6p2o3J15J10j72j34J80J55j64j72J31J60r1j23N4P0j4J7k4q2K6J49
$$ 45 10 4 50 -22 -85 30 140 -32 -166 14 169 5 -167 -36 124 33 -90 -36 34 20 37 13 -69 -43 106
2055A06j7j94j3K21M8k27p9K08Q9j56o7P5N2j6j9m1l5P7Q9j00j56J24J94q3k34
$$ 106 89 -105 -118 103 151 -76 -155 53 142 -14 -81 -6 46 30 11 -30 -65 12 101 1 -155 -31 163 80 -154
2080a54P3K04k1j87jJ25J9n2j9l2J5R7K4j59m6J73Q9j85j28J69J37j32j34R3J10
$$ -154 -81 123 102 -85 -86 39 58 6 -13 -45 -30 67 91 -68 -114 59 148 -37 -165 4 141 9 -125 -32 78
2105G8m4o2rJ6M3M9n2j17N3J62k7k02PK13J8j78m9J36M9q2n4L3J9K1J2o3o7J04
$$ 78 34 -28 -37 -21 22 71 19 -98 -45 117 90 -112 -105 108 126 -52 -101 35 84 2 -52 -19 0 21 33 -30 -97 7
2133GR5j04j23Q8J64q2j47M7J37l8p5nN4nK2Mq7lJ11L9j33n8J27P2j22q9J04Q0
$$ 7 102 -2 -125 -37 127 45 -102 -55 82 44 -31 -36 18 13 35 39 -48 -51 60 99 -34 -92 35 107 -15 -104 0 80
2161H0p5m8L5K9k0J0jn7J2J04j6j31OJ41jj25j8J29J5p8k0M2NqK2l2m5M4P4n9
$$ 80 5 -43 -8 21 1 11 10 -47 -35 69 53 -78 -72 69 68 -57 -75 54 69 -9 -29 13 18 10 32 0 -45 -1 73 14
2191A4q5N2J15o2j06M1Q2k1n2rL2jRJ0m4k8Q6M4r3o5R9P4q2p6O6P0o0m7K5K7r
$$ 14 -71 -19 96 34 -72 -31 51 30 -22 -31 1 0 9 19 -25 -53 33 77 -16 -81 18 92 10 -66 0 70 10 -37 -12 15 6
2222FJ0pm8K0O9j6r9%J12K4j12l2R3M7o8k9K9J4NNm4j6L8O4o3q4O0J06n7j02L6
$$ 6 16 9 -39 -19 50 34 -65 -65 47 71 -41 -73 20 67 -1 -30 -1 13 18 23 -21 -37 1 65 2 -82 -22 84 27 -75 -39
2253c9Q5j0o5%L9Qj4j3k9QN3K1p7l0Q8O8r9p2P7O7m2o3J7M5Nj9j7j2K4L8rq6J5
$$ -39 46 36 -29 -29 10 18 4 -9 -38 -30 23 44 -33 -63 25 93 -6 -78 -1 66 24 -39 -22 23 28 9 -8 -20 4 42 33 -53 -38
2286c8R7j2j04j4R6K9p7l3N2L2j9j5j3lM6Nm0m3O1O5n0q1M2Q7l0p7J7N7jm0j0
$$ -38 59 47 -57 -71 25 54 -23 -56 -4 28 9 -6 -19 -22 24 29 -11 -54 7 72 22 -59 -17 70 40 -37 -20 37 36 -4 -14
2317a4J3KK9pn5j1P0K8o8l8O1N8o2o8N8L8rl8oK0J5J7j7m1LN9jp2rP8Qo4k8N8
$$ -14 -1 1 30 23 -32 -43 27 55 -13 -51 10 68 6 -62 -4 34 25 -13 -19 1 16 33 16 -25 -22 37 36 -36 -45 33 41 -23 -51 7
2351GK1l1j2J4NQQj8k7K9M7m4m9L3N6k5m9KO6j3l0nJ5JJKl6j8O0J7m8l1M7L5l8
$$ 7 28 -3 -15 -1 4 12 20 2 -25 4 51 7 -42 -9 47 22 -27 -25 41 28 -2 -7 8 9 10 12 -24 -42 18 35 -13 -44 3 38 0
2386@m5L9M6l4l4J9RQJ1j8j9NN2Jn2rM5K9o2j5K8L8l8j0KJ0MLj9j3J0M2k6n9L0
$$ 0 -45 -6 40 6 -28 -9 0 8 19 1 -18 -13 39 40 -12 -21 24 53 -9 -24 4 42 4 -6 -4 6 10 13 -6 -19 -9 33 7 -52 -22
2421b2O1j2o5RM4Ql3JJ4MOoj9j3L4J9l6k7L1M8l3m6K5L9qm3JJ9LKLk4LM4Mn3m
$$ -22 39 27 -38 -29 15 23 -10 -9 5 9 15 9 -10 -23 11 30 -6 -33 -2 46 13 -33 -8 31 23 -20 -19 0 3 5 8 -16 -13 31 35 -18 -22
2458b2M9K5o7k0M2K8l1k1J2J9omnj5K1K1qm3%M9ln5KO5Lm7j4K8K1k1rpRJ9Nk5
$$ -22 27 52 -15 -35 7 35 4 -17 -5 14 8 4 -1 -16 5 26 18 -25 -25 24 21 -34 -32 33 36 -11 -25 3 24 3 -6 -13 -4 15 20 -5
2494ek4L6M0l6m5K4M7k6l5QK6Nl0J3j2J3K4om5JN2Rm9j5M0K8l5k7L0K0pk4J1%
$$ -5 -29 7 47 11 -34 -10 37 11 -24 -16 10 15 -15 -2 -14 -1 23 17 -28 -27 25 34 -15 -30 10 38 3 -24 6 26 19 -5 6 6
2528FNRj2k0RK6lm9J2L5Nm1qK7J7k4qJ2%NJ2k2j8K1L6k4k5K0L2k5l0J7J3jrJ%
$$ 6 11 20 8 -12 -3 23 20 -29 -17 18 23 -18 -26 1 18 -6 -14 -2 -2 3 15 -7 -25 -4 32 8 -17 3 35 10 -20 -3 10 9 0 1 1
2565AlPJ5k4oK4J3l4k2L6K6l5j3J6J8j3j7J8mmJ7mj7pK8Km0kN1kl4j4L3JnqJ7
$$ 1 -2 5 20 -4 -10 14 27 -7 -29 7 33 -2 -15 1 19 6 -11 7 3 -1 16 12 -5 -12 16 18 -22 -24 27 25 -9 -23 10 11 6 -2 15
2602A5j4mJ9qk2jM5j7l3OL6Nl6jL1j1rjNj2QOj1k0K5J9k3k6J7L7j2m2K3K1mk2
$$ 15 1 -3 16 8 -14 -15 30 13 -20 -14 22 27 -9 -10 21 10 1 0 5 -7 1 7 -4 -24 1 20 -3 -29 -12 25 13 -29 -6 15 11 -11
2638a1J0JkRRk3nL6Jl8j5M5J7l8j7M1lj2j3J0J3j4J3j1j9OL0qn1K8M1k3k7ML2
$$ -11 -1 0 -2 7 16 -7 -12 24 25 -13 -28 17 34 -4 -21 20 17 5 -8 2 15 1 14 3 -16 -10 20 12 -39 -11 30 7 -20 -16 16
2673A6lj9KQpQNrj2J9K7m2j8K9K5j4l7K5K1j2l3J7PmPNj4rK5kk2j3L4J0l1j4M5
$$ 16 13 -6 -4 4 -3 5 10 1 -11 8 35 -7 -25 4 29 15 -22 3 24 12 -21 -4 3 -1 6 11 -3 -12 13 11 -11 -24 10 20 -11 -25 20
2710B0Ml5jJ9Okj0lrNK8rl1RL9om5PK6Ll1J0K1j3j3J1Nj9PK2qk2K4K3k1l5K7K2
$$ 20 24 -11 -12 7 13 11 1 -2 -11 -6 22 13 -18 -9 30 24 -21 -14 12 15 -16 -6 15 2 -11 0 5 -14 -7 15 7 -15 9 32 11 -24 3 25
2748B5j8j2JJ6j4mJ4j3j1J8J0k3j3L1J2k5j9L4J5l6jK2%rJ6jk0OK0%l3mL1J1l1
$$ 25 7 -5 -4 12 -2 -6 8 -5 -16 2 12 -11 -24 7 19 -6 -25 9 24 -12 -13 9 9 0 16 15 -5 1 21 21 -12 -16 15 26 -5
2783ej2L3Lk0rPkMONl0J3K2mm2J9K7%m8J5L8kk7kJ4j%Lj9J3K3Kj8k5L1J6l4k2
$$ -5 -17 16 19 -1 -10 -3 -5 -1 5 10 -20 -7 15 11 -31 -12 15 15 -33 -18 20 18 -9 -11 3 2 2 5 -14 -1 22 24 6 -19 12 28 -6 -28
2821b8L4J9k3k2J5J1j1jJ6j7mK6rl3J3L3Lm2qM8%l0nK7nj3PkoRJ5j1l5K0M6l4
$$ -28 6 25 2 -20 -5 6 -5 -6 10 -7 -11 15 6 -27 -14 19 22 -20 -28 20 20 -10 -15 12 7 -6 1 -1 -7 2 17 6 -29 -9 37 3
2857Ck7J2L9j3l4J3K6mj5Rj8OJ4J4l3j4M3J8m3l6N1J4j7n1L9K5k3j2J6j0oL2j4
$$ 3 -24 -12 27 14 -20 -7 19 15 0 9 -9 -3 11 25 -8 -22 21 39 -4 -40 11 25 8 -43 -4 21 -2 -14 2 -8 -14 18 4
2890Dj9J3K5Lm2j1M2Ok3qJ9J4k2KJjMJ4j8l2K5J9pl0J4L1j1m2J8K5rj4%jj2K3
$$ 4 -15 -2 23 26 -16 -27 15 21 -2 -10 9 23 1 3 4 3 7 21 3 -29 -4 15 8 -22 -8 23 12 -30 -12 13 4 -10 -10 -11 -23 0
2926@J1ok2L5Pk3k4L9J2k1k0J4%RrPo%J7j6j6pM5j1k7j6L7Ml0qK3J0orRrJ0K4
$$ 0 11 5 -17 18 25 2 -22 17 29 8 -12 2 2 11 2 9 3 3 20 4 -12 -19 26 15 -12 -28 9 13 -17 -25 -2 8 2 -7 2 -7 3 27
2964B7k6k5J4L9j9l5J0L9ok9pK5%j0LKnNK6l7kJ2J9k0k4L0L1k8k4K0J1j0j3lJ1
$$ 27 1 -24 -10 29 10 -25 -15 24 18 -11 -18 7 7 -3 0 2 -3 2 28 -9 -11 1 20 0 -24 6 37 9 -15 5 16 6 -7 -10 1
2999ArJ8pj5RK6jl5j5M5J0l7j0L5Pj7j4K2mQnqj9K2L0l0l1QM7j5m1K4K3j2j9Q
$$ 1 -8 10 3 -12 -3 23 22 -13 -28 17 27 -10 -20 15 22 5 -9 13 9 17 12 4 -15 7 37 7 -24 -16 31 16 -25 -1 22 10 -9 -1
3035aJ3jj1J2k2%K1Ok9k1L4L3l8j6J7K5j9k3K0J1nmj%kK5jl5KL0Kl7MK5Oj7j5
$$ -1 12 11 0 12 -10 -10 11 17 -12 -33 1 34 -4 -20 -3 22 3 -20 0 11 6 2 1 1 -1 24 23 -12 -10 20 22 -15 -11 14 20 3 -12
3072a2J3Qqjjj5J7J1ll2K2K9k9k8J2L3qk1MJ6Oj4%j3J4J4Lk8j3M0J4k1l4K3L1
$$ -12 1 9 1 0 -1 -16 1 12 9 -23 -1 28 -1 -29 -17 16 8 -13 -9 7 13 -1 -1 -14 0 14 17 -11 -24 16 30 9 -25 -2 29
3107B9j9k5QJ2j1QrLnJ6mj1LL2ll9PK2Jj7oJ5lJoj2QLJ2j7j5J9J5rk7J1L1qk2
$$ 29 10 -15 -7 5 -6 2 -7 -4 -9 7 3 -8 -5 27 24 -15 -8 14 15 -2 -8 7 4 5 -1 -13 -5 -2 10 -7 -22 -3 12 3 -24 -13 18 10 -12
3146a2J3RNknj5OJ8Ol0j0L7%k6j1J6K9k1k9J9Ppmkj1RK4j1k4OL7Kk9lK4J5l1k
$$ -12 1 10 15 13 8 -7 -1 17 23 -7 -17 20 20 -6 -17 -1 28 7 -22 -3 4 -3 -7 -9 -20 -11 13 2 -22 -16 21 23 -6 -9 15 30 -1 -3
3184c%L1j0j2KmRJ1j8k0J8K5j1l6J0K8jl4MK2Nj4nmNJ5qqj2J5K1k6j4K9K8k7j9
$$ -3 -3 28 18 6 8 4 13 24 6 -14 4 29 18 -18 -8 20 19 -15 -11 11 16 2 -3 -7 -2 13 5 -3 -15 0 21 -5 -19 10 38 11 -8
3221hJ5RJprMKJ4j5j4OL0j5l0OL2Kk9mRJ5j8qMJ3OJ0k5kJ2J9j9l6K2L1j0k6LL3
$$ -8 7 16 17 10 1 5 7 21 6 -8 -2 28 13 -17 -11 21 23 -6 -10 -1 14 -4 -12 -8 5 11 21 -4 -6 6 25 6 -30 -8 23 13 -13 -10 23
3260B3j4j7%J2nJ1kj5jL1Jl5NK2Pj4j8J6J4mj7lJ0mK5k4j4J2K2j4k7QK3Ql4KJ1
$$ 23 9 -8 -8 4 -1 10 8 -7 -8 23 24 -11 -6 16 23 9 -9 7 21 17 0 -3 7 3 28 4 -10 2 24 10 -17 -9 14 22 -12 -10 1
3297AK0j6j2R%J1%k2JJ9Oqk1J6K2j2k6OK1Mk6QlJ2LKk5J1RJ5k9j3K8J0k4k0K1
$$ 1 21 5 -7 2 2 13 13 -9 -8 11 17 9 -12 4 26 14 -12 -6 15 19 -7 1 -2 10 13 15 -10 1 10 25 -4 -17 11 21 -3 -23 -2
3334bK0j8rKkMK4j3j2J0Onj3RK5Lk9j4K9J0j8j2J4%Kj6oMK0J4k5j8K6J4j2j9m
$$ -2 18 0 -9 -7 -9 -5 19 6 -6 4 10 5 -8 1 26 29 0 -14 15 25 7 -5 9 9 11 -5 -11 -7 13 27 2 -16 10 24 12 -7 -11
3371a1K7Kj8pJ1jMj2PJ3Rj1k9LK7J8k8k1K7J5rj3LKN%rnMK5j8k0QK3Ml2OJ6Rl1
$$ -11 16 18 0 -7 4 3 7 -5 2 15 24 13 -16 -13 14 32 4 -17 10 25 16 3 6 8 13 13 4 -1 3 28 10 -10 -2 21 25 -7 -1 15 24 -7
3411gnJ6Pj1lj1RQ%rpK2%ok3J2L7j3k1jJ0RnLlnJ5lk0MK2nk6jKK5j9j7J6J5pM
$$ -7 -12 4 11 0 -3 -14 -5 3 3 -6 -13 9 9 3 -20 -8 29 16 -5 -6 4 13 8 11 8 3 18 15 -5 -1 21 16 -10 -11 -9 16 -3 -20 -4 11 4 8
3453HrLJ4rj2j1OK5ok6LL4Qk5LJQmj2m%J1J9l0kJ4J5j5k1QK7nk7PLPJj7jK1p%
$$ 8 -1 2 16 7 -5 -16 -10 15 9 -17 -14 20 28 3 6 7 15 11 -1 -5 -5 6 25 -5 -7 7 22 7 -14 -6 21 16 -11 -4 -1 6 7 -10 -11 10 3 3
3495Cj7QL6j1k6pL1Lk5pJ4NJ0j8nPJ2kmqK0Oj1k9J0K5%k8mJ7J9k3plJ8Opk4J0
$$ 3 -14 -6 30 19 -7 -14 17 20 -5 -12 2 7 17 -1 -6 1 13 11 7 -1 19 25 14 -15 -5 20 20 -8 -12 5 24 1 -6 -9 9 15 8 -16 -6
3534fJ6jj3rK4MJk9QK2mj0j4OOOj1NKNj2rRJ2J1k3rPK3kj8kK2Joj0j1K3j0j0j3
$$ -6 10 9 -4 -13 11 15 16 -13 -5 17 13 3 -11 -5 1 7 -4 1 3 8 -4 -13 -4 8 19 -4 -13 -6 17 15 -3 -5 17 18 12 2 -9 14 4 -6 -19
3575a9OK9ok5PJ5J3j8j0KNPnj3JJ6J1j9jK2mlj6NJ5oj6lJ5J1lj9lMK4j0k0LK6
$$ -19 -13 16 10 -15 -8 7 20 2 -8 -6 -1 6 1 -12 -11 5 16 -3 -4 18 14 11 -5 0 15 9 -7 -10 5 16 13 -6 -9 -5 19 9 -11 -8 18
3614A8j1j6jNJ3pJpPJ5nk1OQKmj8J1K7j1j8mK0Lj4lKJ0Qk4MNMMj9nK6Mj0k1K3
$$ 18 7 -9 -10 -5 8 1 2 -5 2 17 12 -9 -3 5 7 3 -15 -4 23 12 -6 -10 10 13 -1 -4 -2 8 16 -8 -4 1 5 9 -10 -15 11 15 5 -16 7
3655G%mrLjJ5j0pJOJ2ok6K5J5lk4j0J4J7j2k0J0O%Oj2OK1Jj4j5J6Noj7J3NQj9
$$ 7 7 3 -6 -3 -4 11 1 -6 -5 1 13 7 -19 6 21 18 -6 -16 -2 15 3 -17 -7 -1 -1 5 -7 -1 20 21 7 -8 8 13 7 -10 3 8 16 -3
3695cL%J4j7JkPJmppJ0J0ok2K2Qj2oKK4mj1MrJ4lpOmK2Kk2mJ0JrpKK1j5Mq%J6
$$ -3 0 0 14 -3 -2 -4 3 4 0 -7 -14 -4 6 0 -22 0 8 -4 -10 -8 16 12 1 5 -4 10 7 0 6 2 24 26 4 0 10 11 2 -5 -3 18 3 7 -1 -1 15
3740A5pj1jJ4Pj9rK0qRj0j5J3J4lnJ0NLj5rjJ0LqrJ6Pj2nJ0OpnkjJ3qoqJ0J0m
$$ 15 8 -3 -4 10 17 -2 -11 9 1 10 0 -15 -2 12 9 4 14 19 22 7 -2 -3 7 10 2 -7 9 16 4 -1 9 15 8 3 1 0 13 5 -1 -9 1 11 7
3783Gj1mK6j5nmjK5rj7j3J6J0LooJ2Jlj1OJ2Kj9JJ4Lnk2J3J4klj3KJ7j4rKNJ3
$$ 7 -4 -8 18 3 -2 -6 -7 18 9 -8 -21 -5 5 8 2 -4 8 9 6 -5 1 13 15 -4 -3 11 14 9 -13 0 14 12 9 -4 -2 15 1 -8 -6 -1 12
3824A2oj7JJ9n%j1KK0j0j0j2K4Kj1j4NK4nj4KQM%j8OJ1J0mrJ2lmkj0J6Loj2MJ7
$$ 12 6 -11 -10 9 4 4 -7 -5 15 5 -5 -17 7 9 -2 -16 -11 13 8 -6 -4 4 8 8 -10 -4 7 17 13 4 16 13 9 7 -3 13 16 10 -2 2 19
3865A9j0j7KJJ0oJpLJ1jj0j1K3Nj4j1J7KKlmJ0klj1kPJ3j8LkJ2Pk2JJ9Pk0LlJ
$$ 19 9 -8 -6 -5 5 -1 0 -7 -4 7 6 -4 -15 8 13 -1 -12 5 7 9 6 2 12 10 7 -4 -6 1 14 -4 -1 -3 9 16 -6 -5 14 21 1 4 1 2
3907BNppmJ5%%j7K4Oj8rJ4Njj2JPJ1oj1mRJ3jk1OK0j2j6jLJ1lmJPJj2rJ7Onoj1
$$ 2 7 0 -7 -11 4 4 4 -13 11 17 -1 -10 4 9 8 -4 -3 4 15 9 -2 -6 3 16 15 -6 0 20 8 -8 -9 -6 5 2 -2 -1 6 7 -5 -14 3 9 4 -2 -13
3952a3J1OJ1k7J2lRqkKJ5j0qnJ1J1j0mlNJ1nj0J4Mqnj0RJ1qj5nJ6J0j1qJ1Rk3
$$ -13 -2 4 15 -12 0 -3 6 -2 -4 -2 13 3 -5 -10 1 12 2 -2 -5 0 11 6 -4 10 14 6 1 -9 0 11 3 -12 -17 -1 9 -2 -10 1 10 -13
3992a3PkPJ3j4pORKj0nQOp%kR%oj0MJ8%j7jJ3j%k8J1J3Mrj0J1J1kok1K2Oj0j4
$$ -13 -6 -8 -1 12 -2 -9 -3 6 8 -2 -7 1 7 0 0 -2 7 7 1 -9 -5 13 13 -4 -5 8 7 7 -21 -10 3 7 -2 -12 -1 10 8 2 -19 3 9 -1 -15
4035a5J2J1Lj2j5J7J0mpmOPpoJ2nJq%KJ8j3rkJ5Pj1lPjNlj3PRLj1j3J1L%qKMj
$$ -15 -3 8 11 -1 -16 1 11 7 0 -4 2 9 2 -4 8 3 4 -4 -4 -2 16 3 -6 -8 7 14 3 0 7 6 11 8 -5 2 11 14 3 -10 1 4 4 -4 -2 2 1
4080AmnOJkKlLQkpJ0J0mj5Q%Rjj3MkJ1lmKJMj2poJ7krqK5mj7J4j2NJ2j8qRJ2j3
$$ 1 -3 -8 -2 -1 -3 -1 -4 -1 7 5 -2 8 18 14 -1 7 7 16 15 2 6 4 15 12 8 10 11 15 3 -4 -10 7 5 -4 -12 13 9 -8 6 -6 -1 11 -7 -15 -6 6 -7
4127gjNRmjOqOLkokjOpLLQj2jJ1Lk%j4MklLmJJ9j5jQjNj6jJJ0j1mMMLlqjJ5j1
$$ -7 -8 -3 6 2 1 7 -1 5 8 6 0 -2 -3 3 -4 -1 2 10 -2 -3 8 11 9 9 -5 -1 -3 -6 -3 -7 -6 13 -2 -3 5 4 9 -7 -8 -7 3 -8 -12 -8 -4 -1 -4 -12 -13 2 -9
4178i%LJ0Pj0lKJ2Mj4JMJ2j0lj8NNLj1lK4qMj4J4rklJ2qPqnJ4%LnnQ%%j1%J4k
$$ -9 -9 -6 4 11 1 -2 0 12 16 2 3 7 19 9 6 -12 -7 -2 1 -10 -13 11 3 7 -7 7 -2 -4 -7 5 -3 4 -4 -9 5 5 8 3 -2 6 6 6 -5 -5 9 7
4224Gj1kLK5j2Oj8J4Mqj3mK2lmj0RrLmJLRorkNOknJ6k1K2j1KJ6Lj0oJ0mj1J2j9
$$ 7 -4 -6 -3 22 10 16 -2 12 16 8 -5 -9 13 10 6 -4 5 -4 -1 -5 -4 -1 8 2 -7 -9 -4 2 0 -5 11 -10 12 1 3 19 22 12 6 16 12 1 13 -6
4268fJ2Pj4%OjLrNpMJ2qj6J9Lj1rlK1M%k5J5MJ0j1qPQqpNMJ0jk1NMMKj9J7mPj2
$$ -6 6 13 -1 -1 5 4 7 -2 3 -4 0 12 4 -12 7 10 -1 -10 -13 8 12 12 -13 2 6 16 5 -3 4 12 4 -3 2 6 16 15 -6 -1 3 7 9 -10 7 3 10 -2
4314bnJ0J3j8OqJ6j0Nl%J1j1j2%J0nPpMQMoLMknoPmM%rJ6mJj1J0NplkM%Rj2mR
$$ -2 -7 3 16 -2 4 -4 12 2 7 4 4 15 4 -8 -8 2 -3 4 -3 1 9 13 7 10 14 12 7 1 8 4 8 8 -1 15 11 12 1 11 16 9 6 4 8 8 17 5 1 10
4362A0QropK2mpqkJM%qJJ4Mj4OMJ3j6MkQqLrJ0kJ4qj4Rljj2K2j0jj2J2JKokKL
$$ 10 18 9 3 -4 18 14 7 -1 -3 -2 2 2 -6 -5 9 13 -1 5 9 22 6 10 8 16 8 11 2 12 10 24 16 2 11 8 7 -5 17 7 6 -6 6 7 9 3 1 3 6
4409FPpkOj1J0rjQNJj4QLJj5JNKJ8oj3jJ4rrONLj2%oJ3jpKMJ0qp%oK6j9LnJ0j2
$$ 6 13 6 4 10 -1 9 0 -1 7 12 13 -1 7 10 11 -4 -3 2 4 22 16 3 2 16 7 -2 4 9 12 0 0 -6 7 6 -1 1 5 15 7 0 0 -6 20 1 4 -1 9 -3
4457cPj5PJ9qj1J3OLpopPKJpJ3lMqMjkjlOLj6OJlJjpkJ9j0Rj7MPOj6JQJ1j0jJ5
$$ -3 4 -11 -4 15 7 -4 9 15 18 11 5 -2 5 7 8 1 14 11 15 7 11 10 8 7 4 10 13 -3 3 4 1 2 1 -6 -8 11 1 10 -7 -3 4 10 -6 -5 3 14 4 3 18
4506A8koj1%J7Lpj9J5jJ2j8LoK3j6LoR%%kjKnkqKJ3Oj4LMqOpkkJ7mqPJNrmJ6j1
$$ 18 16 10 -1 -1 16 19 12 -7 8 7 19 1 4 -2 21 5 8 2 11 11 11 9 8 10 5 3 -5 -3 10 16 2 5 9 1 7 0 -2 -4 13 9 1 8 9 14 5 1 17 6
4554FnJ2oLqMP%jmjkjJ1j7JPRj4mnJ1nLpJ4mQop%%LqJ5LjKj4J3Onj7PJ2j3J4r
$$ 6 1 13 7 10 2 6 13 13 12 8 7 5 4 15 -2 -1 6 15 1 -3 -8 3 -2 1 -6 8 4 12 6 -1 -1 -1 2 -6 9 12 11 13 -1 12 18 13 -4 3 15 2 16 7
4602Gj1QMpoJ5Qlj5oPljmNj1K0mKqNpKJ4pPlj1LOKnRjo%MQmLojqOqOpMRjj0mQ
$$ 7 -4 4 8 1 -5 10 18 15 0 -6 1 -2 -3 -7 -2 -13 7 3 5 -3 2 -5 -3 11 4 11 8 -3 0 6 8 3 12 11 5 5 9 17 13 16 10 9 1 7 -1 5 -2 2 11 10 0 -4 4
4655DjmpM%LllPMjNkMnj%PmQjpnKJ0morJ5qpJ0M%j1LNNLj6J0kjqPnnOMnJ0p%n
$$ 4 3 -1 -8 -4 -4 -1 -4 -7 0 4 3 8 6 10 5 4 4 11 7 15 14 7 2 4 14 10 4 -5 10 2 -5 5 9 9 -2 1 6 11 14 -2 8 6 5 -3 4 -1 -6 0 4 -1 9 2 2 -3
4709crJ0QMmpQjjpkJ4lkKPLj2Pol%Kj1J0lkkLRJ0j4lJj0J1nOPqq%J3oNlJQJj2
$$ -3 -12 -2 6 10 6 -1 7 6 5 -2 -4 10 7 5 7 14 17 5 12 6 3 3 5 -6 4 1 -1 -3 0 9 19 5 2 3 -7 4 -1 5 12 4 -4 -4 9 3 8 5 6 14 15 3
4759CQmqJ6rpJ9k%orMk%olPOj2lQQoqQ%Kj1J2Lj3JOPLqMkj3J5KLpnPMj0jNKJ%
$$ 3 11 7 -1 15 6 -1 18 16 16 10 1 5 3 3 -3 -6 1 7 -5 -8 0 8 2 -6 2 2 4 -7 5 8 -5 -4 2 9 12 4 8 6 -7 8 10 13 6 1 8 12 2 1 6 8 9 9
4811IKj2J4nrkONj2jJ0JjPnnkpJ0jKjnjNLKoJ0j4J6j3N%nMMJpL%PqjPloMm%jj1
$$ 9 11 -1 13 8 -1 -3 3 8 -4 -5 5 6 5 12 7 2 0 -7 3 2 4 3 -2 -3 2 5 7 1 11 -3 13 0 5 5 0 4 8 9 2 5 5 12 4 3 10 7 1 5 1 1 0 -11
4863a1J1MmOrKNln%J1j0KoQKOJmRj2NjRnlqNKj2NoPPkojPlj3KJJN%Kj%kOJnOn
$$ -11 0 4 0 6 -3 -1 4 1 -4 -4 7 -3 -1 -7 1 3 9 10 6 15 3 8 7 16 11 8 0 5 7 -5 0 -6 1 8 6 0 -1 6 3 -10 -8 -7 -6 -1 -1 1 0 0 -2 4 5 0 6 1
4917AnNN%pLJNMj4MQjkkqJj%P%LNoj4MNjkpKMoPJjmOmRkmmNMkolKOJlO%mOKj0
$$ 1 -4 1 6 6 -1 2 3 8 12 -2 2 10 9 7 5 -3 -2 -3 -3 4 4 7 12 6 -8 -4 1 0 -2 -9 -7 -3 -9 -2 -1 -2 -6 0 -4 5 3 -1 -5 0 4 2 -4 -7 -5 1 2 -1 5 5 1 7 9 -1
4975aMJoj7J6jkJNjMj2mKMqLJNkLkqQJ3pmJJ3j6J1j0MJ6KmjKrkJ0rJKj1LJRqj
$$ -1 3 4 -2 -19 -3 -4 -6 -5 0 -1 3 -9 -13 -11 -7 -15 -12 -11 -6 -8 -5 -7 -15 -7 6 -1 -5 -4 9 -7 4 -6 -2 14 16 12 11 13 4 2 12 3 4 6 -5 -2 -1 8 0 -1
5025anJ1qOmLmnJ2oJ0j7NkJ1lLPj1jJMj2M%J3pj3J5%LqJ2j4OKj0JJ3j4mLOjNj
$$ -1 -6 5 -3 3 -1 2 -2 -7 5 -1 9 -8 -3 -5 6 3 6 13 2 1 2 6 -6 -2 -2 11 4 -9 6 6 9 1 13 -1 5 7 -3 -2 11 -3 -7 -4 2 1 6 5
5071Ej7NL%Nj0J9j6kJRlNnNLkQj5OKnj1J6jj2J3LqJ2Lj7JKlJ2j0kNjo%ljJ3ol
$$ 5 -12 -7 -4 -4 1 -9 10 -6 -8 -7 2 -1 4 -1 4 7 5 13 -2 4 6 1 -10 6 5 -7 6 9 1 13 16 -1 0 2 -1 11 1 -1 4 3 -3 -3 -6 -7 6 0 -3
5118cnjOJlNKmPMkJPj9LLLnmN%kQkjqMjPj0KmlQlnrK0oPqmJkOmmK2j3jMj4K3o
$$ -3 -8 -9 -3 -2 -5 0 2 -2 5 9 7 8 15 -4 -1 2 5 0 -4 1 1 -1 7 5 4 -4 0 -1 6 -4 -2 -6 -9 -1 -4 -9 -18 2 -4 3 -5 -9 -8 -10 -4 -8 -12 10 -3 -4 0 -14 9 3
5172C%rPjJ0mpJ2rRj2JL%Oj3MJ2j3lqNQllMNKqkJ1j4J9ojoPpLo%J6Kj1Rnj3OJ0
$$ 3 3 -6 1 0 10 6 -1 11 2 11 -1 0 3 3 9 -4 0 12 -1 -4 -12 -7 1 -2 -5 -1 4 6 -2 -4 7 -7 12 6 5 -1 6 -1 2 -4 -4 12 14 3 12 7 -6 0 10
5221A0pOlkJpLPjNlmqNLkj5RNj7J8j0Rl%PopNqJ6j5J1KkJmMLqLKoNnN%%lJ2op
$$ 10 3 9 6 4 5 -2 1 8 7 12 9 5 -3 2 5 3 -12 -3 2 -15 3 -7 2 -1 -1 6 0 -7 -2 -10 6 -9 2 4 2 3 -1 3 6 -2 1 3 -3 2 -3 2 2 2 -1 11 5 -2
5273bJNjmj%J%jlQplJ6mLoJNj1%lpK0MrJ1j0J1rj%jJ0lj1NJ1j6jjLK%j4PkJ4j0
$$ -2 -1 4 3 -1 -2 -2 -1 -1 -2 -5 3 -4 -7 9 5 8 2 3 8 -3 -3 -6 -13 7 11 2 13 3 14 5 4 4 3 13 10 -1 4 15 -1 -2 -3 0 2 2 -12 -5 -7 7 -3
5322cKOqOj0oJ0%Mj8J8Rj1j2J1J2j3OnNJ2j0JKLKqJnJ0j1mJ0kpmOjlOJklJlmQ
$$ -3 -1 5 -3 3 -7 -13 -3 -3 1 -17 1 10 -1 -13 -2 10 -3 3 -2 3 15 5 6 8 11 13 5 6 1 11 0 -4 6 4 -3 -7 -1 -2 -5 1 2 0 -3 -2 -5 -9 -1
5369amjJ5nJnOqJkJ5Lj2kJ0LJnmojRJMpj0KjRj0J4k0J1Mj0J7j8Nj1J6moJ%oQJ4
$$ -1 -5 -6 9 4 5 0 6 -2 -1 -3 12 15 3 1 11 14 15 10 6 0 -1 8 9 13 6 -4 -2 -3 6 -4 10 -10 1 5 -5 12 -6 -1 -12 4 0 -6 -5 -5 -11 -3 11
5416A1j3MNJMj2LJ0j4MMQj0ljO%Lj4J4qMj2jKQojJ1oLj1NMqkkkJ1kJ2j4J9k3Q
$$ 11 -2 2 7 8 12 0 3 13 -1 3 7 15 5 2 1 7 7 10 -4 10 2 6 -6 -7 -5 3 -3 -4 7 1 4 -7 -2 2 -6 -8 -10 -12 -1 -3 9 -5 14 -9 -1
5461aRomJ6mlplKlJ0mOjkoJ1qNj0NKnj1OQjjoMJ2qJp%mJLJ2qKrKJ0%m%MjqK0j9
$$ -1 8 2 -2 14 10 7 0 -3 -1 -4 6 2 8 7 5 -1 10 2 7 -3 2 4 -1 -12 -6 2 1 0 -6 -2 10 2 3 -4 -4 -8 -7 -4 8 0 2 -7 -5 5 5 1 1 5 4 -4 16 -3
5513cjPOMj0MknJj3J6mjj1Qk%jLPnMj5J4KljLj2J3Mj1OMKomQpljQo%KLmJ1Jj5
$$ -3 -4 3 9 13 3 7 5 0 1 -12 4 0 -1 -12 -4 -6 -6 -7 -4 3 -2 2 -13 1 3 0 -1 2 -10 3 7 -4 2 6 8 2 -2 6 -1 -4 -5 3 -3 -3 -1 2 -2 9 10 -5
5563ekmMJ2j8PkkJ0n%LJj6J5oOJlKm%QJlRK%nnQj2J3knRnJmKnJKMlj3MLJml%Q
$$ -5 -7 -11 -7 5 -13 -6 -8 -10 0 -5 -5 -2 -1 -17 -2 -8 -2 -1 -4 -2 -6 -6 2 3 0 9 11 11 6 1 9 -3 10 8 3 12 7 8 4 6 1 2 4 8 5 -8 -4 -1 0 -4 -7 -7 1
5616AkjKpJQjkr%J0KLljQpjMRlnnMmMpKo%PnLjlNnoQj2jJ7LKKj3MKJNj5OLnOr
$$ 1 -1 -2 0 -7 -6 2 1 -1 -10 -10 0 2 5 2 1 9 2 1 5 14 11 6 1 5 1 5 -2 0 -6 -6 1 -4 -1 -2 -5 0 -5 -11 -3 -15 -16 1 4 6 8 -5 -1 1 2 7 -8 -2 1 -4 2 -7
5672gJRllJ6k%j3Qr%jkNnJ1k0J7mMo%Rk0LJ2mMppR%MKLkpNPkqMJ0j2MMKnPqnP
$$ -7 -6 3 0 -3 13 11 11 -2 6 -3 -3 -4 -6 -1 -6 5 -15 2 -2 2 -4 -4 5 -15 -12 0 -4 0 -7 -14 -5 -5 -1 1 4 2 -5 0 7 5 -3 1 11 -1 3 7 9 4 11 3 -2 5
5724Ej1J5j9MMmkJ5pNplKpNjqMJKlQkjMrJ3nlRj0J2nJ1pkmPoLjLKoJnnJ1qjLj1
$$ 5 -6 9 -10 -6 -2 -6 -8 7 0 5 -2 -5 -3 -10 -5 -6 -14 -10 -9 -7 -10 -2 -4 -5 -1 -10 3 -2 -5 4 -6 6 1 12 5 3 -1 6 0 3 2 5 7 1 2 -3 -8 3 -5 -6 -3 -14
5776a4ONNoJKlj2RJMnJ2j0OOj2NJ5nj4lJ9jrlOLoN%Nj6nPJK%j0K0j0mrJ3kL%p
$$ -14 -8 -3 2 -4 -3 -1 -4 -16 -7 -6 -2 -7 5 -5 1 7 -5 0 15 10 -4 -7 12 11 2 -1 5 8 2 7 7 12 -4 -9 -2 -1 1 1 -9 11 1 -3 -12 1 -1 2 2 -5
5824e%Mj0J5qQj2MKPjpNKpLJJ%MOoOlj0rJ4MJMnKok%qKkqJ2Nk1K1qKKqLNQj1%
$$ -5 -5 -1 -11 4 -4 4 -8 -4 -2 5 4 -3 2 4 -3 0 1 2 2 6 12 6 12 9 -1 -10 4 8 9 13 8 10 4 2 2 -6 -4 -6 -14 -2 3 -18 3 -5 -3 -1 -9 -6 -1 7 -4 -4
5876dKPJJmMNplJ2rKNrRrmJ0lj0jJ3j8J6j3Nlj1PPmLK%LLrQ%pl%RJlKjKJQmlJ
$$ -4 -2 5 6 7 3 7 12 5 2 14 5 7 12 3 12 3 -1 9 6 -4 -5 8 -10 6 -7 -2 -5 -16 -9 -2 -6 -3 -1 -1 2 5 -4 4 4 -3 -6 -6 3 4 1 3 2 4 5 13 9 6 7
5929GpK%kmjPj2J6rkPnJoLkKOLrJ1j0N%J0j6KjJ0kmJ2rNKkmJkPpKkJOMj6kRJ1
$$ 7 0 2 2 0 -4 -5 2 -10 6 -3 -5 2 -3 -2 -8 -5 -7 -5 1 4 -5 6 -4 1 1 11 -5 -3 -4 6 4 0 12 3 8 10 8 4 5 3 10 3 5 3 4 10 14 -2 -4 5 16
5980A6j8Qk1K1j5Pmj%oOnJ3JkNqOjJqKJ6j9J2%mMrJ6rnJ1pqLJ1ljqOKkMqRn%o
$$ 16 -2 6 -15 6 -9 -2 -6 -7 -7 -13 -7 -12 1 2 0 5 -3 3 2 3 -5 -3 13 -6 6 6 2 6 -3 13 4 -1 10 3 -5 -2 9 6 5 -3 3 5 3 7 -1 8 3 3 -3
6029cOKj2nRmLOkL%Kjj6J1JN%JkNj5J2J%PnjrqJ2koMPLj3LJ5j7qKNQmNqqJ2kl
$$ -3 3 5 -7 -12 -3 -7 -4 2 0 3 3 5 4 -12 -1 0 5 5 6 4 9 -6 6 7 7 14 9 8 -1 -9 3 1 -5 -1 6 9 -4 -1 14 -3 -11 -9 -4 4 0 5 -3 -11 1 -1 -4
6080dRplRkKJKoKjKMJmmJNPj2%m%%KMj3J8jj1kNlJ1nlOKjj6J1%jOoKNjqQLOj3
$$ -4 5 -2 -5 4 2 4 5 7 1 3 2 4 8 9 5 1 2 7 14 2 2 -2 -2 -2 0 4 -9 9 8 -3 -5 0 -3 8 3 0 6 8 7 -9 2 2 1 7 1 3 8 7 -1 7 10 16 3
6133CjJ4rJljQkplK%jNlpKJL%pOjj0J4jnnQnmJKK1j2J3j8J0lOqkJOkjJJ2j2pN
$$ 3 2 16 7 8 5 4 12 10 3 0 2 2 1 6 3 -4 -2 -1 2 2 -5 1 0 -10 4 3 -2 -7 1 -4 -8 -7 -5 16 4 17 -1 9 6 12 4 2 3 9 7 6 7 19 7 0 5
6184EQj4J1j4J1rJOpMqJ4j8J1NlLj3JKRllLJJ3j0nJ1%nmJ2mKpNj2LKNjMj5J0n
$$ 5 13 -1 10 -4 7 -2 -1 5 -2 2 -6 8 -10 1 6 3 6 -7 -6 -4 5 2 -1 2 3 16 6 1 12 12 7 3 15 11 13 6 11 -1 2 4 9 8 12 -3 7 2
6230BJNkj8NJ5klLoJ0j4LJ4j4nJ0n%KPj0J3nqJ0Qj1OLj5LJ3njp%J0q%KmkNj4L
$$ 2 3 8 6 -12 -7 8 6 3 6 0 10 -4 -1 13 -1 -6 4 -1 -1 1 8 -2 11 6 -2 8 16 5 11 14 -1 2 15 10 9 2 2 12 4 4 6 2 0 5 -9 -6
6276fQnqJ1nLNjkOpLmMmoLQPr%KoQjJj2PQMj0NoRmJoNj3K0j2kLlrPnJ2lJlQom
$$ -6 2 -3 -11 0 -5 -2 3 2 0 6 -1 2 -2 2 -2 -8 -5 3 10 1 1 3 -3 5 4 5 -7 0 8 12 2 7 1 10 6 7 1 6 -7 13 1 -1 2 -1 -10 -3 -8 4 1 2 -1 7 1 -3
6330cQoNJokO%J4j9MkLnPLj0LLJlmNmpK5j4PKj5NNoMomPoNj0OOnkJ2joPmqPJ5
$$ -3 5 -1 4 5 -1 -3 3 3 17 -2 2 0 3 -2 5 8 -2 1 4 5 2 -2 3 -1 -8 17 3 10 12 -3 2 7 1 5 -1 -5 2 -4 1 -9 -3 3 -2 -4 8 7 1 8 4 -4 3 18
6382A8poJ4j5j0QJQmQqnJ3j0qrJ1lJPoKRlj1rJ8nLJ0qLj3J8nj5J5j3MPqLJ4jj5
$$ 18 11 5 19 4 -6 2 3 11 7 15 7 2 15 5 -3 -12 -1 -4 -3 4 -2 0 9 6 -5 -14 4 -1 2 12 4 7 -6 12 7 -8 7 -6 -2 5 -3 0 14 13 -2
6427bRkKJqjNPj1OpMJkjKj0PoJqJ0kJlOjjJQKoMJj0NOn%m%Q%JqQkoOj1J0j0NK
$$ -2 7 5 7 8 0 -1 4 11 0 6 -1 3 4 2 1 3 -7 0 -6 -5 -13 -3 -5 -4 -7 -1 -2 -3 -2 6 8 2 6 7 -3 2 8 3 3 -1 -1 7 7 8 0 8 6 0 6 -5 5 -5 0 2
6481BrJ1moJ3KoKKpjmQmj0KJ5NqJqJ6rJNrNlLPj1RJl%j0LOllkLJ0j2kJLlkKJk
$$ 2 -7 4 0 -6 7 9 3 5 7 0 -1 -5 3 -1 -11 -9 6 11 3 4 -4 12 3 4 9 0 5 2 5 12 1 10 11 8 8 -2 1 7 4 1 -1 2 12 0 -2 -1 2 -1 -3 -1 0 -2
6533bnPrJOkjQL%kKqNNlJ1poOj0PRj3J2pqJ4j6JojMNNj3lJ6kJKoOpJqJ0jnLNm
$$ -2 -7 0 -9 -8 -2 -4 -5 3 6 6 4 6 -2 3 8 5 16 9 3 9 -1 6 15 2 14 7 -1 13 -3 -2 -8 -9 -5 0 5 -8 -11 5 3 4 6 0 6 -1 0 -8 2 1 -4 -1 4 0
6585@kjJ5j1L%JOp%nnRkkNO%jmj4K3k0J1prMkQPj3NRj5RKjj0LPpNNqRpKJ1plO
$$ 0 -2 -3 12 1 4 4 5 11 4 4 -1 -6 3 1 -1 4 10 10 9 5 -9 14 -6 5 -2 -11 -7 -9 -1 6 -7 -2 7 -8 1 3 2 -8 -5 2 -5 0 5 -3 6 -1 1 12 5 2 8
6636HomPmJ1k4J2nMLLJJj2Oj1Rj3RRj4N%Pj6J1NqQKnNMqPlJJ%J7kj7MpJL%nL%
$$ 8 2 -2 5 1 12 -12 0 -5 -1 2 5 6 7 -5 1 -10 -1 -14 -5 4 -10 -5 -5 2 -14 -3 2 -6 2 4 -1 4 8 0 7 4 5 6 6 23 21 4 8 1 2 5 5 0 3 3
6686CknJ5j1jJ0qp%kLkKOmpJJ6KlnlP%mJ%J0j1RoJ1JmQj7%%mMMoKKKmloRLj2L
$$ 3 1 -4 11 0 -1 9 1 -6 -6 -8 -5 -7 -5 1 -3 -10 -9 7 9 6 1 -2 5 5 1 2 2 12 1 10 4 15 16 12 20 3 3 3 -1 3 7 1 3 5 7 3 0 -6 3 6 -6 -3
6738cOjJLj0J4j9J1NLpKKKj1JNLKlLLqJ0mrJ0qQLj3OKj0LjmKNnJj0J2olOjJ1j6
$$ -3 3 2 3 6 -4 10 -9 2 7 10 3 5 7 9 -2 -1 4 7 9 6 9 12 4 14 10 1 11 3 11 14 1 7 9 -1 2 1 -3 -1 4 -1 0 -10 2 -4 -7 -1 -2 9 -7
6787gMJ8q%qRj0PLmlKJ4kj1pJ3nlLnJJ4j5kklONqLoRpOkKrJ1jj1J8j1Roj4J9N
$$ -7 -3 15 7 7 -1 8 -2 5 8 4 1 3 17 15 4 -3 10 5 2 5 0 1 15 0 -2 -4 -7 -1 4 -4 -1 -7 2 -5 1 -1 1 -8 3 2 -9 9 -2 7 1 -13 6 11
6835A1qRkOj2Qnk%JJ0j1KpMMmLjkmnJMJ3j1j5J6Kj1MMMmj0MOj0RlNO%Lkl%%jn
$$ 11 3 12 10 16 4 12 7 5 5 6 16 5 7 0 4 8 4 7 6 4 0 -5 -4 0 13 2 -13 3 5 -6 -2 2 6 2 -8 -4 2 -8 1 -2 3 9 9 12 10 7 7 7 6 1
6885AKPNn%j6NJ3oLqOlrNK%j0MJKM%J4j4pJjQJJkOnPj6J4jlJlN%JpOLkmLj1%j
$$ 1 3 10 15 10 10 -6 -1 12 6 9 1 7 4 -5 0 2 2 -8 -4 -3 -1 3 3 17 3 -4 -3 -4 4 5 6 4 10 5 12 -4 10 9 6 7 4 9 9 10 3 9 12 10 6 9 -2 -2 -3
6938cRmMq%jqNJPj%KjLj3NLJ5j5NJ5j5QorJ7j2OlKJqJnJ7j4OJj4OPpQj1lNoKK
$$ -3 6 2 6 -2 -2 -3 -11 -6 -5 2 1 1 3 2 5 -8 -3 0 15 0 5 20 5 13 7 -2 15 3 9 6 8 9 1 2 -3 14 0 6 7 -7 -1 6 -1 7 -4 -7 -2 -8 -6 -4
6988dLmKKkOKj0OLj4J3JmlJjJ5j2J1kjokrNRkMoqMOL%j2ONMj3jJPj0J2okRj1J6
$$ -4 -1 -5 -3 -1 -3 3 5 -5 1 4 -10 3 4 0 -3 -2 -3 12 0 11 9 8 2 0 -9 -4 5 3 7 1 -7 -3 3 6 6 -6 0 5 9 -4 -5 -4 3 -7 5 -1 -3 6 -5 11
7038A1nrOqJ0Mj0J0oJ6j2kK%lK%JpOlmJ2j0Oj1jJ4j1j3QnOQmlNJMnQrJ1onLOk
$$ 11 6 -3 3 -5 5 9 -1 9 3 19 7 5 7 7 4 6 6 7 0 6 3 -1 11 1 7 -4 -5 9 -2 -15 -7 -12 -6 2 -2 -5 0 1 5 0 8 -1 10 4 -1 2 8 6
7086FK%lkPmMmQlrJ4qmLrJQj7PRj4LlJ2mp%kRmJ1r%kNKpKJRmjJ2oJ3j6lkKoJ1
$$ 6 8 8 5 3 10 6 10 6 14 11 2 16 8 4 7 -2 -1 7 -10 -3 6 -8 -5 -8 4 0 -7 -7 -9 0 -4 7 -2 -2 -4 1 3 -4 -2 -1 8 4 3 15 9 22 6 3 1 3 -3 8
7138HploJ2plKkjJ0jmMJJkKrJMjN%qpJ8mnJ2qqLJKnLJ2pJMjj0J2mNpj3LJ0j3J2
$$ 8 1 -2 -8 4 -3 -6 -4 -6 -7 3 2 -2 2 3 4 2 4 -5 -4 0 -1 4 4 -4 -11 7 3 -2 10 2 -6 -3 -2 0 -5 -2 10 3 4 8 7 -3 9 5 10 3 -10 -7 3 -10 2
7189BpkMORj6JKlJlNjOjqJ5NjoQmplJJmkJ6rOj2RMnNjrrNNJj5KRlJJ5j8QmlKm
$$ 2 -5 -7 -3 3 12 -4 -3 -1 -4 -3 -6 -1 -2 4 3 -5 10 15 14 8 16 12 5 2 3 4 0 -2 14 5 11 -1 8 12 7 12 11 2 -7 -2 3 4 -11 -9 0 -3 -2 13 -5 3 -1 -4 -2 -6
7243fMQjmqJ0%%NKj3J1%%okQmKnNmPoJ0pjKnJkqlJ5j5JQNlJlpJ4j1J3j0JPJKJ
$$ -6 -2 6 5 1 -7 3 3 3 8 10 -3 8 8 8 2 0 8 4 6 1 6 2 9 3 13 6 5 7 2 3 1 -7 -10 5 -10 -9 -1 4 1 2 -1 -8 6 -5 8 -2 -1 6 7 9 10
7294A0KRjkj7OJ1j3jJ0lJj1JKKlqJ9j1KmJj1MKkJ3jlMkkknKLnOPMMLk%JpjrJ5
$$ 10 12 21 20 18 1 7 18 5 4 14 11 12 1 2 4 6 3 -5 14 3 5 1 2 -9 -5 -3 -5 8 7 4 8 6 4 2 -3 -1 2 -3 3 10 14 18 21 19 19 20 13 12 3 18
7344A8j1LmLp%OmJ8j8%pkMJPpKnKNpPMoK%%J3j5QOj4KJ0oJ%lJ1qNj1MNppJ2j4
$$ 18 7 10 6 9 2 2 8 4 22 4 4 -3 -5 -1 0 7 0 2 -3 -1 4 -3 4 8 2 4 4 4 17 2 10 16 2 4 14 8 9 9 6 17 9 14 3 7 12 5 -2 10 -4
7393dJ0pJmJ3j1OpMnJJoOjNoJ2oKj0K2lmmj%PO%nl%Llj0J2Knj0Qj3J3KrP%Jj6
$$ -4 6 -1 0 -4 9 -2 4 -3 1 -4 -3 -2 -8 -2 -3 2 -4 8 2 4 -6 16 13 9 5 4 4 11 17 17 12 9 9 12 9 -1 11 13 8 -2 6 -7 6 8 -1 6 6 7 -9
7442iJ3j9LNJ4j3Qj0J0oNJNmJ0njLkjj4J5lJjP%KpNr%oLmlPnKLmKJ3oJj0mkPQ
$$ -9 4 -15 -12 -7 7 -6 2 -8 2 -4 1 2 7 3 13 8 7 10 8 7 -7 8 5 6 5 12 12 14 7 12 3 3 -3 0 -4 -7 0 -5 -3 0 -4 -2 11 5 6 -4 -8 -10 -3 5
7492EnJLRrlJ7Kj2Oj2oMJ2jkmMqKKL%opQOmqJj1QJQj6KLJQnQnJkJj4J9jNmmNM
$$ 5 0 1 4 13 4 1 18 20 8 14 2 -4 0 12 11 9 5 9 1 3 5 8 8 2 -5 3 9 5 -3 -2 -13 -5 -4 4 -12 -10 -7 -6 2 -3 5 0 1 -1 0 -14 5 4 9 5 1 6 10
7545A0rJ5j1jM%KpNQoj%jJnQj3KJQoRj7J4mpkMJj0nJ2LO%pRKoJ1nJopNMoOj5K2
$$ 10 1 16 5 4 8 8 10 3 8 16 10 9 9 8 9 4 12 -1 1 2 10 4 13 -4 10 6 -1 -3 1 2 -8 -13 -1 2 8 8 1 10 12 6 17 12 13 7 0 5 9 3 9 -6 16
7596A6j4lP%JmkrJ4lpRNj5MOKnjOoOoNnmJ0Oj3NJ2p%Q%pjlLOj2J0j6QlJ2%%Jj5
$$ 16 2 -1 6 6 7 3 1 -8 6 3 -4 5 10 -5 -1 5 7 2 1 7 1 7 1 6 1 -3 7 13 0 5 17 10 10 18 18 11 10 7 10 16 4 14 -2 6 3 15 15 15 16 1
7646AoPlkMpPpjJ9pLlkJMMj0J0rMLklJ0j1JPNpjjlnKJRoOj1LkQj5LoJ%J2Jj2N
$$ 1 -5 2 -1 -3 1 -6 1 -6 -7 12 5 8 5 3 4 8 12 2 12 3 7 10 8 5 15 4 5 12 17 10 9 8 5 0 2 3 12 6 12 1 4 2 10 -5 -2 -8 -7 -7 5 6 -6 -1
7698a%jKJ%lJ9j4JKNrJJ5j2jMpNJL%pPj8J3LrnJ4Mj4RkJ4j4rkONj3N%J3pmMRq
$$ -1 -1 -2 0 1 1 -2 17 3 4 6 11 2 3 18 6 5 9 2 7 8 11 11 4 11 -7 6 9 0 -5 9 13 -1 8 6 20 6 -3 -5 1 6 -7 -2 -2 11 4 0 4 13 5
7747ElNj8J0jRJ4j5JPj6J2p%Rj1lJ4qj0J4nNljj3NlNJJ0r%KnOpJ4j6JJ8j3J7j2
$$ 5 2 7 -11 -1 -2 7 21 6 7 14 -2 10 3 3 12 1 -2 12 4 -6 8 3 8 5 4 -9 -4 -7 -2 -1 9 0 0 2 -3 3 -4 10 -6 -5 13 0 17 5
7791Eom%QLOlKlmLjmrONmNr%K%K%mJ2j3jjMmLmNMRKj0Rj2OMPj0Nj4MQj1OrJ4L
$$ 5 -1 -5 -5 3 6 12 9 11 8 4 7 6 2 -7 -1 4 0 5 -4 -4 -2 -2 0 0 -4 8 -5 -6 -7 -3 -7 -4 -8 -3 1 10 12 2 11 -1 5 9 16 6 11 -3 1 9 -2 4 -5 9 12
7844A2jlp%OmpMj5MjPlLMJjj4Q%PmkKKJ5j2J8j2Jj8K2lloJ3rRpJllJORj8kMLj0
$$ 12 11 8 1 1 7 3 -4 0 -15 -11 -12 -5 -8 -5 -1 0 -1 -15 -7 -7 0 -4 -6 -4 -2 13 1 19 7 8 -10 12 9 6 0 13 4 13 6 7 4 1 2 8 17 -1 -3 1 4 -6
7894fQrOj1PoJ3j0KkJ8j3mk%OlmJ5j3K3j0OKnM%kOj5QpJ1j1OlL%j4J4j6JKrLJ2
$$ -6 2 -7 -1 -12 -5 -11 2 -8 -6 -8 10 -3 -7 -9 -9 -3 -6 -10 5 -8 15 5 11 13 8 12 12 10 16 1 9 2 13 2 8 5 8 8 -6 8 -8 -7 -5 -14 -11 1
7940ApjMkJ2JKmmJoklQPMk0J7%Lj0kJ3jj0%PoQjmjOj4PmnMoMpMMj2J8Mj5POpo
$$ 1 -6 -7 -3 -5 7 8 10 6 2 3 -3 -5 -8 0 7 11 -9 8 8 11 1 -1 12 11 1 1 8 2 10 9 5 4 10 -4 3 -1 -6 -2 -8 -4 -11 -7 -3 -15 3 7 -8 -1 5 -2 -8
7991hMnJ2NMjj1MNqPJoJRlJj1jkKMj1JjJ2MlnJRj9JOnMmQpPrJ1KrJ0rJ1k%mKK
$$ -8 -4 -9 3 8 12 11 0 4 9 1 8 9 3 4 13 10 11 0 -1 -3 -1 3 -8 -7 -8 4 8 5 0 1 10 -9 -8 -2 -7 -3 -7 1 -6 1 -8 3 5 -4 6 -3 8 6 6 2 4 6
8043FLLlM%lolRrMNpoJPlMj6J0LpQknPmLmlPmRrOKnjQo%J0mo%NlPj5jQJ%mJp%
$$ 6 9 12 9 13 13 10 4 1 10 1 5 10 3 -3 -2 5 2 6 -10 0 3 -4 4 2 -3 4 0 3 -1 -4 3 -1 8 -1 5 7 2 1 9 3 3 13 9 3 3 8 5 12 -3 -4 4 5 5 1 2 -5 -5
8100eO%pRj1%MOmqJ0mJ0kLlJ2j3J7j5mJ0qKrJ3nNMrLkKNKnqj%rJ2kOJ0k5PMlk
$$ -5 1 1 -6 3 -8 -8 -4 2 -2 -10 0 -4 6 4 7 4 16 3 20 5 1 11 3 5 -4 9 4 9 13 4 7 5 7 12 14 9 1 0 0 -9 3 1 7 17 -8 -1 3 0 -2
8149bLj3MJ1mpJNNqKMPlmJKjPNpkljPJqKmNlNkjMj9RJ0n%nk
$$ -2 1 -12 -8 3 -1 -8 -7 -2 3 -5 -3 1 8 5 1 2 4 3 10 15 8 6 3 2 9 10 2 4 0 5 2 7 5 4 8 -11 -2 8 3 3 -2 -4
8191d
$$ Imaginary data points
##PAGE= N=2
##DATA TABLE= (X++(I..I)), XYDATA
0@%%%%%%%%%%%%%%%%%%%qJ6j6J6j6J6k4L2l2L3m1M8n6O4p2Q0q8J02j11J22j38
$$ 0 0 0 0 0 0 0 0 0 0 0 0 0 0 0 0 0 0 0 0 -8 8 -8 8 -8 8 -16 16 -16 17 -24 24 -32 32 -40 40 -48 54 -57 65 -73
40g3J54j70J90k14K34k58K88l18L50l84M23m67N15n66O24o92P67q52R53j069J206
$$ -73 81 -89 101 -113 121 -137 151 -167 183 -201 222 -245 270 -296 328 -364 403 -449 504 -565 641
61F41j375J583j852K212k718L493m840P824k5911J6438N4735m3906m3951K1214
$$ 641 -734 849 -1003 1209 -1509 1984 -2856 4968 -20943 -4505 50230 6324 -37627 -16413
75a6413M3801j0049k7660p383J3380J5316Q609k2297k6404K0194M4234j6176n4172
$$ -16413 27388 17339 -10321 -17704 -4324 10992 19601 -2696 -29100 -8906 35328 19152 -35020
88c5020O749N9533J940n6118j1250M7576J6250l2984j8072J6710J4333M77p184
$$ -35020 -28271 31262 33202 -22916 -34166 13410 29660 -3324 -21396 -4686 9647 10124 2940
101B940j5074l580K6475J5181l2580k6389L3978L4682l0704l9023K4525L8338
$$ 2940 -12134 -15714 10761 25942 -6638 -33027 951 35633 4929 -34094 -9569 28769
113B8769j6536l2868Q735K3131k318j0719j604k701K745J5342j410k5701j676
$$ 28769 12233 -20635 -11900 11231 8913 -1806 -3410 -6111 -3366 11976 10566 -15135 -16811
126a6811L2573N385l5533q605L4602J0266l0487r822K4205P069j6821k409R595
$$ -16811 15762 21147 -14386 -22991 11611 21877 -8610 -18432 5773 12842 -3979 -6388 3207
139C207l529l217R814j739j5440N187J9753p350k2008Q630K2086r503k0118J0405
$$ 3207 -322 -3539 6275 4536 -10904 -5717 14036 6686 -15322 -6692 15394 5891 -14227 -3822
153c822J6513j1584j1946J2975O987j4443k312J5534j752j5888M960J5094p426
$$ -3822 12691 1107 -10839 2136 9123 -5320 -7632 7902 6150 -9738 -4778 10316 2890
166B890j2973R397R512j1078n053J2844J19j4743M749J6728q817j8371J1579J9357
$$ 2890 -10083 -686 8826 -2252 -7305 5539 5658 -9085 -4336 12392 3575 -14796 -3217 16140
180A6140j2772j9077J2365J7167j0726j3389Q304P785n852q66M027o833l232J4290
$$ 16140 3368 -15709 -3344 13823 3097 -10292 -1988 5797 -55 -921 3106 -3727 -6959 7331
194G331L709k0677n322K5029P619k6708r905K5448J1488k1418j1514J5167R600
$$ 7331 11040 -9637 -14959 10070 17689 -9019 -18924 6524 18012 -3406 -14920 247 9847
207I847p636n480l5n98O761Q048j1564j5914J3885K3010j3568k8202J0867L0472
$$ 9847 2211 -3269 -3304 -3902 2859 10907 -657 -16571 -2686 20324 6756 -21446 -10579 19893
221A9893o585k9283J707K4495K630j6659n428O730N993L962m027j4036j43K2124
$$ 19893 13308 -15975 -14268 10227 12857 -3802 -9230 -2500 3493 7455 3428 -10608 -10751 11373
235A1373N872k7129j2028K8553J7428k6366k0860K1150K1506j3912j8942N911
$$ 11373 17245 -9884 -21912 6641 24069 -2297 -23157 -2007 19499 5587 -13355 -7444
247g444J3232J568n124p376m430J0738J4064j1367k2490R397K8452n500l1129
$$ -7444 5788 7356 2232 -5144 -9574 1164 15228 3861 -18629 -9232 19220 13720 -17409
260a7409O58L0136M021k5597p459J8235Q892r083p812m95M346R277J033j6085
$$ -17409 -16751 13385 17406 -8191 -15650 2585 11477 2394 -5418 -5913 -1567 7710 8743 -7342
274g342p451K0172J3800k1258j8957J9530K1906j5680k2079J0543J9252n229j3799
$$ -7342 -14793 5379 19179 -2079 -21036 -1506 20400 4720 -17359 -6816 12436 7207 -6592
287f592O62O420K490J767l768r808L309J6575j435k1208j195K3325L867k2790
$$ -6592 -5930 490 2980 4747 979 -8829 -5520 11055 9620 -11588 -12783 10542 14409 -8381
301h381n803J9953O522j5410n655R915L272m296L15p48m593M659Q873p222j2578
$$ -8381 -14184 5769 12291 -3119 -8774 1141 4413 117 432 -316 -4909 -250 8623 1401 -11177
316a1177Q465J4987q553j5901P935J5088o995j2748O158R244n695n042N722P16
$$ -11177 -2712 12275 3722 -12179 -4244 10844 3849 -8899 -2741 6503 808 -4234 1488 2204
330B204o097L321O561o535o933Q904O827j0294o059J0905M527j0921k357J0570
$$ 2204 -3893 -572 5989 -546 -7479 1425 8252 -2042 -8101 2804 7331 -3590 -5947 4623
344D623k75j0063K989R441n456q740P351P778q461o442Q749M557q271k072P283
$$ 4623 4348 -5715 -2726 6715 1259 -7481 -130 7648 -813 -7255 1494 6051 -2220 -4292 2991
359B991r48o088M409M906p840m057J0973L629j3300l601J4512L768j4337l817
$$ 2991 2043 -4045 364 5270 -2570 -6627 4346 7975 -5325 -8926 5586 9354 -4983 -8800
373h800J2687L422r771k352N962L76j796K496k263n986N495R743p541j3222Q231
$$ -8800 3887 7309 -2462 -4814 1148 1524 -272 2224 -39 -6025 -530 9213 1672 -11550 -3319
388c319J5809p550j6956N837J6295l490j3730J213R420N39l837j300k315P83Q290
$$ -3319 12490 4940 -12016 -6179 10116 6626 -7104 -5891 3529 4068 231 -1069 -3384 -2601 5689
403E689Q91j3245l523J6589O509j7909r277J7064J1119j4281j1548J0043J0215
$$ 5689 6580 -6665 -10188 6401 12910 -4999 -14276 2788 13907 -374 -11922 -1879 8336
416H336n084p093J79K441L989L136o678r022P762J4308p070j8223N037K0124k109
$$ 8336 3252 -3841 -3662 -1221 2768 5904 -774 -9796 -2034 12274 5204 -13019 -7982 12142 10033
431A0033j9699r64J6941L461j2229m800O224M580K80k826o344l62J1208M326j4306
$$ 10033 -9666 -10630 6311 9772 -2457 -7257 -1033 3547 3827 1001 -5343 -5705 5503 9829 -4477
446d477q413J5336J1861j4401j3940J1780J4274q139j2607M191R123n77m231k102
$$ -4477 -12890 2446 14307 -94 -14034 -2254 12020 3881 -8726 -4535 4588 4011 -220 -2322
460b322j411L526P049l595j1925K507J5414o56j7109j466J6848L272j4751m349
$$ -2322 -3733 -207 6842 3247 -8678 -6171 9243 8587 -8522 -9988 6860 10132 -4619 -8968
474h968J1236M303o877l109K296Q02J943K266n268n570P430Q618q319j0878Q087
$$ -8968 2268 6571 -306 -3415 -1119 -317 1626 3892 -1376 -6946 484 9102 783 -10095 -2008
489b008J1987p029j1713N559J0080m042p353K850L883k217j09K126l508k486O478
$$ -2008 9979 2950 -8763 -3204 6876 2834 -4519 -1669 2214 -3 -112 2014 -1494 -3980 2498
504B498L073q598l638R751L852r941l559R358K677q223j232O827n96n345K623
$$ 2498 5571 -3027 -6665 3086 6938 -3003 -6562 2796 5473 -2750 -3982 2845 2249 -3096 -473
519d73L949m552k660O106J501p077m15P417p01p139J920O333l275n226M725L927
$$ -473 3476 -1076 -3736 2370 3871 -3206 -3621 3796 3095 -4044 -2124 4209 934 -4292 433 4360
535D360o137k701P296J657q076q14Q250J29p711N00O506j228m667K199K386l399
$$ 4360 -1777 -4478 2818 4475 -3601 -4415 3835 3964 -3747 -3247 3259 2031 -2636 -437 1949 -1450
551a450J0M879k222o396L914P850m937q933N227R357m841q917L939P503k839n178
$$ -1450 -1440 3439 1217 -5179 -1265 6585 1648 -7285 -2058 7299 2458 -6459 -2520 4983 2144 -3034
567c034J793K048j100J525R13n070j337Q150K300j0373l572J1469M854j1264n752
$$ -3034 -1241 807 -293 1232 2145 -2925 -4262 3888 6188 -4185 -7757 3712 8566 -2698 -8450
582h450R821N969p360n234M267L542j051q77j852k445L999N929n106r175N121
$$ -8450 1371 7340 -20 -5254 -987 2555 1504 627 -1225 -3670 329 6258 1152 -8023 -2902
597b902J1655m217j2904K597J2718p48j1045r16Q092J987m229k160o9J367M206
$$ -2902 8753 4536 -8368 -5771 6947 6199 -4846 -5762 2330 4317 88 -2072 -2141 -774 3432
612C432L19p609k593R923N070j0903p212J0471Q623q862q938O378Q013l542n890
$$ 3432 3751 -3858 -6451 3472 8542 -2361 -9573 898 9521 659 -8279 -1901 6112 2570 -3320
627c320P81K734J459J060k865m946L288Q385k778j0983J618J2313o8j2243j403
$$ -3320 -2539 195 1654 2714 -151 -5097 -1809 6576 3798 -7185 -5567 6746 6678 -5565 -6968
642f968J0798K483q217k832M928K351j380r84j974j048M673L370o416n653P153
$$ -6968 3830 6313 -1904 -4736 192 2543 1163 179 -1795 -2843 1830 5200 -1216 -6869 284
657B84P456o956q454N962Q456m554p399K990N463j684k825P42j28l35L063M27
$$ 284 7740 784 -7670 -1708 6748 2194 -5205 -2215 3248 1564 -1261 -519 -647 -982 2081 2508
673B508n513q71P286J504q233k045Q339K284p628k129O390J457m783l21L035j121
$$ 2508 -3005 -3876 3410 4914 -3319 -5364 2975 5259 -2369 -4498 1892 3349 -1434 -1755 1280 159
689A59j441K712N2m186R65N318j685n963K127O046k429n586K699M696l044l424
$$ 159 -1282 1430 1482 -2704 -1739 3579 1894 -4069 -1942 4104 1675 -3911 -1212 3484 440 -2984
705b984L449J986l861n74M243o57m445J634M410k378m003K894L231l283k130L605
$$ -2984 465 2451 -1410 -1984 2259 1602 -2843 -1209 3201 823 -3180 -286 2945 -338 -2468 1137
721A137P85l917O19M239j939m551K995M726l670m678L912M359l786l587L330K400
$$ 1137 1922 -1995 -1376 2863 924 -3627 -632 4094 424 -4254 -342 4017 231 -3356 -26 2374
737B374k723p78K085j118j575L089J321m903j306O305J488p079j875P206K139
$$ 2374 -349 -1127 958 -160 -1735 1354 2675 -2228 -3534 2771 4259 -2820 -4695 2511 4650
752D650o573k201N276J870l491j071J477k32N12J897k152l738L253N477l675o852
$$ 4650 -1923 -4124 1152 3022 -469 -1540 -63 -295 217 2114 -38 -3776 -523 4954 1279 -5573
768e573L491P636k814p586J808O721p72n031p9K728N04n0m00k662k43M980J274
$$ -5573 -2082 5554 2740 -4846 -3038 3683 2911 -2120 -2199 529 1033 983 583 -2079 -2322 2658 3932
785C932o661k562P549L771p510m671O607N019n074m597L089L474j047j628p63
$$ 3932 -2729 -5291 2258 6029 -1481 -6152 455 5474 400 -4197 -1108 2366 1319 -309 -1072
800a072p02K105L199k755n479K743P262k164q246J185Q326j38p443q01N760J328
$$ -1072 -1774 331 3530 775 -4704 -1961 5301 3137 -5109 -3924 4402 4264 -3179 -3980 1780 3108
816C108l492j308R25O78J545M55l626j904N052L371n688m637N624N441m931n561
$$ 3108 -384 -1692 -767 -89 1456 1911 -1715 -3619 1433 4804 -884 -5521 103 5544 613 -4948
832d948L780N027k465l767J200J976k13J72m11k327N71M250l63n663j06O424O56
$$ -4948 -1168 3859 1394 -2373 -1173 803 590 762 351 -1976 -1405 2845 2482 -3181 -3287 3137 3793
849C793o530j107N950J327m874j128L392N55j801L83K62j518J029K681j926l694
$$ 3793 -2737 -3844 2106 3433 -1441 -2569 823 1378 -423 -40 222 -1296 -267 2414 488 -3206
865c206K466M365k626m635K567M405k364l734K146K710k028j441J980J25k056
$$ -3206 -740 3625 999 -3636 -1069 3336 972 -2762 -616 2094 66 -1375 605 730 -1326
880a326J109K144k108k242K842K201l263j958L390J525l342q51L150L7k883Q83
$$ -1326 -217 1927 -181 -2423 419 2620 -643 -2601 789 2314 -1028 -1879 1271 1308 -1575 -692
896f92K588j729k312K482K005k980j643L166J213l122o16K787j21k314R80J763
$$ -692 1896 167 -2145 337 2342 -638 -2281 885 2098 -1024 -1640 1147 1026 -1288 -308 1455
912A455j968j222K898P77l675m85M224L22m415k08M182J27l552N8K590l82j401
$$ 1455 -513 -1735 1163 1940 -1735 -2220 2004 2326 -2089 -2297 1885 2012 -1540 -1482 1108 726 -675
929f75R17J22j605J050K415j973l224K554L906k735m337K580M310k116l862J494
$$ -675 242 364 -1241 -191 2224 251 -2973 -419 3487 752 -3585 -1005 3305 1189 -2673 -1179
945a179K947q78j634L89L8j48J652J92l181n44M386J094n102j694N256K207m817
$$ -1179 1768 890 -744 -355 -317 -465 1187 1379 -1802 -2346 2040 3134 -1968 -3662 1594 3801 -1016
962a016k461L893K330k593j764J143P70K27N74j359k046K042L471k278m642K096
$$ -1016 -3477 416 2746 153 -1611 -468 302 529 1103 -256 -2302 -260 3211 933 -3709 -1613
978a613N325j587n439Q91M951k05l897k91K394N14o59l27j113j70K631R68l767
$$ -1613 3712 2125 -3314 -2423 2528 2323 -1574 -1865 529 1043 384 57 -1056 -1226 1405 2373 -1394
995a394j857M380K689m440l296L994L499l164l253K113K502j019j350O2p7N98
$$ -1394 -3251 1129 3818 -622 -3918 76 3575 411 -2842 -729 1773 754 -596 -534 -611 -13
1011a3J629r42l023R25M133o43m764K13M879K47m473n60L616O41k439m32J119
$$ -13 1616 674 -2349 -1424 2709 2066 -2698 -2485 2394 2641 -1832 -2392 1224 1865 -574 -1006 113
1028A13q1J78P97j277j612K053K366k492k961K588L258k423l200K068K788j669
$$ 113 32 210 1007 -270 -1882 171 2537 45 -2916 -328 2930 507 -2693 -625 2163 494
1044D94k019J262J065r97L6Q45j064q28J972Q88k628r62L000J001l064r14K884
$$ 494 -1525 -263 802 -195 -159 686 -378 -1206 766 1654 -974 -1936 1064 2065 -999 -1913 971
1061I71O56k506k58K028k95j518R27J004j545n78K056K16k389N2K536l39k428
$$ 971 1627 -879 -1137 891 596 -922 5 1009 -536 -1114 942 1158 -1231 -1179 1357 1018 -1410
1078a410O31K112r34j650J301J114j690n64K059Q6k343L00K502n79k467P63K214
$$ -1410 -779 1333 399 -1251 50 1164 -526 -1090 969 1055 -1288 -988 1514 935 -1532 -769 1445
1095A445q91j751J004J106j158l60J357m15j610J101J880j645k099J935K268k024
$$ 1445 554 -1197 -193 913 -245 -605 752 337 -1273 -172 1708 63 -2036 -101 2167 143
1111A43k256J901K025j573j567J190Q70q05J8M93j006k79J915K61k699l98L208
$$ 143 -2113 -212 1813 240 -1327 -137 733 -72 -54 439 -567 -846 1069 1330 -1369 -1767 1441
1128A441O18l388q32L214R61k716r32J950O80j021j84Q2n29P64J322j358k115
$$ 1441 2059 -1329 -2161 1053 2014 -702 -1634 316 996 -25 -209 -127 -656 108 1430 72 -2043
1145b043J672K812j707l244J478L369j092l112O33K492k15j578p1M69J16P04M6
$$ -2043 -371 2441 734 -2510 -1032 2337 1245 -1867 -1234 1258 1043 -535 -606 -137 -21 683 729
1162G29j780m01K615Q79l117j398L254J778k993j993K452J918j690j517Q57Q59
$$ 729 -1051 -1452 1163 2042 -1075 -2473 781 2559 -434 -2427 25 1943 253 -1264 -407 452
1178D52q7O4n27j061R00K005r95k783Q91L256o13l380K50L114O5k524k51J685
$$ 452 365 429 -98 -1159 -259 1746 751 -2032 -1141 2115 1502 -1878 -1628 1486 1551 -973 -1224 461
1196D61K32p12l4k64l67J134Q58j769j386K148J829k219k102K068K138j718j904
$$ 461 693 -19 -53 -317 -684 450 1308 -461 -1847 301 2130 -89 -2191 -123 2015 297 -1607
1213a607J268J454q49p72M73j0k31Q25J23j560j27K083K36k391l67K454M26k273
$$ -1607 -339 1115 266 -506 -33 -43 -274 551 674 -886 -1013 1070 1306 -1085 -1452 1002 1428 -845
1231h45m05J906K61j426L0Q84m30l47Q66p9j295M23J616o32j801P44J813q07j655
$$ -845 -1250 656 917 -509 -479 405 -25 -372 494 415 -880 -457 1159 527 -1274 -530 1283 476 -1179
1250a179Q52J340r08r06R83M15j090O9J188m82j271Q09J295j019j226J122J051
$$ -1179 -327 1013 105 -801 182 597 -493 -424 764 282 -989 -180 1115 96 -1130 -8 1043
1267A043j143p60J120L72j072Q9J038n55j015R51J008j264j001J454R59j495q40
$$ 1043 -100 -860 260 632 -440 -351 687 132 -883 68 1076 -188 -1189 265 1224 -271 -1111
1284a111J377O32j155l31Q83j14n88N91L31j091j53J548O0j868m7K028Q9j988
$$ -1111 266 898 -257 -588 295 181 -407 184 515 -576 -729 819 879 -989 -1036 992 1081 -907
1302i07j40J766J44j335o3Q11j31k08M23l63p93Q40J183j160j550J280J805j239
$$ -907 -1047 719 863 -472 -535 276 145 -63 360 -3 -796 44 1227 67 -1483 -203 1602 363
1320C63j907J047J797p61j492M55R81k01l25M5l99mJ089J12j640l31K021O07k176
$$ 363 -1544 -497 1300 539 -953 -498 483 282 -43 2 -397 -401 688 800 -840 -1171 850 1457 -719
1339g19q36K077R86j753r76J243Q23p04m52J22l8L49O41p02j224Q51J721q39k056
$$ -719 -1555 522 1508 -245 -1221 22 845 141 -311 -189 -227 122 763 61 -1163 -312 1409 570 -1486
1358a486O70K183m45k046J94J679Mj123j09M77P2K28R4q46l74J325P15j627j025
$$ -1486 -816 1367 922 -1124 -930 749 753 -370 -479 -2 70 298 392 -454 -828 497 1212 -415 -1440
1377a440J712J248j599j342J325J249r60r73N61N65k20l6k4n50J73J075j83j490
$$ -1440 272 1520 -79 -1421 -96 1153 193 -780 -219 346 126 90 66 -484 -311 764 581 -909
1395i09J18J733L0j794j63J673K19j380j95R75P5n26J57N8m32L09P38n88j013
$$ -909 -791 942 972 -822 -985 688 907 -473 -668 307 382 -144 13 71 -361 -52 686 98 -915
1414i15P47J183p99j262P72J207o97j021O28P09n48l46N29n5n12M21N72p44n87
$$ -915 -168 1015 216 -1046 -274 933 236 -785 -157 552 4 -342 187 132 -380 41 613 -131 -718
1433g18R40O03j031n79J033M87r66l19Q23P6o69J79N55m79m58P43L60r30k94J033
$$ -718 222 825 -206 -785 248 735 -231 -550 273 349 -320 -141 414 -65 -523 220 580 -350 -644 389
1453C89K35j043j42R34M2p71J39N63l66l11N90J12q19N6J003j43j141K04J165
$$ 389 624 -419 -561 373 415 -356 -217 346 -20 -331 259 371 -448 -392 611 468 -673 -469 696
1472F96k10j079J92Q87k11n86K37K42l28J23M61m52o32P02Q08q70r29R12R87q34
$$ 696 486 -593 -401 486 275 -311 -74 168 -160 -37 424 -28 -660 42 850 -20 -949 -37 950 116
1492A16r62O86Q20m89n59K89K08j39K20L5o12m0R66J06j236k21J366L37j340m25
$$ 116 -846 -160 660 171 -388 -99 109 -30 190 225 -387 -427 539 645 -591 -812 554 891 -449 -874
1512h74J158M61q81l82N13K26j36L5k07l57M70P07o21j014O54J237n79j342M53
$$ -874 284 745 -136 -518 -5 221 85 120 -87 -444 26 733 112 -902 -248 989 410 -932 -479
1531d79J273k71j080R2P56J4l42n1j28mN72J33r15l14J123N30j195o87J135P72
$$ -479 794 523 -557 -465 291 305 -37 -88 -216 -220 352 485 -430 -744 379 909 -286 -973 162 934
1551I34r50p60O94O28l95l59J04M7Q7L40k33o89K67R76k28j168J41J224k6j154
$$ 934 -16 -776 -82 546 151 -208 -104 -57 30 370 137 -552 -285 691 463 -705 -564 660 634 -520
1571e20p2R50J09o64q7L14NOJ64k91l78N36N55o51p20P04Q09o51q15N52P18m34
$$ -520 -592 358 467 -197 -284 30 35 41 205 -86 -464 72 627 -24 -744 -40 769 118 -697 -145 573 139
1593A39n23L20K67k19J5J62k92j71N56J84p16k44Q11K68q18k77P43K29o12j23
$$ 139 -384 -64 203 -16 -1 161 -131 -302 254 438 -278 -522 289 557 -261 -538 205 434 -178 -301
1613c01M52l5k87K14J48l78n4N52k4o50N0P14q4o80J00N91j39m49J89K81k82j10
$$ -301 151 116 -171 43 191 -187 -241 311 287 -363 -313 401 317 -363 -263 328 189 -260 -71 210 -72 -182
1635a82L88o2m82J85N88k85o08L12O17l19n40K99L98k72k16K43K7k74J97L05l88
$$ -182 206 144 -338 -153 435 150 -458 -146 471 152 -388 -89 309 37 -179 64 91 -183 14 319 -69
1656f9l60N22M04n80m47N78M50n25m04M22K85k84j23J64q9n8L05J1n18RO87Rp76
$$ -69 -429 93 497 -83 -530 48 498 -27 -431 -9 276 -8 -131 33 -56 -114 191 202 -316 -307 380 389 -387
1679c87o4P93J29p30j52N87J64l90r4J48k2P2J84k81l52M05N19m60o58M35P32
$$ -387 -451 342 471 -259 -411 176 340 -50 -144 4 -18 54 238 -43 -395 10 529 69 -589 -154 578
1700E78l77p26K68O23j41m59M7K21J8M5j7k94l5N37J16o93k25P72L30p45l96O15
$$ 578 201 -525 -257 366 225 -234 -187 34 52 97 80 -214 -249 288 404 -289 -514 258 588 -157 -553 62
1722F2M24m65l52K53K29o9n3q4j59J89L82k59n53K25P09j71p67J04P23j1o00p0
$$ 62 486 21 -331 -78 151 82 29 -55 -214 -25 357 98 -455 -230 479 308 -459 -355 368 357 -243 -313
1744c13M45P6k19m0j0l8K22J47l97k59M74L90n13m62M72N04l99m64K86L68j84
$$ -313 132 208 -11 -51 -61 -99 123 270 -127 -386 88 478 -35 -497 -25 479 80 -384 -98 270 86
1765H6j99P8J5j7J70J7l62j6M94N3n57j08N66J39n27j37M16J12k98l7J54n2l9
$$ 86 -113 -35 -20 -37 133 150 -212 -228 266 319 -238 -346 220 359 -168 -305 111 223 -75 -112 42 -10 -49
1788d9J58o3k70J29L66j49m47J62M45j34m14J21L54j33k15J18R7j40L8J83j46
$$ -49 109 46 -224 -95 271 122 -325 -163 282 148 -266 -145 209 76 -139 -21 76 -64 -26 157 11
1809A1k30K36K74k80l04K96K97k79k52K29J73j87p9J53o0j19J60J33k83j33L42
$$ 11 -219 17 291 11 -293 3 300 21 -231 -2 171 -16 -95 58 -2 -121 39 172 -111 -244 98
1830I8J65l85j57L58J66l15j25K45O4j42J0P3j19jK28l9l32O5L91n2m33K6M23
$$ 98 263 -122 -279 79 245 -70 -195 50 114 -28 -18 55 -64 -65 163 124 -208 -143 248 196 -237 -211 212
1853B12j4l49j9K58J0j24MKo3J21J40k12k33K67L07k85l47K55L77k23l28J39K63
$$ 212 198 -151 -170 88 98 -26 -22 -20 -83 38 178 -34 -267 0 307 22 -325 -70 307 84 -244 -105 158
1876A58o5j40LJ5RJ38qk74k7L73Q4m36j31M29J88l83k09K96J89j82j30O2N1L5
$$ 158 93 -47 -44 -29 -20 118 110 -164 -191 182 266 -170 -301 128 316 -67 -276 20 209 27 -103 -41 10 45
1900D5N8j11j79J68K93j76l90J57M34j19m20M2L74Mk61m7J37L4lj7j32l5K53J16
$$ 45 103 -8 -187 -19 274 98 -292 -135 299 180 -240 -198 176 180 -81 -128 9 43 40 23 -109 -144 109 225
1924B25l18j84L22K52l04k69K49K76j85k24J01J40k1l9k0q6M1K02m6k81J2L37
$$ 225 -93 -277 45 297 -7 -276 -27 249 64 -160 -59 81 60 21 1 -85 -44 158 112 -169 -157 180
1946A80J7l63m7L25P6k71o3J63P3r4j2nm9P7J20j18j82J31K40j26k79J14K79q2
$$ 180 197 -166 -213 112 188 -83 -146 17 90 -4 -16 -21 -70 7 127 9 -173 -42 198 72 -207 -93 186 104
1970A04k40O0J67m1p6L6pm8Q1O8j55q6J89J23k19j45K10J42j69j33J35P3q5j2
$$ 104 -136 -76 91 50 -26 10 3 -45 36 104 -51 -137 52 175 -44 -189 21 163 -6 -139 -4 69 -16 -28
1994b8N7n3l0J14J8j62k4K06M0k22m9K17L2j67l7J31J1p8J7L3o8K3J18n8j58O3
$$ -28 29 -24 -54 60 78 -84 -108 98 138 -84 -133 84 116 -51 -88 43 54 -24 -7 26 -42 -19 99 41 -117 -54
2020e4K03o8k19N3K06l6j75L8J01nn3L2m3m8J09P1j45j23J63J58j81j52J33J76
$$ -54 149 81 -138 -85 121 85 -90 -52 49 44 -9 23 -20 -68 41 112 -33 -156 7 165 -16 -168 -35 141
2044A41j11j38O9Q2k3j8j0l8J8J12nj83NK20K8k33n8K27O9j76r2J29O8o2m1j4
$$ 141 30 -108 -39 43 20 2 -8 -46 -28 84 79 -104 -99 121 149 -84 -142 85 154 -22 -114 15 83 21 -20 -34
2070c4JN6O2r7j23J06J86j03k20P6K23l5k14PJ68J1q7k6J3K0N7Mj03n3J64P9j88
$$ -34 -33 23 85 -12 -135 -29 157 54 -166 -90 133 98 -116 -109 59 70 -17 -43 -30 -10 47 51 -52 -105 59 138 -50
2097e0r4J68J53j63j45J12J31o7q9KM4L8Ql8j01M9J47l8j83KK08J6j88m7J77L9
$$ -50 -144 24 177 14 -131 -19 112 45 -44 -42 2 40 48 10 -91 -42 105 67 -116 -114 94 110 -78 -125 52 91
2123I1j16m2O1L9rmm4l4Q6Q7j15j20R9J44q7j60Q1J40m6j09J0P2mkmm4j3J04J2
$$ 91 -25 -67 -6 33 24 20 -24 -58 28 115 0 -120 -21 123 36 -124 -43 97 51 -58 -48 24 20 18 14 -30 -43 61 73
2152G3j17m7J30O7j35p5J18O8p9p4O3L8k2j2Ol4J1P7k2j07K8J19j3j31kJ36J1
$$ 73 -44 -91 39 106 -29 -104 14 82 3 -71 -8 30 8 -4 2 -32 -21 56 34 -73 -45 74 61 -70 -72 64 75
2179G5r8k1N1J6j9J3j2m0M8N4n2p6N3Q7l5j17M0R0j8q4K0M3j2pJj7l7Q3K8q5n9
$$ 75 -23 -44 7 23 4 17 5 -35 13 67 15 -61 -8 79 44 -73 -33 57 39 -45 -25 18 6 -1 0 -17 -54 29 57 -28 -87
2210h7R6P8j13n1Q0O1m9n9M4K4oKol1J7N7j3r8RJ05J4j18k1R7L5q0l8M3K1rj6
$$ -87 9 87 -26 -77 3 64 15 -44 0 24 18 20 14 -17 0 57 44 -54 -45 60 74 -44 -65 32 67 -13 -51 -8 13 4 -12
2241a2qj2M4M1n7p4O1Q7m1j00L9J03j5r4NM7K6k2l1j2J3M7K2q7k4R2M0r6n4P4
$$ -12 -20 -32 12 53 -4 -78 -17 70 29 -71 -32 71 56 -38 -33 14 40 18 -13 -25 -12 35 57 -30 -54 38 78 -18 -72 2
2271BP5o0p3M1N4j1m1KqL3K4k8o3K6Q1pj09jR8K4r3k3P1K9l8l5ML0J2Rn0j6N5
$$ 2 77 17 -56 -15 39 28 -13 -11 -19 14 38 10 -53 -27 54 47 -62 -63 35 59 -34 -57 14 43 5 -30 -26 4 16 25 -25 -41 14
2304A4N0n4p5N4Q4m0q3K4O8Nn5pK9K0nj0l7jN3J3p5k8O1N5n9o7O3M5l7l8QK7Q
$$ 14 64 10 -65 -11 73 33 -50 -26 42 47 -8 -15 14 34 29 19 -18 -19 34 47 -28 -56 5 60 1 -66 -3 42 5 -33 -25 2 10
2337A0jkl0J8N0j8n8RP4Lp2j4O6K0n6k1K7J5rOk3j2J9L0l7m5L3N5j9n4QN0jl7
$$ 10 9 7 -23 -5 45 27 -31 -22 52 55 -17 -31 35 55 -1 -22 5 20 11 17 -6 -18 1 31 -6 -51 -18 37 18 -36 -28 22 21 -16
2371a6oK7j2KQlk1L5K5m8k8M7M2n9k1L2K7k6k2QK5nj5Oj8LL6%n1j1N9J1n5k7N9
$$ -16 -22 5 -7 -5 3 0 -21 14 39 -9 -37 10 52 -7 -28 4 31 5 -17 -9 16 11 -4 2 -16 -13 23 23 -28 -39 20 31 -24 -51 8
2406HK2l5j7J4K0mrPj7ML1k8m1K3M9rn0JN7ol3j0K7J3j9KJj2K9J2l3k4M2L2l6
$$ 8 30 -5 -22 -8 12 8 -1 6 -11 -7 24 -4 -45 -22 27 18 -32 -31 26 20 -13 -23 4 17 -2 0 1 -11 18 30 -3 -27 15 47 11
2441A1n1K7N3k2m1J5K0knj0j4ML0j0l6oN4Rm7k3M9L1m6k1K6K5j8lJ0k4J7K7k4
$$ 11 -40 -13 40 18 -23 -8 12 10 5 -5 -19 -15 15 5 -31 -37 17 26 -21 -44 5 36 -10 -31 -5 20 2 -1 9 -15 2 29 5
2474Ek9J9M9k2o1J9M6J2o4OK6Ooj5MkPJ2k1l4M4K7l4l7L1M7k2m1QL8pj3oR%K0
$$ 5 -24 -5 44 22 -39 -20 26 38 -26 -20 6 12 6 -9 -5 -7 0 12 -9 -43 1 28 -6 -43 -12 35 13 -28 -20 18 11 -2 -8 1 1 21
2510B1j6j3j8M1K1m6l3N1K7m0k4K7K9k9j9J0J5lJkl0J8M0k1l7J5L5Om7lL8lk9
$$ 21 5 -8 -26 15 36 -10 -43 8 35 -5 -29 -2 27 -2 -21 -11 4 1 2 0 -30 -12 28 7 -30 -15 20 26 -21 -24 14 11 -18
2543a8RKJ5k2J6jk1J9J7j1m7L2M2j4n1K8M2k6k4QJ1KjMj6j0J8J9l8k0M2J6l1k4
$$ -18 -9 -7 8 -14 2 1 -20 -1 16 5 -42 -10 32 18 -33 -5 37 11 -13 -5 6 8 7 11 -5 -15 3 22 -16 -36 6 22 -9 -33
2577c3K9J8k2qJ7jpRPk5QK6nk8jL2J2l6oL7Nk9%J9j8%J3pk4J1K8j5l9J6M1ql1
$$ -33 -4 14 -8 -16 1 0 -7 2 9 -16 -8 18 13 -15 -16 16 28 -8 -14 23 28 -1 -1 18 0 0 13 6 -18 -7 21 6 -33 -17 24 16 -15
2614a5j2L4%j2j0MPLJ0j1j5PM0l5l3L9L7k8l5K5K9j7j8QQLkOl2PK2Om1KK8J6m1
$$ -15 -27 7 7 -5 -15 -11 -4 -1 9 -2 -17 -10 30 -5 -38 1 38 10 -25 0 29 12 -6 2 10 13 11 17 -15 -8 14 20 -21 -19 9 25 -16
2651a6j1M1J1k8k8K7J5j0Pj1j9J7K0ql5RM5j1m1MM6nl5QK1%rKmj1J6K0k8k2L3
$$ -16 -27 14 25 -3 -31 -4 11 1 8 -3 -22 -5 15 7 -28 -19 26 15 -26 -22 24 19 -16 -8 13 13 4 6 2 -9 7 27 -1 -23 10
2686A0K7k0l7K5K1j3l0RROj4lQnJ6%k4j1L2Nk2k3K9K7l2j3K1J6j8QOqmJ4j1j4
$$ 10 37 17 -20 5 26 13 -17 -8 1 7 -7 -10 -2 -7 9 9 -15 -26 6 11 -11 -34 -5 22 -10 -23 -2 14 -4 4 10 2 -2 12 1 -13
2722a3J7K2kl4J1K7qk7j8L7oj6LMk5K0J3j9j4RL8k3l5K6K6k5j5K2J4j0mJ5j0m
$$ -13 4 26 24 -10 1 28 20 -7 -25 12 6 -10 -7 -3 -28 -8 5 -14 -28 -19 19 -4 -39 -13 13 -12 -27 -5 9 -1 -5 10 0 -4
2756dJ2Rk7j1L1Qj9k0K2K0k6qJ3Qj0mJ6j1qK8j0l2NL5nk6MK3Rl5kJ5Kj6K1kk4
$$ -4 8 17 -10 -21 10 18 -1 -21 1 21 -5 -13 0 8 -2 -6 10 -1 -9 19 9 -23 -18 17 12 -14 -10 13 22 -13 -15 0 2 -14 7 5 -19
2793a9PK4j9j6K1K0ml2KL0jk4PJ8nk0J5%j6K2Qk4k1L7K1m4j8K8K4k2k5K1J4j9
$$ -19 -12 12 -7 -23 -2 18 14 -18 -16 14 13 -11 -4 14 9 -11 4 4 -12 10 18 -6 -27 10 31 -13 -31 -3 21 -1 -26 -5 9 -10
2827a0KPplK1rl6J4L6Qn8RM4Pl7qL9jj1nPkQNk2j9K7L6l0k3qO0k6m1J0K6Jk7n
$$ -10 -8 -1 -8 -11 10 1 -35 -21 15 23 -35 -26 18 25 -12 -20 19 18 7 2 9 7 15 20 -2 -21 6 42 12 -11 -19 41 15 -26 -16 10 11 -16 -21
2866b1J8jJ0mnj7J4L4m5rK4K4k1k1L5K2l6j1J4LpJ1Jk9J0L1kl8KM0ql1JK6kk2
$$ -21 -3 -4 6 2 -3 -20 -6 28 -17 -26 -2 22 1 -20 15 37 1 -10 4 7 0 11 12 -17 -7 24 22 -16 -14 26 18 -13 -12 14 12 -10
2902a0MJ2j0KNrj0JL4j8l6K7K9j4k4LL5nk7KJ1Oj0J7j2j6K5J8k4l7M4J5k3k9K2
$$ -10 -6 6 -4 -2 3 -6 -16 -15 19 1 -35 -8 21 7 -17 -14 21 16 -11 -9 2 8 -2 15 3 -13 12 30 6 -31 13 28 5 -24 -2
2937bJ1lmkKMJ0ok8jL2Jl2j2L9J6m4j4L6Kj2j2L2j5oJ7nk0J2K7nk8QL3j0m0J6
$$ -2 9 6 2 0 2 6 16 10 -18 -19 13 14 -18 -30 9 25 -19 -33 3 5 -7 -19 13 -2 -8 9 4 -16 -4 23 18 -10 -2 31 21 -19 -3
2974cL7k6pqKJ0JOj5j4K6J0l3j5L3K2l0l2K7K0qj1MJQJ3j8qKL8qm4J0L9Lm5j2
$$ -3 34 8 1 -7 -5 5 6 12 -3 -17 9 19 -14 -29 4 26 -4 -36 -9 11 3 -8 -4 -3 5 18 0 -8 -6 32 24 -20 -10 29 32 -13 -25
3011b5M2jqj4PKRkoj4J3L0k9l0K3K2lm7J1K8J4l6LJ6JPkqj8L2J1l8j1L4K6l8j6
$$ -25 17 16 8 -6 1 3 12 10 4 -10 3 33 4 -26 -3 19 16 -31 -20 8 22 -14 -11 5 6 13 11 3 -15 17 28 -10 -21 13 39 1 -15
3048a5J4K5j7j4OJ1Nmj3%J1J2j1j9LL2Pm6pL7Nl1%J6Oqj4L%JQj5rJ6L0k7l4K2
$$ -15 -1 24 7 -7 -1 10 15 11 -2 -2 9 21 10 -9 -6 26 33 -13 -20 17 22 -9 -9 7 13 5 -9 -6 -6 -5 3 -12 -21 -5 25 -2 -36 -14
3086a4K9lk3J2QlrLJrJ1J3j3j8K6Npk7K0L1l4k8K6J1n%jj0RlNk1QL4rk9j2K7M
$$ -14 15 12 -11 1 9 6 -3 0 1 -8 3 16 3 -15 11 16 9 -18 2 33 -1 -29 -3 8 3 3 2 -8 1 -2 3 -18 -10 24 15 -14 -26 1 5
3125Eoj8J8Lj5QJ6k4J9Pj4j3J3L4k2k6QK7qk3MJ5Mrj1KlJ9qj5j0K3J4l0lL1Rj7
$$ 5 -1 -19 -1 2 -13 -5 11 -13 6 13 -1 -14 -1 33 11 -15 -7 20 12 -11 -7 8 12 3 -8 -6 -9 10 2 -13 -23 0 14 -16 -19 12 21 4
3163Dk8PL2j0j4%RqK4k0j2%L8j0l2KL3Nj8j1K3Poj6jJJ4Lj9j4J1K1ol2NL7j7k9
$$ 4 -24 -17 15 5 -9 -9 0 -8 16 -4 -16 -16 22 12 -20 -18 15 20 2 -9 14 21 15 -1 -2 -1 13 16 -3 -17 -6 15 9 -23 -18 19 2 -27
3201b7J5J8jj3mPoJ5Mk9J0K6lk3j4L5K6m3MKK3j2k2J4rJ5Rjl0J4K1nl1J7K5%l9
$$ -27 -12 6 5 -8 -12 -5 -11 4 8 -21 -11 15 12 -11 -25 10 36 -7 -3 -1 22 10 -12 2 -7 8 17 16 -14 0 21 16 -15 2 27 27 -12
3238a2j3K8Oj5Kj4K4j0Lj5OJ7J2k0k4K2J6Pk9PK7j0qpJ5llJj6kK3kk3k0L7J2j9
$$ -12 -25 3 9 -6 -4 -18 6 -4 -1 -16 -10 7 19 -1 -25 -3 13 20 -9 -2 25 15 7 0 15 12 9 10 -6 -8 15 13 -10 -30 7 19 0
3275@j9K5J9j9k0J4KPPk3jLK5j7k3J2K1j0k0jK0J7k5j0J8LMmonJ2J6k3qPK7j7
$$ 0 -19 6 25 6 -14 0 2 9 16 -7 -8 -5 20 3 -20 -8 13 3 -17 -18 2 19 -6 -16 2 5 9 5 -1 -6 6 22 -1 -9 -2 25 8
3312Hk0J2J2Jj6j1J3QlNj2jJ4mj4rK8J1k1k4J9J6j4rMK0qPj2NLJ7j8k2J5K6j1
$$ 8 -12 0 12 13 -3 -14 -1 7 4 9 -3 -4 10 6 -8 -17 11 22 1 -23 -4 12 -2 -11 -7 13 5 12 0 5 8 25 7 -15 0 26 15
3349A5k2J0K6jj5j5K5j4J0k3lJ0OJ1j8k4J8K7k5l4J5K4Kk4pK4J9j1j3qK3%lj1
$$ 15 -7 3 29 28 13 -2 23 9 19 -4 -7 3 9 20 2 -22 -4 23 -2 -36 -21 3 5 -19 -26 -2 17 6 -7 -15 8 8 5 -6
3383fj0L0Nk6rK7Rj2k7K1PnoknJ4Knj5J3L3k0k1rK7Rl3lK0J1jk8jK0KQk4RJ8R
$$ -6 -16 14 19 -7 -16 11 20 8 -19 2 9 4 -2 -4 -9 5 7 2 -13 0 33 13 -8 -17 10 19 -14 -17 3 14 13 -15 -16 4 6 14 -10 -1 17 26
3423B6k3j4K0K2j9k0MJ9Mj5j2lJ1Mnnj2K8Nl2LK7Jj6j7J3J5oj3mJ6%Kj4j3J9K8
$$ 26 3 -11 9 31 12 -8 -4 15 19 4 -8 -11 0 4 -1 -6 -18 10 15 -17 -14 13 14 -2 -19 -6 9 3 -10 -14 2 2 4 -10 -23 -4 24
3460B4j5k4PJ4J0k2mK1Rj2nKMJ6j2k6K0NMk3%J3J3j9j6RJ9lj4j9J7J1kj0j2J4
$$ 24 9 -15 -8 6 16 -6 -10 11 20 8 3 5 9 25 13 -13 7 12 16 -7 -7 6 19 0 -16 -7 12 9 -5 -24 -7 4 2 -8 -20 -6
3496fJ7ok2PJ7J0k2j3RK3j4JmNKJrpJ6KKk5J9K1j1l1RJ9Kj2j0KJ0%rj2K0JOk5
$$ -6 11 5 -17 -10 7 17 -5 -18 -9 14 0 1 -3 2 4 5 -4 -11 5 7 9 -16 3 24 13 -18 -9 10 12 0 -10 -8 2 2 -7 -19 1 2 8 -17
3536a7kJ9QJk9MK7Lk5lJ5P%rj4J9OPk9J2J3J5l1j1J3Rl%pJ3Lj5j2OJ9Pj7j5J1
$$ -17 -19 0 8 9 -20 -16 11 14 -11 -14 1 8 8 -1 -15 4 10 17 -12 0 13 28 -3 -14 -1 8 5 5 -2 11 14 -1 -13 -7 12 19 2 -13 -2
3575bK2pl4%J8Oj0j3QJ5%j4pJ2J1%k0QJ1J7j1j8MJ7Nl1J0K0j2jroOJ4j5mj1K3
$$ -2 20 13 -21 -21 -3 3 -7 -20 -12 3 3 -11 -18 -6 5 5 -15 -7 4 21 10 -8 -4 13 18 -13 -3 17 5 4 -5 -11 -5 9 -6 -10 -21 2
3613BJpj6K2K2k7j8J6J5%j3OJPMk1j6K1J7j1k1LK7Kj7qJ5Q%j3LlJ4qqj2K1Ok1
$$ 2 3 -4 -20 2 24 -3 -21 -5 10 10 -3 3 4 11 15 -6 -22 -1 16 5 -16 -13 14 16 -1 -9 6 14 14 1 4 1 15 7 -1 -13 8 14 -7
3652gp%K1k1LrK3n%oLJ1Joj3%K4Mj7j0J1K3k8j5K8Nj3JoMJ6pj7%J6J4j3npJ9o
$$ -7 -14 -14 7 -14 -11 -20 3 -2 -2 -8 -5 6 7 1 -12 -12 12 16 -1 -11 0 23 -5 -20 8 13 0 1 -5 -1 15 8 -9 -9 7 21 8 3 -4 15 9
3693Ij8JJ2J3rj9J0pK2j9mLJ0Kk1%J8Qj4jkJ7koqOPpknNK4k3k1J4K1qj2pK0J1
$$ 9 -9 -8 4 17 8 -11 -1 -8 14 -5 -9 -6 4 6 -15 -15 3 11 -3 -4 -6 11 9 3 -5 1 8 1 -1 -6 -1 23 0 -21 -7 14 6 -6 -13 7 18
3734A8j3j1KJ9rlj3%MJ5k0KjJ6Mj2lQJ%j9J8J5j0Kj3PJ7plj4K1kjk3J2J2Jj8j0
$$ 18 5 -6 -4 15 6 3 -10 -10 -6 9 -11 -9 -10 6 10 -2 -5 3 4 4 -15 3 18 8 10 -3 4 21 14 11 -3 18 16 15 -8 4 16 17 -1 -11
3774a1KJ1Lj7j0K1RKk0OOOj4rJ8JNj4M%J5kj9jK2Mj6%MJ4Jk7kL3kj6j3QJ1mok
$$ -11 -9 2 5 -12 -22 -1 8 10 -10 -4 2 8 -6 -15 3 4 9 -5 -1 -1 14 12 -7 -8 14 18 2 2 6 20 21 -6 -8 25 23 7 -6 2 13 9 3 1
3816AJ1%j0rN%J0j4qJ2J0qj4QKJ4qlqL2j2lmpK8qk1nJ4J6j3okRRj0j5RQMj9kJ8
$$ 1 12 12 2 -7 -2 -2 8 -6 -14 -2 8 0 -14 -6 -4 10 2 -1 -9 23 11 8 4 -3 25 17 -4 -9 5 21 8 2 0 9 18 8 -7 2 10 14 -5 -7 11
3859A1Jkk1KPJ3j3j2QJ5rj7KJ5J3j2%nPJ8j6j5K1OmrLKKLk3K1%Qoj7kJ6mj4QJ0
$$ 11 12 10 -11 -9 -2 11 -2 -14 -6 9 0 -17 -15 0 13 1 1 -4 3 21 5 -10 11 17 13 4 7 9 11 14 -9 12 12 20 14 -3 -5 11 7 -7 1 11
3901A1oj3JNJ8qrj1PQj3PlR%%j3NJ5Qk2%J5NJj1pNJ1kk2OK4j0ooJ4Ppj8J0LlJ
$$ 11 5 -8 -7 -2 16 8 -1 -12 -5 3 -10 -3 -6 3 3 3 -10 -5 10 18 -4 -4 11 16 17 6 -1 4 15 13 -9 -3 21 11 5 -1 13 20 13 -5 5 8 5 6
3945Fj6J3kLj2lJ4Mj2pJ4mOqjOQj0oJ1NqNpNPQj1j4K2Okk1NO%j3pJ7MPj5j4KJ1
$$ 6 -10 3 1 4 -8 -11 3 7 -5 -12 2 -2 4 -4 -5 1 9 -1 -7 4 9 1 6 -1 4 11 19 8 -6 16 22 20 -1 4 10 10 -3 -10 7 11 18 3 -11 -9 2
3990Bj0qOOLj0jKJ3n%j0K1NpjrJ8llpjJ3nj3LMKlo%PLj3O%O%rmJJ6j4JpPJkmM
$$ 2 -8 -16 -10 -4 -1 -11 -12 -10 3 -2 -2 -12 9 14 7 6 -3 15 12 9 2 1 14 9 -4 -1 3 5 2 -4 -4 3 6 -7 -1 -1 5 5 -4 -8 -7 9 -5 -4 -11 -4 -3 -5 -9 -5
4040eJ5rrQNjkqkJ5K%j3J4kLj6PLkJj2MJ7nj1L%jnnmK0Lrj0MJ2%j1j2MJ9Mk3M
$$ -5 10 1 -8 0 5 4 2 -6 -8 7 9 9 -4 10 8 11 -5 2 5 3 4 -8 -4 13 8 -3 0 0 -1 -6 -11 -15 5 8 -1 -11 -7 5 5 -6 -18 -14 5 9 -14 -10
4086a0QpJ1j2J3rRqlJ1Pmjj3J6Rj3m%R%rpOPkk1J3OqJ2j6OJ2j6JqJ7MKkJjlkq
$$ -10 -2 -9 2 -10 3 -6 3 -5 -8 3 10 6 5 -8 8 17 4 0 0 9 9 0 -7 -1 6 4 -17 -4 2 -6 6 -10 -4 8 -8 -7 -15 2 6 8 6 7 6 3 1 -7
4132gJ2Mlj6MMJ1prQJ1K1k8rNJ2j6mPLj0JKJMnmoNQj1QnQJ1qKjJ3lj6kJ5j1Rj5
$$ -7 5 9 6 -10 -6 -2 9 2 -7 1 12 33 5 -4 1 13 -3 -7 0 3 -7 -6 -4 -3 1 -4 -8 -14 -9 -1 -12 -4 -9 -1 10 2 4 3 16 13 -3 -5 10 -1 8 -7
4178glJ8kj0oRQnj1KPJjomJ4kj2pJ3KLrmJ3jQj9LNjj1lQK0mmLKj3K0j2mJ4jnj
$$ -7 -10 8 6 -4 -10 -1 7 2 -9 -7 0 1 0 -6 -10 4 2 -10 -17 -4 -2 1 -8 -12 1 0 8 -11 -8 -3 -4 -15 -18 -10 10 6 2 5 7 -6 14 2 -2 12 11 6 5
4225EnJ3mooKkK%kLnkjlOJj2QNL%rJPLjnLLKj3KJ4Lnj8K1JKj1jJ0NrlO%rKjJK
$$ 5 0 13 9 3 -3 -1 -3 -1 -1 -3 0 -5 -7 -8 -11 -5 -4 -16 -8 -3 0 0 -9 -8 -1 2 1 -4 -1 2 4 -9 -7 7 10 5 -13 8 9 11 0 -1 9 14 5 2 8 8 -1 1 0 1 3
4278CJj5JNmJ1j6J0MNJpkO%Kj0J4Nj0jOkKqjjJ5pj5OJ1Jpj0KJ1qJoRMMj8kQmN
$$ 3 4 -11 -10 -5 -9 2 -14 -4 0 5 6 -1 -3 3 3 5 -5 9 14 4 3 9 7 9 1 0 -1 14 7 -8 -2 9 10 3 -7 -5 6 -2 -1 -7 2 6 10 -8 -10 -2 -6 -1
4326aKl%Kj3J1oJJ%lRRlpkJ2Oj4%mPJ4kj8LjOj3PRj2jkR%qLqQPk0NLJ0%mmkJ0
$$ -1 1 -2 -2 0 -13 -2 -8 -7 -6 -6 -9 0 9 6 -1 -3 9 15 1 1 -3 4 18 16 -2 1 0 6 -7 0 9 -3 -4 -6 3 3 -5 -2 -10 -2 5 -15 -10 -7 3 3 -1 -5 -7 3
4376CmmmJ1njJMJ1rRkpjPj1RknrkRJQj1rJ6j4MnPlOnjQLrJ3qMJ0j1jkJ0oj3KK1
$$ 3 -1 -5 -9 2 -3 -4 -3 1 12 3 12 10 3 2 9 -2 7 5 0 -9 -11 -2 -1 7 -4 -13 3 -11 -7 -12 -5 -8 -2 -7 -8 0 3 -6 7 -1 3 13 2 1 -1 9 3 -10 -8 13
4426A3l%rqPLKNpnJ2qoJ3j0%mmRMj9NOQrQKqkKjnJ2J0qj3J6kkqJ2NoJj5LRMok
$$ 13 10 10 1 -7 0 3 5 10 3 -2 10 2 -4 9 -1 -1 -5 -9 0 4 -15 -10 -4 4 -5 3 5 -3 -5 -3 -4 -9 3 13 5 -8 8 6 4 -4 8 13 7 8 -7 -4 5 9 3 1
4476AJ1%qKmkLkRj0Nj3QoOn%j0nPOLj3NJ2j3J0mJ0Kj2kJ6LpJ1j4RnOj4PQlj1q
$$ 1 12 12 4 6 2 0 3 1 10 0 5 -8 0 -6 0 -5 -5 -15 -20 -13 -7 -4 -17 -12 0 -13 -3 -7 3 5 -7 -9 7 10 3 14 0 9 4 10 -4 3 11 8 -3 -11
4522a1MMJ4j0j3K1jjkk6K5nRooOooKOJJQj6PPLoj%mjQOmJ3j0j3RjqNJJ3nj2j3
$$ -11 -7 -3 11 1 -12 9 8 7 5 -21 4 -1 8 2 -4 2 -4 -10 -8 -2 -1 0 8 -8 -1 6 9 3 2 2 -2 -3 5 11 7 20 10 -3 6 5 -3 2 3 16 11 -1 -14
4569a4J1kLpPKOlmLllKlRLmj2J0PKJkrPKjqQl%kjJ6rqlMQpKj1OOqQrpJJjOpMJ0
$$ -14 -3 -5 -2 -9 -2 0 6 3 -1 2 -1 -4 -2 -5 4 7 3 -9 1 8 10 11 9 0 7 9 8 0 8 5 5 3 2 18 9 1 -2 2 10 3 5 -6 0 6 -2 6 -3 -10 -9 -8 -9 -3 -10 -6 4
4624Dj1J2nqjK1krOqJ2kjkkmOpkJMjmQmKNj1nNOoomM%Q%KJjJkJ1mopJJ4Nlj0J0
$$ 4 -7 5 0 -8 -9 12 10 1 7 -1 11 9 8 6 4 0 6 -1 -3 -2 2 1 -3 5 1 3 8 -3 -8 -3 3 -3 -9 -13 -9 -9 -1 -1 1 2 1 2 0 11 7 1 -6 -5 9 14 11 1 11
4677A1oJjPjkjj1O%mjkjJLoJJ0pNk0J3KloJ0lMqM%NJ1j6OJJ3j5LLmMOrnJ5Ok5
$$ 11 5 6 5 12 11 9 8 -3 3 3 -1 -2 -4 -5 -4 -1 -7 -6 4 -3 2 -18 -5 -3 -6 -12 -2 -5 -1 -9 -5 -5 0 11 -5 1 2 15 0 3 6 2 6 12 3 -2 13 19 -6
4726fJ0LrKmLMMj5J%RmKjnJjlpJ3RqMKkNpm%J0Jj5J7jKLj2OKmplOkNQnpJ5j5j
$$ -6 4 7 -2 0 -4 -1 3 7 -8 -7 -7 2 -2 0 -1 -6 -5 -6 -9 -16 -3 6 -2 2 4 2 7 0 -4 -4 6 7 -8 9 8 10 13 1 7 9 5 -2 -5 1 -1 4 12 7 0 15 0 -1
4778aJ2nlj1NQj3NpJ0LmqJ2JK%nJ0nLmMkJ5j9OmjNrJOj2J4nj9J5LqlKJ1q%LmQ
$$ -1 11 6 3 -8 -3 5 -8 -3 -10 0 3 -1 -9 3 4 6 6 1 11 6 9 5 9 7 22 3 9 5 4 9 0 1 7 -5 9 4 -15 0 3 -5 -8 -6 5 -3 -3 0 -4 4
4826Dj4jNM%nJ5nqJ7j7j1J8NlqPLJ2rJlk%jRmj%j1l%J1j1KMlKj3J9j9RJJ1njm
$$ 4 -10 -11 -6 -2 -2 -7 8 3 -5 12 -5 -16 2 7 4 -4 3 6 18 9 10 7 5 5 4 13 9 8 8 -3 -6 -6 5 -6 -4 0 -3 -1 -14 5 -14 -5 -4 7 2 1 -3
4873cPrJJ1qRnjMkpnNPKmkORkmMjj7J4oJkrj5J4kJ4j4pJ2mJ9rrjJ1koJ7mOrNq
$$ -3 4 -5 -4 7 -1 8 3 2 6 4 -3 -8 -3 4 6 2 0 6 15 13 9 13 12 -5 9 3 4 2 -7 -22 -8 -10 4 -10 -17 -5 -9 10 1 -8 -9 2 0 -6 11 7 13 4 9 1
4923AJ0j0Rj3OOmqMOrLjjnLM%m%KmmJ9oNloq%pLNQkKlOKoqJ0OkJ0qKl%oOJpOq
$$ 1 11 1 10 -3 3 9 5 -3 1 7 -2 1 0 -1 -6 -3 1 1 -3 -3 -1 -5 -9 10 4 9 6 0 -8 -8 -15 -12 -7 1 -1 1 -2 4 6 0 -8 2 8 6 16 8 10 7 7 1 7 8 1 7 -1
4978akPjnpJ1mj1J0JJPj1LKjnqK4j4NOj1LOmjj1K4qkJ2rMMj3J0lNqOrRj0Qj6J0
$$ -1 -3 4 3 -2 -9 2 -2 -13 -3 -2 -1 6 -5 -2 0 -1 -6 -14 10 -4 1 7 -4 -1 5 1 0 -11 13 5 3 15 6 10 14 1 11 8 13 5 11 2 11 1 9 -7 3
5025Cj3k%JkNLjomJ3kJkNpQoPJLnnNkMJj1J1j1J1%mJlQNj6Rj3JOOj0J6k6J8j2
$$ 3 -10 -12 -12 -11 -13 -8 -5 -6 -12 -16 -3 -5 -4 -6 -1 -8 0 -6 1 2 5 0 -5 0 -2 2 3 -8 3 -8 3 3 -1 0 -3 5 10 -6 3 -10 -9 -3 3 -7 9 -17 1 -11
5073a1J2j0nJ6j2j0J3lJNj1J7JOKqKlMqRj5J4Jj4J5m%mkj2J2kjK%oJ4j9OkmKJ1
$$ -11 1 -9 -14 2 -10 -20 -7 -10 -9 -4 -15 2 3 9 11 3 5 2 6 -2 7 -8 6 7 -7 8 4 4 0 -2 -14 -2 -4 -5 -3 -3 -9 5 -14 -8 -10 -14 -12 -1
5117apmOqK1pl%%QpK5j6pJ0nmNkQklklmJ9j2oLnNnLpMKj0J1jMjOJnj8%PJ0qMl
$$ -1 -8 -12 -6 -14 7 0 -3 -3 -3 5 -2 23 7 0 10 5 1 6 4 12 10 7 5 2 -2 17 5 -1 2 -3 2 -3 0 -7 -3 -1 -11 0 -1 3 2 8 9 4 -14 -14 -7 3 -5 -1 -4
5168dqLN%J3nlMnRkqQKqMqJ7j1j0lRqRjNj8mJ4LqO%lJ%lPOkpK%LPrJMJ0j8NkP
$$ -4 -12 -9 -4 -4 9 4 1 5 0 9 7 -1 7 9 1 5 -3 14 3 -7 -10 -1 -9 0 -1 4 -14 -18 -4 -1 -9 -3 -3 -6 -5 -5 -8 -1 5 3 -4 -2 -2 1 8 -1 0 4 14 -4 1 -1 6
5221Flj1QloJ3rMNOj3pKJMKj1PJJonQPq%J%PkoJ0J3j2jKpNQooKkPplOk%K%j2j
$$ 6 3 -8 0 -3 -9 4 -5 -1 4 10 -3 -10 -8 -7 -3 -1 -12 -5 -4 -3 -9 -14 -6 1 -7 -7 -6 -6 1 -1 -7 3 16 4 3 5 -2 3 11 5 -1 1 -1 6 -1 -4 2 0 0 2 2 -10 -11
5274a1OlQ%lkNl%KkLLj4PMoOLljJ3j4MQp%j%LN%q%jJ1j2RqkmkJj1PQnJ0qLlOl
$$ -11 -5 -8 0 0 -3 -5 0 -3 -3 -1 -3 0 3 -11 -4 0 -6 0 3 0 -1 12 -2 2 10 3 3 2 2 5 10 10 2 2 1 12 0 9 1 -1 -5 -7 -6 -17 -10 -2 -7 3 -5 -2 -5 1 -2
5327bMJrLMJ0rnNQqkkQnO%pj%kJ%QpoJ4rLoMOqlKpMjPNOk3NNLKklKPrKJ3j5QJ
$$ -2 2 3 -6 -3 1 11 2 -3 2 10 2 0 -2 6 1 7 7 0 -1 -1 -3 -2 -2 6 -1 -7 7 -2 1 -5 -1 5 -3 -6 -4 -11 -7 -8 -1 4 10 -13 -8 -3 0 2 0 -3 -1 6 -3 -1 12 -3 5 6
5383FljJKlNopJ1pjqQlNJLj1J5rrlJLrKJ4mJJ4lj1kJ1j6NjJ7%j0KkKkQkQj4kQ
$$ 6 3 2 3 5 2 7 1 -6 5 -2 -3 -11 -3 -6 -1 0 3 -8 7 -2 -11 -14 -13 -10 -19 -17 -3 -7 -6 8 5 -6 -8 3 -13 -8 -9 8 8 -2 0 -2 0 -2 6 4 12 -2 -4 4
5433Dn%JloPjJJ%llMNnNmlKMlJ4j3kLQj1jJ6plJ0j2J0mnJ1j0KLj3J0Ljlj4J4%
$$ 4 -1 -1 0 -3 -9 -2 -3 -2 -1 -1 -4 -7 -3 2 -3 2 -2 -5 -3 1 -2 12 -1 -3 0 8 -3 -4 12 5 2 12 0 10 6 1 12 2 4 7 -6 4 7 6 3 -11 3 3
5481CoLoKKj3J1mmQoOj4J0J1mNllrJ7kNJj1%OmJ8j2Lj2OjKOkl%mnJllpJ5mJKk
$$ 3 -3 0 -6 -4 -2 -15 -4 -8 -12 -4 -10 -4 -18 -8 3 -1 4 1 -2 -11 6 4 9 10 -1 -1 5 1 19 7 10 -2 4 3 5 11 9 6 6 2 -3 -2 -5 -8 -15 0 -4 -3 -1 -3
5531cpRpLkJ0jJjj1J0PrOLJ%j1KmPLKj5J2rNJJJ1j2okRql%PlKlLnJ1mKp%LOno
$$ -3 -10 -1 -8 -5 -7 3 2 3 2 -9 1 8 -1 5 8 9 9 -2 0 -4 3 6 8 -7 5 -4 1 2 3 14 2 -4 -6 3 -5 -8 -8 -1 -4 -2 -5 -2 -7 4 0 2 -5 -5 -2 4 -1 -7
5583gJ1nMJ6nrllmJ2qjNpPj1J2Qj4kkJ2onOj1J0jjJj0J6%rkLoJ0JJQj4J3j2Nj
$$ -7 4 -1 3 19 14 5 2 -1 -5 7 -1 -2 3 -4 3 -8 4 12 -2 -4 -6 6 0 -5 1 -10 0 -1 -2 -1 -11 5 5 -4 -6 -3 -9 1 2 3 11 -3 10 -2 3 2
5629BKmQrK%llMJ3j9J6NpoQkokNjpJJlKkKnJ5%qQj1KPqJ0%kJ%nmJ1pQrnJ0Lkn
$$ 2 4 0 8 -1 1 1 -2 -5 -1 12 -7 9 14 7 1 9 7 1 -1 4 3 -4 -3 -2 -5 -3 -5 -3 -8 7 7 -1 7 -4 -2 5 -3 7 7 5 6 6 1 -3 8 1 9 0 -5 5 8 6 1
5682A%mlJ4o%MOrlNokLlj4J1J1qmPlKMmR%mMKrJ0%j0ONlKoNmr%J2rOrLj2J5j0
$$ 1 1 -3 -6 8 2 2 6 12 3 0 5 -1 -3 0 -3 -17 -6 5 -3 -7 0 -3 -1 3 -1 8 8 4 8 10 1 11 11 1 7 12 9 11 5 10 6 -3 -3 9 0 6 -3 0 -12 3 -7
5733gOjO%lkPj1M%jqJ0jj5J0lJ1kkoJ2pOJ0pkJJ5jj3KQnqNj3rJ6pNopkJ2kMJo
$$ -7 -1 -2 4 4 1 -1 6 -5 -1 -1 -2 -10 0 -1 -16 -6 -9 2 0 -2 -8 4 -3 3 13 6 4 5 20 19 6 8 16 11 3 8 -5 -14 2 -5 0 -6 -13 -15 -3 -5 -1 0 -6
5782fnJ1nLMmjjJ0oLlJ0ljJKlj6J6lNrQJlkNm%Lpj1J1lLKpLk%JJnoMPMKNnLnN
$$ -6 -11 0 -5 -2 2 -2 -3 -4 6 0 3 0 10 7 6 7 9 6 -10 6 3 8 -1 7 8 5 3 8 4 4 7 0 -11 0 -3 0 2 -5 -2 -4 -4 -3 -2 -7 -13 -9 -2 2 4 9 4 7 2 7
5836GlqNJOkqRPqljjKlLoPJoQKj1nJ0J2j2rOMmLplJ2nj0J4rRqNrJ3%J1j0KOj2
$$ 7 4 -4 1 2 8 6 -2 7 14 6 3 2 1 3 0 3 -3 4 5 -1 7 9 -2 -7 3 15 3 -6 0 4 0 3 -4 -7 5 0 -10 4 -5 4 -4 1 -8 5 5 16 6 8 14 2
5886BNrJ0KmkkkmJMomJ1j0KOLPnnrQnlJ3kjj0MP%JLnJ1Kj2MKkLk%lN%jKj1J1n
$$ 2 7 -2 8 10 6 4 2 0 -4 -3 1 -5 -9 2 -8 -6 0 3 10 5 0 -9 -1 -6 -9 4 2 1 -9 -5 2 2 3 6 1 12 14 2 6 8 6 9 7 7 4 9 9 8 10 -1 10 5
5938EolJKmOnLjnRk%Jp%PN%kJpNNnJ0oRj1jNj0lQJnN%qKJ2qkLrjjNpJOnjJ2j%
$$ 5 -1 -4 -3 -1 -5 1 -4 -1 -2 -7 2 0 0 1 -6 -6 1 6 6 4 5 -2 3 8 3 13 7 16 5 4 9 -1 -4 4 5 0 5 5 -3 -1 11 3 1 4 -5 -6 -7 -2 -9 -8 -2 -7 -8 4 3 3
5994CoLjPpJ2njJ0opOjMnrJ5KrNp%KrMJ8k6PKJlL%qNPj2LKJ0j1OOkmj4J3lPlK
$$ 3 -3 0 -1 6 -1 11 6 5 15 9 2 8 7 11 6 -3 12 14 5 10 3 3 5 -4 0 18 -8 -1 1 2 -1 2 2 -6 -1 6 -6 -3 -1 9 -2 4 10 8 4 -10 3 0 7 4 6
6045FNj2RJ1j1J3j0JlJNj1Lj0QJj2PJrJ1KrkmJ0joPMmPn%j1OJ2j8J5JNj2jMMm
$$ 6 11 -1 8 19 8 21 11 12 9 10 15 4 7 -3 5 6 -6 1 2 -7 4 6 -3 -5 -9 1 0 -6 1 5 1 8 3 3 -8 -2 10 -8 7 8 13 1 0 4 8 4
6091DnMrLJ0JLj5J1NpmN%%rQoJmJJk%JJ0k0J5Nj3J8opjJ3oPj3kJ9j1OqJ0qPj0
$$ 4 -1 3 -6 -3 7 8 11 -4 7 12 5 1 6 6 6 -3 5 -1 0 -4 -3 -2 -4 -4 -3 7 -13 2 7 -6 12 6 -1 -2 11 5 12 -1 -3 16 5 11 3 13 5 12 2
6138BMjlMmkjJ0j6MJMrKLNKqQ%j0M%mKK1j1lOJjMkKkj0J0moJ9j1lolJ0oRKj2j
$$ 2 6 5 2 6 2 0 -1 9 -7 -3 -2 2 -7 -5 -2 3 5 -3 5 5 -5 -1 -1 -5 -3 18 7 4 10 11 10 14 12 14 12 2 12 8 2 21 10 7 1 -2 8 2 11 13 1 0
6188@kmPKMLj2jJQ%rjJ4noPRq%nMlJ4k0QrJ0nQj4J9J1j9JQqLj2JkJkLLl%kjkL
$$ 0 -2 -6 1 3 7 10 -2 -3 -2 6 6 -3 -4 10 5 -1 6 15 7 7 2 6 3 17 -3 5 -4 6 1 9 -5 14 25 6 7 15 7 10 -2 -1 -3 -2 -4 -1 2 -1 -1 -3 -4 -6 -3
6239c%KM%LkmPllQNqlJ0Jj3J2jMj1KJLoRj1kqOjPk%qMrNKKkJ2j4J3j0%l%lRP%
$$ -3 -3 -1 3 3 6 4 0 7 4 1 9 14 6 3 13 14 1 13 12 16 5 7 8 11 5 14 3 1 -7 -1 -2 5 3 3 -5 -1 -10 -5 -3 -1 -3 9 -5 8 -2 -2 -5 -5 -8 1 8 8
6291Hj3PLJNmMjn%rQOj1Nlj%PmOk1J8jj0J1oMqNnMk%j%JJLjjlQ%lJ1Pj1kNJjj1
$$ 8 -5 2 5 6 11 7 11 10 5 5 -4 4 10 -1 4 1 0 0 7 3 9 -12 6 5 -5 6 0 4 -4 1 -4 0 -2 -2 -3 -3 -2 -1 2 1 0 -3 5 5 2 13 20 9 7 12 13 12 1
6344AmJ3oMoNL%nj2J0Nk0J1%%RlmQkmnKPnllJ4kj0J1llKj1J5KokJ1jpoJ6m%qP
$$ 1 -3 10 4 8 2 7 10 10 5 -7 3 8 -12 -1 -1 -1 8 5 1 9 7 3 -2 0 7 2 -1 -4 10 8 -2 9 6 3 5 -6 9 11 5 3 14 13 6 0 16 12 12 4 11
6393A1%loLj0kJ2j0KLjkj1QJ2%kLKkrJ4j1KMRj5J3j0QrKLmNMk%qNPj1LrPj3K0
$$ 11 11 8 2 5 -5 -7 5 -5 -3 0 -1 -3 -14 -6 6 6 4 7 9 7 -2 12 1 3 7 16 1 14 4 12 3 5 8 4 9 13 11 11 3 8 15 4 7 -2 5 -8 12
6440A2p%Nlj2NqJ5lmoMPjlRm%nJkJ1j0J1JkJ0j0j1NKNj0kJ4rkn%LJlJ9qpjKOj3
$$ 12 5 5 10 7 -5 0 -8 7 4 0 -6 -2 5 4 1 10 6 6 1 2 0 11 1 12 13 11 21 11 0 5 7 12 2 0 14 5 3 -2 -2 1 2 -1 18 10 3 2 4 10 -3
6489cK%KJJ2j6nJQO%LmLlJ%%KJnOnPlRj4kJoJ2r%pNnJJ4%j5N%LQnLj0KQOkj2%
$$ -3 -1 -1 1 2 14 -2 -7 -6 2 8 8 11 7 10 7 8 8 8 10 11 6 12 7 14 11 20 6 4 5 -1 11 2 2 -5 0 -5 -4 10 10 -5 0 0 3 11 6 9 -1 1 9 15 13 1 1
6542AjJrkRO%KjJrPLmMjLo%p%KLrMJ0qLnJ0morK5j3jJ5nJj5RMJmMpNQrNoNj0P
$$ 1 0 1 -8 -10 -1 5 5 7 6 7 -2 5 8 4 8 7 10 4 4 -3 -3 -1 2 -7 -3 7 -1 2 -3 7 3 -3 -12 13 0 -1 14 9 10 -5 4 8 9 5 9 2 7 15 6 11 5 10 0 7
6596GJ0j2KoKRnm%mjOo%OnJ%KkkQlpKlRLMOj2kKlQLmmjkQJqOj1JNjj1NoJ2Lj7
$$ 7 17 5 7 1 3 12 7 3 3 -1 -2 4 -2 -2 4 -1 0 0 2 0 -2 6 3 -4 -2 -5 4 7 11 17 5 3 5 2 10 13 9 5 4 2 10 11 3 9 -2 -1 4 3 -8 -3 -9 3 6 -11
6650a1J2Moj%oPQMj8ROmj2J6J0j2On%KnPj3QJKQj4J2p%rJ7q%pkRj0lJ3qkKlLL
$$ -11 1 5 -1 -2 -2 -8 -1 7 11 -7 2 8 4 -8 8 18 6 12 7 7 9 4 11 -2 6 7 9 17 3 15 8 8 -1 16 8 8 1 -1 8 -2 -5 8 0 -2 0 -3 0 3
6698CkKjLlmJ7nL%omOj2J4rJ2Oj3%mJ%NKJ2k7J9%Mj3PJnj4K%JnJL%jQQrkOkML
$$ 3 1 3 2 5 2 -2 15 10 13 13 7 3 9 -3 11 2 14 20 7 7 3 4 4 9 11 23 -4 15 15 19 6 13 14 9 -5 -3 -3 -2 -7 -6 -3 -3 -4 4 12 3 1 7 5 9 12
6749A2JMj7J7lJooLkKlkL%%p%pJ6rLkNmnOJ0j0k%KlL%QnnjJ3mj2J8j1jlJ0Rj0
$$ 12 13 17 0 17 14 15 9 3 6 4 6 3 1 4 4 4 -3 -3 -10 6 -3 0 -2 3 -1 -6 0 10 0 -2 -2 0 -3 0 0 8 3 -2 -3 10 6 -6 12 1 0 -3 7 16 6
6798FjjLQj2J0Lj1Kj1MqRk%oJ2NolnK1rnj5RQrPrOjKJ0j1lJ6j3PLqPoKnRrOln
$$ 6 5 4 7 15 3 13 16 5 7 -4 0 -8 1 -1 -1 -7 5 10 4 1 -4 17 8 3 -12 -3 5 -4 3 -6 0 -1 1 11 0 -3 13 0 7 10 2 9 3 5 0 9 0 6 3 -2
6848bJ2Mj9kMnPmoLJQkjRrJ%%Qm%J3kjj0QpMNj0JPqM%jkklOMLnKpLJ%mK%LqnK
$$ -2 10 14 -5 -7 -3 -8 -1 -5 -11 -8 -7 1 -1 -2 7 -2 -1 -1 -1 7 3 3 16 14 13 3 11 4 8 13 3 4 11 3 7 7 6 4 2 -1 5 9 12 7 9 2 5 6 6 2 4 4 7 -1 -6 -4
6904dj0Qj%J2j3MJ5j0Mj6J3J1j1NlNKj5jKR%nlNnLPNrpRjJM%jj6J0PoOj2MpQr
$$ -4 -14 -6 -7 -7 5 -8 -4 11 1 5 -11 2 13 2 7 4 9 11 -4 -5 -3 6 6 1 -2 3 -2 1 8 13 4 -3 6 5 6 10 10 9 -7 3 10 4 10 -2 2 -5 3 -6
6952fJJ3j5J1qKONpkJ0Kj4J5Kj3J3j0KLqLKoJmRj0oPJj9J4RJj5J2njNNJlmKL%
$$ -6 -5 8 -7 4 -4 -2 4 9 2 0 10 12 -2 13 15 2 15 5 7 10 2 5 7 1 2 -2 7 -3 -9 -2 -1 -20 -6 3 4 -11 1 -4 -5 0 5 6 3 -1 1 4 4
6999Dj%Kj3J0jPnmK%%mKLmJ2j0jMOlrLoMjOlnlK0qj3OJKj%J3rPkMj4kQNrNlJk
$$ 4 3 3 5 -8 2 1 8 3 -1 1 1 1 -3 -1 2 -2 10 0 -1 3 9 6 -3 0 -6 -2 -3 3 0 -5 -8 12 4 -9 -3 -2 0 -1 -1 12 3 10 8 12 -2 -4 4 9 0 5 2 3 1
7052ARj4J0MnmOlKj1J0lKqPLp%Kj1jJ3rjPj8J6jj3J8PpLmO%MPKj2jKqR%%%lmj3
$$ 1 10 -4 6 10 5 1 7 4 6 -5 5 2 4 -4 3 6 -1 -1 1 -10 -11 2 -7 -8 -1 -19 -3 -4 -17 1 8 1 4 0 6 6 10 17 19 7 6 8 0 9 9 9 9 6 2 -11
7102a1Rp%JKJ2nkMnlNlMjpJLNr%jJ0QJmqNkOj0J2npKNmnMmL%KLJmrRpJ0mnQn%
$$ -11 -2 -9 -9 -8 -6 6 1 -1 3 -2 -5 0 -3 1 0 -7 -6 -3 2 -7 -7 -8 2 10 11 7 -1 4 2 8 -2 10 5 -2 0 5 1 -4 0 -4 -1 -1 1 4 5 1 -8 1 -6 4 0 -5 3 -2 -2
7157b%J1j3QoJMLNj5J6j5NNj0OQj2OKq%OJj0PNmmQlqJLmojNPpoK%QJ0lmm%MlP
$$ -2 -2 9 -4 4 -2 -1 3 6 11 -4 12 -3 2 7 -3 3 11 -1 5 7 -1 -1 5 6 -4 3 8 4 0 8 5 -3 -2 1 -3 -9 -10 -5 2 -5 -11 -9 -9 -1 9 6 2 -2 -2 2 -1 6
7209FJ1k3J3%Mj0LQj5KkJJ%mQJj0LPj0J4qmNJJOj1kM%rRmJ1%%%nJ1kmJ%J%mlL
$$ 6 17 -6 7 7 11 1 4 12 -3 -1 -3 -2 -1 -1 -5 3 4 -6 -3 4 -6 8 0 -4 1 2 3 9 -2 -4 0 0 -9 0 -4 7 7 7 7 2 13 11 7 8 8 9 9 5 2 5
7259EKrRkLKnoOKj5M%nJ1kmJ3kj3LrJ8Kj1%J5j1QK%KlkMLmnqJ2nJ0oJ%p%JKpO
$$ 5 7 -2 7 5 8 10 5 -1 5 7 -8 -4 -4 -9 2 0 -4 9 7 -6 -3 -12 6 8 -3 -3 12 1 9 11 11 13 10 8 12 15 11 6 -2 10 5 15 9 10 10 3 3 4 6 -1 5
7310EknlmJ3Qk4QnpRjJ2mpkOOrPJ1mOj0QopJ4rK%j2jNKJmJ8rLoKJj4KPj1J2j2
$$ 5 3 -2 -5 -9 4 12 -12 -4 -9 -16 -7 -8 4 0 -7 -9 -3 3 -6 1 12 8 14 4 12 6 -1 13 4 6 6 -6 -7 -2 0 1 -3 15 6 9 3 5 6 -8 -6 1 -10 2 -10
7359a0LmKJ2pJ0j8J4kJ0mj2OOpqOJ1pmOjjMpJ1poqJ7oNnJLlj0J1mqJ0pOmJllk
$$ -10 -7 -11 -9 3 -4 6 -12 2 0 10 6 -6 0 6 -1 -9 -3 8 1 -3 3 2 1 5 -2 9 2 -4 -12 5 -1 4 -1 0 3 0 -10 1 -3 -11 -1 -8 -2 -6 -5 -8 -11 -13
7407a3J4qpJ0nJ1mKOqMjOKkN%kPj0kRj2lMOj2oJ0mMRj1j2J1mKPmRj1lRnRnOLn
$$ -13 1 -7 -14 -4 -9 2 -2 0 6 -2 2 1 7 9 7 12 12 10 17 7 5 14 2 -1 3 9 -3 -9 1 -3 1 10 -1 -13 -2 -6 -4 3 -1 8 -3 -6 3 -2 7 2 8 11 6
7456FkpMJ1qj2QJ4j4J7j6J%MJjknmJ0Mqj1NOkrNljKjJ0ooQmPjMMl%NkkOqKQrL
$$ 6 4 -3 1 12 4 -8 0 14 0 17 1 2 2 6 7 6 4 -1 -5 5 9 1 -10 -5 1 -1 -10 -5 -8 -9 -7 -8 2 -4 -10 -2 -6 1 0 4 8 5 5 10 8 6 12 4 6 14 5 8
7508HmjRjKmj3QrlJ2Nj1PqNmlKKLj1QMpJ4j2JJ0mJjlPrOJ3nqPqMpQqklKjPOqm
$$ 8 4 3 12 11 13 9 -4 4 -5 -8 4 9 -2 5 -3 2 -2 -5 -3 -1 2 -9 -1 3 -4 10 -2 -1 9 5 6 5 2 9 0 6 19 14 6 13 5 9 2 10 2 0 -3 -1 -2 5 11 3 -1
7561aJnQLrmMJjMlMoj0O%OQr%LLQk0J4kMMj0J2rMkLmL%rjmMll%J0j0mJ4rMKkR
$$ -1 0 -5 3 6 -3 -7 -3 -2 -3 1 -2 2 -4 -14 -8 -8 -2 6 -3 -3 0 3 11 -9 5 3 7 11 1 13 4 8 6 9 5 8 8 -1 -2 -6 -2 -5 -8 -8 2 -8 -12 2 -7 -3 -1 -3 6
7614Fj1jJ6j6J7qJJ1rmRpjJ1lnoNmKPlpOmlLRjoj3NPj1M%NloLkNjQlj3J7JoR%
$$ 6 -5 -6 10 -6 11 3 4 15 6 2 11 4 3 14 11 6 0 5 1 3 10 7 0 6 2 -1 2 11 10 4 -9 -4 3 -8 -4 -4 1 -2 -8 -5 -7 -2 -3 5 2 -11 6 7 1 10 10
7665A0MjqNpOkKMnJnkRolkJ2j1kj0Q%Kj2J6m%jjJj4J4kM%kNj2J2Qj6J5j3OPjL
$$ 10 14 13 5 10 3 9 7 9 13 8 9 4 2 11 5 2 0 12 1 -1 -11 -3 -3 -1 -13 3 -1 -1 -2 -3 -2 -16 -2 -4 0 0 -2 3 -9 3 11 -5 10 -3 3 10 9 12
7713A2MqMmlkJ%j%MlljJ%mlrJ2pJ2mLm%kRlLPj5RoJ3j2NNlLkllO%kmKK%mKJ2j3
$$ 12 16 8 12 8 5 3 4 4 3 3 7 4 1 0 1 1 -3 -6 -15 -3 -10 2 -2 1 -3 -3 -5 4 1 4 11 -4 5 -1 12 0 5 10 7 10 8 5 2 8 8 6 2 4 6 6 2 4 16 3
7767CMKrQj0oJ2kj4J6kkNlJL%OmkkKnk%J2nnQmJKnjmQJm%qQMj0Qmj1J2MnkqQk
$$ 3 7 9 0 8 -2 -8 4 2 -12 4 2 0 5 2 3 6 6 12 8 6 4 6 1 -1 -1 11 6 1 9 5 6 8 3 2 -2 6 7 3 3 -5 3 7 -3 5 1 -10 2 6 1 -1 -9 -1 -3
7820cklPnmJ3j1POpjQ%lPMj4J3nj0J0jjpqJ0N%j2rJ3jmJ%OOrklQmJoJ5mkQj5J5
$$ -3 -5 -8 -1 -6 -10 3 -8 -1 5 -2 -3 5 5 2 9 13 -1 12 7 -3 7 6 5 -2 -10 0 5 5 -7 -16 -3 -4 -8 -7 -7 -1 5 -4 -6 -9 -1 -5 -4 -10 5 1 -1 7 -8 7
7870Gq%QnnJ4j6J2J0qqQmLMMqLjpm%lJJ0j1OJpQjnlMOlJ1j4Pj4RlR%loMjRLkq
$$ 7 -1 -1 7 2 -3 11 -5 7 17 9 1 9 5 8 12 16 8 11 10 3 -1 -1 -4 -3 7 -4 2 3 -4 4 3 -2 -5 -1 5 2 13 -1 6 -8 1 -2 7 7 4 -2 2 1 10 13 11 3
7922Cj%kPJJ0nkMmj1KjlLPj2J2j9OllJ2nm%PJPrkJPOpJ0oPkj3LPomLQj3NMRno
$$ 3 2 2 0 7 8 18 13 11 15 11 0 2 1 -2 1 8 -4 8 -11 -5 -8 -11 1 -4 -8 -8 -1 0 7 -2 -4 -3 4 10 3 13 7 14 12 -1 2 9 3 -1 2 10 -3 2 6 15 10 4
7974DpjJ6omNplJ%Nk%nPJj1J3%pJJ0%Jj3PJpJ0KqN%%j0mNJ4j3lJ1rqJ0kp%Rkk
$$ 4 -3 -4 12 6 2 7 0 -3 -2 -2 3 1 1 -4 3 4 -7 6 6 -1 0 10 10 11 -2 5 6 -1 9 11 3 8 8 8 -2 -6 -1 13 0 -3 8 -1 -9 1 -1 -8 -8 1 -1 -3
8024crNqRlNjQj3PjJ1OmlJlJ4j6MjJMpPojNrNKjj0PoKNKrj1QkPmjJPN%j1J2rP
$$ -3 -12 -7 -15 -6 -9 -4 -5 3 -10 -3 -4 7 13 9 6 7 4 18 2 6 5 6 10 3 10 4 3 8 -1 4 6 5 -5 2 -4 -2 3 5 -4 -15 -7 -9 -2 -6 -7 -6 1 6 6 -5 7 -2 5
8077EM%%pnJ0%Lj6J7rRq%kJQj4J0j2J1J0j6mJ4pj2MJ1p%nRjqJOkkPPk2K7qNl%
$$ 5 9 9 9 2 -3 7 7 10 -6 11 2 11 3 3 1 2 10 -4 6 -6 5 15 -1 -5 9 2 -10 -6 5 -2 -2 -7 2 1 -7 -6 0 -2 -4 3 10 -12 15 7 12 9 9
8124IlrQOknMoRjKqJNlk0J0J2j5NJLPq%LrkMp%kPJ4j2lJ5mkpN%jRkOnMjj1Qn%
$$ 9 6 -3 5 11 9 4 8 2 11 10 12 4 5 10 7 -13 -3 9 -6 -1 0 3 10 2 2 5 -4 -6 -2 -9 -9 -11 -4 10 -2 -5 10 6 4 -3 2 2 1 10 8 14 9 13 12 1 9 4 4
8177DL%nmJJ1mqj3NjMNq
$$ 4 7 7 2 -2 -1 10 6 -2 -15 -10 -11 -7 -2 -10
8191a0
##END NTUPLES=NMR FID
##END=
