##TITLE=1H_LY-DMAA.Per.3
 CDCl3
 8 sc, 
 7.02.2022
##JCAMPDX= 6.0         $$ Bruker NMR JCAMP-DX V2.0
##DATA TYPE= NMR FID
##DATA CLASS= NTUPLES
##ORIGIN= UXNMR, Bruker Analytische Messtechnik GmbH
##OWNER= root
$$ XWIN-NMR		Version 3.5
$$ Mon Feb  7 11:47:13 2022 Russian Standard Time (UT+4h)  she@DPX200
##.OBSERVE FREQUENCY= 200.131346
##.OBSERVE NUCLEUS= ^1H
##.DELAY= (6, 6)
##.ACQUISITION MODE= SIMULTANEOUS
##.ACQUISITION SCHEME= undefined
##.AVERAGES= 8
##.DIGITISER RES= 18
##SPECTROMETER/DATA SYSTEM= spect
##.PULSE SEQUENCE= zg30
##.SOLVENT NAME= CDCl3
##.SHIFT REFERENCE= (INTERNAL, CDCl3, 0, 15.7039)
##AUDIT TRAIL= $$ (NUMBER, WHEN, WHO, WHERE, WHAT)
$$ ##TITLE= Audit trail, XWIN-NMR		Version 3.5
$$ ##JCAMPDX= 5.01
$$ ##ORIGIN= Bruker BioSpin GmbH
$$ ##OWNER= she
$$ F:/spectra/data/she/nmr/H-F/1/audita.txt
$$ ##AUDIT TRAIL=  $$ (NUMBER, WHEN, WHO, WHERE, WHAT)
(   1,<2022-02-07 11:44:45.39 +0400>,<she>,<DPX200>,
      <created by zg, POWCHK disabled, PULCHK disabled
       configuration hash MD5:
       00 E9 B6 7A A2 85 ED C7 34 08 36 98 17 FE 4E 26
       data hash MD5: 16K
       17 FA 1F 87 D5 4D E7 8B BD 0F C4 64 BD E9 15 46>)
$$ ##END=
$$ 
$$ hash MD5
$$ 20 CB F3 80 3D 62 0A 03 84 34 FE 26 58 2A 56 4F
##$RELAX= 
##$RELAX= 
##$RELAX= 
##$RELAX= 
##$RELAX= 
##$RELAX= 
$$ Bruker specific parameters
$$ --------------------------
##$DU= <F:/spectra>
##$EXPNO= 1
##$NAME= <H-F>
##$PROCNO= 1
##$TYPE= <nmr>
##$USER= <she>
##$AMP= (0..31)
100 100 100 100 100 100 100 100 100 100 100 100 100 100 100 100 100 100 
100 100 100 100 100 100 100 100 100 100 100 100 100 100 
##$AQSEQ= 0
##$AQ_mod= 1
##$AUNM= <au_zg>
##$AUTOPOS= <>
##$BF1= 200.13
##$BF2= 200.13
##$BF3= 200.13
##$BF4= 200.13
##$BF5= 200.13
##$BF6= 200.13
##$BF7= 200.13
##$BF8= 200.13
##$BYTORDA= 1
##$CFDGTYP= 0
##$CFRGTYP= 5
##$CHEMSTR= <none>
##$CNST= (0..31)
1 1 145 1 1 1 1 1 1 1 1 1 1 1 1 1 1 1 1 1 1 1 1 1 1 1 1 1 1 1 1 1 
##$CPDPRG= <>
##$CPDPRG1= <>
##$CPDPRG2= <>
##$CPDPRG3= <>
##$CPDPRG4= <mlev>
##$CPDPRG5= <mlev>
##$CPDPRG6= <mlev>
##$CPDPRG7= <mlev>
##$CPDPRG8= <mlev>
##$CPDPRGB= <>
##$CPDPRGT= <>
##$D= (0..31)
0 1.2 0 0 0 0 0 0 0 0.06 0 0.03 0 0 0 0 0.0002 0 0 0 0 0 0 0 0 0 0 0 0 
0 0 0 
##$DATE= 1644219884
##$DBL= (0..7)
120 120 120 120 120 120 120 120 
##$DBP= (0..7)
150 150 150 150 150 150 150 150 
##$DBP07= 0
##$DBPNAM0= <>
##$DBPNAM1= <>
##$DBPNAM2= <>
##$DBPNAM3= <>
##$DBPNAM4= <>
##$DBPNAM5= <>
##$DBPNAM6= <>
##$DBPNAM7= <>
##$DBPOAL= (0..7)
0.5 0.5 0.5 0.5 0.5 0.5 0.5 0.5 
##$DBPOFFS= (0..7)
0 0 0 0 0 0 0 0 
##$DE= 6
##$DECBNUC= <off>
##$DECIM= 32
##$DECNUC= <off>
##$DECSTAT= 4
##$DIGMOD= 1
##$DIGTYP= 9
##$DL= (0..7)
0 120 120 120 120 120 120 120 
##$DP= (0..7)
150 150 150 150 150 150 150 150 
##$DP07= 0
##$DPNAME0= <>
##$DPNAME1= <>
##$DPNAME2= <>
##$DPNAME3= <>
##$DPNAME4= <>
##$DPNAME5= <>
##$DPNAME6= <>
##$DPNAME7= <>
##$DPOAL= (0..7)
0.5 0.5 0.5 0.5 0.5 0.5 0.5 0.5 
##$DPOFFS= (0..7)
0 0 0 0 0 0 0 0 
##$DQDMODE= 0
##$DR= 18
##$DS= 0
##$DSLIST= <SSSSSSSSSSSSSSS>
$$ [...]
##$SUBNAM2= <"">
##$SUBNAM3= <"">
##$SUBNAM4= <"">
##$SUBNAM5= <"">
##$SUBNAM6= <"">
##$SUBNAM7= <"">
##$SUBNAM8= <"">
##$SUBNAM9= <"">
##$SW= 18.0517287032376
##$SWIBOX= (0..15)
0 0 2 0 0 0 0 0 0 0 0 0 0 0 0 0 
##$SW_h= 3612.71676300578
##$TD= 16384
##$TD0= 1
##$TE= 0
##$TE2= 300
##$TE3= 300
##$TEG= 300
##$TL= (0..7)
0 120 120 120 120 120 120 120 
##$TP= (0..7)
150 150 150 150 150 150 150 150 
##$TP07= 0
##$TPNAME0= <>
##$TPNAME1= <>
##$TPNAME2= <>
##$TPNAME3= <>
##$TPNAME4= <>
##$TPNAME5= <>
##$TPNAME6= <>
##$TPNAME7= <>
##$TPOAL= (0..7)
0.5 0.5 0.5 0.5 0.5 0.5 0.5 0.5 
##$TPOFFS= (0..7)
0 0 0 0 0 0 0 0 
##$TUNHIN= 0
##$TUNHOUT= 0
##$TUNXOUT= 0
##$USERA1= <user>
##$USERA2= <user>
##$USERA3= <user>
##$USERA4= <user>
##$USERA5= <user>
##$V9= 5
##$VALIST= <valist>
##$VCLIST= <CCCCCCCCCCCCCCC>
##$VD= 0
##$VDLIST= <DDDDDDDDDDDDDDD>
##$VPLIST= <PPPPPPPPPPPPPPP>
##$VTLIST= <TTTTTTTTTTTTTTT>
##$WBST= 1024
##$WBSW= 4
##$XGAIN= (0..3)
0 0 0 0 
##$XL= 0
##$YL= 0
##$YMAX_a= 358524
##$YMIN_a= -309326
##$ZGOPTNS= <>
##$ZL1= 120
##$ZL2= 120
##$ZL3= 120
##$ZL4= 120
##$ABSF1= 10
##$ABSF2= 0
##$ABSG= 5
##$ABSL= 3
##$ALPHA= 0
##$AQORDER= 0
##$ASSFAC= 0
##$ASSFACI= 0
##$ASSFACX= 0
##$ASSWID= 0
##$AUNMP= <proc_1d>
##$AZFE= 0.1
##$AZFW= 0.1
##$BCFW= 1
##$BC_mod= 2
##$BYTORDP= 1
##$COROFFS= 0
##$CY= 11.3945322036743
##$DATMOD= 1
##$DC= 2
##$DFILT= <>
##$DTYPP= 0
##$F1P= 2.36226072786647
##$F2P= -0.459571619588291
##$FCOR= 0.5
##$FTSIZE= 0
##$FT_mod= 4
##$GAMMA= 1
##$GB= 0.15
##$INTBC= 1
##$INTSCL= 1
##$ISEN= 128
##$LB= 0.24
##$LEV0= 0
##$LPBIN= 0
##$MAXI= 10000
##$MC2= 0
##$MEAN= 0
##$ME_mod= 0
##$MI= 1.114404
##$NCOEF= 0
##$NC_proc= 0
##$NLEV= 6
##$NOISF1= 3.799351
##$NOISF2= 2.8
##$NSP= 1
##$NTH_PI= 0
##$NZP= 0
##$OFFSET= 15.70392
##$PC= 1
##$PHC0= -16030.58
##$PHC1= 15.80078
##$PH_mod= 1
##$PKNL= yes
##$PPARMOD= 0
##$PSCAL= 0
##$PSIGN= 0
##$REVERSE= no
##$SF= 200.130013532006
##$SI= 16384
##$SIGF1= 3
##$SIGF2= 2
##$SINO= 400
##$SIOLD= 16384
##$SREGLST= <1H.CDCl3>
##$SSB= 0
##$STSI= 0
##$STSR= 0
##$SW_p= 3612.71676300578
##$SYMM= 0
##$S_DEV= 0
##$TDeff= 0
##$TDoff= 0
##$TI= <>
##$TILT= no
##$TM1= 0
##$TM2= 0
##$TOPLEV= 0
##$USERP1= <user>
##$USERP2= <user>
##$USERP3= <user>
##$USERP4= <user>
##$USERP5= <user>
##$WDW= 1
##$XDIM= 8192
##$YMAX_p= 0
##$YMIN_p= 0
$$ End of Bruker specific parameters
$$ ---------------------------------
##NTUPLES= NMR FID
##VAR_NAME=  TIME,          FID/REAL,        FID/IMAG
##SYMBOL=    X,             R,               I
##VAR_TYPE=  INDEPENDENT,   DEPENDENT,       DEPENDENT
##VAR_FORM=  AFFN,          ASDF,            ASDF
##VAR_DIM=   8192,          8192,            8192
##UNITS=     SECONDS,       ARBITRARY UNITS, ARBITRARY UNITS
##FACTOR=    0.0002768,     1,               1
##FIRST=     0,             0,               0
##LAST=      2.2672688,     0,               0
##MIN=       0,             -309326,         0
##MAX=       2.2672688,     358524,          0
$$ Real data points
##PAGE= N=1
##DATA TABLE= (X++(R..R)), XYDATA
$$ [...]
994f31Q6J631l69j727N15J718o57j776O33J642p68j410Q21R67q90l98R12j31j008
$$ -631 -545 1086 717 -1010 -495 1223 566 -1210 -577 1065 297 -1113 -292 675 -215 -613 299 168 -840
1013h40O30J247j045j413J451J636j621j663J689J756j634j590J433J293j250
$$ -840 -210 1037 -8 -1421 30 1666 45 -1618 71 1827 193 -1397 36 1329 79
1028G9p49R52P7q15N50P51j328q30J957Q28k347j012K567J084k537j113K361J021
$$ 79 -670 282 359 -456 94 845 -483 -1313 644 1472 -875 -1887 680 1764 -773 -1886 475 1496
1046A496j979o80J528L27j051M08N87j107j84J791K1k385J1K828j7l065l0K875
$$ 1496 -483 -1163 365 692 -359 49 636 -471 -655 1136 1157 -1228 -1217 1611 1594 -1471 -1501 1374
1064A374J22k744nK103k00j514N45Q20j022j48J553l61k013P88K470r69k797J240
$$ 1374 1496 -1248 -1253 850 650 -864 -319 501 -521 -669 884 523 -1490 -702 1768 799 -1998 -758
1082g58K811j214k570J172K235j247j616J254R82j394l02J536m16j831J014J929
$$ -758 2053 839 -1731 -559 1676 429 -1187 67 1049 -345 -647 889 473 -1358 -344 1585
1098A585j570j988J853J955k050j772K163J528k232j088K238O22k122j2K024m20
$$ 1585 15 -1973 -120 1835 -215 -1987 176 1704 -528 -1616 622 1244 -878 -890 1134 714
1114G14j865R62J642j470j301J826J070k200o30K318L18k683J13K630m78k672
$$ 714 -1151 -189 1453 -17 -1318 508 1578 -622 -1252 1066 1384 -1299 -1186 1444 966 -1706
1130a706P80K547j128k221J328J839j587j248J686O71j829J39J971p69k081J477
$$ -1706 -926 1621 493 -1728 -400 1439 -148 -1396 290 961 -868 -729 1242 473 -1608 -131
1146a31K242j922k314K138K394k313k216K234J918k101j416J709P39j489P0J241
$$ -131 2111 189 -2125 13 2407 94 -2122 112 2030 -71 -1487 222 961 -528 -458 783
1162G83j109j090K002J099k744j216L262J363l477j485L478J496l024j192K436
$$ 783 -326 -1416 586 1685 -1059 -2275 987 2350 -1127 -2612 866 2362 -662 -1854 582
1177E82Q21j766j20J089p95m00J787j23k657J94L495l53l996J59M182m5l914j79
$$ 582 1403 -363 -483 606 -189 -589 1198 1075 -1582 -1388 2107 1754 -2242 -2083 2099 2054 -1860 -2039
1195b039L235K00k317LJ270m27k20J160o74j976J485K748j865l397J989L816j702
$$ -2039 1196 1396 -921 -918 352 -75 -295 865 191 -1785 -300 2448 583 -2814 -825 2991 1289
1212A289l847J349L529j054k820O97J756n65p01P78o89j021J722J411k474k097
$$ 1289 -2558 -1209 2320 1266 -1554 -857 899 334 -367 411 -278 -1299 423 1834 -640 -2737
1228b737L031K588l161k825K918K844k420k489K031J725j405p56J046l63p60J545
$$ -2737 294 2882 -279 -3104 -186 2658 238 -2251 -220 1505 100 -656 390 27 -733 812
1244H12P54k582q37L224J077l708j239L663J257l443j138K869Q09k287l12J654
$$ 812 1566 -1016 -1853 1371 2448 -1260 -2499 1164 2421 -1022 -2160 709 1518 -769 -1081 573
1260E73n37r01J390L60k092r7K854o4l282K21L479j67l401K72L060m69k470P25
$$ 573 36 -865 525 885 -1207 -1304 1550 1486 -1796 -1575 1904 1737 -1664 -1392 1668 1199 -1271 -546
1278e46J798j074j158J536L95k028R5K412n55k745R50K749j187k637J422K393
$$ -546 1252 178 -980 556 951 -1077 -982 1430 875 -1870 -920 1829 642 -1995 -573 1820
1294A820j681j860J837J347k019p42K318J34k333L65K402q23k328J167K139j544
$$ 1820 139 -1721 116 1463 -556 -1298 1020 1154 -1179 -814 1588 765 -1563 -396 1743 199
1310A99j751J791J243k033p90K317K27k616K89K691p57k719J084K658j291k421
$$ 199 -1552 239 1482 -551 -1341 976 1203 -1413 -1124 1567 810 -1909 -825 1833 542 -1879
1326a879J451J885j388j309J608O00j723J38J986q83k143J483K409k004k467K197
$$ -1879 -428 1457 69 -1240 368 968 -755 -617 1369 486 -1657 -174 2235 231 -2236 -39
1342c9K383k176k311K029J865j838j210J556L00j281N61J163j464j255K341J432
$$ -39 2344 168 -2143 -114 1751 -87 -1297 259 559 -722 -161 1002 -462 -1717 624 2056
1358B056l011j479L351J650l318j664L086J505k495j040J779L68j139M92N62j480
$$ 2056 -955 -2434 917 2567 -751 -2415 671 2176 -319 -1359 420 788 -351 141 703 -777
1374g77j38K358p5l225Q6L730Q0l948l49L726N39l301m71K420L25j529K95N26
$$ -777 -915 1443 1368 -1857 -1771 1959 2039 -1909 -2258 1468 2007 -1294 -1765 655 980 -549 -254 272
1392B72r07L70J749r52k619J407L284j404l797J412L748j031l581P97K783m96
$$ 272 -635 -265 1484 532 -2087 -680 2604 1200 -2597 -1185 2563 1532 -2049 -1252 1531 1035
1408A035j936N08P53p70M29J103j438j672K149K271k587k672K686K948k510k948
$$ 1035 -901 -393 360 -410 19 1122 -316 -1988 161 2432 -155 -2827 -141 2807 297 -2651
1424b651K217K564j684j855J305R14r60J91P85j208r25K168J170k944j398L250
$$ -2651 -434 2130 446 -1409 -104 810 -150 41 826 -382 -1307 861 2031 -913 -2311 939
1440I39J576l313j753L116J586k704j116J985O32j465J40R84j051o01J953M28
$$ 939 2515 -798 -2551 565 2151 -553 -1669 316 948 -517 -377 607 -444 -1045 908 1336
1456A336k596l28L102L89l311l48L189L16k888r1K418l78j761P58J131j326o35
$$ 1336 -1260 -1588 1514 1903 -1408 -1756 1433 1749 -1139 -1230 1188 810 -951 -193 938 -388 -1023
1473a023J897J87k486K26K727m57k898O85K808q95k462J083K124j366j440J605
$$ -1023 874 1061 -1425 -1199 1528 1071 -1827 -1142 1666 771 -1691 -608 1516 150 -1290 315
1489C15R41j944k91K220j82k406N66K494r05k380J070K123j388j722J604J192
$$ 315 1256 -688 -979 1241 1059 -1347 -781 1713 808 -1572 -502 1621 233 -1489 115 1307
1505A307j909o42K068J99k394K45K610o71k639J053K439j124k187J276J828j446
$$ 1307 -602 -1244 824 1023 -1371 -1126 1484 813 -1826 -773 1666 542 -1645 -369 1459 13
1521A3j032J461M82j800K73K122j070k181J426K451j765k570J888K421j816k213
$$ 13 -1019 442 924 -876 -603 1519 449 -1732 -306 2145 380 -2190 -302 2119 303 -1910
1537a910J760J523j501q18J337k4j350R54J349j679j504K349J763k723j880K795
$$ -1910 -150 1373 -128 -946 391 367 -983 -29 1320 -359 -1863 486 2249 -474 -2354 441
1553D41K011k693j858K344J476j836q75J287M3q92R67N36j886n70K748N69l297
$$ 441 2452 -241 -2099 245 1721 -115 -990 297 340 -552 415 951 -935 -1505 1243 1812 -1485
1570a485q09L608R02l420j064L040J003k404n83J577J00p73P03N8j483L82K430
$$ -1485 -2294 1314 2216 -1204 -2268 772 1775 -629 -1212 365 465 -308 395 453 -1030 -648 1782
1587A782o83l070N98L587m63l772K57L481j19k871lK008j51j034N55L9j112P79
$$ 1782 1099 -1971 -1373 2214 1751 -2021 -1764 1717 1598 -1273 -1276 732 581 -453 102 141 -971 -192
1605a92J716j337k358J661K961j730l211J585L187j219k842R26K217p81j215O98
$$ -192 1524 187 -2171 -510 2451 721 -2490 -905 2282 1063 -1779 -853 1364 583 -632 66
1621F6K46q73O85J221j623j604K150J997k456k246K388K325k236k148J878J730
$$ 66 312 -561 124 1345 -278 -1882 268 2265 -191 -2437 -49 2276 40 -2108 -230 1500
1637A500j468j109J222K33r81P29Q64j496r34K195J137k720j184K906J206k713
$$ 1500 32 -1077 145 378 -603 126 990 -506 -1440 755 1892 -828 -2012 894 2100 -613
1653f13j171K408Q76k066m54J607j49j177Q04Q51j484p17K112N38k508m51K620
$$ -613 -1784 624 1500 -566 -1020 587 438 -739 65 916 -568 -1285 827 1365 -1143 -1594 1026
1670A026M66k565l03K382R0k024L43J572q02j080J228P36j708m26K078J98k278
$$ 1026 1492 -1073 -1376 1006 1096 -928 -585 987 185 -895 333 1069 -639 -1065 1013 1211 -1067
1687a067r4K377j44k256L32J931n84j620R66J147j369p08J763K84k067P5K259
$$ -1067 -1161 1216 1072 -1184 -852 1079 495 -1125 -159 988 -381 -1089 674 958 -1109 -1034 1225
1704A225k28k340L98K313n10k003O51J560p99j077J148M91j471o4J808l35k208
$$ 1225 997 -1343 -945 1368 858 -1145 -494 1066 267 -810 338 829 -642 -706 1102 767 -1441
1721a441O59K432r16k395Q11K302q30j934P62J380q25o43J005l1j193O50J528
$$ -1441 -782 1650 734 -1661 -850 1452 622 -1312 -550 830 5 -638 367 336 -857 -207 1321
1738A321j105j856J458K130j613k203J626K085j437j828J143J351r76n86P77k21
$$ 1321 216 -1640 -182 1948 335 -1868 -242 1843 406 -1422 -279 1072 96 -490 287 66
1754F6p39R07R14j673j135K139J344k348j573K360J598k043j514J689J181j172
$$ 66 -673 234 1148 -525 -1660 479 1823 -525 -2098 262 1860 -183 -1697 -8 1173 1
1770Ao24P52p3m17R25K68j703k47K248M84k697o10K768P40k595q51K105P95j638
$$ 1 -623 129 56 -361 564 832 -871 -1118 1130 1614 -1083 -1693 1075 1815 -780 -1631 474 1269 -369
1789c69m84J026l2l51O10p3j345L87J975m35k511M32K680j43k661j3K446M2j814
$$ -369 -853 173 141 -210 400 327 -1018 -631 1344 909 -1602 -1170 1510 1367 -1294 -1307 1139 1181 -633
1808f33q7J205j66n34N03j70r97P05J528j044j992J117K283j026k403Q95K210
$$ -633 -720 485 319 -215 288 118 -879 -174 1354 310 -1682 -565 1718 692 -1711 -816 1394
1825A394p24j768N43J204m88m97N96j40q24P45J110j123j411J388J672j547j715
$$ 1394 670 -1098 -555 649 161 -336 260 120 -704 41 1151 28 -1383 5 1677 130 -1585
1842a585J456J625j275j390J086R27r35m17P65j77q33P87Q72j276r42J571J076
$$ -1585 -129 1496 221 -1169 -83 844 -91 -508 257 80 -753 34 906 -370 -1312 259 1335
1859A335j695j043J685J016j489q34J309M39r88J8P86m09p62R51O46j376o21J573
$$ 1335 -360 -1403 282 1298 -191 -1025 284 723 -265 -247 539 130 -632 319 965 -411 -1032 541
1877E41O25j696n97J591N11j450k81J200p4r47L88P90q48n63J216M77j479l44
$$ 541 1166 -530 -1127 464 975 -475 -756 444 370 -577 -189 601 -247 -810 406 883 -596 -940
1895i40J659L05j630l29J622J61j303j5R99l04o09N63K93q82j75J291Mj579QJ721
$$ -940 719 1024 -606 -935 687 848 -455 -470 529 225 -384 179 472 -410 -585 706 710 -869 -861 860
1915H60l7j689PJ542j6j250J39Q33l38l30N73J9r97M10J260n97j509O12J721n56
$$ 860 823 -866 -859 683 667 -583 -444 389 51 -279 294 313 -684 -274 986 389 -1120 -508 1213 657
1935F57j678M23J476k95j189K06P57k81k24L78k65o55P18R33r94j183J033J439
$$ 657 -1021 -598 878 583 -606 -400 357 76 -148 230 -35 -690 28 961 -33 -1216 -183 1256
1953A256j057j466R03J458o40j203M67P52k92k05J94l15k50Q07M28j154p54J440
$$ 1256 199 -1267 -364 1094 454 -749 -282 470 178 -27 167 -148 -398 409 837 -317 -1071 369
1971C69Q86j501j001J278J121j136r79P98O29m41k42K03k11q8P32R0j129j84J444
$$ 369 1255 -246 -1247 31 1152 16 -963 -165 464 23 -219 -16 -227 -315 417 507 -622 -806 638
1990F38L61j571m60J505O09j338n78J029M88o91j97K32j64K9N44j82r58K21J255
$$ 638 999 -572 -1032 473 1082 -256 -834 195 683 -8 -205 27 -137 -108 436 254 -704 -483 772
2009G72k02j469J09J462Q3j343k12J134J56o72p9L96k08L6M30k86o79M35R85m76
$$ 772 570 -899 -790 672 755 -588 -800 334 490 -182 -261 135 -73 -37 393 107 -572 -137 848 372
2029C72j174M42J250l51j190K10R62k49o33K20K48k34QM51l49n85N49P51o25q83
$$ 372 -802 -360 890 539 -651 -441 521 272 -361 -141 107 -127 -119 332 -17 -602 -53 698 73 -810
2049h10N88J070o64q61M77P41l97m08K87J59k89J33L89n13l91O29N13p32o36P33
$$ -810 -222 848 184 -677 -200 541 144 -264 23 182 -107 26 415 -98 -489 140 653 -79 -715 18
2069A8O84o84o46M91N49l89l18L38n9j74K98K33n73k68P86L54q53m29Q59M32p36
$$ 18 702 18 -628 -137 412 23 -295 43 -16 -190 108 341 -232 -500 286 640 -213 -642 217 649 -87
2090h7m02O08K53l78j23K43j67q3L51L1o62J5Q09J01r51j52Q97K40p98k37N87
$$ -87 -489 119 372 -6 -129 114 -53 -136 215 246 -416 -401 408 509 -442 -594 303 543 -255 -492 95
2111I5K28l69r6J44m4jL47j56o22L22O86j44q78P6R36l0q58p2N61J61l32j24P3
$$ 95 323 -46 -142 2 -42 -43 304 148 -474 -152 534 390 -488 -412 524 494 -364 -436 125 286 -46 -170 -97
2134i7j2J52J81k88m49M00O88m76q00M58Q03k65p84K03N73N3m11l7Q7J17J21J8
$$ -97 -109 43 224 -64 -513 -113 575 99 -701 -243 560 295 -489 -286 287 340 -71 -108 -21 96 217 235
2156B35m06j86O12K97o86m46N92N50n03o23M00N26k41l30N3P2P6J60j05l61J17
$$ 235 -171 -357 255 552 -134 -580 12 562 59 -564 -164 362 121 -209 -156 -84 -8 152 47 -314 -197
2177a97M76P6o48j13O26L42o38l16M63L13k82l11J89J5O7P1j34k84J15N16k06
$$ -197 279 355 -293 -406 220 562 -76 -392 71 384 102 -209 -20 -5 62 133 -1 -285 -170 346 140
2198A40n70J22O53k7n82j95N59J98l82j31K21L7L7Q2j53j99K34L75l28m50K38
$$ 140 -430 -308 345 318 -264 -459 100 298 -84 -215 6 43 80 162 9 -190 44 419 91 -359 -121
2219a21N45k21n15J19L85J3l42L3N1J9N3K9j97j49L75K53m18l06L50L75k79l23
$$ -121 424 203 -312 -193 192 205 -137 -104 -53 -34 19 48 -149 -298 77 330 -88 -394 -44 331 52 -271
2241b71K02K90j26j92P6P8p6J60J1k78n1M01J19m46k63N24J62l61k63K82J87k10
$$ -271 -69 221 95 -97 -21 57 -19 141 152 -126 -177 224 343 -103 -366 158 320 -41 -304 -22 165 -45
2263d5q5M9mN3K06q6l59J17M20q7m34J9M25R5l85j17L37M7j23p2K5m6N4J52j36
$$ -45 -130 -81 -85 -32 174 88 -271 -154 266 179 -255 -236 189 284 -101 -218 119 166 43 -29 -4 -50 4 156 20
2288B0l33K96L08j80m83J99M31j02m29NL89Lj82MJ8k5J44R6k19k28L27L37l50
$$ 20 -313 -17 291 111 -372 -173 258 156 -273 -268 121 124 -58 -54 -36 -61 83 179 -40 -268 59 396 46
2311D6m17L44M73l47l78J83L05j12j71L6l9JJ26Q1l45p9M91R9m26k69N34K96m53
$$ 46 -371 -27 446 99 -279 -96 209 97 -74 -38 -77 -76 50 131 -214 -293 198 297 -129 -398 136 432 -21
2334b1l23L82K24k37j27J08L3n7J68Rl82Q2M10l9n71M5N46O9n86o8M58Q6l42p3
$$ -21 -344 38 262 25 -102 6 39 -18 150 159 -223 -141 269 230 -341 -296 250 319 -267 -335 123 209 -133 -206
2358b06K24j3k8J07m1l08K04L99j82n23K69M99j57n40J58M80j83l29J16K26j53
$$ -206 18 5 -23 84 43 -265 -61 338 156 -367 -98 401 244 -296 -138 342 159 -170 -54 172 19
2379A9o7J75p6l03K16L39l75l33L45M47m04l96L59L62l25k18K25J44j65o7K09
$$ 19 -48 127 51 -252 -36 303 -72 -405 -60 387 -17 -413 -54 308 -17 -235 -10 134 -31 -98 111
2400A11r5k03K88K22l50k76M16K81m69k48M55J96m40j01L30J4l23J30K31k73j54
$$ 111 16 -187 101 323 -27 -303 113 394 -75 -323 132 328 -112 -213 117 131 -192 -62 169 -104 -258
2421b58K88J82l99j63N22J16m63j05N28Q5n31K8L33o8k52K23J87l25j62M37L3
$$ -258 30 212 -187 -350 172 288 -175 -280 248 333 -198 -170 163 95 -157 66 253 -72 -234 203 236
2442B36m78j7N54m2n16k9N10n4m04R9L09j74j38K61M9m00Q9M31o4m91L5N70j53
$$ 236 -242 -259 295 253 -263 -292 218 164 -240 -141 168 -6 -144 117 166 -234 -145 286 222 -269 -234 336 183
2465A83n07J23N34k13l47K04K51k46r3K22k8l80J76M70l32m69L24N44l44n39L61
$$ 183 -324 -201 333 120 -227 -23 228 -18 -111 111 83 -297 -121 349 17 -452 -128 416 72 -467 -106
2486a06M45l40l17J94L83k80j14L14r3k87K67L37m47l55N24L69n86l63N82L49
$$ -106 339 -1 -318 -124 259 -21 -135 179 86 -201 66 403 -44 -399 125 494 -92 -455 127 476
2506D76n12k96L49K10l56kK44j90j48L18J79m46k26N66K23n85k81O73K66o29j81
$$ 476 -36 -332 17 227 -129 -131 113 -77 -225 93 272 -174 -400 166 389 -196 -477 196 462 -167 -348
2527c48M87J79m53R4K76k23j47L11N8n07K4O25k4p12JP17p1o28L1N49m1m22J01
$$ -348 139 318 -135 -41 235 12 -135 176 234 -273 -249 376 352 -360 -359 358 287 -341 -310 239 198 -224 -123
2550a23K97k43o4L37n7m17R3O23k46n94K40O43k78o15K69M89j78m98K68K45k65
$$ -123 174 -69 -133 204 147 -270 -177 446 200 -394 -154 489 211 -404 -135 354 176 -322 -54 191 -74
2571g4o2L16j04l80K13M77l54m80M56M64m04n32M48M02m27k48L32K18l36j4L19
$$ -74 -136 180 76 -304 -91 386 32 -448 8 472 68 -464 -16 386 -41 -289 43 261 -75 -89 230
2592B30j71l90M00L33m26m08N79L30n81l50N08L09n21j69M79J1l64Q1L34k81k23
$$ 230 59 -331 69 402 -24 -432 147 477 -104 -454 54 363 -158 -327 152 163 -201 -120 214 -67 -290
2613b90L87K17n11j47N68J97n91k09O20J50n64m3M32r5l23J48L21l57j90M76P6
$$ -290 97 314 -197 -344 224 421 -170 -379 241 391 -173 -216 216 121 -202 -54 267 -90 -280 196 272
2634B72n17p5N61N2o14j7O35q9m98J00L86j96k13K60J63l56o8N19r1n00J2O54
$$ 272 -245 -320 241 293 -321 -338 297 208 -290 -190 196 0 -213 47 210 -146 -214 305 214 -286 -274 380
2656C80j01o33J78N36j59m67J81L36k57k05K85O1m33K06M42k13n60K25N92k30
$$ 380 279 -354 -176 360 201 -266 -85 251 -6 -211 74 135 -298 -92 350 137 -423 -198 394 164
2676A64n76K71M73k48m16K75L14k59j26L17l5m09K67L71l45m75L76M95m14m38
$$ 164 -412 -141 332 84 -332 -57 257 -2 -128 189 154 -255 12 383 38 -437 -61 434 20 -418
2696d18L80N20m62l39K90K01k16o8K81k13j79K93K85m20l61N79K90n49l20N98
$$ -418 -38 482 20 -319 -29 172 -44 -112 169 -44 -223 70 355 -65 -426 153 443 -106 -426 172
2716A72K84n12k74M32R7k67PJ87j86j72L82J37n18j53O17J76p01j71O36J75n76
$$ 172 456 -56 -330 102 199 -68 -61 126 -60 -232 150 287 -231 -384 233 409 -292 -463 173 348 -228
2737b28j18M55P2k68M2K02j79o8L14qm64M9N90o5o64N4N92k3n21k6M90l3l63Q3
$$ -228 -346 109 181 -87 -45 157 -22 -90 224 216 -248 -199 391 326 -338 -284 308 285 -236 -262 228 195 -168 -85
2761h5J81k34L4K57j5m73K02N65l11n73K93N62k15m91J70M43k35k11J32J41k37
$$ -85 96 -138 -104 153 138 -335 -133 432 121 -452 -159 403 188 -303 -133 310 75 -136 -4 137 -100
2782a00P1K55j97l25L11L64l69l97L30N02l99m27K75M05k49k16J67J19k09N0K97
$$ -100 -29 226 29 -296 15 379 10 -387 -57 445 46 -381 -106 299 50 -166 1 120 -89 -39 258
2803B58l25j93L36K61l50l35M20L71m77l02M03K12l07j70K95K6k21J22J82l14
$$ 258 -67 -260 76 337 -13 -348 72 443 -34 -336 67 279 -28 -198 97 123 -98 24 206 -108
2823a08j36L49J96m88j24M22K36m58k05L95J12l00J2J53l2j72K59P2l61j5M28
$$ -108 -244 105 301 -187 -311 111 347 -111 -316 79 191 -109 -97 56 24 -148 111 183 -178 -193 235
2844B35N0m71p4N54pn06k2M03l5k91L7K37j29r1J76j7k85Q2M18r2m86L5N87p1
$$ 235 285 -186 -260 294 287 -219 -241 162 127 -164 -127 110 -19 -110 66 49 -236 -154 264 172 -314 -279 308 237
2868B37m75J5M05L1l04K0K35j58o8K36q9l03J80L76k38m19J53N06k06m23J11L84
$$ 237 -238 -223 182 213 -91 -71 164 6 -62 174 85 -218 -38 338 100 -319 -166 340 134 -289 -178 206
2890B06j01k69J53N1p4j2J58j48k11L37K28l36l46L85L61l55l54L33K78k27k63
$$ 206 105 -164 -11 40 -34 -46 112 -36 -247 90 318 -18 -364 21 382 27 -327 6 284 57 -206
2911b06J83J26j15J5P1j91n3K71J75m13j94M01K44l70k94L65K65k77k11K06Q6
$$ -206 -23 103 -12 3 74 -117 -170 101 276 -137 -331 70 314 -56 -350 15 280 3 -208 -2 84
2932H4p7j0J06k18j2L29ll99m4M37J47m80j63L93J44l21q1J74R6r6jL3j56qL49
$$ 84 7 -3 103 -115 -127 202 199 -200 -244 193 340 -140 -303 90 234 -87 -168 6 102 6 5 38 -118 -126 223
2957B23j01l26kN09o6n06O2M35j5l27oK51o0j05Q9Lj60O8J84j11l02J62M06j84
$$ 223 122 -204 -206 303 237 -269 -207 228 213 -114 -120 131 71 -34 55 58 -102 -34 150 39 -263 -101 305 121
2981A21m22J10L86m4l35Q6J50%o7J5j1n8L6K17j63k81K83K90k84k63K08K84j48
$$ 121 -301 -191 195 151 -184 -98 52 52 -15 0 -11 -69 -33 184 21 -260 23 313 29 -234 -26 258 110
3004A10k39P7J74o4j08J49j20j09J66J36k27j89K38L11l64k48L20K41k30k47J86
$$ 110 -129 -52 122 58 -50 99 -21 -130 36 172 -55 -244 -6 305 -59 -307 13 254 24 -223 -37
3025c7J56j22J1ok2q7K12M9k68j5K59J83l70j23K37J78k54j61K24O0j53M0j7l4
$$ -37 119 -3 8 2 -20 -107 105 154 -114 -129 130 313 -57 -180 57 235 -19 -180 44 104 -49 -9 -26 -60
3049f0k6J83L7l24L6L56l2k85j00L47O9k74n9K48j4j03R4p7n4J7J89q0k92J62
$$ -60 -86 97 134 -190 -154 202 170 -115 -215 132 201 -73 -132 116 102 -1 93 16 -38 -21 168 88 -204 -42
3073d2K23q3k39o9L72n1k52L3J42M1r6L5Mn7L9J69j86j34J60K47k21l00K58K15
$$ -42 181 98 -141 -210 162 111 -141 -108 34 75 -21 14 18 -39 0 169 -17 -151 9 256 35 -265 -7 208
3097B08p3k90R4J26l9n1N2n3qJ04kj56o0J67J71k76j27J97J82j06k24J45J32m5
$$ 208 135 -155 -61 65 26 -25 27 -26 -34 70 68 -88 -148 19 190 -86 -213 -16 166 60 -164 -19 113 68
3121F8j01N4m8J8J16L0k19j5J95R5k84o6K53J52k79j18J61R6j23n2O9r1P7R1J
$$ 68 -33 21 -27 -9 107 137 -82 -97 98 193 -91 -157 96 248 -31 -149 12 108 -15 -67 2 -89 -12 79 80
3146H0k59R0K25j1k21n7K72L1k17r5K80j0q5n8K9L1J9N0r6j03Q5J69l4k70N8K30
$$ 80 -179 -89 136 125 -96 -153 119 150 -67 -162 118 108 23 -35 -6 25 44 94 -2 -105 -20 149 115 -155 -97 133
3172A33l2k31k0K56n3n9j8Mk1J00l5o9p9J14K37k21j66J07K07j01j68O0J07Kn3
$$ 133 101 -130 -150 106 53 -6 -24 -20 -41 59 24 -45 -124 -10 227 6 -160 -53 154 53 -115 -55 52 54 1
3197An4L3O0J7j7j62N1J33P6j83j17J23J76j17j31Q4J21p6j9K2k8KM8mj26N4J72
$$ 1 -53 -20 40 57 40 -122 -71 62 138 -45 -162 -39 137 20 -111 -27 94 18 -1 21 -7 -5 43 39 -87 -33 139
3224A39k1k06p7K23Q9j82j33J52K3L4m8n6L2L6K7K0j57O7J20L0j87l7K20O8j48
$$ 139 118 -88 -165 58 147 -35 -168 -16 7 41 -7 -63 -31 5 32 52 -105 -38 82 112 -75 -112 108 176 28
3249B8q3J07N7j05k1J0K7O3l5k1j02O7J28j08j74N6J86Jj75j4J64j1j13K1kO2
$$ 28 -55 52 109 4 -17 -7 20 83 48 27 -75 -8 120 12 -162 -106 80 81 -94 -108 56 45 -68 -47 -49 13
3275A3J9j0n3l4P2J32j65r0J20J61r5k05M5K01l5j40L0J7M6M2k4o9l9J07R3j79
$$ 13 32 22 -31 -65 7 139 -26 -116 4 165 70 -135 -90 111 76 -64 -34 -17 29 71 47 -22 -61 46 139 -40
3301d0j05J69J35j53j31J28O1J5j35L8J9PN0j19rM4P4Qj99M7J74J6j81j3J17M1
$$ -40 -145 24 159 6 -125 3 64 79 -56 -18 1 8 58 -61 -70 -26 48 56 -143 -96 78 94 -87 -100 17 58
3327E8o4q2K9Q2m0R0q8o7K7J72o4j12qJ70Oj62l7J34L8p1l5nM4J3j9p0K3M5R1
$$ 58 -6 -88 -59 23 -17 73 -15 -82 -55 117 53 -59 -67 103 109 -53 -90 44 82 11 -24 -29 15 28 9 -61 -38 7 98
3356I8j22o0M3Q9o0j41N8J88m8j26k5R2RN0Jo5M7jP4r8j12J38J02r4j03P3J00
$$ 98 -24 -84 -41 48 -12 -153 -95 93 45 -81 -106 -14 -5 45 46 -19 28 27 101 3 -109 29 131 37 -66 7 107
3383A07l7j43j0N6N2jjo2j09J72Qj04r6J49J25j47k7M4R2l2o9QL3J5L6k1q8K9
$$ 107 70 -73 -83 -27 25 24 23 -39 -148 24 32 -72 -168 -19 106 -41 -68 -24 68 36 -33 -25 8 23 59 38 -50 -21
3411b1P0mp1m7J71K1j31l0O7O1j31L5j1K0K3k1k7o4J22K0J4j40P4Q7l0j22J2J00
$$ -21 49 45 -26 -73 98 119 -12 -42 25 86 -45 -10 -21 -1 22 1 -26 -90 32 52 66 -74 0 87 57 -65 -53 47
3439D7L0n7p0Q8l3J2J3m1l8O5M8o0l4OJ27q8j11nJ18J7q2K3L9O5m3Ml1n9P3P1
$$ 47 77 20 -50 38 5 17 30 -11 -49 16 64 4 -30 -24 103 15 -96 -101 17 34 -48 -25 14 79 36 40 9 -50 23 94
3469I4j04j14J70Nn7n2L9J35r0m5k1O6k2l3nj2M0L7n7j3o8R7J00j04p7R9P5r0
$$ 94 -10 -124 46 51 -6 -58 -19 116 26 -19 -40 26 4 -29 -34 -46 -6 31 -26 -39 -107 -10 90 -14 -91 8 83 -7
3497gr0J04P5q1%M7j6L4j3k0q3M8N6l4l1p7J16J01j48ml4Q8k9m2mK0jO1j9n7l0
$$ -7 -97 7 82 1 1 48 32 66 53 33 -50 -2 54 20 -11 -88 28 129 -19 -23 -57 31 2 -40 -44 -24 -25 36 17 -40 -70
3528g0J02L6o9k4O8M3q1m7N7J8m8m2J00j4l9N7k1j15N9J47j11j05J11J8lj39O4
$$ -70 32 68 -1 -25 43 86 5 -42 15 33 -15 -57 43 29 -10 47 26 -89 -30 117 6 -99 12 30 27 -112 -48
3555d8Q4l7J1p6N7l2Q6n1m3K0J8O0Lj22M4P9l0p8J9J16m1o2lL6k6L0J9p2p3J08
$$ -48 36 -1 10 -66 -9 -41 45 -6 -49 -29 -11 49 52 -70 -26 53 23 -55 -36 80 39 -23 -26 10 -16 14 33 -39 -112 -4
3585dO8q0m8J05P3j44K1lJ06m9k7j1lO2j7j3M8j30P3o0J6k7O3N7j27K8NQ0k9n2
$$ -4 64 -16 -64 41 114 -30 -9 -12 94 45 18 7 4 66 49 36 84 -46 27 -33 -17 -44 19 76 -51 -23 -18 62 33 -19
3615a9k6M3%K1l5MK3M1J2r4oR6j7o4k1Q9j1l2J4m9L6RkK2j00N9N4o2p7O0J29o9
$$ -19 -45 -2 -2 19 -16 -12 11 52 64 -30 -36 60 43 -21 -42 47 36 4 18 -31 5 14 12 34 -66 -7 47 -15 -92 -32 97 28
3647B8j05L6N4J5m6NK8K2j00M7n5J2Q8L9k8j58R6J23k3j20O4P3l7r3K3K3l3O2
$$ 28 -77 -41 13 28 -18 -13 15 37 -63 -16 -71 -59 29 68 40 -118 -22 101 78 -42 22 95 58 -35 -12 11 -22 40
3675D0l3j8o6Q3L1j33O4L9N0o6l0N8j3L8j14N9M2k7K1j4p4P0L3Pp4m5J18Pq1p7
$$ 40 7 -11 -77 6 37 -96 -32 7 57 -9 -39 19 6 44 -70 -11 31 4 25 11 -63 7 40 47 -27 -72 46 53 -28 -105
3705a05R4Q9k9n4j0R2p8Lj0J3LJ4k9o7O6R2l6p8qQ7J5p0J2Jm6rN0K8n9%qm2O6
$$ -105 -11 78 49 -5 -15 77 -1 2 -8 5 8 22 -7 -74 -8 84 48 -30 -38 49 64 -6 6 7 -39 -48 2 30 -29 -29 -37 -79 -13
3738a3K6n9K4o3PQ5lp5N0QNl6O3m7K3J9L9o0k5N3N8o4p9J9J33o5l2q4J12J0p2
$$ -13 13 -46 -22 -85 -78 7 4 -71 -21 -13 -8 -44 19 -28 -5 14 53 -7 -32 21 79 15 -64 -45 88 23 -9 -93 19 29 -43
3769d3M7o5J05n2l5KMM5j0K3j33J23O2k4n1j7O4ooo4L8J1qrp0P7l4L5l5l0Q2L9
$$ -43 4 -61 44 -8 -43 -41 -37 8 -2 21 -112 11 73 49 -2 -19 45 39 33 -31 7 18 10 1 -69 8 -26 9 -26 -56 26 65
3801F5m8m4M4j5Oo%n7L8JL1p0j5R2n2J2l4N0j6k4J8N7J9j1q0M1n4Q3L9o9K0l9
$$ 65 17 -27 17 2 8 2 2 -55 -17 -16 15 -55 -70 22 -30 -18 -52 -2 -18 -42 -24 33 52 41 -39 2 -52 31 70 1 21 -18
3833a8Q6r5o2N4J8O6o7k8O8k0K2l2L2j1j5L3n4J0L9M0l8j00N0M4L8j19R1k6K2
$$ -18 68 -27 -89 -35 -17 49 -18 -46 22 2 24 -8 24 13 -2 31 -23 -13 26 66 28 -72 -22 22 60 -59 32 6 28
3862B8o4L3j8l0P7l8k8OM6L0k5m1M8k8K2m0L2L2Nql7N0n1L1n6KM6K8J7n4n5M5
$$ 28 -36 -3 -21 -51 26 -12 -40 -34 12 42 17 -24 24 -4 18 -22 10 42 47 39 2 52 1 32 -24 -22 24 52 69 15 -40 5
3894EJ6j0r9N4M6j2k2J5MjK9k9j5Q7m3rl6pM7N0p7rQK9J6r8M7M9jl0JnPP7l6q0
$$ 5 21 11 -88 -34 12 0 -22 -7 -3 -4 25 -4 -19 68 25 16 -20 -27 20 70 -7 -16 -8 21 37 -61 -14 35 34 4 5 0 7 84 48 -32
3930c2J0Q5o6j2k8Q0k7Mr2O3L5K8m1L5j01J26j02JJ5J6L4k0ll2K6J1Jn7O2k2Q7
$$ -32 -22 63 -3 -15 -43 37 10 14 -78 -15 20 48 7 42 -59 67 -35 -34 -19 -3 31 11 8 -24 2 13 14 -43 19 -3 84
3961H4j03j2M0k6m6N4j7O1J8k6j7l3O6l3j5j6N8qn9J0P1n3L6l6l5n5P4%j7L3J5
$$ 84 -19 -31 9 -17 -63 -9 -26 35 53 27 10 -23 43 10 -5 -21 37 29 -30 -20 51 -2 34 -2 -37 -92 -18 -18 -35 -2 13
3992A3Kj0n5L9M7J3m0m3K3K0j4KK1K4J8j9k1k3RK6J0l8j9j2N7j6j12J08%N4n5
$$ 13 15 5 -50 -11 36 49 9 -34 -11 9 -5 -3 18 42 60 41 20 -3 6 32 42 4 -15 -27 30 14 -98 10 10 64 9
4023In0K9%J2j1nlpM2m3K7K4k2L2m1j4L4Q7r4J1M7l8J2j2l6J7P9m9m5K4k5L5n1
$$ 9 -41 -12 -12 0 -11 -16 -19 -26 16 -27 0 24 2 34 -7 -21 13 100 6 17 64 26 38 26 -10 7 86 37 -8 16 -9 26 -25
4056b5L6k3N2n2j5k5Q3n0pj3K8K4M1r6j0K0P9J6p0j1M5m6P5p4nL4o5P8m4KJ4K7
$$ -25 11 -12 40 -12 -27 -52 31 -19 -26 -39 -11 13 54 -42 -52 -32 47 63 -7 -18 27 -19 56 -18 -23 11 -54 24 -20 -18 -4 23
4088B3r7P5L2pl1RrJ6Nk0J7k0M0J5j6m5N8m1K5jm7PM0o9j9M7qqL2m6K4M5Qm2l2
$$ 23 -74 1 33 26 -5 4 -5 11 16 -4 13 -7 33 48 32 -13 45 4 29 28 -19 -12 28 -41 -60 -13 -21 -29 3 -43 -19 26 34 -8 -40
4123d0K0j0j4K9J2OPk8kL6Lm0K8J0k6mN5n6PK6m7l1J4Q6o0M3m6L2o8R8r0K8PP
$$ -40 -20 -30 -44 -15 -3 3 10 -18 -20 16 19 -21 7 17 -9 -13 42 -14 -7 19 -28 -59 -45 41 -19 24 -22 10 -58 40 -50 -22 -15 -8
4157hP5o5m9L3O8op6j1O1j1k4K1l1O8l5j1jJ9l0j1M7o3QN5Rl9pN0k2k8o2O8L8
$$ -8 67 2 -47 -14 54 48 -28 -39 22 11 -13 8 -23 45 10 -1 -2 17 -13 -24 23 -40 -32 23 32 -7 -14 36 14 -14 -76 -8 30
4190C0rJ5j1l2oLJ2j3j7N1j22N8L9M4Ll8l9NL7L3l6nk3N3k4n0N3k9K6l9N7j9M8
$$ 30 21 36 25 -7 -13 -10 2 -11 -28 23 -99 -41 -2 42 45 7 -32 -27 10 43 7 2 -21 32 8 -42 11 -18 8 -31 26 7 55
4223E5Kp0K3j8K5J6J7n3K9J6k8K0j6m0J1jl3O1j9j8J5Ol5K0J0L3j2K2n6J9n7N2
$$ 55 57 -13 10 -8 17 33 50 -3 26 42 14 34 18 -22 -11 -12 -45 16 -3 -21 -6 0 -35 -15 -5 28 16 38 -18 1 -56 -4
4255dLl5K1j2P3l2k7K6n3N3L0m3oK7m5L0J9n0MK8r1L8J8L3k2P5r6L2K8%mK2j9
$$ -4 -1 -36 -15 -27 46 14 -13 13 -40 13 43 0 -6 21 -24 6 25 -25 -21 7 -84 -46 -28 5 -17 58 -38 -6 22 22 18 40 21
4288B1j6k8%N9p0P7n1j9k1M5jj3j3J2M5J4j06N2J5K7l7M0j4K8J3l1j9j1K4ll7
$$ 21 5 -23 -23 36 -34 43 -8 -27 -48 -3 -4 -17 -30 -18 27 41 -65 -13 2 29 -8 32 18 46 59 28 9 -2 22 19 -18
4319a8k2L6LM9p4M3n0K4j7K8Rk7M5k2Pl4L2J2l2j7M0Pp0M3M9rr6Q0k3k8nP1j8
$$ -18 -40 -4 -1 48 -26 17 -33 -9 -26 2 11 -16 29 7 14 -20 12 24 -8 -25 15 22 -48 -5 44 35 -61 19 -4 -32 -37 34 16
4352A6m5Q1p2Mj9N4k7m1O2j0m0L8k7L5qM1q3O9n4L7J8k3m8K7O1p7L8m3N5m4N3
$$ 16 -29 52 -20 -16 -35 19 -8 -49 13 3 -37 1 -26 9 1 42 -41 28 -26 11 29 6 -42 -15 46 -31 7 -36 19 -25 28
4383B8Kj9k9j3N1Jl7K5K1K6r2j3K7M6n5L5l7K6k1j2L2kl1J6J2K1nK6j4j9L6m5
$$ 28 30 11 -18 -31 20 21 -16 9 30 56 -36 -49 -22 24 -31 4 -33 -7 -28 -40 -8 -10 -41 -25 -13 8 3 29 15 -4 32 -13
4415a3L2j2m1J3J0L9l5L5l8N8j4o4L7Ll5N0J3n4N3oj1m1K1K1l1l2M0N2n8jJ5J5
$$ -13 19 7 -34 -21 -11 28 -7 28 -10 48 34 -30 7 10 -25 25 38 -16 37 31 20 -21 0 21 -10 -42 -2 50 -8 -9 6 21
4447B1j0j9j7K9RJ6l9j3K1LL9o0N6p3M2J2l6K8k2k4rJ05q7O2j4l5O0j3j6jK8m7
$$ 21 11 -8 -25 4 13 29 -10 -23 -2 1 40 -20 36 -37 5 17 -19 9 -13 -37 -46 59 -28 34 20 -15 45 32 16 15 43 -4
4479dL3Qm7L4k2Nj3K5k7J8k4jm9Q1j6K1Pk0okJ2k5N4q2N1OQo2N3rk8P4r6Q0l1
$$ -4 29 37 -10 24 2 7 -6 19 -8 10 -14 -15 -64 17 1 22 29 9 3 1 13 -12 42 -40 11 17 25 -37 16 7 -21 53 -43 37 6
4514Fj3OJ2rk4k3M9n7R4q8kN8k7J5%Pn7Q1j18Q8Rk9J6O8p5nqJ1M5j2m3K9J0m8
$$ 6 -7 -1 11 2 -22 -45 4 -53 41 -47 -49 9 -18 -3 -3 4 -53 28 -90 -2 7 -22 -6 62 -13 -18 -26 -15 30 18 -25 4 14 -34
4548c4M5Rk0NK6rl2J3L6ok2Km9LR8j40J14o3M3j8pk4O2mk2n7J03p2l0RN1m6J3
$$ -34 11 20 0 5 31 22 -10 3 39 33 11 13 -36 -33 65 -75 39 -24 19 1 -6 -30 32 28 6 -51 52 -20 -50 -41 10 -36 -23
4581b3N8l8m8P8j06M9nJ7J7j4J7Om5L4K2k3J6L6j1J1o3K8pl2L6%Mk3k0L0J2l7
$$ -23 35 -3 -51 27 -79 -30 -35 -18 -1 -15 2 8 -37 -3 19 -4 12 48 37 48 -15 13 6 -26 10 10 14 -9 -29 1 13 -24
4613b4K9m1NN4n6O7rk4MN9l6m6O1n4k8M9j8K2%l4K7J9J5m9K3ook2L6rP3r1J6j4
$$ -24 5 -36 -31 23 -33 34 25 1 5 64 28 -18 43 -11 -39 10 -8 14 14 -20 7 26 41 -8 15 9 3 -19 17 8 81 -10 6 -8
4647hj1M2k8J1j5rm7O0nqrK3j0R9j04K7l7O4m2L8K1l4l1J5M9j7o4RN6j1M9n6n
$$ -8 -19 23 -5 6 -9 -18 -65 -5 -10 -18 -27 -4 -14 85 -19 8 -29 35 -7 31 52 18 -13 2 51 34 -30 -21 35 24 73 17 12
4680A2m7nP8j03J6L7j9Q0l1k1m1M3J3P1n7J2l8K2j1KqK4k9on9Q0pPn7K6M6l9j9
$$ 12 -35 -40 38 -65 -49 -12 -31 49 18 -3 -44 -1 12 83 26 38 0 22 11 13 5 29 0 -6 -65 15 8 15 -42 -16 30 -9 -28
4713b8JN0k3j1Ol7K1Q6k8j0j1k5N9m4J3k3j1M2K6j5n7Rl4O2Km1J7qm4M8pK3N2
$$ -28 -27 23 0 -11 -5 -42 -21 65 37 27 16 -9 50 6 19 -4 -15 27 53 38 -19 -10 -44 18 20 -21 -4 -12 -56 -8 -15 8 60
4746F0j19M2J8J6j4l4M0k0omL0K4j4k7K4Ol1L5j5J4k2lj4K5k1M1j7J2n1J6J3k8
$$ 60 -59 -17 1 17 3 -31 9 -11 -17 -21 9 33 19 -8 16 22 -9 26 11 25 3 0 -14 11 -10 31 14 26 -25 -9 4 -24
4778b4O8o5k7P9J8o4j6L1K6q2R3m8qN6Nm5LrJ8jN7m2K0j2k8K6l2L0j22P8oP9k6
$$ -24 44 -21 -48 31 49 -15 -31 0 26 -56 37 -11 -19 37 42 -3 0 -9 9 8 65 23 43 31 3 29 -3 27 -95 -17 -23 56 30
4811C0Pk9m0QL1K5k0j5jqJ0Kk0m1O7NQk9rn0R9n1Rj5k9P9lm0N5m8KO9p2L2Lm2
$$ 30 37 8 -32 -24 7 32 12 -3 -4 -12 -2 0 -20 -61 6 11 19 -10 -19 -69 30 -21 -12 -27 -56 23 20 -20 35 -13 -11 58 -14 18 21 -21
4847b1J01q4j4M2K3o7K0J7l1M2m3J1k2O2J8l9Jm4MQM2q1M0M5o5J7m2J03r9Q5j
$$ -21 80 -4 -18 24 47 -20 0 17 -14 28 -15 -4 -26 36 54 15 16 -28 -24 -16 26 -55 -15 30 -35 -18 -60 43 -56 29 28
4878B8N7j04M0k9M0K1k9L7p9M5j8O1m9m7mN9l8j5J00q1l3J5K5Mk7J9Km0lL3N7
$$ 28 85 -19 21 -8 32 53 24 61 -18 27 9 70 21 -26 -30 29 -9 -24 76 -5 -38 -23 2 6 -21 -2 0 -40 -43 -10 47
4909D7n7J0J4l9J30j16Pk3K1RO8n3koJ7mm0PNM4m0J3l8K0L9k9k6K7J9j6LRlLj2
$$ 47 -10 0 14 -25 105 -11 -4 -27 -6 3 71 18 16 10 27 23 -17 -10 -5 39 -1 12 -26 -6 33 4 -22 5 24 8 11 20 17 20 8
4944HO9r4pk1M4mO0r3oL3N3k6l8jM6omJ0j9k8K1K7K0n4J6K5r8O0L7n0L3j0k7r
$$ 8 77 -17 -24 -45 -1 -5 55 -38 -44 -11 42 16 -22 -23 23 17 13 23 4 -24 -3 24 44 -10 6 31 -67 -7 30 -20 13 3 -24 -33
4978c3N2j2Qn2K7J2KM4p8M4J4m0k5M3J7j0n4k4L5K0k5oqQ3k8rM0o2M3Om9k2J17
$$ -33 19 7 15 -37 -10 2 4 48 -30 14 28 -12 -37 6 23 13 -41 -65 -30 -10 -35 -41 -49 34 6 -3 37 -25 18 24 -25 -47 70
5011G0j13O6ll4J3J2j0pL5n2K8Rprj9N3J2q7QJ0jnLJ5Qm3oL1J6M4n5K8j8n1M6
$$ 70 -43 23 20 -14 -1 11 1 -6 29 -23 5 14 7 -2 -21 32 44 -43 -35 -25 -26 -31 -28 -13 -5 -48 -54 -23 -7 37 -18 10 -8 -59 -13
5046a3L7r9M7LK0L0rK9Nn8OkJrn3J03n6RL1j4k6j8M2k3jL1Oj6nk4K5NqKJ6j2k0
$$ -13 24 -75 -28 -25 -5 25 16 45 50 -8 -2 -4 -3 -12 -65 38 -18 -9 22 8 -18 -36 6 -17 -18 13 19 3 -2 -26 -1 4 -4 -2 14 2 -18
5083a8k0K4k7j7O7jk3M7n0K0L0q8N4K6o0Q9l7oL8k8l0L3K1k4k6lM1Kr1L3K1J1
$$ -18 -38 -14 -41 -58 9 8 -15 32 -18 2 32 -56 -2 24 -36 53 16 10 48 20 -10 23 44 20 -6 -9 32 34 -57 -24 -3 8
5115Hk6L1k2m3N3L7l2K0n3M0JkK0rk2k1N8j2J9o0N5kq4Q1J1l3j0K2J6m7L5lm7
$$ 8 -18 13 -9 -52 1 38 6 26 -27 13 14 12 32 23 1 -20 38 26 45 -15 40 38 -46 35 46 13 3 25 41 -6 29 26 -21
5148b1qJ1l0J9L3n3J1J5L2n7O7p6Q0j0l7O0l8M1n2L5pML2m9M6Nm0l8O4n6j8N5
$$ -21 -29 -18 -48 -29 4 -49 -38 -23 9 -48 19 -57 23 13 -24 36 -2 39 -13 22 15 19 51 2 48 53 13 -25 39 -17 -35 20
5180B0p2R4k4k6M7l4j8K7NpKK3n9L0kj3QJ5j9K1j4J2j5M3j0n4M1mm6L1oM1n9K2
$$ 20 -52 42 18 -8 39 5 -13 14 19 12 14 37 -22 8 6 -7 1 16 -3 18 4 16 1 44 34 -20 21 17 -29 2 -4 37 -22 0
5214@roN0J0k4Ml5rK5NK4k7K1Pk2l4J1J1K4l4J7K3Nol4M0p6P4j2o6K2j8L9k1n
$$ 0 -9 -15 35 45 21 25 -10 -19 6 11 35 8 29 36 14 -20 -9 2 26 -8 9 32 37 31 -3 37 -39 35 23 -43 -21 -39 0 -21 -26
5249b6N3Jk6j9K4m5N8qj5K7l4J8k5N0l8J0Qm0M1j1K2k2Jml0K1K4J3qKm8qR1l9
$$ -26 27 28 2 -17 7 -38 20 12 -3 24 -10 8 -17 33 -5 5 13 -27 14 3 25 3 4 0 -30 -9 15 28 20 22 -26 -34 57 18
5283A8q1M3rJk3K5J4J6J1o5M0rN5l4M2k5nl4N6m6J6O0m7k5O3j8n3l4O8pm5J21
$$ 18 -63 -20 -29 -28 -51 -26 -12 4 15 -50 -10 -19 36 2 44 19 14 -20 36 -10 6 66 19 -6 57 39 -14 -48 20 13 -32 89
5315H9r3M5lk7j4P3m5j0j3l9KK1M2qk1K2l1L7k9mP2o9l6J6L5JpjP1o6L1n8J9M
$$ 89 -4 41 38 11 -3 70 25 15 2 -37 -35 -14 28 20 -1 21 -10 27 -2 -6 66 -3 -39 -23 12 13 6 5 76 10 41 -17 2 6
5349Fj5%mlnO0l0lJ9l7L6Kn2K0K0k6pL7l4M3k0J3m9n2P9k6K6J9m5L4k5N9J3r7
$$ 6 -9 -9 -13 -16 -21 39 9 6 25 -12 24 26 -26 -6 14 -12 -19 18 -16 27 7 20 -29 -81 -2 -28 -2 17 -28 6 -19 40 53 -44
5383d4M6Rm8lO0k0l2Q%M0ll3jRPJ7J8J3o6L2n2J9N5n1L7n7P1l5mLL0m1K0J2l2
$$ -44 2 11 -37 -40 20 0 -32 -24 -24 16 13 -20 -21 -12 -5 12 30 43 -23 9 -43 -24 31 -20 17 -40 31 -4 -8 -5 25 -16 4 16 -16
5418a6lN0k5j9K3p4J05l6Ppm6jO1m4K7k4L8j5l5L2j3K8K0n3m3O6j0Mpj8n6P0K9
$$ -16 -19 31 6 -13 10 -64 41 5 12 5 -41 -42 19 -25 2 -22 16 1 -34 -2 -15 13 33 -20 -63 3 -7 -3 -10 -28 -84 -14 15
5451A5qJ4J0m5j6L6k1n6J21n1k2K3n4P7rm2k0N0l0P8j0l6l5K0K8j2j5L4j9l4K4
$$ 15 7 21 31 -14 -30 6 -15 -71 50 -1 -23 0 -54 23 14 -28 -48 2 -28 50 40 4 -31 -11 17 5 -10 24 5 -29 -5
5482eM4k2k6j0J8N3j02P0rJ5l8K5j5m0P0o0K3J6n2M9n3J3qJ9L6k8L8jj1K5rnJ3
$$ -5 39 17 -9 -19 -1 52 -50 20 11 26 -12 13 -2 -42 28 -32 -9 7 -45 4 -49 -36 -44 -25 11 -17 21 20 9 34 25 20 33
5515C3l0k1NJ2n4Q3n3l7Q0ln8M9N1j33O4M4n4K4kl3K7m0L7R8q3m9M3L5k6J2l1
$$ 33 3 -18 -13 -1 -55 28 -25 -62 18 15 -43 6 57 -76 -12 32 -22 2 0 -33 -6 -46 -9 89 6 -43 0 35 9 21 -10
5546a0j6LL1j5pL7m8K6O9l7k9l3rM6mj2L6m7J8L2k8Jl5J2N5n6L9k0j4LK1m1JK2
$$ -10 -26 -23 8 -7 -14 23 -25 1 70 33 4 -29 -38 8 4 -8 28 -19 -1 31 3 4 -31 -19 36 -20 19 -1 -15 -12 9 -32 -31 -9
5580iJ6k9LoJ6l9M7k9L6k1J9L8n9NKk0M5K1l1ll2RL1M4p6J6oJ0PJ8N3j04L0J1
$$ -9 7 -22 -19 -25 -9 -48 -1 -30 6 -15 4 42 -17 -12 -10 -30 15 36 5 2 -30 -21 10 54 -22 -6 -12 -2 5 23 76 -28 2 13
5614A3n9P1lm1o0R0m8k0Q1m5rK0j6M4k4n2Q0J1m8L7j6j1k0k2K2OL4%k7QK2l3J9
$$ 13 -46 25 22 -19 -79 11 -37 -57 24 -21 -30 -10 -26 18 -6 -58 22 33 -15 22 6 -5 -25 -47 -25 -19 15 15 -12 -4 18 -15 4
5647Dl3J1K5J3o4L6K0j3J1j4qK8n8K6Mk7L2j8O7Oo0nN3o5J3m6O2%n0M5l7Q0mm7
$$ 4 -29 -18 7 20 -44 -8 12 -1 10 -4 -12 16 -42 -16 -12 -39 -7 -25 42 48 -12 -17 36 -29 -16 -62 0 0 -50 -5 -42 38 34 -13
5681a3L8l4j8N5Rj7j1Ok0qn6N6L2Qql4P5q1l2P1j6l5P5m8M1p4K7j1K4K7J8k8k0
$$ -13 25 -9 -27 28 37 20 9 15 -5 -13 -69 -13 19 27 19 -15 60 -21 -53 18 2 -33 42 -6 35 -39 -12 -23 1 28 46 18 -2
5714bj8K0j7ML9l4k1NL6L9l5j2q7P9K4J8q0mJ8j2N5m0j0j9P5L4j01L9K3m0m5P0
$$ -2 -20 0 -17 -13 26 -8 -29 -24 12 51 16 4 -83 -4 20 38 -42 -46 -28 -40 15 -25 -35 -54 21 55 -46 -7 16 -24 -69 1
5746Ak9j0K4k1M3k3OoJ2lK1m9J5O0o7N2J8j3K7m9M5o4J5j7L4Ql7J4Qm0L1lj3K5
$$ 1 -28 -38 -14 -35 8 -15 -9 -15 -3 -6 15 -34 -19 41 -26 26 44 31 58 9 54 -10 5 -12 22 30 -7 7 15 -25 6 3 -10 15
5780A5l5O0k0p2N0J0k0j6P9l6l5L3m3M0j0J5qj3N4q2K6m2rR5p4O3n6M3l1M0j6
$$ 15 -20 40 20 -52 -2 8 -12 -28 51 15 -20 13 -30 10 0 15 7 -6 48 -34 -8 -50 -59 36 -38 25 -31 12 -19 21 5
5811Ej4jJ0J2ROK2J1k4k3l2P7j0p7O4J9p1K9lok2j9O9l4n2M4J9J1rj3Mrj4L2l6
$$ 5 -9 -10 0 12 21 27 49 60 36 13 -19 58 48 -29 35 54 -17 12 9 3 -19 -38 31 -3 -55 -11 8 19 10 -3 1 -8 -22 10 -26
5846b6N2n4OM8l5Mj0NM8m2J0L6k0J1j5kjJ7l2q7J13km7k7J5J9N8k9l4L2nL7j1
$$ -26 26 -28 -22 26 -9 -5 -15 -10 38 -4 6 42 22 33 18 16 15 32 0 -87 26 24 -23 -50 -35 -16 42 13 -21 11 6 43 32
5879C2Mrl5J4j0J7j7oL8%l4L5n3J7k3P8m5NmK0J5l7M1m6J0Ol2%L0l8L3J2q5O2
$$ 32 36 27 -8 6 -4 13 -4 -10 28 28 -6 29 -24 -7 -30 48 3 8 4 24 39 2 43 -3 7 13 -19 -19 11 -27 6 18 -67 -5
5913eo6J5N3k3K9j6RN6m1k4MM6q0N6K6p1K9J5pOn0KN4j5Ol4PK8Lk8k6L4K3k4L0
$$ -5 -71 -56 -3 -26 3 -13 -4 52 11 -13 -9 37 -43 13 39 -32 -3 12 5 11 -39 -37 17 2 8 -26 -19 9 12 -16 -42 -8 15 -9 21
5948B1l5M3k6k6M4m9n0L9K6MJ8J9k6L7m6L2J3m2oJ4K9n9M3K0l2N8l6o3L3J8k6
$$ 21 -14 29 3 -23 21 -28 -78 -39 -13 -9 9 28 2 39 -7 25 38 -4 -10 4 33 -26 17 37 5 63 27 -36 -3 15 -11
5979a1K4Qk6kk7%O7LK6j3pn5L8o0kO2pJ3l4n8K2P8m2orJ2M5%p0N4k9k4K0J9N3
$$ -11 13 21 -5 -7 -34 -34 33 36 62 49 42 -13 25 -35 -37 25 18 31 -3 -61 -39 39 -3 -9 -18 -6 39 39 -31 23 -6 -30 -10 9 62
6014F2o4pnM9l1M9k7o6J3NO5m5K3J3m5j4J7L1jpm2OO2l8K2qj2M8r9M2M3k6m8K9
$$ 62 -2 -9 -14 35 4 53 26 -40 -27 -22 43 -2 21 34 -11 -25 -8 23 22 15 -27 -21 41 3 25 17 5 53 -46 -4 39 13 -35 -6
6048fM3n2oRL0j0LJ4j6pm9lL0M5k0l5OJ5j1Mkj8N3l9P6m2n3K3QrJ3nJ3Nk8j9P6
$$ -6 37 -15 -21 -12 18 8 11 25 9 2 -47 -50 -20 25 5 -30 -24 -9 -20 -16 -18 -36 17 -22 54 12 -41 -18 -10 -19 -6 -11 2 7 -21 -40 36
6085C6q6N0J3j1l2L9pl7K0N7l1%oo1O5J0l0P1r3K7J7j0N9q6RK8n0N3j6j8OQPL7
$$ 36 -50 0 13 2 -30 9 2 -35 -15 42 11 11 5 -56 9 19 -11 60 -33 -6 11 1 60 -26 -17 11 -39 14 -2 -20 -14 -6 1 38
6119C8p7J6Rj8MOK0j3M3j05N8k7L6k2R7o5qK7n1K0OMJJ1k1J6K2j14Q0M1o3L7Q
$$ 38 -39 -23 -14 -32 -28 -22 -2 -15 28 -77 -19 -46 -10 -32 65 0 -8 19 -32 -12 -6 -2 -1 10 -11 5 27 -87 -7 34 -29 8 16
6152A6k1o2P5Jj1oKrrJ5J7k5J3j4jM0k9M6n1k5O9p1N7k5PM0o7P6m8j0M0m1j2k7
$$ 16 -5 -67 8 9 -2 -8 -6 -15 -24 -9 8 -17 -4 -18 -19 21 -8 38 -13 -38 31 -40 17 -8 -1 39 -28 48 0 -10 30 -11 -23 -50
6186e0K2K5J7m9Q8j8j0Ko2M8j2n1L6mj3KK3L4m9J2n6N7m5K4J5K6L4n9Lk1L9l3
$$ -50 -28 -3 14 -35 53 35 25 27 -35 13 1 -50 -14 -18 -31 -29 -6 28 -21 -9 -65 -8 -53 -29 -14 12 46 -13 -10 -31 8 -25
6218b5QmK8o1N5ql8L0J8L5m1Rj4J2N1j2m1Qk7L6l6N0l4J8k6L1j1jk6%K1k1M0K
$$ -25 -17 -21 7 -54 1 -7 -45 -15 3 38 -3 6 -8 4 55 43 2 10 -17 19 -17 33 -1 17 -9 22 11 10 -16 -16 5 -16 24 26
6252B6j1J8m4oM3k9L0j8QL0p4K6lnRJ5O0p0j7K2o3J32m4j9m4J9L3m3n6Q1O3n9
$$ 26 15 33 -11 -17 26 -3 27 9 17 47 -27 -1 -4 -9 0 15 75 5 -12 10 -53 79 35 16 -28 -9 24 -19 -75 6 69 10
6284A0Mm0L4Pj7J0l4j0R1j12KN9j1K6n7K0j9M2N8p4K3J7l2j4ol4K3P0l2K9k8M1
$$ 10 14 -26 8 15 -2 8 -26 -36 55 -57 -55 4 -7 19 -38 -18 -37 5 63 -11 12 29 -3 -17 -23 -57 -34 36 4 33 5 46
6316D6n5o1R9j7k6k0O0l8M0m4M8Jn7K8KK1m7K3L%l1L4jn6Q2K2n9%l3L4k3M8j6
$$ 46 -9 -70 29 12 -14 -34 26 -12 28 -16 32 33 -24 4 6 27 -20 3 6 6 -25 9 8 -48 34 56 -3 -3 -36 -2 -25 23 7
6349Gm6K9N8l7j8k3O8rk1j1R5q3Qk0J8l5k1L7o1M6PK0J4rRl6mN3Ql7k7k0L4j1
$$ 7 -39 -10 48 11 -7 -30 38 29 8 -3 92 9 17 -3 15 -20 -41 -4 -65 -19 -12 8 22 13 22 -14 -18 35 43 6 -21 -41 -7 -18
6383a8K6m4O0Nm3J5n3R7K6k7o4QK9l4rN8j1l5N0jll8l2K5kJ0o0O6J7m7M4k0j3
$$ -18 8 -36 24 29 -14 1 -52 45 71 44 -20 -12 17 -17 -26 32 21 -14 36 35 32 -6 -38 -13 -15 -5 -65 1 18 -29 15 -5 -18
6416a8k2P6k0J6l0q1L7P3m2K5n0L2R2m1p0k2Q1m7J8l5R3p3k8rM8ro4O0k0NN2J7
$$ -18 -40 36 16 32 2 -79 -42 31 -11 14 -36 -4 88 47 -23 -45 36 -11 7 -28 65 -8 -36 -45 3 -6 -70 -10 -30 -25 27 44
6448D4n2n1O2L4m5N0p0L0j0OJ4j2MN3j03L1lk2j2K7L5%m4O4L2p0J1O6o7L7L6j13
$$ 44 -8 -59 3 37 -8 42 -28 2 -8 -2 12 0 4 57 -46 -15 -18 -40 -52 -25 10 10 -34 30 62 -8 3 69 2 39 75 -38
6480c8M3K5n0J5oP2l5Lr2M5K2l0J2L6n2mPJ0k3P2m8mM7l1k8N6k2kK0k2Ol7M0K4
$$ -38 5 30 -20 -5 -11 61 26 29 -63 -18 4 -26 -14 22 -30 -34 -27 -17 -40 32 -16 -20 27 -4 -32 24 2 0 20 -2 4 -33 7 31
6514C1k6m1K5J0M7k6L7J7r7L1l4lN0j2P4j13O8j4Ql6LJ2K6j6k9m5M9Qp8N3J5j1
$$ 31 5 -36 -11 -1 46 20 57 74 -23 8 -26 -29 21 9 83 -30 38 24 32 -4 -1 11 37 21 -8 -53 -4 4 -74 -21 -6 -17
6546a7J8j5mM0l9K3j8pN8l2K3l5j8M7l3K6Kqom4Q7j0j0k3k0M5m1MqK4K7jn9ol
$$ -17 1 -14 -18 22 -17 6 -12 -19 39 7 30 -5 -23 24 -9 17 19 11 5 -39 48 38 28 5 -15 30 -11 -7 -15 9 36 35 -24 -30 -33
6581c3M5L4K3l3o8RL8Rl0NJ6o7M9Kn1P4j6J6k8kM6mo1oJ8L5j5j9N3Rm8K0l1l3
$$ -33 12 46 69 36 -32 -23 15 24 -6 -1 15 -52 -3 -1 -52 22 6 22 -6 -8 38 34 -27 -33 -15 20 5 -14 39 48 0 20 -11 -44
6615d4L3M6j2o9P7qj9p2M0M2j9K0m7P9m2K0j7RK1K5k4m0J4j0MkN3p6K3jL1n0J
$$ -44 -11 35 23 -46 31 23 4 -68 -28 14 -5 15 -32 47 5 25 8 17 38 63 39 -1 13 3 7 5 58 -18 5 4 35 -15 -14
6648a4N2n8J7J7K0r2N8K8m3j3QL5j7m9L3L9m6P4j9o2L4J9m3Mj4O6%j1m2J3L7n5
$$ -14 38 -20 -3 14 34 -58 0 28 -15 -28 -20 15 -2 -51 -18 21 -25 49 30 -32 2 21 -22 -18 -32 34 34 23 -19 -6 31 -24
6680b4P5l4j6J2n1M1J8l3k1K5L3Ok3rk0k2O5l5m2JQ0m0n0O1Om6N0k9J9no4J29
$$ -24 51 17 1 13 -38 3 21 -12 -33 -8 25 31 8 -1 -21 -43 22 -13 -55 -54 26 -14 -64 -3 3 -43 7 -22 -3 -8 -72 57
6712E7Pr1M1m4J8PO8l3k8j2J0NRK5l5j1j5oJ3N2M4p2N8j06M4J4L5l0l4J2l1J1
$$ 57 64 -27 14 -30 -12 -5 63 30 2 -10 0 5 14 39 4 -7 -22 -28 -15 37 81 9 67 -39 5 19 54 24 -10 2 -29 -18
6744a8P9m3k1m5L9m4K1k2PM3j7L2l6M3j4L7l8k4j1N7p3R8k7k0nk4J0K2k7M5j8
$$ -18 61 18 -3 -48 -9 -53 -32 -54 -47 -4 -21 11 -25 18 4 41 3 -21 -32 25 -48 50 23 3 -2 -26 -16 6 -21 24 6
6775Fl9M2j6kQM3n4K4lj0N5q5RRL1l6J4K1k1k0r%J09j01K8k1l5O7N4p1J4J0k1
$$ 6 -33 9 -7 -9 -1 42 -12 12 9 -1 54 -31 -22 -13 18 -18 -4 17 -4 -24 -33 -33 76 -25 3 -18 -53 14 68 -3 11 21 0
6808@K2m3M4m4kN2J0m9M4m5Nn5Q2o6LK7j5NK7J3lOj2p3O9O0j04M5m9K5JmK8j4
$$ 0 22 -21 23 -21 -23 29 39 -10 34 -11 -6 -61 21 -45 -42 -15 -30 -25 2 15 12 18 6 -67 2 62 -42 3 -46 -21 -20 -24 4 -10
6842a0nJ1Ok4K4J2n9M2LL9o2l0M8l1M9p0L1N0l9%kM8l0j0M3j5Mm9J8jOj9K3kk8
$$ -10 -15 -4 2 -22 2 14 -45 -3 0 39 -23 -53 -5 -36 13 -57 -26 24 -15 -15 -17 31 1 -9 34 19 23 -26 -8 -9 -3 -22 1 -1 -29
6877b9L1k0J7l1J7RK4q0Q2nl6qrK9k7K8n4N5QLk5jN3Km2nL0o4L7lP0m3J3k4j1
$$ -29 2 -18 -1 -32 -15 -6 18 -62 20 15 -21 -29 -38 -9 -36 -8 -62 -7 1 4 -21 -22 31 33 -9 -14 16 -48 -11 -14 56 13 26 2 -9
6912iMll1J0J4K1M2m2j1J7k2j5j0N6M2m6Kl2J6M0k6qJ9p2L2K2K7l9J2K%l5k6M6
$$ -9 -5 -8 -39 -29 -15 6 48 6 -5 12 -10 -25 -35 21 63 17 19 -13 3 43 17 9 28 -44 -12 10 37 -2 10 12 12 -23 -49 -3
6946cm5Q4l9k7Pl1K2L5k6%N2n5J4j8J6J5MPJj4j0M2l0L6k7kl%JNm3K5qO2m9J1
$$ -3 -48 36 -3 -30 -23 -54 -32 3 -23 -23 29 -26 -12 -30 -14 1 5 12 13 -1 -11 31 1 37 10 8 5 5 6 11 -32 -7 -15 47 -2 9
6982Ik7JJk1Q5oo4L7j6j7K7Kk5k2K7J4k9N4m4M4K3m5J0l6mQ3j04O3m4j5L7j8M4
$$ 9 -18 -17 -16 -37 48 42 -22 15 -1 -18 9 11 -14 -36 -9 5 -24 30 -14 30 53 8 18 -18 -22 61 -43 20 -24 -39 -2 -20 24
7015B4n0Jj0N9o4J4L3m0NN2Kl2Kk5L8%K4rqj0JPn6Q2r3LM4k4J8K8%r8M0L8Nk7
$$ 24 -26 -25 -35 24 -40 -26 7 -33 -28 24 26 -6 -4 -29 9 9 33 24 16 6 7 14 -42 40 -53 -50 -6 -30 -12 16 16 -82 -42 -4 1 -26
7051b6oO9m9k8K9M3l2j6M7l1m2N7n4M6k5l9O9Jm0M5k4%J9j0j4k5P2n8K7J4k5m1
$$ -26 -32 37 -12 -40 -11 32 0 -16 31 0 -42 15 -39 7 -18 -57 12 13 -27 18 -6 -6 13 3 -11 -36 36 -22 5 19 -6 -47
7083d7N4l8K5Qo6R9n5jQK8k8L0j4m9K6J8l7O6p4J3L7N4M1q6j0j1k9L6j7M7J6k8
$$ -47 7 -31 -6 2 -64 35 -20 -21 -13 15 -13 17 3 -46 -20 -2 -39 27 -47 -34 3 57 98 12 2 -9 -38 -2 -19 28 44 16
7115A6n1%J3PL8l6l5m3M8P5l5%j1M0k3k2m1N4J6%k6k3qP4l7j1J3J2L6kk6K8j7
$$ 16 -35 -35 -22 -15 23 -13 -48 -91 -43 32 -3 -3 -14 26 3 -19 -60 -6 10 10 -16 -39 -47 27 -10 -21 -8 4 40 38 12 40 23
7148B3n1N5l9OK5Pj0om7N2l7nJ3M3l5N7o2K3L4o7L4l6J5J7m1N5j2o0N7LqJ8l6
$$ 23 -28 27 -12 -6 19 26 16 10 -37 15 -22 -27 -14 29 -6 51 -11 12 46 -21 13 -23 -8 9 -32 23 11 -49 8 11 3 21 -15
7181a5rk8K7P1o9L7m0j9N5k5lNLk8L5J4k4j0j8K7M6n3j0J7kM4m1O1ql6j9Pml2
$$ -15 -24 -52 -25 46 -23 14 -26 -45 10 -15 -18 -13 -10 -38 -3 11 -13 -23 -41 -14 32 -21 -31 -14 -16 28 -13 48 40 4 -15 -8 -12 -44
7215d4pK4j6K5K4j8l3M8k7J4M5Lk5k4rNK3K3K9j06M6k9L4kN8m1j9QK3j7m4Q2p8
$$ -44 -51 -27 -43 -18 6 -12 -45 3 -24 -10 35 38 13 -11 -20 -15 8 31 60 -46 0 -29 5 3 61 20 1 9 32 15 -29 53 -25
7248b5O0p5M2L4l3l2K4o3Q8pj4nj8L8l0j8M3KL8k3n6P7k6l0j6N3p0L4l5K2L3l0
$$ -25 35 -40 2 36 3 -29 -5 -68 20 13 -1 -6 -24 14 -16 -34 9 11 49 26 -30 47 21 -9 -25 28 -42 -8 -43 -21 12 -18
7280a8L2o1O3j3j9Qj9J9m1P2j6J5l5J8J5J7m4k6N9l3KK0pk0j0oN6k4jk2K5%M6
$$ -18 14 -47 16 3 -16 -8 -27 -8 -49 23 7 22 -13 5 20 37 -7 -33 26 -7 -5 15 8 -12 -22 -28 28 4 3 -19 6 6 52
7313E2n4mj6LM9Kq2M3K0%J9l4m5L5nl3J7P7l7j8j5P0n7MJJ9j3J2j8k2M8j3j1m1
$$ 52 -2 -6 -22 -19 30 32 -50 -7 13 13 32 -2 -47 -12 -17 -50 -33 44 7 -11 -26 44 -13 -9 -8 11 -2 10 -8 -30 18 5 -6 -47
7347d7N3K1l8RL1n3K1Pj2j2O5n8L0k3Mj6RRJ6j0ol2K6L0j5lL6o2LNk2M3JK0j0
$$ -47 6 27 -11 -2 29 -24 -3 4 -8 -20 45 -13 17 -6 -2 -18 -9 0 16 6 0 -32 -6 24 9 6 42 -20 -17 -12 -34 9 10 30 20
7382B0l4KQj0k6K7k9L0O5n1m4L0OJ0m8O2l3L1l4k8M9n0KJ5%N1p7N5J3J5j1k6m3
$$ 20 -14 -12 -4 -14 -40 -13 -42 -12 53 2 -42 -12 -6 4 -44 18 -15 16 -18 -46 3 -47 -45 -30 -30 21 -56 -1 12 27 16 -10 -53
7415e3K4K1qj0M1QNo0lK5ppM5j8%m5J8N3j3N0n3kl5N0k1L9r3L9j4k9O2m0O1l2
$$ -53 -29 -8 -16 -26 15 23 28 -32 -35 -10 -17 -24 21 3 3 -42 -24 29 16 66 13 11 -24 26 5 44 -49 -10 -24 -53 9 -31 30 -2
7449bl4K5J7oJ3l8P2l2rj4Mj2N3m1K9m3J4J4l6J1O1l8j1j9oK3l8Q0l3p4O2k1P0
$$ -2 -36 -11 6 0 13 -25 47 15 6 -8 -4 -16 37 -4 25 -18 -4 10 -26 -15 46 8 -3 -22 -28 -5 -43 37 4 -70 -8 -29 41
7482D1m2k5j8O1m3k0N9Pm5M8p7M0K9m0JJ5N1m1rl7J6Rm9J13r9N2j0jM4l2L1Nl
$$ 41 -1 -26 -44 17 -26 -46 13 20 -25 23 -54 -14 15 -25 -24 -9 42 1 -8 -45 -29 -20 -69 44 -55 -3 -13 -14 30 -2 29 34 31
7515C1p7J21q0J2J8K3l1l2M5j6k9L0l4J4K2pn0K5k5M9l7M2mlK8q7Q9k4o4Q1m4
$$ 31 -46 75 -5 7 25 48 17 -15 30 14 -15 15 -19 -5 17 10 -40 -15 -40 9 -28 14 10 7 35 -52 37 13 -51 30 -14
7546a4Jk8N0j2M8r9K3J7k5J04o6N%L8m2K9Ql5Qj7J3Jl9N7k7J6Nrrk6O7m0m3M7
$$ -14 -13 -41 9 -3 45 -54 -31 -14 -39 65 -1 4 4 42 0 29 37 2 10 -7 6 7 -32 25 -2 14 19 10 1 -25 42 2 -41 6
7580FM1n7m3M8J3k0L3o3K3L9m1L4oJ5n1K3Jl6K2NO2l9l4j9P1n8K3JK2l4k3jK1
$$ 6 47 -10 -53 -5 8 -12 21 -42 -19 20 -21 13 7 22 -29 -6 -5 -41 -19 -14 48 9 -25 -44 27 -31 -8 -7 15 -19 -42 -43 -22
7613b2J1L3l5k2O2K1l8PN5j17J3j7L8k9M9JK0%l3pNn1M9K3j5l8RL7k8OLO5n9r
$$ -22 -11 22 -13 -35 27 48 10 17 72 -45 -32 -49 -11 -40 9 10 30 30 -3 -10 -5 -56 -7 16 1 -37 -28 9 -19 -13 -10 55 -4 -13
7647a3J5Roj2k9J6M9j2k1JQm5K8N0rl0k0N1l8J1m0M6J4Jln4N4q1N8J1kK7p9R0
$$ -13 2 11 5 -7 -36 -20 29 17 -4 -3 5 -40 -12 38 29 -1 -21 30 -8 3 -37 9 23 24 21 -33 21 -60 -2 9 7 34 -45 45
7681D5l5K9m0R%k5j4L7Pk6Kk7O6o9O8jl4L0j8O1o7M3n8K3J4p1L2j9M2K9k1L7q2
$$ 45 10 39 -1 8 8 -17 -31 6 13 -13 -11 -38 28 -41 27 26 -8 22 4 65 -2 41 -17 6 20 -51 -19 -38 4 33 12 49 -33
7714c3N4n1J3M3J0m1K0l7L9Kjl8l7M6L4j9n5N9K7l4N2o8M4QJ3j06Q0oj1Pm2M2
$$ -33 21 -30 -17 26 36 -5 15 -22 17 19 18 -20 -57 -11 23 4 -51 8 35 1 53 -15 29 37 50 -56 24 18 7 14 -28 14
7746A4nj3J8J3%j5j1J3m5J0K0J7m8KK2J5Qj7j3oR5r7RqjK2pJ1l6L9l1K2J9Prj
$$ 14 9 -4 14 27 27 12 1 14 -31 -21 -1 16 -32 -30 -8 7 15 -2 -15 -21 74 -23 -14 -22 -23 -1 -8 3 -33 6 -25 -3 16 23 14 13
7782A3n3J8OJ5j1QOj6Q6k7j2n0npK6l6Q6q9Q5r4J11p9J6lj3L8Rl5K6l8J4M0l4
$$ 13 -40 -22 -16 -1 -12 -4 2 -14 72 45 33 -17 -22 -29 -3 -39 47 -42 43 -51 60 -19 -3 -6 -19 19 28 -7 19 -19 -5 35 1
7815Aj4m4N3J6K7qj4L4q1N0k4L6j4m4J4L9K5p3MO6qo9M0M7n5J0l1J4j8J0j2L7
$$ 1 -13 -57 -4 12 39 31 17 51 -30 20 -4 32 18 -26 -12 27 52 -21 -17 49 41 -28 12 59 4 14 -17 -3 -21 -11 -23 14
7847A4K3o3K0pL0kj2m3L8K4ol8K7l2M0L6n7J5Km7Q2J7n8K4K2j1k8j3ONm6O7n0
$$ 14 37 -26 -6 -13 17 15 3 -40 -2 22 16 -22 5 -27 13 49 -8 7 9 -38 44 61 3 27 49 38 10 -3 3 8 -38 29 -21
7880b1J8p1R2K6m3Qk8lP4l3On1K1J1K1j3j3j4L4o7L9j7J7K7k3J1n1M5K2j4n6J27
$$ -21 -3 -74 18 44 1 9 -19 -22 52 19 25 -26 -5 6 27 14 1 -13 21 -46 -7 -24 -7 20 -3 8 -43 2 24 10 -46 81
7912H1p2jNJ5Qk0p4Q1k6qjj4L0k7N4m7N9r2N9M4j25P2j1kJ0j6J3qk3k2N9J5o8
$$ 81 9 8 13 28 36 16 -58 23 -3 -11 -12 -26 4 -23 31 -16 43 -49 10 54 -71 1 -10 -12 -2 -18 -5 -13 -36 -58 1 16 -52
7945e2M7O9o3L3j3k1l0M4l5LL5K1k4p7J00n0J4M8o3LJPk2J7L1J8k8kQj6m3M9J8
$$ -52 -5 64 1 34 21 0 -30 14 -21 -18 17 38 14 -63 37 -13 1 49 -14 -11 -10 -3 -25 -8 23 41 13 11 19 3 -40 9 27
7978B7n3L4J5k3m0L0n5k2J02m9MK7k5K9j1JQO6k8l5j0LN8p1M9n6O2o5j4K6L2J8
$$ 27 -26 8 23 0 -40 -10 -65 -87 15 -34 -30 -3 -28 1 -10 -9 -1 65 37 2 -8 -5 53 -18 31 -25 37 -28 -42 -16 16 34
8010C4l6j3NJ0k5J8J6k4k1L1J8pk8M3K2p7RJ2mJ4K1KJ5k5rL0q3N0k7K6J2k2J0
$$ 34 -2 -15 -10 0 -25 -7 9 -15 -36 -5 13 6 -22 21 43 -34 -25 -13 -17 -3 18 20 35 10 1 31 -52 -2 -29 -3 9 -13 -3
8043ck7J9K8m8JO9o3M6j15J09k2oK7k8NRJ3j2j2mM6p0M8j6J7k9N3Lj21O0K3LM8
$$ -3 -30 -11 17 -31 -30 39 -24 22 -93 16 -6 -12 15 -13 -8 1 14 2 -10 -14 32 -38 10 -6 11 -18 35 38 -83 -23 0 3 51
8076E1n5J0j5K4l8%M1l3M8k9j3J0k7M4k8MJ6%j8j4k4L8k2J6O2m6P%K0k2Mm1J8
$$ 51 -4 6 -9 15 -23 -23 18 -15 33 4 -9 1 -26 18 -10 -6 10 10 -8 -22 -46 -8 -30 -14 48 2 9 9 29 7 11 -30 -12
8109a2K1p1Q8qMK6p2LPM2l4J1mK2m5K7MMj8j5J6M0j6j9n3P8n1J7L6o2jmJ1JM0
$$ -12 9 -62 26 18 22 48 -24 -21 -14 28 -6 5 1 23 -22 5 9 13 -5 -20 -4 36 20 1 -52 26 -25 -8 28 -34 -35 -39 -28 -27 13
8144A3j1K6m3J2K2j03O1M5l6K3l5L6l9MO2p2N4n8M5JNn6JN3K6j5J6l8Qk4L9n2
$$ 13 2 28 -15 -3 19 -84 -23 22 -14 9 -26 10 -29 -25 37 -35 19 -39 6 7 12 -44 -43 10 36 21 37 -1 7 -17 22 -30
8176c0M4PK3nn8PL1j7k6RK0QL2m6p
$$ -30 14 21 44 39 -19 -12 19 2 -24 -15 5 13 45 -1 -8
8191h
$$ Imaginary data points
##PAGE= N=2
##DATA TABLE= (X++(I..I)), XYDATA
0@%%%%%%%%%%%%%%%%%%%%%%%%%kLkNj0J1j3J7k0K3k4K6l2L9m5M9n4O3p1P8q7R9
$$ 0 0 0 0 0 0 0 0 0 0 0 0 0 0 0 0 0 0 0 0 0 0 0 0 0 0 -2 1 -1 4 -6 5 -8 9 -11 12 -12 14 -18 21 -24 25 -29 34 -37 41 -46 53
47E3j10J19j32J47j62J77j92K10k30K49k68K87l05L21l27L18k82J88L4n58J958
$$ 53 -57 62 -70 77 -85 92 -100 110 -120 129 -139 148 -157 164 -163 155 -127 61 95 -463 1495
68A495o897N0009L05481k32421m23357J41465L68649k3165k75366o0481J32987
$$ 1495 -5402 44607 350088 117667 -305690 -164225 204424 181259 -94107 -154588 -21601
79b1601J12818K3002j13295j79317P1726L05152Q968l85877j03480M07402J93448
$$ -21601 91217 114219 924 -178393 -106667 198485 207453 -178424 -281904 125498 318946
90C18946l74339k53933K96594K74597j93941k47838Q3664J77520J3073p1742q1961
$$ 318946 -55393 -309326 -12732 261865 67924 -179914 -96250 81270 94343 22601 -59360
101e9360n2981J10928J76102j00675k77697N8538L42473K17l63124o0001L39936
$$ -59360 -112341 -1413 174689 74014 -203683 -145145 197328 197545 -165579 -225580 114356
112A14356J06026k79068j26655J93170J15349r6844p1578Q145K949O0045P8735
$$ 114356 220382 -58686 -185341 7829 123178 26334 -45244 -37099 -34150 25895 104630
123A04630r9873j58278J11267K22354r9331k61627P2510K70321m1385k48810J5382
$$ 104630 4757 -153521 -42254 180100 80769 -180858 -108348 161973 120588 -128222 -112840
134a12840K01338l184j37810P817O8897k8592n431O0134m5604r5305Q1079J27157
$$ -112840 88498 85314 -52496 -44679 24218 -4374 -9805 50329 4725 -90580 -9501 117656
146A17656j00146j48948J06090J56850j02837j48252R6593J25162r1669r1566
$$ 117656 17510 -131438 -25348 131502 28665 -119587 -22994 102168 10499 -81067
156h1067R1176N3112r4735j5537J00012j7578j04493M3539J04540o2793r8169
$$ -81067 10109 63221 -31514 -47051 52961 35383 -69110 -25571 78969 16176 -81993
167h1993P6151Q3225q6667o0839R7036L3256j09019m526J22476k0852j34556L9779
$$ -81993 -5842 77383 -9284 -70123 26913 60169 -48850 -53376 69100 48248 -86308 -46529
179d6529J42470n0097j42062N2898J31109m9949j07536M5189P2394m3189k8538
$$ -46529 95941 45844 -96218 -43320 87789 37840 -69696 -24507 47887 4698 -23840
190b3840M7599j8556o0666O2288Q0821r7019j05194J17385J27920j21532j43400
$$ -23840 23759 5203 -55463 6825 87646 -9373 -114567 2818 130738 9206 -134194
201a34194J09497J45739q5265j31167N4838R8589k5488m9899M623q464K778O9677
$$ -134194 -24697 121042 35777 -95390 -40552 58037 32549 -17350 -12727 -21191 -18413 51264
213E1264N472j24065k7560J64159N8551j83255r1101J79006J16494j52770j27136
$$ 51264 56736 -67329 -94889 69270 127821 -55434 -146535 32471 148965 -3805 -130941
224a30941J09671J17372n8708q6120R204L5613K9145K7171n0396r3211N1240J51969
$$ -130941 -21270 96102 37394 -48726 -39522 -3909 25236 52407 2011 -91200 -39960 112009
236A12009l3079j93844J693K12093L4945k03513o6803J70373Q5720j18086q5330
$$ 112009 78930 -114914 -113221 98872 133817 -69696 -136499 33874 119594 1508 -83822
247h3822N6273O3902M660k3064n4791l1393Q6834R0215r7051j43837Q5622J82357
$$ -83822 -27549 36353 41013 17949 -36842 -68235 18599 108814 11763 -132074 -46452 135905
259A35905n7837j99295K1092J90733J5095j57857m2253J05838N3295m3002m4847
$$ 135905 78068 -121227 -100135 90598 105693 -52164 -94417 11421 64716 21714 -23133
270b3133k0296J8013P4452K3292j11538p0517J27371J15236j21698j48011R8554
$$ -23133 -43429 -25416 49036 72328 -39210 -109727 17644 132880 11182 -136829 -38275
281c8275J62263o4750j54508K8448J25216J921p9109k0379K3231K3032L3362j0809
$$ -38275 123988 59238 -95270 -66822 58394 60315 -18794 -39173 -15942 7090 40452 29643
293B9643q2292j3640J16863M3903j33394p3187J31746R4657j14396j02861Q6931
$$ 29643 -52649 -66289 50574 94477 -38917 -112104 19642 114299 -97 -102958 -16027
304a6027R5627n5358p2809K6243L8290m462L129o834m4882P358Q0963R30j06539
$$ -16027 79600 24242 -48567 -22324 15966 11504 14633 7799 -37083 -29725 51238 52168 -54371
317e4371j4629J18744K8649j17581l8928J04531M1378q3707l4558N9080J8725
$$ -54371 -69000 49744 78393 -39188 -78116 26415 67793 -15914 -50472 8608 27333
328B7333l5245L697J5626k9216j949N3837n319p3348P665Q5847p160q9471O730
$$ 27333 -7912 -4215 11411 -17805 -19754 34083 28764 -44584 -36919 48928 41768 -47703 -40973
341d0973Q5058q142p4445J3294N9789k1866m4013L2812K8923m4425j6209N4179
$$ -40973 44085 35943 -38502 -25208 34581 12715 -31298 1514 30437 -13988 -30197 23982
353B3982N550o0335K894O1609j0839n7974J8929N0382k8237m0236L8946K9674
$$ 23982 29532 -30803 -27909 33700 22861 -35113 -16184 34198 5961 -34275 4671 34345
365C4345m9971k0183O0482J3106o8172q222P1420N357o8744k741N9942j169m5828
$$ 34345 -15626 -35809 24673 37779 -30393 -38615 32805 38162 -30582 -33323 26619 25450 -20378
378b0378P729K8247j8141j0087L2046o198m8436J7725O4552k3519p7871K3194
$$ -20378 -12649 15598 -2543 -12630 19416 13218 -35218 -17493 47059 23540 -54331 -31137
390c1137Q5194j8030q4437J0543P4597l386n6165r2L1582j754m026J0210k2188
$$ -31137 54057 36027 -48410 -37867 36730 33344 -22821 -22913 8669 6915 2889 13099 -9089
403i089k4278M3516M2164n6799o0423O0610P5165n5494q2953M3032Q1030k6922
$$ -9089 -33367 10149 52313 -4486 -64909 -4299 70866 15372 -67581 -24549 56481 29559
415B9559o8736J0675M6545J687j7670p256j4329M761M4498N718o8517k1669Q2810
$$ 29559 -39177 -28502 18043 19730 2060 -5196 -19525 -14764 29734 35452 -33065 -54734 28076
428B8076M0022q5534n5955P7171O5868n9648o6244L7060N5824j3706l5238n862
$$ 28076 68098 -17436 -73391 3780 69648 10000 -56244 -19184 36640 22934 -12304 -18166
440a8166P240J7964K4018k1147n3789J5103P7127k359r0771j4037R2627K9423
$$ -18166 -10926 7038 31056 9909 -43880 -28777 48350 45991 -44780 -58817 33810 63233
452F3233q3109m0015O4335M2610l9918l5570J4283J9828Q405K809k4541k8253
$$ 63233 -19876 -59891 4444 47054 7136 -28434 -14151 5677 14082 16891 -7650 -35903
464c5903L2389N2790l1371p2058K3260Q2942j0729q3679k790P4301J3458n6724
$$ -35903 -3514 49276 17905 -54153 -30893 52049 41320 -42359 -45149 29152 42610 -14114
476a4114j8617L3509J6519r014p323j3583p518L0522K5413m0242m2766M2192N6383
$$ -14114 -32731 778 17297 8283 960 -12623 -20141 10381 35794 -4448 -47214 -5022 51361
489E1361l7211o3470K7791O2909j6618n4335O935L9457p82k0389l50K11l345J7997
$$ 51361 14150 -49320 -21529 41380 24762 -29573 -22638 16819 16037 -4352 -4702 -4491 -7836 10161
503A0161J1009l2224k0643M0722K9617m3460l6133M0880L8210l4871l5419K7219
$$ 10161 21170 -11054 -31697 9025 38642 -4818 -40951 -71 38139 3268 -32151 -4932
515d932K7695j9863j6273J4382K852j1379J0736J1134k2582j2468L1469J4635
$$ -4932 22763 2900 -13373 1009 3861 -7518 3218 14352 -8230 -20698 10771 25406
527B5406l6252j6230L7486J6080l5403j3621L1297Q645k6321j939K1574o059j7888
$$ 25406 -10846 -27076 10410 26490 -8913 -22534 8763 17408 -8913 -10852 10722 4663 -13225
540a3225J3776J5177k0532j3312K5073J1480k7197r121K7008N549k4977m49K2194
$$ -13225 551 15728 -4804 -18116 6957 18437 -8760 -17881 9127 14676 -10301 -10750 11444
553A1444n781j9059J2651J6807j9054j5359K4455J4464k7481j3774K8064J2383
$$ 11444 5663 -13396 -745 16062 -2992 -18351 6104 20568 -6913 -20687 7377 19760
565A9760k6121r676K1982N000j6643J381J1179r583o733J8111L940k6228l193
$$ 19760 -6361 -16037 5945 10945 -5698 -4317 6862 -2721 -9454 8657 12597 -13631 -16824
578a6824L2444M235l5725o321L5506Q341l1490q970K4504P674j5374l413N838
$$ -16824 15620 19855 -15870 -22191 13315 21656 -9834 -18804 5700 13374 -2000 -5413 425
591D25l402K623J2303q852k1684J1840L0014j1446l6104Q232L8311l520l6393
$$ 425 -2977 -354 11949 3097 -18587 -6747 23267 11821 -24283 -16051 22260 18740 -17653
604a7653j356L0088M638k0394n514Q853L055K939K396j2995j0123K0169J8855
$$ -17653 -19009 11079 15717 -4677 -10191 -1338 1717 4656 7052 -5943 -16066 4103 22958
617B2958k3338k6537K2488L2132j8324l3851J2092L1383n364k4646k70J4589L463
$$ 22958 -380 -26917 -4429 27703 9379 -24472 -12380 19003 13639 -11007 -11277 3312 6775
630F775k807l509r340L95J9502N186k6771j2122K9904J8636k8783k3483K4061
$$ 6775 3968 459 -8881 -8486 11016 16202 -10569 -22691 7213 25849 -2934 -26417 -2356
643b356K5165j6763k3172Q904J7493j685q624l254j761N402J2298m355k1217R12
$$ -2356 22809 6046 -17126 -8222 9271 7586 -1038 -4292 -6053 -651 11647 7292 -13925 -13013
657a3013K7136M080k9461r256K7951J2988k3390j4491J6512J2993q978q793J933
$$ -13013 14123 18203 -11258 -20514 7437 20425 -2965 -17456 -944 12049 3071 -5722 -3789
670c789K265L366N370o150j3095O666J9533n025k3614K141K5002J120k3138l668
$$ -3789 -1524 1842 7212 1062 -12033 -5367 14166 9141 -14473 -12332 12670 13790 -9348 -13016
684a3016J9059M840j3117m138O628J524o12K562m333p380P202J2112q505j5783
$$ -13016 6043 10883 -2234 -6372 256 1780 1168 3730 -603 -7983 -781 11331 2826 -12957
698a2957P913J7649o348j7649M431J5407k689j1734J886P172k136k305L618k007
$$ -12957 -5044 12605 6257 -11392 -6961 8446 5757 -5977 -4091 3081 945 -1360 2258 251
712B51n477N331P842p368r760Q217J0821p930j0687P086R290o207o872N388L762
$$ 251 -5226 105 7947 579 -9181 -964 9857 1927 -8760 -1674 7616 1409 -5463 -75 3687
727C687n218o36N548k480o254M752O930o163p508O821P390o660o477O252M828
$$ 3687 -1531 -2167 3381 901 -5353 -601 6329 166 -7342 -521 6869 209 -6268 -16 4812
742D812n589k459N297j45n224K747N587m924o048O340O581o957o760O542O310
$$ 4812 -777 -3236 2061 1916 -3308 -561 5026 102 -5946 394 6975 18 -6742 -200 6110
757F110n678n166M445L145l427o49K755k312k512M869K986o964l763Q298M694
$$ 6110 432 -4734 -289 2856 -571 -1220 1535 -777 -3289 1580 4566 -2398 -6161 2137 6831
772F831q376n379P619N590o003m914M144L322k084j049N99j831K68M678m32p204
$$ 6831 -1545 -6924 695 6285 282 -4632 -488 2834 750 -299 300 -1531 -1263 3415 2983 -4221
788d221k46Q817J337r568k591R009L491p461l897N147L486k538k136J79j7J826
$$ -4221 -4467 4350 5687 -3881 -6472 2537 6028 -1433 -5330 -183 3303 765 -1371 -1192 -1209 617
804F17K581k776n086K957P346k254q614J022Q925L49p997j701O186K349l813k266
$$ 617 3198 422 -4664 -1707 5639 3385 -5229 -4207 4718 5067 -2930 -4631 1555 3904 91 -2175
820b175J050J336J297K62l194k324M120M253m173n922L512O884k253o807Q14N962
$$ -2175 -1125 211 1508 1770 -1424 -3748 372 4625 452 -5470 -1958 4926 2673 -4134 -3320 2642
836B642N03m255j238K191J413J04q12k182j97L585J731m427l161M303M298l636
$$ 2642 3145 -1110 -2348 -157 1256 1360 548 -1634 -1831 1754 3485 -942 -4103 200 4498 862
852H62m945K409M821j236l997j5K605P37q55r92q20N82K456J82l386j119L799
$$ 862 -4083 -1674 3147 1911 -2086 -2101 504 1241 386 -606 -1426 -844 1612 1794 -1592 -2711 1088
869A088K175l537k852K890L144j852k948Q48K178%j091n67j70O40J267m16k266
$$ 1088 3263 -274 -3126 -236 2908 1056 -1892 -1044 1134 1134 43 -524 -694 -54 1213 797 -1469
886a469j90K682R16k837j572K527J952j843k001J098J771l15j070k04L23M89O66
$$ -1469 -1659 1023 1939 -898 -2470 57 2009 166 -1835 -737 1034 719 -351 -555 -232 257 923
903I23m61j393J58J973K65k131r13K071J333j727j593J131J471n99j145l8N76
$$ 923 462 -931 -773 1200 1465 -666 -1579 492 1825 98 -1495 -364 1107 508 -637 -675 -99
920i9K62J22l99p16K54J247J20j548n52J667J028j456j260J236J420p84j235M09
$$ -99 163 285 -114 -830 -576 671 791 -757 -1309 358 1386 -70 -1330 -94 1326 542 -693 -284
938b84Q74j01m32k7k07Q1O02K4j013m61J312P01j487q85J290J076j227j053R71
$$ -284 590 489 57 30 -177 -96 506 530 -483 -944 368 1069 -418 -1303 -13 1063 -164 -1217 -246
957b46R98p81o29N96L47m05J35M21n50l46Q86N07j203n99J462N66j531n75J472
$$ -246 752 -29 -658 -62 285 -120 15 436 -114 -460 426 933 -270 -869 593 1159 -372 -947 525
976E25N30j474m47J306J57j223R7J001k89r56O70O81q68m39J109K68j284JJ487
$$ 525 1055 -419 -866 440 597 -626 -529 472 183 -773 -103 578 -290 -729 380 648 -636 -635 852
995H52j35j694M79J718n83j727P01J638p55j498P92J141q43p38Q35J51r75L10
$$ 852 717 -977 -498 1220 637 -1090 -389 1249 494 -1004 -212 929 86 -652 183 334 -641 -331
1013c31J155q02j371J197J534j547j630J741J754j697j687J672J413j355r57J207
$$ -331 824 22 -1349 -152 1382 -165 -1795 -54 1700 3 -1684 -12 1401 46 -911 296
1029B96L71r19K89P61r49p70J638P72k238r53K497J083k633j224K493J121k246
$$ 296 667 -252 37 798 -151 -921 717 1489 -749 -1702 795 1878 -755 -1979 514 1635 -611
1046f11q58J655N70j270J17P78p52k87J474J24k143M6K680j9k931NK960J67k843
$$ -611 -1469 186 756 -514 -397 381 -371 -658 816 940 -1203 -1157 1523 1504 -1427 -1422 1538 1705 -1138
1065a138r2K465j45j850L18J104p59m72J254k29j728N75K229r63k632J171K744
$$ -1138 -1230 1235 1090 -760 -442 662 -97 -569 685 456 -1272 -697 1532 569 -2063 -892 1852
1082A852j107k729J189K440j139j949J308J349j401n68J487k4j657P30J783j344
$$ 1852 745 -1984 -795 1645 506 -1443 -135 1214 -187 -755 732 708 -949 -219 1564 220
1098B20j901J688J954j938j936K078J611k159j316K156Q21k120l31K044j84j948
$$ 220 -1681 7 1961 23 -1913 165 1776 -383 -1699 457 1278 -842 -1173 871 687 -1261
1114a261P38J785j165j569J681J282j989q38K235N47k546n4K630l10k685O60K608
$$ -1261 -523 1262 97 -1472 209 1491 -498 -1336 899 1446 -1100 -1154 1476 1166 -1519 -859 1749
1131A749j002k392J233J950j438j594J674Q60j770k36J952m44k047J086K206j648
$$ 1749 747 -1645 -412 1538 100 -1494 180 1040 -730 -966 986 542 -1505 -419 1787 139
1147A39k325K114K365k216k350K338K132k147j672J880J097j632l34J415o59j178
$$ 139 -2186 -72 2293 77 -2273 65 2197 50 -1622 258 1355 -277 -611 804 145 -1033
1163a033J541J040k371j223L016J255l431j362L528J424l277j386K828R92k028
$$ -1033 508 1548 -823 -2046 970 2225 -1206 -2568 960 2384 -893 -2279 549 1541 -487
1178d87m77J334k67p23J390J10k272K62L171l19l796K05M204j49m047j84L652
$$ -487 -964 370 103 -620 770 880 -1392 -1130 2041 1722 -2074 -1869 2335 2186 -1861 -2045 1607
1195A607K05k886j00J786k34p87P71k79j581J149K388j654l153J919L743j853
$$ 1607 1812 -1074 -1174 612 378 -409 362 83 -1498 -349 2039 385 -2768 -849 2894 1041
1211A041l914J624L781j209l196R21K229n69j209P45j27r32J285J256k212j834
$$ 1041 -2873 -1249 2532 1323 -1873 -952 1277 708 -501 244 117 -815 470 1726 -486 -2320
1227b320K837K299l154k711L046K821k722k680K224K141j729j224J218J75q70
$$ -2320 517 2816 -338 -3049 -3 2818 96 -2584 -360 1781 52 -1172 46 221 -649
1242f49R80P83j964q25K957R68l551j149L797J265l599j282L186J081k650o49
$$ -649 331 1114 -850 -1675 1282 2250 -1301 -2450 1347 2612 -987 -2269 917 1998 -652 -1301
1258a301J941q6j291R03O44j749k66K533m7l064J53L393j98l443K62L286l55k822
$$ -1301 640 554 -737 166 810 -939 -1205 1328 1281 -1783 -1630 1763 1565 -1878 -1616 1670 1315 -1507
1276a507O78K169q77j411J289P80j813j82K266m31k517P56K676j042k763J309
$$ -1507 -829 1340 463 -948 341 1121 -692 -874 1392 961 -1556 -800 1876 834 -1929 -620
1292f20K522j603k118J714J573j865j075K125N08k358J14K407n30k350R86K310
$$ -620 1902 299 -1819 -105 1468 -397 -1472 653 1161 -1197 -1083 1324 794 -1556 -570 1740
1308A740j425j949J726J578j988r78K148N74k479j9K598m55k755Q50K647j151
$$ 1740 315 -1634 92 1670 -318 -1296 852 1426 -1053 -1072 1526 1071 -1684 -834 1813 662
1324F62k539J375K130j520j656J639R10j717j56J859n57k045J305K268j787k421
$$ 662 -1877 -502 1628 108 -1548 91 1001 -716 -872 987 430 -1615 -310 1958 171 -2250
1340b250K101K586k259k324K108K048j920j550J710P45j437R6J260j117j203J938
$$ -2250 -149 2437 178 -2146 -38 2010 90 -1460 250 995 -442 -346 914 -203 -1406 532
1356E32J347k813j390L150J628l350j756L245J658k800j340K266P85j531O1Q24
$$ 532 1879 -934 -2324 826 2454 -896 -2652 593 2251 -549 -1889 377 1162 -369 -308 516
1372E16r77k68J923R3k895O8L616l3l944k28L876M25l542n31K878L31j992p1J000
$$ 516 -461 -729 1194 1287 -1608 -1540 2076 2043 -1901 -2129 1747 2172 -1370 -1901 977 1308 -684 -755 245
1391B45n52l4J364p63k190J315L020j538l505J431L841j116l791R11L230o36k355
$$ 245 -307 -341 1023 260 -1930 -615 2405 867 -2638 -1207 2634 1518 -2273 -1362 1868 1232 -1123
1408a123N13J356n97k45Q77r32j425J888J891k425k530K679K910k660l007K363
$$ -1123 -610 746 149 -96 781 -151 -1576 312 2203 -222 -2752 -73 2837 177 -2830 -467
1424d67K795j989k248J527J456j159l59R04p12q21J791J027k602j173L104J499
$$ -467 2328 339 -1909 -382 1074 -85 -444 460 -252 -1073 718 1745 -857 -2030 1074 2573
1440B573l315j747L302J639k929j466K413Q86j801j90J192o88p84J595M58k351
$$ 2573 -742 -2489 813 2452 -477 -1943 470 1356 -445 -635 557 -131 -915 680 1138 -1213
1456a213m07K953L00l127m10L325L60l148j44K729j23k076N46J472j099q34J582
$$ -1213 -1620 1333 1633 -1494 -1904 1421 1781 -1367 -1511 1218 1095 -981 -435 1037 -62 -896 686
1473F86M03k217N9K632l92k886N66K882q40k640R92K263j159j829J494J247j841
$$ 686 1089 -1128 -1069 1563 1171 -1715 -1149 1733 893 -1747 -755 1508 349 -1480 14 1261 -580
1490e80o02K069J54k366L81K443o32k435R47K270j188j936J447J501j711r23J990
$$ -580 -1182 887 1041 -1325 -944 1499 867 -1568 -621 1649 461 -1475 -28 1473 -238 -1161 829
1507H29L05k214L7K444n13k600Q35K602j093k355J256J891j343j417J543P32j685
$$ 829 1134 -1080 -1043 1401 888 -1712 -877 1725 632 -1723 -467 1424 81 -1336 207 939 -746
1524g46M9J878n75k225J287K383j586k594J814K582j960k255J778J866j570j309
$$ -746 -697 1181 606 -1619 -332 2051 465 -2129 -315 2267 307 -1948 -170 1696 126 -1183
1540a183J450M18j380M45J371j318j510K051J633k572j852K816J954k744j914
$$ -1183 267 685 -695 -250 1121 -197 -1707 344 1977 -595 -2447 369 2323 -421 -2335
1555b335K551J643k022j171J535N54j085M40O94j396n58K345N12k979p00L414
$$ -2335 216 1859 -163 -1334 201 755 -330 110 804 -592 -1150 1195 1707 -1272 -1972 1442
1571A442Q80l576j034L274J058k855q16K023M37j239K64M90j106J23K040n00k806
$$ 1442 2322 -1254 -2288 986 2044 -811 -1627 396 833 -406 -142 348 -758 -635 1405 905 -1901
1588a901N98L455n47l725L91L695j74l221N3K472l0j525K29N26p46K79J426j107
$$ -1901 -1303 2152 1605 -2120 -1729 1966 1792 -1429 -1376 1096 1066 -459 -230 296 -450 -171 1255 148
1606A48k063J534K704j729l133J651L209j333l083J106K550q97j662P11P51p46
$$ 148 -1915 -381 2323 594 -2539 -888 2321 988 -2095 -989 1561 664 -998 -287 464 -282
1622b82K89R54j117j337J811J800k322k141K446K336k321k359K028K070j714j450
$$ -282 7 961 -156 -1493 318 2118 -204 -2345 101 2437 116 -2243 -215 1855 141 -1309
1638a309J319O74j082K42Q28j057r22J935R24k406j081K772J263k814j273K604
$$ -1309 10 684 -398 -156 672 -385 -1307 628 1552 -854 -1935 837 2100 -714 -1987 617
1654F17J096k175p52J847J48j369N12R53j147p66J784O21k366m55K526L86k590
$$ 617 1713 -462 -1214 633 781 -588 -76 877 -270 -1036 748 1369 -997 -1452 1074 1460 -1130
1671a130l95K536J45k226J33J811m68j374J006R08j418n51J859L58k233q0K406
$$ -1130 -1525 1011 1156 -1070 -937 874 406 -968 38 946 -472 -1023 836 1194 -1039 -1119 1287
1688A287p2k319K30K033l69j841P26J427j168r19J502M87j952j34K233j62k386
$$ 1287 1215 -1104 -874 1159 790 -1051 -325 1102 -66 -985 517 1004 -948 -1082 1151 989 -1397
1705a397M05K257m38k148O01J788p07j323J020P72j316k44J695j55k092O03K257
$$ -1397 -992 1265 827 -1321 -720 1068 361 -962 58 830 -486 -730 965 810 -1282 -679 1578
1722A578p68k374P87K393q88k072P82J675q34j060R07L16j120L64J328r10j722
$$ 1578 810 -1564 -777 1616 728 -1344 -562 1113 279 -781 126 442 -678 -314 1014 104 -1618
1739a618J417J931j544k135J610K235j454k044J207J685r63j039Q06K85p82N23
$$ -1618 -201 1730 186 -1949 -339 1896 442 -1602 -395 1290 327 -712 94 379 -403 120
1755A20Q42j294j004J934J187k317j422K363J618k305j602J938J331j450r06R80
$$ 120 962 -332 -1336 598 1785 -532 -1954 409 2027 -278 -1880 58 1389 -61 -967 13
1771A3K72o56N74L44j293j90J989L05k411n63K681Q51k745q45K332R24j903p07
$$ 13 285 -371 203 547 -746 -936 1053 1358 -1053 -1616 1065 1916 -829 -1674 658 1582 -321 -1028
1789a028J316K42p38L07J38r74K10J646m56k199M35K614l41k700J31K590N4k172
$$ -1028 288 530 -208 99 237 -737 -527 1119 663 -1536 -1101 1513 1172 -1528 -1397 1193 1247 -925
1807i25p9J577m4p95L12J29p64M94J268q47j752J092K112j151k291R12K338q32
$$ -925 -1004 573 529 -266 46 175 -589 -95 1173 326 -1426 -334 1778 627 -1664 -752 1586 754
1825G54k026O58J457n42q89N77J87p17M47R98j065j168J317J516j452j667J481
$$ 754 -1272 -614 843 301 -588 -11 176 -541 -94 904 -161 -1329 -12 1504 52 -1615 -134
1842a34J729j336j479J143J140r59o74P75P0o56L97Q25r88r78J383J000j622j032
$$ -134 1595 259 -1220 -77 1063 104 -570 205 275 -381 16 841 -147 -1125 258 1258 -364 -1396
1860a396J649J031j575r43J473N84j091k82R59k25q13P81O53j120o59J502O50
$$ -1396 253 1284 -291 -1234 239 823 -268 -550 409 184 -629 152 805 -315 -974 528 1178
1877A178j667o50J729N04j553m11J377Q1j077K24Q00o37n68R60N17j391l76J592
$$ 1178 -489 -1139 590 1094 -459 -870 507 588 -489 -265 535 -102 -670 290 807 -584 -960 632
1895F32L19j693k92J676K38j409j61J173r5q27M05N71p87k41J197m9j471Q7J664
$$ 632 951 -742 -1034 642 880 -529 -690 483 388 -439 -34 537 -250 -491 706 657 -814 -727 937
1914I37n9j746%J640M1j477L6J035j72o24M66J08p34K74J096m65j417N50J619
$$ 937 878 -868 -868 772 813 -664 -628 407 235 -389 77 185 -549 -275 821 356 -1061 -511 1108
1933A108n23j723M64J675k93j431K63J031k43n68L37J6n74N40P10q22j007R72
$$ 1108 585 -1138 -674 1001 708 -723 -460 571 328 -240 97 113 -461 79 789 -33 -1040 -68
1951f8J355j108j461R18J518q51j298O16R84l65n74K75qj73N50K80r66n31J359
$$ -68 1287 179 -1282 -364 1154 303 -995 -379 605 240 -334 -59 -67 -240 310 590 -376 -907 452
1970D52P52j454r52J412J071j248j071R28Q53n87m90K75K7j79N68K3j037n5J344
$$ 452 1204 -250 -1202 210 1281 33 -1038 -110 743 156 -334 -59 -32 -211 357 380 -657 -712 632
1989F32K59j622l84J635N70j538n56J227N98q99k83M88p9o4L60k10o99K20J145
$$ 632 891 -731 -1115 520 1090 -448 -1004 223 821 -78 -361 127 48 -16 344 134 -565 -345 800
2008H00k37j320Q3J476n5j478o6J235J43r49j25N91m2j90L15j08n27K28R31m17
$$ 800 563 -757 -674 802 747 -731 -797 438 581 -368 -493 98 56 -134 181 73 -454 -226 705 288
2028B88j131M90J250m16j194K70J109k49p45R5M93k14j62L66k18m92L92P02o50
$$ 288 -843 -353 897 481 -713 -443 666 417 -328 -233 260 46 -116 250 32 -460 -68 634 -16
2047a6p77N72R87n96r75N20Q66m23o43L64L66l25J5L14k78l82O05N27q23n13P56
$$ -16 -793 -221 766 170 -805 -285 581 158 -485 -121 245 -80 -65 249 -29 -411 194 721 -102 -615 141
2068A41O91p59p07O09N75m88l70L17J57k86Q0K92m68k52P05K98q42m45Q92M29
$$ 141 832 73 -634 -25 550 62 -308 9 166 -120 -40 252 -216 -468 237 535 -307 -752 140 569
2088E69o85m79O37M64n47j71K67N4j93K23J23n23n1P94O5r18k04R46K53q83l15
$$ 569 -116 -595 42 506 -41 -212 55 109 -84 139 262 -261 -312 482 547 -371 -575 371 624 -259 -574
2109e74P69J68m84j52K92nq5K43j09m54J76P56k47q23J70R52j03q91o6P81J18
$$ -574 195 363 -121 -273 19 14 -71 172 63 -391 -215 541 294 -529 -359 593 490 -401 -467 314 432
2130D32m95j71K91J4M8Q7l11k67L96N20n40o82M88P77l78p37J99O53l8n61oL42
$$ 432 -63 -234 57 71 119 206 -105 -372 24 544 4 -678 -190 587 209 -528 -329 324 286 -275 -281 61
2152F1PJ37q2k60j33N23K87o25n00P26N74o57n75M22N49k91m60J61J72M6O0k07
$$ 61 68 205 123 -137 -270 253 540 -85 -585 141 715 58 -517 -95 454 163 -297 -136 36 82 142 -65
2174f5k35Q3N45j04o47m4P04K76p43k94O35L34m28k45J89J89p4pp7j58J64L43
$$ -65 -300 -217 328 224 -423 -467 237 513 -230 -524 111 445 17 -228 -39 150 76 69 -8 -166 -2 341
2196C41j52n64J32O39r0o11NN34P5m50j13J90J20q0K3o2j60K90K07k50m26K96
$$ 341 189 -375 -243 396 306 -305 -300 234 309 -141 -254 -64 56 -24 -1 -63 -223 67 274 24 -402 -106
2218a06N17k20n11J90M42r4l89J03J54j9j7qr1j19K73K06l86k92M27K65k90m02
$$ -106 411 191 -320 -130 312 218 -171 -68 86 67 50 42 -49 -168 105 311 -75 -367 60 325 35 -367
2240c67K56L63k05k66J62R4k0R8o6j91M1L15R6m86q1L94K20m47j41K72K02k71
$$ -367 -111 252 47 -219 -57 37 17 115 49 -142 -101 214 310 -176 -257 137 357 -90 -231 41 243 -28
2262b8j18J71m5M9O1m6k98Q4M25p5m52m9N31M0m70l1L34J63k39q3J50j22Q3J65
$$ -28 -146 25 -20 29 90 44 -254 -170 255 180 -272 -321 210 250 -220 -251 83 246 7 -76 74 -48 35 200
2286B00j45k41J77L58k19m61J52N35j43m72NM37m1k66mM3K7M5Q1j91j66L45K88
$$ 200 55 -186 -9 349 130 -331 -179 356 213 -259 -254 183 142 -124 -128 -85 -58 -13 68 -123 -289 56 344
2309C44l67l77M28M14l14m78K98L39r6l21J14R7j5P7Kk83j09M60P2n44j51N61
$$ 344 -23 -400 28 442 128 -350 -52 287 191 -130 -16 81 66 143 145 -138 -247 213 285 -259 -410 151
2331A51J97n04k55M06K63l19j41K16N4j10J24j37j39J4M71q8m88M0N47M4n90o4
$$ 151 348 -156 -411 -5 258 -61 -202 14 68 -42 82 -55 -194 -180 291 203 -285 -245 302 346 -244 -308
2353c08N77Lm22k2K18K8j59J49ok55J12L31k30l52K08N28j92n69J44N04j12l78
$$ -308 269 272 -150 -172 46 74 -85 64 58 -197 -85 246 16 -336 -128 400 208 -361 -217 287 175 -203
2375b03N1L33n9j96K01j07j43J18L00l06l16L06L71l54m16L80M26l72l28L01K08
$$ -203 -152 181 122 -74 127 20 -123 -5 295 -11 -327 -21 350 -4 -420 -40 386 14 -314 -13 195
2396A95k68l4J86p3j99J79K22k11l05M39K23l90l04M46K88m66j61L86P5l38L6
$$ 195 -73 -107 79 6 -193 -14 208 -3 -308 131 354 -36 -340 106 394 -72 -233 153 228 -110 -74
2417g4K26j26k81K88K26m03j67N32K5m44j41M63J37m62n0M73j78k31J85J61k62
$$ -74 152 26 -255 33 259 -144 -311 221 246 -198 -339 124 261 -201 -251 222 44 -187 -2 159 -103
2438a03j16M32P6n33nN60k8m77k9N23q1l83K4L86j28l33J93J73k76q1M36n1m90
$$ -103 -219 213 289 -244 -249 311 283 -194 -223 300 219 -164 -140 246 118 -215 -22 151 -125 -206 230 179 -311
2461c11P2N55r4o07J50N96j62m53J66K78j73j55K73M8l62J45M17k82m64K66N44
$$ -311 -239 316 222 -385 -235 361 199 -254 -88 190 17 -138 135 183 -179 -34 383 101 -363 -97 447
2482D47l72n08L07N12l40m33L43L10l15j65L07l4k53K06K81l82k81M36M09n48
$$ 447 75 -433 -126 386 46 -387 -44 266 -49 -214 93 59 -194 12 293 -89 -370 66 475 -73
2502g3l84N59M09m67m24M65K19l66j35L15p7k33K32K09l96k37N91J82o93j86O96
$$ -73 -457 102 511 44 -380 85 304 -62 -197 118 41 -192 40 249 -147 -384 207 389 -304 -490 206
2523B06J23n53j65N88N9m00o1L96j41j63K49J09m68J4N41q5n85P5O83p2p26J13
$$ 206 329 -224 -389 199 258 -142 -203 193 52 -111 138 247 -221 -207 334 249 -336 -261 422 350 -376 -263
2545b63N70q6m99J17L39j67j86K19P3l94J16N19k39n42K72O03k35o81L39N90l17
$$ -263 307 221 -278 -161 178 11 -175 44 117 -277 -161 358 119 -423 -151 452 217 -464 -125 465 148
2566A48m31K60L45k98j16K59kl73J74L87k88m73L35M99l97m97M17M92m25l85L66
$$ 148 -283 -23 322 24 -92 167 165 -208 -34 353 65 -408 -73 426 29 -468 -51 441 16 -369 -3
2587cK07l17q9L35j05l06K72L00l44l11M43K92m92l31N62L18n36k42M86J21m04
$$ -3 204 -113 -202 133 28 -278 -6 294 -50 -361 82 374 -118 -449 113 431 -105 -347 139 260 -144
2608a44L5K80j30l21L36J90m01k18N36K22n94j87O02R7n03n1M66l8l63J20L24
$$ -144 -109 171 41 -280 56 246 -155 -373 163 385 -209 -396 206 303 -200 -251 215 177 -186 -66 258
2629B58k74k25L59J58m22j43N44P9o38m3O09K5o04J15M39j56l46K86R2k32j47
$$ 258 -16 -241 118 276 -146 -289 255 334 -304 -347 262 287 -317 -202 237 81 -265 21 113 -119 -266
2650b66M70J5n53R1N84p1n95J28N90j38m93J11L14j52k53L03R7l82O1M53j78m96
$$ -266 204 219 -334 -243 341 270 -325 -197 393 255 -238 -127 187 35 -218 85 182 -200 -139 314 136 -360
2672c60K14N42k57o27L36N08k71m62K33L67k63j32K52j2k38J01L96l04m41M19
$$ -360 -146 396 139 -488 -152 356 85 -377 -144 223 -40 -172 80 68 -170 -69 327 23 -418 1
2692AN19m67m84L54N66m00m02L51K20l07q9K73r9k38K30K57l85l18N24L45o14
$$ 1 520 53 -431 -77 489 89 -313 38 258 -49 -138 135 36 -202 28 285 -100 -418 106 451 -163
2713a63l70N94L83n03l32M72K09l30n5J83r4j77L11J10m09j36N65J16n91k25P02
$$ -163 -533 61 444 -59 -391 81 290 -40 -95 88 -6 -183 128 238 -171 -307 258 374 -217 -442 260
2734B60J44n99j84M94J60m02j5K34r4j23K64N1m54LO15o9o03M0O29j7o68N6N88
$$ 260 404 -195 -379 115 275 -127 -142 92 -2 -125 139 190 -264 -261 354 285 -318 -278 351 334 -334 -278 310
2757C10o0m18O8K32j22o1K07l5m33J92M67k31n41J83O59k09n70J74M72j94l43
$$ 310 250 -168 -100 132 10 -51 156 121 -312 -120 347 116 -425 -242 417 208 -362 -188 284 90 -253
2778b53J26K80j57q8K47j10k85K58L55l47m09L63M79l10n22L27L99k60l27K14
$$ -253 -127 153 -4 -92 155 45 -240 18 373 26 -383 -20 459 149 -373 -46 353 93 -234 -20
2798b0J97k70OK12j40k37L47K14l98l09M85L29m93l23M39K94l68j92L50N9k23
$$ -20 177 -93 -87 125 -15 -252 95 309 -89 -398 87 416 -77 -400 39 333 -35 -227 123 182 -41
2819d1OJ98j75j67L05J91m34k39N20J84n25j89M67K04m17j08K65Pk00J30J05k19
$$ -41 -35 163 -12 -179 126 317 -117 -356 164 348 -177 -366 101 305 -112 -220 45 52 -148 -18 87 -132
2841a32o5L33Q7m73m3N25O1m93n5M68M7m17RK98r0j69J71J0k00j7L44n1m50Q5
$$ -132 -197 136 223 -250 -293 232 293 -200 -255 213 260 -157 -148 150 60 -109 62 72 -128 -145 199 148 -302 -217
2865b17M88o2m98K2N00k7l91J32J62q5j08J42k0k70J72K96j76m11K24M29j59m21
$$ -217 271 209 -289 -267 233 206 -185 -53 109 24 -84 58 38 -232 -60 236 60 -351 -127 302 143 -278
2887b78J59L87j20l39J01K20j18m1J5Oj65K48K22l58k70L76L29l13l99K80L60
$$ -278 -119 268 148 -191 -90 130 12 -29 -14 -8 -173 75 297 -61 -331 45 374 61 -338 -58 302
2908C02k10l25K31J67j41oJ01q6j92K94J20m06j09M21K19m74k56M14K20l90j52
$$ 302 92 -233 -2 165 24 18 119 33 -159 135 255 -151 -260 161 380 -94 -350 64 284 -106 -258
2929b58K24J31j27j6M5j05j3K27O5l56l1M42J04n19j10M77J39l20j77K71J13k38
$$ -258 -34 97 -30 -46 -1 -106 -119 108 173 -183 -214 228 332 -187 -297 180 319 -1 -178 93 206 -32
2951c2JJ06k14P2K27n3l50Q5M36r3m56O1M48n1l39l4K64nj26pO7o7L0J64j35k13
$$ -32 -31 75 -139 -67 160 107 -243 -158 278 185 -271 -210 238 187 -152 -186 78 73 -53 -60 7 -60 -30 134 -1 -214
2977b14J67K68r1m10J48L83j43l10P6K62pj90R6k6m0LJ78j94k05K61K68k20l33
$$ -214 -47 221 130 -280 -132 251 108 -202 -126 136 129 -61 35 9 -31 -28 150 -44 -249 12 280 60 -273
3000b73J86L09j36l35J70K67j88n3P6m9k9R1P2j34j72K77J88l37j56K16K18j76
$$ -273 -87 222 86 -249 -79 188 0 -53 23 -26 -55 36 108 -26 -198 79 267 -70 -226 -10 208 32
3022C2k56K12P2n7p1N6o1qJ28P0k39m4L19J5k59j12K83J87k98j41J85J04j16r8
$$ 32 -224 -12 60 3 -68 -12 -73 -81 47 117 -122 -166 153 168 -91 -203 80 267 -31 -172 13 117 1 -97
3046i7J37o0K6J43p6k37M6L12l5l36o5L39O5l07l9K37N7j71J5P8l0KJ03p2j27
$$ -97 40 -20 6 149 73 -164 -118 194 159 -177 -242 97 162 -145 -184 53 110 -61 -46 32 2 4 107 35 -92
3071i2O3K15m9l50Q3L67l1l45oK61n4r2K2Ol3N9Q2j64j43K17K26k43k50J48K87
$$ -92 -29 186 137 -213 -130 237 206 -139 -145 116 62 -30 -8 -2 -35 24 106 -58 -201 16 242 -1 -251 -103 184
3096A84j25k51J42J59L0k47O9K9K8L9M7j26q7J81J45k69k18L23J22j64k03J37
$$ 184 59 -192 -50 109 139 -108 -39 -10 18 57 104 -22 -109 72 217 -52 -270 53 175 11 -192 -55
3118e5J40l1j41L9P3L9j8M4k25M8K23O7k93j35L66M7k88q3K09J41j67p4N1%N6
$$ -55 85 54 -87 -48 25 64 46 90 -135 -87 136 203 -90 -225 141 188 -100 -183 26 167 0 -74 -23 -23 33
3143C3K2o0j02N3J91j00k20L3L12Kk71LJ55J02j63l7L5N5QJ9l0j35P7J84r4k70
$$ 33 55 -5 -107 -54 137 37 -183 -150 162 164 -107 -104 51 153 -10 -47 -12 43 51 70 40 -95 -18 166 72 -198
3169a98R6J86Kk19oJ74N7j47k5Q1j3J6kk3r9J68Q3j82j28J15K45j17k25J14J72
$$ -198 -102 84 86 -133 -139 35 92 -55 -80 1 -12 4 2 -21 -120 48 131 -51 -179 -64 181 64 -161 -47 125
3194A25j8j18KK8j2O0Pj05m6J30J06k40k9J00J36j67j84J88J65n3j50KO4J7L4
$$ 125 107 -11 -9 19 7 67 74 -31 -77 53 159 -81 -110 -10 126 -41 -225 -37 128 75 -75 -73 -9 8 42
3219D2Qr7rJ70j5k30J8K39L2k08q2J14J69j12o7J7R4o9M0j19o3Q5J04Rk62O7J99
$$ 42 50 -47 -56 114 99 -131 -113 126 158 -50 -132 -18 151 39 -28 -11 83 14 54 -65 -128 -43 61 70 -192 -125 74
3246G4O2j96o5J81P4j52r4J41lk5M9r0n0J39P5n8j72Q7K03r4j97K4J47N5j71k7
$$ 74 136 -60 -125 56 130 -22 -116 25 22 -3 46 -44 -94 45 120 62 -110 -23 180 86 -111 -87 60 115 -56 -83
3272h3Q2m2O6k6l2o7J66O5j37j17J44J24r7j17M1Q1K2j07l6N8P9RJ0j72J6J58
$$ -83 -1 -43 23 -3 -35 -102 64 129 -8 -125 19 143 46 -71 -30 51 73 -34 -70 -12 67 76 86 -86 -70 88
3298H8J5j31j21K04O6n0j99R5R0k7j37P1L0N6o0m5Mj2R5j7q0m9J68P3j45q1J33
$$ 88 103 -28 -149 55 121 71 -128 -33 57 30 -107 -36 -6 50 -10 -55 -51 -63 32 15 -65 -114 54 127 -18 -99 34
3325C4O3r8l8k7J93j05j2k1k9K3M0Mj14j2J67n2p4r0K44nj42m2N2Q2n5O1r1kN6
$$ 34 97 -1 -39 -66 127 22 10 -11 -40 -17 23 27 -87 -99 68 16 -58 -148 96 91 -51 -93 -41 41 -14 47 -44 -46 10
3354A0J05r4j66J09J68q5j13nJ47k5j09J0M7K8k0j7On7Q4Q3j02p6J06R5j11j23
$$ 10 115 21 -145 -36 132 47 -66 -71 76 51 -58 -48 -1 27 7 -10 -4 -61 23 106 4 -72 34 129 18 -105
3380a05Q8J12q0o5J9P5l2k2K6r6M8M6K3n8o4J31Rp9j17J41Q0p9q2O0N3m7J9lj7
$$ -105 -17 95 15 -50 -31 44 12 -10 16 -80 -32 14 37 -21 -85 46 55 -24 -141 0 80 1 -81 -21 32 -15 4 1 -16
3409a6P1L4l9r1jJ23k4q1l7J20L4j07n0Q0J9k9j9m8J7j2Q5Pj44Q6O0Qo7l4J36
$$ -16 55 89 50 -41 -42 81 57 -24 -61 59 93 -14 -64 16 35 6 -13 -61 -44 -56 29 36 -108 -22 38 46 -21 -55 81
3438H1o0n7l2L3O4l7n0M1%J7P8j07%O1O7p7r7L3Q4l5l7K8J6Opm8j6O6K4k7n8l8
$$ 81 21 -36 -68 -35 29 -8 -58 -17 -17 0 78 -29 -29 32 99 22 -75 -42 42 7 -30 -2 14 20 13 -35 -51 15 39 12 -46 -84
3470h4J18P2j00j32J22M6M7j59O4oM0m9oL9rM4Jm0j47J67M5j26o0J17J27j94l1
$$ -84 34 106 6 -126 -4 42 89 -70 -6 -12 28 -21 -27 12 3 47 48 8 -139 28 73 -53 -113 4 131 -63 -94
3497i4J05M4j2m8k2J4J5J2j0n9O4P7j8o7o4J70k2j09q2Q1K1mj4M8l5rQ7n2q6P3
$$ -94 11 55 43 -5 -27 -13 2 14 4 -55 9 86 68 1 -63 107 85 -24 -106 -25 -4 -8 -22 26 -9 -18 69 17 -69 4
3527DN7n7m3K8Q6j0r8m8J32kp5L8pm1Q4qj1q2O3M6j4j01R0L8j4j42J9O6L7q7K8
$$ 4 61 4 -39 -11 75 65 -33 -81 51 49 -26 12 5 -36 48 40 29 -53 10 56 42 -59 31 69 55 -87 -68 -2 35 -52 -24
3558b4L3m6J1M7n2n7J19Q2q4j41J21Q8q3m4j9J19Mp7J1j3J5O0k4r1J1N9O8j35
$$ -24 9 -37 -26 21 -31 -88 31 113 29 -112 9 97 14 -30 -49 70 74 -3 8 -5 10 70 46 -45 -34 25 93 -42
3586d2p0R8P6p1j9N1On2o3M5kJ7qL7m2QO3qj03N3Q9%l7r7Q8N4m9l8M1k5oKK7o8
$$ -42 -112 -14 62 -9 -28 23 29 -23 -86 -41 -43 -26 -34 3 -39 -31 32 24 -79 -26 63 63 26 -71 17 71 22 -16 25 0 -6 -4 23 -45
3620d5O5N3o8mmO6n1l5mM2R5j30J1M8j6j2qk0L0k8Q5l8j00O0K9Pj10J1J56j11
$$ -45 20 73 5 1 -3 63 12 -23 -27 15 110 -20 -9 39 23 11 3 -17 13 -15 70 32 -68 -8 21 28 -82 -71 85 -26
3650b6qJ5J2N1m8l6J0K1O3l7l8q6R2P0j03M8J1P7n6m5NO6m3n3L6MJ0rLp0J3N3
$$ -26 -34 -19 -7 44 -4 -40 -30 -9 54 17 -21 -107 -15 55 -48 0 11 88 32 -13 -8 58 15 -38 -2 2 12 3 6 -64 -51 2
3682BJ4q3j1O0L2k8j9M1o3O1k5N2j8J1L1pq6nJ37j4r8pP5jj15K1N7l1O3p9NoN9
$$ 2 16 -67 -78 -18 14 -14 -33 8 -55 6 -19 33 15 26 57 50 -36 -41 96 82 -16 -23 52 51 -64 -43 14 -17 46 -33 -28 -34 25
3715B5Mj8o3L6MJ1o1k4J07N3j09P6l6M6n7L0Rm7M1o1O9o9M7K3ln4K9%O0r0LM1
$$ 25 29 11 -52 -16 -12 -1 -62 -86 21 74 -35 41 5 51 -6 24 33 -14 27 -34 35 -34 13 36 33 -21 8 8 68 -22 -19 22
3747B2K2n2j4LK7J8M8n4m3R2Mr9l6Q7pPm1N5m0M5q8QmO4o8P6q7L7N0jl3p4J02
$$ 22 44 -8 -22 -19 8 26 74 20 -23 69 73 -26 -62 25 18 25 -16 39 -1 44 -44 -36 -40 24 -44 32 -55 -18 32 31 -2 -76 26
3780B6M2k5j10N6M1L8q9M7LJ5%l2k7L6j0N6p9n3Q5K7jn2rJ7k2m1K7j4L1j5K6j16
$$ 26 68 43 -67 -11 30 68 -21 26 29 44 44 12 -15 21 11 67 -12 -65 20 47 46 -6 -15 2 -20 -61 -34 -48 -17 -32 -6 -122
3812a22P2J04p3J5k8K5L7j2l7P5j6ko1O8J3j4n3K9j%Qo1k5NJ08j4n7j7N0j8K6
$$ -122 -50 54 -19 -4 -32 -7 30 18 -19 56 40 38 -23 45 58 44 -9 20 19 19 27 -34 -59 -54 54 40 -17 -34 16 -2 24
3843B4j06K1Q3j0k9L6o8L1M9l9n1N9L9j0r0L6P2l9o5NL3N6l0L1p1K1mN9pk4L4
$$ 24 -82 -61 22 12 -17 19 -49 -18 31 -8 -59 0 39 29 -61 -25 47 8 -57 -52 -19 37 7 38 -33 -12 -16 43 36 12 46
3874D6j7j4n3mQ3n6L0l5k3Q9k3k6MnL3j9m4J5K0O9q2o9Q3J3J7m8m8K8j0nN5K2
$$ 46 29 15 -38 -42 41 -15 15 -20 -43 46 23 -3 1 -4 29 10 -34 -19 1 70 -12 -81 2 15 32 -16 -64 -36 -46 -51 4 26
3906B6k6J0qn1L4P2Km1n9N3oj5l0J2J3qM1k7k0L4j0l0j9l1J24kj8n2K9k5jl2p
$$ 26 0 10 2 -49 -15 57 59 18 -41 12 6 -9 -39 -27 -14 -22 19 -8 -28 6 -4 -34 -53 -84 40 38 20 -32 -3 -28 -29 -61 -68
3939f8N7mJ1mO5l1J7l2r9J15M6p4j7j8J09m0m4j2N4J5l3k1M2k9K2Pq4kM0Mnp6
$$ -68 -11 -15 -4 -8 57 26 43 11 -88 27 73 -1 -18 -36 73 33 -11 -23 31 46 13 -8 34 5 27 34 -50 -52 -12 -8 -13 -89
3971h9M9P9l3K4j18Q6PL4k6jj8L3J3j3k3l2P7j4kn1Q0p2l4M3M1n5j7jk9N5K2n
$$ -89 -40 39 6 30 -88 -2 5 39 13 12 -6 27 40 27 4 -28 49 35 33 -18 62 -10 -44 -1 40 -15 -32 -33 -62 -7 15 10
4003A0p4M3M3l5L4LRk3L8m6j1l6M9n1J2O9qkn6j0M4%J0j5NJ0j4M5j00R5l1Op0
$$ 10 -64 -21 22 -13 21 24 33 10 48 2 -9 -45 4 -47 -35 34 26 24 -32 -42 2 2 12 -3 2 12 -2 43 -57 38 7 13 -57
4036e7K0K9L8m2Kl6N8M2m6k6K0K9j6L4j01J08j8k0l3j6M0j7k7Nn0N7M3k7j9OJ0
$$ -57 -37 -8 30 -12 -10 -46 12 54 8 -18 2 31 15 49 -52 56 38 18 -15 -31 9 -8 -35 -30 -80 -23 20 -7 -26 -20 -10
4067a0J4%l9R1l3k3l2m0J13kj00R5l3JK6l1JN7k4l7j4l7P9koo1L8J0K8k9l4L7
$$ -10 4 4 -35 56 23 0 -32 -72 41 39 -61 34 1 2 28 -3 -2 55 31 -6 -20 -57 22 20 14 -47 -9 1 29 0 -34 3
4099CnJl1kL5M5n6Oj0P6p5%J1mK8m1J9M3l2k4M0j5j3J1O1n6J0j6%m5K3k2L9km1
$$ 3 -2 -1 -32 -34 1 46 -10 -4 -14 62 -13 -13 -2 -6 22 -19 0 43 11 -13 27 12 -1 10 71 15 25 9 9 -36 -13 -35 4 2 -39
4134c9L1J3Mm3L5jl0L3Pl1L6j5pm6J3jO0l1P%rmK2k6l8M4K5K8o1RR5o4J7q4M5
$$ -39 -8 5 9 -34 1 0 -30 3 10 -21 15 0 -7 -53 -40 -41 19 -12 -5 -5 -14 -18 4 -22 -60 -16 9 37 -24 -15 80 16 33 -51 -6
4169fL8K1j00J3K9JoL1m4PL3m7K9n3K8P0o3LL9m3O0n2P7n9M2r5O4k1JO3p9L1j3
$$ -6 32 53 -47 -34 -5 -4 -10 21 -23 -16 17 -30 -1 -54 -26 44 -19 -16 23 -20 40 -12 65 6 48 -47 17 -4 -3 60 -19 12 -1
4202aRN3p9J6K4J3Mo1M7qn2P3q5P6l4P1o1o1M5JK6l5jJ3L7n4L7jmj3J4Ql3LL8
$$ -1 8 61 -18 -2 22 35 39 -22 25 17 -35 38 -47 29 -5 66 5 -56 -11 -10 16 -19 -20 -7 30 -24 13 12 8 -5 9 17 -16 -13 25
4237B5p9K5R5m1Nm1j8j5L3qrN8k5k6J5ml1N1m5n7Q9J5k8RomO4l9lo3O0PmRnJ8
$$ 25 -54 -29 66 25 30 -11 -29 -44 -11 -19 -28 30 5 -21 -6 -10 -41 10 -35 -92 -3 12 -16 -7 -13 -17 47 8 5 -58 2 9 5 14 9 27
4273B7Ql3r2J39k2m6qM7j%J6n6j5RR9k8l0M1k0mJ8m9RN4n2l2K0N3o6Kn0Q1k2j8
$$ 27 35 2 -90 49 27 -19 -27 20 19 19 35 -21 -36 -27 72 44 14 55 35 31 49 0 9 63 11 -21 -1 52 -14 -12 -62 19 -3 -21
4307b1KlqNK8j6k1N6k5J3K0m0O4p4Pj5K8J8k0J2k9K6m4J12r4M5l2O5m0l7M8%m3
$$ -21 -19 -22 -30 -25 3 -13 -34 22 -3 10 30 -10 54 -20 -13 -28 0 18 -2 10 -19 7 -37 75 -19 26 -6 59 19 -18 30 30 -13
4340a3mJ0j9qL2k5J6J8pj4k8J7N5L0p7k2OL2J3K4k6j2l0N3NQn9J9J6j9O1j6m4
$$ -13 -17 -7 -26 -34 -2 -27 -11 7 0 -14 -42 -25 30 60 -17 -39 -33 -1 12 36 10 -2 -32 21 26 34 -25 -6 10 -9 52 36 -8
4373hj8M6k1NJ4q0L3P7j6Ql7j0L8n2M2l7L2L4m3RJj5J3k8LJ6K8l1jm8j1N2N4q1
$$ -8 -26 20 -1 4 18 -62 -29 48 32 40 3 -7 31 -21 21 -16 16 50 7 16 17 2 15 -13 -10 6 34 3 2 -46 -57 -5 49 -32
4407c2L5L4kp3J6j1K6J4Ql1P6n2j8J1j6J0L6no3J7O7j5o1N6k7M1l5M5k9K1o3M1
$$ -32 3 37 35 -38 -22 -33 -7 7 15 -16 60 8 -10 1 -15 -5 31 26 -37 -20 47 32 -29 27 0 41 6 51 22 43 -20 21
4439B1k9rkM1Jn3K7kK4pkm3P6Ol9oJ7J5Pl6j0N1j1k8o6J4M7K0j4k9NK7lKJl6M7
$$ 21 -8 -17 -19 22 23 -30 -3 -5 19 12 10 -33 43 49 10 4 21 36 43 7 -3 48 37 9 -57 -43 4 24 10 -19 -14 13 10 12 13 -23 24
4476B4n4J7J0qJ7L9o2J4j6j3O0ok0N8o4L6j8L3Jl0l3k4K7nkJ0M4k6ONo8P4pj9
$$ 24 -30 -13 -3 -11 6 45 -17 -3 -19 -32 28 22 2 60 -4 32 14 47 48 18 -15 -39 -12 -17 -19 -9 35 9 15 20 -48 26 19 0
4510@l1P1k9j9k8K1N5j6j1LL2k8qQm1j2L5k3N9m5n4R0m9L1o6P1jj5K4mOo6M9k
$$ 0 -31 40 11 -8 -36 -15 40 24 13 16 48 20 12 20 -21 -33 2 -21 38 -7 -61 29 -20 11 -55 16 15 0 24 20 26 -40 9 7
4544GpJ9j3l3O0%n1M0Jk5J0m6N3k4l1M8j4J4l4jO8l1m5J4J2o6R0o0K3O9l2qN5
$$ 7 0 19 6 -27 33 33 -18 22 23 -2 8 -38 15 -9 -40 8 -6 8 -26 -27 41 10 -35 -21 -9 -75 15 -45 -22 47 15 7 62
4577F2Qo9N2j11M3M2k4rM5o7K6J1rRn1N0l2j1N0n2M8j3m4Kl4R6Nn9O7m0L3j1q
$$ 62 70 1 53 -58 -15 27 3 -6 39 -28 -2 9 0 9 -42 8 -24 -35 15 -37 11 -2 -46 -44 -78 18 23 -36 31 -9 24 13 5
4610Enl9O4n7N4Rj4L0n7M0on9O3j2Pn4Q3l6l6NN7l3l7N1k9qJ7m2N9oj2l7qO7J
$$ 5 0 -39 25 -32 22 31 17 47 -10 30 24 -35 28 16 23 -31 52 16 -20 -15 42 9 -28 23 -6 -14 3 -39 20 14 2 -35 -43 24 25
4645B5m1kK5K5%k9j1lJ7qo6M9K1n1jO7l4kJ8k9J19q2J2j0J8OJ2op0Q8p4Q1k6q
$$ 25 -16 -18 7 32 32 3 -8 -11 6 -2 -68 -19 2 -49 -50 17 -17 -19 -1 -30 89 7 19 9 27 33 45 39 -31 57 -17 64 38 30
4679C0QK1q3nN9n9N5r0O2K5l3lK7o0L6K3jkkn7J6N2lLo4K9K4K3Om6jK0j5QK3j
$$ 30 38 59 -24 -29 30 -29 26 -64 -2 23 -10 -13 14 -46 -10 13 12 10 8 -49 -33 19 16 19 -45 -16 8 31 37 -9 -10 10 -5 3 26 25
4715B5l0roK4KKl9K6J4Mn6N1Mk5k0Qk2R0L2j03j0K2L5NK6m5N8k3qn5O1q9oJ8J7
$$ 25 -5 -14 -20 4 6 8 -31 -5 9 13 -43 8 12 -13 -33 -25 -47 43 75 -28 -38 -16 19 24 50 5 63 40 32 -23 38 -51 -57 -39 -22
4750b2L7k0kp%mnO5m3n3L2j0j3j5O7qQon4K9l4K8J0j1jL4Ll3qMK2Jj1K0j8L4o6
$$ -22 15 -5 -7 -14 -14 -18 -23 42 -1 -54 -22 -32 -45 -60 7 -1 7 1 -53 -24 -58 -30 -20 -31 -32 2 5 -28 -36 -32 -10 -9 -20 0 -18 16 -50
4787e0J2L7Lj8j8N0Kj0L7k8k1K7l9M2n4NO1o7L8k0N7m1J5mk4k3OK8j7K9k5L0l9
$$ -50 -38 -1 2 -16 -34 16 18 8 45 17 -4 23 -16 26 -28 -23 38 -29 9 -11 46 5 20 16 -8 -31 -25 3 -14 15 -10 20 -19
4820a9N1m3N0k7kmj4N6l7J9l6P9m0rm3M2J6k6M3j9l3qjM9l8j7j4K9J4m8KK7km1
$$ -19 32 -11 39 12 10 6 -8 48 11 30 -6 73 33 24 -19 23 39 13 56 37 4 -4 -5 44 6 -11 -25 4 18 -30 -28 -1 -3 -44
4854d4N2k9L4k7l6MK2M7k3L7k3K9rl7KN7k5n3J6j4RM0m3jJ1m1L2k6K8L5m2K0n8
$$ -44 8 -21 13 -14 -50 -46 -24 23 0 37 14 43 34 -3 -1 56 31 -22 -6 -20 -11 29 -14 -15 -4 -45 -13 -39 -11 24 -18 2 -56
4887e6O7K4r5M4KN8j7Lo2M4j9K6k1l0N3p1J02r4K1L9q2M2P3k0Jnj1o0O1j7j2N7
$$ -56 11 35 -60 -16 -14 44 27 30 -32 12 -7 19 -2 -32 21 -50 52 -42 -21 18 -64 -22 51 31 32 27 16 -44 17 0 -12 45
4919D5m2kL6j6J9Kn3oLk2O0j4k9j9L3m0L7Pkk7K9J1l5k5P0Kl2N7l4l3N9k1j7k
$$ 45 3 1 37 21 40 42 -11 -17 -14 -36 24 10 -19 -38 -5 -45 -8 -1 -3 -30 -1 10 -25 -50 20 22 -10 47 13 -20 39 18 1 -1
4953aqQ4n2mrL2Ol2%l2j5K9k2M0jol0j3rK3L0l7K5N3o1j9K0qkN6m7J9%j4n1N2
$$ -1 -9 75 23 19 10 42 48 16 16 -16 -31 -2 -24 16 15 9 -21 -34 -43 -20 10 -27 -2 51 -10 -29 -9 -17 -19 37 -10 9 9 -5 -56 -4
4989dJ6M8l2k4J2Oo2L8K5J0k8L2m8Q0Lp3n8R8Rk2l6JLJ3mj2l1O2k0j8Kj2m5M1
$$ -4 12 60 28 4 16 22 -40 -2 23 33 5 37 -11 69 72 -1 -59 39 48 26 -10 -9 -6 7 3 -9 -40 22 2 -16 -14 -26 -71 -30
5023c0L1jM7%n8K6o0J4P3r3O1MJ3j07M6Q6m5L1l8pJ5j5J5l2k3N6J2l2N6m2K1k4
$$ -30 1 0 47 47 -11 15 -45 -31 42 -51 10 14 27 -80 -34 52 7 38 0 -7 8 -7 8 -24 -47 9 21 -11 45 3 24 0
5055@j7M7p3O4j1j0No0Q8n7OJ1J7r3N4O3qn4OK0LJ8ml7R8o9L6o2j1K0L1M9l3o8
$$ 0 -17 30 -43 21 10 0 5 -55 33 -24 -18 -7 10 -83 -29 34 26 -28 -22 -2 1 19 15 -22 76 7 43 -19 -30 -10 21 70 37 -31
5089c1M0MJ8m9l0M5JK9o8M7j8M9o9L0k4lK1k1J1K4m5K4L9k8M8m3J7k0L2k6q1R1
$$ -31 9 13 31 -18 -48 -3 -2 27 -41 6 -12 37 -32 -2 -26 -29 -8 -29 -18 6 -39 -15 24 -4 44 1 18 -2 30 4 -77 14
5121A4j7k6P1l7pRoK4l1qN0m7M2m1K5l8J2K0K2l1k2OO7q3L5jK3m1Ljm5%N5n4L8
$$ 14 -3 -29 42 5 -2 7 1 25 -6 -14 36 -11 31 -10 15 -23 -11 9 31 0 -22 -16 51 -32 3 2 25 -16 -13 -14 -59 -59 -4 -58 -20
5156b0K2mj1j5N3p7N8p5O8k0L4j05J16k3k4L1LQl3N8j2j0%l0k0N5rKJ1l9klo7
$$ -20 2 -2 -13 -28 25 -52 6 -69 -1 -21 13 -92 24 1 -23 8 11 19 -14 44 32 22 22 -8 -28 27 18 20 31 -8 -10 -13 -80
5189h0R4l0K5M1q0L3jl6J8L4l1KL3m0Q1m5J6K5l4n7N8n0K8jOK0J9o1J01r0k4m2
$$ -80 14 -16 9 50 -30 3 2 -34 -16 18 -13 -11 22 -18 63 18 34 59 25 -32 26 -24 4 3 9 29 48 -13 88 -2 -26 -68
5221f8P5j6J4LK3k3m8J0j1P3l0J8m0M3k0j0K2Mm1KoO8j8L7q7J1j0J2J7q9N7O0
$$ -68 7 -9 5 8 31 8 -40 -30 -41 32 2 20 -20 23 3 -7 15 19 -22 -20 -26 42 24 61 -26 -15 -25 -13 4 -85 -28 32
5253C2n5L9m6K1j8N1mm5N5r2O6Jj4lL1j3j5J5j7J6j0K0k9QqM3j4p5J09n3k5j2
$$ 32 -23 16 -30 -9 -27 24 20 -25 30 -62 4 5 -9 -12 19 6 -9 6 -11 5 -5 15 -14 -6 -14 29 15 -60 49 -4 -29 -41
5285d1L9L6rJ9p0m5O5Pk6JL1m3K2L7m3Q5n5M0l1nJ6p3K3M3j5mk0j2n3P3p1R6l0
$$ -41 -2 34 25 44 -26 -71 -6 1 -25 -24 7 -36 -14 23 -20 65 10 50 19 14 30 -43 -20 23 8 4 -16 -28 -81 -8 -79 17 -13
5318a3K0m3nJ7m0O9k7j5P8o5L7kmKpj8k3M9l7ll9R2n7Q8p2RN5m8O6m9m6J8k9o
$$ -13 7 -36 -41 -24 -64 5 -22 -37 41 -24 13 11 7 9 2 -16 -39 10 -27 -30 -69 23 -34 54 -18 -9 46 -2 64 15 -31 -13 -42 -48
5352d8K5j1K0L4o7M8K3k6m2K9L0m2M2l6J0qJ6j3O4l2m5J7M6k4j6rJ2jl8K2P0n7
$$ -48 -23 -34 -14 20 -47 1 24 -2 -44 -15 15 -27 15 -21 -11 -19 -3 -16 48 16 -29 -12 34 10 -6 -15 -3 -4 -42 -20 50 -7
5384gj2L6L2j6k3j1jM2j8j0L3k2K2m2RN0n3m1N2j2rk4M1L4k6p7M5j0M3l0K5q1
$$ -7 -19 17 49 33 10 -1 -2 40 22 12 45 23 45 3 12 62 9 -32 20 8 -1 -25 16 50 24 -53 -8 -18 25 -5 20 -61
5416f1O5L3J2k1Jm8K1J6j1k5nj2M4l5M6k0K7m5L6k1j8K0l1P4o2L0m1j9J5l3M8
$$ -61 4 37 49 28 29 -19 2 18 7 -18 -23 -35 9 -26 20 0 27 -18 18 -3 -21 -1 -32 42 -20 10 -31 -50 -35 -68 -20
5447b0l8K5K0L3l9L0j2L0m6L9m3N1knl2Q2j5j9m7M4o5k4OP6n1N1m3k3M9m2L0j1
$$ -20 -58 -33 -13 20 -19 11 -1 29 -17 22 -21 30 28 23 -9 73 58 39 -8 36 -29 -53 -47 29 -22 29 -14 -37 12 -30 0 -11
5479a1K8l5J5k6oM2m2N4J4n2L9l0j9L8J2N3j03L9k7N9n2k1M7o6N1R5r7K9rkj7
$$ -11 17 -18 -3 -29 -35 7 -35 19 33 -19 20 -10 -29 9 21 74 -29 10 -17 42 -10 -31 16 -50 1 96 -1 28 19 17 0
5510@l2L1j4k4Q9j3m9qON9m0j7J4J2Jl6J1mK2M1r0N6o1O8j4K3J7o9J6k3P5m9k4
$$ 0 -32 -1 -15 -39 50 37 -12 -20 -14 45 5 -12 2 14 15 -21 -10 -14 8 49 -41 15 -46 22 8 31 48 -21 -5 -28 47 -2 -26
5543b6Q6l1J9o4O5Qk9k9Lj4rK0l3N0kJ9q3N5Mo3N5j6KMj2J7Kll6N1j9jJ4L9m3
$$ -26 60 29 48 -16 49 57 28 -1 2 -12 -21 -1 -34 16 14 33 -50 5 9 -54 1 -15 -13 -9 -21 -4 -2 -5 -41 10 -9 -10 4 43 0
5578@l0O8mn2RN0o7L5m9Q3k5l7kP6l9m0JmOJK9n4J6LpM4j9J2K3j16R5PqK6n5k
$$ 0 -30 38 34 -18 -9 41 -26 9 -40 43 18 -19 -21 55 16 -24 -23 -27 -21 -20 9 -45 -29 -26 -33 11 -8 4 27 -89 6 13 5 31 -24 -26
5614b6O7n4K0K8l7k6M9m5K4m9J9K0L3n1j1J00n7J1J2p1N0J4k6NK6l2k8P3jpk8
$$ -26 41 -13 7 35 -2 -28 21 -24 0 -49 -30 -10 23 -28 -39 61 4 15 27 -44 6 20 -6 -1 25 -7 -35 38 37 30 2
5645BMrK4n3L0k1J5LK8n5m2R2J4m2K9%k5K1o8P4J5n8L2q2R3J6j8J1kj1J2o9N9
$$ 2 6 -3 21 -32 -2 -23 -8 -5 23 -32 -74 18 32 -10 19 19 -6 15 -53 21 36 -22 10 -72 21 37 19 30 28 17 29 -40 19
5678A9L7nK2m2Op2j5N3l6L9l2j5M5J6j7jKK2l9K9M8r2N6j7K6p5J2LK1O0m0q6N4
$$ 19 56 51 73 31 37 -35 -50 3 -33 6 -26 -41 4 20 3 2 4 26 -13 16 64 -28 28 11 37 -38 -26 -23 -2 58 18 -68 -14
5711a4k0J6L1k8N8k8l2K4j5K1L9l5J5m1j5J9m0JL1K8m4J7lJ1K5m6Q7j14J9O5j5
$$ -14 -34 -18 13 -15 43 15 -17 7 -8 13 52 17 32 -9 -24 -5 -45 -44 -13 15 -29 -12 -15 -4 21 -25 62 -52 -33 32 17
5742A7m2LMJ4n3O0K4q8P0K2p1K6P2q1L4rL4n5nK3N2n1j4n2J09n9j3J5qmN7J1m2
$$ 17 -25 -22 -18 -4 -57 3 27 -61 9 31 -40 -14 58 -23 11 2 36 -19 -24 -1 51 0 -14 -66 43 -16 -29 -14 -22 -26 31 42 0
5775@j6o0J00K2o6P2n4K1l0lj4P4o8PL0M1l9l8P4j6Mm5oN3p4l2M1j5O2m9M0km5
$$ 0 -16 -76 24 46 -20 52 -2 19 -11 -14 -28 46 -22 -15 15 56 17 -21 53 37 41 -4 -10 43 -31 -63 -22 -37 25 -24 16 14 -31
5808c1M1m2j2P8o4O1qOn5N0j3l4K8j5j0O6nn5L4Jm5k9QN2Noj4LL3p7Q5o7N6J8
$$ -31 10 -32 -44 34 -30 31 23 29 -26 24 11 -23 5 -10 -20 46 41 -14 20 21 -24 -53 -45 7 12 6 -8 -5 28 -49 36 -31 25 43
5842D3n0JL6j2j1n7L9J7Lk6k0O1n4N8o5O5n3J5rM0p1K9N1k6l5J2O7n8%pJ2K1L1
$$ 43 -7 -6 30 18 7 -50 -11 6 9 -17 -37 24 -30 28 -37 28 -25 -10 -19 21 -50 -21 30 4 -31 -19 48 -10 -10 -17 -5 16 47
5875D7qm4M2j0l5K1j9L6m9K1m1K7J9J2k1k7PN6n2O8m7n9M0k8L1l5K8N4o4j2O0
$$ 47 39 -5 37 27 -8 13 -6 30 -19 2 -39 -12 7 19 -2 -29 -22 34 -18 50 3 -56 -16 -44 -13 -48 -20 34 -30 -42 18
5906A8m1J8KK8KK2m1pJ6n9Q2m7J0j5k2l2Q5ll0m2J18k0k1j9k3K2J1Ok2L3m3mJ2
$$ 18 -23 -5 -3 25 27 49 8 1 17 -42 40 -7 3 -12 -34 -66 19 16 -14 -56 62 42 21 2 -21 1 12 18 -4 29 -14 -18 -6
5939fL4j5l6O1m9j1K9om0O4j9Ll9L5m1K8M7l3k1N4k0l2N2j7l0j7Q8r1L7PPrl6
$$ -6 28 13 -23 38 -11 -22 7 1 -39 25 6 9 -30 5 -36 -8 39 6 -15 39 19 -13 39 22 -8 -25 63 -28 9 16 23 14 -22
5972b2L1k3rJj0J3L6k4k7L7K9k6pM0p5L7m8P4l0K3n4P2m8oRj2M6o6O7j0km3J9
$$ -22 9 -14 -23 -22 -32 -19 17 -7 -34 3 32 6 -1 39 -36 1 -47 27 -3 20 -34 38 -10 -16 -7 -19 27 -39 28 18 16 -27 -8
6005hM%K7k3M7n3j0K4l7J5Kj1l3M2nMK1kj9Ql6OJ3OJ5m2M0L0m1N7k0J2qj5l9N5
$$ -8 -4 -4 23 0 47 -6 -16 8 -29 -14 -12 -23 -56 -14 -19 -15 6 4 -15 -7 -43 -37 -24 -18 -3 -45 -5 25 -16 41 21 33 25 10 -29 26
6041B6Lj0n4M4N6o2k5qJ27q4l6J7M5n6J7j1Mj3qM5qLRk8j7N7q1O4j6j5l1J1O3
$$ 26 29 19 -35 9 65 3 -22 -30 97 13 -23 -6 39 -17 0 -11 -7 -20 -28 17 9 12 21 -7 -24 33 -48 16 0 -15 -46 -35 28
6074B8rm4P0j9j3l8k2Q2k8L4l9k3j0N9n0JK6kL0p0LO2qK8m4J8l4K1jm5M5k0LK5
$$ 28 19 -25 45 26 13 -25 -47 35 7 41 2 -21 -31 28 -22 -21 5 3 33 -37 -34 28 20 48 4 22 -12 9 8 -37 8 -12 -9 16
6108A6J3p7R8l6j8pK2j3J7j2Ml0K6j7N8p9Q9k3n1L1j7JN6q4K3J9m5P6n7NjO0o7
$$ 16 29 -48 50 14 -4 -11 11 -2 15 3 7 -23 3 -14 44 -35 54 31 -20 11 -6 -5 51 -33 -10 9 -36 40 -17 -12 -13 47 -20
6141b0RL7k6K5rJ7Ok2k1l6K9lM9n0K9m4J2NL1o0K0M6Qj0l2N5J8o2j3k8L0J5m6
$$ -20 -11 26 0 25 16 33 39 17 -4 -40 -11 -14 35 -15 14 -30 -18 -13 18 -42 -22 24 32 22 -10 45 63 1 -12 -40 -10 5 -41
6174d1N4J7pp4M9L9k7mL3j18P7m4M8J9m2K0J5k4l7P0r8P4Mk6n5M6P4o9K3l7J1
$$ -41 13 30 23 -51 -2 37 10 6 39 -79 -2 -46 2 21 -21 -1 14 -10 -47 23 -75 -1 3 -23 -78 -32 42 -27 -4 -41 -30
6205c0M1L3n8O8qo6J2J6JRnOk3j1K3Mk4K6m6k7K8K9n1N1Qk8J5l4j6m8Q4OJ2K3
$$ -30 11 44 -14 54 46 -20 -8 8 9 18 13 19 -4 -15 8 12 -12 14 -32 -59 -31 -2 -53 -2 6 -22 -7 -41 -57 -105 -21 -15 -3 20
6239B0qQK4o7L1J5l4JO6o4o1O4Pj5L8j20J34p3L5J6j1l6L0l6L0M9o3K1O8o2J7
$$ 20 12 20 44 -23 8 23 -11 -10 56 -8 -69 -5 2 -13 25 -95 39 -34 1 17 6 -30 0 -36 -6 43 -20 1 69 7 24
$$ [...]
8191C8
##END NTUPLES=NMR FID
##END=
