##TITLE=1H_LY-DMAA-Per4.16
 CDCl3
 8 sc, 
 11.03.2022
##JCAMPDX= 6.0         $$ Bruker NMR JCAMP-DX V2.0
##DATA TYPE= NMR FID
##DATA CLASS= NTUPLES
##ORIGIN= UXNMR, Bruker Analytische Messtechnik GmbH
##OWNER= root
$$ XWIN-NMR		Version 3.5
$$ Fri Mar 11 14:09:33 2022 Russian Standard Time (UT+4h)  she@DPX200
##.OBSERVE FREQUENCY= 200.131346
##.OBSERVE NUCLEUS= ^1H
##.DELAY= (6, 6)
##.ACQUISITION MODE= SIMULTANEOUS
##.ACQUISITION SCHEME= undefined
##.AVERAGES= 8
##.DIGITISER RES= 18
##SPECTROMETER/DATA SYSTEM= spect
##.PULSE SEQUENCE= zg30
##.SOLVENT NAME= CDCl3
##.SHIFT REFERENCE= (INTERNAL, CDCl3, 0, 15.7039)
##AUDIT TRAIL= $$ (NUMBER, WHEN, WHO, WHERE, WHAT)
$$ ##TITLE= Audit trail, XWIN-NMR		Version 3.5
$$ ##JCAMPDX= 5.01
$$ ##ORIGIN= Bruker BioSpin GmbH
$$ ##OWNER= she
$$ F:/spectra/data/she/nmr/H-F/1/audita.txt
$$ ##AUDIT TRAIL=  $$ (NUMBER, WHEN, WHO, WHERE, WHAT)
(   1,<2022-03-11 14:07:59.06 +0400>,<she>,<DPX200>,
      <created by zg, POWCHK disabled, PULCHK disabled
       configuration hash MD5:
       00 E9 B6 7A A2 85 ED C7 34 08 36 98 17 FE 4E 26
       data hash MD5: 16K
       6B D7 E4 44 22 E2 C5 FA 76 8E 06 B9 61 AA 2D 61>)
$$ ##END=
$$ 
$$ hash MD5
$$ DB 2A 89 84 DF 05 E5 68 F5 3A 12 28 F3 B0 CC 5C
##$RELAX= 
##$RELAX= 
##$RELAX= 
##$RELAX= 
##$RELAX= 
##$RELAX= 
$$ Bruker specific parameters
$$ --------------------------
##$DU= <F:/spectra>
##$EXPNO= 1
##$NAME= <H-F>
##$PROCNO= 1
##$TYPE= <nmr>
##$USER= <she>
##$AMP= (0..31)
100 100 100 100 100 100 100 100 100 100 100 100 100 100 100 100 100 100 
100 100 100 100 100 100 100 100 100 100 100 100 100 100 
##$AQSEQ= 0
##$AQ_mod= 1
##$AUNM= <au_zg>
##$AUTOPOS= <>
##$BF1= 200.13
##$BF2= 200.13
##$BF3= 200.13
##$BF4= 200.13
##$BF5= 200.13
##$BF6= 200.13
##$BF7= 200.13
##$BF8= 200.13
##$BYTORDA= 1
##$CFDGTYP= 0
##$CFRGTYP= 5
##$CHEMSTR= <none>
##$CNST= (0..31)
1 1 145 1 1 1 1 1 1 1 1 1 1 1 1 1 1 1 1 1 1 1 1 1 1 1 1 1 1 1 1 1 
##$CPDPRG= <>
##$CPDPRG1= <>
##$CPDPRG2= <>
##$CPDPRG3= <>
##$CPDPRG4= <mlev>
##$CPDPRG5= <mlev>
##$CPDPRG6= <mlev>
##$CPDPRG7= <mlev>
##$CPDPRG8= <mlev>
##$CPDPRGB= <>
##$CPDPRGT= <>
##$D= (0..31)
0 1.2 0 0 0 0 0 0 0 0.06 0 0.03 0 0 0 0 0.0002 0 0 0 0 0 0 0 0 0 0 0 0 
0 0 0 
##$DATE= 1646993278
##$DBL= (0..7)
120 120 120 120 120 120 120 120 
##$DBP= (0..7)
150 150 150 150 150 150 150 150 
##$DBP07= 0
##$DBPNAM0= <>
##$DBPNAM1= <>
##$DBPNAM2= <>
##$DBPNAM3= <>
##$DBPNAM4= <>
##$DBPNAM5= <>
##$DBPNAM6= <>
##$DBPNAM7= <>
##$DBPOAL= (0..7)
0.5 0.5 0.5 0.5 0.5 0.5 0.5 0.5 
##$DBPOFFS= (0..7)
0 0 0 0 0 0 0 0 
##$DE= 6
##$DECBNUC= <off>
##$DECIM= 32
##$DECNUC= <off>
##$DECSTAT= 4
##$DIGMOD= 1
##$DIGTYP= 9
##$DL= (0..7)
0 120 120 120 120 120 120 120 
##$DP= (0..7)
150 150 150 150 150 150 150 150 
##$DP07= 0
##$DPNAME0= <>
##$DPNAME1= <>
##$DPNAME2= <>
##$DPNAME3= <>
##$DPNAME4= <>
##$DPNAME5= <>
##$DPNAME6= <>
##$DPNAME7= <>
##$DPOAL= (0..7)
0.5 0.5 0.5 0.5 0.5 0.5 0.5 0.5 
##$DPOFFS= (0..7)
0 0 0 0 0 0 0 0 
##$DQDMODE= 0
##$DR= 18
##$DS= 0
##$DSLIST= <SSSSSSSSSSSSSSS>
$$ [...]
##$SUBNAM2= <"">
##$SUBNAM3= <"">
##$SUBNAM4= <"">
##$SUBNAM5= <"">
##$SUBNAM6= <"">
##$SUBNAM7= <"">
##$SUBNAM8= <"">
##$SUBNAM9= <"">
##$SW= 18.0517287032376
##$SWIBOX= (0..15)
0 0 2 0 0 0 0 0 0 0 0 0 0 0 0 0 
##$SW_h= 3612.71676300578
##$TD= 16384
##$TD0= 1
##$TE= 0
##$TE2= 300
##$TE3= 300
##$TEG= 300
##$TL= (0..7)
0 120 120 120 120 120 120 120 
##$TP= (0..7)
150 150 150 150 150 150 150 150 
##$TP07= 0
##$TPNAME0= <>
##$TPNAME1= <>
##$TPNAME2= <>
##$TPNAME3= <>
##$TPNAME4= <>
##$TPNAME5= <>
##$TPNAME6= <>
##$TPNAME7= <>
##$TPOAL= (0..7)
0.5 0.5 0.5 0.5 0.5 0.5 0.5 0.5 
##$TPOFFS= (0..7)
0 0 0 0 0 0 0 0 
##$TUNHIN= 0
##$TUNHOUT= 0
##$TUNXOUT= 0
##$USERA1= <user>
##$USERA2= <user>
##$USERA3= <user>
##$USERA4= <user>
##$USERA5= <user>
##$V9= 5
##$VALIST= <valist>
##$VCLIST= <CCCCCCCCCCCCCCC>
##$VD= 0
##$VDLIST= <DDDDDDDDDDDDDDD>
##$VPLIST= <PPPPPPPPPPPPPPP>
##$VTLIST= <TTTTTTTTTTTTTTT>
##$WBST= 1024
##$WBSW= 4
##$XGAIN= (0..3)
0 0 0 0 
##$XL= 0
##$YL= 0
##$YMAX_a= 478527
##$YMIN_a= -415753
##$ZGOPTNS= <>
##$ZL1= 120
##$ZL2= 120
##$ZL3= 120
##$ZL4= 120
##$ABSF1= 10
##$ABSF2= 0
##$ABSG= 5
##$ABSL= 3
##$ALPHA= 0
##$AQORDER= 0
##$ASSFAC= 0
##$ASSFACI= 0
##$ASSFACX= 0
##$ASSWID= 0
##$AUNMP= <proc_1d>
##$AZFE= 0.1
##$AZFW= 0.1
##$BCFW= 1
##$BC_mod= 2
##$BYTORDP= 1
##$COROFFS= 0
##$CY= 11.3945322036743
##$DATMOD= 1
##$DC= 2
##$DFILT= <>
##$DTYPP= 0
##$F1P= 2.36226072786647
##$F2P= -0.459571619588291
##$FCOR= 0.5
##$FTSIZE= 0
##$FT_mod= 4
##$GAMMA= 1
##$GB= 0.15
##$INTBC= 1
##$INTSCL= 1
##$ISEN= 128
##$LB= 0.24
##$LEV0= 0
##$LPBIN= 0
##$MAXI= 10000
##$MC2= 0
##$MEAN= 0
##$ME_mod= 0
##$MI= 1.114404
##$NCOEF= 0
##$NC_proc= 0
##$NLEV= 6
##$NOISF1= 3.799351
##$NOISF2= 2.8
##$NSP= 1
##$NTH_PI= 0
##$NZP= 0
##$OFFSET= 15.70392
##$PC= 1
##$PHC0= -16744.06
##$PHC1= 6.200781
##$PH_mod= 1
##$PKNL= yes
##$PPARMOD= 0
##$PSCAL= 0
##$PSIGN= 0
##$REVERSE= no
##$SF= 200.130013532006
##$SI= 16384
##$SIGF1= 3
##$SIGF2= 2
##$SINO= 400
##$SIOLD= 16384
##$SREGLST= <1H.CDCl3>
##$SSB= 0
##$STSI= 0
##$STSR= 0
##$SW_p= 3612.71676300578
##$SYMM= 0
##$S_DEV= 0
##$TDeff= 0
##$TDoff= 0
##$TI= <>
##$TILT= no
##$TM1= 0
##$TM2= 0
##$TOPLEV= 0
##$USERP1= <user>
##$USERP2= <user>
##$USERP3= <user>
##$USERP4= <user>
##$USERP5= <user>
##$WDW= 1
##$XDIM= 8192
##$YMAX_p= 0
##$YMIN_p= 0
$$ End of Bruker specific parameters
$$ ---------------------------------
##NTUPLES= NMR FID
##VAR_NAME=  TIME,          FID/REAL,        FID/IMAG
##SYMBOL=    X,             R,               I
##VAR_TYPE=  INDEPENDENT,   DEPENDENT,       DEPENDENT
##VAR_FORM=  AFFN,          ASDF,            ASDF
##VAR_DIM=   8192,          8192,            8192
##UNITS=     SECONDS,       ARBITRARY UNITS, ARBITRARY UNITS
##FACTOR=    0.0002768,     1,               1
##FIRST=     0,             0,               0
##LAST=      2.2672688,     0,               0
##MIN=       0,             -415753,         0
##MAX=       2.2672688,     478527,          0
$$ Real data points
##PAGE= N=1
##DATA TABLE= (X++(R..R)), XYDATA
$$ [...]
1511i512m233J9124M141j0945k327K061p78O140N360j3178j0237J8098J4731k0517
1525b072j8212K0551J9681j8507j8936J4856J5692j0363j0464N934L539k012M036
1538C723o84j1539K170J7954k384k2498J887K4557q08k4116N2K1215R2j6256O35
1553f000J0164k386l702M973k473q046P559J1031j1352j3403J3528J4494j4217
1566A70j4057J3569J2147j2303q468J0480L805q639J457P168o635n959J1224N020
1580H979j4547m160J6395L012j6498j563J5104m81j2520L117R111o241n489R449
1594C668J888j2314R95J4654l252j5842M718J5606n581j3663O011J0445o355o056
1608e078O965R53p701M106Q815q627j0035J2059J1147j4076j1618J4416J1075
$$ y = [-9512, -13745, 5379, 9520, -1425, -3752, -1691, -2469, 3671, 9031, -4147, -14384, 3714, 18445, -2072, -20284, 267, 19948, 1441, -17495, -2639, 13053, 2690, -7774, -1840, 1699, -313, 3723, 3039, -8500, -6330, 11624, 9240, -13258, -11371, 13186, 12378, -11738, -11686, 9529, 9621, -6635, -6000, 4164, 1778, -1924, 3049, 576, -7470, 89, 11120, -232, -13635, -107, 14387, 170, -13887, -318, 11829, -474, -8942, 1538, 5343, -3296, -1839, 5329, -1306, -7265, 3959, 8979, -5568, -9728, 6667, 9679, -6819, -8382, 6722, 6241, -6279, -3162, 5949, -292, -5781, 3668, 5556, -6758, -5763, 8891, 5639, -10203, -5485, 10121, 4540, -9123, -3112, 7333, 978, -5078, 1887, 2840, -4861, -755, 8060, -567, -10602, 1457, 12604, -1472, -13090, 1326, 12401]
1621A2401j3338r353J0880O366p770k225M568l029j402Q228p05j3445K101J7641
1635A0918k405k0220K021K0820j131j9221K07J5659K09j0210PL889j320K706L534
1650E463q838o395J3651R463j6639j2330J7636J3997j6431j4383J3576J2933r544
1663B159r743N203M903j068J189k265p538M338J3526n039j8261M409K1325k928
1677A0210k2079J022K0347P71j6520j799J0812J901m318q26k390j450Q556M467
1691H704j3428p672J6346J0636j7327j2573J6424J3118j3774j1987J0098R077
1703G642n836m823K004o08J288O273l415j1565M372J5766m312j8282L375J8813
1717A0692k282j7332J160J4104o69r459Q47M186j905J224L605n981n646R688P684
$$ y = [12401, -937, -10290, 590, 6956, -814, -3039, 1529, -1500, -2902, 5326, 4621, -8824, -6723, 10918, 8513, -11707, -9686, 11134, 10003, -9218, -9011, 6648, 6857, -3353, -3346, 543, -777, 1929, 5463, -3375, -9770, 3881, 13344, -3295, -15625, 2011, 16008, -423, -14806, -1230, 11703, 2159, -7584, -2381, 2522, 1454, 2643, 378, -7160, -2822, 10704, 5665, -12596, -8187, 13138, 10210, -11869, -10847, 9500, 10271, -6249, -8048, 2764, 4665, 347, -479, -2869, -4319, 4237, 8704, -4724, -12396, 3950, 14586, -2741, -15314, 1110, 14228, 454, -11533, -1435, 7642, 1806, -3017, -1013, -1621, -333, 5940, 2525, -9040, -4668, 11098, 6786, -11496, -8121, 10692, 8410, -8922, -7762, 6342, 5673, -3786, -2939, 1247, -658, 566, 4171, -1810, -7456, 2232, 9916]
1732I916j2070r041J2879R860j2563r275J1108P458q977m622O573Q88m302L177
1746A009K380p175r03J0415j4j2719N46J3618r30j3200J515J1421k296q592L456
1761a469N252n043j559O746j720q309M375R588o269j0102P125R774p353q256O928
1776b92N818o284k737N811j115n330M793N115q045n120J0469N191j1689n189J1795
1791C191M662j0606l571Q522J709n672Q34K735l976J69P158k466j0112L849J2514
1806H940m560j3717M405J3646l769j2118K801R162k014n115J657L54j819M419
1820B272K631q632l973J1868N633j3710p015J3984P852j2568p795R947O637o549
1834E82m326K834R88O35L013l479p187N262J0973n987j3839N538J5343m280j5262
$$ y = [9916, -2154, -11195, 1684, 11544, -1019, -10294, 814, 8272, -705, -5327, 1246, 2134, -2168, 1009, 3389, -3786, -4689, 5726, 5712, -7007, -6461, 7157, 6227, -6973, -5458, 5963, 3667, -4925, -1469, 3783, -1260, -2819, 3927, 2207, -6102, -1727, 7861, 1592, -8510, -1385, 8389, 1036, -7220, -292, 5526, -758, -3495, 2316, 1201, -4129, 664, 5779, -2266, -7386, 3083, 8274, -3415, -8604, 3191, 7853, -2753, -6324, 2198, 3907, -1765, -931, 1804, -2172, -2003, 5155, 2689, -7423, -3574, 8940, 4380, -9337, -4932, 8714, 4945, -7173, -4372, 4790, 2776, -2339, -682, -328, -2147, 2272, 4903, -3729, -7702, 4166, 9799, -3911, -10926, 3058, 10910, -1658, -9453, 494, 7131, 582, -3744, -910, 78, 713, 3726, 247, -6940, -1678, 9295, 3308, -10531, -4993, 10350, 6070, -9192]
1849i192K667J3428j012j0045k11N570P38m61l13m698q28R034K745j2316m721
1864i615J4055O553j4120p662J2508P848r826o790O288M529k688j214p92k575
1878c501L280O607m953j0023N488J2628n135j3817M184J3495k837j1663J601Q625
1892C979p41m731N68L54r73L837J913p313l304R856M640j1153n805J1246O172
1907H545j0227n648Q171M350n771k126L253p06r63L862r04o639K107Q909k560
1922C653j0410K781J0564k552r689K342P883k451n166K680K100l305R24M225l699
1937a20n196N702N973o925o366P378N976o947m966O154L238m971q94L841j784
1952I3k826M484K034o722j634Q412J406r203j308R027J034p958m71O009l76l720
$$ y = [-9192, -6525, 6903, 5891, -4154, -4365, 1205, 1943, 1482, 1169, -3529, -4357, 4677, 7422, -4894, -9615, 4440, 10993, -3127, -10789, 1719, 9567, -259, -7049, -761, 3768, 1080, -134, -926, -3501, -221, 6386, 1433, -8590, -3102, 9526, 4391, -9426, -5242, 8253, 5416, -6247, -4646, 3979, 3238, -1493, -925, -571, -1544, 2293, 4206, -3107, -6411, 3445, 8085, -3068, -8873, 2373, 8545, -1682, -7330, 841, 5191, -580, -2706, 547, -159, -1122, 2740, 1836, -4803, -2696, 6213, 3653, -6757, -3976, 6588, 4036, -5653, -3311, 4572, 2121, -3045, -365, 1735, -1570, -646, 3579, -120, -5316, 386, 6359, -566, -6932, 446, 6422, -525, -5491, 663, 3901, -1070, -1964, 1877, 93, -2733, 1751, 3785, -2937, -4571, 3841, 5247, -3956, -5264, 3763, 4797, -3161, -3632, 2377, 2001, -1719]
1968a719J783J132l566J374N269l252p002M511Q277n051q847M942Q532m182p173
1983d972L258M928k293j963J587j421j211M712J329p540j910R557K625j0525l438
1998g277J0350L863r023l800O741L098m031j543J115o23J639L270l949n780N216
2013g34Q182n642r814N274J0473m171r976K830Q151j295n531J94J994L96J735
2028B066k48n433l37Q271J491j0275k786J0992L924j0415m605Q728M596o210l748
2043c989L287K060k69L33k317l127M291N714n244p949N453R439m874r964L829
2058c327R228k479p528J187M862k78j704m1j779p5M827Q57p331j796Q895K843
2074F361r369l630Q818L957p371l549N371K383k961p20P08j465J194L761k603
$$ y = [-1719, 64, 1196, -2370, -996, 4273, 1021, -5981, -1470, 6807, 1756, -7091, -2149, 6383, 2201, -4972, -1714, 3214, 921, -1042, 545, -876, -2087, 2625, 3954, -3586, -5496, 4061, 6686, -3839, -7277, 3073, 6936, -2087, -5887, 854, 3952, -79, -1622, -507, -1130, 509, 3779, -170, -5950, -734, 7448, 1806, -8008, -2734, 7739, 3568, -6408, -3578, 4573, 3278, -2253, -2059, -65, 331, 2066, 1818, -3615, -3952, 4319, 5810, -4465, -7251, 3741, 7665, -2750, -7355, 1373, 5969, -241, -3989, -702, 1358, 1089, 1422, -895, -4022, 269, 5983, 739, -7210, -1757, 7682, 2808, -7156, -3327, 5901, 3422, -4106, -2919, 1943, 1665, -39, -80, -1859, -1934, 2893, 3750, -3581, -5377, 3518, 6361, -3008, -6638, 2180, 6137, -1234, -4783, 588, 2971, 10, -710, -2, -1467, -273, 3488, 885]
2089H85n786L326P190l405p963L031P941k658o755K068M958j675k724J675N0j749
2105a591K404K274m459k814N806L409o545l702O568L552n861k878M676J712l366
2120h15p3K013j901p69L680m6n391N37O497o26p038P08O712o10n768O98M160j005
2138I63k122J731n6k615K091L555l534m579M488N344m848n585M564N145l792m260
2154c510K912K510j831l93R34j959l75M230J98o111l33P337P66p816j174P435
2170B820J577o279j565M465J133k230k44n2j191K160K878l787m480M656N778m872
2186G67o739M436O882l423o308K253M841j023k690L5J09N71K604n87n040K01O988
2203C877N28q114j361Q290K084p480k537N870K476l777j877J370O73R95R18k986
$$ y = [885, -4901, -1575, 5615, 2210, -5753, -2722, 5219, 2561, -4194, -2126, 2832, 1157, -1567, 108, 158, -1591, 813, 3087, -1372, -4186, 1620, 5029, -1516, -5218, 1350, 4902, -959, -3837, 839, 2551, -815, -888, 1125, -776, -1545, 2135, 2089, -3302, -2765, 3732, 3106, -3932, -3224, 3488, 2878, -2890, -2192, 1968, 963, -1159, 572, 516, -2099, -8, 3547, 13, -4566, -78, 5266, 418, -5167, -603, 4542, 750, -3510, -598, 1912, 81, -312, 622, -1337, -1712, 2518, 2716, -3395, -3728, 3609, 4375, -3441, -4615, 2820, 4397, -1882, -3447, 1018, 2151, -79, -323, -375, -1566, 594, 3472, -315, -4795, -139, 5639, 767, -5972, -1536, 5346, 1923, -4385, -2132, 2709, 1686, -1004, -969, -860, -289, 2315, 1728, -3312, -3111, 3877, 4405, -3709, -5070, 3220, 5304, -2176, -4713, 1157, 3633, -144, -2021, -651, 22, 1017, 1935, -1051]
2219a051k696M282M488m948n942M941O722m180o793L087O015j801m485O73K369
2234F81J42K10n67k701M85M896K6o539p57P270J556p263k108O380K308m947k022
2251b950L053J175r36J1r20j577K366L220l321m531L722N494l532n845L005N509
2267C943k327m461J565K943r88r38O04j123o03L008Q09m539j213N435J698n783
2283a970j975N401K005m555j567L236Q77j830K88M98j698O73L054j415m176J777
2299a377M897j686n255J545M845j212l964J046K488r82q48J118r18j441K410J998
2315B664l610k541M310K939m436l104M144K857l339k259K377J152j221K53K71
2330D57j801M24L364q51m577Q65N362n74n659K63N163R9m219l10K704K39r48J87
$$ y = [-1051, -3747, 535, 5023, 75, -5867, -926, 5796, 1616, -5177, -2090, 3925, 2124, -2361, -1688, 681, 823, 1033, 466, -2235, -1750, 3146, 3172, -3367, -4124, 3146, 4702, -2561, -4669, 1711, 4019, -928, -2950, 103, 1278, 342, 353, -567, -2144, 222, 3442, 121, -4410, -688, 4806, 1274, -4571, -1566, 3943, 1616, -2845, -1280, 1663, 675, -263, 341, -782, -1385, 1623, 2432, -2107, -3320, 2115, 3813, -1970, -3945, 1456, 3461, -1094, -2661, 575, 1452, -378, -90, 408, -1290, -617, 2437, 1022, -3154, -1377, 3520, 1834, -3421, -1876, 2969, 1757, -2207, -1161, 1327, 345, -503, 615, -303, -1744, 666, 2664, -946, -3487, 823, 3762, -674, -3778, 366, 3223, -116, -2375, 2, 1154, -67, 186, 457, -1344, -920, 2444, 1593, -2984, -2119, 3243, 2669, -2990, -2727, 2436, 2535, -1684, -1994, 710, 949, 1, 188]
2348A88q23q95K341J868l557k868M273L655m273m173L834M196k903l693J898K646
2364A714p78j051k56p84Q65K604j104m223R24N382n38n964l3N864O25n109j120
2381b982L860J100j990q45J04K42J595Q42l074j984M018L135m391l963M121M398
2397D186l382m369K401L622j195k428J75P47N81J061r92k841J048M311p93n179
2413c047J40N588M67n233r58M357J258l023j167J493O40J61K40j721j204K781
2429G72K324l495l227L627L785l345l911K604L578j781k745R97J381k25N9j52
2445B46j622L28L017j91m012j07M578M75m530q94M080J004l045r00J900L92o01
2462A18K96n55j256J469K192k077k987K242L517k204l592J766L301j301k528R03
$$ y = [188, -635, -1530, 811, 2679, -878, -3746, 527, 4182, -91, -4264, -430, 3766, 863, -2830, -932, 1714, 936, -115, -371, -1155, -290, 2314, 1210, -3013, -2089, 3293, 2755, -3209, -3242, 2622, 3247, -1862, -2982, 878, 1978, -12, -857, -753, -511, 1084, 1926, -1148, -3132, 886, 4021, -370, -4333, -212, 4186, 804, -3565, -1164, 2458, 1263, -1165, -990, -243, 338, 1399, 407, -2434, -1386, 2925, 2132, -3047, -2907, 2681, 3148, -2085, -3043, 1314, 2572, -451, -1618, -125, 515, 676, 916, -805, -2009, 772, 3096, -399, -3626, 1, 3786, 441, -3470, -866, 2712, 931, -1814, -817, 564, 339, 398, 246, -1376, -1048, 1969, 1778, -2234, -2341, 2237, 2712, -1818, -2712, 1368, 2372, -673, -1573, 327, 719, 118, 414, -141, -1397, 72, 2264, 187, -2800, -558, 2959, 755, -2837, -1071, 2230, 929, -1599, -696]
2478f96J429n67j07L91j200m34K437O70l244j015L711J349l764j535L339J439
2494B203k576j123J601M75n54L84l82j427J045K393j358l245J467L782j300l810
2510b425Q79L486m61k720J57J531J7j40N9j137m39K320R39l182j508L539K050
2527B965l557k356L003K463k314k107J429J328l89l01n65q29J175K040j293l218
2543b526J321L940j036m203N79L965M1l396m20K289N94q06o12n28J60J789M63
2560A614k829j217L415J945l553k522L242K740k525k650J640K058n87j144k66
2575f39oR40J236j255k424J309L410j036l991N98M026m2l682m51K842P25j757
2592a97o89M25M56Q64K3j966p36K674J568l098k129L016K554k591k585J880K275
$$ y = [-696, 733, 166, 59, 450, -750, -1184, 1253, 1923, -1321, -2336, 1375, 2724, -1040, -2575, 764, 2203, -373, -1496, 105, 580, 26, 410, 28, -1399, -354, 2039, 681, -2564, -1097, 2685, 1385, -2425, -1546, 1940, 1479, -1241, -1084, 447, 464, 324, 383, -754, -1193, 1127, 2066, -1116, -2624, 915, 2965, -592, -2948, 55, 2518, 204, -1903, -474, 854, 465, 164, -401, -1230, -55, 1985, 692, -2526, -1205, 2735, 1699, -2504, -1925, 2040, 2081, -1315, -1735, 554, 1148, 342, -270, -798, -638, 1151, 1614, -1215, -2432, 983, 2928, -625, -3147, 95, 2835, 310, -2340, -700, 1358, 771, -373, -639, -645, 295, 1531, 276, -2148, -839, 2571, 1535, -2456, -1858, 2168, 2126, -1556, -2007, 835, 1560, -197, -886, -461, -5, 859, 882, -1084, -1820, 854, 2422, -676, -2805, 211, 2765, 174, -2411, -531, 1744]
2609A744j022j566K56N74M02M92p78j619Q55K576o40l254L20L548M3l374m35K771
2627H93O02j866o00Q55L10K11J90j170p32J787J454k186j967K158K420j976k476
2644b093J571K174r72j627M46P18o0K38j68j263K39K101r6k713j60K994M65k830
2662a036p64K366Q49j625p31Q68L17O8K21q14r17J387J608j607k208J586K536
2679B104j364k589R23K266m98j613K1Q87J58J51k71j058J6J950K44k500o40K731
2697I18J061k653j307K296J336j551j237Q67O91O7n4p80o71J111J606j422k242
2714a964J341K646j022k824O59K497j15k075k45J231N04k63m47q05K70J708J58
2731A254k362o32K724J111k670j517K285J754j691j662R35J226j43o09n58j92
$$ y = [1744, 722, -844, -588, -14, 388, 880, 102, -1517, -662, 1914, 1274, -1980, -1660, 1888, 1931, -1443, -1878, 893, 1495, -371, -971, -116, 194, 405, 595, -575, -1307, 480, 1934, -252, -2219, -61, 2359, 383, -2093, -522, 1652, 680, -947, -501, 217, 157, 395, 227, -1036, -797, 1304, 1208, -1505, -1665, 1329, 1794, -1036, -1800, 566, 1415, -210, -941, -73, 244, 312, 533, -281, -1198, 189, 1797, 190, -2018, -432, 2104, 740, -1849, -926, 1340, 842, -771, -750, 137, 295, 446, 175, -883, -867, 1083, 1327, -1173, -1813, 918, 1979, -674, -1981, 315, 1651, 100, -1137, -270, 421, 488, 434, -346, -1017, 94, 1700, 278, -1964, -623, 2023, 1001, -1823, -1164, 1333, 1218, -857, -1102, 129, 633, 370, -77, -882, -612, 1096, 1254, -1108, -1740, 984, 2095, -575, -2092, 193, 1947, 256, -1406, -471, 755, 612, 3, -555, -747]
2747g47J072J048j283j823J206K434r83k798O10K658o1k348l18J731N93q18o13
2764d40j87M68J053n8j780m32K292R16k372j459K153J757j743j700J093J402m50
2781E13q54k44J68P19O12r67j404J035J983p11k404M17K519p2k275k94J767N73
2799A081j044o14K45M06N66q2j236m54J707Q78j868j331J772J614j435j677R97
2816d75J427m62r58m3M00L67L98o21j017N32J700l46k112R5K201K47k077m54J620
2835D22N72j001n50K87L13M03M9r71n78J297J084j485j422J336J728j074j738
2852a328O79J527k50j099p8N40L32K56m83r91L81J526j04j930j50J979N46j868
2870e15q53J559Q77r80q48M06M78L26m0q00n34J106J116j271j530J175J797q58
$$ y = [-747, 325, 1373, 90, -1733, -527, 1907, 924, -1874, -1264, 1394, 1333, -1015, -1333, 398, 991, 173, -440, -627, -159, 894, 836, -944, -1376, 916, 1832, -540, -1999, 154, 1911, 168, -1532, -439, 963, 513, -341, -585, -417, 302, 914, -53, -1457, -422, 1561, 850, -1554, -1137, 1382, 1310, -965, -1259, 508, 1081, 37, -577, -332, 74, 640, 558, -678, -1132, 575, 1453, -415, -1746, 26, 1640, 205, -1472, -475, 952, 490, -468, -511, -111, 256, 654, 33, -984, -452, 1248, 902, -1210, -1115, 1086, 1333, -744, -1198, 422, 994, -7, -557, -270, 43, 446, 495, -476, -1054, 243, 1327, -158, -1580, -244, 1484, 410, -1328, -649, 878, 628, -471, -549, -9, 323, 579, 96, -895, -514, 1012, 908, -1022, -1172, 807, 1353, -515, -1368, 191, 1068, 88, -760, -354, 124, 450, 410, -390, -924, 182, 1298, 27, -1503, -328, 1469, 611]
2888F11j883M89J750r0j262k96O00M63J61n91p59L59J454j37j825k64J946O15
2906A341j826r59J524J072r80j113N59P51J34l09o62k27J057P71j133j325J045
2923b80J721p83j836L43J799l5j459k86R20M96k60n82m80M22J089j88j478j95
2941a072J750N76j696r57J494J097j029j188N88R23N8n38m98O5P78M80q80j045
2959a094Q20J507p18j681M22J630l4j443k70J061M11m98n22n9L78O95j31j174
2977g00j99J436N82j477q87J289J161r88j152N85R81j33o72k81J90N69L92p36
2995d0q99O67J349n69j528J95J560R9j318l54R47O08n73n18n0M39N57j36r85k46
3015g95J188O29j246q65J085J127q75j133N03R60r5p08k65K97M68K13m95q19N61
$$ y = [611, -1272, -783, 967, 877, -385, -681, -81, 382, 543, -48, -807, -448, 1006, 869, -956, -1220, 726, 1341, -485, -1444, 80, 1152, 172, -941, -382, 369, 503, 194, -468, -695, 362, 1133, 0, -1325, -280, 1441, 658, -1178, -835, 964, 929, -530, -816, 104, 600, 340, -242, -722, -300, 789, 601, -877, -1072, 678, 1254, -442, -1399, 95, 1192, 163, -1025, -437, 486, 544, 6, -492, -427, 351, 831, -49, -1094, -274, 1233, 515, -1166, -744, 886, 852, -591, -861, 200, 611, 113, -409, -468, -90, 605, 474, -700, -899, 537, 1119, -358, -1245, 44, 1205, 217, -935, -350, 631, 498, -174, -455, -265, 304, 696, -40, -939, -272, 1077, 508, -1020, -825, 735, 834, -484, -838, 109, 717, 144, -374, -424, 15, 572, 436, -549, -795, 393, 1022, -224, -1089, -4, 1123, 248, -885, -382, 578, 483, -225, -490, -193, 275, 488, -7, -826, -265]
3034b65J155l58j447N4J518K34j288m75R83O35n76n94O7M21M10j03q73j75J042
3053C65O01j026j010R55J189p25j277M01J086r0p21l50M62M90J01n66n99N01J027
3072H14k91j303J5J376L20j328n36J040P22o49o90J33N90L25l04o80o9Q95M66
3091H46j000q24Q38J137o85j210L52J142L3r64k92N39N12j09n29m08M62R01k88
3110D53j150M5J230K82j238m99J003O75o51p09K40N91K17m29n36N2P43L54q44
3129a71p46Q39R50n29j152L00J086L6r21k89O84M20k13n38k44M06O90k38r13q8
3149f31J105L02j071o26R99O81o42p44K24P50L9m19l88O6O29L34p43n77O10R06
3169H04m26j046K04J006O7r01k80O04L93k30m19j91L91N17k17q42k5R77K84r58
$$ y = [-265, 890, 532, -915, -861, 657, 891, -397, -872, 111, 746, 170, -424, -357, 64, 474, 371, -502, -677, 365, 966, -60, -1070, -115, 1074, 349, -928, -527, 559, 469, -252, -602, -140, 350, 451, -115, -714, -213, 814, 523, -780, -765, 611, 931, -397, -933, 107, 829, 180, -510, -377, 213, 538, 234, -446, -515, 380, 846, -154, -978, -140, 997, 312, -898, -546, 596, 629, -335, -627, -88, 424, 315, -214, -622, -160, 741, 453, -697, -652, 578, 860, -378, -877, 126, 801, 150, -559, -319, 272, 489, 60, -476, -424, 319, 673, -171, -917, -78, 872, 343, -809, -509, 577, 613, -308, -597, 87, 507, 294, -244, -488, -82, 608, 370, -543, -631, 474, 776, -295, -921, 78, 759, 117, -627, -403, 347, 386, -33, -421, -355, 274, 608, -135, -712, -102, 804, 378, -668, -464, 542, 609, -292, -572, 32, 425, 195, -224, -415, -24, 493, 276, -566, -591, 386, 670, -288]
3189b88n24Q02O44m85p64K38P13N0m77k80J53N48J84o32n30N22Q58l66j024J73
3209d85J014J28r23l26O20N06l46n05j10M63L80k09p10KQ41K49p93n14O95P44
3229G21n30p87K55P92j7m98l29K28M97R4n51m18N13O64l17r18O9R20J75q22l65
3250f24O13M73k96n87O1M10L48k36o15L9P43K84p86m51N68Q14n00q33K03P87M8
3271D63n82l15L46L94K2n07l37M64N83k86q29R7Q75J09p91l33O32M96l78m99Q5
3292b91M10K18k74m48O4O22K49p25m25N54O75l85p96K33O95M9n90k80L67L98p0
3313B50m35k79L97N62l29n90j2P59K33q08l01N82M67k71n65Q8M58J94m13l60J57
3334b16N37J05n78m51N57O32m29p00J84P21L4o05k67M40M13j34m99j61M27N20
$$ y = [-288, -812, -10, 634, 149, -615, -377, 336, 386, -91, -371, -218, 330, 514, -118, -648, -126, 732, 366, -658, -485, 529, 657, -266, -592, 28, 534, 188, -317, -427, 36, 416, 207, -503, -501, 340, 589, -204, -718, -23, 721, 191, -596, -341, 451, 434, -64, -393, -165, 332, 426, -125, -543, -30, 634, 317, -601, -532, 388, 563, -259, -624, -11, 462, 166, -421, -360, 50, 398, 162, -453, -414, 329, 613, -173, -624, -56, 758, 258, -575, -372, 415, 463, -119, -434, -88, 306, 328, -179, -516, -52, 531, 245, -584, -487, 388, 497, -294, -627, 5, 501, 123, -376, -291, 119, 337, 63, -385, -321, 301, 550, -175, -600, -46, 629, 244, -552, -319, 376, 425, -165, -445, -78, 320, 250, -185, -464, -67, 495, 166, -424, -436, 323, 556, -252, -553, 29, 496, 225, -340, -252, 206, 400, -13, -373, -216, 321, 426, -152, -603, -46, 586, 157, -543, -359, 362, 396, -209, -476, -36, 377, 243, -256, -417, 10, 530]
3354E30l25o11O1O91J45o03l99M99N24l61n80J57N28J10l22m19J25N54J30o40
3374b06l64M71O39l66o53J28O58J80o65k70M02M50j98m58j65M91L69l30m92Q4
3394b95O03J22o36l05M67N24l06n81P1N23J63l95l73J73N25Qn15k64M39N52l79
3415A21n90J92O02P8n90l06N15M02j63n21m7M22K78k83m66J06N29J23n28l63M68
3436b1M55k70n40O9N76Q1m24l36K87L81N6m46l02N04L50k42n52R3N61P9m82l37
3458d60M57M03k40l85q9L74K87k57m46K1N90J30n70k49M25L83k73n16J45M70J38
3479C38l71k90K84L59m2m35j87M41L16k90m01MN54O8n08k60L62M42j63m90m4M15
3501A02K25l39l00O2M53J28m90k18M03L77k52m70O2M61J71l86l02K35L41j0m03
$$ y = [530, 205, -406, -345, 346, 491, -112, -511, -12, 512, 151, -429, -272, 256, 366, 44, -375, -250, 304, 434, -206, -570, -99, 540, 174, -479, -351, 307, 487, -178, -448, -46, 404, 206, -252, -417, 74, 443, 113, -379, -295, 308, 430, -206, -511, -44, 480, 174, -407, -336, 187, 350, -45, -418, -245, 280, 288, -227, -491, -52, 500, 121, -469, -277, 325, 403, -187, -493, 22, 424, 261, -260, -307, 115, 393, 110, -356, -250, 279, 402, -126, -489, -21, 434, 164, -376, -307, 269, 350, -74, -410, -123, 258, 314, -132, -434, 70, 420, 178, -374, -281, 280, 359, -123, -460, -3, 400, 160, -225, -314, 60, 347, 90, -356, -335, 255, 385, -185, -434, -9, 374, 101, -415, -270, 200, 338, -33, -323, -39, 320, 278, -157, -344, 97, 413, 123, -278, -274, 280, 348, -160, -420, -58, 384, 221, -269, -313, 102, 327, -12, -312, -250, 203, 331, -159, -377, 26, 403, 151, -319, -257, 204, 375, -11, -313, -78, 263, 253, -150]
3522a50j69L14L86k15m48jM78J45m63k68L50M01k23m32m1M72J35k51l28J04M61
3543B57O4m60k24M06L51k24m60K9M74J59m27k56K99K63m0m13j35M11K95k53m66
3564c50J38M53N7m40k43M19L40k19m61P2L88K08l22l66K11L82j1m12j72L92L25
3585C89k53m81J02M81O3l91k35K79L40j49l20j59M16K22k36l12L7M40M8m34j94
3606c47L23L39j77m13N9L51J79k95l13J84M18p4l97j63L02L34k27l97Q8M30P7
3627B81m20j65J84L77p6l71m7L27J97k09l79J46L75J2l14j59K39L00j82l37J6
3648b05L12J89l31k45J74L41j05l05o9K47K85k41l34N9L69Q8k85k25K55K94n3
3669B15m08m7K71K83k49l27J56L33l3k74j67K33K86j94l05L1L42J64l90j58J25
$$ y = [-150, -319, -5, 381, 166, -282, -283, 195, 340, -123, -391, -41, 360, 137, -295, -336, 136, 271, 20, -308, -204, 257, 321, -139, -363, 43, 394, 170, -290, -261, 213, 372, -55, -311, -12, 251, 211, -202, -337, 74, 369, 116, -350, -212, 241, 298, -142, -385, 34, 374, 155, -306, -234, 154, 362, 40, -326, -115, 267, 256, -156, -328, 64, 389, 136, -345, -243, 238, 301, -90, -325, -46, 294, 145, -175, -334, 82, 304, 68, -244, -207, 233, 281, -153, -347, -24, 315, 138, -275, -216, 135, 314, 19, -294, -110, 308, 234, -163, -326, -24, 310, 83, -314, -226, 204, 281, -139, -304, -120, 257, 181, -190, -237, 90, 287, 78, -301, -155, 220, 232, -82, -241, -2, 298, 116, -221, -205, 107, 296, -35, -280, -106, 235, 130, -175, -244, 3, 288, 47, -287, -228, 141, 229, -56, -281, -26, 268, 215, -193, -240, 31, 314, 65, -262, -106, 227, 194, -80, -247, -14, 272, 78, -227, -196, 146, 310, -80, -238, -113]
3690a13L67l7l79p3K48K76k45k81O1L44J46l38k44K18K95p4m33J9L23J46k44k61
3712b79J79K73O7l49j24K01K83j34l51K5L64N3k36k67J65L56k6l59p4K93K20k01
3734G9l85J98L01J3l00j39K46K49r2l27r9L62J43k75k47J43L29o2k78q7K18K36
3756B26j13l39oL32J15k32k66K25K70q0k71m9K68J76j70k97O7L13qk67j22J60
3778f8K96j13l06j7K69J84k75j80J34K54l8l01q3K89J72j08l03K8K50J30k45j85
3800b16J70K71r7k58m6K64J35k05k17J09K51j9k28j18J72K20n9l62N8K91R1k36
3822b9j97J70K46l7k67o3K12J87j45k17J9K19O9j58k31R9L12m7l07l6K17J65j43
3845C8k74Q7K94O3k97j27J70K21m9k83K9K60P4j69k48J62L14j13l02k6K46J22
$$ y = [-113, 254, 217, -162, -235, 13, 289, 44, -237, -176, 168, 314, -24, -268, -50, 245, 171, -262, -243, 80, 226, -18, -279, -100, 173, 240, -109, -233, -32, 251, 117, -234, -209, 155, 208, -28, -295, -130, 226, 200, -159, -233, 60, 280, 79, -306, -108, 193, 206, -94, -233, 13, 262, 170, -157, -256, 106, 249, -26, -273, -130, 199, 137, -141, -228, -10, 226, 113, -226, -232, 100, 215, -17, -283, -58, 212, 132, -139, -188, 80, 256, 86, -211, -144, 169, 161, -106, -228, -68, 228, 115, -191, -208, 61, 245, -30, -210, -76, 178, 140, -161, -244, 45, 217, 109, -194, -166, 84, 214, -31, -216, -46, 225, 128, -130, -176, 88, 223, 18, -199, -90, 161, 142, -86, -204, -32, 188, 129, -233, -175, 116, 207, -29, -226, -56, 190, 153, -114, -177, 35, 222, 77, -140, -121, 98, 167, 9, -222, -123, 189, 142, -165, -201, 16, 181, 38, -236, -149, 145, 208, -89, -216, -46, 175, 126, -157, -128, 132, 206, 37, -211, -49, 265, 152, -150, -176, 70, 192]
3867A92j59k30P8J92J31k48j27J18J63M9l27l5K65J54j69k52P8K62M2k50j06J89
3889A0K27j13k47k3K29J33j88k27J44K18k2k70k1J74J51j04k48N9K19L2j94j70
3911b31J86J58Nk52m9K45J21k20k04J30K86m0l08L5J50J25p6j87J7J75J11j86
3933ij84J39K11q7j84j8K02J27j74k16J10K08j4j65k6JK64j23j81l1K26J32k20
3956a2j71J24K62l9k80k6J52J08q1j78N4J69N7j52k19J08K89j9l02j8K46Q6j42
3979A6j88J23K17Kj99p5O4J82k4k12j0J95J07k00j89J21K19n7k03m5J30J10n3
4002C1j28l3J84J03j81j79R4K64o3j63r2K16J28j60j63P0J65N1j57j06R6J54r
4025A22k13m2J09J63j56j60J53J79o4k17j4J09J62j47j09O5J11J01j90j22M4K67
$$ y = [192, 33, -197, -119, 73, 204, -44, -171, -53, 110, 159, -168, -203, 62, 216, 47, -205, -127, 135, 177, -73, -179, 10, 237, 124, -123, -146, 83, 216, 28, -199, -55, 163, 141, -129, -150, 24, 175, 71, -177, -118, 101, 133, -61, -231, -45, 113, 118, -134, -183, 62, 183, -37, -241, -111, 175, 135, -173, -138, 12, 137, 61, -126, -109, 66, 177, -9, -193, -54, 157, 70, -114, -132, 70, 197, 23, -193, -83, 125, 111, -54, -80, -79, 185, 62, -119, -150, 76, 208, -12, -183, -59, 203, 164, -116, -142, 10, 118, 37, -141, -87, 82, 139, -13, -232, -124, 165, 146, -156, -174, 72, 158, 16, -172, -49, 168, 170, -29, -104, -40, 142, 118, -94, -104, 91, 198, -2, -191, -70, 149, 92, -111, -156, -26, 84, 31, -97, -130, 54, 157, -24, -203, -109, 155, 92, -71, -163, 53, 181, 21, -142, -72, 93, 144, -13, -119, -23, 131, 122, -91, -133, -24, 139, -17, -177, -24, 155, 91, -126, -140, -31, 131, -16, -125, -60, 51, 152, -38, -160, -116, 151]
4047A51j3k01n0J92P5j31j68Q8J78ok45j3J29J64j06j44J1J52R7j62j48Q4J94
4070A28K1k20o4J82J29j45o7l0J52L2j45q6P5K18j04j85n0K18Q7k09j19J29J53
4093A00n6j14m9J19J8Nj50pK23M9q5k14J20J61Qk12n3J94O9j00j66J26J00%j15
4118b9j46J78J20l7j28j41K18Q4j38j23M7K18m5j38k8R4J41j33p5j7J53P0j04
4141D1j87J37J26L2k56k0K20O0r7r3L7J21n7m7j14l3K69j01j19o8K34N6k04r7
4165a60J09J90j28j29O9J49l1K5j45JQ4M3p9j49J05J82q9j86j5K90Jj72n0L6J38
4190H9%p9q7O9J19k3j76k5J45Q5j36j25Q3J59k8j36j0J06R2q1j26pJ26J11j13
4215C2k07R2K15k1j98n7J95J01j83p6R9O8k9q7NL6Q0rj22n0J78M5j16j05N0J84
$$ y = [151, 138, -63, -113, 79, 154, 23, -145, -57, 121, 115, -130, -143, -14, 150, 44, -100, -89, 63, 160, -2, -150, -66, 128, 149, -71, -135, 47, 176, 31, -36, -66, 86, 118, -27, -113, -38, 180, 76, -109, -159, 59, 146, -63, -182, -53, 100, 44, -70, -119, 0, 18, 23, -127, -134, 89, 138, 53, -161, -41, 120, 128, -84, -137, 57, 126, 26, -140, -14, 86, 86, -29, -175, 3, 123, 86, -42, -183, 35, 119, -19, -142, -95, 123, 78, -60, -88, 6, 147, 14, -61, -78, 75, 145, 41, -146, -9, 117, 149, -107, -127, 93, 153, 56, -37, 0, 121, 64, 17, -97, -130, 139, 38, -81, -149, 85, 141, -63, -160, -51, 139, 11, -118, -49, 100, 69, 94, -51, -50, 34, 77, -2, -151, -46, 136, 47, -139, -154, 136, 137, -35, -85, -49, 89, 89, 10, -77, -8, 111, 88, -88, -113, 32, 117, -19, -144, -61, 98, 70, -66, -76, 30, 122, 41, -85, -92, 34, 145, 32, -175, -83, 132, 111, -87, -144, 51, 152, -31, -107, -8, 60, 31, -56, -51, -15, 65, 56, -66, -116, 62, 107, -9, -114, -64, 120]
4241A20k5j60j4J02Q9j49K8j4N3P1j10j01RK27l5j65o0J65O6j87j6O6R5pp0LK6
4268GQ6K2j98l7J57J22j44j61N1K11k5j71m3J53M7j03j06Q6Q1L0r5k9K7J32m1
4293E9j29n3K12J1j50m9O7J02K5j15l7R1O1l1j31k2J56%o8j29M6J72m2j49K5P9
4319AR5j28j13Q6J07L9q8p4L6Q9Q0k04l3J72L1j23r4J15M9pj07J6O7L2m6o9LP5
4347GO2r4r6N1J31m6q2RJ47qp2l7N1N2n7q4OQ7Q8j01m6l7L6J00k3j71J14N2j5
4376B4o3k6P6K2k8m6l5N8J05r3q4K1J50k7j50K0J45M1j07r3J04K9K9m8p8N4J04
4403A04m8q5n7J24P3r2j08Q7R7n5j14k4P2O5ol4k4O1L3m9r1O2P5J6j18m0Q5P4
4431H3p8j37J14M1N6j34k1O1P6k2r1l7P4P3p2n2N0J08Lj78M8O0mk6o8R1K4j1l1
$$ y = [120, 95, -65, -79, 23, 112, -37, -9, -23, 30, 101, -9, -110, -101, 126, 91, -74, -134, 31, 97, -90, -106, -40, 55, 48, -22, -19, 7, 93, 115, -83, -120, 37, 159, 15, -146, -95, 116, 91, -80, -123, 30, 77, -26, -132, -46, 35, 65, -30, -59, -32, 100, 59, -70, -123, 89, 100, -50, -99, -32, 70, 95, -20, -57, 34, 95, 64, -67, -89, 67, 67, -1, -130, -84, 88, 46, -103, -78, 1, 96, -32, -145, -59, 48, 87, -1, -75, -39, 50, 130, -74, -107, 65, 96, -27, -121, -6, 43, 36, -71, -55, 12, 44, -2, -71, -68, 7, 69, -25, -121, -70, 61, 15, -67, -58, 89, 81, 9, -28, 23, 75, 18, -66, -60, 27, 115, 14, -32, -69, -33, 67, 44, -127, -13, 39, 24, -39, -65, 11, 33, 5, -41, -76, -18, 87, -6, -90, -69, 81, 54, -96, -76, 69, 110, 3, -90, 14, 43, 72, 24, -54, 0, 104, 56, -29, -86, 38, 111, 19, -89, -2, 95, 40, -74, -98, -26, 39, 33, -1, -25, 36, 69, 20, -71, -9, 66, 82, -36, -76, 9, 83, 5, -132, -18, 23, 79, -55, -76, -15, 61, 39, -52, -89, -15, 58, -14, -66, -16, 92, 95, -83, -35, 25, 21, -5, -73, 18, 42, 31, 0]
4460@m2QJ60j08r1oO7Q4r6q0J32Rk6j8l6O4j4O0j24m7J50L3l9j26O2J22l7q3m
4489b6R7K4j36jnQ8j0q8j0J2R6nq1nJ10lr3L1m3Q8l2o1L5J8M7j3j30P6N9K8q0
4520a3j12M8J66m7r3kN0O0n3o6M9L7j2o3OJ6J02j8o0p2P3J42j12o9M9N6l0o5j9
4549e2J7L5jMn6Q0K4q3p0O0O9l5m3m3J22Ko3PoM6J1j9l6N0K0Mm6m2O4M1n3n8L4
4582a6M7M6j14L9J6J9p6K7lo4R1mm9qJ06k1o8j9Q2j1m2m5O3N0J3j06J0M2L6pn8
4613b4k2O1O9p0j40Q2J03k4q2J6RK4q0P0kM6L4p9m7K0J24m5p9j9O2N5p8p0P2P7
4643F3M5j41j1P0N9m3q1OP3Oq0j2M2Q5p8p1R0j5O7r1k2J6P5J6p4o6L8R3j6o6k8
4674e1J00J6j04j6K6O3Pn4l1J2O6m2k7QJ9N0j06oP6N8n0p3M1N6j4l8M3m6K7K1
$$ y = [0, -42, -34, 126, 18, -73, -79, -12, 72, -24, -104, 28, 37, 11, -7, -43, 21, 7, 67, -57, -104, 46, 79, 40, -86, -24, 98, 61, -22, -26, 71, 95, -41, -42, -47, 41, 31, -57, -67, -55, 41, 36, -45, -50, 60, 57, -36, -5, -48, 40, 8, -53, -18, 0, 47, 34, -96, -20, 39, 67, -13, -125, -77, 89, 42, -51, -53, -3, 57, 4, -62, -13, 24, 12, -51, -45, -29, 73, 55, -5, -77, -4, 138, 26, -43, 6, 62, 32, -33, -52, -35, 0, -1, 3, -53, 27, 51, -32, -102, -42, 27, -8, -51, -94, 28, 30, -33, -26, -32, 14, 25, 6, -30, 20, 40, 44, -2, -44, 20, 61, 8, -50, -16, 31, 77, -37, 2, 18, 37, -39, -12, -15, -79, 12, 8, -41, -49, 57, 36, -32, -51, 31, 20, -22, -67, -4, 46, 59, -47, -37, 5, 41, 34, -24, -46, 15, 84, 14, -126, -44, 59, 35, -47, -31, -22, 2, -78, -8, -10, 36, 70, -9, -56, -36, 88, 43, -36, -55, 7, 62, -16, -86, -14, 63, 108, -33, -44, 26, 85, 42, -39, -33, 40, 46, -34, -46, -4, 81, 3, -68, 22, 7, 74, -17, -39, -23, 52, 68, -6, -72, -34, 59, 43, -23, -51, 49, 65, -39, -55, -29, 34, 41, -13, -44, -32, 34, -8, -35, -27, -8, 42, -64, -70, 6, 64, 14, -59, -18, 38, 24, -14, 29, -17, 10, 31]
4704C1Om0m7J03m3n8J6Q4j2p6j8N9J5j2P%j5L5n4oj5K2R4n1j03N2N9m8K1j2P9
4735G3l6q0K2K1QJ8n7m0K2P6om1n4P9j2mn9N5M2Mk2k9N7n3L6m9k3J8N5k6m7K8
4767b4J01m4l3j1M1M1j07M6Nl1J0Jj9J2N9m1j07O1Q6j5m2p1R2L0l3n8L9M0N7j34
4797d9K1pJ7R0p7o8j2J00jo1k0J26j0k9l9M8n2L5l8m7L6N4j4n8J5P6m6l6OJ9L5
4828A4j1k6%O8l3K7j01J6P1Mo9m5L9Q7j1q9L5M5j5p7OJ05orn1J6j4jP4m3oK7k2
4861EL4j03N4O9k8j04O6J3j3J2j3K2L3l9L8q9N3O1l3n4j2K0L2L1j17P1K8k8j06
4890i7R7J6O6r1l2N3l7P8j3j06O4Ql4M3m3N3j4j5J4j9N0Rq7M5n3J33m0j17L4R0
4920E5Km4j0J3N3m5m5L6k3L3Ol3p6J11K6n2n2M1P3p7n4K7J00o7J3l6rN2j6Ml2
$$ y = [31, 37, -3, -50, 53, 10, -48, -32, 52, 40, -36, -54, 5, 20, 8, 15, 15, 0, 35, -19, -25, -40, -18, 76, 25, -78, -26, 33, -15, 6, -6, 73, 37, -43, -21, 0, 8, 26, -31, -71, -49, 27, 21, -20, -74, 5, -7, -11, -70, -15, 27, 31, 9, -20, 37, -16, 20, -29, -52, -34, 21, -5, -52, -24, 77, 33, 0, -11, 30, 71, -36, 10, 15, -16, -6, -5, -24, -12, 47, 6, -101, -40, 46, 31, -11, -82, 10, 40, 7, -51, -12, 28, 85, -49, -28, -35, -18, 72, -5, -73, -85, 15, 14, -47, -67, 59, 49, 20, -19, 29, -23, 12, -26, -73, -37, 17, 3, -55, -40, 36, -10, -46, -40, -21, 14, 3, -23, -23, 45, 12, 39, -62, -46, 25, 29, -40, -85, -46, 41, 30, -59, -24, 21, 6, -71, -65, 40, 34, 25, -26, -10, -24, -25, 49, 6, 0, 27, 5, 39, -64, -10, 59, 31, -73, -7, 6, -7, 5, -8, 14, 47, 8, 46, -43, 10, 71, 38, -16, -28, -8, 24, 55, -62, 9, 37, 9, -97, 0, 16, 82, -9, -41, 12, -25, 53, 40, -66, -2, 6, -28, 15, -28, 25, 11, -4, 10, -9, 41, 50, -37, 8, -45, 88, 48, -69, -35, 55, 57, 13, 3, 16, 69, 24, -21, 15, -8, 25, 31, -2, -78, 33, 59, 7, -45, -4, 69, -8, -62, -35, 65, -2, 11, -25, -34, 18, 2, 6, -26]
4951b6M0L4Np5J0M2J3m4m9N9L3L7r4k5J00r7J9N3o8O2M3q2m5O8M4m2o9K0KQ7j39
4982h4O0jN7j8QJ7l4J4J0o1j1N6P8j03l2L7O2m4j6m9R1j8n4P1j05M8K2J4l4m3
5012f2P3P2q1kk8Q4r0k7J10o5N0n7J5K2l3O1j06P3nl4k3N1N5o2m0K7K2L6o1M1
5042A6j2Lj0K8l9%LN5k4k7k8O9Rp5l9N0L4k5k4L8NNo0K0J8J9Rn3NJ9M3k7l7QQ9
5077F5j1m7j3Kk1O6Oo1J0j1N2q3k2R5m0MRl8R8m9m3M2L8%J0r3Q2nml4k1k6M1m
5111fj7PL6k5k0J6J1j9J8L1j8m2L3J0o7jN1L1k0m6MP7l4k5MnK0J0rK1k0M1j0j36
5145i9J13j7j1M1j0l6M7n0l6O9l4J6O1l2r1J30n2Mj2J1K7r7K9N1j2l4K5l6J23
5174H8q9K7j5k0rJ2J7r9O0P3k9l8K1M3l7n5J4L5j4L1k6J3mk7RL0l1L1rMn1L8L7
$$ y = [-26, 14, 48, 53, -22, -12, 30, 43, -1, -50, 9, 42, 79, -15, -40, 60, -37, -18, 35, -33, 29, 72, -10, -55, 13, 57, 15, -54, -34, -32, 55, -84, -24, -25, 32, 14, 22, 39, 5, 19, 29, -32, -43, 13, 91, -12, -44, -7, 55, 11, -5, -54, 37, 19, -35, 36, -69, -21, 1, 15, -19, -62, 11, 83, 2, 0, -28, 56, -34, -61, 49, -16, 34, -23, -8, 14, -19, 42, -64, 9, 4, -30, -53, -2, 53, -9, -49, -22, 0, 36, -25, 16, 4, 7, -3, 25, -14, -14, -11, 44, 20, -7, -35, 34, 43, -32, -71, -21, 13, -12, -36, 2, 7, 12, -48, -28, -10, 9, 18, -35, -30, -11, 32, 5, -32, -24, 65, 54, 7, -6, -4, -25, 41, 47, -14, -4, -15, 37, -46, -68, 27, -13, -9, 0, -38, 60, 11, -32, 10, 48, 48, 58, -35, 47, 42, 38, 4, -17, -43, -2, -6, -23, -16, 20, -5, -25, -9, 2, -17, 1, 32, 14, -28, 5, 15, -52, -53, -2, 29, 9, -37, -33, 44, 10, -15, -11, -16, 4, 14, 5, 26, 6, 47, 37, -99, 14, -3, -14, 27, 17, -19, 28, -22, -58, 11, -23, -7, 54, 22, -69, 61, 9, 13, 1, 12, 39, -58, -29, 22, 10, -24, 1, -35, 88, -1, 26, 11, -9, -18, -6, 11, -88, -28, 45, 16, -22, -1, 42, 5, -50, -36, -1, -15, 16, -10, 3, -1, -28, -19, 11, -20, 11, 2, 6, -45, -7, 30]
5207C0l7n8R1k3J2j0L7j4nQJ8o0k0M1o2Q3mJ7q1J8JjL3L1l7L9l1Nno4M6N6p1j
5241a8k6N7Mj8n2O7j4k6M2m7K9m6L2Qn0M2j2P7m9kk8L9rnN5n1K9l0N9k3o3K3J3
5274Gm1Q1p3K1q1O7%J5j7m1O1QnoK3JJ8l1m7nL0P1o1L7j0K6p3RK8J3L7o4k7j3
5308d2M9m9P9o5J0K1j4k2j6L2J0o7N0L6m7J4O0o5L2MK0l4m6O3J2j7qj1lKLL2J7
5341D0p4L2l7P5m5j4m2L0Q1l6j9Ok0N2Oo9M5k8J3RJ9j1M2k6Op0R0j09Q8p7K6N2
5373C5K0kj02O1L8kr6M7L7k7n1N6j9J5o3N5r1J07ml0j0K6%K2Jl7k0J8L0l9O3n
5405C3OJ1n1J8%j4j5l5OR0o6J7K2km9N6j7m8K0NK2mO5j4oq8J7M0m8J4L3l7K0n3
5439e2J3j5P3m3Q8p1J5k2J8lNJ9m2N4k2J6l5O0ol3k2K2L4n3qrP2q5j3M8J1L3j04
$$ y = [30, -7, -65, 26, 3, 15, 5, 42, 28, 23, 31, 49, -11, -31, 10, -52, 31, 27, 44, -37, -19, -18, -19, 14, 45, 8, 47, 16, 21, 16, -48, -2, 54, -17, -18, -44, 13, 17, -1, -53, 14, 0, -26, 16, -31, -2, -48, -16, -8, -58, -16, -28, 49, 0, -2, -30, 9, 0, -5, 50, -1, 28, -2, 57, 34, -29, -6, 7, -34, 47, -26, -5, -86, -19, -19, -4, -21, -62, -1, 7, 2, -4, 19, 20, 38, 7, -40, -45, -15, 56, -5, 32, 22, 48, -25, -16, 12, 25, 62, -2, -29, -42, 7, -42, 37, -28, -18, 3, -11, -33, -49, -17, -7, -74, -24, 12, -35, -21, 39, -26, 6, 10, 30, -4, -50, 13, 25, 8, 0, -11, -14, -12, -9, 23, 40, -34, -2, -39, 36, -9, -23, -65, -35, 46, 10, -9, -3, -23, 29, 35, -34, 11, -17, -4, 5, 24, 13, 55, 29, 35, -35, 55, -54, 34, -43, -17, 35, 55, 53, -49, 12, 50, 48, -48, -1, 36, 9, -42, 14, -5, 10, -53, 2, -89, 18, 14, -16, -26, 0, 0, 22, 23, -14, -34, -16, 14, -25, 38, 33, 39, 50, -1, 17, 17, 3, -12, -47, -41, 49, -17, 0, 22, 20, -29, 27, 10, -38, -18, -13, 9, 5, 70, 56, 50, -38, -21, 19, -29, -15, 18, -19, 1, -52, -39, -54, 19, -24, 64, -7, 8, -14, 4, 1, 6, 25, -17, 37, 15, 31, -4, 56, 50, 17, -5, 17, 51, -2, -10, -19, 53, -32, -45, 3, 14, 47, -57]
5472e7N5Ln9P3j9M5m6lok1P6j9J8o0jm8R1j1m2N3J0j6j1M0q0rRK8k3M4lm4L8k6
5506b1L0m4L3l0k9M2NPJ6KnQJ8l1K8rJ5k9n8J01p3K7J6K0Lo7PL1Lrk1ml3P9jm7
5542b0K8J5ql9kM2L0o9K1j4L5j4k8L9k2j8J02q0kM7J5k4q0J03p6l6PL4K6l5K9
5573Fjj8m1J4kj5O6nqK3l9M4k2L8n2M5o7J9J8jPn0L3Ml1L9J1Km2J5J2jl1jPK4
5609@J1j7m4P0k9jJ2j9K6o3O2%j7NL6o4K7J5K3k7Kj2n5N4jk8L9l1J5j2K1%O3p9
5643a8J5Kk7Q8q6mL2K0Kk5PPnk8K5k1L7k0o5M2mk5K0N8k1K1kK8j06J9Q3l1kk4
5677hM2M9j10j6K1L4n4K2J5L0k0k6j5J1J0pL4n0L1M0j6lL0j1o8j8L3JK4l9J7m
5709b1j8N1k4j8M4l7J9j7J2L0j3n0J4RK1mM5k2o3N9m5J9RM3n5n9L7MK8j9O4o9
$$ y = [-57, -2, 1, -58, 15, -4, 41, -5, -8, -14, -35, 41, 22, 40, -20, -21, -69, 22, 11, -31, 22, 32, 16, 5, 45, -35, -44, -35, -7, -30, 14, 11, -33, 5, -21, 9, -35, -2, -32, -61, -19, -14, -7, 9, 11, 6, 14, 32, 1, 29, 20, 35, 6, -52, 49, -24, 3, 19, 39, 42, -25, -18, 13, 16, 7, -14, -18, -51, 28, 27, -20, 8, 23, 15, -24, -26, 16, 46, -23, -2, -16, 19, 5, -23, 16, -6, -24, 78, -2, -4, 43, 58, 34, -46, 57, -19, -55, -48, -14, 12, -23, 6, 5, -13, -54, -40, -42, -57, 9, 4, -4, 19, -20, 24, 2, 40, -12, 33, -34, -15, 3, 2, 9, -41, -8, -4, -35, 4, 15, 17, -25, -10, 2, 1, -30, -31, -24, 0, 11, -6, -50, 20, -9, -10, 2, -17, 9, -54, 8, 8, -9, -4, 32, -32, -5, 10, 33, 6, 8, -4, -59, -5, -6, -34, 5, -26, -11, -23, -2, -2, 61, -18, -3, -1, -28, 60, -26, -30, 2, 22, 24, -1, 6, 13, 8, -20, 5, -16, 21, 1, -64, -22, -26, -51, -31, 27, 6, 27, 25, 53, -53, -34, 49, 18, 16, -8, 34, 83, -27, -43, -22, 12, -42, -20, -5, 25, 5, -21, -36, -25, -15, -22, 12, -38, -7, 33, 17, 14, 44, 33, -35, -53, -20, -19, 5, -34, -17, -21, -39, 12, -12, -30, 14, -23, -4, -21, -9, 21, 8, -42, -28, -19, 2, -2, 43, 21, -42, 17, -28, -9, 0, 43, -12, -71, -34, -30, -2, -21, 43, -26]
5741b6J8L8o2K3n9K8L3j1m6Q2L0o3l9O4j8nm7M6nl4J5L5J7Kn7ML9m3OO9n2J9j1
5774a0kOo5R7j22P0M5pPn6M7J4l4L6n7N2n5K6M9k3Kj3N2m1Nm8M6l8K0k5QJ3L5
5807C4j6L4j13J09l0oj6k9J1L0n0K6lN1k7J1j0l9O6l5n3L7L8L1l3o4N5l2lMK2
5838@k3k4O0rJ4p2N3J2Jj2m3O6K0n5%K9l4j7J5J3O9n8k7m3N3Jk4j1L6P1p1L6n1
5871b5J9O6p6J6jK3q1Q7p3K8P7k8m7m1R2j9M8r4K4j7jM3k7QL3Qo1J9L4N3o6k4
5903crK0m7mRJ4l7K9j1K0L9m2m7O4M2rPk8k6P0p1NK0m1J4K8PQMj7rj2O3n6J6m6
5939c6j5P0k2J4K2k6J7o5M7J6j8l5NP9Kn2ol8M2j1L6k2RM5Mj05O5l8JK1l4L1Q
5972A1nk3Ll5N7k9rk9L9P8l4k3l7K1l8N7K0Jol0mM5Km4%rlO3m7J4J7k0j3k9L8
$$ y = [-26, -8, 30, -32, -9, -68, -40, -7, -18, -64, 18, 48, -15, -54, 10, -8, -13, -60, -14, -19, -53, -38, -3, 14, 16, -41, -37, 2, -41, -35, 34, -18, 1, -10, -12, -6, -71, 26, -96, -26, 19, 12, 19, -37, 10, 24, -10, 26, -31, 21, -34, -8, 41, 18, 20, 7, 59, 18, 23, -25, 21, -17, 3, -22, -14, -1, 34, 18, 52, -61, 48, 18, 12, -4, -33, -22, 8, -42, -16, -19, 32, 5, 16, 6, -33, 33, -2, -55, -18, 20, 51, 18, -46, 9, -23, -26, -22, 0, -23, -47, 13, 4, 18, -54, -1, 11, 12, 0, -43, 23, 43, -12, -12, 17, -17, -34, -19, -6, 63, 5, -22, -65, -12, -11, -35, -46, -10, 61, -10, 26, -25, -6, 60, -16, 0, -1, 22, -59, 28, -45, -17, 60, 32, -15, -56, 36, 17, 65, -29, -5, -22, -23, 20, -7, 1, 34, 42, -19, 0, 34, 87, 21, -3, -12, 8, -39, -43, -34, -20, -57, -28, -39, -19, 20, -22, -69, -5, 37, 28, 35, 7, -19, 51, -20, -15, 5, -36, -22, 6, 13, 21, 25, 8, -1, -13, 50, -6, 10, -36, -51, 19, -3, 11, 33, 7, 24, -41, 6, 22, 4, -31, -26, 53, 55, 3, -3, -41, 1, -10, 26, 4, 13, 58, 62, -43, 22, -16, -15, 6, -28, 3, 11, 6, -17, -14, -49, 8, -21, -30, -59, -20, 58, 24, 1, -36, -15, -53, 4, 24, 25, 19, -11, -15, 30, 32, -12, -12, -21, -24, 39, -8, 6, 23, 3, -10, -39, -1]
6007aL9n3J4l9P7m7K7m0J08p6l4P2p2Q0Oj2j2l0jK4j1K6l8l2km2Q7Lm9%L1L8m4
6040cj3L0k7L2j0j7lj6J8j4K3j1J3lJ0J1J4l1M4l8j4J6l8j2M3KJ5j8plm1O6K7
6073D5q6QO0l7L4l1Mk9P5On3O3l4j6j5j5Q1o8oM6l3j9L0k2oJ1Pk4K8k1J7M1p1
6106c0K0L2nK5k6L4k8ll4N1k7k6j2N3k5k4K9LJ6j2j4n3J3L1j5M2l2M5mj8m0NM5
6139A6m0M2J5j7rpj7J3J2K3m1K0k0%L3m0l1L0L4Rm4J0kj3J8jm5J2N6pl5pK1l%
6174a5K3o0M1l9O6mm7P4o4M1Pm7M6L0m3k0NJ9ojM0q0j5P6n2j0O2p5J3N7m7M2p3
6207e6L2L8p9O7j6MK0n1Q4l0l0K4n5M7o6M4O3k0l3%kN2l0J8k8m1K7l4M0M6o8N5
6239B2Ml5J2KM1j42J31n3j8J1M6J5m7j4k3mP9J7j6o7N8k8pLjR4j10L2k2Jk3JN4
$$ y = [-1, 38, -15, -1, -40, 37, -10, 17, -23, 85, 9, -25, 47, -25, 55, 61, 49, 37, 7, 6, 30, 19, 45, 7, -25, -27, -69, 18, 21, -28, -28, 3, 41, -3, -16, 14, -13, 19, 9, -8, -11, -27, -9, -23, 0, -11, 2, -1, 9, 20, 34, 3, 47, 9, -5, 11, -27, -39, 4, 6, 21, 3, -4, -7, -48, 18, 45, -41, -33, 27, -10, 24, -7, -3, -32, 43, 49, -4, 59, 25, 9, -6, -21, 60, -8, -14, 32, -1, -20, 10, -12, -18, -7, 0, -24, 4, -17, 0, 41, -30, -10, 22, 17, 42, 16, 50, 22, 19, -15, 36, 9, -17, -29, 24, -1, -25, 4, 7, 23, 11, -3, -56, -43, -12, -27, 15, -17, 28, 24, 6, -34, -29, 16, -24, 18, 33, 16, 7, 0, -17, -4, 8, 31, -10, 10, -10, -10, 23, -17, -48, -18, 16, 25, -19, -9, -11, -24, -6, -7, -52, -40, 16, 9, -26, -33, -12, -15, -15, 8, -52, -11, -50, 16, 12, -35, 39, -25, 16, 23, -24, 22, 52, 9, -11, -6, 13, 7, 6, 46, -34, -49, 27, -25, -35, 27, -48, -35, 22, -25, 17, -56, -24, 14, -65, 2, -14, -10, 10, -41, 43, 13, -17, 7, -48, -1, -67, -23, 40, 20, -13, -13, -15, 37, 7, 25, -3, -44, -17, -51, -11, 35, -33, 22, 26, -9, 3, 5, 46, -96, 35, -18, -36, -25, 21, 36, -11, -25, -48, -52, 27, 44, 28, -39, 19, -9, -16, -13, -14, 80, -30, 2, -20, -19, -42, -41, 13]
6272A3j6qjl9R3m4PK1l9KK3k6oJ8k1kJO2l9JL6n1mJ2mNk7K7MN2r0O7m7M4n3L3
6308Dj3m5N3l5J02o4NMk0j6mM4m4NJ4L9m5M0k0M9j01Q3n1N2p9N4j0K4k5kK0q3
6340f5M3L2ol9j5Q4kl2m7O4o0kL8N0j2m4L2J%k2Mrk2M3j4k5J2k1L8n4N0j0l9J2
6374c7J18r9qmJ2M2k8L0n6J5L6jo0k2O7M6j9J4o8k3O4k4mk%j3oK0k0J7J8j4l2
6407d1j0N6m6mpN2k9K3lL0l4k6N2J7j4p2M8j6j7j2N7l4OK9Pkn4L3J1Pl8N6q6N6
6441eLK2k5q2Q3k1n1L7Q1q6J5L8J8n3O7m3K6L5j13P2k7j0M1m3Jj5Q2k7k7lNPJ
6474CJ7lj6q4J11k2J2jj7Qj4L6m5M7q5N0j7kL1k2N5ro8K0M2o5KmL4k3L4k0N2l3
6508Dm5J4k8M7J3m0j3j3J7M6L0l7N1o4j4J0RK6l2r%J9l8K2J8PQk7o%N6k7m6P0
$$ y = [13, -3, -11, -12, -51, 42, -2, 5, 26, -13, -11, 12, -14, -20, -2, -23, -25, -24, 38, -1, 0, 36, -15, -19, -7, -11, -6, -33, -6, -2, 50, -40, 27, -20, 24, -29, 4, -9, -54, -1, -36, 66, 2, 7, 11, -9, -25, -29, 15, -29, -24, -10, 29, -16, 24, 4, 53, -48, 35, -16, 36, -43, 11, 1, 25, 0, -2, 18, -65, -22, 10, 4, -35, -50, 34, 32, 0, -47, 17, -43, -45, -7, 43, 31, -13, 19, 20, 20, -2, 2, -7, -29, 14, 0, -25, -13, -34, 4, -50, 0, -10, -49, -37, 81, -18, -26, -30, -18, 24, -4, 26, -30, -15, 21, 20, -40, -62, 5, 51, 32, 46, -22, -45, 19, -5, -9, -11, -11, -24, -30, -10, -30, -13, 5, -9, -41, -51, 5, -41, -45, -52, 0, -29, -6, -9, 21, -13, -39, 13, 30, 16, -56, -8, -24, -41, -53, 4, -30, -24, 5, 12, 10, -44, -11, 0, 7, -31, 25, -61, -5, -2, 20, -5, -87, -4, -25, -76, -39, 42, -44, -29, 9, 27, -26, 41, -2, 24, 59, -54, 18, -9, -19, 22, -21, -20, -35, 47, 20, -7, -10, -5, 2, 3, 20, 17, 1, -83, 28, 6, 18, 17, 0, 8, -6, 30, -15, 32, -53, -3, -20, -22, 9, -13, 42, 33, -35, -15, 27, -38, -36, -40, -6, -29, 5, -15, 37, 4, -41, -27, -55, -8, 5, -35, -48, -61, -44, 2, 32, -5, 46, -18, -32, -22, -13, 13, -19, -28, -28, -9, -47, -25, -7, 0, 8, -19, -25, -25, 31, 4, -42, 28]
6542B8l7oO2oo0M4n5L9k6L5L6nm6n0L4M3o8L9l2M7Oq0J9J3k4M3K2Kj5j8ok4P2
6575B6mrJ3j5rn0M9M2o2L1l7PkJ6J2L0Mn3j2J3L8k1l0K5p1P2J0l7K1Qm4L1K4k4
6609hL5j0m0K1Ll1K6j2M1n9j2K1Kj4kP1J6p7rJ2K2K3p1M5Pj0qJM9q9J8J2M1o3
6643d9O8l0l6L7qMNj4P1p1J6M7l1m3L8Kj7N8p6L2m9O1l0O0pl3J1k5J6j3M0q2M4
6676dO7p1L2n7M6j8n5P6j6K1rm5P2j6rk6lkJ5N6l3p6O2k7M2Qn8J7j5j8R2k4m3
6709a9K7Mj4M1m7M1o3M0p4P5PNk6m0N6Kk6jl4P2p1N6k5K6Rj6K5q1QN5J8n0M6n7
6743c1M7k4p5O9Rl5KM6n0L6jKQmjM0m0j6O2l9Rj2o0M3L2K5j7jkm4L7l8R4n3j1
6778Gm1L9n5j4J13o6OR9q9jK3o4N9l3M7k4l4J8K7k9O1m4ook9J5K6J2No8L4J8K6
$$ y = [28, -9, -15, 47, 41, -19, 25, -30, 9, -17, 18, 54, 49, 3, -47, -13, 30, -38, 1, -31, 16, 22, -58, -39, -26, -50, -7, 15, 17, 2, -16, -22, -46, 26, 22, 13, 26, 11, 2, -48, 1, 43, -19, 12, -25, -18, -20, -4, 8, 38, 42, -11, -23, -10, 28, 7, -23, 2, -69, 3, 13, -24, -3, 5, -39, -8, 16, -8, 27, 17, -23, -2, 1, -30, -4, -16, 25, -34, -46, -25, -23, -37, -39, 32, 48, -29, -38, -26, -4, 19, -52, -7, 0, -10, -18, -17, 32, -57, -39, -27, 14, -49, 19, -11, -47, -10, -18, -14, -9, -23, 48, -23, -7, 40, 9, -34, 4, 6, -11, 47, -29, 3, -46, 15, -15, 45, 38, 5, 16, -9, 7, -6, 34, -48, -4, 63, -8, 24, -33, 13, -5, -60, 16, 0, 21, 12, -33, 39, 23, 14, -12, -15, -17, -2, 54, 21, -55, 7, -20, 22, 30, -28, -11, -26, -44, 48, 24, -19, 8, 12, -2, 39, -8, 33, -30, 10, -64, 11, 18, 23, -3, -43, 13, 15, -11, -12, -46, 26, -45, 11, -14, 12, 21, 5, 30, -51, -43, 12, 30, -20, 26, -31, 16, -8, -83, -14, -5, -40, -38, 8, -42, -6, -7, -5, 3, -1, -2, 38, -2, -18, 44, 5, 14, 2, -58, -15, 17, 42, 25, 24, 22, -22, 15, -23, 71, 18, 7, -34, 5, -50, -64, 49, -17, -11, 88, -1, -2, 21, -43, 16, -17, 30, 6, -28, -10, 17, -12, 49, 5, -1, -7, -36, -21, 5, 17, 22, -46, -12, 6, 32]
6811C2k4m2L3J9k7KOpPk4K2k8M5J1K7o9K4Qj3Jn7P8rj4K0j7k2rl6K0O4J1n2K3
6845Cj1moM9p1J8j2LO0q8M8Ok9J3m8M1PP2p0NK3LK3o3J5j0%PO1k6j0J2l3M4j05
6880g3P5l0M1l0K5k7k1Ok1P9l1n7P3J3m7N8K6q9oQ0o9l7M3kk9J8K6P3r5JLm4N4
6913a4Oj6j1L2L4l6RL2k7k6k4R3p8K9K5j3j9K9J4j2m0k8j5R6l6k4L4m1qoN1j8
6945hk7M8o1K2J1L3j8K0J0J7o4O1q1K9K8l2K7l7M6m8L6p0K1Q2m3J0J0l1j6J2j3
6976b6l9O0Ll6k2O0l3N2k3j3N4pm7J7K8m4J4p1P0l0K1L5Mk8JK1l7M5m0%N4n6P
7009fK2j2m7N9l5P3q0N7rj3K9n1rM1j6K3n4KJ3K9j3j8j4L0lMl3K3k7L9mK2k6l1
7043c5Q4n5K8J2p4O6k0j0j6jNk1P8r0k7O5M6oj1n2rMM2l5lQ7o5QLL8m7L9l8k5
$$ y = [32, 8, -34, -1, 18, -9, -7, -1, -8, -1, -25, -3, -31, 14, 25, 52, -17, 7, 15, 2, 3, -54, 24, 15, 1, 21, 4, -18, -27, -63, -43, 21, 32, -20, 3, -8, -12, -18, 31, -40, -22, -34, -31, 29, -59, -11, -5, -34, -21, -69, -28, -21, 51, -19, -14, 9, 12, 35, -28, -13, -23, -23, -16, 45, 19, 9, 21, -12, 32, -73, 2, -28, 13, -17, 8, -19, -40, -34, -55, 24, -7, -64, 9, 22, -25, 33, 59, -30, -36, 44, -25, -62, -19, -21, -50, -32, -6, 67, -28, -27, -24, -68, -14, -8, -24, -35, -3, 31, -5, 4, 36, 9, -17, -41, 52, -26, 3, 28, 15, -4, 25, 39, 27, -13, -41, -56, 40, 4, -20, 14, -27, -35, -41, 10, -8, -35, 13, -48, -26, -15, 18, 0, 20, 30, 47, -17, 44, -37, -8, 20, -12, 15, -22, 24, -24, 12, -58, -37, 45, 2, 12, 22, -9, -25, -13, -26, -65, -5, -2, -38, -60, 0, -33, 19, -4, -17, 37, 30, -17, 0, 28, -16, -2, -73, -3, -33, -12, 23, 27, -1, 0, 21, -16, 29, -11, -11, 43, -13, -6, 16, 4, -43, 16, -19, 54, -26, 31, 22, 9, 38, -13, -22, 19, 3, 26, -28, -26, -13, 16, 3, -15, -29, 1, -2, 2, -31, -8, -35, 4, 0, 22, -4, -35, 49, -6, 22, 34, -40, 26, 6, -4, -20, -21, -16, -37, 41, -49, -76, -11, 35, 29, 18, -34, -43, -39, 3, -32, -35, 52, -13, -5, -2, 36, -11, 28, -10, -35]
7077c5R5Nn6J8m1K7j6k2MJ6pNMm6JL8NqJ1L0j7QJ7l0p0N4K2j3K2k6k8L7M1l8l0
7112b3M0L4n6l2j6L8L4j9L2m4m9L9M3J0Jp0P2n6J8J1JP4o2k4N7o3o9O1J5J7J3
7143B7l8JLk7R8n9O8m5jp6M4kK8k7QL4j1rl5L0k1j0RM2o9j4L5NK5L3o0Rk4O1o4
7178c2LN3j6LJ4n9M7j2J2j4N6q1K1%JmmK7l7M0j7NN1p8J5k2j3J07o4m8N1lj2K0
7212A0Rm8QoL3MRj1olJ0l5J0J3m4K8jM9l7J2k5P7m6K4K2m6k1J4N1l9n5K7N2n5
7246a6j0N5m9J3N0j17Q7m0RM4L2r6L0K6k8JN3l8K5l6L5l0K6l2J4O1p7ON1p8j6
7277d5L5NkK6Ro7N1j1m9P6lqom4M3l8K9N2q7N9k5k9P1m7rL3n4K7PJ8qK4J3n3o
7312a3l7O2m0J7J1J3K1j5m7J3K8j03Q0L3ok3J0Om5K8j9j9J4LN7p5oN2Mm4K1J2
$$ y = [-35, 60, 65, 9, 27, -14, 13, -3, -25, -21, -5, -12, -7, -3, -49, -48, -10, -5, -13, -2, 28, 11, 19, 36, 6, -64, -10, 12, -1, 21, -5, -33, 4, 45, 7, -23, 17, 51, -5, -37, -53, -15, 19, 0, 32, -12, -61, -22, 21, 31, 32, -38, 34, -22, -4, 7, 8, 82, 20, -4, 53, -10, -79, -18, -3, 14, 27, -11, -10, -7, -34, 64, 5, 73, 28, 27, -49, -5, -7, 21, -6, 2, 36, 25, 16, -19, 11, -10, -20, -11, 31, -38, -52, -17, -12, 13, 46, -14, -5, -29, 32, -32, -29, 24, 8, 11, 25, -34, 13, 1, 13, -1, 55, -26, -5, -5, -4, -8, -12, 15, -22, 18, 1, 6, 57, -21, -6, -28, -41, 66, 2, -46, 5, 2, -10, 10, 19, -29, -21, -27, 6, 10, 19, 8, 2, -1, 9, -26, -16, -3, -47, -19, -20, 29, -8, 4, -21, 56, 10, 34, 56, 10, -11, 3, 54, 15, -40, -13, 39, -16, -26, 29, -20, -7, 43, -74, 13, -27, -18, 26, 58, -38, -8, 18, -10, -9, 44, 6, 31, -5, 30, 0, 26, -6, 8, 69, -8, -2, 49, -29, -45, -10, -5, -7, 19, 28, -39, 12, 1, -48, 28, 25, 17, 11, -33, 10, -28, 1, 53, -34, 25, 0, -29, 42, -5, -14, 19, -35, -8, -1, 17, 9, 33, 46, -7, -13, -50, 12, -28, -11, 0, 13, 34, 19, -28, -15, 13, -90, -10, 23, 17, -6, 4, 10, -35, -7, -26, -45, -31, -28, 29, -46, -52, 0, 4, -40, -19, -7]
7344gN7lo7N1m8L5k9qk7J25j04O1p1P1m7j3N1k4mOj5PK7%j7j2j5ROJ6l2J4j1M1
7378B3rlK2lp1RP8p5mJ4J5j1M3k7j4L7j3j7J3j3J4o4Q6o3J8KJ1j2mk5J7K5K4n1
7412b8M9o1N3n0K2pN6rJ4n1J9j5m8Q8m9Ml9K3K4m3P3k6KK8q9L8KM0l2J7j0j1Q7
7445G1o7J5K7m7K8n7L6j8OJ2JK2l8M1l5%JL1K8j7k2mJ1rk8jk7N8j7j5K2MJ4q4
7479e8P5J9l0K4Ll5M9n7j9K0M0k8l8O3k3l4L0M4k8k8P5l0l6Kn3M3O1q3N4k7nK7
7511A7ql3L2m0j3O9n1l2P4JoJ8Pjp7J04j05O2m0J7l5ojN4kk5j3K0k7L6j7K9pp2
7545g1L7k2O7mLm3K6j9M0j7k7J8J8l5K2m3P5n8L7k7Jj2O5o9j0M4K3j1k5k5N3J4
7577B5m5K9j7L9J4l1OJ1k9j9JK4l8P2r1N1m2J7N3j4K5j04M1m2nN7L3m7KQ1n7M
$$ y = [-7, 50, 47, -20, 31, -17, 18, -11, -19, -46, 79, -25, 36, -35, 36, -11, -24, 27, 3, -1, 5, -10, -3, 24, 24, 7, -5, -20, -11, -5, 11, -21, -7, -18, 23, 14, 11, 33, 30, -41, -32, 46, -29, -33, -19, -4, -15, 28, 1, -13, 24, 11, -6, 7, -6, 8, -56, 30, -33, -15, -13, -2, -14, -18, -43, -26, -1, 23, -28, 21, -40, 13, -37, -15, -22, 34, 25, 39, -12, 7, -8, -56, 32, -17, -13, -52, -29, -5, -48, 25, -1, 1, 29, -60, -22, -20, 20, -12, 5, -5, -16, 71, 4, 19, 46, -1, 27, -30, 6, -12, -6, 6, 7, 29, -9, 32, -3, -3, -2, 29, 57, 40, 18, 14, 25, 16, -12, -13, -40, 18, 1, -14, 8, 12, 26, -58, 17, 36, 6, 30, 33, -2, 47, -10, -29, -9, 31, 3, -35, 28, 5, -29, 1, 45, 17, -11, 64, 34, -2, 0, -53, -10, 51, -32, 22, -5, -10, 17, 9, -24, 8, -32, -45, 24, -27, -59, 15, 16, 10, 28, 35, 34, -43, 61, -44, 18, -22, -5, -40, -46, -47, 7, 5, -20, -33, -13, -40, -4, -21, 8, 1, -71, -34, -56, 11, 7, 10, -33, -7, -26, 14, -3, -30, -12, 6, -29, -7, -50, 25, -33, 4, -23, -22, -34, 31, -38, -48, -4, 19, 8, -17, -42, 11, 25, -20, 9, -8, 31, 45, 14, 20, 31, 2, -17, -16, 8, -30, 42, -49, 2, -40, -23, 30, 16, 41, -63, -22, -64, -69, -12, 21, -26, -24, 57, 0, 4]
7609DJ2J6n6j4L2OL2n4O0k3j7N5n3M7p6L2JL6q9J32q2m1J20j12PM8k2KJ6J5n3
7640a9RL4qj2j7M4p6P2k7P%K6L2r3K3J6l7k0P5n6j7L8mK0%K3n3N7j4l0J5J2j5
7673EJ2K8o1M0oj0j3QpRJ5k0K5l6l3QM7l9L2j2l7Q0p4L7mM2n9K8k9K1K2J3k3o
7707COl5J8K3Ll7nK7pj6%J5J0rJ2k1j2J7j1Pl7P9n4P1n2rK4K1k3k4k1J2J2l4P2
7742B5k6m1%J0L9J1l0K2m0j9RM8j3j4J7j7J1L3%j10J57m6m1%j5jL0lM4p2O9l8
7774aORl0K2Pk4l4O2l5qL9J0o3pL7k5Q1j4l4jJqrmKM0o6J3L6mMk8J4PL4l0j7j6
7812c4M4M0J0m3j8K8K7l3l1knM9j0l7qL4K9o8K9lj6M8j5qj7K8j9n6J08o0KJ6J0
7845A9k9k6O7j9J6J6n9J0Kk4N7l5j5L1Rk2N2j6J8o9l0K5J1j1k7J7L4j2N2j8q9
$$ y = [4, 16, 32, -24, -38, -6, 0, 32, -22, 38, 15, -2, 53, 0, 47, -29, 3, 4, 40, -49, 83, 1, -40, 80, -32, -25, 23, 1, 3, 19, 34, -19, -10, 24, 16, 4, -13, 31, -45, 27, 0, 7, 7, 33, 65, -28, -5, 11, -26, -46, 29, -27, -44, -6, -10, 10, 10, 33, -20, 37, 23, -7, 8, 20, 5, 17, 45, -16, 24, 18, 8, -5, 3, -4, 5, 20, 0, 25, -11, -44, -36, 11, -28, 4, -8, -45, 35, -39, -2, -6, 36, -23, 5, -24, -3, 19, 32, 9, 3, 9, -26, -8, 15, 18, -19, -24, 3, -4, -20, -20, -5, 5, -4, 8, -13, -25, -8, -19, -12, -49, 30, -24, 47, -5, -14, 10, 31, 8, -16, -37, -25, -13, -47, 25, -1, -42, -42, -32, 7, 18, -12, 10, -30, -49, -40, 8, -5, -19, -2, -19, -8, 25, 25, -85, 72, 26, -15, -15, -30, -31, -1, -4, 40, -32, 37, -1, 5, 14, -16, 6, 13, -11, -45, 17, -18, -26, 13, 23, -40, -47, -10, -35, 46, 32, -2, -3, -2, -10, -19, -23, -21, 19, -47, -34, 2, -2, 2, -26, -12, -5, 29, -1, -18, -34, 10, 50, 60, 17, -1, 27, 54, 21, -10, -12, -17, 32, 22, -15, -23, 11, 40, -28, 1, -2, -18, 30, 15, 7, -10, 18, -1, -57, 51, -9, -7, 9, 19, -10, -36, 31, 12, 28, 44, -15, -5, -3, -27, 30, -5, -20, 11, 20, -2, 50, 34, 52, -17, -47, -22, -11, -22, -49, -32, 2, -10, 42, 24, -65]
7876f5N0M3m4J6K9k7j5J3nLN7p9J0j6J0J6L0mjl5j6K2k7N7m3nN4n4L2K5n8QLJ9
7910CQJ3j1k4J1k1M6j9J5k9m4KP4l5k1M1J8j9j0mj9L3j0mOJ1l1L2M5l6k3Orjj6
7945b2rM1j8M0k5j7J3J7J3Ko5M1l7K5K4Qn2K8j8qPM6pj4L9q2OL4l1QK7k1J0PK8
7980C8n0Lk0L4K3J5k3J5n9K8j4J8kl9lN1k6L3O3j13OnP7k7l9k3M3qQJ4q0P4p9
8013f7N2j3M8njl0J3M7k0l7k5K6K1j3k1pj1O4l5l6K8J3k0K1J4l1L0j6O6j20O0
8044eM2o0jJ3l6M7o6R5m8J6J3m7L4M6l5J6j7k7L2j4k0OL5l5l9K6N3o5j9N9J7l7
8076b1K3j9rO1n7N3o8J7K4k3J5JJ5L2j0j9m1NL2l9N8o1K7L0o4k0K7J0j3KO0l8
8108a0PLl9N2oJ6k1k2L0L4p4M5L1m4J3KO8n1j3n0M7k5K8m4M3o6L7L4m0j3P0l2
$$ y = [-65, -15, 28, -16, 0, 29, 2, -13, 0, -5, -2, 55, -24, -14, -30, -20, -4, 26, 22, 21, -14, -30, -8, -35, 22, -21, -26, 28, -26, 6, 31, -27, -19, -16, 3, 11, 24, 13, -11, 0, -21, 25, 6, 21, -8, -52, -50, 24, -11, -32, 9, 27, 8, -2, -6, -25, 8, -2, -6, 0, 11, -20, 12, 57, 21, -2, 4, -5, -6, -22, -31, 10, -8, 32, 7, -10, 3, 20, 33, 35, -30, 11, -26, -1, 23, 31, -21, 7, -11, -19, -12, 34, 27, 13, 52, -30, -24, 10, -21, -13, 14, -7, 3, 10, 38, -12, -9, -29, 5, 28, 43, 20, 35, -24, 4, -10, 8, 6, -33, -36, 15, -11, 22, 85, -28, -22, -27, 50, 23, -16, -39, 4, -4, 4, 18, -62, 12, -67, -15, -28, 20, 15, 14, -16, -3, 44, 24, -13, -38, -12, 9, -4, -25, -32, -43, 21, -14, -50, -22, -9, -29, -8, 6, -25, 5, -11, 55, -65, -5, 37, -23, -24, -11, -47, 0, -66, 29, -19, -3, 10, -37, -3, 43, 8, 24, 7, -20, 12, -2, -22, -16, 19, -16, -55, -29, 24, -41, -60, -1, 16, -21, 2, -17, -26, 35, -22, 31, -37, -20, 4, -19, -4, -3, 12, 44, 34, 15, -26, -21, 11, -28, 30, -31, -4, 26, -38, -58, -31, -21, -34, -32, 28, -10, -3, 0, -39, 13, 7, 23, 2, -20, 10, 44, -30, 15, 46, 2, 15, 17, 85, 34, 21, -29, 18, -7, 21, -23, 20, -46, -9, 25, -15, -28, 42, 10]
8140A0j0j8J2J1m1J5L8mJMj7J5L3k3p4Ok3L8Rj4k2P1Pj4N6q5LKK7qk4L0l3J7M1
8175C6k8Rj5k5M3n1N7L0l8m3K6L2m9P3o2l2
$$ y = [10, 0, -18, -6, 5, -36, -21, 17, 13, 14, 18, 1, 16, 49, 26, -48, -42, -65, -27, -18, -32, -54, 17, 24, 10, 66, -19, -16, -14, 13, 5, -19, 11, -22, -5, 36, 8, 17, 2, -23, 20, -31, 26, 56, 18, -25, 1, 33, -16, 57, -5, -37]
8191c7
$$ Imaginary data points
##PAGE= N=2
##DATA TABLE= (X++(I..I)), XYDATA
0@%%%%%%%%%%%%%%%%%%%%%%%%%kMlMpQqJ0j6K0k3K7k9L3m0M7n1N5o5P6q1R1j05
48e5J16j26J39j57J70j83J99k14K30k46K57k62K63k50K08j21n5M23j242L328j0399
69g977P1090L99604l34710n43760K36889M77182r0295l67807l1351J96868J31198
80A36931n044j82611j94920J91394L68396j53269m99771Q6967N68960k662n72552
91b58181p6354N10940J37580l97421j65407K46745J55499q2389j06962p7014K7761
102h5203K10450O9809l06707j69606L56624K55720l61061l13374L25356L33077
112C15085k60530l09845J80327K46693r8182j50705K6600L5443K6280Q4755n6695
123C9226j93833O5925K79103n8821l31640M2733L46934k5977l26519J4904K75744
$$ y = [0, 0, 0, 0, 0, 0, 0, 0, 0, 0, 0, 0, 0, 0, 0, 0, 0, 0, 0, 0, 0, 0, 0, 0, 0, 0, -2, 2, -1, 3, -4, 4, -4, 6, -10, 10, -13, 14, -15, 18, -22, 25, -26, 29, -36, 40, -41, 50, -55, 61, -65, 74, -83, 87, -96, 103, -111, 119, -127, 130, -132, 131, -119, 89, -32, -87, 336, -906, 2422, -7977, 63113, 462717, 128007, -415753, -178864, 298318, 208023, -159784, -191135, 5733, 136931, 131887, -50724, -245644, -54250, 314146, 160877, -338894, -251927, 317033, 314371, -258181, -334535, 176405, 313985, -83436, -248843, -2098, 153401, 71012, -35950, -112964, -85203, 125247, 195056, -111651, -281257, 75367, 331087, -29974, -343348, -17992, 315085, 54555, -255290, -74963, 171730, 73548, -77157, -50557, -15114, 11166, 95921, 39226, -154607, -88682, 190421, 131600, -200040, -157307, 189627, 163650, -162869, -147965, 127779]
134A27779j5189k04343K7871J21973n1455l9575Q1339l4490j11653R4669J35702
145A32628j37736j47494J64516J44085j76619j23954J78575Q9375j73466m4188
155i4278J64736n433j54061N3152J40970r3382j24345J21301J01826j35693p1767
166i6974J36166L2300j25768J5475J08307o9012q8691J23743P0818j73422n6987
177a24045K11602M8571k31853m3502K30590L9295k05887l1569J60013J6845r7589
188b7529P734K6132m2738M4916Q6151j07316j33583J52641J78398j76579k13529
199b05302J76419K31520j54320k26860J15142J96356o6530j40335J7550O3184
209F824K3777K7779m9848j21998N7469K08097m5472k74620J7677L12627J9489
$$ y = [127779, 112590, -91753, -63882, 58091, 6636, -32939, 48400, 13910, -97743, -3074, 132628, -5108, -152602, 11914, 155999, -20620, -144574, 34001, 123376, -50090, -94278, 70458, 65025, -89036, -35884, 105086, 11704, -112641, 8660, 110486, -25207, -96974, 39192, 71492, -54276, -38801, 69506, 494, -88197, 35546, 106364, -67058, -124045, 87557, 136128, -95725, -139227, 91363, 130658, -75229, -106798, 53215, 70060, -27529, -19795, 6337, -36401, 8515, 94666, -12650, -146233, 6408, 184806, 8227, -205302, -28883, 202637, 48317, -178543, -63401, 132955, 66425, -73910, -56360, 6824, 30601, 58380, 8532, -113466, -55997, 152100, 106628, -167992, -150315, 162312, 181801]
220A81801l16397n7623K84616Q7298k21241j00995J33938R2926l4547o2040o4542
231g6806J0614J50266N4636k12368j24368K44290J87320k43528k32656K13323
241b9277K52152j60073k40181R3876J96831k5441j25684l4233L5031P7249O3676
252A03926r8278j58466R5950K36870p3539k89308L7053L08628M935k93366m3819
263a69414K45781P0798j72343q0190Q3139O8922J0593l7888r6718q239J65802
274H0243O2424k10093j15280K26956J57839k16700j82168J84112J83202j36356
284C4179j59460Q1797J12979k9255m9897j4742k2116M5034R3106o0179j54410
295a22964O1263J98287n1779k19965L6709K17847k1308j93127J0464J50723p221
$$ y = [181801, -134596, -192219, 92397, 179695, -41546, -142541, -8603, 84323, 49776, -12264, -76806, -66192, 84074, 138710, -73658, -198026, 46264, 233584, -9944, -242600, -29277, 222875, 62802, -177379, -83503, 113328, 87887, -37797, -72030, -36999, 40250, 103926, 5648, -152818, -56868, 180002, 106463, -182845, -145792, 162836, 167771, -125595, -169414, 76367, 147165, -25178, -105368, -22229, 46693, 57286, 19398, -77320, -85559, 80243, 142667, -67426, -182706, 44250, 202089, -14611, -196779, -12667, 170535, 34179, -125281, -43484, 69495, 40240, -9657, -24399, -46515, -1481, 91625, 31446, -122964, -61701, 136586, 84807, -135158, -98449, 119398, 98090, -95037, -84573, 66150, 58929]
306E8929r6212J2960L7311k6424J9547M5049o8221o4957J05010Q1313j28019r0576
318a14290J37377Q9559j35298p7665J24558N5007j08722k4671R0600r806p2658
329d6009M4116N5668p3813l9196R5686K2773j07327m761J08810j5568j00922L8770
341b1773Q6287o3549o7695Q8208M8075j09858l0037J25117J4438j31212j830J25589
353F1760r041j08099J9398P9259l1073m2113M5378P36o2748M0156Q2378p5221
365G70j02008J00629J18751j12845j28756J11393J28643r7049j15419P3074Q8134
376F5317m3962m7748J4871l000R125N8620k4465j13180K8590J59371k2192j90988
388a09641P241K03190J1765j93421k9815J62535M1709j13596m3100N2797L1951
$$ y = [58929, -37283, -24323, 12988, -13436, 6111, 51160, -17061, -82018, 22992, 104305, -23714, -114290, 23087, 112646, -22652, -100317, 24241, 79248, -29474, -54145, 36455, 26649, -46009, -1893, 53775, -20038, -59234, 36452, 59225, -48102, -52863, 55947, 40379, -60543, -21773, 64514, 965, -66730, 21478, 69553, -40305, -70342, 54775, 69213, -61999, -63829, 61760, 52719, -55380, -35982, 43277, 12204, -29909, 15469, 16205, -46543, -6387, 75991, 770, -101238, -609, 118142, 5297, -123459, -12066, 116577, 19528, -95891, -22817, 65317, 21355, -26393, -11522, -14522, -5397, 53223, 28758, -84422, -55832, 103539, 81347, -109641, -102400, 100790, 112555, -80866, -110681, 51854, 93563, -20033, -63133, -10336, 21615]
399B1615J2532p926p3765k6133J23842O5810j56567j04775J68791J36402j60370
410e44j54787J33626J55160r4015j35750M7634R6997k156m2924l5880k0706O1282
422G937Q6191p1345j44971O5938J89470m7403k13508K0945K13958P809j90226
433g5205l2206J45634M6983q5766m8399J8476L5264M7666r500j04774k5114J46117
445E9176O2376j68102r5982J69160J19537j51594j28333J19646J19700p9160r3644
456f7220L6573N3318K054l112l2013m9980N0738R9507n7349j38935N3629J63371
468A10581m2369j69928K7535J58234j3553j30446L718R0251p91m3144N072n283
480a0123j6044M9098L1348q4261m7476J07779O0860j18479o8196J17542O7180
$$ y = [21615, 34147, 26221, -47544, -73677, 50165, 115975, -40592, -145367, 23424, 159826, -544, -155331, -21705, 133455, 39440, -96310, -48676, 48321, 46165, 3241, -32639, -53345, 7937, 94128, 22783, -122188, -56250, 133220, 85817, -127691, -106746, 107212, 115021, -75205, -107411, 38223, 85206, -560, -48959, -30483, 4781, 52447, 42947, -61827, -86941, 59176, 121552, -46550, -142532, 26628, 146165, -5429, -133762, -14116, 105584, 26424, -67220, -30647, 22671, 24725, 21613, -10400, -60380, -9642, 89865, 32516, -106419, -52790, 110581, 68212, -101716, -74181, 84053, 70500, -59946, -56228, 34023, 33232, -9912, -4840, -10123, -26167, 22931, 54279, -29982, -77458, 30321, 91181, -27298, -95494, 22048, 89228]
491H9228j06722n6647Q9601L7655o9083j2077M8348j6610k9498M4904J3490o9105
503c6516n86Q6282j0468r4841K0403R4004l0648q5014M1430O9433n2919m9904
515d9344O4277K8995p3959q882Q0206q590q0998K2895P5500l3917o2613M2500
527c930M3298m9469j8980N6011p858o2606L4184O8889n6767p4407P2713P7319
539G8397q0412p6220P9058O8709o9569n3975N3839L1630l4728k650J5597l0586
551b0910M54O5180j1221r6459J5686J20701j3820j33961P467J33912J117j19828
563e1682q700R2689J2274n5414r809J2066P9L1724J6475p1239l8067J01235O1347
576I2978j18485q2433J21399R7089j10004j01844Q7012R4373n6104p3585K2425
$$ y = [89228, -17494, -74141, 15460, 53115, -15968, -28045, 20303, 3693, -25805, 19099, 32589, -36516, -37102, 49180, 38712, -56129, -35726, 58278, 27630, -57384, -15954, 53479, 560, -49344, 14933, 43928, -30031, -38913, 41293, 32703, -48295, -25400, 50100, 16183, -46430, -3930, 39368, -10101, -29081, 26930, 19072, -43534, -9350, 59539, 2772, -71635, 1078, 78397, -2015, -78235, 823, 69532, -37, -54012, -173, 31457, -3271, -5921, 9676, -20910, -20456, 44724, 33503, -62956, -47270, 73431, 59611, -74350, -66883, 67029, 68146, -51682, -60382, 32307, 44581, -10833, -20642, -8576, -8497, 23227, 39702, -31537, -69604, 31631, 92978, -25507, -107940, 13459, 110548, 544, -101300, -14288, 80085, 23981, -49604, -27179]
587b7179M1096R093J54l3774m5185M8636Q8440n2123j24352M5062J47522l0044
599F7346j54905J0832J44733P984j18503k2264P9190K8420l2068k4757j7065J1569
611a9488O2277R290r8067l4185J20820N8863j28362p8439J21286Q9229j01572
622A652q8351P3159P4859m0537m9856Q524J5754J8731K2969l8347o1659M8329
634a4773R5175m9314j19017M2530J29992l0789j26900J7574J10122o025q1831
645c3256j181M6016K563o838K281l0474j2137O2276K4822q5117l7449R7316M7193
658G6015r9032n1392R1160M8403p6472l8103N7559K1051l7492M59J8551k3810
670a3103k559M5933r678o3988J8349P5829k4100p9941K8103P6419l1326o5685
$$ y = [-27179, 13917, 23010, 23164, -10610, -55795, -7159, 81281, 29158, -95194, -50132, 97390, 67346, -87559, -76727, 68006, 75990, -42513, -64777, 14413, 42833, 10765, -13992, -31057, -19488, 42789, 52079, -45988, -80173, 40647, 99510, -28852, -107291, 13995, 103224, 1652, -86699, -13540, 61319, 20782, -29074, -20550, -4796, 13935, 36904, -1443, -63102, -14773, 80402, 31088, -87929, -45399, 84593, 53804, -73096, -55522, 54600, 48575, -33256, -34437, 11579, 14142, 7304, 9585, -20889, -33026, 29250, 54072, -31045, -68494, 28822, 76015, -23017, -74409, 16751, 65154, -11318, -49421, 8138, 29189, -8303, -7844, 10707, -13103, -15662, 30271, 20593, -43395, -25046, 50783, 26683, -53258, -25155, 51264, 19938, -45747]
682d5747L4824M9777l8895l0425M3107J0449m7131Q422M9348k4363m9138L6609
694c163M4909m5012l6493M9708K3842n1751p995N2011r660n1193K6957M9953m2013
707A00m7612N2914M4010n8200l8147N7766K9279n1630j6883M1443P95k8793J8299
720C341J5555l8749m040N8426m556p5224R360Q6369j0635r0123R130Q4999o368
733C7485p1101M171M9393m024k2056P439p722j4604L6706K5361o1220l7970P8482
746B0340N0587q6432o0533Q4401O5263p3166o2729N4596N1726l2033l2660Q661
758a1979O890J1848K2696k6844n2934L4662P9598l4961r8940K8666J08461j7894
770D9269j06188N676R2189N346o7904j2278L6249J3637j169q496l3153k516O2788
$$ y = [-45747, -10923, 38854, -41, -30466, 12641, 23090, -24041, -15619, 33729, 9366, -39772, -3163, 41746, -3266, -39759, 9949, 33791, -17960, -25955, 26056, 16396, -34797, -7840, 42113, 100, -47512, 5402, 49412, -8788, -46935, 10831, 40110, -11520, -28403, 13040, 13835, -14958, 3341, 18896, -19853, -23893, 34533, 29977, -45247, -35887, 50482, 39847, -50276, -41146, 43853, 37485, -33616, -29445, 19948, 15924, -6132, 1307, -6415, -21019, 15687, 41048, -20172, -58142, 20340, 70927, -15505, -76038, 8363, 73626, 460, -62269, -7673, 44053, 12020, -20640, -11979, -5089, 6759, 29455, 2611, -50323, -15661, 63937, 28976, -69964, -41298, 67163, 49269, -56919, -51243, 40946, 46292, -21612, -33890, 2359, 15996, 14827, 6331, -26822, -29338, 33450]
783C3450J7569q4267l4414R5550M9159r5574n9362Q5032O2493o6473n6895M2423
795a1309M2595j6850k0576o926o329K5855L5153l7903o1962M2534Q3193l9993
807B7482r5726L2316R7784k1646q9068J0856P0507k254m4749k265J4781J826J5325
820A5169L200m2397j1689O3215K1685p6255l0705Q0403L6853p6373l8062O5571
832A0615L3613m9986k3391L2359Q583j4804R297o06k7766J2712M4482k0998n7202
845d3092K5520O4196k7196o4822K7078N8636k6208m7066K5683L1085k5952j3091
857a5229K6992m858k8497K1079K9560l3782k9257M2665K6622m7072k1095M7773
869A4901J2859m5541k101M1346r936l6162K2015L0587l2765k4866M0504J8949
$$ y = [33450, 51019, -33248, -67662, 27888, 77047, -18527, -77889, 7143, 69636, 3163, -53732, -11309, 31286, 14436, -6140, -13066, -19395, 6460, 41613, 3710, -58252, -15718, 67475, 27482, -68244, -35928, 61856, 40210, -48858, -38002, 32505, 30251, -14498, -16763, -1982, -156, 15169, 18369, -24028, -35717, 27498, 49183, -27072, -57777, 22626, 59479, -16894, -54956, 10615, 44228, -5758, -29149, 3210, 11793, -3011, 6286, 5680, -22086, -9374, 35108, 14110, -43092, -17572, 46624, 19428, -45394, -18316, 40320, 14112, -32954, -7271, 23814, -2138, -15229, 11763, 6905, -21592, -513, 29047, -4735, -33992, 8673, 35295, -11777, -32872, 14901, 27760, -17781, -19882, 21464, 11528, -24634, -2619, 27968, -4797, -29663, 10841, 29790]
881B9790m4619j2593M4393N038m0122L704L2459j3859k2526K4872J2074l6106
893a7495k226M6471n945n4238J1588N8519j4726n7651J5561N1446j4918l9853
905b3467J4092K3517j3886m206J5143j6064j8417L4914K3102n0248k8628N9977
917A5829L3702o3278l6612N9624L6132m9905l1091L5678K1188j9015o638K445
929a941j1061J1857L0291k2049m8654K7478O3450k7581p2801K3351P4781j6151
941C0970o8912P944N5168p42l5265l771J1119M329J4343q81l7926o387N7122J6049
955D3160o9556k6150P4051L4658p0223l9207N9145L8491m2449l1673K2796J9065
967A2108l100j711j4137j8306K6986L8068l4225n5223L5589O6934l1959p1718
$$ y = [29790, -14829, -27422, 16971, 22009, -18113, -14409, 18050, 4191, -18335, 6537, 18611, -17495, -19721, 26750, 20805, -33433, -21845, 36674, 21948, -35703, -20142, 31304, 16386, -23467, -9375, 14142, 256, -3950, 11193, -4871, -23288, 11626, 34728, -15520, -44148, 15829, 49531, -13747, -50359, 9265, 45397, -4508, -35599, 79, 21267, 2252, -4386, -1941, -13002, -1145, 29146, 7097, -41557, -14079, 49371, 21790, -51011, -27660, 47121, 30970, -37942, -29998, 25170, 24428, -10837, -14608, -3489, 840, 15183, 14302, -23624, -30011, 27111, 43160, -26396, -52546, 21505, 56163, -14060, -53267, 5878, 44369, 1920, -29753, -6957, 12108, 9008, 7297, -6840, -25146, 1840, 39908, 5683, -49540, -13951, 52983, 21024, -50694]
979e0694K4697O8520j5947n7652P631M0375j331j8797j448m462Q27K6598L249
992B1566m5048r492N8035J6517o4320k2472O3692K5750n6720k5419M5044K0495
1004B7628l0236j1688J4544n96J14J4450j2260k8382K0949M0283k5917m8392K7378
1017a2125N1574k6072m9248K3448M1697k0344k9721J7801J5061j6236O44J5847
1029A2326j5494j6292K7949J6807l6974j6649M1947J4933m2979j1383M0421N733
1041B0345l5408J668K8804j0194k1564J8756J4591k6454p977L2105K206l4899
1053a8021L072L4527q008l0973J3171K4644j8362j6488K3847P402k9097J254L3584
1066B0552q861l6526J4478L7089j7985l4799J9452K8983j9325k0082J8355Q430
$$ y = [-50694, -25997, 42523, 26576, -31076, -23445, 16930, 15599, -3198, -4646, -9108, -8281, 18317, 21566, -23482, -32974, 25061, 41578, -22742, -45214, 18478, 44228, -12492, -37911, 7133, 27628, -2608, -14296, 248, -348, -234, 14216, 1956, -26426, -5477, 34806, 8889, -39503, -12125, 39449, 13377, -35871, -12423, 29274, 8930, -20791, -2990, 12071, -4165, -3521, 12326, -3168, -19460, 8489, 25296, -11678, -28327, 13620, 28553, -14426, -25809, 14612, 20345, -15063, -13395, 15409, 5215, -16349, 2407, 16998, -9456, -17433, 14672, 16878, -18021, -14949, 19578, 11570, -19403, -6232, 18412, 50, -16438, 7409, 14811, -14286, -13032, 20552, 11691, -24835, -10357, 26732, 8747, -26052, -6600, 22383, 3058, -17024, 1331, 9761]
1078I761j7042M672J6375j8003j6458L0164J7248l9291j8347M4619J9163m5322
1090a2461j8694M1368J6238l3353j1397K2551L695j0244O093j803j7465J1914
1102c558K9240j9341l9750K3016M7476k3153n0908K0046M9486j4996m2521R146
1114a5817L0835m027j4993O47k723J08K0661J880l6538o125M8298J1830n4821
1127b0785j7466N5069K1654m9539k3067L8999K0610k5062j4197R669M195N018
1139E098Q370j7389k1886K6003L4657l0260m4457L0005N0192k6202n0379J9919
1151a6329M5088j2600l4450N684J9775n60k824k056j4498J663L0316R26m2604
1164b2469n309M9986J0195n2037j4114M8476J6101m0341j4983K8745J0726j5426
$$ y = [9761, -7281, -2609, 13766, -4237, -20695, 9469, 26717, -12574, -30921, 13698, 32861, -12461, -31155, 10213, 26451, -6902, -18299, 4252, 7947, -2297, 3796, 1993, -15472, -3558, 25682, 6341, -33409, -10393, 37083, 13930, -36978, -16932, 32554, 17558, -24963, -15817, 15018, 10991, -4002, -3355, -6078, -5970, 14691, 16571, -19967, -26092, 22206, 34036, -20785, -38251, 16818, 38472, -11067, -34134, 4865, 25475, 413, -13784, -4115, 80, 5098, 13468, -3921, -25807, 196, 34853, 4593, -39864, -9859, 40333, 14131, -36248, -16329, 28759, 16159, -18291, -12607, 7168, 6608, 3784, 1728, -12770, -11107, 19209, 20135, -22469, -27778, 22208, 32403, -19634, -33748, 14728, 30829, -9512, -24495, 4250, 14976, -450]
1176d50l391K190o005R450J6495j8423k6224K4031L3970k6188l8354K5310L8647
1189C1058k2512l4512J8433K6464j4409j5491J0905L002q747R667P709k1022p597
1202a7052K9807P948l5303p937L7267P092l5668m808L1209J059k4579L948J7106
1215A0089r891r374J5979K323k1439L632K5323q341k7202J1801K6315j4348k2977
1228a8110J6206J7399j7853j0277J9392K429k0857N390K1884j1981k2142J6944
1240a576K1265j9857j8526K0747J4086k0071p658J8145k20j5588Q848J3056j7474
1253d823j0944K4974R198l0387q096L3021P039l2571n507K8648L406k2249Q6J3773
1267E568m811m400J0668m564j7232J2401K3656j7780k9084K0629L2502k0665l3055
$$ y = [-450, -3841, -1651, -7656, 1794, 18289, -134, -26358, -2327, 31643, 5455, -32899, -7589, 31058, 8546, -25966, -7533, 18931, 4522, -10969, -64, 2938, -5809, 3858, 11567, -9455, -17052, 12755, 20703, -14600, -22537, 14730, 21822, -13846, -18654, 12555, 13614, -10965, -7017, 10089, 198, -9176, 6803, 9126, -12313, -8681, 16642, 8301, -18901, -7100, 19215, 4867, -18110, -1904, 15495, -2358, -12635, 6757, 9186, -11671, -6281, 15603, 3622, -18520, -1576, 19689, -168, -18694, 2053, 16139, -3932, -11590, 6555, 6335, -9253, -405, 12651, -4823, -15767, 9207, 18405, -11982, -20078, 12943, 19982, -12589, -18096, 10552, 13958, -8291, -8205, 5568, 757, -3643, 7025, 2461, -14771, -2370, 21286, 3506, -25578, -4949, 27553, 6888, -26167]
1280b6167J8304L0184j4336k3896R640J4499n424k894K247r678q52K1665J297
1293A4589l1727l318L8560O200m1285q993L9573J0912l3605j0962K4397Q668j3064
1306e5l902J267l071R832J1286j8652j9957K4493K7573k6843l2953K5599L5224
1319B9841k1829l3492J5970K7893r603j8697L532P118Q91N867l325j8442L552
1332a0724K9277j745l6804j330M0364M838l9570p611L4659Q740k6349p645J5802
1345A902M268m685J205n896q078J4562J5307k0721k1695K3782K6284k4147k8038
1358b5950K1904K6705j7982k2130J3432J4755q797n619N163m434k570J4121J339
1371I937k2314j123K8109J598l0957k064L0511K060k7369j091K1815j108j4928
$$ y = [-26167, -7863, 22321, 7985, -15911, -6271, 8228, 2804, -90, 2157, -7521, -8373, 13292, 14589, -17138, -20456, 18104, 24304, -16981, -25974, 13599, 24511, -9094, -20056, 4341, 13009, -55, -3957, -2690, -5761, 4071, 15357, -3295, -23252, 1241, 28814, 1971, -30982, -5383, 29841, 8012, -25480, -9510, 18383, 8780, -9917, -6385, 733, 1624, 7491, 4166, -14276, -10724, 18553, 16808, -19996, -21326, 19038, 23876, -15694, -23305, 11354, 20094, -6255, -13900, 1902, 6170, 1485, 2690, -3206, -11284, 3278, 18585, -2136, -23831, -49, 26235, 2088, -25950, -4046, 22659, 4677, -17453, -4021, 10734, 1937, -3682, 1481, -2953, -5523, 8598, 9937, -12377, -13500, 14609, 16207, -14750, -16814, 13697, 15757, -11612, -12703, 9112, 8004, -6924]
1384f924M461P319q437k51J2661n764j6507J0440J9145j3335k0096J4962J8944
1397A6618j5165j5912J4923J0932j4203m762J3472j859j2832Q099J2303j3475
1409a861j1551J7213J0198j9155q072J9151M947j7579q23J4837m159j1439R470
1422A177Q067j4766m849J9212K395k2303l97K3526j094k2387K262J9214l634j4047
1436g624N320P600p678n39J0464o196j3680J1804J6751j5855j9073J7716K0084
1449A9094j7515j9302J5539J6338j2194j1259Q251M512m552L545J597j1794K40
1462g500J9433o18k5522lK9118J301k9602k838K7001L772k1628l697J3996K172
1476E385n199P73l737n039J1580J0229j7717j5436K1409J9767k2239k2465K0625
$$ y = [-6924, -2463, 4856, -3581, -3832, 8829, 3065, -13442, -3002, 16143, 2808, -17288, -2326, 16618, 1453, -14459, 464, 11396, -2807, -7569, 5903, 4044, -8788, -689, 11614, -1861, -13412, 3801, 13999, -5156, -13228, 5923, 10870, -6709, -7532, 7305, 3146, -8293, 1177, 9244, -5522, -10371, 8841, 11236, -11067, -11464, 12062, 10968, -11419, -9157, 10057, 6423, -7624, -2304, 5296, -2382, -2921, 7543, 1347, -12333, -529, 16222, 367, -18706, -990, 19094, 1579, -17723, -2184, 14154, 1960, -9299, -1048, 3464, -1088, 2457, 4054, -7740, -7500, 11933, 11315, -14207, -14210, 14908, 16209, -13393, -16231, 10770, 14542, -7086, -10783, 3213, 5385, 186, 959, -2778, -7817, 3763, 13992, -3725, -19161, 2248, 22015, -224, -22689, -2064]
1489b064K2759j6668k0469J1576J5496o116q184J194n83K400R783m272j8321M424
1503i045K5015l010k9204O95L0042J881k7834l699K2488M423j5149l425O527R82
1517F87K120K977r849p770J5938J2621j9642j6706K0891J9193j9758j9603J6821
1530b080J7621j2655j3392Q157P115l944K66M91p872J535J4917k412k0487K233
1544a0507K3843j403k4562L99K2830K48j8932J55J3305j275p004L624N07o506
1558e278N209R546r634j2380J2678J4088j4018j4469J3904J3296j3006j0406J1380
1571I10O131r462j247P904m179o478R073N468j3010m591J5679L601j6625k355
1585i181J6086O54j4008J783J0836m575p311P779L630j0935l97J3587k193j5445
$$ y = [-2064, 20695, 4027, -16442, -4866, 10630, 4514, -3670, -2476, -3059, -659, 9124, 4852, -13469, -9045, 15970, 12960, -16244, -15549, 14493, 16374, -11460, -15159, 7329, 11752, -3397, -6822, -295, 687, 2807, 5784, -4065, -11835, 4103, 16724, -2918, -19624, 1267, 20460, 702, -18901, -2080, 15541, 2886, -10506, -2349, 4766, 822, 1088, 1579, -6293, -4758, 10159, 7747, -12740, -10507, 13336, 11933, -12629, -12230, 10600, 10848, -8084, -7929, 5376, 4101, -2903, 721, 1228, -5278, -69, 9477, -157, -12537, 141, 14229, 211, -14258, -354, 12942, -64, -10470, 910, 7041, -2421, -3668, 4236, 57, -6421, 2652, 8120, -4890, -9481, 6198, 9799, -6826, -9181, 6905, 7559, -6449, -4666, 6170, 1595, -5716, 2063, 5693, -5242, -5639, 7948, 5755, -9690]
1599i690M105J5855n211j4870N778J2312o293q288O575L617p320J638Q267o560
1613h5r349J0519J0686j3275j1481J4495J1478j3999j0378J2257P927r363m394
1626d962O108l46k943N615K31j0928J490J5695k370j9144K252K0841j623k0316
1640a0400O83J7694O4j3025k16P157n75m72K270n908m903J1506P901j5386j0998
1655a4608J7330J3375j7350j4346J5089J3961j1682j1582P421P382k979j963q15
1668g67m271L420J0667m838j6111M834K0096l689k1935J992K1395K1j8730j356
1682i272J3886J988p707j503R93k71N589K862j1120o117J5065R289j7160j1791
1696a5269J7159J3054j5299j2774J2005J0732p937p069L812K216j68L419k508
$$ y = [-9690, -5585, 10270, 5059, -9811, -4033, 8279, 1986, -6302, 273, 3890, -3430, -1792, 6475, -85, -9434, 1085, 11771, -1504, -12985, 1510, 12988, -1011, -11389, 868, 8795, -568, -4962, 1146, 800, -2143, 3472, 3703, -7225, -5735, 9960, 7590, -11554, -9302, 11539, 9916, -10400, -9717, 7977, 8041, -4984, -5200, 1957, 1382, 910, 3180, -2728, -7631, 3875, 11776, -3610, -14608, 2722, 16097, -1253, -15599, -510, 13451, 1769, -9813, -2392, 4990, 2011, 48, -767, -5038, -1618, 9049, 4211, -11900, -7066, 13030, 9341, -12594, -10602, 10793, 10814, -7916, -9272, 4614, 6602, -1105, -2608, -1615, -1886, 3703, 6565, -4555, -10672, 4393, 13682, -3478, -15269, 1890, 14944, -355, -13129, -1124, 9608, 1671, -5398, -1586, 630, 462, 3881, 1373]
1709A373r010M094J3831m419j7253L951J8809k897j8316J644J5892q59j1894O84
1723d370O859j327j497K778l748m639Q019O671j1067q490J2780R506j2931r620
1737a1076J1964Q504j0080o131P775K830n455J197L353n271j546Q817M43j1730
1751f406K86J3378q13j3621J235J2433j904j0027K808O850m187l318N794j26p486
1766e104L140R017n341r988O781J0065p282r146P163P204o603m414O110P41n482
1781c139K999N125o464n159R351N226j1339n241J1985M963j1405m173R674K777
1795E180p217n20M272k328j198N460j360q662L307J1477m415j3282M683J3855
1809I252m165j3048L257J0775k350p215J708K739j622K048K135o673l247J0402
$$ y = [1373, -7637, -3543, 10288, 5869, -11384, -7433, 11376, 8479, -9837, -8193, 7699, 6840, -5054, -4370, 2489, 1162, -335, 2443, -1305, -5944, 2075, 8746, -2321, -10811, 1969, 11475, -1456, -11076, 888, 9392, -688, -6819, 956, 3786, -1669, -472, 2881, -2390, -3936, 4881, 5324, -6406, -6120, 7258, 6445, -7176, -5941, 6492, 4588, -5439, -2631, 4219, 32, -3286, 2508, 2382, -5104, -1964, 7053, 1712, -8276, -1495, 8570, 1288, -7858, -695, 6509, -94, -4508, 1602, 2343, -3139, -140, 4985, -1479, -6638, 2713, 7939, -3400, -8641, 3344, 8307, -3098, -7271, 2403, 5180, -2037, -2557, 1715, -613, -1811, 3649, 2289, -6373, -3066, 8411, 3996, -9286, -4603, 9252, 5087, -7961, -4704, 6071, 3721, -3494, -1786, 953, -669, 1379, 3514, -3159, -6406, 3996]
1823C996M758j2973o314J4029P477j3434p904J1446P309q323n577M709K835j036
1837I98R64k221n108M522R092n680j2577N865J4724m936j5500L466J4478j814
1851F273j1905M17P818N41k993o47k175j39O934J796j0925l644J3433N659j4258
1866c815p175J3447P924j1255p438P993N877m471l001Q63p11K243M544m261q423
1881g659N374J1455n384j3489M768J3779l462j2788K182J0323j102o687M94K615
1895D19o48J793J429n760k578Q730M025j0696n310J1435O091j0905n984R214N125
1910F380p076l314M494P25j991K216p9n209J511P881k403r738K683J0678k625
1925D133j0322K397Q915k223o608K482L610k982m56L783k488m698M818N530o412
$$ y = [3996, 8754, -4219, -10533, 3496, 10973, -2461, -10365, 1081, 8390, 67, -5510, -801, 2034, 998, 1962, -259, -5367, -845, 8247, 2567, -10010, -4145, 10579, 5643, -9857, -6391, 8087, 6273, -5632, -5215, 2603, 3144, 151, -496, -2671, -2810, 4124, 5920, -5005, -8649, 4784, 10443, -3815, -10990, 2457, 10381, -874, -8312, -319, 5558, 1087, -1914, -1051, -1762, 481, 5025, 764, -7659, -2285, 9170, 3786, -9703, -4935, 8844, 5382, -7406, -5224, 5099, 3997, -2690, -2196, 419, -229, 1564, 2993, -2767, -5345, 3385, 7410, -3286, -8596, 2839, 8930, -1975, -7959, 1255, 6380, -696, -4010, 484, 1209, -782, 1434, 1355, -3854, -2343, 5538, 3135, -6603, -3920, 6758, 4133, -6189, -3792, 5123, 2900, -3708, -1226, 2384, -598, -1054, 2729, 241, -4457, 361, 5891, -521]
1940e21o119P194O121p156n553O539M143n533k095M335m56l238L129K384n644
1955b470j698P611J553q923j404R307J190q625p46P063J28n021J114K405k650
1970a166J26M398k319o212L941P787m937q714N065Q752m534p994L747O156k697
1985A399l589J909L16j331L089J252o144j640Q715K248j0150l121J0601L727r808
2000b527l891P945L499n468k446K572N23L85J842k877m540M677P021n521r055
2015g861N522J0286m776j0331L497R284k028p011P02L885J60j19n25l568N9O973
2031D149Q30r416k175J0839L412j0957m360R749M663p633m188M758L005j829r38
2046i1r77j674L354M453m804o938N470Q787n238r821M411R697l126q527J880O266
$$ y = [-521, -6640, 554, 6675, -481, -6034, 505, 4648, -885, -2980, 1355, 899, -2339, 790, 3174, -2470, -4168, 3443, 4996, -3927, -5331, 3976, 5166, -3459, -4205, 2858, 2986, -2035, -921, 1484, -1166, -1040, 3358, 1039, -5173, -1232, 6555, 1618, -7096, -2031, 6721, 2187, -5807, -2060, 4096, 1399, -2190, -281, 35, -1296, 1793, 3045, -3099, -4739, 3976, 6224, -3926, -7047, 3554, 7281, -2527, -6418, 1527, 5026, -442, -2888, -316, 207, 592, 2434, -443, -4983, -306, 6715, 1194, -7861, -2339, 7947, 3171, -7160, -3663, 5621, 3593, -3418, -2716, 1169, 1329, 1210, 685, -2883, -2824, 4149, 4979, -4437, -6612, 4227, 7639, -3318, -7678, 2071, 6734, -899, -5087, -329, 2676, 847, -91, -1068, -2742, 612, 5065, 261, -6677, -1207, 7580, 2342, -7479, -3068, 6629, 3503, -5024, -3144, 3122]
2062C122o91l419P1l3QL386L56o190j222Q196K258r219l223R209L797q156l777
2079e527O334L113m108j717J848l34L37K556j904m776L003O568l385p771L309
2094b454Q085k870p517K325O024j924l885J648J330j712J265K001l605k432N210
2109A489L189o295l578O648L666o269l247N330K351m052q99K622q88j351K858
2124A574K99m644L27O065n89o951O84O977p00o290O55N015q85l123J342J057k140
2141a327J087L082k885m077M180M944m735n509M758N495m283m718L342L411k344
2156D21j563J417p78o68L124K23n186k74O772N62p629j087P757J474o936j618
2172c989N384J490l395o88J012m40J191K021l088l673M412N125m830o364M731
$$ y = [3122, 2431, -988, -917, -950, -942, 2444, 2800, -3390, -4612, 3584, 5842, -3377, -6600, 2609, 6406, -1750, -5527, 807, 3920, -188, -1905, -57, -391, -54, 2502, 598, -4178, -1175, 5393, 2008, -5763, -2454, 5631, 2761, -4756, -2431, 3593, 1669, -2216, -568, 762, -950, 315, 2316, -1289, -3721, 1489, 4678, -1617, -5195, 1453, 5119, -1150, -4397, 933, 3284, -768, -1667, 955, 67, -1284, 1574, 1873, -2771, -2444, 3621, 3032, -3919, -3235, 3742, 3042, -3248, -2593, 2422, 1537, -1586, -244, 813, -1327, -240, 2842, -43, -4120, 60, 5004, 269, -5240, -482, 5013, 730, -3988, -646, 2765, 421, -1142, 275, -503, -1171, 1953, 2176, -3010, -3284, 3488, 4050, -3579, -4666, 3091, 4565, -2371, -3989, 1395, 2885, -510, -1198, -186, -626, 565, 2586, -502, -4175, 237, 5362, 532, -5832, -1101]
2187a101O931m073o675K877N644j655l842N11J369L26J286o28l945M48O153O4
2203C690p558r07Q304J700p922k372O759K597m877k236K559J376k13J17k091j803
2219b877L695L653m744n240M997O424m654o844L681O453k429n347J259L462k26
2234A263j075m32j459N67L893k34n817l61O948J241p417j837O919K264n693k296
2250c526M005J700k051o16Kq19J744K352k910l912L560N082l660n793L347N818
2266D323k743n055J953L799j209j945P25q5n61K108O60l781j035N036J452n644
2282b002j879N537K077m981j882L896J295k587l01J121r58J47K337j062l650J580
2298a312M692j729n201J686N163j397m472J104L268q93j752J017o8j251J710J666
$$ y = [-1101, 5830, 1757, -4918, -2041, 3603, 1948, -1894, -1383, -14, 312, 1598, 970, -2975, -2527, 3626, 3690, -3868, -4775, 3529, 5229, -2693, -5065, 1694, 4291, -586, -2822, -263, 1113, 900, 1017, -1074, -2877, 818, 4471, -273, -5513, -516, 5908, 1254, -5590, -1909, 4544, 2115, -3232, -1973, 1489, 1263, 188, -244, -1703, -1136, 2757, 2523, -3294, -3655, 3293, 4534, -2883, -4720, 2199, 4463, -1230, -3526, 479, 2179, 128, -488, -486, -1305, 439, 2791, -119, -4031, -471, 4611, 951, -4842, -1495, 4323, 1580, -3475, -1522, 2277, 1068, -877, -152, -237, -798, 1310, 1970, -1811, -2846, 2190, 3642, -2002, -3881, 1656, 3733, -1248, -3130, 766, 2061, -526, -827, 294, -664, -517, 1820, 758, -2892, -1312, 3380, 1651, -3550, -1864, 3299, 1902, -2570, -1466, 1802, 909, -843, 174, 106, -1145, 565, 2231]
2314B231l049k261M001K768m454l072M281L099l814k597K847J750j791m27O30
2329A42r42J53K558o53m035R78M955p60n546M89N443j5m812k70L516L51j888j20
2347d56J23n56J666J353l073k342L958L335m383l930M122M224l446m012K469L204
2363B256j249j915K50J89N86J652j046l396J118M883q28n741K08N994L62n597
2379b274q63M487J044k834j091J093N64Q16K50k404j410L641K563m252l531M259
2395E8M268l753m431K913M038j820l046O84J604K85J31r76j886J013L686r45m849
2412c026M26N508J72n543p14M842J113l701j207K217R83o22l04r12p15K306J771
2429B594l181k763L604L591l529l982K938L893k154l262J347K159o07p50n8q06
$$ y = [2231, -818, -3079, 922, 3690, -764, -3836, 445, 3544, -270, -2867, -20, 1730, -61, -488, 142, -800, -647, 1911, 1258, -2777, -1799, 3156, 2396, -3150, -2661, 2782, 2767, -2045, -2315, 1201, 1552, -336, -456, -333, -889, 777, 2130, -943, -3285, 673, 4008, -375, -4305, -183, 4041, 595, -3417, -948, 2256, 1007, -908, -658, -469, 117, 1769, 723, -2673, -1555, 3328, 2500, -3241, -3033, 2961, 3323, -2274, -3137, 1350, 2394, -440, -1531, -438, 126, 942, 1192, -1212, -2622, 1019, 3582, -670, -4201, 58, 4326, 573, -3858, -945, 3093, 1273, -1773, -1089, 515, 800, 931, -45, -1931, -918, 2768, 1823, -3026, -2600, 2908, 3080, -2463, -3177, 1665, 2778, -923, -2130, 87, 1070, 448, 144, -768, -1483, 823, 2594, -587, -3350, 254, 3845, 316, -3666, -728, 3165, 1011, -2251, -904, 1255, 648, -102, -160, -966]
2445i66K92K368l34l595R9M347L43m573p60M358R99l614r75K529O70j261r6J3
2463a56p73J113J755j794k697K231L309k295l625K029L504j609k938J097J983
2478A134p16p71M63n89m04J839N88k883q35L555J178l762j416L546J561k980j356
2495a848K123Q14j084p4J02q58P16J889j304k899J500L527j392l814J027L716
2511B141o01l141K79K113K0q96K1m69k70J799O44k726j247L409J828l627k266
2528b989L364K472k698k372J901J702q35r21m7k52Q26J440j258k722J484L512
2544B607j198m127Q70M149k61l714k60K844N25j536n93J51L40J263J84k440q00
2561a996L197J540l602k167L397K676k892k795K058K424j088j732K19N85O08O79
$$ y = [-966, -674, 1694, 1360, -2235, -2136, 2211, 2554, -2019, -2779, 1579, 2578, -1036, -2011, 518, 1188, -73, -169, -156, -929, 184, 1939, 145, -2552, -321, 2988, 693, -2932, -903, 2601, 992, -1946, -849, 1134, 418, -353, 110, -479, -883, 956, 1544, -1339, -2174, 1381, 2559, -1203, -2619, 927, 2488, -492, -1848, 275, 1089, 5, -69, 33, -825, -109, 1780, 476, -2423, -923, 2604, 1212, -2602, -1575, 2141, 1540, -1601, -1322, 791, 811, -85, -64, -533, -803, 996, 1640, -1086, -2333, 1076, 2904, -723, -2989, 375, 2847, 149, -2223, -322, 1380, 545, -376, -423, -675, 151, 1591, 333, -2389, -905, 2607, 1409, -2718, -1848, 2301, 2040, -1674, -1934, 910, 1435, -101, -694, -543, -203, 1060, 1244, -1196, -1996, 1201, 2741, -861, -3028, 369, 3045, 153, -2642, -584, 1840, 752, -980, -761, -176, 432, 1111]
2577A111j125j901J335K937j153l664P19M076k59l927k32L337N94k296p99J084
2593a63O25K00j76j413m55K350J175k958j834L061K373k779k664K302K425j435
2609F34j983O51J215L2j2o50j081Q64K131q62k936N27L444j36l514k04L057N49
2627A726k420n91J350M75l23j33o15m30J443J144k050j731K260K176k131k396
2643b246J743K341j186j950P07J222j76l19j08p39K70J718k69k366o2K810L81
2660A771k980o64K675Q72k097q22J225N42l33q6m39n98J143J262j450j908J553
2677c34K398j399k628J182K409o65k023K61J253J53m54k12o11R7J570R6k279m75
2695a661K711Q29k788j112K460J383j939j323J148J059l35n01l24l59J019J128
$$ y = [1111, -14, -1915, -580, 2357, 1204, -2460, -1741, 2335, 2076, -1851, -2083, 1254, 1848, -448, -1247, -163, 462, 662, 486, -927, -1382, 968, 2143, -815, -2649, 412, 2785, 6, -2658, -356, 2069, 634, -1349, -698, 517, 549, 537, -113, -1194, -330, 1801, 939, -1997, -1470, 1974, 1838, -1676, -1880, 1177, 1726, -694, -1285, 65, 540, 217, 84, -531, -961, 482, 1626, -424, -2155, 105, 2281, 150, -2246, -503, 1838, 652, -1298, -591, 631, 455, 136, 28, -711, -441, 1277, 1008, -1358, -1420, 1390, 1771, -1209, -1873, 802, 1674, -423, -1245, -20, 522, 189, 103, -336, -934, 209, 1471, 21, -1887, -334, 2064, 665, -1963, -781, 1628, 963, -1060, -799, 454, 607, 153, -59, -670, -573, 997, 1093, -1186, -1661, 1050, 1879, -909, -2021, 439, 1822, -117, -1440, -292, 767, 432, -69, -393, -752, 267, 1395]
2711A395j309j909J415K488j217k794Q09K792l60k359j58J678L41o64m99l46M36
2728b61J259q4k111l20K498R41k707j358K507J673k001j698J303J485n19r72j85
2745e50K00Q16O32j167j521J304K140j087k663P72K762l21k584j78K050M59j203
2762a39n98L05N21O93k36j516j76K088P91k470j126K247J591j964j702J372J640
2779A321p32j226N3N68N37J55q71r78R44J770r49k267O26K532k93k405j09K058
2797G34L88j378n92O77N28J79k84q66k24J494O50j780j168J860J528j638j668
2814a560J194J639p17j302J71P64J84k2n60o45N88J411n25j869K53K126J20k179
2832i29l38J835N70j297n73N87M59P2j61o68l25J184Q47j481j250J448J591j307
$$ y = [1395, 86, -1823, -408, 2080, 863, -1931, -1122, 1670, 1310, -1049, -1207, 471, 812, 148, -351, -697, -261, 998, 914, -1197, -1517, 981, 1922, -785, -2143, 364, 2037, 36, -1662, -359, 1126, 607, -365, -550, -350, 466, 1098, -69, -1590, -286, 1854, 767, -1896, -1124, 1638, 1317, -1267, -1445, 605, 1064, -139, -737, -432, 89, 782, 546, -970, -1146, 942, 1733, -737, -1863, 384, 1975, 11, -1691, -319, 1321, 589, -637, -584, -16, 521, 676, -195, -1173, -229, 1541, 592, -1675, -1049, 1483, 1190, -1215, -1324, 734, 1122, -256, -848, -171, 357, 536, 252, -614, -838, 656, 1306, -474, -1642, 218, 1746, 108, -1560, -366, 1273, 556, -746, -575, 189, 373, 351, -209, -854, -266, 1145, 620, -1249, -996, 1130, 1250, -929, -1267, 568, 1138, -159, -732, -145, 314, 386, 225, -443, -768, 416, 1263, -218, -1468, -20, 1571, 264]
2850B64j717Q83J720n25j310P7P70K65j47l78n88M50J207k37j723q0J979L57j957
2869f90o09J661Q84j256q90O59O56K4l50n57k14J033P61j277j287J185J769j055
2887D47j864O74J823k68j475j23R73M28k85n73l53M73J041k74j584n4J863M63
2905A332j895q25J772J024j373j135Q10R21j41o36m09P0Q93M79j096j059J159
2922a09J497r20j806O03J843j98j676j22J180M81n69n92j24M97Q21l25j338p6
2940i33J677M63j767q01J652J035j296j201Q30J088k72p74k61L26O49K57r01q03
2958a032R47J300q02j605N50J673j99j582j43J277L84p65n08J42M85M42l36r50
2976g22L2J231M71j524p48J385J097j155j134P64J036k76q02q6L86M88Q2p03n85
$$ y = [264, -1453, -570, 1150, 625, -685, -608, 162, 427, 280, -98, -686, -236, 971, 734, -989, -1069, 910, 1267, -690, -1299, 362, 1246, -10, -900, -241, 415, 439, 89, -468, -682, 351, 1112, -165, -1452, -267, 1502, 447, -1417, -743, 1080, 812, -663, -786, 187, 615, 330, -243, -596, -123, 918, 644, -940, -994, 869, 1332, -563, -1388, 384, 1408, 35, -1100, -290, 631, 490, -146, -555, -485, 408, 887, -209, -1268, -109, 1388, 468, -1338, -735, 1108, 910, -766, -888, 292, 773, 204, -388, -512, -15, 806, 481, -857, -933, 744, 1207, -560, -1361, 291, 1326, 30, -1171, -341, 747, 475, -299, -560, -234, 415, 672, -229, -1032, -85, 1215, 413, -1192, -642, 1031, 832, -750, -893, 384, 768, 3, -505, -363, 122, 564, 228, -722, -690, 541, 1012, -512, -1260, 125, 1222, 67, -1067, -303, 733, 457, -345, -431, -45, 443, 525, -178, -763]
2995g63O87J136o28j475L62J603j84j426k00J192M58p81n31K18M83L18l03p17
3013e51k0J031L81j186p46J216J017r42j201O64J146k94q98p3M90L37M2n50n87
3032g24N93R93m10j320J73J486M3j403l90J182N80p47o57K60N67K17l39n58k0
3051d74Q85L86j064p70J075J135r44j154N04J183k43r55q2N46M47j82n29l54N56
3070c4P44l32j253J81J429O8j300m47J203O31q77p12M39O16Q5l82n37J13P72K74
3090F81q97o79R39R87q08j173M27J220q5j096j92P66M53l85m41k23N26O67m23
3109B64j011J84J261J28j331l92J124O45q44p24M19P23J8n68l07J86O42J58q32
3128b57n70Q48Q72p06j047M32J141j50j040j43Q39L04l75n54P2M02M37l29q33
$$ y = [-763, -76, 1060, 432, -1043, -681, 922, 738, -688, -888, 304, 762, -19, -550, -332, 151, 469, 166, -551, -571, 460, 841, -345, -1091, 125, 1142, 200, -1001, -337, 809, 515, -383, -456, 34, 371, 413, -137, -724, -131, 862, 452, -868, -695, 791, 834, -569, -959, 223, 803, 56, -601, -341, 226, 443, 104, -454, -474, 411, 797, -267, -1037, 38, 1173, 229, -925, -421, 762, 519, -436, -518, 28, 475, 293, -236, -590, -34, 710, 378, -875, -694, 735, 803, -497, -944, 259, 890, 13, -699, -260, 356, 441, 59, -478, -365, 407, 681, -216, -895, 44, 1031, 223, -950, -523, 697, 612, -484, -676, 90, 543, 158, -283, -506, 20, 687, 264, -747, -563, 698, 826, -505, -897, 227, 872, 28, -696, -277, 446, 464, -104, -411, -225, 417, 575, -257, -827, 21, 893, 187, -860, -428, 713, 563, -477, -620, 219, 523, 148, -406, -334, 68, 505, 176, -657]
3147f57J88J003K15j140m39J039O48p72p79M49P33k3o31k52K68N44J7o43m89P37
3167A6P32n54r73L43J076m1j009j77P71L49l60n05l7N19L12k81p09M9J003J25
3187F49r81m64R06P28p79p57L94P88r3o17k64L40N42nn24m88O30P11m71r65L06
3208d14J000N4j059k02Q28M10n17m99J00M95K44l43n94P4Q57J05q55l61P02O81
3228G06o04p91L92P89j50o30j67L52N07j00n26k57N68N46m19q05J55R95Qq78l17
3249f26P81M30n39m97J69M98J64l72m41J27O96J37q20l94O99P04n98p90L67P49
3269D44m4o95j57M45M33j54n01j67N13L80l49o64K04Q60J6q93l16Q26L96n65n00
3290d88K31M86J37m73l39J49O12Q1o64k76N67O04n01o97K82P58Kp43k09N28L53
$$ y = [-657, -469, 534, 749, -391, -830, 209, 857, 85, -694, -245, 488, 465, -166, -418, -150, 394, 411, -232, -721, 16, 748, 194, -779, -436, 640, 599, -410, -587, 184, 533, 173, -332, -369, 150, 462, 181, -528, -479, 524, 649, -332, -796, 110, 838, 59, -698, -304, 484, 391, -226, -490, -150, 392, 387, -137, -625, 5, 716, 245, -720, -414, 586, 640, -419, -621, 207, 617, 100, -399, -299, 196, 440, 97, -497, -423, 434, 539, -316, -677, 25, 706, 102, -689, -297, 492, 342, -288, -455, -103, 404, 304, -222, -479, 89, 635, 216, -589, -434, 561, 569, -309, -626, 155, 585, 46, -451, -282, 216, 380, 8, -433, -306, 390, 527, -293, -687, 12, 716, 118, -672, -305, 444, 400, -295, -452, -7, 426, 272, -229, -396, 117, 497, 148, -516, -312, 548, 564, -329, -645, 181, 577, 12, -488, -257, 229, 366, -107, -446, -297, 315, 396, -268, -544, 23, 627, 126, -571, -289, 469, 471, -272, -481, 47, 400]
3311D00j86m79q7M53L88l84o25J96P84k2p63k54O92M52n04n36K41N59J7m26l45
3332d29K68N30J8o09k71O10M49m02o81J97P37kp20j36N00L39k47m43r2M96L47
3353D59l82n81J84P41%o55k91N95M78m96n13L00N56k9l86l46L36M04m3n04k26
3374c99M94M54m09o75K36P42p3o51j68M65L66k68m67J5M44K67l69m59J76P16J3
3395D50p24k32O07M26m40n20J87N69j1m39k30K56M08k6n05j93N01M34m12o11K36
3416b69O01J1n73k23N11L50k90m42N0M93J18k83m43K12N20K5o06k13N28M13m13
3437G7n01K31N62q2m46k17K91L82p8m84j16M36L08k91n32K31N69K7n24k48M52
3458D7L04k11m36P1M13J72l24l43J99M69l1n44k44N74K77k92n39J86N23J0m22
$$ y = [400, 214, -265, -352, 101, 489, 105, -520, -324, 460, 438, -325, -579, 113, 565, 61, -475, -234, 325, 342, -84, -429, -161, 369, 387, -222, -493, 117, 566, 164, -517, -320, 417, 415, -305, -441, 59, 398, 151, -292, -384, 112, 459, 77, -504, -320, 421, 421, -234, -525, 70, 548, 52, -461, -161, 395, 366, -20, -366, -30, 374, 331, -173, -399, 95, 549, 140, -535, -299, 443, 370, -281, -449, 16, 382, 114, -353, -338, 106, 373, 4, -455, -279, 437, 450, -274, -506, 101, 527, 87, -433, -246, 323, 312, -127, -357, -101, 307, 281, -224, -417, 84, 518, 106, -505, -269, 332, 343, -230, -453, 58, 408, 118, -324, -274, 219, 337, 54, -389, -177, 343, 368, -238, -451, 77, 490, 77, -424, -193, 369, 287, -159, -376, -85, 297, 219, -265, -381, 55, 363, 72, -460, -229, 340, 367, -157, -405, 47, 351, 140, -296, -225, 188, 360, 36, -307, -108, 361, 330, -214, -458, 116, 393, 101, -438, -252, 271, 281, -141]
3479a41k22K67M14j00m22j37M51K18l14l90J78N79n0m80k15M41L59l24m02J02
3499a88L74J16k90l59J72M52J0m47k74M44L19k39m54J66M47L7m16k07L14L32j28
3520A81m07n2L37L17l66l79J86N29l3n16j44M13K88k67m04P6M35J10l33k92J90
3541a31M06r3m30j51M61L30l17m45J55M97k0l58j73K94L54k33l79o8M29K67l59
3562C6m15J99M98n1n00j15L81L13k92l62N0M33J63m54k68K94L76q5l99j47M29
3583H4K83k80m02J53M42nm51q7L36K37j77l87J0L64K36l91k76J53M64r5m82n2
3605c23L68K47j86m28J50L95Q3m08j67K60K66j7l98r4L62K20k83l77J97L80k6
3626B21l83j22K83L26k06l85K7L46J47k88k60J47L80n4l06k45M53J87k11k83N9
$$ y = [-141, -363, -96, 318, 218, -204, -341, 110, 328, 14, -376, -198, 381, 331, -149, -364, 77, 436, 112, -290, -188, 186, 302, 12, -347, -175, 277, 287, -160, -434, 10, 329, 90, -364, -198, 249, 286, -130, -337, -23, 309, 181, -226, -278, 59, 376, 10, -369, -183, 346, 313, -203, -347, 66, 354, 87, -317, -241, 194, 304, -29, -321, -131, 275, 182, -248, -399, 62, 392, 75, -370, -215, 282, 262, -96, -269, 25, 379, 146, -233, -301, 128, 395, 36, -379, -180, 318, 267, -233, -348, 33, 346, 54, -308, -258, 175, 338, -116, -384, -90, 286, 201, -198, -345, 84, 367, 87, -315, -162, 280, 275, -176, -263, 73, 310, 133, -254, -244, 120, 356, -35, -311, -158, 306, 211, -271, -323, 45, 292, 106, -322, -172, 223, 306, -102, -269, -9, 257, 240, -158, -252, 110, 330, 47, -330, -133, 247, 221, -162, -284, -1, 325, 119, -266, -239, 107, 254, -34, -294, -147, 233, 179, -127, -372, 81, 268, 57, -226, -167]
3647a67L83L1l83j43K75K29l8l40r9L45J65k04l56J98L15J1l50j29K52K78j49
3668A24l95R1K87J46l08k45K09L41j1m02q6L04K59k06l25Q0L25P1l22j79J35L78
3690B71j71k89o3L05K17k79k41J73K71j9l34r3K20K87j63l38M8K95J80k77k11
3711b11J47L35r9l20n8K37K63k10l38J16L54Ok86k31K85K24n7l83qL34J95k52
3733D3l29J92K84jl63p7K39K91j76l23N2K93J53l22k07J68L33j10l04l9K45J56
3755A98j78k75J32L29M1l58j88K69L16j20m05N3L31Q0k50k24K37K19l3l04j11
3776b41K58K16j22k91K7K79J29l30k64K33L22j02k81k2K69J10j96k22J47K66k0
3797A65k64j31K70K24j31l04j8K65J60k52k03J85K06k8k97q7K66K16j58k50K0
$$ y = [-167, 216, 247, -136, -279, -4, 225, 187, -153, -252, 93, 258, 54, -302, -104, 211, 222, -128, -257, -5, 273, 124, -271, -180, 107, 253, -55, -300, -91, 250, 239, -163, -249, 55, 314, 108, -217, -137, 188, 259, -63, -242, -107, 271, 100, -189, -252, 53, 270, -9, -250, -77, 194, 175, -159, -252, -32, 255, 92, -246, -198, 97, 277, 0, -211, -64, 271, 172, -148, -206, 31, 294, 84, -254, -138, 216, 222, -64, -295, -10, 214, 157, -226, -234, 100, 295, 43, -286, -94, 190, 189, -174, -251, -12, 279, 103, -220, -168, 125, 278, -44, -251, -83, 250, 140, -164, -203, 42, 198, 20, -255, -123, 206, 247, -111, -299, -30, 286, 166, -239, -186, 145, 225, -25, -249, -12, 207, 174, -130, -241, 17, 233, 111, -180, -153, 126, 255, -75, -339, -106, 216, 114, -167, -189, 80, 190, -6, -228, -81, 185, 165, -99, -230, 40, 264, 133, -171, -189, 76, 236, -16, -219, -34, 172, 144, -153, -240, 26, 242, 84, -166, -146]
3818a46K79O4k73j58J33L23r1k75o2K80J37k18j97O5L15j8k41q1J67K10j52k23
3840a62j6K77P2k02j84J80K11k7k83p3K41J06j02k50K1K62J15k13k36K02K78r7
3862A20k87J1K48N9j33k39J36K25L2k37j31J52K54j23k11l9L30O0k62j98J39K70
3884A76o8k02r1K49J18r9k73K7K60J31k52j61J52K77j42k28o0K86J22j96k42J49
3906f7J97M1k39j59K45J23j8k24j2K57L0k43j04J13J96n8k23l4K23J19j21j96
3928a54O9K22K7j97j51J95K10j13k78n3K97J40k80j38J38J94j9k49m2K10Q8p2
3950D4k10L3J89J40k56j51K33J81o5k97L8K14J02k09r1M2K19k8j45j59J93J41
3972A58p2k06LK67Oj89j35J39J45Kk29m6J69Q1j2k37KK03J48k53j13J59J62p3
$$ y = [-146, 133, 197, -76, -234, -101, 222, 131, -144, -206, 74, 211, -7, -204, -139, 176, 158, -83, -164, 3, 213, 61, -162, -178, 99, 171, -31, -215, -35, 176, 149, -134, -207, 34, 140, 38, -212, -191, 71, 186, -27, -263, -61, 217, 120, -167, -156, 92, 151, 18, -221, -85, 140, 172, -65, -196, -44, 210, 87, -124, -163, 167, 227, -35, -233, -94, 176, 108, -94, -185, 64, 182, 83, -190, -163, 97, 228, -24, -185, -33, 244, 102, -126, -186, 100, 222, 26, -216, -67, 130, 171, -68, -227, 18, 141, 123, -101, -113, 144, 174, -69, -173, -60, 136, 78, -145, -179, 44, 163, 42, -154, -85, 137, 164, -33, -184, 11, 221, 108, -170, -223, 74, 214, -66, -204, -66, 128, 109, -140, -182, 28, 116, 44, -166, -133, 56, 196, -60, -211, 22, 203, 138, -159, -121, 93, 195, -14, -105, -63, 156, 128, -17, -176, 17, 158, 86, -120, -117, 150, 156, -33, -168, -29, 116, 118, -111, -157, 12, 93, 81, -156, -154, 49, 197, -56, -169, -10, 152, 79]
3996G9j87JJ59R2j49r6OJ79J0j36j05P3J83j06j41oK49L4j96j04J00J75k6j34
4020d6n4J25J12q6j83K7K19K2j51j14R5J53o3j64m4J99J28k39j77J84J45n1j29
4043i2n4N8K36m1j95n1K05N3q8j56R9J59m1j32%N2O4K7k45N5J45J16k04j56J64
4068b2J67k4k94N5J83L6j71r5J87Q3j6j07q4P4J84o2k08j4J97J23k41r4J45Q8
4092I0Jj87k2J52Q1o8j80P6J14O7j69p4J16J54j20j21m8K64L8k40m6P9J26lj49
4117f9n9J31J41p3j78k4K41R3k39j14J15J85j10j33j3J68k2pj56O0J35L8j29j85
4141b04J78J02J3j69J4J51K5j35j07Q0J38m5q5q4J63N4k9j64m2K03J00j86j29
4164a58R0J50J4k11MJ17P6j10j00J05K6J11j32j28J22J66r3j73L6J64L3j48j08
$$ y = [79, -108, -107, 52, 144, -5, -101, -95, 84, 94, -42, -147, -74, 109, 3, -138, -144, 105, 139, -57, -161, -61, 114, 88, -46, -100, 25, 137, 51, -132, -105, 114, 136, -15, -129, -34, 119, 56, -108, -152, 47, 175, -64, -241, -57, 88, 37, -92, -146, -88, 148, 107, -88, -139, 66, 119, 31, -125, -26, 133, 92, -40, -40, 12, 76, 103, -142, -87, 58, 174, -30, -186, -22, 145, 121, -173, -118, 65, 101, -70, -165, 22, 105, 89, -18, -102, -28, 156, 94, -114, -128, 69, 192, -49, -143, 2, 90, 91, -96, -118, 34, 115, 47, -133, -57, 57, 124, -45, -119, -3, 151, 31, -90, -138, 126, 164, -76, -122, -43, 83, 80, -69, -128, 3, 144, 71, -107, -131, 110, 203, -36, -150, -35, 150, 40, -93, -106, 62, 40, 33, -123, -63, 72, 110, -19, -204, -26, 76, 89, -80, -66, 85, 110, -25, -132, -52, 86, 41, -44, -128, 35, 89, 60, -104, -146, 57, 157, -29, -158, -68, 82, 96, -115, -111, 6, 82, -28, -128, -23, 3, 114, -18, -146, -24, 142, 49, -124, -88, 76, 109, -39, -147]
4187a47J03J25p4k2n3Q5K4l2r4j6J59J02j90j30J42P0m1j38N2J04R9j27n4J9P4
4212D0J13j87m8R4R9n0j40n0K01R4k11o9J17J25r6q9K1N6K9j8j32oJ66N5j50j06
4238a42J23J89q9j42J6R2O8r6j33J01O8M1j44p0J06J17m2j78l4J55O2j20m9P7
4262b4J49l5j53j6J06K4Oj35mJ44L8o7j64J20J36r4j41P5N7N6p8o5L3N5K1j21
4288g7rM8J42n8j26K1J54L5j49r8J34O5m2j17MJ13N5q0m3K7Q2N4k07j2N7J68j10
4315C1j34J5J52Op8j02P6Q6m3l1n0K7J22o5q8k7J40M8j03p5J62J8m5j07J0R9K6
4342G0l4p6L5M2K5p7n1M4J31k5j84N1P7Km8n2N1M8j6p6OR2J8qq4j8J05J28k26
4371e0n1J46N8k2j48j7O7J07j11pj7N9K5r0o9O0J74o8j46M1Q6M3j05m5Q8J3L2
$$ y = [-147, -44, 81, 7, -15, -68, 17, 41, 9, -85, -101, 58, 160, -30, -160, -18, 52, 11, -127, -75, 29, 128, 1, -53, -34, 40, 153, -34, -82, 12, 111, 61, -79, -129, 72, 166, -45, -114, 3, 128, 32, -57, -36, 20, 49, 31, -101, -107, 59, 114, -36, -142, -19, 170, 81, -61, -45, 47, 115, 19, -114, -13, 55, 96, -48, -118, -12, 105, 63, -115, -149, 6, 68, -52, -101, -24, 125, 90, -63, -79, 27, 51, 57, -78, -82, 62, 100, 33, -131, -11, 125, 31, -110, -35, 22, 78, 0, -65, -32, 23, 44, -77, -86, -38, 104, 46, -80, -59, 95, 130, -19, -117, 17, 82, 40, -77, -73, 40, 95, 15, -28, -1, 81, 135, -72, -84, -27, 141, 31, -103, -88, 64, 70, -8, -110, -34, 52, 9, -22, -72, -45, 77, 12, -76, -103, 37, 85, -18, -93, 69, 87, 42, -65, -55, 44, 70, 36, -40, -5, 37, 62, -15, -66, -22, 109, 84, -100, -49, 28, 30, -18, -70, -19, 29, 13, -63, -57, 35, 53, 45, -39, -57, 48, 176, -50, -101, 45, 103, 81, -67, -84, -17, 90, -21, -28, -45, 14, 39, -51, -120, -60, 114, 46, -100, -59, 27, 70, -35, -80, 8, 21, 53]
4398E3j26Q4k8P0nq6k2R1N7j46j09J60J11o1j08O8N9Jl5p5j5J04rm5q4K7J67l7
4426F1j58N6O7N1j16m8R6N7p9p1JM0J47n8o5j6L9J01j07j20J09J20l9j19J2Q6
4452D7jj7r3O4L6j4k3q3N0J27o8n8k3J39J3j35L4K9P8p8r5j5R1K3j0j24J11M4
4480D9j5K4j37N8P3j3j40P3O4J6q0k7P7L7J6j13n2Q6O5Lr1m6J07J5r5q0J19N4
4508D7n4j5j1%J21p0m6ML2Q4o0p4OJ26o5p9j9R6M7n0j04Q8J6j9m1m5Q7k5O4j57
4538a16L8J29j4l6j06J14N3K2j19K3J9L1Kj12R4K6j4m2m1N8P7n8o4K2P7jj33j0
4566h1N0O9l1K2j26R4J8j6l2j6J12j2j01l1O8N3j4q0PJ52k9r0k3M4N5JK5j44M4
4595a2J04k4r5l0Q9J2p0o5N7Q9k7k3koL3L2j36mJ57m1o1k2L8R2k9r7kQ8N6j15
$$ y = [53, -73, 11, -17, 53, 48, -38, -60, 31, 88, -58, -167, -7, 104, 43, -65, 3, 62, 63, 28, -47, -62, 42, 33, -12, -96, -69, 98, 61, -97, -41, 26, 77, -39, -87, 9, 66, -13, -84, -83, -43, 104, 46, -19, -35, 4, 105, -2, -122, -13, 107, 68, -51, -39, 47, 46, 29, -64, 0, 36, 22, -1, -84, -34, 93, 25, -33, -56, 83, 96, -39, -5, 24, 102, 24, -71, -86, 5, 28, 18, -106, 5, 49, 34, 58, -79, -21, 52, 39, -101, -28, 36, 52, -28, -55, 22, 59, 75, -38, -90, -4, 61, 64, -27, -73, 34, 49, -46, -126, -7, 47, -7, -22, -33, -33, 88, 18, -28, -24, 8, 92, 32, -42, -36, 90, 25, -54, -73, 23, 70, 20, -84, 4, 20, 1, -40, -85, 2, -23, 41, -116, -78, 51, 37, 1, -105, 9, 62, 84, -35, -12, 7, 38, 40, -72, 22, 48, 34, -8, -49, 9, 86, 28, -36, -14, 63, 62, -71, -81, -31, 38, 7, 29, -97, -3, 15, -1, -33, -49, 63, 51, -50, -81, -13, 40, 26, -54, -47, 105, 76, -14, -37, 7, 62, 63, 88, -56, -12, 92, 68, -27, -57, 32, 44, -26, -91, -34, 55, 28, 5, 3, -3, 30, 62, -74, -78, 79, 38, -23, -45, -7, 85, 56, -41, -43, 45, 101, -14]
4625a4RJ2kL9k6j17O6J8M3j03L5R8L7r3o5O0O2lq5K6N8l9Kk1j6N2N2o6o4L6N6
4656D7j4n5m6N4L8o2j9J2O3Qm7k8J4O7K3j34L7N8M9r2j9N3N7n6m4Q3j7N2Ro9k4
4687bJ2O9m4r6K8Q0n8j3LM1L9n4k3nK8j4J5Mk0O1n6j1rR1l4n9PPN8n6m5P1l1K
4721a4O1j25M4M2j7j6j9QM5j5l8j9R8Jr3OO5M6p5O4n8J4L3l9n1L0P3j7n8n7R2
$$ y = [-14, -5, 7, 5, 44, 18, -99, -33, -15, 28, -75, -40, 58, 95, 2, -63, -3, 59, 56, -29, -3, 55, 16, 18, -3, -19, 33, 85, 19, -45, -9, 47, 33, -22, -68, -14, 24, -38, -57, -45, 18, 26, -21, -49, -35, 32, 55, -79, -42, 16, 65, -27, -46, 7, 64, 8, -36, 47, 30, 82, 91, 22, -2, 10, 79, 35, -61, -33, 47, -11, -24, -21, 20, 59, 5, -18, -23, 5, -9, 6, 10, -10, 51, -5, -16, -25, 66, 32, -27, -20, -13, 45, -11, -56, 15, -16, -14, 47, -78, -34, 8, -9, -25, -44, -36, 9, -6, -44, -63, 35, 36, -57, -51, 14, 60, -15, 49, -9, 5, 38, -1, -52, -22, 51, 34, -24, -81, 11]
$$ [...]
8191c4
##END NTUPLES=NMR FID
##END=
