##TITLE=1H_LY-DMAA-Per3.16
 CDCl3
 8 sc, 
 11.03.2022
##JCAMPDX= 6.0         $$ Bruker NMR JCAMP-DX V2.0
##DATA TYPE= NMR FID
##DATA CLASS= NTUPLES
##ORIGIN= UXNMR, Bruker Analytische Messtechnik GmbH
##OWNER= root
$$ XWIN-NMR		Version 3.5
$$ Fri Mar 11 14:16:48 2022 Russian Standard Time (UT+4h)  she@DPX200
##.OBSERVE FREQUENCY= 200.131346
##.OBSERVE NUCLEUS= ^1H
##.DELAY= (6, 6)
##.ACQUISITION MODE= SIMULTANEOUS
##.ACQUISITION SCHEME= undefined
##.AVERAGES= 8
##.DIGITISER RES= 18
##SPECTROMETER/DATA SYSTEM= spect
##.PULSE SEQUENCE= zg30
##.SOLVENT NAME= CDCl3
##.SHIFT REFERENCE= (INTERNAL, CDCl3, 0, 15.7039)
##AUDIT TRAIL= $$ (NUMBER, WHEN, WHO, WHERE, WHAT)
$$ ##TITLE= Audit trail, XWIN-NMR		Version 3.5
$$ ##JCAMPDX= 5.01
$$ ##ORIGIN= Bruker BioSpin GmbH
$$ ##OWNER= she
$$ F:/spectra/data/she/nmr/H-F/1/audita.txt
$$ ##AUDIT TRAIL=  $$ (NUMBER, WHEN, WHO, WHERE, WHAT)
(   1,<2022-03-11 14:15:40.78 +0400>,<she>,<DPX200>,
      <created by zg, POWCHK disabled, PULCHK disabled
       configuration hash MD5:
       00 E9 B6 7A A2 85 ED C7 34 08 36 98 17 FE 4E 26
       data hash MD5: 16K
       45 31 AE AE 31 4A 17 FA CA C5 45 24 4B 92 9C 9F>)
$$ ##END=
$$ 
$$ hash MD5
$$ B8 0B 26 C7 7B A1 CE 08 1B 76 B9 29 9F 95 9A 10
##$RELAX= 
##$RELAX= 
##$RELAX= 
##$RELAX= 
##$RELAX= 
##$RELAX= 
$$ Bruker specific parameters
$$ --------------------------
##$DU= <F:/spectra>
##$EXPNO= 1
##$NAME= <H-F>
##$PROCNO= 1
##$TYPE= <nmr>
##$USER= <she>
##$AMP= (0..31)
100 100 100 100 100 100 100 100 100 100 100 100 100 100 100 100 100 100 
100 100 100 100 100 100 100 100 100 100 100 100 100 100 
##$AQSEQ= 0
##$AQ_mod= 1
##$AUNM= <au_zg>
##$AUTOPOS= <>
##$BF1= 200.13
##$BF2= 200.13
##$BF3= 200.13
##$BF4= 200.13
##$BF5= 200.13
##$BF6= 200.13
##$BF7= 200.13
##$BF8= 200.13
##$BYTORDA= 1
##$CFDGTYP= 0
##$CFRGTYP= 5
##$CHEMSTR= <none>
##$CNST= (0..31)
1 1 145 1 1 1 1 1 1 1 1 1 1 1 1 1 1 1 1 1 1 1 1 1 1 1 1 1 1 1 1 1 
##$CPDPRG= <>
##$CPDPRG1= <>
##$CPDPRG2= <>
##$CPDPRG3= <>
##$CPDPRG4= <mlev>
##$CPDPRG5= <mlev>
##$CPDPRG6= <mlev>
##$CPDPRG7= <mlev>
##$CPDPRG8= <mlev>
##$CPDPRGB= <>
##$CPDPRGT= <>
##$D= (0..31)
0 1.2 0 0 0 0 0 0 0 0.06 0 0.03 0 0 0 0 0.0002 0 0 0 0 0 0 0 0 0 0 0 0 
0 0 0 
##$DATE= 1646993740
##$DBL= (0..7)
120 120 120 120 120 120 120 120 
##$DBP= (0..7)
150 150 150 150 150 150 150 150 
##$DBP07= 0
##$DBPNAM0= <>
##$DBPNAM1= <>
##$DBPNAM2= <>
##$DBPNAM3= <>
##$DBPNAM4= <>
##$DBPNAM5= <>
##$DBPNAM6= <>
##$DBPNAM7= <>
##$DBPOAL= (0..7)
0.5 0.5 0.5 0.5 0.5 0.5 0.5 0.5 
##$DBPOFFS= (0..7)
0 0 0 0 0 0 0 0 
##$DE= 6
##$DECBNUC= <off>
##$DECIM= 32
##$DECNUC= <off>
##$DECSTAT= 4
##$DIGMOD= 1
##$DIGTYP= 9
##$DL= (0..7)
0 120 120 120 120 120 120 120 
##$DP= (0..7)
150 150 150 150 150 150 150 150 
##$DP07= 0
##$DPNAME0= <>
##$DPNAME1= <>
##$DPNAME2= <>
##$DPNAME3= <>
##$DPNAME4= <>
##$DPNAME5= <>
##$DPNAME6= <>
##$DPNAME7= <>
##$DPOAL= (0..7)
0.5 0.5 0.5 0.5 0.5 0.5 0.5 0.5 
##$DPOFFS= (0..7)
0 0 0 0 0 0 0 0 
##$DQDMODE= 0
##$DR= 18
##$DS= 0
##$DSLIST= <SSSSSSSSSSSSSSS>
$$ [...]
##$SUBNAM2= <"">
##$SUBNAM3= <"">
##$SUBNAM4= <"">
##$SUBNAM5= <"">
##$SUBNAM6= <"">
##$SUBNAM7= <"">
##$SUBNAM8= <"">
##$SUBNAM9= <"">
##$SW= 18.0517287032376
##$SWIBOX= (0..15)
0 0 2 0 0 0 0 0 0 0 0 0 0 0 0 0 
##$SW_h= 3612.71676300578
##$TD= 16384
##$TD0= 1
##$TE= 0
##$TE2= 300
##$TE3= 300
##$TEG= 300
##$TL= (0..7)
0 120 120 120 120 120 120 120 
##$TP= (0..7)
150 150 150 150 150 150 150 150 
##$TP07= 0
##$TPNAME0= <>
##$TPNAME1= <>
##$TPNAME2= <>
##$TPNAME3= <>
##$TPNAME4= <>
##$TPNAME5= <>
##$TPNAME6= <>
##$TPNAME7= <>
##$TPOAL= (0..7)
0.5 0.5 0.5 0.5 0.5 0.5 0.5 0.5 
##$TPOFFS= (0..7)
0 0 0 0 0 0 0 0 
##$TUNHIN= 0
##$TUNHOUT= 0
##$TUNXOUT= 0
##$USERA1= <user>
##$USERA2= <user>
##$USERA3= <user>
##$USERA4= <user>
##$USERA5= <user>
##$V9= 5
##$VALIST= <valist>
##$VCLIST= <CCCCCCCCCCCCCCC>
##$VD= 0
##$VDLIST= <DDDDDDDDDDDDDDD>
##$VPLIST= <PPPPPPPPPPPPPPP>
##$VTLIST= <TTTTTTTTTTTTTTT>
##$WBST= 1024
##$WBSW= 4
##$XGAIN= (0..3)
0 0 0 0 
##$XL= 0
##$YL= 0
##$YMAX_a= 400047
##$YMIN_a= -342763
##$ZGOPTNS= <>
##$ZL1= 120
##$ZL2= 120
##$ZL3= 120
##$ZL4= 120
##$ABSF1= 10
##$ABSF2= 0
##$ABSG= 5
##$ABSL= 3
##$ALPHA= 0
##$AQORDER= 0
##$ASSFAC= 0
##$ASSFACI= 0
##$ASSFACX= 0
##$ASSWID= 0
##$AUNMP= <proc_1d>
##$AZFE= 0.1
##$AZFW= 0.1
##$BCFW= 1
##$BC_mod= 2
##$BYTORDP= 1
##$COROFFS= 0
##$CY= 11.3945322036743
##$DATMOD= 1
##$DC= 2
##$DFILT= <>
##$DTYPP= 0
##$F1P= 2.36226072786647
##$F2P= -0.459571619588291
##$FCOR= 0.5
##$FTSIZE= 0
##$FT_mod= 4
##$GAMMA= 1
##$GB= 0.15
##$INTBC= 1
##$INTSCL= 1
##$ISEN= 128
##$LB= 0.24
##$LEV0= 0
##$LPBIN= 0
##$MAXI= 10000
##$MC2= 0
##$MEAN= 0
##$ME_mod= 0
##$MI= 1.114404
##$NCOEF= 0
##$NC_proc= 0
##$NLEV= 6
##$NOISF1= 3.799351
##$NOISF2= 2.8
##$NSP= 1
##$NTH_PI= 0
##$NZP= 0
##$OFFSET= 15.70392
##$PC= 1
##$PHC0= -16743.42
##$PHC1= 6.200781
##$PH_mod= 1
##$PKNL= yes
##$PPARMOD= 0
##$PSCAL= 0
##$PSIGN= 0
##$REVERSE= no
##$SF= 200.130013532006
##$SI= 16384
##$SIGF1= 3
##$SIGF2= 2
##$SINO= 400
##$SIOLD= 16384
##$SREGLST= <1H.CDCl3>
##$SSB= 0
##$STSI= 0
##$STSR= 0
##$SW_p= 3612.71676300578
##$SYMM= 0
##$S_DEV= 0
##$TDeff= 0
##$TDoff= 0
##$TI= <>
##$TILT= no
##$TM1= 0
##$TM2= 0
##$TOPLEV= 0
##$USERP1= <user>
##$USERP2= <user>
##$USERP3= <user>
##$USERP4= <user>
##$USERP5= <user>
##$WDW= 1
##$XDIM= 8192
##$YMAX_p= 0
##$YMIN_p= 0
$$ End of Bruker specific parameters
$$ ---------------------------------
##NTUPLES= NMR FID
##VAR_NAME=  TIME,          FID/REAL,        FID/IMAG
##SYMBOL=    X,             R,               I
##VAR_TYPE=  INDEPENDENT,   DEPENDENT,       DEPENDENT
##VAR_FORM=  AFFN,          ASDF,            ASDF
##VAR_DIM=   8192,          8192,            8192
##UNITS=     SECONDS,       ARBITRARY UNITS, ARBITRARY UNITS
##FACTOR=    0.0002768,     1,               1
##FIRST=     0,             0,               0
##LAST=      2.2672688,     0,               0
##MIN=       0,             -342763,         0
##MAX=       2.2672688,     400047,          0
$$ Real data points
##PAGE= N=1
##DATA TABLE= (X++(R..R)), XYDATA
$$ [...]
1445E522j1659M311O989p408k661J0790p98j3817L439J6068n218j6859O258J6200
$$ 5522 -6137 -1826 5163 -2245 -4906 5884 5086 -8731 -5292 10776 5558 -11301 -5043 11157
1459A1157p049j3936P748J0524q768o444J0111K091j1706J799J3166n078j4140
$$ 11157 4108 -9828 -2080 8444 -324 -6768 3343 5434 -6272 -4473 8693 3615 -10525
1472a0525P328J4355q815j3291R328J1274r576p792R595L468r671J268J0145n836
$$ -10525 -3197 11158 2343 -10948 -1620 9654 78 -7714 1881 5349 -4322 -3054 7091 1255
1486A255j0830R674J1764j2451j2228J3720J2163j3627j1027J2200Q593j0197
$$ 1255 -9575 99 11863 -588 -12816 904 13067 -560 -11587 613 9206 -991
1498i91m981Q009J20o035N175M734j0523m288J5095M615j8227n358J9596O109
$$ -991 -5972 2037 2157 -3878 1297 6031 -4492 -8780 6315 10930 -7297 -12655 6941 13050
1512A3050j8854o410J6449N598j2374l494P661O0k962M640j327r677M191J4727
$$ 13050 -5804 -12214 4235 9833 -2541 -6035 1626 1686 -1276 3364 2037 -7640 -3449 11278
1526A1278n683j8912N778K1284m725k1641K976J9616j245j5564K27R842l17l260
$$ 11278 5595 -13317 -7539 13745 9020 -12621 -9645 9971 8726 -6838 -6611 3231 2914 -346
1540c46J947l486m547R101Q358j3359j2120J5470J5363j5406j7188J3566J7114
$$ -346 1601 -1885 -6432 2669 11027 -2332 -14452 1018 16381 975 -16213 -2647 14467
1553A4467j0369j5022O773J0810l513n013J188j774l06Q427Q98j4376k542J8573
$$ 14467 4098 -10924 -4151 6659 3146 -1867 -679 -2453 -2759 5668 6566 -7810 -10352 8221
1567H221M742k0491p028K0091Q676j7619q842J3565P450q630m393L757o8L96N558
$$ 8221 12963 -7528 -14556 5535 14211 -3408 -12250 1315 8765 135 -4258 -501 -569 -173 5385
1582E385l512j0909N110J5609n364j8810M405K0041k921j9114J276J6184k79j1707
$$ 5385 1873 -9036 -3926 11683 6319 -12491 -8086 11955 9034 -10080 -8804 7380 7101 -4606
1596d606K86O197j445o66L782m336o721Q182R799j0435j2411J1384J3868j0824
$$ -4606 -4320 1877 432 -234 3548 -788 -7509 673 10472 37 -12374 -990 12878 2054
1610B054j3909R403J2355p611r233N800N180m654m91M245m231m494Q226N257j1356
$$ 2054 -11855 -2452 9903 2292 -6941 -1141 4039 -615 -1106 3139 -1092 -5586 2640 7897 -3459
1625c459o129J3056O641j3453o458J2625N352j0925l186Q728M87o706K897M830
$$ -3459 -9588 3468 10109 -3344 -9802 2823 8175 -2750 -5936 2792 3279 -3427 -530 4300
1639D300o155l413R165K575j1543j851J2722J265j2708n12J1665p24r677K319
$$ 4300 -1855 -5268 3897 6472 -5071 -6922 5800 7065 -5643 -6155 5510 4786 -4891 -2572
1653b572P150m423m684O749K419r072p03J0978n19j2058J212J2192j786j1129
$$ -2572 4578 155 -4529 2220 4639 -4433 -5136 5842 5323 -6735 -5523 6669 4883 -6246
1667f246K371R095l176o273M530L055o017J3P864k563r818M501J1321n460j2239
$$ -6246 -3875 5220 2044 -4229 301 3356 -2661 -2648 5216 2653 -7165 -2664 8657 3197 -9042
1682i042N635J1943n251j0443M524P851m094m245L889J16m299M122N154p669o492
$$ -9042 -3407 8536 3285 -7158 -2634 5217 1123 -3122 767 883 -3416 706 5860 -1809 -8301
1697h301J0318P902j1629r015J1672R408j0416q690Q333O837n836l705L411m05
$$ -8301 2017 9919 -1710 -10725 947 10355 -61 -8751 -418 6419 583 -3122 289 -116
1711a16j484M852L43r116k45J2658Q27j4832k179J5496L400j4440m154J1925M025
$$ -116 -1600 3252 3595 -5521 -5766 6892 7719 -7113 -9292 6204 9604 -4836 -8990 2935 6960
1726F960q319k800M250N06l13K875l066o473N313J0068o231j3064N995J4822m797
$$ 6960 -1359 -4159 91 597 284 3159 93 -6380 -1067 9001 2770 -10294 -4299 10523 5726
1741E726j4972L090J3495j483j0488L59O212j16j491R40l360k674P503M886j0332
$$ 5726 -9246 -6156 7339 5856 -4632 -4273 1939 1823 332 1272 -2088 -4762 2741 7627 -2705
1756b705p355J1703R429j1546j0598J0142J0509p808q857N193N979k733k111J099
$$ -2705 -10060 1643 11072 -474 -11072 -930 9579 1771 -7086 -1893 4086 1353 -758 341
1770C41k396k46O663L07j0213j131J2613K385j3651l601J3068M268j1259m181
$$ 341 -2055 -2301 4362 4669 -5544 -6675 5938 8323 -5328 -8929 4139 8407 -2852 -7033
1784g033Q521L078n365j066K350j763K63M939k002p964L028J0378l246j1726K805
$$ -7033 1488 4566 -799 -1865 485 -1278 -1015 3924 1922 -6042 -3014 7364 4118 -7608 -4803
1799d803J1984k152j0862J593Q744j527n867J959K635l076O06M451l269o079N173
$$ -4803 7181 5029 -5833 -4240 4504 2977 -2890 -931 1704 -1372 -766 3685 416 -5663 -490
1814d90P443o317q234O597Q229o246p393N644N695m961l265M535N03m376K329
$$ -490 6953 636 -7598 -1001 7228 982 -6411 -767 4928 -33 -3298 1237 1740 -2636 -307
1829c07M575m819m770O512N126p567n122P700M749p309l626O293K047n368J07
$$ -307 4268 -551 -5321 1191 6317 -1250 -6372 1328 6077 -1232 -4858 1435 3482 -1886 -1779
1844a779M343k548l630M892L152o795k990Q180K904q757k683Q476K190p353j257
$$ -1779 2564 16 -3614 1278 4430 -2365 -5355 2825 5729 -3028 -5711 2765 4955 -2398 -3655
1859c655N874k28m023K270K130m443o61O559k67q436O59R636p06r952N36R167
$$ -3655 2219 1991 -2032 238 2368 -2075 -2736 3823 3556 -4880 -4221 5415 4709 -5243 -4707 4460
1875D460l59p545M73N169j117k347K277m51l899K850N759m519p535N412Q843n310
$$ 4460 4101 -3444 -2971 2198 1081 -1266 1011 560 -3339 -489 5270 751 -6784 -1372 7471 2161
1891B161r496M751R072l609p731K521N343j589k315J243j161j490M338K294o989
$$ 2161 -7335 -2584 6488 2879 -4852 -2331 3012 1423 -892 351 -810 -2300 2038 4332 -2657
1906b657l633Q809M979r496o067R024O584p608o255N604M871l328k522J310n68
$$ -2657 -6290 2519 7498 -1998 -8065 959 7543 -65 -6320 -716 4155 827 -1695 -385 -953
1921i53L35L893j115o961J070R428l74j0930o48J1200J595j0213k203Q020K297
$$ -953 -618 3275 2160 -4801 -3731 5697 5323 -5607 -6255 4945 6540 -3673 -5876 2144 4441
1936D441n317j550K312j00O19K321l047m696M468P060n003q907M787R882l896
$$ 4441 -876 -2426 -114 -214 405 2726 -321 -5017 -549 6511 1508 -7399 -2612 7270 3374
1951C374r626K639Q416j505o210O97L383n46j01J054l061k055N440L443p169m833
$$ 3374 -6252 -3613 4803 3298 -2912 -2215 1168 622 521 1575 -1486 -3541 1899 5342 -1827 -6660
1967f660P850N876p560o315O440N992n037m628L344K684k044nJ135k810o00N365
$$ -6660 1190 7066 -494 -6809 -369 5623 586 -4042 -698 1986 -58 -63 1072 -1738 -2338 3027
1983C027N64p095j139Q292J620q479k005P872J930o453j436M683L65k802J174
$$ 3027 3591 -3504 -4643 3649 5269 -3210 -5215 2657 4587 -1866 -3302 1381 1746 -1056 118
1998A18J062l036K34M813j133o272J552P176j641p352J484O856j319n731J499
$$ 118 1180 -1856 -1622 3191 2058 -4214 -2662 4514 2873 -4479 -2995 3861 2542 -3189 -1690
2013a690L978j783k036K553J61l503J385M618k686n411L357N873l565n787L457
$$ -1690 2288 505 -1531 1022 1183 -2320 -935 3683 997 -4414 -1057 4816 1251 -4536 -1079
2028a079N038l200l788K899J948k749n3K932j875l372L643L828m690m317N267
$$ -1079 3959 759 -3029 -130 1818 -931 -984 1948 73 -3299 344 4172 -518 -4835 432
2043D32M505n201m244M739L462l893k097K900L60k078J654J604l650j565N374
$$ 432 4937 -264 -4508 231 3693 -200 -2297 603 963 -1115 539 2143 -1507 -3072 2302
2058B302J730o652k045P029K427o821k498N897K175m454j355K778L7j140J752
$$ 2302 4032 -2620 -4665 2364 4791 -2030 -4528 1369 3544 -910 -2265 513 550 -590 1162
2073A162k32l663J220N418j508o862J406P598q71p612L33O747J34n193k41K990
$$ 1162 930 -2733 -1513 3905 2397 -4465 -3059 4539 3668 -3944 -3611 3136 3270 -1923 -2164 826
2089H26j74n87J031j671k403L530L806m547n315M975O288m608o765L864O356k690
$$ 826 652 65 1096 -575 -2978 552 4358 -189 -5504 -529 5759 1151 -5614 -1750 4606 1916
2105A916n192J615L340p70q75L29j660l74L978R50n796j898O891K948p129l867
$$ 1916 -3276 -1661 1679 909 34 363 -1297 -1671 2307 3257 -2539 -4437 2454 5402 -1727 -5594
2121e594O603M165n413l877L763K843k007j258N34r88P35L110j213n098J228O625
$$ -5594 1009 5174 -239 -4116 -353 2490 483 -775 -241 -1229 -494 2616 1403 -3695 -2467 4158
2137D158p85p451J29P405O43o571j042N082R90l127l76R38p05R77K161k549l641
$$ 4158 3373 -4078 -3949 3456 4099 -2472 -3514 1568 2558 -569 -945 -7 -712 265 2426 -123 -3764
2154c764L414M869l607n822L322O154k753n768K044M748j465l051J053J134j044
$$ -3764 -350 4519 912 -4910 -1588 4566 1813 -3955 -1911 2837 1372 -1679 -626 508 -536
2169e36R85J352k796j933M144K729m935l303N017L673m660l619L906K991k971
$$ -536 449 1801 -995 -2928 1216 3945 -990 -4293 724 4397 -263 -3882 24 3015 44
2184D4j845K038L02j370J333R56k939q61M249J035n186j171N390J342n006j251
$$ 44 -1801 237 539 -831 502 1458 -1481 -2342 1907 2942 -2244 -3415 1975 3317 -1689 -2940
2200b940M215R51l156k10K119j009r96K272J53l484L90M498o32n122O74N106n76
$$ -2940 1275 2226 -930 -1140 979 -30 -1026 1246 1399 -2085 -1695 2803 2171 -2951 -2277 2829 2253
2217B253m752N71L748o02k543R38J180j592J64K446j189l398K049M071k328m585
$$ 2253 -2499 -1928 1820 1218 -1325 -387 793 -799 -635 1811 622 -2776 -727 3344 1016 -3569
2233c569K368M628k076m130J630L152j268j752J157J44j268J316J781k716k401
$$ -3569 -1201 3427 1351 -2779 -1149 2003 735 -1017 140 284 -984 332 2113 -603 -3004
2248c004L663K992m172l433M036L683l568l402K738K596j777j365J001k09m46
$$ -3004 659 3651 -521 -3954 82 3765 197 -3205 -467 2129 352 -1013 -12 -221 -667
2263f67J845L24l445l72M746P13n441j219N521J654n002j818L955J630k656j003
$$ -667 1178 1502 -1943 -2315 2431 3144 -2297 -3516 2005 3659 -1343 -3161 794 2424 -232 -1235
2279a235J142n9J80J412j195k904J769M203j825n150J527N582q87n449L03M587
$$ -1235 -93 -152 28 1440 245 -2659 -890 3313 1488 -3662 -2135 3447 2560 -2889 -2586 2001
2295B001J55l202k59J461J02K55N84j837j515K951K665l672l660L829M234l389
$$ 2001 2156 -1046 -1305 156 258 513 1097 -740 -2255 696 3361 -311 -3971 -142 4092 703
2311G03m488K611M183j829l138Q97J744l72J3J08j728j46L183P39m393j241M912
$$ 703 -3785 -1174 3009 1180 -1958 -1061 683 311 324 432 -1296 -1442 1741 2480 -1913 -3154 1758
2328A758J841m837k296M310K364l289k085K168J222r48j08pj301O36K611q47l841
$$ 1758 3599 -1238 -3534 776 3140 -149 -2234 -66 1156 208 100 93 -1208 -572 2039 1192 -2649
2345b649P76M586l82n009O0M605L70l768m96K697K46j275K91k0j074J042K054
$$ -2649 -1873 2713 2331 -2678 -2618 1987 2357 -1411 -1907 790 1036 -239 52 32 -1042 0 2054
2362B054j787k930K186L585k101l960J855L785j525l234J107K271q84j010Q37
$$ 2054 267 -2663 -477 3108 1007 -2953 -1098 2687 1162 -2072 -965 1306 422 -588 249
2377B49l63j034J471J471k418j902K998K354l175k557K989K470k496k016J912
$$ 249 -114 -1148 323 1794 -624 -2526 472 2826 -349 -2906 83 2553 57 -1959 -47
2392d7J341j348l05R17q85o79K018O02k929q13L508J089l762j157L361J260k854
$$ -47 1294 -54 -359 558 -327 -1006 1012 1614 -1315 -2128 1380 2469 -1293 -2450 911 2171 -683
2409f83r79J985N43j273M08M12j289J45K300m50l201N79L698l33l869O6L677R6
$$ -683 -1662 323 866 -407 1 413 -876 -731 1569 1119 -2082 -1503 2195 1862 -2007 -1941 1736 1832
2427A832l002p8J942k6r33N58k93j161J190J889j820k672K113L186k037l432J685
$$ 1832 -1170 -1248 694 668 -265 293 0 -1161 29 1918 98 -2574 -461 2725 688 -2744 -1059
2444a059L318j178k790O89J938m20o79L69o37m57J774R39k707j519L307K013l347
$$ -1059 2259 1081 -1709 -1020 918 498 -181 188 -449 -906 868 1807 -900 -2419 888 2901 -446
2461d46k505L085K578k446k341J577J799q90p46R5m31K91J713l38k817J34L629
$$ -446 -2951 134 2712 266 -2075 -498 1301 411 -335 -240 -671 -380 1333 995 -1822 -1688 1941
2478A941J93l947o79L906J042l345j223K520J002j366n71L11j95O97J102j313
$$ 1941 2134 -1813 -2492 1414 2456 -889 -2112 408 1410 44 -527 -216 -411 286 1388 75
2494G5k141J620K978j556l623J245L811q43l490L38K707Q5j688k01N26oP01M44
$$ 75 -2066 -446 2532 976 -2647 -1402 2409 1566 -1924 -1586 1121 1206 -482 -683 -157 -163 538 982
2512I82j654j151K380J874k614k509K584K775k208k717J604K383j024j585L99
$$ 982 -672 -1823 557 2431 -183 -2692 -108 2667 459 -2258 -654 1729 705 -880 -481
2527d81O02j43N61N1j622k03K407N69l000r11L195J256l008j401K469J365j815
$$ -481 121 -22 539 590 -1032 -1235 1172 1741 -1259 -2170 1025 2281 -727 -2128 341 1706 -109
2544a09r39J046K26j63N41k69j492N39K298n77k858L93L092j42l044m2K517K51
$$ -109 -1048 -2 224 61 602 333 -1159 -620 1678 1101 -1757 -1364 1728 1586 -1458 -1500 1017 1268
2562A268j935j42J060k04q4O69o54j245J129J787j320k309J361K653j216k585
$$ 1268 -667 -809 251 47 -37 632 -22 -1267 -138 1649 329 -1980 -619 2034 818 -1767
2578a767Q96K266o20j606M85P55m44J25N62r49q83J594J278k058j522K038J808
$$ -1767 -871 1395 775 -831 -346 409 -35 90 652 -297 -1180 414 1692 -366 -1888 150 1958
2595A958j937j906J652J608j183j138P64M61m46N09J77j379j20K062L50k503o62
$$ 1958 21 -1885 -233 1375 192 -946 -182 279 -167 342 519 -860 -980 1082 1432 -1071 -1733
2612a733K700R00k474j099K078J033j468p29P93J64j78N74l98j296O69J954o79
$$ -1733 967 1867 -607 -1706 372 1405 -63 -792 1 165 -13 561 163 -1133 -464 1490 811
2629H11k599N50K809j85k753r3K392L76j730m68R29L32j53J65o98p75J345J427
$$ 811 -1788 -1238 1571 1386 -1367 -1460 932 1308 -422 -890 39 371 218 383 -315 -1090 255 1682
2647A682j615k020J643K314j358k516J086K235n94j752J69J005L0q0q4q30j31
$$ 1682 67 -1953 -310 2004 646 -1870 -784 1451 857 -895 -726 279 309 229 145 -685 -816
2664h16J709N16k229r91K468J392k361j670J961J713j357j487P75R59j55k71k22
$$ -816 893 1409 -820 -1811 657 2049 -312 -1982 -21 1692 335 -1152 -377 582 427 156 -66
2681f6o29M10J449m10k152J49K614Q8k668n27K535P12j898r20J319O83m80l58
$$ -66 -695 -285 1164 754 -1398 -1249 1365 1453 -1215 -1742 793 1505 -393 -1313 6 689 209 -149
2699a49j17k77P30J020j087j662J145K162j035k376O76K404k55k117%J484Q7o95
$$ -149 -266 -543 187 1207 120 -1542 -397 1765 730 -1646 -970 1434 1179 -938 -938 546 633 -62
2717f2j01j07j59R02M36j399r65J707J415j708j714J509J819j163j570O91J201
$$ -62 -163 -270 -429 473 909 -490 -1455 252 1667 -41 -1755 -246 1573 410 -1160 -469 732
2734G32l60n84J13r3QQ30K0j408k30J816N35k009q94J986R57j634r85J147Q05
$$ 732 372 -212 -99 -192 -184 646 666 -742 -972 844 1379 -630 -1524 462 1419 -215 -1200 -53 752
2753G52o45l89J88j94J06Q58l60j377M04J809j87k067O2J942K94j802l41J255
$$ 752 107 -282 -94 -288 -182 676 316 -1061 -657 1152 965 -1102 -1040 902 1196 -606 -947 308
2771C08L23o81j20R9j79L98O23p69j107Q59J578r29j822P67J873m84j715K21J307
$$ 308 631 -50 -170 -71 -250 148 771 2 -1105 -246 1332 403 -1419 -652 1221 737 -978 -757 550
2790E50j23o11OL3j27O58L50j115o54J398J047j551j238J344J438j114j374P17
$$ 550 427 -184 -178 -145 -272 386 736 -379 -1033 365 1412 -139 -1377 -33 1405 291 -1083 -366
2808c66J101l97n96O3r1J87O40j31j272oJ720K89j910n65J872Q10j688q20J169
$$ -366 735 338 -258 -195 -286 -99 541 410 -862 -868 852 1141 -769 -1334 538 1348 -340 -1160 9
2827IQ13n87n74J07R9L55M17n80j075P22J542n54j852L16J872j9j806k08J437
$$ 9 822 235 -339 -232 -133 222 639 59 -1016 -294 1248 694 -1158 -842 1030 1011 -795 -1003 434
2846D34L56q79m18K76K75K46J60q39n58J152J085j218j456J130J609q29j621M83
$$ 434 790 -89 -507 -231 44 290 450 -389 -947 205 1290 72 -1384 -254 1355 526 -1095 -612
2864f12J481j80j038j09M37K17K19j82p92j00J327L62j644p04J638J019j450j109
$$ -612 869 689 -349 -458 -21 196 415 233 -559 -659 668 1030 -614 -1318 320 1339 -111 -1220
2882a220R80J198o90q31J99M22J64J37l95o21L85J263l36j605J51J652K26j667
$$ -1220 -240 958 268 -563 -364 58 222 359 -36 -657 -272 991 655 -950 -799 853 1079 -588
2900e88m20J372N63j043n26M59M05o0L5m04n06P54Q85p93j245O99J471m89j431
$$ -588 -1008 364 927 -116 -642 -183 222 162 197 -207 -713 41 926 133 -1112 -413 1058 569 -862
2919h62J51J436m3j059j60O17K20m0j33m10j88Q09N02j046q22J088J097j081j202
$$ -862 -711 725 682 -377 -537 80 300 260 127 -283 -471 338 840 -206 -1028 60 1157 76 -1126
2938a126Q18J115m43r06J64N45L8j6j87m34R0Q89O5j203k35J325N10j263o78J087
$$ -1126 -308 807 364 -542 -378 167 205 189 2 -432 -342 547 612 -591 -826 499 1009 -254 -932 155
2958A55P44p55p25L96M37q2k7k33l67L61P25k96j154K25J343Rj432k64J387K93
$$ 155 899 144 -581 -185 252 170 143 -90 -457 -96 629 333 -821 -596 747 756 -676 -940 447 740
2978G40r02m77O90K69j38j11l02j53N58N91p42q82P03J132n58j329L14J322j68
$$ 740 -162 -639 51 320 182 71 -231 -384 174 765 23 -859 -156 976 418 -911 -597 725 557
2997E57r83j27O50K29j92k13l04K5P64J80j045m48J096Q22j018r85Q37J023n14
$$ 557 -426 -553 97 326 134 -79 -383 -358 406 586 -459 -907 189 1011 -7 -992 -155 868 354
3016C54r69K28P10M4k57k24k85L29O90k20j039qJ247K10j289n23J240N97q96p08
$$ 354 -615 -387 323 367 110 -114 -399 -70 620 400 -639 -647 600 810 -479 -1002 238 835 -61 -769
3036g69N61N96j36l08k25J2L57N23n65q60N50J169m20j207P4J298R6j061l24O98
$$ -769 -208 388 252 -56 -281 -269 88 611 46 -814 -264 905 485 -722 -648 650 746 -315 -639 59
3056E9M32l41l01j39Q7N20J39p61m42Q69P68q64r51O26J035l22j051J17Q29J08
$$ 59 491 150 -151 -290 -203 317 456 -305 -747 122 890 26 -925 -299 736 414 -637 -520 309 417
3076D17m35k65O1J99M83j43p72o0R56L58j065n67R91O86p16q10M00P68j53n01
$$ 417 -18 -283 -222 -23 460 317 -455 -515 441 799 -266 -833 158 844 128 -682 -282 486 333 -168
3096a68j83K04L07K08l01o65K47R70p1j117j72J188K98r32m29O36M28k80m12K5
$$ -168 -351 -147 160 368 67 -598 -351 619 548 -569 -741 447 745 -187 -616 20 448 168 -244 -219
3116b19J82K74R8m81m29N26Q07o44q95L83J031j44j000m5P46K26m47k98J00K93
$$ -219 -37 237 335 -146 -575 -49 758 114 -781 -398 633 489 -511 -556 190 416 -31 -329 -229 64
3136F4K10n2n14j86P49M21p31p12P05Q04m81q18J69Q10o7n00j36J16K64J36k38
$$ 64 274 222 -292 -478 271 692 -39 -751 -46 758 277 -541 -372 438 371 -129 -265 -149 115 251 13
3157A3m63J21P04J66r38l68R64N29q01o42N85O45k96m31k1K17K38R2l77l98L65
$$ 13 -450 -329 375 541 -397 -765 199 728 -73 -715 -130 515 219 -212 -233 -16 222 314 -63 -461 -96
3178i6O66k47r12J25R65K0q71k45P33L35l55m57Q4K83K13k8m93j58N47M52m73
$$ -96 570 323 -589 -464 501 521 -350 -595 138 473 118 -339 -255 28 241 213 -280 -438 109 561 88
3199H8p90M89Q79k97r16J01P95J41n32k72K45K82O1j73m79O1O79J44p31m29P36
$$ 88 -702 -213 666 369 -547 -446 349 490 -42 -314 -69 213 274 101 -378 -317 362 506 -225 -654 82
3220H2N59n82p19M29P38k02o26J3L04J98O2l65k54K80O00k01p47l0Q60J63p32
$$ 82 641 59 -660 -231 507 305 -321 -308 -4 194 256 -109 -363 -83 517 316 -431 -461 399 562 -170
3241a70m50O92M77m14n22J31M36O2j46k75j51L53M63m59n96K33Q42j25p86q4P26
$$ -170 -620 72 549 135 -387 -256 180 242 96 -179 -330 23 486 27 -569 -336 506 381 -405 -489 237
3262B37K89n61l65K93L75M6k67l02M8N23J13n56l92N23O21m68p83K87P08n9n83
$$ 237 526 -35 -400 -107 268 314 47 -255 -207 316 429 -127 -519 4 625 157 -626 -339 369 310 -273
3283b73r8L52K41q0k42k57K74M43j06n67j69P75K71o13n33N08N06j48o16RM92
$$ -273 -371 -19 222 142 -100 -357 -83 360 254 -313 -482 293 564 -49 -582 -74 432 284 -332 -323 169
3304A69J47k08k72j30L06L95k52o22J46P19P9p71k20O32L92m93m29K24M07N0k71
$$ 169 316 108 -164 -294 12 407 155 -467 -321 398 477 -294 -514 118 510 17 -412 -188 219 269 -2
3325bk77R1L27K27l87m20L53N78j99p06R1O29O8m69k95L74L36j47k89j23J69L07
$$ -2 -279 -188 139 366 -21 -441 -88 490 291 -415 -324 305 373 -96 -391 -17 319 172 -117 -240 -71 236
3347B36K8n25k01N09N07n71n30L84N62j00o07k3M31J99j75l64K6K82K72j38n12
$$ 236 264 -261 -462 47 554 -17 -547 -163 399 299 -308 -331 100 299 124 -240 -214 68 340 202 -310
3368c10l6O88P7o18l31N49N14m90m33J67L98J2k58k41J45K68K51m37k95K61M77
$$ -310 -346 342 419 -199 -530 19 533 43 -390 -223 175 187 -71 -312 -167 101 352 -85 -380 -119 358
3389C58m2o10l6O08K22n83k74K94L37r5l23o5J71K41Km26j61M35L71l41n51J63
$$ 358 316 -294 -330 278 500 -83 -357 -63 274 179 -144 -209 -38 203 205 -221 -382 53 424 83 -468 -305
3411c05O72o6n64j38M78J81k08l04P6L03J92j68m39M0M81K20n44l62M50M68l14
$$ -305 367 301 -263 -401 77 258 50 -254 -178 125 317 149 -290 -250 231 451 -93 -455 -5 463 149
3432A49n26J82L82M3k93j85Q5K95J05l05k97J62N12l5n35j23M80L36m35l72L22
$$ 149 -377 -195 187 230 -63 -248 -163 132 237 -68 -365 -203 309 274 -261 -384 96 432 -3 -375 -53
3453e3L21o6k64j94K33K48Rl55j44K90L81k81n33K00M41J09n45k20M43K69k01
$$ -53 268 202 -62 -256 -23 225 234 -121 -265 25 406 125 -408 -208 233 342 -203 -423 20 289 88
3474H8l24J8K18L25k81l11K5M32K32l98m47M03M35k16m34K1M09J17l23k01J40
$$ 88 -236 -218 0 325 44 -267 -242 190 422 24 -423 -20 415 199 -235 -214 195 312 -11 -212 -72
3495g2J70J38k27l13J08M59Pm51k19M94K42l11l91K12M21Mm20j06K84K23n8k42
$$ -72 98 236 9 -304 -196 263 270 -181 -400 94 336 25 -366 -154 267 271 -149 -255 29 252 194 -48
3517d8k28K79M04k24m73Q4M05J49m15k57L19L17j75m03J0K97J62j06l53M0L07
$$ -48 -276 3 407 183 -290 -206 199 348 -67 -324 -5 312 137 -266 -256 41 203 97 -256 -216 91
3538I1K56l07m56K66M49p6n15J6M06K24l19k27K5L54K2k26k35J26L59R2m42k26
$$ 91 347 40 -416 -150 299 223 -292 -276 130 354 35 -192 -167 187 209 -17 -252 -126 233 325 -117 -343
3560c43L75L33l00m14J86L44P4l54j67K18K57n6l10j27K92K34r6m51K6M42K07
$$ -343 32 365 65 -349 -163 181 255 -99 -266 -48 209 153 -157 -284 8 242 146 -305 -279 163 370
3581C70m31k39K60L17j41k88k2K65R8j24k82L1K50J56k31l40K24L20M6m67o3L79
$$ 370 -61 -300 -40 277 136 -152 -174 91 189 65 -217 -186 64 220 -11 -351 -127 193 239 -228 -291 88
3603H8J66k23k85J35K41J32k36k31J65L04k6k88k35L10L28j96m47J07L80P6l21
$$ 88 254 31 -254 -119 122 254 18 -213 -48 256 230 -58 -293 17 345 149 -298 -191 189 265 -56
3624e6k14J47K50j3k71o2J74L09j79k73m1L31J95l06k59K07L10m0l76m4K79J81
$$ -56 -270 -123 127 114 -157 -219 -45 264 85 -188 -229 102 297 -9 -268 -61 249 209 -167 -211 68 249
3646B49j90k30pK08J99j71l07R5L38L6l07k23L44K08j91l09M4L45J5j24k41Q3
$$ 249 59 -171 -178 30 229 58 -249 -154 184 220 -87 -310 34 242 51 -258 -214 131 146 22 -219 -136
3668a36K45J14k70k02K06L51j84l43pL61J28k69k09J59K75r7k03r2J26K56l8l73
$$ -136 109 223 -47 -249 -43 308 124 -219 -226 135 263 -6 -215 -56 219 122 -81 -173 -47 209 171 -202
3690b02m5L10J89k17l41J38M05p5l54n2K71K36k05j75r3L04K11k93k31Q0L25K5
$$ -202 -247 63 252 35 -306 -168 237 162 -192 -244 27 263 58 -117 -210 94 305 12 -219 -139 186 211
3712B11l24j25K36K20j49l10Q9K61J43k35k19Q6K70M9l33j45K17L09r4l59j7K82
$$ 211 -113 -238 -2 218 69 -241 -152 109 252 17 -202 -116 154 203 -130 -275 -58 251 157 -202 -219 63
3734F3J74j51l13J20K40M1k37q2J31J88l0k87l1K51J02j93k10J02K55K5k70j26
$$ 63 237 86 -227 -107 133 174 -63 -145 -14 174 144 -143 -174 77 179 -14 -224 -122 133 158 -112 -238
3756b38J75J47j4j96n4K62J06j97j72N8K48J11l23j62K49K19j20k44J3K55J30
$$ -238 -63 84 70 -126 -180 82 188 -9 -181 -123 125 236 -87 -249 0 219 99 -145 -132 123 253
3777B53k69j97J15K58pk21j35J30K84r0l09l2L01J08j83k23J17K63j1j75j51J63
$$ 253 -16 -213 -98 160 153 -68 -203 -73 211 121 -188 -220 81 189 6 -217 -100 163 152 -23 -174 -11
3799a1K39j11k13p3K34J22j29k58L6L65J2k93j21J63K31j46k19MK59P2j57j55
$$ -11 228 117 -96 -169 65 187 58 -200 -164 201 213 -80 -201 -38 193 47 -172 -168 91 163 6 -149
3821a49J9K76M5k34j17J19K20ok96n3K29J39j79j27K9K07L8k01j75J58K17q3k05
$$ -149 -130 146 191 -43 -160 -41 179 173 -123 -176 53 192 13 -114 -85 122 160 -41 -216 -58 159 76 -129
3844a29j16K45J60j43k13N6K64J3j63j62J45J47K6k69JJ38K06j10k85P0L14%k33
$$ -129 -245 0 160 17 -196 -140 124 137 -26 -188 -43 104 130 -139 -138 0 206 96 -189 -119 195 195 -38
3867c8j64J56K08k2k51p0K18J02j04k46M7K52M5j36k65J99K62r8k29pJ62J83j75
$$ -38 -202 -46 162 140 -111 -181 37 139 35 -211 -164 88 133 -3 -268 -69 193 95 -134 -141 21 204 29
3890B9j15l5K83P8k67j37J46J87n3k24q7K19J92j77k27Q6J64R9j87j68Q8K04L2
$$ 29 -86 -121 162 240 -27 -164 -18 169 116 -108 -195 24 216 39 -188 -102 62 161 -26 -194 -106 98 130
3913A30k26r9J84J54o7k41N4J60J44k26j17J30J97o8j47o0J89J05q3j96j00K52
$$ 130 -96 -195 -11 143 76 -165 -111 49 193 -33 -150 -20 177 109 -38 -98 91 196 113 -83 -183 69
3935F9R1k17j70J47K44l7k71J1K00Q4j18k22L8K68K8j52j94J18K17j1k00l8K17
$$ 69 160 -57 -227 -80 164 127 -144 -133 67 151 33 -189 -151 117 145 -7 -201 -83 134 123 -77 -115 102
3958A02J32j42k17O4J88N1k01p8O6J40L6j94j13J50J43p2k15O5J86O3k03o5R3
$$ 102 234 92 -125 -61 127 178 -23 -101 -35 105 141 -53 -166 -16 127 55 -160 -95 91 154 -49 -114 -21
3981b1J97p7j81rQ1J83m9j99n5K52K4j83j07J08K32m2k35m6J86K8o1j85j1J96
$$ -21 176 99 -82 -91 -10 173 124 -75 -130 122 146 -37 -144 -36 196 154 -81 -127 59 87 26 -159 -170 26
4005B6J41j32k39J46K09q8j22j23K21J20o1j92oJ88N8j00j82Q9J26J07k63j13
$$ 26 167 35 -204 -58 151 63 -59 -182 39 159 98 -94 -100 88 146 46 -136 -47 79 186 -77 -190
4027a90J61K28j20k39P1J37Q1j12j74O4K22k4j54n9J25J01m1j27q6K45J01j80
$$ -190 -29 199 79 -160 -89 48 129 17 -157 -93 129 105 -49 -108 17 118 77 -50 -136 109 210 30
4049C0j63O9J50M1j83q9J69Q0k7j90mJ55O9j83o2M2K13k3j67q3P0K33n8k48M6
$$ 30 -133 -64 86 127 -56 -145 24 104 77 -113 -117 38 107 -76 -138 -96 117 94 -73 -156 -86 147 89 -159 -113
4074a13J59J25j32j18P1R4P7j50j51R0J94j31r9n9J79P7m9k08N8J67K5j36j14
$$ -113 46 171 39 -79 -8 86 163 13 -138 -48 146 15 -84 -143 36 113 64 -144 -86 81 106 -30 -144
4097a44J07K03r3j73m1K16N9j00j57R1J07K9j16j09J76J21q6j43m8J76J02j59
$$ -144 -37 166 73 -100 -141 75 134 34 -123 -32 75 104 -12 -121 55 176 90 -53 -101 75 177 18
4119A8j11K1J92r7j10n6J05J54p6j75j2J85N4q6j92Q1J64M9j54q7J33J37j08p2
$$ 18 -93 -72 120 23 -87 -143 -38 116 40 -135 -147 38 92 6 -186 -105 59 108 -46 -133 0 137 29 -43
4143d3j14K31Q2j60j36R5J24L1r5j21Q2J40l1j81k7J59P5j14j60J08J41Mj61l2
$$ -43 -157 74 156 -4 -140 -45 79 110 15 -106 -24 116 85 -96 -123 36 111 -3 -163 -55 86 90 -71 -103
4167a03J04R7%j20j8J05R9j59o5k7J43P9j38o0M3J17L1k00jN4J42j33k4J2Q0O6
$$ -103 1 98 98 -22 -40 65 164 5 -60 -87 56 135 -3 -63 -20 97 128 -72 -73 -19 123 -10 -34 -22 58 124
4193A24j65j00P1J54J1k00j5J44J17j13j05NJ51K6j13q8O3J47lj07j03J08Q2j36
$$ 124 -41 -141 -70 84 95 -105 -120 24 141 28 -77 -72 79 105 -8 -96 -33 114 111 4 -99 9 91 -45
4217d5j05L7J72J9j55l4O8P5j4j07r9K06R7j34r0M0R8J02j00j36N9J82o7j20p0
$$ -45 -150 -113 59 78 -77 -111 -43 32 18 -89 -188 18 115 -19 -109 -69 29 131 31 -105 -46 136 69 -51 -121
4242a21J34J15r7j34L2J25N1j23p4O3O8N3j60m9J08J39j11j20L0J31pp4p2Q0J26
$$ -121 13 128 31 -103 -71 54 105 -18 -92 -29 39 92 -68 -117 -9 130 19 -101 -71 60 53 -21 -93 -13 113
4267A13Nj59o0J38P0n1j33OJ06N5j22r5Q6J43rj94J7J15M1r3p0k6J61O1j07j03
$$ 113 118 -41 -101 37 107 56 -77 -71 35 90 -32 -127 -41 102 93 -101 -84 31 72 -21 -91 -117 44 105 -2 -105
4293a05J01J03l1j57l7J16J41q0j69N6J16J2q6p1P1J14j0j30o9J17J14j06j36
$$ -105 -4 99 68 -89 -126 -10 131 51 -118 -62 54 66 -20 -91 -20 94 84 -46 -115 2 116 10 -126
4316a26J28N4P2j47m9K4J09l8j9j27J35N6J7j69lJ58J8r1j07Q6J22n4j14j8O2
$$ -126 2 56 128 -19 -68 -44 65 27 8 -119 16 72 89 -80 -83 75 93 2 -105 -19 103 49 -65 -83 -21
4341b1R8o4m9o2J47M4j01q6N0J55p7q3n2J60M9o1j52J15O7K5o6j18O7J06m9m8
$$ -21 77 13 -36 -98 49 93 -8 -94 -44 111 34 -49 -101 59 108 47 -105 10 77 102 36 -82 -15 91 42 -6
4367fn9O9P8o8j47Q2J10M3m8j79J31K1mo1j27J26Q7n7r1Q2N9N3j06j3L0Q4nn6
$$ -6 -65 4 82 14 -133 -51 59 102 54 -125 6 27 23 -38 -165 -39 48 -9 -100 -18 41 94 -12 -25 5 89 84 28
4395B8q6P9N9k6j13j7J23M0K7k18J2J84lj58K2J8J09j12Lm7Q5Q1k2j65P0M3M8
$$ 28 -58 21 80 54 -59 -76 47 87 114 -104 -92 92 89 -69 -47 -29 80 -32 -29 -76 9 90 68 -97 -27 16 64
4422F4j45m6Q8J76o5j63J4J44lq4j15O4J42k7o7j3J0J02K3j75l6P4J72j41p2K8
$$ 64 -81 -127 -39 137 72 -91 -77 67 64 -20 -135 -71 71 44 -23 -36 -26 76 99 -76 -112 -38 134 -7 -79 -51
4448e1J07j3p2LJ7M3K0o2p2J19P0j1j03j06K20O8k13n1R9R7j21n3j8J16O2r8o5
$$ -51 56 43 -29 -26 -9 34 54 -8 -80 39 109 98 -5 -111 109 177 -36 -87 12 109 -12 -65 -83 33 95 -3 -68
4475f8J0M2P4j5j56J02R9n2q2K0J05L7j21j02J31N1oj01lk1J31l8p3o2J36N2r0
$$ -68 -58 -16 58 43 -113 -11 88 36 -46 -26 79 116 -5 -107 24 75 69 -32 -35 -56 75 37 -36 -98 38 90 0
4502@r2L9J47m1r3n5J24j2m0K6j5K8O8j9j01MP9rq0o7J19M8Kj35K2Q4L2j0n4o4
$$ 0 -92 -53 94 53 -40 -95 29 17 -23 3 -12 16 84 65 -36 -32 47 38 -42 -109 10 58 60 -75 -53 31 63 53 -1 -65
4532f5O6Q7j11l8M5L7k5o9l0J39N1j07k3K5Q4O0j40k0PO4M8p5p4P5O3m6j19L3
$$ -65 1 88 -23 -61 -16 21 -4 -73 -103 36 87 -20 -43 -18 66 126 -14 -34 -27 37 85 10 -64 11 74 28 -91 -58
4560e8Q5j3p2rN2P6Lj29k6L3J08n4j5p7J51kn1j19R5J15m0q2OO7J3k5r0MO3L6
$$ -58 27 14 -58 -67 -15 61 64 -65 -91 -58 50 -4 -19 -96 55 53 2 -117 -22 93 53 -29 -23 44 57 32 -58 -54 9 45
4590D5p5k7N7M8M7j65l5P9O7n6n4jR7rl0k3J1J22n3jj27R8P6m5r9MJ16J6o1j22
$$ 45 -30 -57 0 48 95 -70 -105 -26 41 -15 -69 -70 27 18 -12 -35 -24 98 45 44 -83 15 91 46 -53 -49 67 83 22 -100
4620a00R5J08j05l2L2QM8l5l2n0M6N4l7j25Q3R5J8j59K1R9N4l0r9L8N7J4n4k7
$$ -100 -5 103 -2 -34 -2 6 54 19 -13 -63 -17 37 0 -125 -42 53 71 -88 -67 32 86 56 -43 -5 52 66 12 -15
4648a5NL9O5j13p8J55K8q7r0L7J33L0r9n2k1O1L6n5K3k5O9k6q5J0P7O5j34m2J05
$$ -15 -10 29 94 -19 -97 58 86 -1 -91 -54 79 109 10 -42 -63 -2 34 -21 2 -23 46 20 -65 -55 22 87 -47 -89 16
4677A6L4K5j41mR5L5k6p6PlQ2q2p3O9Q4J1j13RR0Jo3K7LPN4k6r3O3L3J5Kj45J20
$$ 16 50 75 -66 -70 25 60 34 -42 -35 -38 44 -38 -111 -42 42 53 -60 -51 39 40 -23 4 7 14 68 42 -51 12 45 60 62 -83 37
4710C7J2J3j41K4J30l6J9j22l4J12j9p4kN9P6k9q6n7R9J00m7j11P3O6J4r6j3p
$$ 37 49 62 -79 -55 75 39 58 -64 -98 14 -5 -79 -81 -22 54 25 -61 -118 -19 81 34 -77 -4 62 76 -20 -33 -40
4738d0K5O7m0p3P3M2l5n3k9J28k9j19L6M0K4rn4j2K4N8q5L8l7J05k8j8p3JJ72
$$ -40 -15 52 12 -61 12 54 19 -34 -63 65 36 -83 -47 -7 17 8 -46 -58 -34 24 -61 -23 -60 45 17 -1 -74 -73 99
4767I9q8m8o2J64kq8o2P3N6o3J3m9J2J07o2rn2KJ17p6m3jJ08L1n2j02O9O4m8R
$$ 99 11 -37 -99 65 63 -25 -87 -14 42 -21 -8 -57 -45 62 0 -9 -61 -59 58 -18 -61 -62 46 77 25 -77 -8 56 8 17
4797A7m2Q3j6K7j02LP6J7j35j5P2M1P6j94R6j3RJ8p1j0J07km0j3n3R0j4q2j1J22
$$ 17 -25 58 42 69 -33 -30 46 63 -72 -87 -15 26 102 -92 4 -9 0 18 -53 -63 44 42 2 -11 -64 26 12 -70 -81 41
4827D1K3K9q7p8J34k6p2J9J8N5m2r6M2P1L7k4j68L1R5M0j08qO0L0m9O0p0P3l2
$$ 41 64 93 6 -72 62 36 -36 -17 1 56 14 -82 -40 31 68 44 -124 -93 2 42 -66 -74 -14 16 -33 27 -43 30 -2
4856bK4m6jL2Q5j20n6Q5N2q6kK0N6Ko6J8j5M5L5j05M0J8N0m1nr8O5O8j6j01R2
$$ -2 22 -24 -25 7 92 -28 -84 1 53 -33 -35 -15 41 43 -23 -5 -20 25 60 -45 -5 13 63 22 17 -81 -16 52 36 -65 27
4887B7M3o8nj4R2n9j1m6M1nO7k1o0l9J14l9p5M3ON7m5jk8L4K1m0m9J6P9L8o0q7
$$ 27 70 2 -3 -17 75 16 5 -41 0 -5 62 41 -19 -58 56 17 -58 -15 -9 48 3 2 -26 8 29 -11 -60 -44 35 73 13 -74
4919g4P6N7r3N3o1Q7Pj9j00L2L8k5Nn8K6R6oo9%K1N4o6m4L1J01m7p5K9MJ1k0j4
$$ -74 2 59 -34 19 -42 45 52 33 -67 -35 3 -22 -17 -75 -49 47 41 -28 -28 -7 47 -19 -63 -32 69 22 -53 -24 -20 -9 -29 -43
4951d3P1jP1k0p8j8N8Kp7K9lL1j4J2n5J8K2nKk2J8M9m5k3l7J23l0n9o7Q3M5n9
$$ -43 28 27 98 78 0 -18 40 42 -35 -6 -9 22 8 20 -35 -17 5 0 2 -20 -2 47 2 -21 -58 65 35 -24 -91 -8 37 -22
4983b2m7M4J22o3o8J4J3J6O9q9o9LJ30Oq6n2J18rn2rl6J08n1l5l1pJ28k3o1J6
$$ -22 -69 -25 97 34 -34 -20 -7 9 78 -11 -80 -77 53 59 -27 -79 39 30 -22 -31 -67 41 -10 -45 -76 -83 45 22 -39 -23
5013b3J01j5n0m7M2N2k1o3J7K6K2mn7j9J5M1k9j3N0j9M8r1o4J17J3o3n4J25Lr
$$ -23 78 63 13 -34 8 60 39 -24 -7 19 41 37 -20 -39 -24 17 -12 -25 25 6 54 -37 -101 16 29 -34 -88 37 40 31
5043C1k7m7LoQ0k5n6K6K0O8j03J6N6M0j03lJ6j1J0J4o5oO2J4m3k9N2P8m0n5j1
$$ 31 4 -43 -40 -46 34 9 -47 -21 -1 67 -36 -20 36 76 -27 -30 -14 -25 -15 -1 -66 -72 -10 4 -39 -68 -16 62 22 -33 -44
5074d4J05n8%n4N7P6j38R9k6kL2j3n7J9L8Q6j27j5M1Jm5m3Q2L7n2n9OO0oJ1j8
$$ -44 61 3 3 -51 6 82 -56 43 17 15 47 34 -23 -4 34 120 -7 -22 19 20 -25 -68 14 51 -1 -60 -54 6 0 11 -7
5105gk0J8N7j2q5P0k1L7j0j4PJ3k1l3K1K4j1M1q9pO0J8kp9m3J21Qm1ppJ02j04
$$ -7 -27 -9 48 36 -49 21 0 37 27 13 20 33 12 -21 0 24 13 54 -35 -42 18 36 34 -45 -88 33 41 0 -7 -14 88 -16
5137a6j4NK9l0J00r4o0J02Rl2o2R5J3n9j8pL7L2m7j6ML0J9l2j5J2N4J7j24L1k4
$$ -16 -30 -25 4 -26 74 -20 -80 22 31 -1 -63 32 45 -14 -32 -39 -2 30 -17 -33 -29 1 20 -12 -27 -15 39 56 -68 -37 -61
5168f1J34j02kK8K8Mn3LL5j8oMn8P3qM8r3JQ1l4m5j0L2P5o4mj3j7P3l9k5j3L9
$$ -61 73 -29 -31 -3 25 29 -24 -21 14 -4 -10 -6 -64 9 1 49 -44 -43 38 4 -41 -51 -19 56 -8 -12 -25 -42 31 -8 -33 -46 -7
5201gP0k2j11N0M7kn8j2Q7K6j10JM5j5K5kn2K0L0jl1m5M9M1m4l2L9J5k4QK9j9
$$ -7 63 41 -70 -20 27 25 -33 -45 42 68 -42 -41 4 -11 14 12 -40 -20 10 9 -22 -67 -18 23 -21 -53 -14 1 -23 -15 14 -5
5233eNL8m5l1J4Q8m2j15R0J2J7k8j6j0M4rn1M1J1j3N9q6mN1K5r8LN4j3R4j28P8
$$ -5 0 38 -7 -38 -24 64 22 -93 -3 9 26 -2 -18 -28 16 7 -44 -3 8 -5 54 -32 -36 15 40 -58 -55 -1 -14 80 -48 30
5265C0N5p1j9N8j30J68k4o3j3j2pL2o1O7j9mqm2N1L1jp2NqP1K1m8K6o9M7J4k9
$$ 30 85 14 -5 53 -77 91 67 4 -9 -21 -28 4 -57 10 -9 -13 -21 -63 -12 19 18 -54 -49 -57 14 35 -13 13 -56 -9 5 -24
5297b4lP5mj2p7J3K8jj8L0K2o5QN0m0m0Q4qn9j5O4L2q1j4N9%n6M7LjJ0J2l3MJ05
$$ -24 -27 48 44 32 -45 -32 -4 -5 -23 7 29 -36 -28 22 -18 -58 26 18 -41 -56 8 40 -41 -55 4 4 -52 -5 -2 -3 7 19 -14 -10 95
5332I5k3m3m4K2O8n4p8O6k3N7r9J10p7M0ln5K2m4P6rkqL2J8n6qM8l0J9lm3K3L5
$$ 95 72 29 -15 7 75 21 -57 9 -14 43 -56 54 -23 17 14 -41 -19 -63 13 4 2 -6 26 44 -12 -20 28 -2 17 14 -29 -6 29
5365B9lk5L3kn7J05j21L6J1Rm0m3P6N5l0l2L2k6L4j4p2k8R9l2l4M0K8J6j5j14
$$ 29 26 1 34 32 -25 80 -41 -5 6 15 -25 -68 8 63 33 1 33 7 41 27 -45 -73 26 -6 -40 0 28 44 29 -85
5395h5M7M1N2r2l5R9k8k7M3%o8O4Jm5lQ0o5J0p0K6J02m2k2N2J2m7l6P3j2mK8n7
$$ -85 -38 3 55 -37 -72 27 -1 -28 15 15 -53 11 12 -33 -36 44 -21 -11 -81 -55 47 5 -17 35 47 0 -36 37 25 21 49 -8
5427hJ8L0mL6j16j6J4Q1n2nlQ2p0m4J08p9K2RN9p5L3k7J2n9M7Q7Pn2n1M6J2m3
$$ -8 10 40 36 72 -44 -60 -46 35 -17 -22 -25 57 -13 -57 51 -28 -6 3 62 -13 20 -7 5 -54 -7 80 87 35 -16 30 42 -1
5459aj1JL6l6O7m3m5J4N1K7j10J0R0o5POK1K3q5L5K0qK4Mm4L1j3O1n7m0O4k0K3
$$ -1 -12 -11 25 -11 56 13 -32 -18 33 60 -50 -40 50 -15 -8 -2 19 42 -43 -8 12 4 28 32 -12 19 6 67 10 -30 34 14 37
5492C7j9J6m3P4o2Nl2M3j1km2m2R2jl9OJ8O5m7m1J3L7Kl4J9J7KK7J0j08J3R1r0
$$ 37 18 34 -9 65 3 8 -24 19 8 6 -36 -78 14 13 -26 -20 -2 63 16 -25 -12 25 27 -7 12 29 31 58 68 -40 -27 64 -26
5525b6%mP8m4k7j6L6l2L1k6L0o8N1J9k4lJ8P0q6LL8J2l0m7M7RRj3j6k6J03n8o2
$$ -26 -26 -30 48 4 -23 -39 -3 -35 -4 -30 0 -68 -17 2 -22 -25 -7 63 -23 -20 18 30 0 -47 0 9 18 5 -11 -37 66 8 -54
5558e4P7m5L7J6j9q0L7J27o9q8J0M6%m8O6j1K9p3J07p6J0L6J2q2m3O6N4m4n2N6
$$ -54 23 -22 15 31 12 -68 -31 96 27 -61 -51 -5 -5 -53 13 2 31 -42 65 -11 -1 35 47 -35 -78 -12 42 -2 -54 2
5588BP3j07opN0lj8Rk9M1mK1k4k8N4Pp0K9K4Ol0L1K3l0j7N5p0J5N2l3Lm5K3R0
$$ 2 75 -32 -38 -45 5 2 -16 -7 -36 5 1 22 -2 -30 24 31 -39 -10 14 20 -10 21 44 14 -3 52 -18 -3 49 16 19 -26 -3 87
5622H7l7j18M5L8kp8M1l2O4k8L1j8J8J3Kj3o5L2M3j1k4j1Q2p3j2K3L3n4lkN4l5
$$ 87 50 -68 -23 15 13 -65 -24 -56 8 -20 11 -7 11 24 26 13 -52 -20 23 12 -12 -23 59 -14 -26 -3 30 -24 -27 -29 25 -10
5654a0j4O8m5K3lL8q0l4J19o6m5M4L7l6j3K1l1K9J2J9k2n2M1J0O%Jm8L9l6J4L6
$$ -10 -24 44 -1 22 19 57 -23 -57 62 -4 -49 -5 32 -4 -17 4 -27 2 14 33 11 -41 0 10 16 16 17 -31 8 -28 -14 22
5686B2J2k9k5K5n1J9N3n1p1P2O4l6n2K4R9j8r8J2J9L6k3l3L7m2L7K7k4m8O0J5
$$ 22 34 5 -20 5 -46 -27 26 -25 -96 -24 40 4 -48 -24 75 57 -41 -29 -10 26 3 -30 7 -35 2 29 5 -43 17 32
5716C2j2m9K9K4j6m0nN1J9k5j9pQM4j3Jo8R3j0k2lM3j4o9O7o5R7m3l4J2l6M1J1
$$ 32 20 -29 0 24 8 -32 -37 14 33 8 -11 -18 -10 34 21 22 -46 47 37 15 12 55 41 -28 39 -26 71 28 -6 6 -30 11 22
5749B2Pk0j6K2Rp9M1K9j6k5NL8L6Ok2Kk1K8k2k1j1J6kJn7M9O7p5M8k1MJ8j20P4
$$ 22 29 9 -7 15 24 -55 -14 15 -1 -26 -21 17 53 59 37 39 18 46 24 3 -8 8 6 7 -50 -1 66 -9 39 18 22 40 -80 -6
5783fk3j8M1pK7l4M4K2o0J4L0J8m9QQkl4J0J0nk2L8lm0M2N6k3r7J0J9J4Nk6j5
$$ -6 -29 -47 -6 -13 14 -20 24 46 -14 0 30 48 -1 7 15 13 -21 -11 -1 -6 -28 10 7 -33 9 65 42 -55 -45 -26 -12 -7 -33 -48
5817d8N2j3j7L9n4L7k0L5Lk1mKL2n7N0k4qK3J0k1K3J2k1KK8J3k8o8N5N7p8j9K
$$ -48 4 -9 -26 13 -41 -4 -24 11 14 -7 -11 -9 23 -34 16 -8 -16 7 17 -4 19 31 10 12 40 53 25 -43 12 69 -9 -28 -26
5850b6L1J8j7kN6k1j2j1m9L9ljL0l0J6Kn0mJ9J9rRJ3K0o8M8j7oJ1K4k3n2N7J1
$$ -26 5 23 6 4 60 39 27 16 -33 6 3 2 32 2 18 20 -30 -34 -15 4 -5 4 17 37 -31 17 0 -6 5 29 6 -46 11 22
5884B2L9p2Pk5R2p8Pj9P%kK3j9O5m5j7rj4J11n7n8J7O1j9o1L5P9j03Q3p6L1OJ0
$$ 22 61 -11 -4 -29 63 -15 -8 -27 -20 -20 -22 1 -18 47 2 -15 -24 -38 73 16 -42 -25 36 17 -44 -9 70 -33 50 -26 5 11 21
5917B1P%m3mL4o9kM2Q4Rj21L4J2j8K1kL0o4K7j8Kk3Q7r4%RQ2k5l6j1J11p4j8J3
$$ 21 28 28 -15 -19 15 -54 -56 -14 70 79 -42 -8 4 -14 7 5 35 -29 -2 -20 -18 -41 46 -48 -48 -39 43 18 -18 -29 82 8 -10 3
5951CM1l2l8M7qn3J09n6k1k1K6M0K1j03J9K3L4o4M6knk2L8k9k2N4ln7M8j9M1l3
$$ 3 44 12 -26 21 13 -40 69 13 -8 -29 -3 37 58 -45 -26 -3 31 -33 13 11 6 -16 22 -7 -29 25 22 -35 13 -6 35 2
5983Bk9J05o4qk5Kpk2L5Qj4J6k2M5k6j1k0jJ0j2L8L1k9l8K7rJ9LL2j5j6lK5l1
$$ 2 -27 78 14 6 -19 -17 -24 -46 -11 -3 -17 -1 -23 22 -4 -15 -35 -36 -26 -38 0 31 2 -36 -9 -18 1 4 36 21 5 2 27 -4
6017dqoL7ol6K2Pn3M8N3o6J0K9Llm1k5L5n2L8O8k2q1K7J8K1k9L6N8r0L2rLk6J8
$$ -4 -12 -18 19 13 -23 -1 6 -47 1 54 -12 -2 27 30 27 -14 -39 -4 -56 -18 50 28 -53 -26 -8 13 -16 20 78 -12 20 11 14 -12 6
6052FJK0n3L9K2o4J0L2J1mNk5J7Oj2K5l6k3K0M5q8J8P1m3Rn9M8J1K3lM%K7m5Q
$$ 6 7 27 -26 13 35 -29 -19 13 24 20 25 0 17 23 11 36 0 -23 -3 42 -46 -28 43 0 9 -50 -2 9 32 29 33 33 60 15 23
6087B3rm6M5Lm3rJ7J6l0J5O5m8n3J3Q3m8OK3L2j16P3k1MK8k0N1p7k8N8L2l3jJ0
$$ 23 14 -32 13 16 -27 -36 -19 -3 -33 -18 47 -1 -54 -41 42 -6 0 23 55 -61 12 -9 -5 23 3 54 -23 -51 7 39 6 5 15
6120A5j3qjJ1m6O0L7om4J1lkN1p2M3j9j7k5M4J1Nj7JrNJ8j2ll9O3k6p1K5O3j9
$$ 15 2 -6 -7 4 -42 18 55 49 5 16 13 11 62 -10 33 14 -3 -28 16 27 32 15 16 7 12 30 18 15 -24 39 13 -58 -33 30 11
6155A1m9J6K1ol0NJ4k4K4j1M8k3oLM2m8K6L6j7l6j8J03j18ROQl2Q6o4M7m7L6o
$$ 11 -38 -22 -1 -7 -37 -32 -18 -42 -18 -29 19 -4 -10 -7 35 -13 13 49 32 -4 -22 81 -37 -28 -22 -14 -46 40 -24 23 -24 12 6
6188Fpmn3N1K9j18Q4J5Ol0RL6j2m9R7l3j1Qj3m7R8j03N7j3n9J2Rj3N2N1o2%m9
$$ 6 -1 -5 -58 -7 22 -96 -12 3 9 -21 -12 24 12 -37 60 27 16 24 11 -36 62 -41 16 3 -56 -44 -35 -48 4 55 -7 -7 -56
6221e6Q0k7J4ok6KQJ7%o7P9n%jrK9k0ol8R0n6j0Q4l2j06P2RL5n3l3M9l2k1O8J1
$$ -56 24 -3 11 5 -21 -19 -11 6 6 -61 18 13 13 12 3 32 12 6 -32 58 2 -8 76 44 -62 10 19 54 1 -32 17 -15 -36 32 43
6256D3j06M3Lj7K9J8P3p7k9O7Ll1l2M1n1M6k9L4n1L8L5l1qJ6K9J1j16n8M0O9k4
$$ 43 -63 -20 -17 -34 -5 13 86 9 -20 47 50 19 -13 28 -23 23 -6 28 -23 15 50 19 11 27 56 67 -49 -107 -67 2 -22
6287b2o2J20Ok9kNj9l0kN7l9mR7p3J1k8O4m1j1j8N0Po7J9qL5k6Ol5R7o0K6k0l1
$$ -22 -84 36 42 13 11 16 -3 -33 -35 22 -17 -21 76 3 14 -14 50 9 -2 -20 30 37 -30 -11 -19 16 -10 -4 -39 58 -2 24 4 -27
6321b7L6K1J0p4L6N1n3k1N1nl0l5Q3lm9M9n1PONrK9m5O6%m4l3N5L4q9J7J1M8p4
$$ -27 9 30 40 -34 2 53 0 -21 30 25 -5 -40 43 40 -9 40 -11 -4 2 7 -2 27 -18 48 48 4 -29 26 60 -29 -12 -1 47 -27
6355b7M5k3j1j3N5l2n2L3P3j5p2M4N4l3m3L5ql9J4j7M8l9j0M9o4K8l4M9j8jK7
$$ -27 18 -5 -16 -29 26 -6 -58 -25 48 33 -39 5 59 26 -17 18 10 -29 -15 -32 16 -23 -33 16 -48 -20 -54 -5 -23 -24 3
6386CJ7KL9l3L1mnk0QJ4n1J4Jk7POn0j6J15k2k9Q2p4j8K6k6k0PJ3L9n3M2l0M8
$$ 3 20 22 61 28 59 55 50 30 38 52 1 15 16 -11 -4 2 -48 -64 51 29 0 82 8 -10 16 -10 -30 -23 -10 29 -24 18 -12 36
6420C6Mk6m2k9J03l2p0J18l8o9pQ6op1M7k8mrN9l8mk3Q5Jn8J7Rl5j7J2N2rj2P
$$ 36 40 14 -28 -57 46 14 -56 62 24 -45 -52 34 28 -43 4 -24 -28 -37 22 -16 -20 -43 42 43 -15 2 11 -24 -41 -29 23 14 2 9
6454IK7m4M7j1j2J2m1M6j4mlL5l9k2L3k4nJ9M2n6m0K9K0k8k8P8k7Ok9J4K6PM3
$$ 9 36 -8 39 28 16 28 -13 33 19 15 12 47 8 -14 19 -5 -10 9 51 -5 -45 -16 4 -24 -52 26 -1 5 -24 -10 16 23 66
6487F6p1m5Q0Mlp0J7L5J9m8j7M0kk8o5R8LML9o2K0l0K0pqpL4k6M3l0M6m7j1kJ2
$$ 66 -5 -50 30 34 31 -39 -22 13 32 -16 -33 7 5 -23 -88 10 13 17 56 -6 14 -16 4 -3 -11 -18 16 -10 33 3 49 2 -9 -11 1
6522ANm0JR3l4q5R1q7M8RJOn5k9O2J8j1J8Lp1N5O5k9k4k1N6o7Q0p3K9j1o1J16
$$ 1 6 -34 -33 60 26 -59 32 -55 -7 2 3 9 -46 -75 -13 5 -6 12 15 -56 -1 64 35 11 -10 46 -21 59 -14 15 4 -57 59
6555E9m7J1m3L4L1o8k8O4J0J6o4J7k6J0M2N2j48JJ10m0N6j5l5jJ9n0O9o1K3L0
$$ 59 12 23 -20 14 45 -23 -51 13 23 39 -25 -8 -34 -24 18 70 -78 -77 33 -7 49 34 -1 -2 17 -33 36 -25 -2 28
6585B8M8n7L3m6M5n2K2L8p5K2K1J7m4n9N0K7Lj8M8q0oj8M6O9j24Q2j1L2l9L4m8
$$ 28 76 19 52 6 51 -1 21 59 -16 6 27 44 0 -59 -9 18 21 3 51 -29 -35 -53 -7 62 -62 20 9 41 2 36 -12
6616a2JL4n2M3L1n7M6q3N8K3o4RNK3L6o2J3L8m7j8P2n3j0J5m6Q6J1o1J27o3r5
$$ -12 -11 23 -29 14 45 -12 34 -49 9 32 -32 -23 -18 5 41 -21 -8 30 -17 -35 37 -16 -26 -11 -57 29 40 -21 106 43 -52
6647e2L8ON3o7l6J00ko3RK7%l5M4l2qJ2l7N2m3K4N6k9jK5n4kJqM0n6L9K7K3n3
$$ -52 -14 -8 45 -22 -58 42 40 -23 -14 13 13 -22 22 -10 -18 -6 -43 9 -34 -10 46 17 16 41 -13 -15 -14 -22 18 -38 1 28 51 -2
6681bJ8nj6Lj7M3n5O0j6M9n7jJ0M6o0K7j4l3pJ5P0p5qN3rM2k1Lj9l0K8k4lJK1
$$ -2 16 11 -5 -2 -19 24 -31 29 13 62 5 4 14 60 0 27 13 -20 -27 -12 58 -17 -25 28 19 61 40 43 24 -6 22 -2 -5 -4 17
6716A7m3L1o2N6j3k4kJ8J5J7Oj1M3o6mK3LK1k7Kj4N7J9o9l5M3L4m4kQL2q3O8j6
$$ 17 -26 5 -57 -1 -14 -38 -40 -22 -7 10 16 5 48 -18 -22 1 4 25 -2 0 -14 43 62 -7 -42 1 35 -9 -11 -3 29 -54 14 -2
6750bjOL3k1K8m8K7p4O9l6J6NN7j00pJ03n9k1J6L1q4N8L9k0l0LK5l7KO3l7j4j0
$$ -2 -3 3 36 15 43 -5 22 -52 17 -19 -3 2 59 -41 -48 55 -4 -25 -9 22 -62 -4 35 15 -15 -12 13 -24 -22 41 4 -10 -20
6783b0Olj2J9moRm3P0m2J6K6rj2l8M4K0J4k2l6L9lK2jMl1K9l6j6lj8pK9rJ2K1
$$ -20 -14 -17 -29 -10 -14 -20 -11 -54 16 -26 -10 16 7 -5 -43 1 21 35 13 -23 16 13 35 34 38 7 36 0 -16 -19 -37 -44 -15 -24 -12 9
6819Ik4jMJ1%k3j2k8QN0K6k0k6O9j8m1MM3n5M0L7p0j1K9l0J9j7K0j3J3J4J4k2
$$ 9 -15 -16 -12 -1 -1 -24 -36 -64 -56 -6 20 0 -26 43 25 -16 -12 31 -24 16 53 -17 -28 1 -29 -10 -27 -7 -20 -7 7 21 -1
6852aKK5j7M8m6l2L4M6m6K7J1m2J0l0mL0j6qJ4j5k2M3Pm7k8j4Q1k3j2J5k0N2j7
$$ -1 1 26 9 57 11 -21 13 59 13 40 51 9 19 -11 -15 15 -1 -9 5 -10 -32 11 18 -29 -57 -71 10 -13 -25 -10 -30 22 5
6885EJ8k7qN8m6J2L8J2k5o2P7J5n4Lj3QLj9J1j9J2j0K4l1kJ5jJ4o4P5m6O0n0M7
$$ 5 23 -4 -12 46 0 12 50 62 37 -25 52 67 13 16 3 11 14 -5 6 -13 -1 -11 13 -18 -20 -5 -6 8 -56 19 -27 33 -17 30
6919C0J6o1J08n4m1Nk6N4pm6L3nJ0%Mmk5J8rll3J1mM7o2L7%qK1P7m5j4l0k7P7
$$ 30 46 -15 93 39 -2 3 -23 31 24 -22 11 6 16 16 20 16 -9 9 0 -3 -36 -25 -29 18 -44 -7 -7 -15 6 83 38 24 -6 -33 44
6954D4l7j3O6o8OK0mll1J4K7pJJ3l8KQj5K2nM3%k8j5%L1l9j9P3j17Q6n1K4O0K5
$$ 44 7 -6 60 -8 -2 18 14 11 -20 -6 21 14 15 28 -10 -8 0 -15 7 2 45 45 17 2 2 33 -6 -25 48 -69 17 -34 -10 50 75
6989G5r8MK5l7L7j9L8p1L1M9r0Q9J3j2m3L7j6%j1nLJ9l8K2N6l7Oml6J8rR7p5n
$$ 75 -23 -19 6 -31 6 -13 25 -46 -15 34 -56 33 46 34 -9 28 12 12 1 -4 -1 18 -20 2 58 21 27 23 -13 5 -4 93 18 13
7023A3N4p3m9M9M8j02R4j7l1J5k3L8l0J5K9j6m9K9lK0J7Rk9MN0l2l0j8J6jL4k0
$$ 13 67 -6 -55 -6 42 -60 34 17 -14 1 -22 16 -14 1 30 14 -35 -6 -9 11 28 37 8 12 62 30 0 -18 -2 -3 31 11
7055A1j8KN5l6o0O7mM1m9K4jl0k3NN5o3MmK0oj3K0K2Jn9K5Ll4O9ko7L3M9J3j14
$$ 11 -7 -5 50 14 -46 21 17 58 9 33 32 2 -21 -16 39 -24 -20 -24 -4 -10 -23 -3 19 20 -39 -14 -11 -45 24 22 -45 -12 37 50 -64
7090f4N1M1k2Qm0J1qnK2K7n0K8K8J6j21P5K0j7J8k2M5j1J5m5lm2P5l9k2L7nrP
$$ -64 -13 28 6 14 -26 -15 -23 -28 -6 21 -29 -1 27 43 -78 -3 17 0 18 -4 41 30 45 0 -3 -45 30 -9 -31 6 1 -8 -1
7123akk9M2K2j01P5oJ2k9K1K3j6lJ0l8Rrm1M7k5R8p4m2N0O5l9Mm5k1J06m6k1K2
$$ -1 -3 -32 10 32 -69 6 0 12 -17 4 27 11 8 18 -20 -11 -20 -61 -14 -39 59 -15 -57 -7 58 19 23 -22 -43 63 17 -4 18
7156A8mk5J4nmk0K9k4l8N3k5k1M2L8k2k2L2J6o0j5qL3P3r3K4Mj3oM2m6M7n0J3
$$ 18 14 -11 3 -2 -6 -26 3 -21 -59 -6 -31 -52 -10 28 6 -16 16 32 -28 -43 -51 -18 55 -38 -14 -10 -23 -29 13 -33 14 -36 -23
7189b3L5l4K1j3%RK6j7K4p8O4k0j5mPlJ5K3%j4l8J3jPM6o5J4Rk5P8p3L6rJ1o3
$$ -23 12 -22 -1 -14 -14 -5 21 4 28 -50 14 -6 -21 -25 -18 -21 -6 17 17 3 -35 -22 -23 -16 30 -35 -21 -12 -37 41 -32 4 -5 6 -57
7224e7LP8l3mK7l1j5JM1k2k1P7m4n5P6o4N3n7Q0k4K1l5K9l9K0k2l6M9M2n0PJ7
$$ -57 -54 24 -9 -13 14 -17 -32 -31 10 -12 -33 44 0 -55 21 -43 10 -47 33 9 30 -5 24 -15 5 -17 -53 -4 38 -12 -5 12
7256A2k5O2k9L6m0j1j0n3L9M9m8Q9o0l6N6k7mJnl4mK6J7KK0j6J4km1K1m1Q2rn1
$$ 12 -13 49 20 56 16 5 -5 -58 -19 30 -18 71 11 -25 31 4 0 1 -4 -38 -42 -16 1 3 23 7 21 19 -22 -1 -42 40 31 -20
7290b0L4n0kK4Mj3p2J58o7j6MP1j10L1O3n9P4p7RJ4L7qoj9k1J4On6K1M2j1rpM
$$ -20 14 -36 -38 -14 -10 -23 -95 63 -4 -20 -16 55 -55 -24 39 -20 54 -23 -14 0 37 29 23 4 -17 -3 3 -53 -32 10 -1 -10 -17 -13
7324a3J1L3Ml2j0J8J2pl4NM6l0j9P5q2J9j4KK4n6O6mL5p2J0K2ol6M4lrJ4k2L7
$$ -13 -2 31 35 3 -7 11 23 16 -18 -13 33 3 -16 59 -23 -4 -18 -16 8 -48 18 14 49 -23 -13 9 3 -33 11 8 -1 13 -9 28
7358B8Jm0L6qlK6On0k3N7PL4o0M4o0l1j1M7j5M3Rn8j6O9k8k9J6K7k7NL9m9OKm
$$ 28 29 -11 25 17 14 40 46 -4 -27 30 37 71 11 55 -5 -36 -47 0 -15 28 37 -21 -37 32 4 -25 -9 18 -9 -4 35 -14 -8 -6 -10
7393a0K2m4L5lk8O3J0m8j7L4O2l8k3K6l5m2O4j6J6p5pR6n0L8l5K1j7nj7M9m5M6
$$ -10 12 -32 3 0 -28 35 45 -3 -20 14 76 38 15 41 6 -36 28 12 28 -47 -54 42 -8 30 -5 16 -1 -6 -23 26 -19 27
7425B7km7L6l4K0K1k1L1n6j4M3K5j3k5lJ3j3M5j3jrOJ6K0o3J5P8j32P4m4J8L2
$$ 27 25 -22 14 -20 0 21 0 31 -25 -39 4 29 16 -9 -12 1 -12 33 20 19 10 16 32 52 -11 4 82 -50 24 -20 -2 30
7457C0l5O1k5m2J1qn8N3L3k9N5j11N4j2L3%J5K3m7J7k7m3Q1j0k2N7q1P7Qo4k2
$$ 30 -5 56 31 -11 0 -8 -66 -13 20 -9 46 -65 -11 -23 10 10 25 48 1 18 -9 -52 29 19 -3 54 -27 50 58 -6 -28
7488b8rQ3j28Q9k1JJ4l1J2K2j5Q7p0k1mj6K6l1N7m5K0jJ7k2j5M5k6J9l5L5l5P7
$$ -28 -37 46 -82 7 -14 -13 1 -30 -18 4 -11 76 6 -15 -19 -35 -9 -40 17 -28 -8 -9 8 -14 -29 16 -10 9 -26 9 -26 51
7520E1m6l3L2L9k3J1o9M4Rn5J6n6N9LM6j4j5rK6kM6o8Mj6M2l6K4m3J1K6Oj4l3
$$ 51 5 -28 4 43 20 31 -38 6 15 -40 -24 -80 -21 -18 28 14 -1 -10 16 14 60 -8 -4 -20 22 -14 10 -33 -22 4 10 -4 -37
7553c7O5J1q9QnL3J7n7M1j5m8Q9k0k4J5k4K5k0J5r%NJ8rK4k3N7p8N4j5K9LK0o6
$$ -37 28 39 -50 -42 -47 -14 3 -54 -13 -28 -76 13 -7 -31 -16 -40 -15 -35 -20 -29 -29 -24 -6 -15 9 -14 43 -35 19 4 33 36 56 -10
7587a0L4m2K4l0k1N4n4O9o1J1M3j4J6m6J8J3k9J9lJ7Ll2lk0M5%rj1rK1R%l0P0
$$ -10 24 -18 6 -24 -45 9 -45 24 -37 -26 17 3 19 -27 -9 4 -25 -6 -9 8 11 -21 -24 -44 1 1 -8 -19 -28 -7 2 2 -28 42
7621D2j12P8kP1o1k5Mj6K6k3J9n7J8M9M4m7j9J8mjk7JkJ1J0K5J5m3l2K3J4j2J
$$ 42 -70 8 6 77 16 -9 -5 -21 5 -18 1 -56 -38 11 55 8 -11 7 3 2 -25 -24 -26 -15 -5 20 35 -8 -40 -17 -3 -15 -14
7654a4rl8OP1j1J4Lk9lM1m9P%K0J9l1NJ9Mk9jqJ5Ro9M7L1ok0QJLm4N8j8k0N9n1
$$ -14 -23 -61 -55 16 5 19 22 -7 -10 31 -18 -11 -11 9 28 -3 2 21 25 -4 -5 -13 2 11 -58 -11 20 14 -6 2 3 6 -38 20 2 -18 41 -10
7692a0MNljpJ6L8n5J13r1k4PM0k5Oj6kM7m1m7L1J6k3L5O4o6L9lr9K3lk2P3nK5
$$ -10 -6 -1 -4 -5 -12 4 42 -13 100 9 -15 -8 32 7 13 -3 -5 42 1 -46 -15 1 -22 13 77 11 50 47 -52 -29 -32 -54 19 14 39
7727C9k1K3j8l5K0M0k3m4k0N9m0K1K4K7l6k0J2J4k3K4l1oJ6L5l3j0K8m9J6J1q
$$ 39 18 41 23 -12 8 48 25 -19 -39 20 -20 1 25 52 16 -4 8 22 -1 23 -8 -14 2 37 4 -6 22 -27 -11 0 -8
7758hJ8J7n6K1J7qPmK4k3Qj9mK3mpL6o9M0j5K6Lp2M4M1pJ7p6N3m7MO4m9QL1j4
$$ -8 10 27 -29 -8 9 1 8 4 28 5 13 -6 -10 13 9 2 38 -31 9 -6 20 23 -49 -5 36 29 46 -30 23 -24 -20 44 -5 3 34 20
7794B0k8j8K2NN7o4L3nj5j9J8K5k9J0kmj1rM6p7N0m6P2l3L2m0JLO5oo6K3Jk9L8
$$ 20 -8 -26 -4 1 58 -6 27 22 7 -12 6 31 2 12 10 6 -5 -14 32 -45 5 -41 31 -2 30 -10 -9 -6 59 53 -13 10 11 -18 20
7829B0L5j6o5N4j9o2K6L6m6P6o2l3N5k1K3Pk9K6K4q9L8J8KL0m0M7J2p3RK5m7M1
$$ 20 55 39 -26 28 9 -53 -27 9 -37 39 -23 -56 -1 -22 1 8 -21 5 29 -60 -22 -4 -2 28 -12 35 47 -26 -17 8 -39 2
7861Bk6k5M7j4L7k8J4OrL4j4om9KQPM2j0j7M5o4J8J7%j8J2M3r0Q6pJn6L7M6p1
$$ 2 -24 -49 -2 -16 21 -7 7 13 4 38 24 18 -31 -29 -21 -14 28 18 1 46 -18 0 17 17 -1 11 54 -36 50 43 44 -12 25 71 0
7896@Kl5K8N6n1KL2m1Pm4O4nj9QQo4P1p6J01l8K5l0J4ml0jl2J7OP0q8L5k6M5%
$$ 0 2 -33 -5 51 0 2 34 -7 0 -44 20 15 -4 4 12 -52 19 -57 44 6 31 1 15 11 -19 -20 -52 -35 -29 41 -47 -12 -38 7 7
7931Gk2j4K9j5POk7N0k6K0m9j3M8L3J2m2oK8n0J3mK8%K3o2KK4M8m6J1J7n2N4j7
$$ 7 -15 -29 0 -15 -8 -2 -29 21 -5 15 -34 -47 1 34 46 4 -2 26 -24 -11 -15 13 13 36 -26 -24 0 48 2 13 30 -22 32 15
7965A5k2m4L3J2RLk2L6n4N1J2j8l3LK8J6j1J0m0O1k6%J4j8j4l4K3JK5l0K3j6l1
$$ 15 -7 -51 -18 -6 3 6 -16 20 -34 17 29 11 -22 -19 9 25 14 24 -16 45 19 19 33 15 1 -33 -10 -9 16 -14 9 -7 -38
7998c8O8m7k0N2K3l8l1k2O7J9j07J11n8L7m2N7l4j3M5n3L0k4Pj5K3k4K6m9J03
$$ -38 30 -17 -37 15 38 0 -31 -53 14 33 -74 37 -21 16 -26 31 -3 -16 29 -24 6 -18 -11 -26 -3 -27 -1 -50 53
8027E3l3o7L9J0N0r5P5l9j4RQM0k1k1j3L5K4p2N3k0j5N3m9K1j03J08k2n1N6L0
$$ 53 20 -47 -8 2 52 -43 32 -7 -21 -12 -4 36 15 -6 -19 16 40 -32 21 1 -14 39 -10 11 -92 16 -6 -57 -1 29
8057B9%p3L5kK4LL3n8M1Pm4j5O1k2j6k3L2j1M1l5j7J3L7l5nm0O9%k9M5n0M7k9
$$ 29 29 -44 -9 -11 13 16 49 -9 32 39 -5 -20 41 19 3 -20 12 1 42 7 -10 3 40 5 0 -40 29 29 0 45 -5 42 13
8090A3M0r3J7JN1jl7m7O3Oj0jL5p1M5K6n5L6n5O1l6K5jl8lN9o1jL0L4Ql5n6L8
$$ 13 53 -40 -23 -22 29 28 -9 -56 7 13 3 2 37 -34 11 37 -18 18 -37 24 -12 13 12 -26 -29 30 -31 -32 -2 32 40 5 -51 -13
8124a3mk7M3N3j00M1OJ8k3K6j1K8n4M6J9n3l7N5m8O0%Oj5l6l7O1mk1QQJ4J2mj
$$ -13 -17 -44 -1 52 -48 -7 -1 17 -6 20 9 37 -17 29 48 -5 -42 13 -35 25 25 31 16 -20 -57 4 0 -21 -13 -5 9 21 17 16
8158A6k4N2m9K2Jj0k5k0N9m0Mk2N3pJ2%j8l6L9j4JK3Ql9qK9m3N3k7RK7l9M
$$ 16 -8 44 -5 17 18 8 -17 -37 22 -18 -14 -36 17 10 22 22 4 -32 7 -7 -6 17 25 -14 -22 7 -36 17 -10 -1 26 -13 -9
8191i
$$ Imaginary data points
##PAGE= N=2
##DATA TABLE= (X++(I..I)), XYDATA
0@%%%%%%%%%%%%%%%%%%%%%%%%%mQpPj2J6j6J9k3K4k7L5m0M3n0N8o3P0q2R3j02
$$ 0 0 0 0 0 0 0 0 0 0 0 0 0 0 0 0 0 0 0 0 0 0 0 0 0 0 -4 4 -3 4 -8 8 -8 11 -12 12 -15 20 -20 23 -27 31 -32 38 -44 49 -53
46e3J13j27J40j53J69j87K05k24K45k65K87l12L35l56L74l85L78l40K42kn73K122
$$ -53 60 -67 73 -80 89 -98 107 -117 128 -137 150 -162 173 -183 191 -194 184 -156 86 84 -489 1633
68A633p610N5436L39823k63361m68684J68958M07847m0447l07466n5049J53702
$$ 1633 -5977 49459 389282 125921 -342763 -173805 234042 193595 -113871 -168920 -15218
79a5218J21791J6694j35746j90438J05454L33899l2294m31586n7934M67789J48970
$$ -15218 106573 123267 -12479 -202917 -97463 236436 204142 -227444 -285378 182411 331381
90C31381m45995k17076L71890K51456k62300k40146J34095J82810j2012q5252
$$ 331381 -114614 -331690 40200 291656 29356 -210790 -76695 106115 94103 8851
100H851q6422l5956J46848J61444j67971k72438J52127L53183j09047l91964N1161
$$ 8851 -77571 -113527 33321 194765 26794 -245644 -93517 259666 150619 -241345 -190184
111a90184L83389N454l28998m6196K40626O1741j32882m8360K2753R257P6134
$$ -190184 193205 198659 -130339 -176535 64091 125832 -7050 -55410 -32657 -23400 52734
122E2734M9218j51699j15645J96914J76820k11035k19963J98800K36250j69745
$$ 52734 101952 -49747 -165392 31522 208342 -2693 -222656 -23856 212394 42649
132D2649k23718J32821J84044r7364j23856O9415N1364n3978K3063N1214q9525
$$ 42649 -181069 -48248 135796 38432 -85424 -16009 35355 -18623 4440 55654 -33871
143c3871n7535J41191O7266j74225p3758J89270P3067j87968o1387J74687L8655
$$ -33871 -91406 49785 117051 -57174 -130932 58338 131405 -56563 -117950 56737 95392
154I5392j54173o546J31807l0369j10832O6038R2024r6075p4275J16427N5146
$$ 95392 -58781 -65327 66480 36111 -74721 -8683 83341 -12734 -87009 29418 84564
165H4564j26688l2911J26418N184j18142K8350J05030o6370r1561J05301Q0795
$$ 84564 -42124 -75035 51383 56567 -61575 -33225 71805 5435 -86126 19175 99970
176I9970j39283p3456J63666O9164j73737o4996J68033N7913j45899m3458J10600
$$ 99970 -39313 -112769 50897 120061 -53676 -118672 49361 107274 -38625 -82083 28517
187B8517J8348o7496J8182K3717o4212J3481J14623l9427j63187N0352K01989
$$ 28517 46865 -20631 -2449 21268 -42944 -29463 85160 45733 -117454 -67102 134887
198A34887m6811k24172L0833K24382q848k00226j1891J53313K4159q8735k2049
$$ 134887 88076 -136096 -105263 119119 110271 -89955 -101846 51467 75626 -13109 -35158
209c5158J5339L080N7855L2493j20108p9597J62910J31059j80425j76862J71906
$$ -35158 -19819 -16739 41116 73609 -46499 -126096 36814 167873 -12552 -189414 -17508
220a7508K06837j40619k13686R3886J92523m1782j43989n435P2083L7834J3478
$$ -17508 189329 48710 -164976 -71090 121433 79651 -64338 -69773 2310 40144 53622
231E3622m9409j01290L8273J78284p419k33375l5979K59197Q2420k52301j20606
$$ 53622 4213 -97077 -58804 119480 112061 -121314 -157293 101904 184324 -67977 -188583
242a88583K15191J41384j54520j37399Q1511J06776q058n1851n4466j9843R6833
$$ -188583 26608 167992 13472 -123927 -42416 64360 56302 4451 -50015 -69858 26975
253B6975R8093j14525j71051J06447K26824p7494k56795L5446K55368R064k22926
$$ 26975 125068 10543 -160508 -54061 172763 95269 -161526 -126080 129288 138352 -84574
264h4574m5958J63966O6536q7404o5013M414M1054P2950K468j33764n7369J70966
$$ -84574 -130532 33434 99970 12566 -52447 -48033 -6979 65971 68439 -65325 -122694 48272
276D8272J14035j81085j61351J66015J90410j31362j94823Q5565J72395l8857
$$ 48272 162307 -18778 -180129 -14114 176296 44934 -149889 -64324 108071 69214
286F9214j25717L3O0958K3943J1728l0165q2614J9314J41599M238j81464l4059
$$ 69214 -56503 -56470 4488 28431 40159 9994 -72620 -53306 88293 92531 -88933 -122992
298a22992J98294O2237j91731q1450J65550Q6757j25521p5124P9381M7869l4210
$$ -122992 75302 137539 -54192 -135642 29908 116665 -8856 -83980 -4599 43270 9060
309I060q237l361l7907K9484Q3773m2940j22450M4695J48394l8528j58764K8637
$$ 9060 823 -2538 -40445 -10961 72812 29872 -92578 -47883 100511 61983 -96781 -68144
321f8144J52372k0030j31632J6143R9856j9235o2440K9555K4348m4848R873O2272
$$ -68144 84228 64198 -67434 -51291 48565 29330 -33110 -3555 20793 -24055 -14182 48090
333D8090l7125p7722N6787Q7950o8787q9980P5234Q3275p8129o8338P9844M7266
$$ 48090 10965 -66757 -9970 77980 9193 -80787 -5553 77722 -407 -68745 11099 58365
345E8365q1612k3215Q3468q29q4951K1859Q3858l8571p8723N0216O7655n7651
$$ 58365 -23247 -46462 37006 36177 -48774 -26915 56943 18372 -60351 -10135 57520 -131
357a31n0531O2398K7508o6204q29P0926k6500p6817N1361Q3646p0042q9387Q0542
$$ -131 -50662 11736 39244 -26960 -27789 43137 16637 -60180 -8819 74827 4785 -84602 -4060
370d060R2076q1710q8236P4264P6074o0659n4207M4159K2971k8917J4716J8390
$$ -4060 88016 6306 -81930 -7666 68408 7749 -46458 -2299 20672 -8245 6471 24861
382B4861n5526j5141R3666J9563j24212l0399J42291M4086j45006n6221J31826
$$ 24861 -30665 -45806 47860 67423 -56789 -87188 55103 99189 -45817 -102038 29788
393B9788O2192j04736n7611O8136M0693k7526j1195j0348k7737M0011P1599n7275
$$ 29788 91980 -12756 -70367 -2231 38462 10936 -259 -10607 -38344 1667 73266 15991
405A5991j13650O0454J47289n0648j66677L1076J67789p700j49372j3994J13199
$$ 15991 -97659 -37205 110084 59436 -107241 -76165 91624 83924 -65448 -79442 33757
416C3757K7397o3833k8888P930J6301M6520R235r1989m3735J22357Q1556j33921
$$ 33757 61154 -2679 -31567 -23637 -7336 39184 48419 -43570 -87305 35052 116608 -17313
428a7313j15082J26510J37903j02773j44007O8576J30837l0880r8392k882N0385
$$ -17313 -132395 -5885 132018 29245 -114762 -46186 84651 53771 -44621 -47503 2882
439B882K6309O594l5481o4871K9123J15829r957j52407j7573J69381M6628j65488
$$ 2882 29191 35785 304 -64567 -35444 80385 70428 -81979 -99552 69829 116457 -49031
451d9031p0417J42307Q2790j04748p9482N9463N9944j3802k5716k5175j7998N2563
$$ -49031 -119448 22859 105649 901 -78581 -19118 40826 27024 1308 -23867 -41865 10698
463A0698O5135o5268j08175O3713J40311n0091j56755K9237J54855o975j35236
$$ 10698 75833 10565 -97610 -33897 106414 56323 -100432 -71195 83660 76685 -58551
474e8551j1201J00571K0361n6560j8236R166M633L4662J7991o9667m5429R2152
$$ -58551 -69752 30819 51180 -5380 -23616 -14450 -9817 24845 42836 -26831 -72260 19892
486A9892P2221j00522r2961R6096J03627q1518j01515O1970Q6203m1425n9672
$$ 19892 92113 -8409 -101370 -5274 98353 16835 -84680 -22710 63493 22068 -37604
497c7604K4647K5352j3963J1739J0569m6976j3510P5780K0028r5249k7439J03813
$$ -37604 -12957 12395 -1568 10171 20740 -26236 -39746 36034 56062 -39187 -66626 37187
509C7187L2278j02254l2387R2315K6194p7006j3737N9180l532m1612K3567K6412
$$ 37187 69465 -32789 -65176 27139 53333 -23673 -37410 21770 18238 -23374 193 26605
521B6605m3424j3894O0605M263p2566L827P8021j1087p6728J8875O9787k8057
$$ 26605 -16819 -30713 29892 34155 -38411 -34584 43437 32350 -44378 -25503 44284 16227
533A6227n8848L8281M6105m9287l3382N9138K1625o6421j1715O9465K582o6954
$$ 16227 -42621 -4340 41765 -7522 -40904 18234 39859 -26562 -38277 31188 33770 -33184
545c3184O160N8892j5840m5903K7064K9940l9996j3030N4344j972o8515J3608
$$ -33184 -27024 31868 16028 -29875 -2811 27129 -12867 -25897 28447 26475 -42040 -28432
557b8432Q0724k0378q8376K2573Q9267k1160q1906J8111O5905j5998m2438J6355
$$ -28432 52292 31914 -56462 -33889 55378 34218 -47688 -29577 36328 20330 -22108 -5753
569e753J4041k1305J5703L0650m3104m3909O4279N8984p6882p2586P9367Q1850
$$ -5753 8288 -13017 2686 33336 -9768 -53677 10602 69586 -7296 -79882 -515 81335
581H1335p2340q3205N7774P4750l8593n5616J9276K7109l194P732o285m4367P465
$$ 81335 8995 -74210 -16436 58314 19721 -35895 -16619 10490 7296 15028 8743 -35624 -28159
594b8159P7950m72j03682j2709J17456K8624j17941m2893J04781N1060q0664n0184
$$ -28159 49791 49319 -54363 -67072 50384 79008 -38933 -81826 22955 74015 -6649 -56833
606e6833M9378L8264j5783j6150j4637j3972L7890M7829n0598q0064N2079J05855
$$ -56833 -7455 30809 15026 -1124 -15761 -29733 8157 55986 5388 -74676 -22597 83258
618H3258m3351j20513K7732J21560r320j08085p041Q1807J7241m6355j8711O504
$$ 83258 39907 -80606 -52874 68686 59366 -48719 -55760 26047 43288 -3067 -21778 -15274
630a5274J0285L2056O545o4318k9333Q5837N3788r4682p5395R0636Q9412p5742
$$ -15274 -4989 27067 33612 -30706 -60039 25798 79586 -15096 -90491 145 89557 13815
642A3815r2544N3987Q3163k9695o1434P884L0274P791O287j4793m2811J2895P4477
$$ 13815 -78729 -24742 58421 28726 -32708 -24824 5450 13241 19528 4735 -38076 -25181 49296
655D9296l557r6862j0311J07180K4989j05269l6406R1927M1205p0400l7550M4346
$$ 49296 45739 -51123 -61434 45746 70735 -34534 -70940 20987 62192 -8208 -45758 -1412
667a412K4742j7964m692m967j9935K1767M5414l1076o7690L3241Q3523k9509r0463
$$ -1412 23330 5366 674 -4293 -24228 -2461 42953 11877 -55813 -22572 60951 31442 -59021
680e9021K2757Q7868j5350p6153J0142N7119q604l3795J1844R039j9153J3656
$$ -59021 -36264 51604 36254 -39899 -29757 27362 18758 -15037 -3193 5846 -13307 349
692C49K9069l2408l9474M5160M7871n1806n2541N3019N1776n0348m5222M5496
$$ 349 29418 -2990 -42464 2696 50567 -1239 -53780 -761 51015 667 -44555 941
704I41L3693m0326j8341L6186J424l3175J5097L1487k9271k9968M0137K7585m6801
$$ 941 34634 -5692 -24033 12153 13577 -19598 -4501 26986 -2285 -32253 7884 35469 -11332
717a1332k3291M9576J6526m9462p165M7156m162m4273J6368M0975k8127l7886
$$ -11332 -34623 14953 31479 -17983 -25148 22008 17846 -26427 -10059 30916 2789 -35097
729c5097L7717L4358m3954k9880M6185K3532m4528j4653L9811L036l2991J1220
$$ -35097 2620 36978 -6976 -36856 9329 32861 -11667 -26320 13491 16527 -16464 -5244
741e244K5889k6714j9806M2284J5772n5629j3988O5093J3913o8887j4562O6093
$$ -5244 20645 -6069 -25875 16409 32181 -23448 -37436 27657 41570 -27317 -41879 24214
753B4214J4203n6980j1469M2597M861k5152N766O965k0150R011L6768k0805n3340
$$ 24214 38417 -18563 -30032 12565 17426 -7726 -1960 5005 -15145 -6134 30634 9829 -43511
766d3511K6914O7430k7324p5969K2915P7367j5406p0228P452N5213j455l3700
$$ -43511 -16597 50833 23509 -52460 -29545 47822 32416 -37812 -30360 24853 23398 -10302
778a0302l46Q369k968J7219J1686m0174k4273N6963L8717o5963n2267O6314O1345
$$ -10302 -10648 -2279 -5247 11972 23658 -16516 -40789 16174 54891 -11072 -63339 2975 64320
791F4320n8593o3973M4918N8170k8125m3788J1506K2005J940M600r728l2297J0837
$$ 64320 5727 -58246 -13328 44842 16717 -27071 -15565 6440 8380 12980 3252 -29045 -18208
804a8208N7813n602p6998m182Q7332J6022q7449k6505P7642L2650n9804l2359
$$ -18208 39605 34003 -42995 -47177 40155 56177 -31272 -57777 19865 52515 -7289 -39648
816c9648L6794K4435j2721r344r278j0872K5651L3360l4949n4652L6528P1157
$$ -39648 -2854 21581 8860 -484 -9762 -20634 5017 38377 3428 -51224 -14696 56461
828E6461l1422q0077K1933Q0097j0810p0655R95N3433M945l0413n522N189M11
$$ 56461 25039 -55038 -33105 46992 36182 -34473 -33478 19955 24900 -5513 -11035 -5846 -5435
841e435J9047R689l9158k2771N2724L6257n8939m7408N7561N3622n0258n3278
$$ -5435 13612 23301 -15857 -38628 14096 50353 -8586 -55994 1567 55189 4931 -48347
853d8347L8919M5666k6340l1565J4927J2655o582Q481K371k8967k209M6269N352
$$ -48347 -9428 36238 9898 -21667 -6740 5915 -667 7814 10185 -18782 -20991 25278 30630
866C0630n8114r909O3426J4246o2048j6367N5184J4937m4112r684L1162O53j8241
$$ 30630 -27484 -37393 26033 40279 -21769 -38136 17048 31985 -12127 -21811 9351 10004 -8237
879h237J0757O840k3063J740L4436p650m3222J0959M8065j2663m8584J3726M4853
$$ -8237 2520 9360 -13703 -11963 22473 14823 -28399 -17440 30625 17962 -30622 -16896 27957
892B7957j5105l7357J7552K7527k0975j6601K5299O089k9723L450L3229j1069
$$ 27957 12852 -24505 -6953 20574 -401 -17002 8297 14386 -15337 -11887 21342 10273
904A0273l4941J6913L4035k1345l0164K4642K3574k7692j5143L0499N708l3531
$$ 10273 -24668 -7755 26280 4935 -25229 -587 22987 -4705 -19848 10651 16359 -17172
916a7172L587L6094j1524l7799J7393L7731k0857l5150K2407K9447k2353k0623
$$ -17172 -13585 22509 10985 -26814 -9421 28310 7453 -27697 -5290 24157 1804 -18819
928a8819K1713R628k1466L071K2212j5541k4349K6837K7155l5156l0073L9463
$$ -18819 2894 12522 -8944 -5873 16339 798 -23551 3286 30441 -4715 -34788 4675
940D675L1928l9633l1599L5793K7779k9061k0304K0800Q936j2558N100O015k0630
$$ 4675 36603 -3030 -34629 1164 28943 -118 -20422 378 9314 -3244 1856 7871 -12759
953a2759k206L5693J683m8144l811N6267P695n8451j1879N4720J4520m5010j4192
$$ -12759 -14965 20728 22411 -25733 -29544 26723 34418 -24033 -35912 18808 33328 -11682 -25874
966b5874L1190R781j5061j371p13j0753J3851K5001k3044l9207K6951N0931k5918
$$ -25874 5316 15097 36 -1335 -2048 -12801 1050 26051 3007 -36200 -9249 41682 15764
979A5764n8165K0884N9156j3593n3397O032M1543m20k4578j967N257J77J4238
$$ 15764 -42401 -21517 37639 24046 -29351 -23319 18224 17804 -6774 -8741 -3484 -3307 10931
992A0931N777l0997j4872M3163K5458m9419l5012M9107M1733m3322m3395L3258
$$ 10931 16708 -14289 -29161 14002 39460 -9959 -44971 4136 45869 2547 -40848 -7590
1004g590L9126k1313k9038R433J3998p3L985n602k2601O766L9509l975n1993j816
$$ -7590 31536 10223 -18815 -9382 4616 4543 8528 2926 -19675 -12909 26600 22625 -29368 -31184
1018c1184N8731Q703n8718j4366N2309J7364m0814j6077K6170J0270j0702n04
$$ -31184 27547 36250 -22468 -36834 15475 32839 -7975 -24052 2118 12388 1686 1182
1030A182l173j1941J3697K5245k0153l7285K2158M5992k0574n0111J6427M8870
$$ 1182 -1991 -13932 -235 25010 4857 -32428 -10270 35722 15148 -34963 -18536 30334
1042C0334j1590m2344P417L1386n204j7455N504K876q546J0955J3611k2180j9435
$$ 30334 18744 -23600 -16183 15203 9999 -7456 -1952 924 -7622 3333 16944 -5236 -24671
1055b4671K9872K4926l3531k8597L3709K9330l1025k6605K6581K0381k1719j1322
$$ -24671 5201 30127 -3404 -32001 1708 31038 13 -26592 -11 20370 -1349 -12671
1067a2671J7026N31j3496J0427J1409k0570j0406K8359R999l3196r470L4956P964
$$ -12671 4355 4886 -8610 1817 13226 -7344 -17750 10609 20608 -12588 -22058 12898 20862
1080B0862l3789m786L0518L7k5732O044K0536j2763j5434J9312J0932k4663o958
$$ 20862 -12927 -17713 12805 12842 -12890 -6846 13690 927 -14507 4805 15737 -8926 -15884
1093a5884K8075L376k9182J0K7917l814k4826Q260K0291j3623j4972J9102R803
$$ -15884 12191 15567 -13615 -13605 14312 10498 -14328 -6068 14223 600 -14372 4730 14533
1106A4533k4618n263K9158J737l1915Q29L2255k589k9755M364K4681o497j7445
$$ 14533 -10085 -15348 13810 15547 -16368 -15539 16716 14127 -15628 -11264 13417 6920 -10525
1119a0525R618R121j3908n77J9205p180k4863J3146K9864j6828l3335J7940L4129
$$ -10525 -907 8214 -5694 -6271 12934 5754 -19109 -5963 23901 7073 -26262 -8322 25807
1132B5807j6837l1831J4303K5840j1272j6858Q981N621q192O526R342j7961j2355
$$ 25807 8970 -22861 -8558 17282 6010 -10848 -1867 3754 -4438 2088 11430 -6531 -18886
1145a8886K7541J6569l3763k0739L6074K3924l4351k4751K9077K2678k1538j7129
$$ -18886 8655 25224 -8539 -29278 6796 30720 -3631 -28382 695 23373 1835 -15294
1157a5294J2898Q334m907K824j109j5345M305K7422m829l7157K430M3404J417
$$ -15294 -2396 5938 1031 3855 2746 -12599 -8294 19128 14299 -22858 -20428 22976 24393
1170B4393m4824n656M1396Q856l3577r615K2560P431r991j968k073o295J2431
$$ 24393 -20431 -26087 15309 24165 -9412 -19027 3533 10964 973 -995 -3068 -9363 3068
1183C068J6156j9489k6165K2720L4417k2236l9460J8715M0127j3483l6089P821
$$ 3068 19224 -265 -26430 -3710 30707 8471 -30989 -12274 27853 14370 -21719 -13898
1195a3898K7616l357j5907R93K545j442J0665M633k2192r654L0466J5647l4843
$$ -13898 13718 10361 -5546 -4553 -2008 -3450 7215 11848 -10344 -19998 10468 26115 -8728
1208h728k0885L5064K4282l1399k4681K5132K1596j7410j4958R572N739l256N210
$$ -8728 -29613 5451 29733 -1666 -26347 -1215 20381 2971 -11987 -2415 3324 68 5278
1221E278j006j6298K601K6040k098l3103j71L6648K767l6291m833L2311N340k5469
$$ 5278 4272 -12026 -9425 16615 14517 -18586 -18757 17891 20658 -15633 -20466 11845 17185 -8284
1235h284l731J6998n9q111N724Q1j2248O337J8863j0406k4438J2487K7866j2915
$$ -8284 -12015 4983 4924 -3187 2537 2618 -9630 -3293 15570 5164 -19274 -6787 21079 8164
1249H164k8527J2235K6269j1213k1548J0567J4786j0688p146J1589o31j3233P479
$$ 8164 -20363 -8128 18141 6928 -14620 -4053 10733 45 -7101 4488 3857 -9376 -1897
1262a897J5170j2988j6632J6594J7290j8537j6289J9005J3762j8316r733J7309
$$ -1897 13273 285 -16347 247 17537 -1000 -17289 1716 15478 -2838 -12571 4738
1274D738M395j6083J513J5258p392j4458J2285J3864j6080j2850J8084J1131j8718
$$ 4738 9133 -6950 -5437 9821 2429 -12029 256 14120 -1960 -14810 3274 14405 -4313
1287d313q259J7839M272j6260P13J4360o507j2466J2182J1104j7353r975K1006
$$ -4313 -12572 5267 9539 -6721 -6008 8352 1845 -10621 1561 12665 -4688 -14663 6343
1300F343R285k2801q286K2628O621k0188m111J6433L13j1712M783O849j0697k613
$$ 6343 15628 -7173 -15459 7169 13790 -6398 -10509 5924 6237 -5475 -692 6157 -4540 -7153
1314g153J6765n22k2321K253K6345k791k8207K151K7475j270k4036P38J8154j211
$$ -7153 9612 9090 -13231 -10978 15367 12576 -15631 -13480 13995 12725 -11311 -10573 7581 6370
1328F370j0662L213K503o651N275J1343j1518j6627J5840K1412j7398k4907J6711
$$ 6370 -4292 -1079 1424 -5227 48 11391 -127 -16754 -914 20498 3100 -21807 -5096
1341e096K6095j4098k4402J0270J9793o541j2561L666L528k452O158K959j5320
$$ -5096 20999 6901 -17501 -7231 12562 6021 -6540 -2874 654 -1798 4360 7319 -8001
1354h001n226K2631Q607k7186j2333K8593J5240k6653j6487K2194J5363j5910
$$ -8001 -13227 9404 18011 -9175 -21508 7085 22325 -4328 -20815 1379 16742 832
1366H32j1481Q939N363k423K588k513j1426N421J9766n982k6578M650L0531j969
$$ 832 -10649 -1710 3653 1230 3818 1305 -10121 -4700 15066 9084 -17494 -12844 17687 15718
1380A5718l1380j019K8686L348k3077m217J5220L134o517Q3j902n155R041J1278
$$ 15718 -15662 -16681 12005 15353 -7724 -11941 3279 6413 -104 -21 -1923 -7078 1963 13241
1394A3241j3975j7227J6351K2097j6192k4775J4144K4727j0897k1681P408J6134
$$ 13241 -734 -17961 -1610 20487 4295 -20480 -6336 18391 7494 -14187 -6779 9355
1406I355m669q760L250L13l339P856M745j4821p289J9944R856k2584j1962K2592
$$ 9355 4686 -4074 -824 -511 -3850 4006 8751 -6070 -13359 6585 16441 -6143 -18105 4487
1420D487J2930k0540j2043J6952R391j2690m811Q321q29m534P021K040j2905p14
$$ 4487 17417 -3123 -15166 1786 11177 -1513 -6324 1997 1168 -3366 3655 5695 -7210 -7924
1434g924J7794J64k0798l33K1862N01k0926j37J7995r31j4003K919R342n849m711
$$ -7924 9870 10034 -10764 -11097 10765 11266 -9660 -9797 8198 7267 -6736 -3817 5525 -324 -5035
1449e035R078Q22j2383K236J5076m397j6554N723J6733o619j5246P395J2426q288
$$ -5035 4043 4865 -7518 -5282 9794 5397 -11157 -5434 11299 4680 -10566 -3171 9255 967
1463I67q526R452M293j0899j05J2467l596j3731O281J4393q168j4062R158J2414
$$ 967 -7559 1893 6186 -4713 -4818 7649 4053 -9678 -3397 10996 2828 -11234 -2076 10338
1477A0338r478r740R615N706r598j121R918l563j0519P939J1280j1253j1962J3211
$$ 10338 860 -8880 735 6441 -3157 -4278 5640 2077 -8442 -503 10777 -476 -12438 773
1491G73J2318j3761j1692J3025R924j1237o917R073K676p023K548N209p940m327
$$ 773 13091 -670 -12362 663 10587 -650 -7567 1506 4182 -2841 -293 4916 -3024 -7351
1505g351J2865M370j6912m967J9206N726j9529o317J7845O143j4502m700J0056
$$ -7351 5514 9884 -7028 -11995 7211 12937 -6592 -12909 4936 11079 -3423 -8123 1933
1518A933J975n246K248O60p112K949J2335n201j6954N925K0362n450k1703L900
$$ 1933 3908 -1338 910 1570 -5542 -2593 9742 4541 -12413 -6488 13874 8424 -13279 -9379
1532i379K0936k180j7850O22J2899j96o569Q41r1l145O506O335j1512j0220J4671
$$ -9379 11557 9377 -8473 -7851 5048 4852 -1717 -876 -967 -4112 2394 8729 -2783 -13003 1668
1547A668J3883j5686j6428J4629J7473j2077j6310Q640J3164n131q008K240J737
$$ 1668 15551 -135 -16563 -1934 15539 3462 -12848 -4208 8956 3825 -4183 -1943 -206
1560b06p18N175M51j1592j560J6721L602j9869o006K0573P964j9073q983J5719
$$ -206 -924 4251 4702 -6890 -8450 8271 11873 -7996 -14002 6571 14535 -4538 -13521 2198
1574B198Q383j1194o055O190K263j575K820k094q319M570J3423n427j7398N018
$$ 2198 10581 -613 -6668 -478 1785 210 3030 936 -7383 -2813 10610 5183 -12215 -7197
1588g197J9719l686j9897K073J7849o84j4068J11Q992p34l418K452j925n190O389
$$ -7197 12522 8836 -11061 -8988 8861 8177 -5891 -5780 3212 2478 -940 1512 -413 -5603 786
1603G86Q271r484j1263J1122J3342j1205j4145J0198J3329q500j0905O668P360
$$ 786 9057 -427 -11690 -568 12774 1569 -12576 -2378 10951 2451 -8454 -1786 5574
1616E574n240k829M368j907m282O399M819r975n782J2455O419j3380o673J3097
$$ 5574 334 -2495 1873 -34 -4316 2083 6902 -3073 -8855 3600 10019 -3361 -10034 3063
1630C063N993j1818m414R799J914p611J101N683m525m052P753K931j0437k122
$$ 3063 9056 -2762 -7176 2623 4537 -3074 -1973 3710 -815 -4867 2886 5817 -4620 -6742
1644f742J2181J648j2868r16J2354m0j0685J459Q436l339n873N615L351p949j434
$$ -6742 5439 7087 -5781 -6697 5657 5617 -5068 -3609 4827 1488 -4385 1230 4581 -3368 -4802
1659d802J0016J7j1612Q83J2285j535j1886K080J0262k835p707L801M707n240
$$ -4802 5214 5231 -6381 -5498 6787 5252 -6634 -4554 5708 2873 -4834 -1033 3674 -1566
1673a566j454P017j477q806L660J0635n117j1765N612J2189n390j1419M948R259
$$ -1566 -3020 3997 2520 -6286 -2626 8009 2892 -8873 -3261 8928 3538 -7881 -2933 6326
1687F326m333o066L875K169m031K075M632o017n773R155P122j1144q555J1826
$$ 6326 1993 -4073 -198 1971 -2060 15 4647 -1370 -7143 2012 9134 -2010 -10565 1261
1701A261R343j1163r189R442P944p118n310M571J702k333K654Q25p061j22J0994
$$ 1261 10604 -559 -9748 -306 7638 520 -4790 -219 1483 -850 1804 2629 -4432 -4554 6440
1716F440M34j3880j487J5312K819j5230l850J3357M182j0262l518O315J721k275
$$ 6440 6874 -7006 -8493 6819 9638 -5592 -9442 3915 8097 -2165 -5683 632 2353 78
1730G8J071j457m548M312Q278n881j1695O309J4062n444j5121M001J4496k318
$$ 78 1149 -308 -4856 -544 7734 1853 -9842 -3533 10529 5085 -10036 -6035 8461 6143
1744F143j2048Q48Q396j07l927M67j089j657N516L678r040o119J1117Q485j1767
$$ 6143 -5905 -5057 3339 3232 -695 -228 -1317 -2974 2542 6220 -2820 -8939 2178 10663 -1104
1759a104j0214J0985J0700r002r890O477P588l866m175J909j40m77M548R6q447
$$ -1104 -11318 -333 10367 1365 -8525 -2048 5540 1674 -2501 -592 -732 -1209 3339 3435 -5012
1774e012o91J1627J795j3367l002J3536M054j2381m327R951L664o962k175L861
$$ -5012 -5703 5924 7719 -5648 -8650 4886 8940 -3441 -7768 2183 5847 -1115 -3290 571
1788E71l56r31L327j240o606K743R263l248j1167L031J2091k559j1546J930R905
$$ 571 215 -716 2611 1371 -5235 -2492 6771 3523 -7644 -4613 7478 4919 -6627 -4697 5208
1803E208j492p363J661M350k524r90L730j963n297M394O700n786q000O560Q336
$$ 5208 3716 -3647 -1986 2364 -160 -1150 2580 617 -4680 -286 6414 628 -7372 -812 7524
1818G524o490p964N933O666n261m591M710J894m409R79M342l562m610N739M967
$$ 7524 1034 -6930 -997 5669 408 -4183 527 2421 -1988 -1009 3333 -229 -4839 900 5867
1833E867p089n158P709N014p608m270O905K994n904j074M891j311l994L718L330
$$ 5867 -1222 -6380 1329 6343 -1265 -5535 1370 4364 -1540 -2614 2277 966 -3028 690 4020
1848D020n949l063P595K940q633k744Q677K477p948j885O724O15m900J125L074
$$ 4020 -1929 -4992 2603 5543 -3090 -5834 2843 5320 -2628 -4513 2211 2826 -2074 -949 2125
1863B125l269j353N496K06p595N38R194q11r821O52R598m75q382L17O408p26l744
$$ 2125 -1144 -2497 2999 3205 -4390 -3852 5342 4531 -5290 -4638 4960 4485 -3897 -3580 2828 2102 -1642
1880a642J503J037l124J733M745l742o658N045Q252n549r211N189R410m226q470
$$ -1642 -139 898 -2226 -493 4252 510 -6148 -1103 7149 1600 -7611 -2422 6988 2762 -5708
1895e708L013O691k051l850J362N96j318K903J795n822k917Q079M298r323n636
$$ -5708 -2695 3996 1945 -1905 -543 53 -1265 1638 3433 -2389 -5306 2773 7071 -2252 -7888
1910g888R393O449q509o501O696N606m517l774K278J074m33K244q26n430J141
$$ -7888 1505 7954 -555 -7056 -360 5246 729 -3045 -767 307 -126 2118 1292 -4138 -2997
1925b997Q363q35j0271j37J1287J067j0745k003R213K395o769k002L827P44p55
$$ -2997 5366 4531 -5740 -5877 5410 6477 -4268 -6271 2942 5337 -1432 -3434 393 1137 382
1940C82J102j965l451L880N884m890q055N025R451m399r850L211R213k045p467
$$ 382 1484 -481 -3932 -52 5832 942 -7113 -2088 7363 2964 -6886 -3675 5538 3493 -3974
1955c974J109M890o34j657P10j502j440M318K763o468m081P534N479p828o277
$$ -3974 -2865 2025 1391 -266 444 -1058 -2498 1820 4583 -1885 -5966 1568 7047 -781 -7058
1970g058P148O275n850n398M215L678k709j375J494j392p87M112O15o391p96P916
$$ -7058 90 6365 515 -4883 -668 3010 301 -1074 420 -972 -1759 2353 2968 -3423 -4219 3697
1986C697J329q538j770Q255J985p147j813N641J000l794M48J932k157l89L975
$$ 3697 5026 -3512 -5282 2973 4958 -2189 -4002 1639 2639 -1155 -707 1225 -932 -1321 2654
2001B654q21n616J369O892j665p384J506P249j408o295J283M861j536l090K198
$$ 2654 1833 -3783 -2414 4478 2813 -4571 -3065 4184 2776 -3519 -2236 2625 1089 -2001 197
2016A97J114l025O82M079k121m988L073N684l476n884L495N517l268m524L057
$$ 197 1311 -1714 -1032 3047 926 -4062 -989 4695 1219 -4665 -1170 4347 1079 -3445 -388
2031c88K879k793j025K801j012l075K776L626m277m180N118M454n350m415N014
$$ -388 2491 -302 -1327 1474 462 -2613 163 3789 -488 -4668 450 4904 -446 -4861 153
2046A53L921m317k799L356J349k451N17J921k636j572M574J544n987j892O891
$$ 153 4074 -243 -3042 314 1663 -788 -271 1650 -986 -2558 2016 3560 -2427 -4319 2572
2061B572K255p092k440O443K368n196j887L622P19j871P83L60k682Q14M496j317
$$ 2572 4827 -2265 -4705 1738 4106 -1090 -2977 645 1364 -507 276 636 -2046 -1232 3264 1947
2077A947o280J521P425j215p726O19P303o4o044j76M091R8j760N16n74j658K657
$$ 1947 -4333 -2812 4613 3398 -4328 -3709 3594 3530 -2514 -2690 1401 1499 -261 255 -319 -1977 680
2094F80L040m190m432M780N857m896o610M287O615l342n795K116M307j151k130
$$ 680 3720 -470 -4902 -122 5735 839 -5771 -1484 5131 1789 -4006 -1890 2417 1266 -864
2109h64M93l57k72K881N88m947j361O405K432p088l442O984M076o100m053M547
$$ -864 -371 -728 -1000 1881 2469 -2478 -3839 2566 4998 -2090 -5532 1452 5528 -572 -4625 -78
2125g8L491k897k117J179J74J94J970j023m174J252N955j049p069L77P601K59
$$ -78 3413 516 -1601 -422 -248 -54 1916 893 -3281 -2029 3926 2877 -4192 -3815 3786 4045
2141D045p115q20N833J099m015p80J995r9O6J454j849k918L067M258l511n484
$$ 4045 -3070 -3890 1943 3042 -973 -1753 242 143 209 1663 -186 -3104 -37 4221 710 -4774
2157d774L554O073l145o010K399N302j714l927J159K133j068KJ119j896j675L604
$$ -4774 -1220 4853 1708 -4302 -1903 3399 1685 -2242 -1083 1050 -18 -16 1103 -793 -2468 1136
2173A136K333m636l028N077L540m813l743M285L374l475k398K477J106j675M94
$$ 1136 3469 -1167 -4195 882 4422 -391 -4134 151 3525 50 -2348 129 1235 -440 54
2188E4J099k179q69L721Q03m777j031N316J250n283j366M732J165l821n85K671
$$ 54 1153 -1026 -1895 1826 2629 -2148 -3179 2137 3387 -1896 -3262 1470 2635 -1186 -1771 900
2204I00l79j479J588N46k949K44M053n46m862O85N183o22m948M90M307n77l212
$$ 900 521 -958 630 1176 -1773 -1529 2524 1978 -2884 -2199 2984 2362 -2586 -2096 2211 1634 -1578
2221a578P61J858j249n64K082q17k906J744L733k265m371K451M612k231m430J820
$$ -1578 -817 1041 -208 -772 1310 493 -2413 -669 3064 799 -3572 -1121 3491 1260 -3170 -1350
2237a350L733j360k569J176J076j170N14J553k054k033L232K662l997l272M272
$$ -1350 2383 1023 -1546 -370 706 -464 50 1603 -451 -2484 748 3410 -587 -3859 413
2252D13L514l838l623L174L056k290k045J392O26o68R98L20k695k70M142N31n156
$$ 413 3927 89 -3534 -360 2696 406 -1639 -247 379 -289 709 1029 -1666 -1936 2206 2737 -2419
2269b419r53N529J469n265j829M572J800l327j365J875N38m86P30p99k116J520
$$ -2419 -3372 2157 3626 -1639 -3468 1104 2904 -423 -1788 87 625 139 869 70 -2046 -526
2285e26L611j894m787J728N397j208n550N86N067j10l898l21K398L17o62K37j087
$$ -526 3085 1191 -3596 -1868 3529 2321 -3229 -2643 2424 2314 -1584 -1905 493 810 148 385 -702
2302g02r72K466K086l443l131L886L910l608m466L099M314k195l756J322K523
$$ -702 -1674 792 2878 -565 -3696 190 4100 492 -3974 -875 3439 1244 -2512 -1190 1333
2317A333n65r35Q3p60j33K525L19l810r67M743J564n006k053M648K448l866k295
$$ 1333 768 -167 -84 -844 -977 1548 1867 -1943 -2910 1833 3397 -1609 -3662 986 3434 -432 -2727
2334b727K720J763j574o80M41n81L59K013p84l358Q81M374p10m865K60M773K17
$$ -2727 -7 1756 182 -498 -57 -638 -279 1734 950 -2408 -1527 2847 2137 -2728 -2468 2305 2522
2351B522m282m73L341L25k023N1O64p30N64J602j479k506J987L337k149l823K062
$$ 2522 -1760 -2233 1108 1433 -590 -539 125 -605 -41 1561 82 -2424 -437 2900 751 -3072 -1010
2368a010L956j707l554J249K780r51j638Q23L43r08Q78J260k092j679K801K133
$$ -1010 2946 1239 -2315 -1066 1714 763 -875 -52 291 -617 261 1521 -571 -2250 551 2684
2384B684l224k410L138K522k780k278K223J691j586q52J198l77p62J572N95k467
$$ 2684 -540 -2950 188 2710 -70 -2348 -125 1566 -20 -872 326 -51 -813 759 1354 -1113
2400a113p74L250R80l625j128L550J305l149j251K442P78j648r6Q47q21j46J822
$$ -1113 -1887 1363 2343 -1282 -2410 1140 2445 -704 -1955 487 1265 -383 -479 368 -453 -599 1223
2417A223l09k797M88L517m55l826K01L852m2l303q0K403J77j442K19L62q48P42
$$ 1223 914 -1883 -1395 2122 1667 -2159 -1958 1894 1852 -1451 -1531 872 1049 -393 -174 188 -660 82
2435H2J513j572k266K042K923k104l461J923L503j478l153R17K450n74j316L04
$$ 82 1595 23 -2243 -201 2722 618 -2843 -920 2583 1105 -2048 -1131 1319 745 -571 -267
2451b67M1l58J290O03k255j226L053J811l314k252L211K583k764k540K028K082
$$ -267 -226 -584 706 1309 -946 -2172 881 2692 -622 -2874 337 2920 156 -2384 -356 1726
2467A726j230j199M01J26Q8J066k92k314K74L305l0l888m90M063Q63l645j178
$$ 1726 496 -703 -302 -176 -88 978 686 -1628 -1354 1951 1921 -1967 -2457 1606 2469 -1176 -2354
2484b354K905J228j935r33Q68L01J74O88j007j666J508K631j671l296J438L750
$$ -2354 551 1779 -156 -1089 -221 80 254 942 -65 -1731 -223 2408 737 -2559 -1121 2629
2500B629j083l728N94L146r4k244j74J133K1J44K16j276p38K056J488k529k161
$$ 2629 1546 -2182 -1588 1558 1464 -780 -954 179 200 344 560 -716 -1454 602 2090 -439 -2600
2517b600K632K674k405k836J951K562j302k033P73J137k10p9Pj007j51K050L57
$$ -2600 32 2706 301 -2535 -584 1978 676 -1357 -584 553 343 264 271 -736 -887 1163 1520
2534A520k736p63L123J095l129j411K854J339k106j194J362O95o29J14m5r69M78
$$ 1520 -1216 -1979 1144 2239 -890 -2301 553 1892 -214 -1408 -46 649 20 134 89 -880 -402
2551d02J811n59k554M91K961k07l094J0K817J71k251j78J480m6n79M04l08q87
$$ -402 1409 850 -1704 -1213 1748 1541 -1553 -1543 1274 1445 -806 -984 496 450 -129 275 -33 -920
2569i20Q85J505j285k135J459K425j250k553R65K444o95j945N02J198m30l15M97
$$ -920 -35 1470 185 -1950 -491 1934 684 -1869 -904 1540 845 -1100 -598 600 170 -145 352
2586C52n63o74J321J044j825j372K022J731k015j883J727J753j380j417R39P80
$$ 352 -211 -885 436 1480 -345 -1717 305 2036 21 -1862 -135 1618 238 -1179 -240 540
2602E40n39p1L24q99j56J706K71k285n18K628Q12k634r93K324J105j769r21J119
$$ 540 1 -70 254 -645 -801 905 1176 -1109 -1627 1001 1813 -821 -1814 510 1615 -154 -1075 44
2620D4N25m62J19o0r51N26J599o53k279O10K636l37k793J1K595K65k106m16J380
$$ 44 569 107 226 166 -785 -259 1340 687 -1592 -982 1654 1317 -1476 -1465 1130 1395 -711 -1127 253
2639B53K85m74j7l74m47J063J121j531j680J648K204j577k394J207K425p62k110
$$ 253 538 64 47 -327 -774 289 1410 -121 -1801 -153 2051 474 -1920 -713 1712 950 -1160
2656a160L44J416l8n48j15m12K6J281K47j936p32K429J110k379j610K132J802
$$ -1160 -816 600 562 14 -101 -513 -487 794 1041 -895 -1627 802 1912 -467 -2077 55 1857
2673A857j647j686J049J208l73n58j58j28M08R97m36j775K83K473r1k680l91K662
$$ 1857 210 -1476 -427 781 408 -150 -308 -436 -28 969 533 -1242 -959 1514 1423 -1257 -1648 1014
2691A014O45k240q49J562P85q63n08J45M7M29O53q47j381J085J986j058k268Q22
$$ 1014 1659 -581 -1430 132 917 54 -454 -309 -262 167 820 -27 -1408 -323 1663 605 -1663 -841
2709h41K454n07k219J30J790M5j053j77K13Q2N06K75j168o87J517J241j765j614
$$ -841 1613 1106 -1113 -983 807 852 -201 -378 -165 -83 423 698 -470 -1157 360 1601 -164 -1778
2727a778J664J814j421j729J018J332n45r02K57K14k0M95Kj102j47J704M15j975
$$ -1778 -114 1700 279 -1450 -432 900 355 -547 -290 -76 -96 399 401 -701 -848 856 1271 -704
2745g04p77K084R23j795j078J421R70r49o17L98Q4M6M46k74j060L47J569k72j944
$$ -704 -1481 603 1526 -269 -1347 74 1044 95 -522 -124 -40 6 452 178 -882 -535 1034 762 -1182
2764a182J10K053J44j930k82J556L64j039k27M22n0K13M03o05r41Q93J401r98
$$ -1182 -1072 981 1125 -805 -1087 469 833 -206 -433 -11 -61 152 555 -50 -991 -98 1303 305
2782C05j678Q60J845o56j740K35J541j54q96j07L97jL32J69r24n07J387Q24j459
$$ 305 -1373 -513 1332 676 -1064 -829 712 558 -338 -445 -48 -49 283 452 -472 -979 408 1232 -227
2801b27j184J483J439j318j411Q97J291n34q88J98K99N8L17j59r52L7J501J58
$$ -227 -1411 72 1511 193 -1218 -321 970 436 -452 -254 45 103 420 261 -691 -654 847 1005
2819A005j851m49J953O67j798q26J420Q57q36p58L75L56J33J42m37q37P15J329
$$ 1005 -846 -1295 658 1325 -473 -1299 121 978 142 -616 -241 115 248 390 -47 -884 -169 1160
2837A160o11j771M98J922j57j909j79J652L10j161m05N73L30M6p8o47l15R76Q51
$$ 1160 549 -1222 -724 1198 1041 -868 -1047 605 915 -246 -651 -78 252 298 220 -427 -742 234 1085
2856A085j259j165J138J593j030j660O72J614k99j244l0P61K13j47k21n53J22
$$ 1085 -174 -1339 -201 1392 362 -1298 -626 988 689 -555 -585 176 389 242 21 -532 -410
2873d10J133J77j477n73J591Q81j572j115J284J198q88j011M04O94k9j37l58l49
$$ -410 723 900 -577 -1150 441 1322 -250 -1365 -81 1117 229 -782 -378 316 287 150 -208 -557
2891e57L88R50l60j380K36J654R2j777l05J607N20j244n72P48M64k23k23k60j41
$$ -557 -169 781 421 -959 -723 931 1023 -754 -1059 548 1068 -176 -748 0 464 241 18 -242 -383
2910c83N29O51p82j107Q21J401o50j543M02J479j07j208j44Q23K16l59r9k08l3
$$ -383 146 797 15 -1092 -271 1130 480 -1063 -661 818 711 -497 -641 182 398 39 -60 -268 -301
2929c01O71L64j042o28J109R50j077j136Q78J235n97j144L32P39m2l34j48j91
$$ -301 370 734 -308 -936 173 1123 46 -1090 -212 1023 426 -718 -386 353 311 -23 -171 -362
2947c62J34P14l7j078j90J388L84j374n98J172P93r02q26O66N66k10k95q5j50
$$ -362 -228 486 449 -629 -819 569 953 -421 -1019 153 946 44 -782 -116 450 240 -55 -140 -290
2966b90L24O00l51j037L60J248j23j454o6J290K91j108m51P51M43l53k10j20n3
$$ -290 34 634 283 -754 -394 854 731 -723 -789 501 792 -316 -767 -16 427 74 -136 -256 -309
2985c09M94M11o64p79P90J019o09j272M39J324k49j140n4Q44K10l77k31j48J74
$$ -309 185 596 -68 -847 -57 962 353 -919 -480 844 595 -545 -599 245 455 78 -153 -301 -127
3004a27N39K1q70l06J094N81j073r02R68R85o57j062M19Q82k08l54j14n9L36M33
$$ -127 412 433 -437 -743 351 932 -141 -1043 -75 910 253 -809 -390 492 284 -70 -184 -243 93 526
3024E26l25q50J93J132J11j345l01J221N63j047o92P41O88l61m85j18K03L20K73
$$ 526 201 -649 -456 676 787 -558 -859 362 925 -122 -814 -73 615 254 -231 -349 -146 174 447
3043D47n62n99N32J061n34j240K74J339pj157k20R18L25n38l46O6L65J70L9o44
$$ 447 -115 -714 -182 879 345 -895 -621 718 711 -446 -666 252 577 39 -307 -241 124 294 333 -311
3063c11l40Q77N63q42q18O93J047n81j018K29R42on93k60K77K71J70j45o16M8
$$ -311 -651 226 789 -53 -871 -178 869 288 -730 -501 441 435 -158 -418 -141 130 300 155 -461 -413
3083d13R13J71j051m16J050O49q82p48N57Q06k69o32k5K77K32J22m17n10L85Q66
$$ -413 500 671 -380 -796 254 903 21 -727 -170 636 367 -265 -290 -13 219 341 -76 -586 -201 665
3103F65k34j022n8J155K03j059l80Q15M55n14l69J26L37J34o7l76k09M67O11n36
$$ 665 431 -591 -649 506 709 -350 -730 85 540 26 -343 -217 120 254 187 -189 -398 69 680 144
3123A44q89M84R94l21r80O1Q45K27p03k24L12J95J03j93l10j07N90L77p60o19
$$ 144 -745 -261 733 412 -568 -507 338 565 -138 -362 -50 145 248 55 -255 -362 228 605 -155 -774
3143g74P99P78n89q94M00Q23j75o31q6L59K49M3k89l87J85O43J5q98j92R03L81
$$ -774 25 803 214 -680 -280 543 368 -263 -349 10 259 302 13 -374 -189 454 469 -429 -621 282 663
3164F63q17n81O83N91m33m79J08K85K12j24k54k54M01N36k85q16J99R29o2q97
$$ 663 -154 -735 -52 539 106 -373 -265 20 232 108 -146 -400 1 537 252 -564 -365 564 502 -395
3184c95k08Q72L33o05l79K42L53L4j79l36n4N19K97n69n99N53P68l73q99J98Q46
$$ -395 -603 269 602 -3 -382 -140 213 247 68 -268 -322 197 494 -75 -674 -121 647 274 -625 -427 419
3205D19J2o42k26M64K66r1k62k62J78N68K3p36k84P30N69p02o57N04P11k69o88
$$ 419 431 -211 -437 27 293 202 -60 -322 -144 424 447 -289 -573 157 726 24 -633 -129 582 313 -375
3226c75O1M09J57j96k72j90L58M94k57o95Q8Q08J56q15l20P21M61n13n41K97M72
$$ -375 -314 95 252 56 -216 -406 -48 446 189 -506 -418 390 546 -269 -589 132 593 80 -461 -164 308
3247C08Kk56k49j6L72K58m64m57K87P90k51q24j9Q67Q9n81k64L29L99j67k54j85
$$ 308 310 54 -195 -211 161 419 -45 -502 -215 575 324 -500 -519 348 437 -144 -408 -79 320 153 -101 -286
3269b86K16L34P7n22k90N68N29m86p00L17P18j21o60j9M81J64k52l05kJ79L59
$$ -286 -70 264 341 -181 -471 97 626 140 -560 -243 475 354 -306 -325 156 320 68 -237 -239 -60 299
3290B99p6n90o0P01K21o43n06O34N92m35n65J79M94nk49j99J5L63J99k73n03K29
$$ 299 223 -367 -427 274 495 -148 -654 -20 572 137 -428 -249 245 240 -9 -208 -193 170 369 96 -407 -178
3312a78O67q9p64j34P10L43n93m03L69L89j75l11j37J47L31Q6m08l33M18N65l10
$$ -178 489 400 -364 -498 212 555 -38 -441 -72 317 142 -169 -306 -159 172 258 -150 -483 -65 500 190
3333A90o79K00O87N7o66k08N32K99k63l49J4K61K61j32n26l7N60K97n18n45M66
$$ 190 -489 -289 398 455 -211 -419 113 412 149 -200 -186 75 336 204 -322 -359 201 498 -20 -565 -99
3354i9N63j68p12O7N17R0k78k12N7L12J84k60m33J80N59Qn59k42N60L91m89m75
$$ -99 464 296 -416 -349 168 258 -20 -232 -175 137 321 61 -372 -192 367 375 -184 -426 134 525 36 -439
3376d39K94M86j10l29j63J91K28O2l33k63K97M49j35o35O7O46P8n83k16M34L31
$$ -439 -145 341 231 -98 -261 -70 158 220 -113 -376 -79 370 235 -400 -333 313 391 -192 -408 26 357
3397C57k15k87q1K53K55j12l44j03M05L71m87n31L79N55j21n99q0N05K42l81k86
$$ 357 142 -145 -226 27 282 170 -174 -277 128 499 12 -519 -140 415 294 -305 -385 120 362 -19 -305
3418c05J24L13J50k60l48R8M45J16n08k89N19M42l74n32K25M67Pl83j55L00J45
$$ -305 -181 132 282 22 -326 -228 217 333 -175 -464 55 497 123 -409 -184 283 290 -93 -248 52 197
3439A97N0l20k23K27L93j18n40LN01K07n12k92L37M39k40l12n7K24K91j28l18
$$ 197 247 -73 -296 -69 324 206 -334 -331 170 377 -135 -427 -90 349 109 -203 -260 -36 255 127 -191
3460a91j11L93K49k55m16J31N29Pn62q9M08K48k71l47J25L00J10k34l03MN16Q9
$$ -191 -302 91 340 85 -331 -200 329 336 -226 -315 93 341 70 -277 -152 148 258 24 -279 -275 241 330
3482C30l80l28L51M00k10m73R7M05J08l52j97K60K05J2k09k07R0M23j10m44j04
$$ 330 -50 -378 -27 373 163 -310 -213 192 300 -52 -249 11 216 228 19 -188 -98 325 215 -229 -333
3503c33M83K31m04l53K42M26p1l94q2K73J85j14k84m1K77K80k49l69J41M97m5
$$ -333 150 381 -23 -376 -134 292 221 -173 -255 18 203 89 -195 -236 41 321 72 -297 -156 341 296
3524B96m49j55L76L28l27l06O4L40J05k85k31Q0K84J83l45l17K35M24j64m62K6
$$ 296 -153 -308 68 396 69 -237 -173 167 272 -13 -244 -164 120 303 -42 -359 -124 300 136 -326 -300
3545c00M48J42l94j41J40K84L3l20j24K05K61k8l42j36L81L15l84m24K69L63K2
$$ -300 148 290 -104 -245 -105 179 212 -108 -232 -27 234 206 -136 -272 109 424 40 -384 -115 248 270
3566B70l92r7K01K27j61k32m2K86K27k70l20L8N60nm30k00L76K59k18l02K6L79
$$ 270 -122 -219 -18 209 48 -184 -226 60 287 17 -303 -265 295 290 -140 -340 36 295 77 -225 -199 180
3588A80Q5k65k10O6L26J0k43k62K76K89nm98m7M38R5k99j83J64J79P0k51j17J59
$$ 180 265 0 -210 -144 182 192 -51 -313 -37 252 247 -251 -298 140 235 -64 -247 -83 96 166 -85 -202 -43
3611d3K26K2l98o5L05K83k50l82J21M32J3l72q9J87K10m0k58j31K45K23j70l12
$$ -43 183 205 -193 -258 47 330 80 -302 -181 251 264 -108 -197 -10 200 160 -98 -229 16 239 69 -243
3633b43N9L29L1k50k64L06K86p7l92J5L48Q1k05k23M1K60J63k62k36J53L61n3
$$ -243 -184 145 176 -74 -338 -32 254 177 -215 -200 148 229 24 -199 -158 102 265 3 -233 -80 281 228
3655B28l38j49K93K35k80k57J42K46L8k06j87J15L08p2k73j29L16K22j71l39J07
$$ 228 -110 -259 34 269 -11 -268 -126 120 158 -48 -235 -120 188 116 -157 -286 30 252 81 -258 -151
3676a51K87J28l26j81K28K72q7k55l4J22K40q7l27m6L22J64l11k44K42L00q4l85
$$ -151 136 264 -62 -243 -15 257 170 -85 -119 3 243 156 -171 -217 105 269 -42 -286 -44 256 172 -213
3698b13j2K38K41k28k13R8K29M3k07j81J32L20l5m00o4K91K12j48l45J46K49J00
$$ -213 -225 13 254 26 -187 -89 140 183 -24 -205 -73 247 212 -188 -252 39 251 103 -242 -96 153 253
3720B53l10j35J74J62L5l19j36K91K11j41l52P1L51O5l44n6J61J99Nk92m4J64
$$ 253 -57 -192 -18 144 179 -140 -276 15 226 85 -267 -196 155 220 -124 -180 -19 180 185 -107 -151 13
3742A3K25j43k55rK74J04k41k17J72K65p9k72m5K67J54j75k58O2K19J04k47j52
$$ 13 238 95 -160 -169 105 209 -32 -249 -77 188 109 -163 -208 59 213 38 -220 -158 61 165 -82 -234
3764b34J36K59L3l21j20K71K59j86k64P8J98J42k87j84J69K20J6k37r9J26K48
$$ -234 -98 161 194 -127 -247 24 283 97 -167 -89 109 251 -36 -220 -51 169 185 -52 -151 -25 223
3785B23j29k98K2L35N1k19k36J65K38r8j84m9K10J30o9k63K9K25J46k52j60O2
$$ 223 94 -204 -182 153 204 -15 -251 -86 152 54 -130 -179 31 161 92 -171 -142 83 229 -23 -183 -121
3807a21K78N6l48n4J98K14j59j91J5K28J33k97j46J05K35J1k92q0K27J66j44k24
$$ -121 157 213 -135 -189 9 223 64 -127 -112 116 249 -48 -194 -89 146 157 -135 -215 12 178 34 -190
3829a90M0K39O7j81q4P1J96Jk11j21J64J80q0k08l3K38J32k04k23J27K34Kk31
$$ -190 -150 89 156 -25 -109 -38 158 159 -52 -173 -9 171 91 -117 -150 88 220 16 -207 -80 154 156 -75
3852g5r0J24J89l3k71j4K35J05k23j98J25K94K7k65j66K66J77j34j89KJ45J90
$$ -75 -165 -41 148 115 -156 -170 65 170 -53 -251 -126 168 195 -70 -236 30 207 73 -116 -114 31 221
3874B21j51k64J10K00M7k57j01K55Q2l1k25k6J88J70k66j01J34J58L5k09j30J59
$$ 221 70 -194 -84 116 163 -94 -195 60 142 111 -114 -140 48 218 -48 -149 -15 143 178 -31 -161 -2
3896bK19j00k91L4K88Q2j58k12J38J20Kj56j41J88J75q2k01p1K24Q7j88j29O6
$$ -2 217 117 -174 -140 148 230 72 -140 -2 118 120 -36 -177 11 186 104 -97 -168 56 143 -45 -174 -108
3919a08K49ok25j06J52J94p0j89MJ82N0q1j73M8J89O1k22o1J06J71q0k09NK36
$$ -108 141 135 -90 -196 -44 150 80 -109 -105 77 127 46 -127 -79 110 171 -51 -112 -6 165 85 -124 -119 117
3943A17Q9j96j43N0J93rj82j41J99J49n6j72l6K11J08j91j39M7K53l8j91r2J54
$$ 117 206 10 -133 -83 110 101 -81 -222 -23 126 70 -102 -138 73 181 -10 -149 -102 151 113 -78 -170 -16
3966a6J44m9j92o0K03J52j81j15K0J83M8j77j31J35J66Lk35j8J85J02j33j72L9
$$ -16 128 79 -113 -173 30 182 1 -114 -94 89 137 -40 -171 -36 130 133 -102 -120 65 167 34 -138 -99
3989i9J73O6j95j09J12K51o0k30j8J37J64j44j43mJ98j4j23j13J19J55k3j93n2
$$ -99 74 140 -55 -164 -52 199 139 -91 -109 28 192 48 -95 -99 99 85 -38 -151 -32 123 100 -93 -145
4012a45J26J47r7j63O7J68J7j59r0J08J48l4j51p3J66J03j15j54M7K21qj82r7
$$ -145 -19 128 31 -132 -65 103 120 -39 -129 -21 127 93 -58 -131 35 138 23 -131 -84 137 129 -53 -150
4035a50M0J92K6k37K6J12J27j18j20q2J76R9j16j69Q3K30k8k17k9J71J43j29j30
$$ -150 -110 82 108 -129 -103 9 136 18 -102 -184 -8 91 -25 -194 -111 119 91 -126 -155 16 159 30 -100
4058a00L2J66k1r3m8N3K33j71j20p2J38J09j15j30K7K13L8k13j01J28J45l3j81
$$ -100 -68 98 77 -16 -64 -11 222 51 -69 -141 -3 106 -9 -139 -112 101 139 -74 -175 -47 98 65 -116
4081a16j9J24J53q3k32Q5J64N1j11j35Q7J48j5j29r1R4J47r2j02l6K05kj02j99
$$ -116 -135 -11 142 59 -173 -88 76 127 16 -119 -32 116 101 -28 -119 -25 122 30 -72 -108 97 95 -7 -206
4105b06J12K15p9j32k3J11J29j05j22J6J71Q5j89j02J20J06oj40q7J10J59r2j97
$$ -206 -94 121 42 -90 -113 -2 127 22 -100 -84 87 172 -17 -119 1 107 101 -39 -126 -16 143 51 -146
4128a46M8J48L3j14q2N9J37mj56p2J28J32p8j14j3J22J63k09j18J16J31k4j12
$$ -146 -98 50 83 -31 -113 -54 83 79 -77 -149 -21 111 33 -81 -94 28 191 -18 -136 -20 111 87 -25
4151b5n7J06N9j9j57k1J81Q0j29j23N7J02J3j89kJ59R4j10j30j2J37R2r6j28J07
$$ -25 -82 24 83 64 -93 -114 67 147 18 -105 -48 54 67 -122 -124 35 129 19 -111 -123 14 106 10 -118 -11
4176a1Q7J1j11q3J22Q6l3j24n3K14k7o2q7R6L3j3r4k8O6J42j52j33M6J36J6o6
$$ -11 76 87 -24 -107 15 101 68 -56 -109 105 78 16 -71 25 58 45 -49 -77 -11 131 -21 -154 -108 28 44 -22
4202b2r6O4J43j5j30r2J47J02l7j03m4P3J76k03n7M8J41L6j59j11J62Q3n8j32
$$ -22 -118 -54 89 74 -56 -148 -1 101 64 -39 -83 -10 166 -37 -94 -46 95 131 -28 -139 23 106 48 -84
4226h4l6J76j5o9q3JK59o5r6j06R5J69j16j28K8J03J11j21j15N7J37k3k5j46O8
$$ -84 -120 56 41 -28 -111 -110 149 84 -12 -118 -23 146 30 -98 -70 33 144 23 -92 -35 102 79 54 -92 -24
4251b4J69m6j38r4J91P0j82r9O6J41K7j41j16J17J57o0r6n3J72K7n2j26l7K70
$$ -24 145 99 -39 -133 58 128 -54 -153 -87 54 81 -60 -176 -59 98 38 -58 -111 61 88 36 -90 -127 143
4275A43j0k03l9J36O5p1j00n1J84N2j32j05N5J65Pj34j02R5R5q1o5oJ63P8j67
$$ 143 133 -70 -109 27 92 21 -79 -130 54 106 -26 -131 -76 89 96 -38 -140 -45 50 -31 -96 -102 61 139 -28
4300b8r1R5R4k9m1j10J50N0m2j17J6J13K0l9j55M8J75m8j33k9Q4J07l1j15OJ06
$$ -28 -119 -24 70 41 0 -110 40 90 48 -69 -53 60 80 41 -114 -66 109 61 -72 -101 -17 90 59 -56 -50 56
4326E6j8k9j60Q5J45L0j47LM2R8m9j26nQ6L9n7l9K9P1J9p0j21J26O1K5j56J2J00
$$ 56 38 9 -151 -66 79 109 -38 -35 7 105 56 -70 -75 11 50 -7 -46 -17 54 73 3 -118 8 69 94 -62 -50 50
4354E0M2j52p7M8J25N4r4o9P1N9K8j49nN2J25o2j17K6J50k6j19k1Q4M1k4p3j6
$$ 50 92 -60 -137 -89 36 90 -4 -73 -2 57 85 -64 -69 -17 108 46 -71 -45 105 79 -40 -61 23 64 40 -33 -49
4381d9J5R1j7j31J8J00O1j37r4J00J61q8j77R4P4L2rj63Q4J17J7n4j24O8J40m8
$$ -49 -34 57 40 -91 -73 27 88 -49 -143 -43 118 30 -147 -53 21 53 44 -119 -35 82 99 45 -79 -11 129 81
4407H1j25m0J12L0j04n8K2J16l4o8j6K4J29j8j28m0J25J03q0q6j8J29K1j06o0
$$ 81 -44 -84 28 58 -46 -104 -82 34 0 -68 -84 -60 69 51 -77 -117 8 111 31 -55 -73 56 77 -29 -89
4432h9J50L1j2j29l8L3J01o9p5j2J22R9j15j44N3J54nj29LO0R1m6j19rJ54Oj04
$$ -89 61 92 80 -49 -87 -54 47 -22 -97 -109 13 112 -3 -147 -94 60 55 -74 -71 -11 80 34 -85 -94 60 66 -38
4459c8k3j2J71j6j01m5J00J03o6j75O0Q3J8o8n1qJ22L1j32l6M3J16j3j18l4J38
$$ -38 -61 -73 98 82 -19 -64 36 139 73 -102 -42 41 59 -9 -60 -68 54 85 -47 -83 -40 76 63 -55 -89 49
4485D9J2p4m0L9J31r2o5N7k9J39j08l7o9J61M3q5j31R9Q3Pj45n5J52Pp9j07O1
$$ 49 61 -13 -53 -14 117 25 -40 17 -12 127 19 -18 -87 74 117 32 -99 0 83 90 -55 -110 42 49 -30 -137 -76
4512g6M2L5m4j3K7K4K7p0l9R2R6l7r6J1Q0K0j27J5N4K2O7j51k6M5R5n8j06lJ25
$$ -76 -34 1 -43 -56 -29 -5 22 -48 -87 5 101 64 -32 -21 59 79 -48 -33 21 43 110 -41 -67 -22 73 15 -91 -94 31
4541C1J8n1n7M7N5m1n3J6M5jJ0l3l7N8P4l1j34J1J62lj14m5R6j2L3r8P2K6kj2
$$ 31 49 -2 -59 -12 43 2 -51 -35 10 9 19 -14 -51 7 81 50 -84 -73 89 86 -28 -73 23 11 44 -54 18 44 42 30
4571C0p1m5Q8K7q2rJ3J42p7j00nJ25P6j43k2jJ27k0rp3N5M3k7l9j27J46P8r6r3
$$ 30 -41 -86 2 29 -53 -62 -49 93 16 -84 -89 36 112 -31 -53 -54 73 53 44 -29 26 69 42 3 -124 22 100 4 -89
4600h9O1Q3m3p5l7J41K3p2n4m8J25L4k7r0M3Q8mo2o3R3O2n4p5qJ28Lp1m9pN6N8
$$ -89 -28 55 12 -63 -100 41 64 -8 -62 -110 15 49 22 -68 -25 63 59 -3 -66 27 89 35 -40 -48 80 83 12 -37 -44 12 70
4631G0m7p4pJ25l8r6J4Q8J6k1r1LJ07Ol9q7N7R4q0r0J50k8O3p9n4l9J11L2p2p1
$$ 70 23 -51 -58 67 29 -67 -53 35 51 30 -61 -58 49 55 16 -71 -14 80 0 -90 60 32 95 16 -38 -77 34 66 -6 -77
4661g7P1J0K3l8j5J9M6j8j08j2J36N4j61K2N8R7o8q6K2J22m4l1n8M0L2kk1o4M2
$$ -77 -6 4 27 -11 -26 -7 39 21 -87 -99 37 91 -70 -48 10 107 39 -47 -25 97 53 22 -36 4 36 34 13 -51 -9
4690iJ11o4q3l1K3J05o1n5KO4P3j26jM1K0j0o1K5P5LJ9j41N8J08k1n8r3P6J44
$$ -9 102 38 -45 -76 -53 52 -9 -64 -62 2 75 -51 -52 -11 9 -1 -62 -37 38 41 60 -81 -23 85 64 6 -87 -11 133
4719A33m6m8r8Q7N2mj19o2P5R6n6r4K4J38j02n0M7R1m4j4m7QM1M4m4n0O0N0nn6
$$ 133 87 39 -59 28 80 76 -43 -105 -30 66 10 -84 -60 78 -24 -74 -27 64 20 6 -41 -33 8 52 8 -42 18 68 63 7
4749Gr7J17J7qq0K9N9k1m1j8LRR3j05o3R8O9lj73N6J04j6l9n3P8M8l3l0r0J39
$$ 7 -90 27 44 36 -44 -15 44 23 -18 -36 -33 -24 69 -36 -99 -1 68 65 -108 -52 52 36 -3 -56 22 70 37 7 -83 56
4779E6M0n8m8p5J15O5r1r4N2J14k3r6j9N6J13j36o0J6J28j5j1o6L7K3O3p0q9J15
$$ 56 96 38 -10 -85 30 95 4 -90 -38 76 53 -43 -62 -6 107 -29 -89 -73 55 40 29 -37 0 23 86 16 -73 42
4807D2Jm7J1n3P5Ol8q5N0N8j1j06L1J1P6l3m0l2O4N7q2k7L0J01kr6L6J0K8j5j2
$$ 42 43 -4 7 -46 29 35 -3 -88 -38 20 9 -97 -66 -55 21 -12 -52 -84 -20 37 -45 -72 -42 59 57 -39 -3 7 35 20 8
$$ [...]
8191i
##END NTUPLES=NMR FID
##END=
