##TITLE=1H_LY-DMAA-Per2.16
 CDCl3
 8 sc, 
 11.03.2022
##JCAMPDX= 6.0         $$ Bruker NMR JCAMP-DX V2.0
##DATA TYPE= NMR FID
##DATA CLASS= NTUPLES
##ORIGIN= UXNMR, Bruker Analytische Messtechnik GmbH
##OWNER= root
$$ XWIN-NMR		Version 3.5
$$ Fri Mar 11 13:58:16 2022 Russian Standard Time (UT+4h)  she@DPX200
##.OBSERVE FREQUENCY= 200.131346
##.OBSERVE NUCLEUS= ^1H
##.DELAY= (6, 6)
##.ACQUISITION MODE= SIMULTANEOUS
##.ACQUISITION SCHEME= undefined
##.AVERAGES= 8
##.DIGITISER RES= 18
##SPECTROMETER/DATA SYSTEM= spect
##.PULSE SEQUENCE= zg30
##.SOLVENT NAME= CDCl3
##.SHIFT REFERENCE= (INTERNAL, CDCl3, 0, 15.7039)
##AUDIT TRAIL= $$ (NUMBER, WHEN, WHO, WHERE, WHAT)
$$ ##TITLE= Audit trail, XWIN-NMR		Version 3.5
$$ ##JCAMPDX= 5.01
$$ ##ORIGIN= Bruker BioSpin GmbH
$$ ##OWNER= she
$$ F:/spectra/data/she/nmr/H-F/1/audita.txt
$$ ##AUDIT TRAIL=  $$ (NUMBER, WHEN, WHO, WHERE, WHAT)
(   1,<2022-03-11 13:57:06.82 +0400>,<she>,<DPX200>,
      <created by zg, POWCHK disabled, PULCHK disabled
       configuration hash MD5:
       00 E9 B6 7A A2 85 ED C7 34 08 36 98 17 FE 4E 26
       data hash MD5: 16K
       5D A6 82 39 20 7C CA 8A B4 94 7A FB 12 0E 13 0A>)
$$ ##END=
$$ 
$$ hash MD5
$$ B6 6E 3A 95 D1 74 D8 AD E3 42 C2 73 1C AB 74 A0
##$RELAX= 
##$RELAX= 
##$RELAX= 
##$RELAX= 
##$RELAX= 
##$RELAX= 
$$ Bruker specific parameters
$$ --------------------------
##$DU= <F:/spectra>
##$EXPNO= 1
##$NAME= <H-F>
##$PROCNO= 1
##$TYPE= <nmr>
##$USER= <she>
##$AMP= (0..31)
100 100 100 100 100 100 100 100 100 100 100 100 100 100 100 100 100 100 
100 100 100 100 100 100 100 100 100 100 100 100 100 100 
##$AQSEQ= 0
##$AQ_mod= 1
##$AUNM= <au_zg>
##$AUTOPOS= <>
##$BF1= 200.13
##$BF2= 200.13
##$BF3= 200.13
##$BF4= 200.13
##$BF5= 200.13
##$BF6= 200.13
##$BF7= 200.13
##$BF8= 200.13
##$BYTORDA= 1
##$CFDGTYP= 0
##$CFRGTYP= 5
##$CHEMSTR= <none>
##$CNST= (0..31)
1 1 145 1 1 1 1 1 1 1 1 1 1 1 1 1 1 1 1 1 1 1 1 1 1 1 1 1 1 1 1 1 
##$CPDPRG= <>
##$CPDPRG1= <>
##$CPDPRG2= <>
##$CPDPRG3= <>
##$CPDPRG4= <mlev>
##$CPDPRG5= <mlev>
##$CPDPRG6= <mlev>
##$CPDPRG7= <mlev>
##$CPDPRG8= <mlev>
##$CPDPRGB= <>
##$CPDPRGT= <>
##$D= (0..31)
0 1.2 0 0 0 0 0 0 0 0.06 0 0.03 0 0 0 0 0.0002 0 0 0 0 0 0 0 0 0 0 0 0 
0 0 0 
##$DATE= 1646992626
##$DBL= (0..7)
120 120 120 120 120 120 120 120 
##$DBP= (0..7)
150 150 150 150 150 150 150 150 
##$DBP07= 0
##$DBPNAM0= <>
##$DBPNAM1= <>
##$DBPNAM2= <>
##$DBPNAM3= <>
##$DBPNAM4= <>
##$DBPNAM5= <>
##$DBPNAM6= <>
##$DBPNAM7= <>
##$DBPOAL= (0..7)
0.5 0.5 0.5 0.5 0.5 0.5 0.5 0.5 
##$DBPOFFS= (0..7)
0 0 0 0 0 0 0 0 
##$DE= 6
##$DECBNUC= <off>
##$DECIM= 32
##$DECNUC= <off>
##$DECSTAT= 4
##$DIGMOD= 1
##$DIGTYP= 9
##$DL= (0..7)
0 120 120 120 120 120 120 120 
##$DP= (0..7)
150 150 150 150 150 150 150 150 
##$DP07= 0
##$DPNAME0= <>
##$DPNAME1= <>
##$DPNAME2= <>
##$DPNAME3= <>
##$DPNAME4= <>
##$DPNAME5= <>
##$DPNAME6= <>
##$DPNAME7= <>
##$DPOAL= (0..7)
0.5 0.5 0.5 0.5 0.5 0.5 0.5 0.5 
##$DPOFFS= (0..7)
0 0 0 0 0 0 0 0 
##$DQDMODE= 0
##$DR= 18
##$DS= 0
##$DSLIST= <SSSSSSSSSSSSSSS>
$$ [...]
##$SUBNAM2= <"">
##$SUBNAM3= <"">
##$SUBNAM4= <"">
##$SUBNAM5= <"">
##$SUBNAM6= <"">
##$SUBNAM7= <"">
##$SUBNAM8= <"">
##$SUBNAM9= <"">
##$SW= 18.0517287032376
##$SWIBOX= (0..15)
0 0 2 0 0 0 0 0 0 0 0 0 0 0 0 0 
##$SW_h= 3612.71676300578
##$TD= 16384
##$TD0= 1
##$TE= 0
##$TE2= 300
##$TE3= 300
##$TEG= 300
##$TL= (0..7)
0 120 120 120 120 120 120 120 
##$TP= (0..7)
150 150 150 150 150 150 150 150 
##$TP07= 0
##$TPNAME0= <>
##$TPNAME1= <>
##$TPNAME2= <>
##$TPNAME3= <>
##$TPNAME4= <>
##$TPNAME5= <>
##$TPNAME6= <>
##$TPNAME7= <>
##$TPOAL= (0..7)
0.5 0.5 0.5 0.5 0.5 0.5 0.5 0.5 
##$TPOFFS= (0..7)
0 0 0 0 0 0 0 0 
##$TUNHIN= 0
##$TUNHOUT= 0
##$TUNXOUT= 0
##$USERA1= <user>
##$USERA2= <user>
##$USERA3= <user>
##$USERA4= <user>
##$USERA5= <user>
##$V9= 5
##$VALIST= <valist>
##$VCLIST= <CCCCCCCCCCCCCCC>
##$VD= 0
##$VDLIST= <DDDDDDDDDDDDDDD>
##$VPLIST= <PPPPPPPPPPPPPPP>
##$VTLIST= <TTTTTTTTTTTTTTT>
##$WBST= 1024
##$WBSW= 4
##$XGAIN= (0..3)
0 0 0 0 
##$XL= 0
##$YL= 0
##$YMAX_a= 416921
##$YMIN_a= -358443
##$ZGOPTNS= <>
##$ZL1= 120
##$ZL2= 120
##$ZL3= 120
##$ZL4= 120
##$ABSF1= 10
##$ABSF2= 0
##$ABSG= 5
##$ABSL= 3
##$ALPHA= 0
##$AQORDER= 0
##$ASSFAC= 0
##$ASSFACI= 0
##$ASSFACX= 0
##$ASSWID= 0
##$AUNMP= <proc_1d>
##$AZFE= 0.1
##$AZFW= 0.1
##$BCFW= 1
##$BC_mod= 2
##$BYTORDP= 1
##$COROFFS= 0
##$CY= 11.3945322036743
##$DATMOD= 1
##$DC= 2
##$DFILT= <>
##$DTYPP= 0
##$F1P= 2.36226072786647
##$F2P= -0.459571619588291
##$FCOR= 0.5
##$FTSIZE= 0
##$FT_mod= 4
##$GAMMA= 1
##$GB= 0.15
##$INTBC= 1
##$INTSCL= 1
##$ISEN= 128
##$LB= 0.24
##$LEV0= 0
##$LPBIN= 0
##$MAXI= 10000
##$MC2= 0
##$MEAN= 0
##$ME_mod= 0
##$MI= 1.114404
##$NCOEF= 0
##$NC_proc= 0
##$NLEV= 6
##$NOISF1= 3.799351
##$NOISF2= 2.8
##$NSP= 1
##$NTH_PI= 0
##$NZP= 0
##$OFFSET= 15.70392
##$PC= 1
##$PHC0= -16742.86
##$PHC1= 6.200781
##$PH_mod= 1
##$PKNL= yes
##$PPARMOD= 0
##$PSCAL= 0
##$PSIGN= 0
##$REVERSE= no
##$SF= 200.130013532006
##$SI= 16384
##$SIGF1= 3
##$SIGF2= 2
##$SINO= 400
##$SIOLD= 16384
##$SREGLST= <1H.CDCl3>
##$SSB= 0
##$STSI= 0
##$STSR= 0
##$SW_p= 3612.71676300578
##$SYMM= 0
##$S_DEV= 0
##$TDeff= 0
##$TDoff= 0
##$TI= <>
##$TILT= no
##$TM1= 0
##$TM2= 0
##$TOPLEV= 0
##$USERP1= <user>
##$USERP2= <user>
##$USERP3= <user>
##$USERP4= <user>
##$USERP5= <user>
##$WDW= 1
##$XDIM= 8192
##$YMAX_p= 0
##$YMIN_p= 0
$$ End of Bruker specific parameters
$$ ---------------------------------
##NTUPLES= NMR FID
##VAR_NAME=  TIME,          FID/REAL,        FID/IMAG
##SYMBOL=    X,             R,               I
##VAR_TYPE=  INDEPENDENT,   DEPENDENT,       DEPENDENT
##VAR_FORM=  AFFN,          ASDF,            ASDF
##VAR_DIM=   8192,          8192,            8192
##UNITS=     SECONDS,       ARBITRARY UNITS, ARBITRARY UNITS
##FACTOR=    0.0002768,     1,               1
##FIRST=     0,             0,               0
##LAST=      2.2672688,     0,               0
##MIN=       0,             -358443,         0
##MAX=       2.2672688,     416921,          0
$$ Real data points
##PAGE= N=1
##DATA TABLE= (X++(R..R)), XYDATA
$$ [...]
$$ plain form
1114 -1655 3943 1980 -1651 -1401 -437 611 2566 846 -4051 -2459 4905 3838 -5227 -5161 4439 5546
1130 5546 -3489 -5643 1886 4520 -568 -3115 -814 1024 1586 1321 -1759 -3363 1618 5336 -704
1145 -704 -6279 -89 6809 1303 -6155 -1978 5110 2551 -3413 -2472 1381 1761 500 -830 -2318 -782
1161 -782 3292 2171 -4090 -3684 3864 4543 -3452 -5085 2437 4886 -1301 -4084 315 2806 682 -891
1177 -891 -950 -724 1105 2652 -591 -3807 -16 4663 749 -4918 -1460 4386 1733 -3731 -2065 2386
1193 2386 1503 -1338 -999 -45 -92 958 1100 -1614 -2080 1904 3004 -1777 -3356 1640 3619 -999 -3083
1210 -3083 716 2486 -301 -1423 175 373 -237 681 405 -1651 -958 2054 1114 -2534 -1616 2281 1534
1227 1534 -2147 -1545 1544 1064 -1099 -436 637 -178 -179 1039 116 -1575 46 2171 223 -2235 -146
$$ packed form
1114a655N598j963l631K50R64J048J955j720m897J592P364j067r065O6R600J107
1130E546r035k154P529K634n088k547K301J838N62k65l080j604M981L718o040
1145g04n575O190O898n506p458M177P088k559n964R41L853L80j261j330j488J536
1161g82M074j121o261M06P548O79p995j633P522K449o187k783M399K491k124j573
1177h91n9K26J829J547l243l216L791M679l914n667L458N846k653n464J666M451
1193B386q83k841L39R54m7J050J42k714m66L984J100m781j579M996J979m618k084
1210c083L799J770k787j122J598J98o10R18k76k056O93L012r40l648R18L897p47
1227A534l681O02L089m80k163O63J073q15jJ218r23j691J621K125j948k458K089
$$ plain form
1244 -146 2296 444 -1838 -411 1305 235 -718 -4 -94 -588 455 876 -958 -1539 914 1825 -918
1261 -918 -2019 658 1964 -307 -1601 61 1184 294 -339 -263 -209 353 1081 6 -1431 -303 1784
1278 1784 722 -1820 -1164 1492 1290 -1192 -1513 482 1148 -79 -954 -653 277 939 269 -1103 -846
1295 -846 1045 1392 -618 -1576 339 1797 264 -1375 -485 1148 1005 -473 -1046 -12 1047 665 -862
1312 -862 -1088 408 1207 -91 -1370 -386 939 640 -783 -987 182 883 244 -845 -650 670 1089
1329 1089 -235 -1112 50 1280 358 -895 -376 733 526 -289 -416 -61 170 251 60 -650 -493 637
1347 637 517 -867 -821 693 710 -745 -694 603 444 -530 -145 586 -117 -476 557 660 -589 -428 932
1366 932 544 -859 -274 882 213 -830 102 780 -422 -773 671 577 -1109 -608 1162 391 -1487 -439
$$ packed form
1244a46K442j852k282J427J716j070r53P14r0m94J043M21j834n81K453R11k743
1261i18j101K677J306k271j294J662J123q90o33P6N4N62P28j075j437J128K087
1278A784j062k542O56K656k02k482l21J995O66j227q75L01R30O62o70j372K57
1295h46J891L47k010r58J915J458j533j639Q90J633j43j478n73J034J059l82j527
1312h62k26J496P99j298j279R84J325k99j423k04J169P01o39j089J95J320M19
1329A089j324q77J162J230r22j253N19J109k07q15j27L55K31Q1j91p10J57J130
1347F37j20j384M6J514J7j455N1J297j59r74L85P31p03l59J033J03j249J61J360
1366I32l88j403N85J156o69j043R32O78j202l51J444r4j686N01J770p71j878J048
$$ plain form
1384 -439 1396 219 -1341 -78 1052 -161 -774 557 582 -737 2 1310 -105 -1460 506 1863
1400 1863 -567 -1890 746 1891 -785 -1734 725 1328 -870 -890 721 125 -901 370 834 -1060
1416 -1060 -1085 1502 1139 -1951 -1129 2257 1151 -2200 -896 2211 770 -1808 -307 1613 15 -1006
1432 -1006 636 676 -1103 -213 1629 -223 -2113 457 2309 -878 -2619 893 2430 -1174 -2317 1117
1448 1117 1912 -1183 -1355 1239 778 -1138 59 1281 -692 -1139 1435 1206 -1971 -1020 2589 1032
1464 1032 -2798 -874 2939 655 -2854 -539 2460 136 -2062 83 1343 -720 -723 1153 -117 -1768
1480 -1768 707 2261 -1391 -2698 1797 3075 -1883 -2985 2076 3019 -1768 -2465 1573 1850 -1192 -877
1496 -877 917 -219 -682 1277 518 -2436 -711 3169 644 -3908 -984 4036 1025 -3949 -1218 3324
$$ packed form
1384d39J835j177j560J263J130j213o13J331K5j319P39J308j415j355J966J357
1400A863k430j323K636J145k676r49K459O03k198k0J611n96j026J271M64j894
1416a060k5K587l63l090Q22L386j106l351J304L107j441k578J501J920j598j021
1432a006J642M0j779Q90J842j852j890K570J852l187j741L512J537l604j143L434
1448A117P95l095j72K594m61j916J197J222j973m47K574k29l177R51L609j557
1464A032l830J924L813k284l509K315K999k324k198K145J260k063lJ876j270j651
1480a768K475J554l652j307M495J278m958j102N061R43m787o97M038K77l042L15
1496h77J794j136m63J959p59k954J725L880k525m552K924N020l011m974K731M542
$$ plain form
1512 3324 1034 -2557 -651 1558 90 -325 700 -517 -1600 1485 2633 -1936 -3324 2304 3921
1527 3921 -2130 -4100 1894 3871 -1504 -3322 942 2278 -664 -1050 355 -506 -451 1793 508 -3156
1543 -3156 -957 3913 1328 -4329 -1630 4436 1996 -3862 -1806 3184 1594 -2041 -812 1075 -31
1558 -31 -104 1254 -657 -2386 1120 3246 -1442 -4028 1443 4196 -1338 -4188 931 3600 -820 -2731
1574 -2731 678 1561 -778 -272 1026 -889 -1313 2032 1867 -2677 -1996 3251 2346 -3250 -2164 3125
1590 3125 1840 -2745 -1301 2220 439 -1828 358 1188 -1458 -1030 2164 598 -2927 -443 3145
1605 3145 219 -3250 57 3022 -360 -2521 936 2040 -1238 -1271 1908 802 -2305 -122 2762
1620 2762 -225 -2869 592 2808 -837 -2436 1040 1806 -1481 -1172 1619 188 -2094 525 2318
$$ packed form
1512C324k290l591J906K209j468m15J025j217j083L085J148m569j388N628J617
1527C921o051j970N994J977n375j818M264J336k942l86J405q61N5K244j285l664
1543c156K199M870k585n657K699O066k440n858K056M990j590l635J229J887j106
1558c1p3J358j911j729L506K126m688k586N471K753n534k850N119K669m420j911
1574b731L409Q83k339N06J298j915m24L345j65m544O81N247r05n596J086N289
1590C125j285m585J444L521j781k267K186Q30k646M28L194j566l525K484L588
1605C145k926l469L307K965l382k161L457J104l278l3L179j106l107K183K884
1620B762k987k644L461K216l645j599L476P66l287L09K791j431k282K619J793
$$ plain form
1635 2318 -1259 -2771 1679 2900 -1962 -2914 1989 2634 -1775 -1955 1642 1272 -1152 7 1066 -1036
1651 -1036 -845 2123 945 -3096 -1165 3661 1299 -4003 -1557 3646 1545 -3156 -1480 2205 945
1666 945 -1225 -218 124 -743 765 1908 -1417 -2878 1752 3809 -1550 -4248 1349 4460 -819 -4006
1682 -4006 341 3134 53 -1895 -260 386 125 1046 159 -2641 -867 3508 1463 -4146 -2285 4133
1698 4133 2715 -3671 -3003 2895 2780 -1786 -2056 770 1077 348 432 -936 -1763 1409 3095 -1286 -4066
1715 -4066 1037 4690 -509 -4710 -120 4123 485 -3255 -812 1830 599 -524 -301 -967 -508 2077
1731 2077 1259 -2860 -2134 3240 2854 -3102 -3132 2754 3233 -2045 -2725 1379 2040 -573 -842 115 -431 213
1749 213 1719 -249 -2788 22 3479 170 -3833 -637 3629 760 -3284 -858 2442 539 -1524
$$ packed form
1635B318l577j512M450J221m862r52M903O45m409j80L597l70k424J159J059k102
1651a036J91K968j178m041J931M826k362n302K446N203k101m701J676L685j260
1666I45k170J007L42q67J508J143l325j461M630K057n359k698N597L111n279l187
1682d006M347K793l081j948J635O46k61R21q87k800J774M375k045n609J861O418
1698D133j418o386O68N898j15m566k70K826L07p29Q4j368q27L172J686m381k780
1715d066N103L653n199m201M590M243l638l740K443K642j231j123K23o66M59K585
1731B077q18m119P26N374l86n956l0N886M79n278o80M104O61k613k69R57n46O44
1749B13J506j968k539K810L457l309m003L196M266k869m044K426L300j903k063
$$ plain form
1764 -1524 -44 533 -552 319 1353 -888 -2020 1383 2652 -1407 -2881 1425 2852 -1177 -2436
1779 -2436 978 1829 -941 -1029 863 -9 -1067 731 1162 -1600 -1506 1908 1613 -2205 -1675 2179 1650
1796 1650 -1902 -1161 1641 678 -1165 107 941 -869 -612 1721 563 -2249 -524 2664 586 -2740
1812 -2740 -621 2505 452 -2117 -363 1294 -105 -685 619 -109 -1273 590 1966 -976 -2536
1827 -2536 1116 2930 -964 -2955 804 2709 -411 -2060 295 1347 -62 -238 164 -741 -381 1688
1843 1688 797 -2396 -1350 2685 1734 -2826 -2154 2406 2104 -1911 -1968 1119 1432 -414 -609 -241 -352
1860 -352 741 1515 -829 -2338 807 3189 -395 -3420 86 3440 439 -2890 -772 2125 818
1875 818 -1151 -753 -37 224 962 294 -1888 -1185 2237 1835 -2427 -2525 2205 2760 -1647 -2741 1014 2411
$$ packed form
1764a524J480N77j085Q71J034k241j132L403J269m059j474M306J427m029j259
1779b436L414Q51k770q8J892q72j058J798M31k762R4L414k95l818N30L854n29
1796A650l552P41K802r63j843J272Q34j810K57K333j158k812J725L188k078l326
1812b740K119L126k053k569J754J657j399n80J304p28j164J863J376k942j560
1827b536L652J814l894j991L759J905l120j649K355J052j409j76M02r05L60K069
1843A688q91l193J046M035r51m560O72M560l02m015n7L087L13j846j95L68j11
1860c52J093P74k344j509L145K382l584l025L506L354l001l329K118K897j307
1875H18j969L98P16K61P38o68k182P03L422m02m262r8M730N55m407j094L755J397
$$ plain form
1893 2411 -327 -1571 -130 700 543 476 -578 -1431 499 2359 -44 -2889 -417 3098 842 -2945
1909 -2945 -1296 2325 1346 -1661 -1268 712 763 67 -167 -819 -584 1312 1400 -1420 -2036 1409 2593 -1029
1927 -1029 -2581 716 2447 -193 -1870 -79 1117 233 -311 -243 -619 -19 1239 315 -1826 -882 1980
1944 1980 1127 -1993 -1419 1607 1378 -1231 -1226 739 881 -203 -208 -66 -342 383 1102 -229 -1521 288
1962 288 1925 13 -1975 -236 1761 376 -1524 -499 848 251 -391 -81 -333 -357 604 792 -913
1979 -913 -1198 979 1504 -824 -1627 641 1541 -286 -1196 148 747 213 -77 -91 -440 -30 959 296 -1430
1998 -1430 -600 1501 822 -1468 -1037 1154 1086 -847 -1043 263 666 62 -264 -411 -319 581 947 -539
2016 -539 -1267 447 1715 -106 -1749 -161 1618 462 -1157 -680 716 745 -151 -591 -453 133 876
$$ packed form
1893B411k738j244J441Q30j57o7j054q53J930J860k403k845K472L515k256l787
1909b945J649L621r79l007L93J980N1o96k34o52K35J896Q8k820o16L445J184l622
1927a029j552L297J731k640j677J791J196q84n44O8l76O00J258r24k141R44K862
1944A980q53l120N74L026k29k609NJ965J42j084nJ42k76P25P19j331j292J809
1962B88J637j912j988J739J997j385j900J025J347n97o42L10k52k4R61J88j705
1979i13k85K177N25k328q03K268R00j827r10J344N99n34k90j4l49M10R89o63j726
1998a430Q30K101o79k290M31K191o8j933j96J306M03o04l26j47R2R00L66j486
2016e39p28J714J268j821j643J588J779j156j619M77J396K9q96m40J38N86P43
$$ plain form
2033 876 233 -1217 -817 1204 1102 -1115 -1415 743 1474 -374 -1365 -85 988 479 -470 -595 -154 759
2051 759 682 -528 -1141 270 1480 143 -1546 -465 1410 787 -1154 -1013 569 948 -118 -812 -449
2068 -449 386 770 14 -1057 -551 965 909 -796 -1211 522 1357 -36 -1223 -256 1029 648 -526 -626
2086 -626 41 727 510 -490 -901 187 1032 102 -1200 -574 971 697 -758 -948 269 839 -42 -703
2104 -703 -428 370 620 66 -758 -388 683 756 -468 -927 236 1061 128 -844 -348 623 560 -295 -540 -135
2124 -135 527 406 -316 -711 7 725 235 -819 -552 550 679 -320 -713 48 590 287 -336 -463 124
2143 124 607 296 -497 -468 471 731 -128 -789 -41 729 264 -555 -451 250 482 22 -473 -351 296 568
2163 568 -76 -726 -170 643 385 -593 -543 415 621 -90 -540 -150 454 356 -112 -454 -59 549 423 -414 -568
$$ packed form
2033H76o43j450M00K021j02k217l00K158P31j848r91J280J073n09r49j25M41R13
2051G59p7j210o13J411J210j337j689J081J875o23j941J41J582L79j066o94L63
2068d49Q35L84p56j071N06J516n6j705m15J733Q35j393j187R67J285l81j174j00
2086f26O67O86k17j000m11J088Q45r30j302O26J545k74j455j90J217N70q81o61
2104g03K75P98K50n54q24L70J071P3j224m59J163Q25r33r72M96R71o3q55k45M05
2124a35O62j21p22l95P18P18m90j054K67J102J29r99l93P61N42l03o23j27N87
2143A24M83l11p93K9R39K60q59o61P48P70m65q19J04P01K32m60m95J22O47K72
2163E68o44o50N56Q13k58r78N0R58K06p11m50L90O04r8m68l42L95O08j26q37j54
$$ plain form
2184 -568 302 728 -68 -778 -120 566 242 -474 -464 150 422 80 -350 -374 196 555 65 -613 -253 614 483
2205 483 -461 -526 370 655 -39 -447 -70 388 352 -118 -366 -106 313 368 -332 -619 173 577 -80 -706 -201
2226 -201 585 210 -476 -318 211 337 12 -213 -161 127 361 118 -425 -212 507 412 -342 -479 319 545 -121
2247 -121 -486 26 306 85 -158 -222 -63 146 192 -147 -437 61 463 38 -552 -127 470 179 -372 -191 307
2268 307 258 -65 -109 13 76 192 159 -150 -210 243 297 -234 -397 178 417 -148 -312 60 203 -70 -182 -22
2290 -22 -10 -28 106 101 -237 -30 340 160 -281 -111 343 245 -207 -176 279 245 -129 -48 91 -35 19 85 -98 -270
2314 -270 6 301 -127 -417 33 271 -36 -315 -2 222 18 -121 88 45 -19 155 211 -93 -124 258 231 -223
2336 -223 -225 284 275 -203 -242 182 206 -151 -188 6 -35 -26 71 -34 -222 6 295 -12 -309 -84 381 72 -368 -12
$$ packed form
2184e68Q70M26p96p10O58O86l24p16J0O14K72l42m30k4N70L59m90o78L60Q67j31
2205D83r44o5Q96K85o94m08L77M58l6m70k48K60M19N5p00k87P92M04o57o26N05
2226b01P86l75o86J58N29J26l25k25N2K88K34k43n43K13P19r5p54j37P98K26o66
2247a21l65N12K80k21k43o4J59K09M6l39k90M98M02m25n90M25N97k91n51J81M98
2268C07m9l23m4J22O3J16l3l09o0M53N4n31j63N75K39n65j64L72J43k73j12J60
2290b2J2j8J34nl38K07L70j80m41J70M54r8m52L1M55l4l74Q1J39j26N4O6j83j72
2314b70K76K95m28k90M50K38l07k79L13K24k04j39K09m3o4J74N6l04l1L82k7m54
2336b23kN09rm78l9M24K4l57l7J94m1RR7j05j88K28K89l07k97K25M65l09m40L56
$$ plain form
2360 -12 263 141 -170 -38 146 94 -27 70 -70 -70 193 155 -135 -245 271 306 -311 -392 126 267 -153 -301 78
2383 78 111 -3 -58 -58 -78 73 238 -12 -281 17 438 100 -396 -87 402 154 -310 -143 182 133 -165 -132 -56
2406 -56 -26 97 40 -214 -229 231 280 -264 -369 178 436 -154 -369 89 289 11 -193 0 62 82 124 2 -190
2429 -190 14 351 55 -369 -62 453 123 -344 -244 353 169 -210 -238 96 51 -18 1 -150 -145 149 273 -164
2451 -164 -276 179 356 -89 -375 74 415 91 -237 -7 219 108 -42 29 -116 -23 181 29 -293 -173 267
2472 267 174 -315 -273 266 237 -271 -208 117 103 -58 -136 44 -71 51 206 -50 -229 87 352 23 -351 -32
2494 -32 401 55 -256 -86 193 59 -111 -102 -91 -89 113 128 -158 -235 129 268 -221 -280 107 283 -41 -282 98
2517 98 210 31 -68 45 -15 8 148 25 -252 -115 321 182 -346 -213 218 198 -232 -288 135 135 -66 -88 -33
$$ packed form
2360a2K75j22l11J32J84n2j21R7j40%K63l8k90j10N16L5o17q1N18J41m20j48L79
2383G8L3j14n5%k0J51J65k50k69K98M21l38m96L09M89k48m64J67L25m9k98L3P6
2406e6L0J23n7k54j5M60M9n44j05N47K58n90k15M58K00k78k04J93O2K0M2j22j92
2429a90K04L37k96m24L07N15l30m67J00N97j84l79k8L34m5o9J9j51NK94J24m37
2451a64j12M55J77m45k86M49L41l24l28K30K26j11j50P1j45R3K04j52l22J20M40
2472B67r3m89M2N39k9n08O3L25j4j61p8J80j15J22J55k56j79L16K65l29l74L19
2494c2M33l46l11J70K79j34j70RJ1KK02J5k86p7L64J39m89n9L87J76l24k41L80
2517I8J12j79r9J13o0K3J40j23k77J37M36j39n28J33M31k0m30n6M23%k01k2N5
$$ plain form
2540 -33 -6 71 165 -81 -261 80 365 -34 -321 7 422 62 -297 -22 308 126 -62 -67 40 69 87 29 -171
2563 -171 -151 218 230 -282 -392 169 326 -165 -326 24 210 17 -191 -85 87 117 70 -91 -111 77 269 96
2585 96 -360 -124 378 240 -306 -241 214 235 -149 -205 -2 118 10 -47 -143 -141 149 201 -151 -298 89 358 -11
2608 -11 -305 41 367 125 -220 -172 134 210 33 -83 -106 115 177 39 -201 -151 217 246 -228 -332 96 270
2630 270 -111 -273 -89 173 109 -175 -171 -52 133 151 -63 -160 16 282 116 -264 -129 257 211 -139 -247 142
2652 142 287 16 -225 -49 34 127 -49 -193 -146 93 209 -123 -311 -8 314 48 -269 -147 203 204 -134 -94
2674 -94 96 202 129 27 -88 -12 222 119 -123 -230 122 225 -130 -284 -12 259 32 -278 -123 118 79
2695 79 -94 -183 -121 42 182 58 -156 -115 262 211 -244 -258 184 278 -31 -242 -12 216 132 -89 -128 56 85
$$ packed form
2540c3K7P7R4k46j80L41K85l99k87L28M15l60l59K75L30j82j88nJ07K9J8n8k00
2563a71K0L69J2n12j10N61J57m91j61L50J86j93k08J06J72L0m7j61k0J88J92j73
2585I6m56K36N02j38n46O5M55K1l84n6K03J20j08n7r6KK90N2l52j47L87K69l69
2608a1k94L46L26k42l45M8L06P6j77j16k3K21O2j38k40N0L68K9m74j04M28J74
2630B70l81j62J84K62o4k84MJ19J85J8k14r7J76K66j66l80J35L86m6l50j08L89
2652A42J45k71k41J76Q3R3j76j44M7K39J16l32j88L03L22k66l17J22L50Jl38M0
2674i4J90J06p3j02j15P6K34j03k42j07L52J03l55j54K72K71k27l10J55K41l9
2695G9j73q9O2J63J40j24k14M1L77n1m55j4M42R4l09k11K30K28q4k21l9J84K9
$$ plain form
2718 85 85 -89 -191 -43 217 12 -317 -161 208 169 -206 -218 111 153 -13 -174 20 96 82 3 -71 -100 135 255
2742 255 -44 -268 24 271 -28 -232 -75 244 20 -185 -177 42 81 -2 -64 -94 -96 58 99 -142 -187 176 290
2765 290 -64 -227 65 288 46 -142 -33 149 52 10 -19 -38 10 122 87 -191 -121 161 125 -167 -229 148 187
2788 187 -128 -236 11 118 -8 -2 -53 -78 30 138 51 -155 22 278 146 -232 -28 274 141 -188 -90 97
2810 97 109 -65 -27 -73 -105 58 89 -90 -269 51 170 -60 -272 35 247 -23 -214 22 140 76 -78 -4 92
2833 92 28 124 134 -55 -135 201 191 -158 -185 115 206 -102 -174 27 121 -25 -122 -6 -44 -42 88 -12 -208 -62 257
2858 257 52 -255 -89 210 166 -212 -92 179 177 -46 -28 37 -14 18 120 -86 -132 55 189 -95 -329 3 219
2881 219 -61 -293 -29 204 -15 -86 19 15 -15 62 79 -51 -83 194 175 -128 -169 142 183 -170 -131 137 121 -103
$$ packed form
2718H5%j74j02J48K60k05l29J56L69l9l75j2L29M2j66j61J94P6j4p9p4k9K35J20
2742B55k99k24K92K47k99k04J57L19k24k05QK19L9q3o2l0kJ54M1k41m5L63J14
2765B90l54j63K92K23k42j88J09J82r7m2k9j9M8J12l5k78P0K82l6k92o2L77L9
2788A87l15j08K47J07j26On1k5J08J08q7k06J77K56j32l78K04L02j33l29R8J87
2810I7J2j74L8m6l2J63L1j79j79L20J19k30k12L07K12k70j91K36J18o4j54P4R6
2833I2o4R6J0j89q0L36j0l49k7L00R1l08p2K01R4j46r7J16l8KJ30j00j96J46L19
2858B57k05l07J66K99m4l78J20K71kk23J8O5n1L2J02k06m6J87J34k84k34L32K16
2881B19k80k32K64K33k19p1J05ml0P7J7j30l2K77j9l03m1L11M1l53L9K68j6k24
$$ plain form
2905 -103 -56 68 -19 -87 -5 -1 -158 -107 99 20 -226 -61 140 67 -133 10 170 24 -98 26 103 -41 1 155
2929 155 39 -103 13 184 24 -164 25 153 -17 -156 -21 129 -52 -104 19 -44 -56 10 90 -115 -111 106
2951 106 141 -131 -156 74 149 4 -79 58 41 -22 50 108 -63 -42 137 138 -165 -116 108 107 -150 -118 119 66 -152
2976 -152 -131 95 -32 -23 16 22 -111 38 177 38 -230 14 289 70 -139 -49 167 5 -141 15 89 -19 -21
2999 -21 63 -55 -96 139 56 -187 -177 174 204 -118 -257 79 143 -41 -129 50 80 -1 99 29 -128 -32 168 63
3023 63 -167 -54 238 121 -219 -86 191 128 -140 -70 -11 -30 -39 8 -70 -118 59 138 21 -177 14 177 -10 -145
3047 -145 50 158 30 -112 8 48 85 72 34 -91 -69 149 132 -124 -133 128 154 -111 -194 61 114 -15 -90 -32
3071 -32 52 13 35 12 -138 1 200 91 -220 -67 222 157 -135 -63 160 108 -39 -35 37 84 62 84 -80 -194 107
$$ packed form
2905a03M7J24q7o8Q2Mj57N1K06p9k46J65K01p3k00J43J60j46j22J24P7j44M2J54
2929A55j16j42J16J71j60j88J89J28j70j39J35J50j81n2J23o3j2O6Q0k05MK17
2951A06L5k72k5K30P5j45q3J37j7o3P2N8j71K1J79Jl03M9K24jk57L2K37n3k18
2976a52K1K26j27RL9Oj33J49J39j39k68K44K75k19k09R0K16j62j46J56P4j08k
2999b1Q4j18m1K35q3k43J0L51L0l22j39L36O4j84q8J79L0q1J00p0j57R6K00j05
3023F3k30J13K92j17l40J33K77o3k68P0N9j9rM7p8m8J77P9j17j98J91J63j87j35
3047a45J95J08j28j42J20M0L7j3l8j25K2K18j7k56rK61K6k65q3K55N3j29p5N8
3071c2Q4l9K2k3j50J39J99j09l11J53K89o5k92P2K23n2j47MP2M7k2K2j64j14L01
$$ plain form
3096 107 165 -136 -253 73 188 -50 -241 -37 145 23 -110 -52 -20 46 110 44 -133 -43 154 89 -150 -148 188
3119 188 171 -160 -148 95 167 -80 -137 -52 -3 58 74 -106 -145 31 198 5 -186 3 268 30 -227 -48 210
3142 210 138 -109 -10 20 75 71 51 -93 -71 137 174 -99 -202 154 277 -124 -298 -11 208 -50 -137 -64 4 83
3166 83 68 -46 -108 21 238 66 -266 -115 245 193 -168 -88 203 184 -52 -107 -9 97 82 33 -130 -129 109 154
3190 154 -56 -283 38 224 -23 -330 -59 159 96 -134 -130 17 124 18 -9 -90 -3 207 97 -165 -126 146
3212 146 218 -90 -230 99 208 -37 -142 -32 33 -1 -40 -39 -80 41 182 -4 -261 -14 277 29 -250 -181 189
3235 189 189 -117 -128 46 113 59 24 -81 -11 142 113 -157 -216 96 189 -102 -261 24 187 -9 -150 -63 119 76
3259 76 -38 -92 -47 23 182 40 -151 -19 189 183 -130 -145 186 213 -22 -178 19 166 54 -17 -141 -26 43
$$ packed form
3096A07N8l01j17L26J15k38j91K04J82j22j33N8L2O6O4o6j77R0J97o5k39KL36
3119A88j7l31J2K43P2k47n7Q5M9O1J6j80l9J76J67j93j91J89K65k38k57J79K58
3142B10p2k47R9L0N5mk0j44K2K08L7k73j03L56J23m01j74K87K19k58q7P3O8P9
3166H3j5j14o2J29K17j72l32J51L60n2l61Q0K91j9k36n5R8J06j5m9j63JK38M5
3190A54k10k27L21J86k47l07K71K18o3k30MJ47J07j06k7q1Q7K10j10k62L9K72
3212A46P2l08j40L29J09k45j05J10O5l4l9Jm1J21J41j86k57K47K91k48k79O9L70
3235A89%l06j1J74O7n4l5j05P0J53k9k70n9L12R3k91j59K85J63j96j41Q7J82m3
3259G6j14n4M5P0J59j42j91J32K08ol13j5L31K7k35j56J97J47j12p1j24J15O9
$$ plain form
3282 43 107 -81 -173 21 221 -6 -269 -21 229 122 -177 -134 27 142 15 -74 -81 -1 127 149 -165 -77 107
3305 107 221 -93 -231 81 282 17 -205 -8 181 44 -89 -163 -91 100 96 -45 -249 -42 192 93 -215 -108
3327 -108 181 163 -99 -140 110 186 68 -117 -116 17 121 72 -85 -102 155 212 -75 -212 -14 276 60 -214 -102
3350 -102 104 116 -5 -105 -10 101 58 -111 -130 -26 193 175 -178 -131 154 208 -36 -157 -6 185 48 -131
3372 -131 -82 -2 66 82 -128 -182 77 174 -9 -218 -94 231 40 -96 -149 128 190 -45 -153 -46 73 101 45
3395 45 -125 -5 165 200 -139 -167 26 217 10 -189 -51 139 30 -137 -121 4 41 17 -103 -170 27 172
3417 172 5 -208 -108 167 121 -101 -135 8 189 41 -102 -90 102 165 -16 -94 -83 136 98 -78 -227 -13
3439 -13 219 5 -196 -95 139 103 -106 -121 28 102 64 -52 -119 89 140 45 -173 -101 165 210 -48 -198 72
$$ packed form
3282D3O4j88r2J94K00k27k63K48K50j07k99M3J61J15j27q9pQ0J28K2l14Q8J84
3305A07J14l14j38L12K01k65k22J97J89j37j33p4P2J91mj41k04K07K34r9l08J07
3327a08K89j8k62m1K50P6j18j85JJ33J04m9j57j7K57N7k87j37J98K90k16k74J12
3350a02K06J2j21j00R5J11m3j69j9J04K19j8l53M7K85N4k44j21J51J91j37j79
3372a31M9Q0O8J6k10n4K59R7j83k09J24L25j91j36n3K77O2k35j08J07J19K8n6
3395D5j70J20J70L5l39k8J93J91k07j99J38J90j09j67J6J25L7k4j20o7J97J45
3417A72j67k13J00K75m6k22l4J43J81j48j43J2J92O3j81p8J1K19l8j76j49K14
3439a3K32k14k01J01K34l6k09j5J49P4l8j16o7K08N1r5k18P2K66M5k58j50K70
$$ plain form
3462 72 183 21 -139 -43 57 142 45 -152 -98 57 172 -78 -186 28 190 41 -178 -104 136 139 -28 -121 7
3485 7 161 90 -46 -106 12 187 139 -198 -130 100 185 -15 -227 44 152 64 -146 -201 29 123 -34 -150 -95 65
3509 65 136 -64 -253 -39 154 73 -166 -111 144 156 27 -110 -56 146 132 -42 -139 22 145 115 -109 -258 68
3532 68 143 -19 -202 -54 105 56 -115 -89 -13 149 32 -100 -69 73 217 37 -131 -46 173 180 -79 -149 32
3555 32 168 77 -147 -66 115 57 -65 -149 -58 79 72 -94 -219 -14 183 -3 -172 -91 98 110 -101 -148 -4 127
3579 127 32 -116 -106 37 148 71 -162 -85 137 119 -69 -193 -4 157 45 -143 -112 131 115 2 -138 -115 63
3602 63 92 -22 -152 -20 151 80 -101 -111 113 128 -52 -141 -10 168 118 -61 -84 7 102 34 -130 -113 44 108
3626 108 -50 -139 -72 131 46 -160 -106 5 128 2 -119 -25 71 102 5 -152 2 181 119 -89 -84 82 162 -40
$$ packed form
3462G2J11j62j60R6J00Q5r7j97N4J55J15k50j08K14J62j49k19P4K40Lj67r3J28
3485GJ54p1j36o0J18J75m8l37O8K30Q5k00k12K71J08q8k10n5K30R4j57j16N5J60
3509F5P1k00j89K14J93q1k39N5K55J2j29j37N4K02j4j74r7J61J23l0k24j49L26
3532F8P5j62j83J48J59m9j71K6P6J62j17j32L1J42J44j80j68Q5K19Pk59p0J81
3555C2J36r1k24Q1J81n8j22q4R1J37pj66j25K05J97j86j69Q1J89J2k11m7J44J31
3579A27r5j48J0J43J11p7k33P7K22j8j88j24J89J61j12j88L1K43j6j13j40K3J78
3602F3K9j14j30J32J71p1j81j0K24J5j80q9J31J78n0j79k3R1R5o8j64J7J57O4
3626A08j58q9O7K03q5k06N4J11J23j26j21R4R6L1r7j57J54J79o2k08NJ66Q0k02
$$ plain form
3650 -40 -114 -42 143 113 -80 -89 -43 109 23 -117 -86 26 99 -59 -127 -96 111 74 -65 -135 -4 166 47 -58 -63
3675 -63 75 112 23 -73 26 138 72 -78 -91 30 104 -1 -133 -68 100 79 -20 -65 -36 56 47 -29 -102 3 93 22 -116
3702 -116 -70 94 118 -14 -71 41 138 66 -53 -63 49 105 62 -101 -10 69 116 -28 -116 29 85 7 -101 -63 64
3727 64 72 -48 -94 -49 122 50 -13 -56 8 79 34 -49 -42 157 114 -17 -66 -12 88 61 -115 -72 33 52 11 -105 -74
3754 -74 98 65 -46 -128 -51 89 26 -101 -40 55 72 28 -111 14 85 99 -13 -44 25 133 58 -34 -82 38 60 -47
3780 -47 -57 -35 59 57 -68 -77 -18 113 -69 -128 -101 28 93 -20 -88 -27 101 39 -40 -27 40 112 -34 -93 22 118 17
3807 17 -33 -63 3 83 55 -77 -100 107 56 -65 -54 -18 52 17 -57 -82 -9 97 34 -51 15 133 68 -10 -73 -4 78 66
3835 66 -17 -54 47 98 56 -80 -10 72 45 -70 -78 -29 105 24 -83 -81 27 56 2 -68 -9 40 96 2 -80 77 90 89
$$ packed form
3650d0p4P2J85l0j93rM6J52q6j40L1J12P3j58o8L1K07l7j39p0J31J70j19j05n
3675f3J38L7q9r6R9J12o6j50j3J21P4j05j32O5J68k1r9m5K9R2rp6p3J05R0p1j38
3702a16M6J64K4j32n7J12R7p2j19j0J12N6m3j63R1P9M7j44q8J45N6p8j08L8J27
3727F4Qj20m6M5J71p2o3m3O4P1m5q3PJ99m3j31m9N4J00k7j76M3J05J9m1j16L1
3754g4J72l3j11q2P7J40o3j27O1R5J7m4j39J25P1J4j12l1O9J08p5r2m8J20K2j07
3780d7j0K2R4kj25rN9J31j82n9K7J29O5j13o8O1J28o2p9J3O7P2j46n9J15R6j01
3807A7n0l0O6Q0k8j32k3K07n1j21J1L6P0l5p4k5P3J06o3q5O6J18o5p8o3O9Q2j2
3835F6q3l7J01N1m2j36P0Q2k7j15qM9J34q1j07KJ08K9n4p0N9M9N6r4q2J57J3j
$$ plain form
3863 89 -37 -28 86 119 30 -23 7 68 33 -44 -46 71 -14 -54 -104 -17 60 29 5 -71 -77 54 55 -32 -40 66 114 60 -58 -21
3893 -21 20 36 -31 -20 9 95 76 -9 -58 -1 67 -33 -56 -11 18 68 -25 -64 -10 8 23 -72 -56 60 27 -25 -87 29 68
3922 68 79 7 11 -14 90 -5 -55 -33 35 110 11 -41 -19 67 26 -28 -64 -2 55 59 -12 12 54 -4 -37 -44 -16 102 -9 -7 -85
3953 -85 25 75 -27 28 -11 62 129 18 -76 11 68 1 -34 -34 61 103 -30 -82 1 68 48 -115 -69 7 21 -5 -100 5
3981 5 43 46 21 2 48 116 60 -42 -29 70 34 54 -36 13 13 49 -47 -68 55 47 -27 -19 -35 36 90 -35 -72 -45 63 78 -45
4012 -45 -107 29 114 14 -58 -64 91 83 14 -23 41 48 14 -18 23 65 65 -18 -38 -38 65 32 -66 -9 20 44 -13 -39 -46 58 11
4043 11 15 -24 -2 48 64 -31 -41 35 37 2 -50 4 87 115 36 -80 -30 62 24 13 -45 18 73 39 -53 -71 63 59 -35 -54 13
4074 13 17 48 -29 -4 -27 54 1 -23 1 33 49 15 -11 10 104 51 -10 -15 56 -20 -12 -60 44 45 3 -17 -76 -18 2 66 -75
$$ packed form
3863H9j26RJ14L3q9n3L0O1l5p7kJ17q5m0n0Q7P7l1k4p6oJ31Jq7qJ06M8n4j18L7
3893b1M1J6o7J1K9Q6j9q5m9N7O8j00k3M5K9N0r3l9N4J8J5r5J6J16l3n2o2J16L9
3922F8J1p2Mk5J04r5n0K2O8P5r9n2K2Q6m1n4l6O2N7Mp1K4M2n8l3pK8J18j11Kp8
3953h5J10N0j02N5l9P3O7j11r4Q7N7o7l5%R5M2j33n2Q3O7k0j63M6P6J4k6r5J05
3981EL8Lk5j9M6O8n6j02J3R9l6K0r0M9%L6r6k1J23qp4Qj6P1N4j25l7K7J08J5j23
4012d5o2J36Q5j00p2oJ55qo9l7O4Pl4l2M1M2%q3k0%J03l3r8N7K9K4n7k6pJ04m7
4043A1Ml9K2N0J6r5j0P6Kl5n2N4Q3K8p9j16N0R2l8j1n8O3N5l4r2j8J34mr4j9O7
4074A3ML1p7K5k3Q1n3k4K4L2J6l4k6K1R4n3o1nP1p6Qm8J04Jm2k0n9N8K0O4j41
$$ plain form
4105 -75 -57 36 77 -35 -22 -24 64 61 -47 18 60 79 25 -2 16 27 10 4 -51 -3 45 11 -24 -83 -13 83 -35 -87 -43 51
4135 51 66 -45 30 53 36 89 15 -30 47 45 -5 -25 -10 40 12 -26 -48 21 64 -11 -43 -3 85 32 -23 -37 37 55 13 -42
4165 -42 -43 66 97 -22 -46 -59 95 57 12 -74 65 23 8 -52 -26 109 28 29 -76 -38 48 54 -57 -113 18 46 -27 -56
4193 -56 -59 72 21 -56 -70 -2 -7 98 -76 -21 16 90 -5 -10 6 111 66 17 -102 11 109 -10 -2 -31 35 54 -8 -77 -59
4222 -59 3 0 -51 -55 16 34 -36 -51 -78 47 0 23 -41 -32 71 71 -23 -47 83 53 14 -78 -68 84 34 15 -42 28 38 20
4252 20 -58 -33 18 16 -9 -99 -25 17 83 -10 -62 -2 47 -24 19 -79 30 74 -13 -53 -15 67 72 3 -53 -7 60 10 18 -46 29
4283 29 57 12 8 -57 52 60 -65 -34 -43 77 -3 -74 -30 13 56 -5 -20 31 131 60 -64 -67 16 68 -12 -70 -70 64 58 12
4313 12 -86 -57 81 51 -92 -71 38 41 19 -27 22 52 52 -10 -44 35 87 35 -22 6 30 49 -21 -21 20 38 28 31 -81 -27
$$ packed form
4105g5J8R3M1j12J3kQ8lj08O5M2J9n4k7J8J1j7on5M8M8l4l5n9P0R6j18n2M4R4
4135E1J5j11P5K3j7N3p4m5P7kn0k0J5N0k8l8k2O9M3p5l2M0Q8n3n5j4P4J8m2n5
4165d2jJ09L1j19k4j3J54l8m5q6J39m2j5o0K6J35q1Jj05L8Q6Oj11n6J31K8p3k9
4193e6lJ31n1p7j4O8nJ05j74N5L7P4r5nJ6J05m5m9j19J13R8j19Qk9O6J9o2o9J8
4222e9O2ln1mP1J8p0j5k7J25m7K3o4RJ03%r4k4J30l0l9r2J0J52n0j9n7P0J0j8
4252B0p8K5N1kk5r0P4M2O6r3n2O0M9p1M3r8J09M4q7m0L8Q2No9n6M6O7n0Qo4P5
4283B9K8m5mo5J09Qj25L1rJ20q0p1M4M3M3o1j5N1J00p1j24lQ3N2q0n8%J34om6
4313A2r8K9J38l0j43K1J09Lk2m6M9L0%o2l4P9N2n2n7K8K4J9p0%M1J8j0Lj12N4
$$ plain form
4343 -27 4 -20 -57 -48 -3 60 -24 -62 -25 22 64 -22 -8 -18 28 16 -20 28 20 98 36 -90 17 65 68 -78 -5 -35 51 -32
4373 -32 -74 -32 0 15 -95 -28 -13 21 9 -119 26 1 8 -14 3 -71 24 -31 -20 -47 -30 37 41 19 -9 8 49 -15 -22 -1
4403 -1 27 14 -60 -80 -3 25 39 1 -27 -21 63 -3 -18 6 49 35 29 -6 69 -31 24 -27 -40 31 11 -11 -75 18 -28 34 -53
4434 -53 -44 -10 21 -10 20 -92 -40 50 1 -63 10 25 -2 -36 -16 71 65 16 14 8 33 22 37 -30 -62 -12 57 43 -14 -37 38 22
4466 22 -69 6 10 -1 -73 -29 -61 0 -4 -18 -7 24 18 19 1 -2 62 36 -21 5 29 55 45 -25 13 -9 6 -3 -71 41 59 62 6
4499 6 -27 41 35 61 -34 -6 43 -35 -39 0 12 56 -10 27 10 -20 57 60 -44 13 44 20 -28 -55 45 -39 22 -52 2 44 14
4530 14 21 -4 -4 -44 33 -47 -2 36 -24 5 -50 17 -19 -16 33 33 60 55 45 17 19 7 -25 -39 -31 19 -5 22 -4 -28 -49 -46 5 37
4564 37 -16 -35 -12 -26 -5 -54 5 37 15 13 2 53 -12 31 -26 77 -4 -26 21 7 35 -19 58 29 32 4 6 40 26 -11 -37
$$ packed form
4343b7L1k4l7RM5O3q4l8L7M7M2q6J4j0M6j2l6M8qP8o2j26J07M8Lj46P3l0Q6q3
4373c2m2M2L2J5j10O7J5L4j2j28J45k5Pk2J7p4R5n5J1k7J7O7Mk2k8J7M1o4pK1
4403aK8j3p4k0P7K8J4l8k8OQ4o6j5K4M3j4ol5P5j00N5n1j3P1k0k2o4R3m6O2q7
4434e3RL4L1l1L0j12N2R0m9o4P3J5k7l4K0Q7om9koK5j1J5o7l2N0O9j4n7k3P5j6
4466B2r1P5Mj1p2M4l2O1mj4J1L1oJj8lO4k6n7K6K4K6j0p0L8k2J5ro8J12J8Ln6
4499Fl3O8oK6r5K8M9p8mL9J2M4o6L7j7l0P7Lj04N7L1k4m8k7J00q4O1p4N4M2l0
4530A4Pk5%m0P7q0M5L8o0K9n5O7l6LM9%K7nj0k8Kj2l2j4QN0k4K7k6k4k1LN1L2
4564C7n3j9K3j4K1m9N9L2k2kj1N1o5M3n7J03q1k2M7j4K8n4P7k9Lk8KL4j4l7k6
$$ plain form
4595 -37 19 31 -64 25 -20 -27 -28 22 -40 -33 15 27 -15 3 -19 17 19 13 29 46 11 32 32 34 -32 20 -8 -19 47 -25 21 15 -2 3 -34
4630 -34 23 -61 -52 -43 -13 -17 -55 -56 22 -45 10 -24 -32 -11 41 45 21 -30 6 -5 23 -48 11 -64 47 20 67 -44 31 26 11 -20 21
4663 21 -27 -46 -27 -44 24 -38 50 24 -23 7 16 -61 14 -11 -1 -24 -24 58 14 -3 -21 -1 2 -9 -65 -12 -17 3 -80 -30 19 -47
4695 -47 -21 -54 -65 -1 -9 38 6 -27 -43 8 26 14 2 0 19 -19 29 26 72 5 -9 6 61 -9 -10 -3 21 -19 -30 -32 -12 -13 -41 -48
4729 -48 15 11 -2 40 18 6 9 -7 -5 -6 3 39 -8 -48 3 41 -7 11 50 35 53 -31 -20 -13 -6 20 -11 -53 -38 -16 -23 24 -34 -42 17
4764 17 3 -14 -38 30 -28 -21 -7 1 27 32 -7 -56 -7 34 0 -5 4 -35 12 -37 -28 -4 4 -22 5 -35 -47 3 -9 64 8 -15 -36 23
4798 23 -6 -13 36 9 -84 16 1 -2 -4 23 -55 25 15 31 -22 -49 -10 -28 -2 -23 -15 -36 6 -11 44 -20 53 50 -5 -25 59 37
4830 37 0 -29 13 65 -11 2 40 25 46 17 23 -6 -20 -14 2 -31 3 -50 19 -8 -25 -76 34 -10 11 4 24 -10 -24 -9 -9 34
$$ packed form
4595c7N6J2r5Q9m5pjN0o2PM8J2m2J8k2L6KoJ6J7l5K1%Ko6N2k8j1O6p2M6oj7Nl7
4630c4N7q4RRL0ml8jP8o7N5l4qK1N2Mk4n1L6j1K8p1N9p5J11k7M7j11P5nj5l1M1
4663B1m8j9J9j7O8o2Q8k6m7L0Rp7P5k5J0k3%Q2m4j7j8K0Lj1n6N3nK0q3N0M9o6
4695d7K6l3j1O4qM7l2l3j6N1J8j2j2kJ9l8M8lM6o7j4J5N5p0jPK4m0j1kK0jk8p
4729d8O3mj3M2k2j2Lj6KjRL6m7m0N1L8m8J8L9j5J8q4J1PPK6l1m2J5K2pM7n8qN9
4764A7j4j7k4O8n8PJ4QK6Nl9m9M9M1l4nRl9M7m9RK4Qk6K7m0j2N0j2P3n6k3k1N9
4798B3k9pM9k7r3J00j5lkK7p8Q0j0J6n3k7L9j8K6k1Qk1M2j7N5o4P3ln5k0Q4k2
4830C7l7k9M2N2p6J3L8j5K1k9Ok9j4OJ6l3L4n3O9k7j7n1J10m4K1pK0l4j4J5%M3
$$ plain form
4862 34 -16 16 -70 42 30 -18 -49 -5 54 16 -13 -47 12 -20 -38 -53 4 55 30 -29 -18 8 11 37 -11 -68 37 50 19 -26
4892 -26 9 -17 48 17 -15 40 56 -19 40 2 5 84 -59 13 4 17 14 -16 -30 -32 71 42 -18 53 25 2 17 -21 31 63 15
4923 15 -16 -15 20 1 10 1 10 -41 4 -17 20 -47 21 -6 6 36 -28 5 -30 49 -6 16 31 -22 17 70 68 -26 -19 28 -37 56 -1
4956 -1 -37 -16 -30 70 27 5 9 6 29 32 27 34 56 -42 -28 -12 28 21 10 29 -8 17 6 18 -29 -6 65 -15 5 22 -33 61 18
4989 18 -15 -4 -4 35 33 -17 14 57 19 38 -44 1 31 -36 -63 -31 15 1 -85 44 45 -15 12 20 -21 45 21 -27 -3 -8 76 -10
5021 -10 4 27 24 8 -17 -32 16 26 7 -23 -55 -7 46 -8 -49 -22 -32 31 6 -23 -1 -10 52 -43 -19 35 47 -4 -12 -14 24 46
5053 46 -18 18 29 62 19 -76 10 -30 6 -20 -1 31 -15 43 -30 -40 -43 -17 -2 21 -51 -37 -5 -31 -23 69 0 24 32 -41 7 39
5085 39 -3 -18 -42 22 23 24 -4 9 -36 -23 -53 6 26 25 -38 22 7 5 -32 -2 -80 2 -12 46 -30 -23 6 39 -17 -18 22 45 -19
$$ packed form
4862C4n0L2q6J12j2m8l1M4N9l8k9l4N9l2j8j5N7N1k5n9J1K6LK6m8n7J05J3l1m5
4892b6L5k6O5l1l2N5J6p5N9l8LP9j43P2rJ3ll0j4kJ03k9o0P1k8k3J5l8N2L2m8
4923A5l1JL5j9RrRn1M5k1L7o7O8k7J2L0o4L3l5P9n5K2J5n3L9N3kr4PM7o5R3n7
4956al6K1j4J00m3k2MlK3LnPK2r8J4J6M0pj1J9l7K5j1J2m7K3P1q0K0J7n5R4m3
4989A8l3J1%L9kn0L1M3l8J9q2M5L0o7k7L2M6j4q6J29Jo0K7Qm1O6k4m8K4nQ4q6
5021a0J4K3lj6k5j5M8J0j9l0l2M8N3n4m1K7j0O3k5k9K2rO2r5K4N4J2n1qkL8K2
5053D6o4L6J1L3m3r5Q6m0L6k6J9L2m6N8p3j0lK6J5K3p2J4L2k6QR2o9K4Qp3M8L2
5085C9m2j5k4O4JJk8J3m5J3l0N9K0jo3O0j5kl7L0p8Q2j4N8p6PK9L3n6jM0K3o4
$$ plain form
5118 -19 -30 0 -16 63 9 -28 -1 -13 49 -47 -61 4 27 16 -21 -9 12 43 -27 -61 -52 11 -5 3 -23 24 12 -4 -4 -67 1 59
5150 59 9 -40 21 22 -1 -7 -11 38 6 48 15 -14 -27 -7 54 -50 -2 51 15 -18 -81 -21 45 -8 -36 -37 63 19 -9 4 -35
5181 -35 54 30 -42 -65 15 -1 5 2 -51 -7 43 -17 -9 1 16 -34 -33 16 50 14 57 -11 -2 1 -17 3 -15 4 64 25 -8 -22 51
5214 51 32 9 -14 -28 -2 30 -26 9 -13 5 39 -14 -8 -4 25 0 -13 4 2 40 -1 19 10 2 -25 -21 -46 38 31 -9 10 20 62 14
5248 14 0 7 11 14 4 -5 -13 -42 -15 -1 -58 6 10 -21 -28 -97 37 -6 0 -20 -15 16 21 15 24 -2 60 11 -78 19 11 -12 -43 -53 -58 17 33
5285 33 -28 -43 -1 -17 -29 4 42 3 27 56 -9 -3 14 62 11 7 -13 9 20 -3 21 27 33 -37 -48 55 -18 7 -11 -11 -9 39 3
5318 3 -43 -28 -5 -4 14 -26 13 17 -43 -22 -14 21 43 -13 25 64 8 28 3 21 -80 18 -24 -18 -45 -10 16 -8 -58 21 -58 -27
5350 -27 -10 -38 24 8 5 -43 -29 43 27 -4 -45 -14 50 31 -46 -27 42 -37 52 13 -2 21 59 -47 18 8 -14 19 -47 7
$$ packed form
5118a9j1L0j6P9n4l7K7j2O2r6j4O5K3j1l7J2K1L1p0l4RO3j6Qk6M7j2j6%o3O8N8
5150E9n0m9O1Jk3omM9l2M2l3k9j3K0O1j04M8N3l6l3o3O0O6n3k8jJ00m4k8J3l9
5181c5Q9k4p2k3Q0j6Oln3M4N0o0QJ0J5n0JM9L4l6M3o8RLj8K0j8J9O0l9l3j4P3
5214E1j9k3k3j4K6L2n6L5k2J8L4n3OMK9k5j3J7kL8m1K0rqk7Mk5Q4pm0J9J0M2m8
5248A4j4PMLj0rqk9K7J4n7O4Ml1po9J34m3Ok0NL1NoRk6O2m9q9R7qk3l1j0nP5J6
5285C3o1j5M2j6j2L3L8l9K4K9o5OJ7M8n1mk0K2J1k3K4OOp0j1J03p3K5j8%KM8l6
5318Cm6J5K3JJ8m0L9Mo0K1QL5K2n6L8L9n6K0k5J8j01R8m2Ok7L5K6k4n0P9p9L1
5350b7J7k8O2j6lm8J4P2j6l1m1L1O4j9p7J9O9p9Q9l9j5K3L8j06O5j0k2L3o6N4
$$ plain form
5380 7 32 52 2 -36 -41 15 54 -16 -60 -36 18 -53 -50 -4 8 -27 -14 2 -36 26 13 -44 -14 24 12 -19 -5 -62 37 11 -9 -20
5412 -20 -15 7 9 -47 -23 9 27 57 29 18 43 9 4 -20 31 34 -38 2 -17 12 70 1 -14 2 -35 14 -30 -26 2 -9 36 -9 -25
5445 -25 -52 29 -8 -27 -28 66 38 -38 -45 12 14 39 35 5 64 28 -22 2 27 -25 -3 5 -30 2 -23 -6 -19 21 16 -46 -22 -36 58
5478 58 37 -10 -69 49 2 14 -3 54 -30 -12 20 5 6 11 10 38 -40 49 19 -9 -15 9 12 1 23 -29 11 16 16 -20 -29 4 28 101
5512 101 28 -14 16 54 -3 24 -22 -1 42 29 -4 -32 -29 0 -43 24 -37 -21 11 -34 -50 7 41 18 35 17 11 -3 23 -39 34
5543 34 -2 53 72 26 24 13 23 -31 -1 19 21 -5 -9 -21 3 3 -13 22 -56 87 42 -23 -9 9 -5 -32 -43 -27 -2 18 9 -42
5575 -42 35 -6 20 -4 -23 37 50 -8 -72 32 5 -8 -33 44 52 10 -1 -30 -3 -15 24 -44 -20 -7 -27 30 44 14 -2 -17
5605 -17 -11 -15 19 7 -4 -21 18 -26 26 11 20 51 8 30 -13 -10 -10 44 3 -13 -25 -28 66 -36 26 38 -18 -31 -37 8 20 1 10 -37
$$ packed form
5380GK5K0n0l8nN6L9p0m4K4N4p1LM6J2l5J3J6l8O2j3n7L0L8j2l1J4n7R9k6k0j1
5412b0NK2Kn6K4L2J8L0k8j1K5l4nk4N1Lp2M0j9K9N8o9j5J6l7M9m4MK8j1M5m5j6
5445b5k7Q1l7j9jR4k8p6pN7KK5ml0N9l6n0K4K5n2K2Ql5L2k5J7j3M0no2K4j4R4
5478E8k1m7n9J18m7J2j7N7q4J8L2j5JNjK8p8Q9l0k8oK4Lj1K2n2M0N%l6rL3K4P3
5512A01p3m2L0L8n7K7m6K1M3j3l3k8LK9m3O7o1J6L2m5j6N7L4k3J7j8oj4K6o2P3
5543C4l6N5J9m6kj1J0n4L0K0Kk6mj2K4%j6L5p8J43m5o5J4J8j4k7j1J6K5K0rn1
5575d2P7m1K6k4j9O0J3n8o4J04k7j3k5P7Qm2j1k9K7j2L9o8K4J3k0N7J4l0j6j5
5605a7OmL4j2j1j7L9m4N2j5RL1m3K2m3L%N4m1j6j2lR4j02O2J2n6j3oM5J2j9Rm7
$$ plain form
5639 -37 8 12 -20 0 -14 -24 16 -24 12 0 46 6 -5 50 -52 -56 -33 13 -31 -8 -5 16 -46 -15 -17 16 -28 -5 29 51 38 35
5671 35 7 -3 24 42 18 4 -29 4 20 -14 16 -2 20 21 -29 -15 -20 28 -29 -15 -54 28 35 -53 17 -49 -9 2 -19 18 86 32
5703 32 -12 20 -8 53 33 -22 0 9 11 -11 4 56 9 28 -33 -3 11 10 12 27 -19 39 9 18 -24 20 32 -19 11 -33 3 -15 4
5736 4 31 54 36 45 -84 21 -11 18 20 -36 9 -40 29 -29 -18 17 24 21 -1 -16 -1 -11 20 33 -42 -9 48 33 4 -35 -10 4
5768 4 -40 36 -10 11 -19 -57 86 8 7 -27 -10 -22 -12 -41 83 -28 -30 -25 42 43 -38 13 -24 18 8 56 14 -11 -6 17 -13 4
5800 4 -11 16 -3 6 11 37 -59 4 -21 -11 -30 21 11 55 21 -45 -3 -14 9 -9 -28 29 17 -12 15 25 13 -69 20 35 30 -23
5832 -23 -13 -16 38 0 47 -41 42 36 19 6 -25 30 6 -10 3 -20 -21 -17 38 61 45 35 4 45 -17 21 11 21 30 6 21 7 -64
5865 -64 21 11 69 -23 12 -5 -7 49 -9 16 -20 -3 -14 -16 -27 -37 0 36 19 -24 27 49 31 -12 49 36 -42 -12 -9 -7 36 42 -18
$$ packed form
5639c7M5Ml2K0j4j0M0m0L6j2M6m0j1N5j02mK3M6m4K3LK1o2L1kL3m4K3L4K2j3l
5671C5k8j0K7J8k4j4l3L3J6l4L0j8K2Jn0J4nM8n7J4l9Q2Pq8P0o6M0J1k1L7O8n4
5703C2m4L2k8O1k0n5K2RKk2J5N2m7J9o1L0J4jKJ5m6N8l0Rm2M4J2n1L0m4L6j8J9
5736DK7K3j8Rj29J05l2K9Kn6M5m9O9n8J1L5Plk2j5J5j0L1J3p5L3N7j5k9l9K5J4
5768Dm4P6m6K1l0l8J43p8jl4J7j2J0k9J24j11kNO7Jq1N1l7M2j0M8m2k5NK3l0J7
5800Dj5K7j9RNK6r6O3k5J0j9N1j0M4l4o6M2j1K3j8j9N7j2k9K7J0j2q2Q9J5nn3
5832b3J0lN4l8M7q8Q3oj7j3l1N5k4j6J3k3jMN5K3j6j0l1M1o2L8j0J0Rk4J5j4p1
5865f4Q5j0N8r2L5j7kN6n8K5l6J7j1kj1j0L7L6j7m3N1K2j8m3O1j3p8L0LKM3Oo0
$$ plain form
5898 -18 8 -10 1 -15 -29 0 -45 30 -8 28 -8 35 1 30 27 -24 6 15 -25 12 1 2 -8 14 -1 1 26 11 -42 -1 -12 27
5930 27 40 -24 -24 75 16 7 30 30 21 -13 4 -27 -25 -31 3 -12 -7 35 -10 -43 10 50 26 23 30 36 -19 -12 30 14 -1 17 53 25 20 20 2
5967 2 -7 68 63 -14 -44 27 3 -37 90 -14 5 -18 32 38 44 -28 -12 67 -10 -5 39 -48 -44 -59 42 26 -23 -1 0 -2 22 41 -5
6000 -5 17 5 37 19 -10 17 24 -21 21 2 15 31 35 28 -19 -2 0 11 -22 -12 -6 20 -3 -40 -14 16 12 0 -12 8 -33 -29 -79 -28
6034 -28 -6 -8 -46 27 -14 -20 -39 -16 -33 -17 3 -51 1 15 -12 3 -4 -35 -6 31 6 2 -60 38 19 -6 -37 -34 -4 13 -12 -20 -7
6067 -7 9 31 -37 21 29 -6 -10 2 -21 21 20 -3 11 13 -12 15 -35 -53 -23 -41 -9 -6 -20 1 -39 -1 -4 13 -13 41 12 23 2 -14
6101 -14 4 18 -19 -7 -7 25 -5 -48 71 15 -39 -7 -11 -6 -52 -23 1 40 -25 -86 15 -12 -1 3 10 -32 2 -8 23 -53 -17 22
6133 22 -38 -35 -17 -30 8 36 -66 61 -16 4 -29 24 21 -11 -25 -6 24 -4 -2 -6 7 6 17 1 -19 -43 18 15 40 -47 -10 2
$$ packed form
5898a8K6j8J1j6j4K9m5P5l8L6l6M3l4K9ln1L0Rm0L7j1Jj0K2j5KK5j5n3M1j1L9
5930B7J3o4%R9n9rK3%rl4J7l1KoL4j5NM2m5l3N3M0k4lPOn5PM2j6j5J8L6k8n%j8
5967BrP5np7l0P1k4m0J27j04J9k3N0OOp2J6P9p7NM4q7Mj5J01j6m9K2JkK4J9m6
6000eK2j2L2j8k9K7Pm5M2j9J3J6Mpm7J7KJ1l3J0OK6k3l7K6L0mj2j2K0m1Mn0N1
6034b8K2kl8P3m1oj9K3j7J6K0n4N2J4k7J5pl1K9L7k5mo2R8j9k5l1LL0J7k5qJ3
6067gJ6K2o8N8Ql5mJ2k3M2jk3J4Kk5K7n0j8L0j8L2Lj4K1m0L8lJ7k6N4k9J1k1j6
6101a4J8J4l7J2%L2l0m3J19n6n4L2mNm6K9K4L9o5o1J01k7J1MPm2L4j0L1p6L6L9
6133B2o0LJ8j3L8K8j02J27p7K0l3N3ll2j4J9L0k8KmJ3jJ1j6k0k4O1lK5q7L7J2
$$ plain form
6165 2 -18 -23 3 -48 -26 33 12 -24 -18 -35 -8 -9 -34 27 19 11 17 28 8 30 5 0 23 10 -10 15 0 -51 -37 -28 46 31 3 17 -10
6200 -10 11 -13 -20 45 4 9 -25 50 -11 35 -3 10 30 -8 5 -8 -40 12 61 -36 -30 45 -3 -22 4 -14 10 -13 60 72 74 22
6232 22 6 5 7 4 47 -41 -16 20 -18 8 0 -16 -33 -17 50 -10 -67 -2 -42 -4 -26 -33 2 -34 -24 2 39 11 -92 -46 38 -14
6264 -14 -2 22 9 33 38 46 -4 -13 -2 7 19 -34 18 -3 14 21 -4 7 18 32 27 -48 -5 -63 -14 3 8 -28 -44 -1 -16 45 19 -15
6298 -15 -17 1 23 -35 -3 53 -22 -7 -1 49 12 -14 11 10 -15 -28 -11 11 -13 -37 -1 -27 -2 23 -7 -54 14 20 8 11 -17 28 57
6331 57 22 -40 -3 26 -6 27 -4 -21 -7 24 -51 42 -12 21 -22 29 21 -21 -17 39 19 22 22 15 57 -20 9 -27 9 -31 -12 31 -2
6364 -2 -5 7 -14 -38 -26 17 3 -41 12 -29 -11 12 -40 27 -27 -32 15 -46 41 -3 -29 -5 -35 15 -13 5 37 21 -18 29 -29 -29
6396 -29 -12 22 1 -21 -38 64 -64 -13 1 -42 12 -22 -14 5 -4 8 21 52 58 -17 2 21 23 -10 -16 9 -3 65 5 1 0 -3 -5 38
$$ packed form
6165Bk0nK6n1K2N9k1l6Oj7K7jk5O1qqOJ1k0K2k5nK3j3k0K5j5n1J4RP4j5k8J4k7
6200a0K1k4pO5m1Nl4P5o1M6l8J3K0l8J3j3l2N2M9r7OP5m8j9K6j8K4k3P3J2Kn2
6232B2j6jKlM3q8K5L6l8K6qj6j7J6O7o0n7O5m0L8k2pL5l6J0K6L7k8j03M6Q4n2
6264a4J2K4j3K4NQn0rJ1RJ2n3N2k1J7Pk5J1J1J4np5M3n8M9J7Nl6j6M3j5O1k6l4
6298a5kJ8K2n8L2N6p5J5ON0l7k6K5jk5j3J7K2k4k4L6k6K5K5l0m7O8Oj2Lk8M5K9
6331E7l5o2L7K9l2L3l1j7J4L1p5R3n4L3m3N1qm2MN6k0L%pM2p7K9l6L6m0J9M3l3
6364blJ2k1k4J2M3j4m4N3m1J8K3n2O7n4nM7o1Q7m4k6K4l0N0k8J8L2j6l9M7n8%
6396b9J7L4k1k2j7J02j28N1J4m3N4l4QJ9rJ2J3L1Op5J9J9Kl3oK5j2O8o0mjlkM3
$$ plain form
6430 38 -5 25 20 7 -22 -2 35 -5 -17 19 38 9 -26 -27 -15 -67 8 45 -22 -37 -5 15 9 27 -23 18 4 -11 -27 17 5 -7
6462 -7 11 10 -24 20 -5 40 31 23 -5 19 1 13 16 -54 -16 8 15 19 38 18 -16 32 37 -2 39 64 -17 35 24 -41 -3 -17 3 -55
6496 -55 -13 26 -10 -79 71 -16 -19 10 36 -23 14 19 -14 27 -21 10 -1 -9 -8 13 30 3 49 56 48 -25 -24 42 22 38 -2 -11 10 -1
6530 -1 25 22 -12 -20 1 12 -14 7 12 1 -16 25 28 -45 -8 41 -7 24 27 1 1 -14 5 54 -32 26 -40 23 15 1 16 36 -21 -16 7
6565 7 -4 -12 45 20 -72 19 -17 -25 8 27 0 -30 6 -16 26 -8 56 -7 1 30 -33 -28 -4 43 -25 5 15 -10 -2 6 -23 -30 6 17
6599 17 -60 2 -1 36 98 19 3 47 1 18 50 -11 15 -4 21 36 5 -14 -19 59 14 -29 -15 22 20 52 12 4 30 14 -26 -3
6631 -3 2 -24 25 24 14 -64 -13 12 -16 22 2 -6 -26 -28 31 -8 -3 9 14 -25 -17 69 -5 -10 27 4 5 17 48 -70 1 -7 20 -13 -1
6666 -1 -7 3 3 -23 -2 53 9 2 -3 -28 7 -29 4 9 9 -13 -19 7 -20 24 20 23 23 22 7 18 22 20 39 -16 -27 -5 2 -3 -4 -23 -7 7 2
$$ packed form
6430C8m3L0nj3k9K0L7m0j2L6J9k9l5jJ2n2P5L7o7j5L2K0oJ8n0M1j4j5j6M4j2j2
6462gJ8jl4M4k5M5rqk8K4j8J2Lp0L8K4PMJ9k0l4M8Nl9M1K5q1N2j1o5L8j4K0n8
6496e5M2L9l6o9J50q7lK9K6n9L7Nl3M1m8L1j1qJK1J7k7M6Pqp3JO6k0J6m0rK1j1
6530aK6ll4qK1J1k6K1Nj1j7M1Lp3L7M9m8L1Lk6%j5J9M9q6N8o6O3qj4J5K0n7NK3
6565Gj1qN7k5r2R1l6qL3J9k7l0L6k2M2l4O4o3QK9o3NK4M7o8L0J0k5QQk9pL6J1
6599A7p7O2lL7O2p9j6M4m6J7L2o1K6j9K5J5l1j9nP8m5m3J4L7kL2m0qK6j6m0K3
6631cNk6M9jj0p8N1K5k8L8k0qk0kN9l9NJ2Nl9QQ6p4nL7k3JJ2L1j18P1qK7l3J2
6666aoJ0%k6K1N5m4pnk5L5l6L3N%k2oK6k7M4mL%jj5J1MkJ9n5j1K2Pnjj9J6J4n
$$ plain form
6705 2 26 7 -7 -37 -23 12 -15 13 -25 -49 -12 10 0 -18 30 9 -50 47 -5 18 -2 -51 -2 38 17 89 16 23 1 51 27
6736 27 31 -15 49 -16 -3 -37 20 66 -32 -16 -42 14 -36 -2 37 -7 -4 -38 22 49 -24 -5 7 16 2 27 -1 5 -12 -3 30 -2 -10
6769 -10 20 -49 -41 -27 14 25 52 -24 -17 -38 -7 45 -40 40 -33 34 7 -3 40 19 -31 8 44 23 13 -30 63 1 -5 31 0 -13
6801 -13 -57 -40 33 -13 -25 -8 18 25 -16 -47 -45 15 -5 -1 64 47 36 23 18 66 -6 -15 -52 29 8 -49 29 43 1 24 30 25 -23 -38
6835 -38 17 12 -12 -49 35 -31 45 -31 11 15 -32 11 -40 -19 -25 -44 -27 -11 43 -15 -12 -75 -19 6 1 29 -32 -25 30 -21 29 3 48
6868 48 -42 36 46 -50 -14 34 8 -22 9 -39 3 -37 29 7 -13 -35 30 8 -18 -19 12 26 -39 23 22 -5 22 20 3 -14 19 45
6900 45 -57 -6 5 22 39 35 -14 -9 4 5 31 1 -22 -12 -8 -10 8 3 18 -23 -35 2 6 7 10 26 -29 -46 -49 4 -6 1 12 31 -10
6935 -10 4 15 0 -23 6 -7 23 -47 -15 -2 46 14 29 -12 -2 24 22 55 -20 -21 -12 -17 -10 -27 -31 -47 -56 -19 8 2 1 26 -29 9 -36
$$ packed form
6705BK4j9j4l0J4L5k7K8l8k4L7K2j0j8M8k1n9R7n2K3k0m9M9M0k1P2p3Pk2N0k4
6736B7Mm6O4o5J3l4N7M6r8J6k6N6n0L4L9m4Ll4O0K7p3J9J2Rj4K5k8Oj7RL3l2q
6769a0L0o9QJ4M1J1K7p6Pk1L1N2q5Q0p3O7k7j0M3k1n0L9L6k1j0m3R3o2oL6l1j3
6801a3m4J7P3m6j2J7K6Pm1l1KO0k0MO5j7j1j3nM8p2rl7Q1k1n7P8J4m2K3Onm8j5
6835c8N5nk4l7Q4o6P6p6M2Mm7M3n1K1oj9J7J6N4n8Lo3N6K5nK8o1PN5n1N0k6M5
6868D8r0P8J0r6L6M8k6l0L1m8M2m0O6k2k0k2O5k2k6jL1J4o5O2jk7K7kj7j7L3K6
6900D5j02N1J1J7J7mm9NJ3JK6l0k3J0MkJ8nJ5m1j2L7MJLJ6n5j7lN3j0PJ1J9m1
6935a0J4J1j5k3K9j3L0p0L2J3M8l2J5m1J0K6kL3p5jRnPj7mj6rL7K7ojK5n5L8m5
$$ plain form
6970 -36 16 15 -52 3 -37 23 -26 29 25 1 20 46 23 -7 40 20 -16 49 -15 30 23 -18 48 -4 0 28 -40 -40 -48 38 -35 -29 76
7003 76 -15 25 54 40 2 37 4 -12 -16 25 -37 -11 -10 -18 -15 -26 48 -36 -14 23 -14 48 18 9 -41 -25 -20 25 -6 -10 -28 -20 -15 -6 -17
7038 -17 -7 11 -4 36 -30 21 30 9 6 24 -9 -22 29 21 14 32 2 -61 53 -18 -11 41 -29 15 2 7 -26 21 -5 29 8 38 4
7071 4 -14 -13 5 31 13 -6 54 -13 24 46 37 -35 35 13 -4 -43 -15 -18 2 -1 -3 -19 -44 1 -10 -13 -22 -2 -23 9 24 -12 -14 44 -1
7106 -1 -19 4 7 12 21 16 -81 -3 4 3 -13 -16 -38 -13 -1 20 18 5 -38 42 -11 33 2 37 23 14 21 18 -6 -13 -30 -18 -1 34 -3 -10 -27
7143 -27 -13 1 10 -29 23 4 -7 4 23 -9 72 0 18 -5 -48 2 26 -2 -7 -18 5 -18 -18 -18 -1 -4 -24 80 23 10 -1 -37
7175 -37 10 41 -8 35 56 22 18 -14 23 -4 -39 7 -24 18 57 62 36 -8 34 -7 -30 4 14 -1 -68 -11 36 -16 -21 -60 5 -20
7207 -20 35 27 -1 11 21 6 -27 9 14 -14 -67 -78 42 42 -6 -52 -30 20 34 -29 -13 -6 -15 56 -36 45 -1 17 26 -13 24 27 -32
$$ packed form
6970c6N2jo7N5m0O0m9N5mk4J9K6k3l0M7k0l6O5o4M5pm1O6n2MK8o8%qQ6p3OJ05
7003G6r1M0K9j4l8L5l3j6mM1o2K6JqLj1P4q4K2L7l7O2l0rn0J6NM5l1mj8QNRj1
7038a7J0J8j5M0o6N1Rk1lJ8l3j3N1qpJ8l0o3J14p1PN2p0M4j3Nl3M7k6L4k1L0l4
7071Dj8JJ8K6j8j9O0o7L7K2rp2P0k2j7l9K8lK0lkj6k5M5j1lrK0k1L2J5l6kN8m5
7106aj8K3LNRnr7P8Pjj6lk2K5J2K1kj3m3Q0n3M4l1L5j4rPlk4pj7J2J7L5l7pj7
7143b7J4J4Rl9N2j9j1J1J9l2Q1p2J8k3m3N0K4k8nj1K3k3%%J7lk0J04n7j3j1l6
7175c7M7L1m9M3K1l4ml2L7k7l5M6l1M2L9Nk6m4M2m1k3L4J0j5o7N7M7n2nl9O5k5
7207b0N5qk8J2J0j5l3L6Nk8n3j1J20%m8m6K2N0J4o3J6PrP1r2Q1m6J8Rl9L7Ln9
$$ plain form
7240 -32 37 -2 39 -3 -10 -42 8 14 -11 22 13 26 5 -24 -13 15 13 -7 -26 -10 -4 -5 -3 -24 -30 -27 19 28 -49 -34 0 -14 1 34 -4
7275 -4 0 -3 2 -8 -56 -8 -32 8 2 42 7 2 -3 20 -14 -24 -6 4 9 -10 -37 31 13 6 -33 25 -24 -13 -23 9 -17 -32 10 46 20
7310 20 -52 52 -28 17 7 65 -18 -23 39 -29 -5 -18 46 16 29 25 20 32 -1 11 -19 -2 29 12 -38 25 -38 -15 86 -23
7340 -23 -2 74 3 31 11 -29 16 1 25 -23 -16 58 -30 -9 8 9 5 -8 65 32 45 -41 19 -19 -35 49 33 -16 22 -21 -1 -13
7372 -13 -8 -13 8 6 -7 9 96 -23 3 28 35 16 -1 -2 -27 19 -30 5 -40 36 31 12 -11 35 -37 -12 7 -7 -32 14 38 -26 -45
7405 -45 -17 -13 -13 18 -39 7 39 18 -11 24 42 -2 22 14 22 -45 85 8 15 33 -11 4 24 39 26 -6 -4 -8 -11 2 27 34 13 56
7439 56 47 -26 -16 62 1 -58 10 25 -6 -24 0 1 -36 0 4 12 10 7 -11 50 -36 34 3 2 -4 6 -5 34 -48 -18 19 -39 -2 18
7473 18 36 25 -6 -29 -8 -18 -19 -2 7 5 26 18 -21 -31 29 24 12 -2 -4 11 -40 -23 -5 -8 -52 18 -13 -8 11 -30 -24 2 25 2 -11
$$ packed form
7240c2O9l9M1m2pl2N0Ok5L3rJ3k1k9J1K8kk0j9J6OjKk1oLM6Rp7J5L4j4J5L3l8
7275dMlNj0m8M8k4M0oM0l5nnK3l4j0J8J0Nj9k7O8j8pl9N8m9J1j0L2k6j5M2L6k6
7310B0p2J04q0M5j0N8q3nO2o8K4j3O4l0J3mnJ2l3J2l0J7L1j7n0O3o3K3J01j09
7340b3K1P6p1K8k0m0M5j5K4m8PP4q8K1J7Jmj3P3l3J3q6O0l8j6Q4j6m9L8m3K0j2
7372a3NnK1kj3J6Q7j19K6K5Pj9j7jk5M6m9L5m5P6nj9k3M6p2K5J9j4k5M6K4o4j9
7405d5K8M%L1n7M6L2k1k9L5J8m4K4qQo7J30p7PJ8m4J5K0J5j3l2KmlJ3K5Pk1M3
7439E6rp3J0P8o1n9O8J5l1j8K4Jl7L6MQklj8O1q6P0l1joJ0j1L9q2L0L7n8L7K0
7473A8J8j1l1k3K1j0jJ7RkK1ql9j0O0nj2j4kJ5n1J7J8lm4P0l1NJ9m1OK6K3k3j3
$$ plain form
7508 -11 44 26 -5 25 14 54 -2 25 -42 -33 -12 -35 -4 -88 42 -25 11 -4 23 -19 1 32 -1 7 17 18 -15 -6 -44 -5 60 -6
7540 -6 -38 28 -2 -16 22 33 7 27 28 -27 -23 60 -44 4 13 19 42 8 -10 -6 -17 -34 -3 5 -28 -3 18 -20 -47 11 26 22 2 -25
7574 -25 -27 68 50 -3 9 24 26 -15 -11 -60 -33 -9 -16 2 -6 -61 26 -11 8 -28 -28 -17 10 15 -25 -18 4 -34 18 22 -12 -64 -27 1 31
7609 31 15 -19 0 24 35 44 6 15 -51 3 31 48 -23 -11 3 -42 -28 17 -5 -13 0 -33 -5 30 5 22 38 -5 16 9 -21 0
7641 0 -28 -2 27 9 20 1 3 33 6 -66 -22 -22 32 30 -18 -26 17 9 -96 -5 -18 -38 6 -31 3 -9 -21 51 2 32 8 -5 6
7674 6 -2 24 7 -26 -53 19 -11 -3 26 -8 47 -24 -46 78 -62 10 77 21 -9 7 1 57 31 -37 -23 8 -19 -27 39 10 -11 -3
7706 -3 7 -5 11 0 -17 -11 0 54 31 -12 -12 5 42 -20 18 21 24 49 4 5 -16 -49 7 37 -4 -3 19 -34 22 3 -21 36 -55 -5
7740 -5 -9 6 -27 20 22 -23 -20 27 40 -33 -8 -45 -33 -27 -6 25 -14 40 7 -56 7 0 -30 10 21 7 -46 14 -24 -29 -13 -30 -2 -27
$$ packed form
7508a1N5j8l1L0j1M0n6K7o7RK1k3L1q4J30o7L6j5K7m2K0L1l3QJ0Jl3Rl8L9O5o6
7540fl2O6l0j4L8J1k6K0Jn5MQ3j04M8ROK3l4j8Mj1j7L1Ql3K5K1l8k7N8J5mk0k7
7574b5kR5j8n3J2J5Km1Mm9K7K4pJ8qn5Q7l7J9l6%J1K7Nm0PK2l8N2Ml4n2L7K8L0
7609C1j6l4J9K4J1Rl8Ro6N4K8J7p1J2J4m5J4M5k2qJ3l3K8L5k5J7J6m3K1pl0K1
7641@k8K6K9j8J1j9KL0k7p2M4%N4km8qM3qj05R1j3k0M4l7L4j2j2P2m9L0k4j3J1
7674FqK6j7l3k7P2l0QK9l4N5p1k2J24j40P2O7n6l0J6oN6k6o8J4L1k7qO6k9k1Q
7706cJ0j2J6j1j7OJ1N4k3m3%J7L7o2L8LLK5m5Jk1l3N6L0m1JK2n3N6j9k4N7r1N0
7740emJ5l3M7Km5LM7J3p3K5l7J2OK1L1l9N4l3o3O3pl0M0J1j4n3O0l8nJ6j7K8k5
$$ plain form
7774 -27 -48 17 35 -54 9 -12 4 -30 -17 -17 -31 -38 3 -9 -18 23 -1 28 15 -18 5 -29 -15 27 47 10 -12 2 23 -25 -11 -19
7806 -19 34 -23 -4 -3 13 -20 1 19 -49 6 -6 -19 -49 1 -4 26 -26 10 -11 6 -21 -15 49 81 -2 -66 -43 -24 -27 25 18 -55 5
7839 5 30 1 33 -49 -27 24 -1 -12 -3 -58 7 1 -17 3 -41 -15 5 20 -5 -13 -12 18 18 25 -9 -60 -14 -17 21 26 2 1 22 -19 9
7874 9 -9 21 -6 -12 3 -11 -7 28 7 -29 -25 52 33 -10 10 -68 37 -59 28 -21 -19 -10 -24 -16 -19 -5 12 -6 11 -30 -14 -16 15 -52
7908 -52 -10 -8 -17 -6 -16 21 -18 45 -16 -26 -10 -29 -20 -11 39 -54 -22 -50 -15 -38 69 37 -21 29 43 -9 0 27 18 0 -26 14 -1
7941 -1 -3 -38 25 16 6 39 2 32 -17 -3 -19 -1 -35 13 6 -18 6 -44 -13 0 19 7 -24 9 -28 -5 22 42 -11 13 67 -51
7973 -51 45 -17 -1 -23 -35 18 19 31 4 -7 -13 24 -13 32 14 27 -37 -7 -19 -33 32 19 43 -25 6 -26 2 -2 -1 28 26 17 46
8006 46 18 29 -47 -17 14 -1 15 -12 12 30 -7 -31 -7 -10 -19 -29 18 50 28 9 -7 2 -37 -16 -6 39 -1 26 -17 -50 -4 -8
$$ packed form
7774b7k1O5J8q9O3k1J6l4J3%j4pM1j2rM1k4K9j3l3K3l4J4M2K0l7k2J4K1m8J4q
7806a9N3n7J9JJ6l3K1J8o8N5j2j3l0N0nL0n2L6k1J7k7OO4L2q3o4K3J9lN2pp3O0
7839EK5k9L2q2K2N1k5j1Rn5O5oj8K0m4K6K0J5k5qJL0%Pl4n1M6lL8Nk4jK1m1K8
7874Ij8L0k7oJ5j4ML5k1l6MP7j9m3K0p8J05r6Q7m9KRj4QlJ4J7j8J7m1J6kL1o7
7908e2M2KrJ1j0L7l9O3o1j0J6j9RRN0r3L2k8L5k3J07l2n8N0J4n2RK7rj8k6M0j5
7941akl5O3rj0L3l7L0m9J4j6J8l4M8pk4K4n0L1J3J9j2l1L3l7K3K7K0n3K4N4j18
7973e1R6o2J6k2j2N3JJ2k7j1oL7l7M5j8J3o4L0j2j4O5j3K4o8L1l2K8mJK9krK9
8006D6k8J1p6L0L1j5J6k7K4J8l7k4K4lrj0M7L2k2j9j6Rl9K1J0M5m0K7m3l3M6m
$$ plain form
8038 -8 -44 55 -23 2 -19 20 -5 16 10 -39 7 0 23 13 -1 4 2 51 -1 22 24 -10 -38 36 -40 35 0 -16 5 41 -4 -48 -42 15
8072 15 53 0 13 -20 -28 -46 16 -17 -32 -13 -40 48 11 -21 -48 -58 33 21 -36 -24 -22 19 22 55 32 -29 2 -8 -37 59 -27 -27
8104 -27 26 -26 1 31 53 20 -14 -16 -46 51 -2 -21 -1 5 -13 -6 46 26 -74 5 -17 -15 4 4 -47 -10 -28 40 13 4 20 22 4
8137 4 23 27 -9 -28 16 12 -46 9 5 16 14 -42 41 -13 11 81 15 -38 9 -5 11 13 7 54 -22 0 13 2 -35 -78 21 -8 65 12
8171 12 -19 5 -21 30 -31 -8 21 30 15 8 -62 -10 -3 13 63 9 -20 -23 -2 7
$$ packed form
8038hl6R9p8K5k1L9k5K1om9M6pK3j0j4NkM9n2K3Kl4k8P4p6P5l5j6K1L6m5m4ON7
8072A5L8n3J3l3qj8O2l3j5J9k7Q8l7l2k7j0R1j2n7J2KM1LL3k3o1L1j0k9R6q6%
8104b7N3n2K7L0K2l3l4kl0R7n3j9K0Oj8PN2k0j00P9k2KJ9%n1L7j8O8k7rJ6Kj8
8137DJ9Ml6j9M4mn8N5mJ1kn6Q3n4K4P0o6n3M7j4J6KoM7p6K2J3j1l7m3R9k9P3n3
8171A2l1K4k6N1o1K3K9Rj5pp0N2PJ6N0n4k9lK1R
8191G
$$ Imaginary data points
##PAGE= N=2
##DATA TABLE= (X++(I..I)), XYDATA
$$ plain form
0 0 0 0 0 0 0 0 0 0 0 0 0 0 0 0 0 0 0 0 0 0 0 0 0 0 0 -4 4 -4 7 -8 8 -10 12 -12 16 -20 20 -23 27 -31 35 -39 45 -51 56 -60
46 -60 68 -76 83 -92 103 -111 122 -133 146 -159 173 -186 200 -212 224 -229 224 -198 133 33 -442
67 -442 1608 -6071 51208 404742 129063 -358443 -175894 248100 196861 -125296 -174503 -9797
79 -9797 114941 125911 -22644 -214462 -85298 257530 190612 -259191 -273291 223470 325058
90 325058 -160193 -333049 83176 299248 -6116 -222770 -52541 121205 85736 -6511
100 -6511 -89482 -103857 65519 196961 -20838 -261986 -37005 288926 90794 -280983 -132527
111 -132527 240394 150385 -179433 -143935 106210 110867 -33333 -55630 -27400 -11923 70257
122 70257 82774 -90360 -142895 93054 187971 -79393 -208888 58463 205738 -35783 -179103
$$ packed form
0@%%%%%%%%%%%%%%%%%%%%%%%%%mQqJ1j5J6j8K2k4K8l6M0m3N0n8O6p4Q4r6J07j16
46f0J28j44J59j75J95k14K33k55K79l05L32l59L86m12M36m53M53m22L31j00m75
67d42K050p679N7279L53534k75679m87506J82549M23994n1239l22157m9207J64706
79i797J24738J0970j48555j91818J29164L42828o6918m49803j4100M96761J01588
90C25058m85251j72856M16225K16072l05364k16654J70229J73746l5469r2247
100f511q2971j4375J69376J31442k17799k41148K24981L25931j98132l71777J48456
111a32527L72921r0009l29818L5498K50145M657j44200k2297K8230J5477Q2180
122G0257J2517j73134n2535K35949R4917k67364j29495K67351J47275k41521j43320
$$ plain form
133 -179103 18837 135166 -12208 -83091 14410 27718 -26914 21167 43427 -61850 -62773
144 -62773 88141 76679 -102506 -82829 106065 78891 -101911 -64009 94522 42000 -84559
155 -84559 -13186 77413 -14999 -70573 40739 65654 -58992 -58553 69668 48182 -72810 -33442
167 -33442 68586 11779 -61660 13574 52323 -43367 -46366 70832 42280 -94470 -42084 109094
179 109094 43746 -112511 -44691 104339 43339 -83739 -34491 56330 19269 -23515 4998
190 4998 -7131 -34166 33193 66726 -49732 -97431 54977 120916 -50018 -134266 35185
201 35185 132318 -16753 -116583 -3481 85367 18139 -44283 -25435 -3158 22006 50086 -7893
213 -7893 -89845 -13964 118573 41346 -130367 -66925 126499 87733 -105852 -96747 74217
$$ packed form
133a79103J97940J16329j47374p0883R7501J3308n4632M8081K2260j05277r23
144f2773J50914j1462j79185J9677J88894k7174j80802L7902J58531n2522j26559
155h4559P1373R0599r2412n5574J11312K4915j24646M39J28221k1486j20992L9368
167c3442J02028n6807p3439P5234L8749r5690k999J17198k8552j36750N2386J51178
179A09094o5348j56257O7820J49030o1000j27078M9248R0821l7061m2784K8513
190D998j2129k7035O7359L3533j16458m7699J52408O5939j70934q4248J69451
201C5185R7133j49071r9830J13102Q8848o7228o2422J8848K2277K5164K8080n7979
213g893q1952P5881J32537p7227j71713O3442J93424l8766j93585R105J70964
$$ plain form
224 74217 92492 -35822 -73472 -2863 41001 34961 -373 -57557 -44826 65740 85780 -61782
236 -61782 -118837 45237 136728 -22157 -138500 -3532 123418 26368 -93111 -40940 53318
247 53318 45892 -7888 -38182 -34663 21096 71102 4401 -95115 -32380 105450 58660 -101473
259 -101473 -78757 84423 87769 -59542 -85425 29293 69494 -928 -44121 -23241 10760
270 10760 38328 24461 -43811 -57145 39883 83040 -27866 -97608 12357 101162 4972 -91287
282 -91287 -18126 72295 26546 -45686 -26880 16493 19974 11274 -7420 -35068 -9516 50706
294 50706 26010 -59226 -41264 58577 50226 -52281 -53412 40833 48820 -27802 -37839 15323
306 15323 22203 -4770 -3357 -1543 -14606 5181 31313 -4646 -42590 3059 49433 -186 -50004
$$ packed form
224G4217J8275j28314l7650P0609M3864o040l5334n7184J2731J10566K0040j47562
236f1782n7055J64074R1491j58885j16343J34968J26950r7050j19479N2171R4258
247E3318p426n3780l0294L519N5759N0006o6701r9516O2735J37830m6790j60133
259a01473K2716J63180L346j47311k5883J14718M0201p0422m3193K0880L4001
270A0760K7568j3867o8272j3334R7028M3157j10906o9742J09965Q8805r6190r6259
282i1287P3161R0421m5749p2232J8806M3373L481q700j8694k7648K5552O0222
294E0706k4696q5236J7962R9841q351j02507j131R4245P987p6622j0037N3162
306A5323O880k6973J413J814j3063J9787K6132l5959l7944M5649M6374m9619m9818
$$ plain form
319 -50004 -1587 45630 1409 -37731 570 26798 -5637 -16411 11162 5627 -18150 2305
331 2305 23361 -8793 -27055 12786 27542 -15315 -24639 17327 19465 -18542 -11300 21026 3206
344 3206 -22861 5542 25815 -11879 -27413 16466 27929 -18278 -26354 17400 21531 -15390 -14774
357 -14774 11551 4465 -9049 6267 6646 -18194 -6611 28305 7869 -35965 -10481 40000 13887
370 13887 -39034 -16025 34449 17170 -25052 -14693 14029 9937 -1332 -1460 -10009 -9028 18983
383 18983 20417 -24479 -31751 25154 39746 -22662 -44865 15925 43895 -8395 -38332 63
395 63 27362 6455 -12872 -10132 -3363 10685 19940 -7009 -33391 1152 43723 7373 -47737
408 -47737 -15220 46661 22309 -39708 -25966 28564 25576 -14997 -21175 261 11878 12154 -392
$$ packed form
319e0004M8417M7217m4221l9140L8301K6228l2435j0774K7573n535k3777K0455
331B305K1056l2154j8262L9841J4756m2857r324M1966K138l8007P242L2326j7820
344C206k6067K8403K0273l7694j5534M3879J1463m6207q076M3754M131l6921O16
357a4774K6325p086j3514J5316L79k4840J1583L4916k0436m3834K5484N0481k6113
370A3887n2921K3009N0474j7279m2222J0359K8722m092j1269j28q549R81K8011
383A8983J434m4896p272N6905J4592o2408k2203O0790K7970n2290k9937L8395
395F3K7299k0907j9327K740O769J4048R255k6949k6382L4543M2571l6350n5110
408d7737L2517O1881k4352o2017J3742N4530k988m0573o178K1436J1617K76j2546
$$ plain form
421 -392 -22550 -13543 27652 26303 -28746 -37177 25014 43865 -17899 -45239 9204 41538 204
434 204 -31936 -7176 19233 12156 -3358 -12660 -11874 10144 25805 -4216 -35944 -3524 41207
447 41207 11186 -41874 -18232 36831 21758 -28843 -22638 17630 18816 -6521 -12025 -4147 2447
460 2447 12539 8436 -17475 -18441 19756 27441 -18036 -32474 14873 34485 -9528 -31797 4646
473 4646 25905 -318 -17169 -2299 6648 2555 3576 -1354 -13416 -2193 20173 5463 -25019
486 -25019 -9426 25900 11754 -24602 -12587 20939 11421 -15745 -7891 10671 3416 -5197 2751
499 2751 1506 -8132 1742 13482 -3341 -16884 4365 18482 -4936 -18267 5139 15757 -6290
512 -6290 -12618 7018 7967 -9066 -4043 10382 -244 -12092 3205 12800 -5449 -12446 7036
$$ packed form
421c92k2158R007M1195j349n5049q431O2191J8851o1764k7340N4443L2334m1334
434B04l2140K4760K6409p077j5514r302P86K2018J5661l0021l1728L2420M4731
447D1207l0021n3060K3642N5063j5073n0601O205M0268J186k5337n504P878O594
460B447J0092m103k5911r66L8197P685m5477j4438M7347J9612m4013k2269L6443
473D646K1259k6223j6851J4870Q947m093J021m930j2062J1223K2366j4710l0482
486b5019J5593L5326j4146l6356J2015L3526r518k7166P854J8562p255q613P948
499B751j245r638R874J1740j6823j3543K1249J4117k3418j3331K3406J0618k2047
512f290o328J9636R49j7033N023J4425j0626j1848J5297R595j8249o997J9482
$$ plain form
525 7036 11068 -7502 -7937 8240 4469 -8217 352 9115 -4560 -9690 8643 10899 -11422 -11809
539 -11809 12620 11929 -12617 -11674 10424 9367 -8116 -6524 4426 1569 -1615 3626 -983 -9405
553 -9405 2227 14679 -2079 -18442 1283 20904 967 -20414 -2624 18335 4567 -13593
565 -13593 -4930 7649 4255 -812 -2056 -5898 -1607 11211 5667 -15294 -10649 16495 14218 -16090
579 -16090 -17201 13000 17681 -8941 -16195 3864 12435 998 -6501 -4604 -1 7349 7578 -7476
593 -7476 -13704 6574 19032 -3545 -21515 129 21633 3402 -19267 -6393 14280 7614 -8392
606 -8392 -7851 1166 5513 4975 -2535 -10670 -2056 14101 6480 -15739 -10440 15259 13492 -12631 -14317
621 -14317 9361 13821 -4736 -10748 902 6741 2849 -1290 -5166 -4136 6243 9226 -6163 -13487
$$ packed form
525G036M032j8570m35J6177l771j2686Q569Q763j3675n130J8333K256k2321l87
539a1809K4429o91k4546R43K2098j057j7483J592J0950k857l184N241m609q422
553i405J1632J2452j6758j6363J9725J9621j9937k1381J7790K0959j3768j8160
565a3593Q663J2579l394n067j244l842M291J2818n544k0961M645K7144k277l0308
579a6090j111L0201M681k6622p254K0059Q571j1437p499J897M603P350K29j5054
593g476o228K0278J2458k2577j7970K1644K1504j8231k2669J2874K0673o666j6006
606h392N41R017M347n38p510q135Q614J6157p621k2219N299K5699j767k6123j686
621a4317K3678M460j8557o012J1650N839l892m139l876J030J0379K983j5389p324
$$ plain form
635 -13487 4567 15642 -2953 -16564 362 14843 1187 -12226 -2644 7969 2793 -3252 -2107
648 -2107 -1399 685 5744 1728 -8546 -3543 10794 5787 -10949 -6649 10632 7161 -9046 -6361
662 -6361 7025 4698 -4940 -2524 2518 -663 -1068 3202 -735 -6057 1384 7703 -2297 -9029 2605
677 2605 9159 -2980 -8384 3566 7176 -3797 -5010 4779 3181 -5044 -668 5780 -1050 -5845
691 -5845 2913 5560 -4277 -4892 5179 3451 -6154 -1968 6298 -338 -6991 2021 6908 -4301 -7105
706 -7105 5606 6743 -6608 -6182 7013 5280 -6433 -3520 5769 1765 -4154 1202 3025 -3843
720 -3843 -1467 6967 525 -9546 31 11662 -325 -12963 -9 12698 101 -11736 -586
733 -586 8903 210 -5635 168 1491 -1534 2792 3317 -6634 -5448 9876 8120 -11529 -9951 12303
$$ packed form
635a3487J8054J1075j8595j3611J6926J4481j3656j3413R582J0613n176o045J145
648b107P08K084N059m016j0274N003J4337n007j6736M300J7281l471j6207K685
662f361J3386k327r638K416N042l181m05M270l937n322P441O319j0000o732J1634
677B605O554j2139n404J1950L610j0973j213R789j598q225M376O448o830m795
691e845Q758K647r837o15J0071j728r605M186Q266o636o653R012M887j1209k804
706g105J2711J137j3351M26J3195j733j1713K913R289m004n919N356J823o868
720c843K376Q434o442j0071R577J1631j1987j2638J2954J2707j2597j1837J1150
733e86R489q693n845N803J323l025M326N25r951J186J5324j756j9649J578K2254
$$ plain form
748 12303 11714 -11141 -11805 9190 11012 -6198 -8414 2879 4600 20 95 -2507 -5658 3448 10581
763 10581 -3898 -15214 2578 17862 -977 -19051 -1334 17886 3294 -14879 -4422 10389
775 10389 4739 -4491 -3216 -1206 1026 7024 2944 -11190 -6822 14025 10965 -14882 -14150 13753
789 13753 15881 -11341 -16074 7422 13632 -3719 -9843 -329 4028 2865 2234 -4386 -8807 4347
803 4347 14529 -2915 -18444 819 20784 2154 -20209 -4271 17963 6085 -13265 -6062
815 -6062 7836 4877 -1798 -2069 -3731 -1823 8050 6104 -11179 -10505 12077 13628 -11841 -15723 9796
830 9796 15647 -7355 -13984 4474 10490 -1847 -5545 339 309 623 5424 -120 -9993 -631 13759
845 13759 2322 -15562 -3603 15847 4664 -14566 -4825 11833 3764 -8714 -2148 4805 -859
$$ packed form
748A2303n89k2855o64K0995J822j7210k216J1293J721m580P5k602l151R106P133
763A0581j4479j1316J7792J5284j8839j8074J7717J9220j4592j8173J0457J4811
775A0389n650r230J275K010K232N998m080j4134M368K0847l060k5847P32K7903
789A3753K128k7222m733K3496O210j7351o124R514M357j163o31o620m421J3154
803D347J0182j7444j5529J9263J9965j8630k2363J5938K2234j1878j9350P203
815f062J3898k959o675k71j662J908R873j946j7283O74K2582J551k5469l882K5519
830I796N851k3002o629J8458O016j2337l698N884l0L14M801n544r873R362J4390
845A3759j1437j7884J1959J9450j1183j9230R741J6658q069j2478O566O953n664
$$ plain form
858 -859 -1598 3701 -1389 -6969 3293 9505 -4500 -11228 5048 11854 -4978 -10992 5056 9482
872 9482 -4765 -6570 5222 3833 -5365 -593 6136 -2084 -6592 4300 6844 -5959 -6801 6573
886 6573 5609 -7184 -4330 6973 1945 -7013 435 6653 -3137 -6563 5467 6596 -7114 -6257 8257
901 8257 6051 -8135 -4892 7581 3571 -5892 -1236 4383 -1389 -2546 4500 1109 -7668 -311 10275
916 10275 -130 -12363 -323 12863 653 -12505 -1511 10333 1529 -7344 -1303 3502 188
929 188 589 1834 -4148 -4106 7294 7157 -8791 -9459 9405 11529 -8367 -12172 6444 11518 -3953
944 -3953 -9445 1162 5775 822 -1466 -2482 -3660 2496 8110 -1943 -12023 81 14392 2047
958 2047 -15141 -4228 14036 6084 -11215 -6512 7453 6190 -2692 -4010 -1481 1108 5419 2736
$$ packed form
858h59p39N299n090n580J0262O212j4005o728J6276O806j6832o014J6048M426
872I482j4247j805J1792j389r198M772O729q220m508J0892K544j2803q42J3374
886F573r64j2793K854J1303n028q958P448O218r790l426J2030J129j3710Q57J4514
901H257k206j4186L243J2473m010r463M656N619n772j157P046l391q777P357J0586
916A0275j0405j2233J2040J3186j2210j3158J0994J1844q804q873O041M805l314
929A88M01J245n982M2J1400j37j5948o68J8864K124j9896l805J8616N074j5471
944c953n492J0607M613m953k288j016j178O156N614j0053j0080J2104J4311j2345
958B047j7188J0913J8264p952j7299M703J3965j263q882j318K529K589M311k683
$$ plain form
972 2736 -7813 -6626 8773 10125 -8497 -12669 6689 13391 -4446 -12889 1526 10185 626 -6715
986 -6715 -2398 2096 2967 2684 -2417 -6757 1043 10161 1208 -11820 -3319 12358 5418 -10957 -6364
1001 -6364 8862 6709 -5575 -5585 2269 3480 760 -661 -3298 -2737 4517 5692 -5180 -8538 4451
1016 4451 9765 -3459 -10299 1994 9219 -594 -7185 -212 4512 639 -1209 -77 -1611 -538
1030 -538 4350 2036 -5861 -3121 6810 4208 -6798 -4624 5915 4358 -4884 -3545 3319 1806 -2244
1045 -2244 -172 991 -2117 -512 3686 128 -5115 -108 5879 336 -5763 -214 5253 154 -3957
1060 -3957 550 2799 -1154 -1092 2392 -90 -3439 1125 4398 -1698 -5106 1724 5045 -1710 -4767
1075 -4767 1277 3412 -1260 -2022 1135 70 -1499 1713 1987 -3188 -2651 4399 3480 -4721 -3886 4693
$$ packed form
972B736j0549J187J5399J352j8622m172J9358O702j7837q443J4415Q659r559p341
986f715M317M494Q71k83n101m340P800R118q953j3028Q501J5677o940j6375M593
1001f364J5226k153j2284j0P854J211k720j421k637N61P254J175j0872l358J2989
1016D451N314j3224o840J2293P225r813o591O973M724l873j848J132j534J073
1030e38M888k314p897K740R931k602j1006K174J0539j557r242J339O864j513m050
1045b244K072J163l108J605M198l558n243N007N987n543o099N549N467n099m111
1060c957M507K249l953O2L484k482l349M564L273o096l408O830L321o755l057
1075d767O044K135m672p62L157j065j569L212K74n175N37P050r19q201Q35Q579
$$ plain form
1091 4693 4232 -3732 -3676 2802 2978 -1400 -1377 189 -516 695 2337 -1264 -4378 1090 5685 -805 -6822
1108 -6822 -112 6711 793 -6105 -1623 4712 1916 -2795 -1673 656 1206 1655 258 -3305 -1547
1123 -1547 4754 3306 -5092 -4443 4984 5505 -4030 -5719 2666 5101 -1291 -4072 -226 2004 1092 -55
1139 -55 -1868 -2478 1663 4322 -1264 -5907 322 6673 728 -6509 -1565 5808 2437 -4166 -2385 2530
1155 2530 2327 -372 -1257 -1377 114 2881 1461 -3777 -2998 3972 4076 -3828 -5020 2820 4986 -1987
1171 -1987 -4733 711 3412 117 -1969 -851 128 1093 1715 -778 -3181 382 4391 504 -4755 -971
1187 -971 4835 1721 -4086 -1918 3130 1827 -1859 -1349 530 411 473 486 -1455 -1765 1740 2558 -1985
1204 -1985 -3285 1616 3503 -1341 -3387 877 2825 -436 -1867 304 978 -69 273 430 -1060 -616
$$ packed form
1091D693m61p964N6O478J76m378K3J566p05J211J642l601l114N468M595o490o017
1108f822O710O823n918o898M482O335k796m711J122K329N50M49j397l563J758
1123a547O301j448q398O49R427N21r535j689Q385K435o392k781L846K230r12j147
1139e5j813o10M141K659n586m643O229O351n945p237M944P373l371o603J781M915
1155B530k03k699q85j20J491K767j420n238P79O970J04p904j192P840K166o973
1171a987k746N444K701l295k086J118R79R65O22k493k403L563M009l887n259L784
1187i71N806l114n807K168N048j303l686N10J879j19O2J3j941l10L505Q18m543
1204a985j300M901J887m844k046M264J948l261j431K171O74j047L42J57j490M44
$$ plain form
1220 -616 1990 1064 -2355 -1335 2403 1557 -2319 -1677 1814 1239 -1422 -894 720 35 -469 534 48
1237 48 -1384 -23 1907 27 -2205 -119 2360 412 -1999 -343 1704 408 -869 -20 387 -238
1253 -238 289 747 -714 -1271 926 1638 -1042 -2077 747 1916 -589 -1896 93 1294 80 -865
1269 -865 -372 41 373 679 -123 -1214 -70 1810 650 -1786 -796 1801 1369 -1366 -1398 900 1406 -236
1287 -236 -1154 -384 553 725 -129 -1148 -660 979 1088 -981 -1606 469 1566 -119 -1682 -411 1289
1304 1289 798 -765 -970 366 1143 470 -853 -796 697 1267 -226 -1294 -163 1209 511 -890 -851
1321 -851 401 913 -66 -997 -636 629 823 -557 -1170 95 1170 201 -1126 -356 867 512 -424 -375
1339 -375 143 408 375 -2 -365 -177 687 506 -789 -695 705 752 -741 -785 581 509 -660 -381 438 -96
$$ packed form
1220f16K606r26l419J020L738q46l876O42L491n75k661N28J614o85n04J003m86
1237D8j432J361J930j880k232K086K479j948k411J656K047j296j277Q49M07o25
1253b38N27M58j461n57K197P12k680j035K824J169k505j307J989J201j214r45
1269h65M93M13L32L06q02j091J144J880j160k436R90K597m32k735l2K298N06j642
1287b36r18P70R37J72q54j019M88J639J09k069o25K075J097j685j563J271J700
1304A289m91j563k05J336P77o73j323N7J493N70j493j068J131J372o98j401L9
1321h51J252N12r79r31L61J265J94j380o13J265J075r69j327P70J223l55r36M9
1339c75N18K65l3l77l63J88Q64j81j295R4J400M7j493m4J366p2j169K79Q19n34
$$ plain form
1359 -96 -604 171 483 -526 -520 780 517 -851 -347 980 331 -858 53 953 -192 -729 672 751 -878
1378 -878 -549 1208 525 -1376 -448 1357 203 -1506 -278 1134 -146 -1006 290 600 -712 -274 1008
1395 1008 -83 -1324 395 1726 -524 -1816 750 2017 -679 -1733 886 1603 -700 -1031 806
1410 806 571 -797 117 904 -776 -1049 1238 997 -1842 -1241 1968 1031 -2303 -1123 2138 839 -2029
1427 -2029 -555 1732 166 -1233 395 950 -805 -354 1447 52 -1800 428 2255 -619 -2452
1442 -2452 863 2511 -1074 -2487 1106 2097 -1267 -1699 1168 990 -1350 -462 1150 -412 -1239 1084
1458 1084 1207 -1774 -1068 2363 1123 -2662 -844 2998 856 -2854 -529 2739 373 -2268 56
1473 56 1669 -442 -1040 900 222 -1606 409 1931 -1210 -2588 1509 2770 -1907 -3148 1949 3064
$$ packed form
1359i6n08P75L12j009OJ300k63j368N04J327o49j189R11R00j145n37J401P9j629
1378h78L29J757o83j901R28J805j154j709J228J412j280q60J296L10j312M38J282
1395A008j091j241J719J331k250j292K566J267k696j054K619P17k303l31J837
1410H06k35j368R14P87j680k73K287k41k839O01L209r37l334J180L261j299k868
1427b029J474K287j566j399J628N55j755M51J801j395j852K228J827k874j833
1442b452L315J648l585j413L593R91l364m32K867j78k340Q88J612j562q27K323
1458A084J23k981P06L431j240l785J818L842k142l710K325L268k366k641K324
1473E6J613k111n98J940o78j828K015J522l141j378M097J261m677j241N097J115
$$ plain form
1489 3064 -1888 -2713 1654 2247 -1333 -1330 1134 444 -689 908 678 -1822 -575 2883 702 -3611 -858
1506 -858 3988 969 -4129 -1222 3625 1039 -3087 -1022 1961 395 -1081 243 -161 -1194 1010
1521 1010 2120 -1753 -2987 2176 3703 -2171 -3981 2175 4133 -1653 -3615 1280 2926 -789 -1646
1536 -1646 504 253 -363 1112 383 -2545 -796 3494 1093 -4303 -1521 4357 1796 -4175 -1924 3549
1552 3549 1780 -2658 -1176 1614 382 -471 723 -301 -1697 1019 2915 -1293 -3641 1468 4231
1567 4231 -1313 -4277 1078 3860 -902 -3283 672 2076 -790 -1026 805 -392 -1295 1455 1520 -2458
1583 -2458 -1905 3022 2284 -3228 -2201 3320 2128 -2840 -1539 2555 942 -1949 45 1557 -911
1598 -911 -1122 1838 744 -2590 -605 2982 237 -3353 -159 3131 -301 -2871 529 2288 -1079
$$ packed form
1489C064m952q25M367N93l580LK464o90j133J597k30k500J247L458k181m313K753
1506h58M846l019n098K907M847k586m126K065K983j566j476J324m04j033K204
1521A010J110l873j234N163J527n874j810O156J958n786j962M895J646l715q57
1536a646K150k51o16J475p29k928J749M290k401n396K782N878k561n971K251N473
1552C549j769m438J482K790j232q53J194j024j396K716J896m208k348N109K763
1567D231n544k964N355K782m762k381L955J404k866k36J831j197r03K750O5l978
1583b458N53M927p38n512J027N521j192m968J301M094j613k891J994J512k468
1598i11k11K960j094l334J985L587k745l590L194L290l432k570L400J759l367
$$ plain form
1613 -1079 -1697 1564 1015 -2141 -404 2671 69 -2766 463 2965 -638 -2590 1059 2228 -1199
1628 -1199 -1455 1547 710 -1883 76 2154 -961 -2633 1412 2776 -1895 -3005 1898 2702 -1958 -2429
1644 -2429 1648 1578 -1384 -698 1066 -443 -833 1670 950 -2581 -961 3486 1208 -3845 -1401 3893
1660 3893 1615 -3500 -1568 2697 1122 -1794 -639 611 -297 235 1253 -1156 -2481 1504 3353
1675 3353 -1727 -4114 1467 4482 -1053 -4189 629 3689 -40 -2505 -142 1180 293 456 25 -1867
1691 -1867 -469 3049 1155 -3935 -1998 4174 2537 -4037 -2947 3260 2834 -2435 -2475 1284 1462 -250
1707 -250 -387 -645 -1091 1255 2498 -1338 -3564 1255 4504 -752 -4718 204 4541 353 -3773 -659
1723 -659 2606 786 -1274 -526 -301 -145 1511 811 -2612 -1787 3059 2481 -3315 -3069 2934 3184 -2441
$$ packed form
1613a079o18L261n49l156J737L075k602k835L229K502l603j952L649J169l427
1628a199k56L002q37k593J959K078l115j672M045J364m671j110M903Q04m660m71
1644b429M077p0k962O86J764j509l90K503p20l531J620M447k278n053K444N294
1660C893k278n115J932M265j575k916J155J250r08N32J018k409j325L985J849
1675C353n080k387N581L015n535l136M818L060l729k465K363J322q87J63m31j892
1691a867J398L518j894n090J937O172j637o574J090O207m26n269m0L759J78j712
1707b50j37k58m46K346J243l836k226M819L249n256l966M922M337m188m126L114
1723f59L265j820k060P48K25J56J656p00l423Q25M846n78n796K46O003K50n625
$$ plain form
1740 -2441 -3090 1791 2475 -947 -1438 407 247 145 1137 -198 -2205 232 3203 104 -3694 -420
1756 -420 3799 591 -3596 -885 2823 647 -2079 -419 889 -281 -143 910 -701 -1679 1166 2387
1772 2387 -1379 -2734 1460 2943 -1282 -2719 1201 2272 -895 -1456 954 557 -906 350 1099 -1153
1788 -1153 -1315 1733 1504 -2157 -1675 2156 1626 -2107 -1471 1749 908 -1499 -327 1025 -538 -672 1329
1805 1329 622 -1981 -442 2547 611 -2707 -574 2724 649 -2299 -444 1729 172 -1041 301
1820 301 242 -987 299 1525 -882 -2326 1032 2707 -1111 -3011 868 2882 -627 -2419 375 1790
1836 1790 -140 -814 167 -177 -160 1315 645 -2010 -1040 2629 1581 -2831 -1939 2611 2142 -2221 -2178 1461
1854 1461 1692 -847 -1132 -34 80 442 912 -847 -1973 820 2815 -582 -3373 283 3584 298
$$ packed form
1740b441o49M881O84l422m91J845j60j02R92j335k007K437K971l099l798L274
1756d20M219l208m187K711L708k176k726J660J308j170J38J053j611r78K845J221
1772B387l766j355M194J483m225j437L920J071l167n61K410l97j463J256P49k252
1788a153j62L048k29l661M82L831n30l733O36L220q41k407J172J352j563j34K001
1805A329p07k603J539K989j936l318K133L298k075k948J855K173j557j213J342
1820C01n9j229J286J226k407j444L358J675l818j900L879K014l509j792K794J415
1836A790j930o74R81l44J7J475o70k655R70L669j048m412Q92M550m69m363M3L639
1854A461K31k539k85J098J14L62M70j759j126K793J995l397k791L656L301l286
$$ plain form
1870 298 -3178 -531 2684 922 -1630 -834 555 584 523 21 -1509 -723 2062 1497 -2453 -2317 2218
1887 2218 2604 -1986 -2874 1291 2584 -722 -2086 39 1111 392 -83 -557 -963 624 1988 -302
1903 -302 -2585 -106 3063 692 -3034 -1025 2726 1342 -2025 -1386 1130 1050 -322 -539 -521 -248 1035
1920 1035 962 -1394 -1824 1445 2294 -1183 -2670 845 2536 -364 -2122 -16 1604 279 -661 -241
1936 -241 -115 150 1030 226 -1563 -619 1970 932 -2098 -1377 1817 1420 -1524 -1454 937 1018 -561 -616
1954 -616 41 -119 216 704 -325 -1341 353 1762 -85 -1943 -43 2039 364 -1643 -383 1214
1970 1214 440 -627 -182 43 -145 410 509 -849 -1018 940 1287 -952 -1616 754 1559 -473 -1407 161
1988 161 1024 12 -480 -82 -126 92 772 143 -1221 -342 1571 808 -1431 -929 1421 1149 -1000 -1064 569
$$ packed form
1870B98l476K647L215j762k552P96J389K9o1n02j530P86K785n65l950J36M535
1887B218L86m590q88M165J293l306j364K125J072p19m75m74m06J587J364k290
1903c02k283K479L169k371l726K009L751j384l367O39K516q0j372k17J8K73J283
1920A035p3k356m30L269Q49l477j487L515J691k900j758K106J620j325r40M20
1936b41J26K65Q80q04j789R44K589j038l030P21L194l97k944P0K391Q1j579n5
1954f16O57j60L35M88j029j016J694J409j847j858J900K082j675k007J260J597
1970A214p74j067M45K25j88N55R9j358j69J958L47k239o64K370Q05k032r34J568
1988A61Q63j012m92L98m4K18O80o29j364Q79J913p63k239N02K350k72k149o4J633
$$ plain form
2007 569 842 -131 -471 -296 -111 478 578 -606 -1229 474 1452 -362 -1753 -60 1690 326 -1408
2024 -1408 -585 1006 752 -340 -571 -200 415 740 41 -1072 -482 1198 956 -1215 -1350 882 1496 -607
2042 -607 -1510 76 1091 225 -800 -608 132 680 451 -635 -917 469 1364 -95 -1547 -218 1574
2059 1574 678 -1282 -882 884 1012 -313 -907 -189 642 573 -228 -912 -314 966 688 -968 -1212 582
2077 582 1329 -343 -1363 -140 1076 427 -760 -674 310 730 262 -538 -670 390 1057 14 -1101 -368
2095 -368 1082 689 -811 -853 536 875 -155 -835 -243 439 460 -199 -760 -299 723 536 -599 -866 280
2114 280 955 -12 -923 -248 795 514 -398 -554 176 587 356 -352 -517 172 754 144 -752 -415 639
2133 639 628 -472 -785 140 622 27 -568 -389 193 469 31 -605 -385 481 682 -304 -760 59 787 242
$$ packed form
2007E69K73r73l40J75J85N89J00j184o23J703R78j814j391J693J750j364j734
2024a408Q23J591k54j092k31L71O15L25o99j113N90J680k42k171j35K232O14k103
2042f07r03J586J015q66j025J92P40N48k29j086k82J386Q95j459j452J329J792
2059A574q96j960M00J766J28j325n94P18Q31o9q01o84N98J280k78j656k44J794
2077E82P47j672j020J223J216o49j187Q6R84M20m68q00j32J060O67j043j115P33
2095c68J450l93j500m2J389L39j030o80N92O82K1o59n61M61J022j87j135k67J146
2114B80O75r67r11O75J043k81r12j56P30M11k31p08j65O89N82o10q96L37J054
2133F39j1j100l13R25M82n95n95J79N82K76m38o36K20Q66K01r86m56Q19P28n45
$$ plain form
2153 242 -641 -315 441 537 -107 -447 -217 383 495 -172 -629 -84 660 285 -718 -547 508 517 -319 -666
2173 -666 -38 505 218 -279 -357 67 598 327 -446 -486 380 748 -110 -741 -8 715 275 -573 -399 297 493
2194 493 -76 -467 -271 217 444 -86 -694 -171 594 295 -572 -560 421 558 -187 -603 5 468 213 -200
2214 -200 -310 15 412 322 -294 -472 230 702 -97 -687 -40 627 146 -579 -352 314 325 -124 -342 -187 193
2235 193 284 -86 -463 -198 498 366 -483 -446 406 589 -188 -498 191 481 68 -173 -121 60 191 184 -147 -268
2257 -268 137 381 5 -520 -84 441 137 -516 -245 350 172 -209 -187 -5 -21 118 69 -185 -189 260 343 -192
2279 -192 -322 202 393 -118 -369 75 264 -5 -270 -43 57 -62 -57 17 -191 -102 253 87 -328 -177 381
2300 381 195 -315 -240 270 199 -119 -100 75 81 -21 75 -33 -153 101 279 -68 -378 51 340 -33 -338 11
$$ packed form
2153B42q83L26P56R6o44l40K30O00J12o67m57N45P44l75j003J71J055Rq36l47
2173f66O28N43k87m97p8M24N31k71p73m0Q66L68q58o31P33P23m40q48J74O96J96
2194D93n69l91J96M88K27n30o08N23P65k99q67J2R81J37p45m16O08M63k55m13
2214b00j10L25L97r0o16j78P02M72p99n90O47O67m81p25K27O66J1m49k18J55L80
2235A93R1l70l77K65O96j32q49L7Q52J83p77l10O89K90m13k41N2J81J31pl31j21
2257b68M05K44l76n25M36N25l04o53K71N95j78l81K2J82j6J39m9k54mM49Q3n35
2279a92j30N24J91n11k51M44J89k69k65K27J00j19NP4k08Q9L55j66m15J51N58
2300C81j86n10P5N10p1l18J9J75Oj02R6j08j20K54J78l47l10M29K89l73l05L49
$$ plain form
2322 11 262 -14 -268 -89 -11 -93 25 16 -126 -142 164 166 -223 -284 241 251 -184 -263 236 281 -132 -174 135 136 26
2347 26 40 -2 -163 0 200 -28 -332 -64 321 5 -411 -138 304 40 -311 -114 200 37 -43 -46 -78 -40 188
2370 188 141 -174 -183 293 366 -196 -350 227 364 -123 -278 105 202 -85 -145 -17 -2 -13 139 -84 -296 8 343
2393 343 -10 -415 -85 390 117 -331 -171 265 200 -136 -41 68 141 65 35 -127 -157 217 239 -220 -364 205
2415 205 317 -180 -417 56 314 -109 -249 -46 117 82 14 -19 -156 27 278 6 -309 -54 466 183 -354
2436 -354 -117 384 251 -205 -140 100 138 -29 -33 -78 -117 125 144 -243 -353 172 318 -195 -495 58 391 -60
2458 -60 -315 12 266 64 -24 -8 -16 119 210 115 -206 -105 371 208 -318 -253 318 253 -223 -266 89 140 -129 -161
2482 -161 -34 -48 -11 99 -92 -247 -35 336 -18 -398 -14 338 75 -306 -81 254 74 -115 2 -1 -39 56
$$ packed form
2322A1K51k76k54J79P8q2J18rj42j6L06Kl89o1N25J0m35p9M99M5m13m2L09Jj10
2347B6J4m2j61J63K00k28l04K68L85l16m16K73M42k64l51J97L14j63q0ll2L8K28
2370A88m7l15rM76P3n62j54N77J37m87j55L83R7k87o0J28J5j1J52k23k12L04L35
2393C43l53m05L30M75k73m48J60M36o5l36R5J09P3p6l0j62l0L74K2m59j44N69
2415B05J12m97k37M73K58m23j40K03J63l5o8l3j37J83K51k72l15K55N20k83n37
2436c54K37N01j33m56O5K40L8j67mm5l9K42J9l87j10N25J46n13l00N53L33m51
2458f0k55L27K54k02q8J6qJ35R1r5l21J01M76j63n26O5N71o5m76m3L55N1k69l2
2482a61J27j4L7J10j91j55K12L71l54l80L84L52k63l81K25L35j80j89J17ll8R5
$$ plain form
2504 56 110 -158 -244 158 281 -189 -350 148 340 -113 -300 13 199 -23 -130 -13 15 -8 97 69 -235 -36
2526 -36 294 113 -320 -195 308 199 -252 -231 182 173 -171 -184 -8 39 19 27 -105 -223 90 208 -75 -409 17
2549 17 382 23 -335 -87 256 139 -155 -76 82 86 68 77 -116 -54 230 114 -226 -303 185 329 -194 -381 67
2572 67 201 -48 -276 -114 91 77 -29 -79 -122 49 192 62 -321 -32 307 200 -301 -180 301 276 -142 -222
2594 -222 85 187 63 -110 -99 -24 112 102 -133 -291 50 230 -55 -343 -130 302 54 -290 -174 152 147 -71
2616 -71 -130 -63 85 221 25 -180 -75 196 279 -181 -235 119 309 -117 -289 -37 252 7 -190 -132 10 88
2638 88 43 -176 -219 17 215 47 -288 -137 313 207 -229 -245 218 248 -13 -198 -39 187 130 -2 -101 -98 122
2661 122 185 -77 -288 53 280 26 -337 -116 193 107 -200 -211 56 120 8 -188 -94 38 173 67 -206 -182
$$ packed form
2504E6N4k68q6M02J23m70j61M98J92m53j87L13J86k22j07J17K8k3J05k8l04J99
2526c6L30j81m33J25N03j09m51K1M13rl44j3J76M7k0Qj32j18L13J18k83l34M26
2549A7L65l59l58K48L43j17k94P9J58Mj8Rj93O2K84j16l40p7M88J44n23j87M48
2572F7J34k49k28J62K05j4j06n0m3J71J43j30l83K89L39j07n01J21M81k5m18q0
2594b22L07J02j24j73J1P5J36j0k35j58L41J80k85k88K13M32k48l44J16L26nk18
2616g1n9O7J48J36j96k05J05K71Q3m60n4L54J90m26j72K52K89k45j97N8J42P8
2638H8m5k19m3K36J98j68l35J51M50j06m36j6M63L0k61j85J59K26n7j32r9LK20
2661A22O3k62k11L41K27k54l63K21L09q6l07j1K67O4j12j96R4J32J35j06k73K4
$$ plain form
2683 -182 141 296 -78 -252 39 302 39 -240 -139 149 130 -78 -177 -94 65 43 -94 -227 -77 197 134 -260
2705 -260 -251 139 266 -98 -241 43 224 2 -172 -46 100 113 39 -67 -122 55 219 -18 -266 -64 218 103
2727 103 -225 -236 130 220 -130 -227 23 104 37 -92 -113 -102 76 122 -53 -211 77 269 18 -284 -66 256 59
2750 59 -155 -93 120 153 -25 -41 -56 -36 73 68 -160 -186 81 192 -131 -300 -32 238 -61 -236 -24 162 101
2773 101 -20 27 10 87 51 58 -118 -47 168 137 -162 -164 147 176 -147 -200 56 61 -23 -134 -30 2 7 64 3 -220 -53
2800 -53 207 65 -214 -68 223 154 -192 -101 143 94 -56 -10 15 -9 67 64 -63 -171 52 176 -57 -283 33
2823 33 269 -13 -218 -81 150 49 -117 -39 12 6 25 62 -156 -70 196 190 -156 -184 172 217 -84 -150 96 170 -54
2848 -54 -94 -15 24 23 58 19 -162 -34 161 30 -264 -148 218 117 -211 -153 142 43 -127 -57 55 35 38 55 -28
$$ packed form
2683a82L23J55l74j74K91K63k63k79J01K88j9k08r9Q3J59k2j37j33J50K74o3l94
2705b60RL90J27l64j43K84J81k22j74J26J46J3p4j06n5J77J64k37k48K02K82j15
2727A03l28j1L66R0l50r7K50Q1o7j29k1J1J78M6j75j58K88J92k51l02K18L22j97
2750E9k14O2K13L3j78j6j5K0J09nk28k6K67J11l23j69K68K70k99j75K12J86o1
2773A01j21M7j7P7l6Pj76P1K15l1k99kL11K9l23n3K56Nq4j11J04L2NN7o1k23J67
2800e3K60j42k79J46K91o9l46R1K44m9j50M6K5k4P6lj27j08K23J24k33k26L16
2823C3K36k82k05J37K31j01j66P8N1oJ9L7k18Q6K66ol46k8L56M5l01o6K46P4k24
2848e4m0P9L9jL5l9j81J28J95j31k94J16L66j01l28N8K95r9j70P0J12k0LJ7q3
$$ plain form
2873 -28 -137 54 187 -57 -182 81 269 -35 -249 -20 215 17 -150 -14 17 -74 -19 8 -100 -62 88 118
2895 118 -158 -143 181 158 -82 -157 158 158 -81 -55 88 33 -57 10 53 -58 -55 143 -6 -172 -116 114 39 -273 -60
2920 -60 115 49 -183 -19 83 -28 -85 57 59 -85 27 154 47 -133 48 182 14 -105 70 170 -40 -79
2942 -79 68 21 -91 23 118 -33 -185 20 142 -120 -221 73 138 -129 -131 25 78 -67 -27 95 -54 -88 83
2965 83 160 -67 -64 182 150 -156 -118 128 125 -97 -61 117 -20 -74 -25 -2 -121 -105 108 30 -257 -30 201 29 -214
2990 -214 -1 216 13 -146 1 98 44 -23 57 -34 -21 93 105 -120 -193 169 128 -161 -223 75 133 -39 -90 14
3014 14 82 0 -10 -29 -6 11 68 -1 -146 -59 241 148 -225 -102 175 150 -92 -72 44 62 -35 -11 -50 -64 6 152
3040 152 -95 -223 11 137 -48 -225 9 170 -8 -229 -25 35 -26 31 14 23 2 116 146 -132 -81 171 152
$$ packed form
2873b8j09J91J33k44j25K63J88l04k14K29K35j98j67J36L1r1N5K7j08L8J50L0
2895A18k76J5L24k3k40p5L15%k39K6J43n5r0O7M3j11LJ98j49j66N6K30p5l12K13
2920f0J75o6k32J64J02j11n7J42Kj44J12J27j07j80J81J34j68j19J75J00k10l9
2942g9J47m7j12J14R5j51j52K05J22k62j01K94O5k67kJ56N3j45M0J22j49l4J71
2965H3P7k27LK46l2l06L8K46lk22L6J78j37n4M9K3j19J6K13p8k87K27K31j72k43
2990b14K13K17k03j59J47R7n4o7Q0r1J3J14J2k25p3L62m1k89o2K98N8j72n1J04
3014A4O8q2j0j9K3J7N7o9j45Q7L00r3l73J23K77k5k42K0J16J8r7K4l9j4P0J46
3040A52k47j28K34J26j85j77K34J61j78k21K04O0o1N7j7Rk1J14L0k78N1K52j9
$$ plain form
3063 152 -100 -173 126 148 -69 -113 18 13 -14 -27 -42 -113 -63 59 -48 -194 -108 203 64 -176 -43 159 34 -59
3087 -59 -72 57 71 47 90 30 -8 144 173 -96 -171 97 231 -120 -263 -21 155 -10 -182 -63 16 12 40 -65
3111 -65 -109 -86 180 63 -197 -152 155 222 -174 -191 118 180 -73 -106 -12 53 106 43 -64 -136 45 149 -57 -250
3135 -250 -34 219 21 -262 -126 175 117 -108 -100 51 99 50 -5 -74 -21 189 167 -115 -238 153 233 -72 -228
3158 -228 64 259 -7 -193 -51 88 82 -56 -74 -165 17 113 -6 -242 -97 198 86 -222 -166 194 199 -108 -129
3181 -129 25 162 66 12 -80 -30 86 123 -111 -192 54 271 -9 -237 -42 285 30 -285 -83 96 47 -48 -91
3204 -91 -89 -28 118 48 -190 -128 207 194 -151 -220 154 208 -7 -179 18 181 65 -34 -80 -59 36 156 0 -250
3228 -250 -26 170 84 -264 -142 177 91 -181 -157 109 76 -23 -54 -92 9 129 109 -138 -128 136 199 -74 -183
$$ packed form
3063A52k52p3K99K2k17m4J31nk7j3j5p1N0J22j07j46Q6L11j39k40J33K02j25r3
3087e9j3J29J4k4M3o0l8J52K9k69p5K68J34l51j43K42J76j65j72J19P9mK8j05
3111f5m4K3K66j17k60M5L07O7l96j7L09O2k53l3R4O5N3o3j07p2J81J04k06j93
3135b50K16K53j98k83J36L01n8k25QJ51M8m9n5o9N3K10k2k82j23L91Q0l05j56
3158b28K92J95k66j86J42J39oj38j8r1J82R6j19k36J45K95j12l08N6L60Nl07k1
3181a29J54J37r6n4r2N0J16L7k34q1K46K17k80k28J95L27k55l15K02J79m9r5m3
3204i1KO1J46p0k38O2L35j3l45o9L74N4k15j72J97J63j16r9m6K1R5J20j56k50
3228b50K24J96q6l48J22L19q6k72K4K66l3r9l1l8J01J20k0k47J0K64O3k73j09
$$ plain form
3251 -183 35 240 25 -185 -58 175 110 -27 -57 -105 0 128 51 -222 -111 201 103 -189 -204 169 220 -88
3273 -88 -184 91 215 49 -46 -82 32 139 99 -54 -191 64 219 -32 -243 -86 210 88 -171 -140 61 83
3295 83 -111 -140 -61 -22 103 -16 -175 -64 174 247 -108 -226 133 275 44 -163 1 214 102 -89 -103 -15
3317 -15 57 44 -67 -140 -10 149 31 -238 -159 213 165 -161 -139 34 154 -107 -139 -53 67 111 33 -80 -95 170
3341 170 157 -129 -266 34 191 13 -249 -97 132 152 -64 -120 2 93 57 -111 -150 0 202 80 -180 -116
3363 -116 144 167 -65 -214 46 229 9 -118 -34 105 45 59 -142 -109 96 156 -66 -241 -60 202 75 -201
3385 -201 -120 88 154 -94 -190 -22 102 54 -98 -96 -32 156 56 -127 -147 92 223 -6 -197 -25 202 85 -127
3408 -127 -128 30 197 -5 -111 -94 34 153 -31 -187 -58 123 96 -165 -237 100 158 -27 -192 -54 174 94
$$ packed form
3251a83K18K05k15k10J27K33o5j37l0m8J05J28p7k73J11L12r8k92j5L73N1l08
3273h8r6K75J24j66r5l6J14J07m0j53j37K55J55k51k11J57K96j22k59L1K01K2
3295H3j94k9P9L9J25j19j59J11K38P3l55j18L59J42k31k07J64K13j12j91j4Q8
3317a5P2j3j11p3J30J59j18k69P9L72m8l26K2J73J20k61l2Q6J20M4p8j13j5K65
3341A70j3k86j37L00J57j78k62J52K29K0k16n6J22R1l6j68l9J50K02j22k60O4
3363a16K60K3k32j49K60J83k20j27Q4J39o0J4k01L3K05O0k22j75J81K62j27k76
3385b01Q1K08O6k48r6J68J24m8j52KO4J88j00j83k0K39J31k29j91J72K27j17k12
3408a27jJ58J67k02j06J7J28J19j84j56J29J81k7k61p2L37N8j85j65J38K28q0
$$ plain form
3430 94 -30 -89 24 192 71 -63 -154 61 227 1 -236 -50 168 53 -79 -149 67 131 17 -120 -131 36
3452 36 107 42 -230 -121 110 209 -76 -157 76 224 38 -164 -33 109 119 -34 -140 -23 123 94 -55 -187
3474 -187 28 221 34 -233 -71 173 142 -192 -162 -21 142 28 -66 -152 89 146 64 -194 -125 120 168 -59 -178
3497 -178 -8 163 88 -110 -88 81 181 -23 -112 -82 126 55 -61 -248 -53 157 87 -91 -118 66 147 -31 -207
3520 -207 -25 124 105 -78 -127 42 155 74 -118 -155 143 156 -49 -187 -76 226 89 -186 -135 71 106 -31
3542 -31 -135 -88 41 86 -60 -173 -53 192 137 -120 -177 58 137 -10 -163 -75 155 103 20 -86 56 133 83 -82
3566 -82 -141 43 153 27 -127 -67 103 145 -99 -223 3 50 -5 -77 -116 -3 117 -18 -150 -61 129 93 -108
3589 -108 -169 33 158 43 -200 -32 94 95 -76 -170 -79 110 84 -31 -184 -32 124 9 -113 -150 104 119 -65
$$ packed form
3430I4j24n9J13J68j21j34r1K15J66k26k37J86K18j15j32p0K16O4j14j37j1J67
3452C6P1o5k72J09K31R9k85q1K33J48j86k02J31J42J0j53j06J17J46k9j49j32
3474a87K15J93j87k67J62K44l1l34L0J41J63j14r4q6K41N7q2k58O9K45M8k27j19
3497a78J70J71p5j98K2J69J00k04q9L0K08p1j16j87J95K10p0j78k7J84Q1j78j76
3520b07J82J49j9j83m9J69J13q1j92l7K98J3k05j38J11L02j37k75N1K06L5j37
3542c1j04M7J29M5j46j13J20K45n5k57n7K35P9j47j53Q8K30n2q3j06J42P7n0j65
3566h2n9J84J10j26j54O0J70M2k44j24K26M7n5p2l9J13J20j35j32Q9J90l6k01
3589a08o1K02J25j15k43J68J26Jj71r4R1J89k6j15j53J52J56j15j22l7K54J5j84
$$ plain form
3612 -65 -143 -9 161 56 -62 -44 25 157 4 -122 -69 109 80 -11 -139 15 141 -1 -98 -46 24 121 -14 -167
3636 -167 -70 12 84 -62 -149 -30 90 34 -89 -131 69 118 -32 -90 -37 114 96 -65 -109 54 165 37 -107 -51
3660 -51 91 122 9 -105 -49 103 8 -140 -111 44 98 3 -164 -3 72 70 -52 -103 -50 85 80 -107 -125 66 123
3685 123 -12 -91 -28 98 78 -65 -118 -16 107 25 -49 -51 37 57 5 -118 -70 89 34 -153 -105 19 66 -4 -132
3710 -132 -59 45 105 7 -74 -17 58 62 -31 -100 18 143 -3 -97 -81 81 20 -105 -93 -28 75 76 -62 -43 18 89 -5
3737 -5 -57 -62 120 90 -69 -108 40 106 31 -77 -44 84 58 -44 -128 -14 62 57 -92 -72 17 90 -34 -128 -83 25 86
3764 86 -89 -51 -51 69 48 -79 -39 -31 65 -25 -129 -31 63 85 -8 -33 36 120 52 -112 -32 61 103 38 -130 -65 80 17
3792 17 -49 -72 29 51 29 -42 -98 53 78 -31 -103 -23 101 28 -18 -22 13 96 22 -46 -49 99 74 -47 -106 -15 87 -1
$$ packed form
3612f5p8J34J70j05j18J8O9J32j53j26N3J78k9r1j28J54J26j42r7N2P0R7j35j53
3636a67R7Q2P2j46q7J19J20n6j23m2K00M9j50n8N3J51j8j61m4J63J11j28j44N6
3660e1J42L1j13j14N6J52r5j48K9J55N4r5j67J61P5kj22n1N3J35nj87j8J91N7
3685A23j35p9O3J26k0j43n3J02J23q2p4kQ8K0n2j23M8J59n5j87M8J24M7p0j28
3710a32P3J04O0r8q1N7P5Mr3o9J18J25j46r4J6J62o1j25J2O5J03Jj38J9O1P1r4
3737en2nJ82l0j59l9J48O6p5j08L3J28k6j02q4J14P6nj49K0Q9P3j24r4M5J08O1
3764H6j75L8%J20k1j27M0QR6r0j04R8R4K2r3k5O9Q4o8j64Q0R3M2o5j68O5J45o3
3792A7o6k3J01K2k2p1n6J51K5j09p2Q0J24p3m6mL5Q3p4o8lJ48k5j21n9R1J02q8
$$ plain form
3820 -1 -94 -66 11 46 -22 -43 -10 78 51 -18 -49 -33 48 25 -93 -21 91 79 -34 -54 25 57 46 -23 -44 18 62 35 -91
3849 -91 -52 26 13 -12 -97 -25 64 42 -68 -44 24 49 1 -28 -52 43 48 4 -19 -18 33 0 -27 -83 56 101 -50 -50 -21 42
3879 42 40 -25 -67 -10 24 -4 -38 -63 -18 43 -51 -104 -33 72 45 -59 -73 45 121 14 -60 40 67 93 -28 -57 13 56
3907 56 24 -47 -70 56 81 -29 -59 -56 -1 62 -78 -152 -11 33 -6 -69 -111 -40 77 -53 -104 -37 60 92 -40 -28 15
3934 15 55 31 -23 11 77 99 -64 -35 -22 24 33 -45 -68 -8 66 -31 -111 -18 16 44 -54 -89 -9 90 38 -50 -15 6 108 31
3964 31 -101 -51 98 24 -28 -105 0 99 -9 -57 -94 52 5 18 -95 -52 48 0 -45 -47 -1 97 53 -11 -13 24 74 -33
3992 -33 -11 -5 94 46 -8 -34 88 30 7 -5 -17 53 67 -15 -86 -10 12 9 -78 8 56 58 -21 -68 18 51 10 -55 -57 -4 33 1
4024 1 -71 -7 11 97 33 -66 31 109 89 -31 -15 24 0 -2 -90 -27 22 22 -6 -115 -39 62 13 -54 -62 31 59 -20 -92 -17 64
$$ packed form
3820ar3K8P7L5o8k1L3Q8k7o9l1J6Q1k3j18P2J12j2j13k0P9L2j1o9k1O2M4k7j26
3849i1L9P8j3k5q5P2Q9k2j10K4O8K5m8k9k4R5Nm4k3JN1l3k7n6J39M5j51%K9O3
3879D2ko5m2N7L4k8l4k5M5O1r4n3P1J05k7j04j4J18P6j07p4J00K7K6j21k9P0M3
3907E6l2p1k3J26K5j10l0LN5O3j40p4J41M4l9o3m2P1J17j30n1O7R7L2j32J2M3
3934A5M0k4n4L4O6K2j63K9J3M6Rp8k3O0P4r7q0R3L4K8r8l5Q0R9n2q8L5K1J02p7
3964C1j32N0J49p4n2p7J05R9j08m8l7J46m7J3j13M3J00m8m5kM6R8m4o4kL7N0j07
3992c3K2OR9m8n4k6J22n8k3j2j2P0J4q2p1P6K2lq7Q6M8Kp9m7Q6L3m1o5kN3L7l2
4024Ap2O4J8Q6o4r9R7P8k0j20J6L9k4kq8O3M9%k8j09P6J01m9o7qR3K8p9p2P5Q1
$$ plain form
4055 64 53 -11 -38 21 -13 40 -26 -45 60 18 23 -49 5 39 19 -101 -99 19 61 -10 -17 -45 42 20 -39 -79 12 57 31 -64
4085 -64 -63 18 59 -2 -80 -24 47 83 33 -23 20 3 -1 -6 -62 40 2 4 -81 -86 60 48 -43 -35 18 74 -9 -75 -36 13 48 -35
4117 -35 -34 8 29 38 6 -24 -25 73 -15 -1 -49 32 20 -31 -84 -37 32 -14 -88 -55 -49 47 -47 -41 -9 16 70 -4 -26 8 81 34 -36
4150 -36 17 116 31 52 -22 -48 86 79 -9 -51 1 20 64 -45 -3 -13 72 -20 -101 -49 52 7 -16 -57 -27 59 0 7 0 41
4180 41 73 9 -49 -20 37 57 -52 -91 19 30 42 7 -43 35 97 -24 -93 -42 44 -4 -94 -102 17 74 -47 -64 -2 74
4208 74 57 -33 -63 -50 38 -55 -27 -1 20 11 -19 -9 1 62 -1 8 -11 -11 23 -25 -27 -45 23 26 -40 -55 -11 56 16 -56 -61 13 68
4241 68 48 -78 -17 51 42 -11 8 18 37 11 -34 0 5 20 14 -53 -62 5 21 -33 -42 45 13 30 -36 -61 18 21 4 -60 -70 29 71
4274 71 -89 -9 48 82 67 -35 -96 31 57 -42 -41 13 47 41 12 -67 -20 -1 -5 -88 -25 6 36 -29 -10 -1 38 -10 -77 -52 38
$$ packed form
4055F4j1o4k7N9l4N3o6j9J05m2Np2N4L4k0j20KJ18M2p1pk8Q7k2n9m0R1M5k6r5
4085f4JQ1M1o1p8N6P1L6n0n6M3j7mnn6J02l8Kq5nJ46j2r1QN3N6q3o6L9M9L5q3
4117c5JM2K1Rl2l0jR8q8J4m8Q1j2n1n3M7O9m6p4L3OR6r4OL2K5N4p4k2L4P3m7p0
4150c6N3R9q5K1p4k6J34pq8m2N2J9M4j09M2j0Q5r2q1N2J01m5k3m1L0Q6n9PpM1
4180D1L2o4n8K9N7K0j09l9J10J1J2l5n0P8O2j21o9N1Q6m8r0qJ19N7j21j7O2P6
4208G4j7r0l0J3Q8r3K8K6K1rl0J0J0O1o3Rj9%L4m8kj8O8Lo6j5M4O7m0p2nP4N5
4241F8k0j26O1O8rn3J9J0J9k6m5L4NJ5oo7rO7J6n4rQ7l2J7o6k5P9Lj7o4j0R9M2
4274G1j60Q0N7L4j5j02o1J27K6r9JN4L4ok9p9M7J9mq3O3L1L0o5J9RL9m8o7K5R0
$$ plain form
4305 38 35 -23 -57 6 19 0 -6 -63 34 2 18 -57 6 10 52 -35 -76 5 52 -16 -31 -78 10 25 20 -57 -38 30 17 -58 -73 4
4337 4 5 3 -10 -50 53 75 -9 -34 20 35 84 -2 -10 35 36 60 -43 -55 -2 -1 -46 -48 1 23 46 -33 -10 13 70 38 -17 -58 -3
4370 -3 45 27 -37 -8 7 16 -5 -24 -35 8 -5 -13 -50 -25 7 -6 -41 -50 -2 4 -39 -44 35 83 -17 -36 -34 -49 7 -4 -51 -40 25
4403 25 2 10 -13 31 33 -1 -36 -26 56 74 26 -48 -23 -5 9 -19 -27 -52 38 8 -46 8 56 20 -20 -78 1 11 10 13 -29 6 19
4436 19 4 -5 25 -32 19 3 -12 14 66 19 -28 -29 -14 -6 31 -31 -10 30 13 7 -36 -31 44 34 -2 -15 43 42 -12 -31 0 -20 12
4469 12 -11 -74 17 -42 -27 -32 -19 -41 24 -37 -56 -57 -17 5 -52 -62 1 43 -14 11 -3 34 42 10 -32 -53 44 77 -36 -3 40
4500 40 58 -16 49 -23 33 11 -23 7 15 23 -14 -43 -48 -81 -24 -40 -3 -24 12 21 -30 -16 -7 -9 -4 4 9 -20 11 61 37 26 27 23 50 -23
4536 -23 -14 51 11 13 -41 -42 -23 5 -6 8 10 8 -65 -21 24 11 -50 -46 -21 -36 -9 -9 -39 33 -4 5 -14 -62 0 -6 -8 -5 27 -49 -6 6
$$ packed form
4305C8ln8l4O3J3j9on7R7l2J6p5O3MM2q7m1Q1M7o8j5m7Q8J5np7J9O8j3p5j5P7
4337DJkj3m0J03K2q4k5N4J5M9q6qM5JK4j03j2N3Jm5kM9K2K3p9K3K3N7l2n5m1N5
4370cM8j8o4K9J5Rk1j9j1M3j3ql7K5L2j3l5rM8Om3nP9M8j00j9Kj5N6j1m7J1O5
4403B5k3Qk3M4Kl4l5J0Q2J8m8p4K5J8J4k8qk5R0l0n4N4M8l6m0n8P9J0jLm2L5J3
4436A9j5rL0n7N1j6j5K6N2m7m7jJ5QL7o2K1M0j7om3NP5j0l6j3N8jn4j9L1k0L2
4469A2k3o3R1n9J5nJ3k2O5o1j9jM0K2n7j0O3M2n7K5j4L7Ql2m2k1R7L3j13L3M3
4500D0J8p4O5p2N6k2l4L0QQl7k9nl3N7j6L7k1L6Rn1J4RkNQNk9L1N0k4j1JmK7p3
4536b3RO5m0Kn4jJ9K8j1J4Kkp3M4M5j3o1MK5j5K7%l0P2l7Rj9m8O2okLL2p6M3J2
$$ plain form
4572 6 -46 18 42 -8 -78 -30 -28 8 -37 -9 -1 28 17 -19 34 44 -12 2 41 21 13 11 29 7 -43 23 0 -36 -60 -57 22 36 -91
4605 -91 23 -5 -7 20 -2 -75 25 17 -11 -23 -75 9 27 -7 -10 14 -14 2 -11 47 27 12 22 -2 -13 14 25 -26 -16 -4 49
4636 49 -39 9 -36 -35 -39 -52 -32 -26 35 -50 -8 0 -72 -15 16 42 33 -44 19 -16 0 -37 11 -34 -8 7 -10 -22 30 7 -25 -41 -11
4669 -11 -54 36 26 -19 -5 3 9 8 -58 65 -56 1 1 -22 12 8 9 -15 6 -4 42 36 -48 -26 24 -16 -12 -27 6 -25 -6 31 3
4702 3 12 -25 -29 18 15 106 -26 -34 16 36 28 27 45 52 33 1 38 36 -29 -33 -26 -40 -7 16 -28 -26 -37 -2 48 3 -16 -7 57 -22 -81 -36
4738 -36 -37 -6 -50 -7 2 -10 50 26 -28 -46 41 32 34 28 1 -7 8 -31 0 8 14 28 -33 -35 -5 31 -33 11 -21 -46 37 -5 18 21 4
4773 4 27 -11 7 63 8 -24 25 -27 -15 40 0 -10 9 -18 14 -65 -23 -11 8 -14 -27 7 9 -59 -9 5 47 35 21 16 -5 27
4805 27 -16 31 27 18 -7 25 -22 32 34 52 -60 -3 45 8 -17 35 -1 -22 25 -34 -50 -59 -31 50 -14 31 -3 -2 -8 -19 20 53 92
$$ packed form
4572Fn2O4K4n0p0M8KL6m5K8QK9j1l6N3J0n6J4L9k0qkJ8k2n0O6k3l6k4LP9J4j27
4605i1J14k8kK7k2p3J00qk8j2n2Q4J8l4lK4k8J6j3N8k0j5J0k4j1K7J1n1J0J2N3
4636D9q8M8m5Jmj3K0OO1q5M2Qp2N7L1K6rp7O3l5J6l7M8m5K6J5j7j2N2k3l2j6L0
4669a1m3R0j0m5J4QOjo6J23j21N7%k3L4mJk4K1j0M6oq4K2N0m0Mj5L3l1J9L7k8
4702CRl7mM7lR1j32qN0K0qjJ8Pj9l2L7ko5mPj4L3K3m4Kj1L5N0m5j9RO4p9n9M5
4738c6jL1m4M3Rj2O0k4n4j8Q7rKok7qJ5l9L1QOJ4o1kL0L6o4M4l2k5Q3m2K3Lj7
4773DK3l8J8N6n5l2M9n2J2N5m0j0J9k7L2p9M2J2J9k2j3L4Ko8N0J4M2j2j4nk1L2
4805B7m3M7mrk5L2m7N4KJ8j12N7M8l7k5N2l6k1M7n9j6rK8Q1o4M5l4Joj1L9L3L9
$$ plain form
4838 92 -5 -24 -21 34 5 -40 -4 16 24 44 -19 -11 22 15 -6 -54 -37 -32 -14 -51 -36 1 1 -7 10 -7 0 26 -10 -30 0 27 7 9 -2
4873 -2 8 -4 20 17 0 88 15 -45 -53 12 -13 -6 -50 32 23 -8 4 -3 27 28 39 -10 -66 -16 30 7 -5 -20 36 29 37 33 -53 31 6
4908 6 -73 -51 -51 4 -5 -59 16 4 10 -14 -30 -27 33 7 -30 8 -1 8 1 -13 -15 10 28 -10 -34 10 18 12 32 -2 -48 48 8 -32 7 54
4944 54 -15 -9 23 38 -24 1 -36 -23 -23 -50 -11 10 -37 58 14 -3 8 31 47 14 -27 6 18 20 17 -25 67 -20 -21 18 -49 -4 -6
4977 -6 -12 -27 -30 -26 -12 -72 -11 -40 37 13 -28 -10 43 -49 20 -27 -20 23 32 -5 -7 71 47 57 12 -29 -16 2 50 -40 14 21 6 -42
5011 -42 -83 33 -30 23 -33 11 -8 8 8 -67 16 -21 23 -22 -21 8 -31 35 -92 7 34 4 19 -29 -40 1 0 -10 -11 53 30
5042 30 21 -6 11 17 31 12 -26 -58 8 55 -32 -6 5 24 1 -26 14 39 9 23 -57 -6 27 -38 -27 -35 29 46 -17 7 -18 36
5074 36 -9 -75 -91 -25 17 -8 -38 21 -43 15 -19 9 15 79 24 -45 -4 31 -4 1 -17 -12 55 -2 -15 11 57 31 25 -27 -47 25
$$ packed form
4838I2r7j9LN5k9m5L6K0QK0o3QL3pk1m8J7NJ8l7J5L7%qJ7j7PK6l6k0L0K7k0Kj1
4873bJ0j2K4lj7Q8p3o0qO5k5Pm4Q2rl1J2pL0JJ1m9n6N0M6k3j2j5N6pQmq6Q4k5
4908Fp9K2%N5rn4P5j2Ok4j6LO0k6l7L8rRpj4kK5J8l8k4M4QoK0l4m6R6m0m0L9M7
4944E4o9OL2J5o2K5l7J3%k7L9K1m7R5m4j7J1K3J6l3m1L3J2Klm2R2q7jL9o7M5k
4977foj5lMJ4o0O1k9P7k4m1J8N3r2O9m7PM3Rl7kP8k4J0m5m1J3J8M8r0N4Pj5m8
5011d2m1J16o3N3n6M4j9J6%p5Q3l7M4m5JK9l9O6j27R9K7l0J5m8j1M1jj0jO4k3
5042C0rk7J7OJ4j9l8l2O6M7q7K6J1J9k3k7M0K5l0J4q0N1L3o5J1qO4J7o3K4k5N4
5074C6m5o6j6O6M2k5l0N9o4N8l4K8OO4n5o9M1L5l5Nj8NO7n7j3K6M6k6on2k0P2
$$ plain form
5106 25 37 23 7 -19 -6 14 -16 -43 62 21 -16 20 -3 -21 52 1 30 37 38 -41 20 13 -42 23 49 -36 -17 -18 26 4 5 -56
5138 -56 8 27 -42 21 9 -3 26 -12 -1 28 42 -3 -47 -50 31 36 -42 -50 -7 34 0 -38 -9 -37 45 -9 -73 -45 -6 0 -83 -17
5170 -17 -15 108 11 -12 -30 11 31 -28 -11 4 4 4 28 -17 -67 16 46 11 -25 9 17 -20 -60 -9 45 38 -58 -64 -16 15 -36 -84 -13
5203 -13 15 38 -33 -9 10 -10 23 -59 -9 119 27 89 23 -26 11 44 19 27 30 39 -4 -16 -25 6 45 -8 -69 -4 26 6 -20 -8
5235 -8 -5 1 -19 -21 -21 -51 1 -58 1 -15 39 32 -10 -18 -22 75 3 -2 49 -19 31 8 -9 11 33 27 49 -1 35 20 -56 -62 -1 14 30 -91
5271 -91 20 -2 -20 41 2 -34 15 -8 -5 -2 4 44 -39 -66 38 6 9 22 -12 -54 24 -32 -2 29 -15 9 29 7 23 43 8
5302 8 15 -40 42 -5 -20 -3 22 -19 7 17 -15 -40 16 -1 -25 -43 -54 -54 41 -81 -30 3 -1 -25 -7 -39 -47 18 -9 -16 -12 15 3
5335 3 24 37 56 0 -1 2 -39 29 -30 44 58 34 13 4 12 25 -21 61 -13 -42 -66 -29 -1 35 -7 -21 -3 -1 -44 -52 14 -18 2 42
$$ packed form
5106B5J2j4j6k6J3K0l0k7J05m1l7L6k3j8P3n1K9PJp9O1pn5O5K6q5J9jM4k2Jo1
5138e6O4J9o9O3j2j2K9l8J1K9J4m5m4lQ1Np8qM3M1l4l8K9k8Q2n4o4K8L9Oq3O6
5170a7KJ23r7k3j8M1K0n9J7J5%%K4m5n0Q3L0l5l6L4Ql7m0N1N4pr6oM8L1n1m8P1
5203a3K8K3p1K4J9k0L3q2N0J28r2O2o6m9L7L3k5QLRm3j2rL1L9n3o1O5L0k0k6J2
5235hLOk0k%l0N2n9N9j6N4pm2qmR7p2nN1o8N0k3j7K0K2oK2n0L6j5p6oO1J5J6j21
5271i1J11k2j8O1l9l6M9k3LLOM0q3k7J04l2LJ3l4m2P8n6L0L1m4K4K0k2J6K0l5
5302HPn5Q2m7j5J7K5m1K6J0l2k5N6j7k4j8j1%R5j22N1L3mk4J8l2qO5k7pMK7j2
5335CK1J3J9n6jLm1O8n9P4J4k4k1rQJ3m6Q2p4k9k4L7K8L6m2j4J8Km3qO6l2K0M0
$$ plain form
5369 42 -10 -13 16 -3 -43 -32 9 -3 -79 1 -11 -8 -34 3 37 39 -3 8 -1 25 50 0 -48 -11 34 53 21 -41 36 61 37 9
5401 9 -15 6 20 3 3 -12 34 -34 -2 -5 5 8 6 31 -59 7 38 -25 -29 -7 1 65 -25 -30 -15 32 -7 39 -12 -15 49 16 -15 24 22
5436 22 -26 -37 -41 21 6 -27 16 -39 34 -63 -18 2 -50 18 -28 -44 8 -16 -4 -31 -23 -26 -5 -3 -36 -31 -6 12 18 17 29 40 10 20
5470 20 -6 0 40 1 -22 -34 -10 1 -24 -19 -27 11 -10 8 -58 -14 44 -33 -19 -26 14 49 -30 -8 -26 51 49 26 -13 31 -22 -23 10
5503 10 -1 -62 -44 6 -43 4 -25 19 -33 -24 -41 49 -3 -34 -35 9 6 11 2 -27 17 47 62 -3 -22 52 -12 -58 28 -5 -15 -8 -32
5536 -32 2 -9 -18 18 -31 -17 -10 -12 8 -36 32 19 65 -20 -22 13 -24 -43 38 -2 68 45 -14 17 17 67 78 -11 -7 20 30 -11 -29
5569 -29 16 52 27 -28 -22 -9 -9 -23 -7 12 -2 0 -32 -56 -24 -2 -14 -16 5 51 21 -39 -13 24 11 -13 18 -30 -34 8 -17 -12 -21 -23
5603 -23 -6 19 -20 -1 -10 14 -36 -5 6 30 -53 -16 19 -6 31 -25 -37 25 38 -6 2 24 43 -17 -4 -51 14 14 -14 5 55 -66
$$ packed form
5369D2n2lK9j9m0J1M1j2p6Q0j2Lk6L7L4Km2J1rK6K5n0m8L7M5J9l2o2P7K5k4k8
5401Ik4K1J4j7%j5M6o8L2lJ0LkK5r0O6L1o3mK2QO4r0nJ5M7l9M6n1lO4l3l1L9k
5436B2m8j1mO2j5l3M3n5P3r7M5K0n2O8m6j6N2k4J2k7QlK1Kl3NK5J8OjJ2J1l0J0
5470B0k6OM0l9k3j2K4J1k5NqL8k1J8o6M4N8p7J4pM0L5p9K2j8P7kk3l9M4n3jL3
5503A0j1o1J8N0m9M7k9M4n2Rj7R0n2l1jM4lNrk9M4L0J5o5j9P4o4m6Q6l3j0Pk4
5536c2L4j1rL6m9J4PkK0m4O8j3M6q5kL5l7j9Q1m0P0k3n9L1%N0J1q9MK7J0m1j8
5569b9M5L6k5n5OJ3%j4J6J9j4Kl2k4L2K2j2kK1M6l0o0K6L7j3k4L1m8mM2k5Nrk
5603b3J7K5l9J9rK4n0L1J1K4q3L7L5k5L7n6j2O2J3m4QK2J9o0J3m7O5%k8J9N0j21
$$ plain form
5635 -66 -1 27 7 27 41 58 -12 -33 -3 69 18 7 12 22 -19 18 4 51 -5 -3 -45 -43 38 30 -29 -16 -28 -35 -15 -11 -38 9 15 -39
5669 -39 25 17 -1 10 3 53 13 26 -46 17 5 16 37 44 -16 47 24 7 -26 -26 -50 -7 30 26 -4 -36 7 -10 -30 -39 -7 -45 -16
5702 -16 -37 -20 10 29 -21 3 10 -54 -41 -23 72 69 8 -12 23 72 66 3 20 -7 -20 -19 30 -30 -5 9 10 1 -5 16 -32 -60 -2 14
5736 14 -16 0 -21 -19 -12 -10 28 -25 45 -5 14 -11 -7 -39 2 22 18 -24 -37 17 30 -37 -23 13 12 2 -25 3 70 53 -4 41 7
5769 7 11 -13 1 2 -13 27 6 19 -7 57 7 -28 -64 37 33 -13 13 24 13 29 7 -64 -51 -12 -4 -20 -25 -12 67 49 -19 66 68
5802 68 7 -30 44 39 29 3 14 43 -6 6 -35 -20 -11 20 28 -31 18 23 4 -17 -21 -12 50 24 -7 -10 -37 -4 -76 20 10 44 41 -6
5836 -6 2 40 17 -10 6 -6 19 -20 -37 21 -15 14 39 -23 -70 4 32 -15 -59 33 25 45 -51 -11 14 -10 -25 14 6 16 20 -22 77
5869 77 33 -58 -15 39 1 13 -36 -23 -72 -21 6 -2 20 21 -22 31 40 50 4 -9 -37 17 25 25 -3 1 -8 43 12 56 39 -19 -30 -1
$$ packed form
5635f6O5K8k0K0J4J7p0k1L0P2n1j1NJ0m1L7j4M7n6Km2KQ1qn9J3j2pK0Mk7M7On4
5669c9O4qj8J1pN0m0J3p2O3j2J1K1Po0O3k3j7l3%k4M3L7ml0l2M3j7k0rL2l8K9
5702a6k1J7L0J9n0K4Po4J3J8R5lo1k0L5M9oo3J7k7j3JM9o0K5J4JroK1m8k8N8J6
5736A4l0J6k1KPKL8n3P0n0J9k5Ml2M1K0mm2j3N4J3o7J4L6jj0k7K8O7j7n7M5l4
5769GMk4J4Jj5M0k1J3k6O4n0l5l6J01mm6K6J1j1J6k2p1J3L9Qj6nJ3P9j8o8Q5K
5802F8o1l7P4nj0k6J1K9m9J2m1J5RL1Qn9M9Nj9k1mRO2k6l1lk7L3p2R6j0L4lm7
5836fQL8k3k7J6j2K5l9j7N8l6K9K5o2m7P4K8m7m4R2qK0r6M0K5k4j5L9qJ0Mm2R9
5869G7m4r1M3N4l8J2m9J3m9N1K7qK2Jm3N3RJ0m6j3k8N4Q%k8MrN1l1M4j7n8j1K9
$$ plain form
5903 -1 39 21 11 8 -15 4 -50 20 -19 -27 8 -58 -30 5 11 34 -10 -19 13 -49 -60 -37 -32 50 52 42 -19 18 4 23 24 -13 10 3 -9
5938 -9 32 -17 -24 -20 11 -26 -33 24 -15 -12 7 -11 4 4 -25 -25 50 -47 -3 -9 -25 -44 1 9 -33 -28 -24 21 7 -1 10 -26 8 18 12 -8 -15
5975 -15 14 -20 -66 -15 53 15 -45 6 31 -11 26 62 19 4 36 2 33 12 8 35 39 12 -11 -23 1 -22 -7 -27 21 14 29 37
$$ packed form
5903aM0j8j0lk3J9n4P0l9qL5o6K8L5OK3m4rL2o2j1K3NQ2Kj0o1L7j4J9Jl7K3pj2
5938iM1m9pML1l7pN7l9LJ9j8J5%k9%P5r7M4oj6j9M5Qm2NMM5j4qJ1l6L4J0ok0p
5975a5K9l4m6N1O8l8o0N1K5m2L7L6m3j5L2l4L1k1mK7Mk7k3j2K4k3J5k0M8pJ5Q
$$ [...]
8191c5
##END NTUPLES=NMR FID
##END=
