##TITLE=1H_LY-DMAA-Per1.16
 CDCl3
 8 sc, 
 11.03.2022
##JCAMPDX= 6.0         $$ Bruker NMR JCAMP-DX V2.0
##DATA TYPE= NMR FID
##DATA CLASS= NTUPLES
##ORIGIN= UXNMR, Bruker Analytische Messtechnik GmbH
##OWNER= root
$$ XWIN-NMR		Version 3.5
$$ Fri Mar 11 13:52:49 2022 Russian Standard Time (UT+4h)  she@DPX200
##.OBSERVE FREQUENCY= 200.131346
##.OBSERVE NUCLEUS= ^1H
##.DELAY= (6, 6)
##.ACQUISITION MODE= SIMULTANEOUS
##.ACQUISITION SCHEME= undefined
##.AVERAGES= 8
##.DIGITISER RES= 18
##SPECTROMETER/DATA SYSTEM= spect
##.PULSE SEQUENCE= zg30
##.SOLVENT NAME= CDCl3
##.SHIFT REFERENCE= (INTERNAL, CDCl3, 0, 15.7039)
##AUDIT TRAIL= $$ (NUMBER, WHEN, WHO, WHERE, WHAT)
$$ ##TITLE= Audit trail, XWIN-NMR		Version 3.5
$$ ##JCAMPDX= 5.01
$$ ##ORIGIN= Bruker BioSpin GmbH
$$ ##OWNER= she
$$ F:/spectra/data/she/nmr/H-F/1/audita.txt
$$ ##AUDIT TRAIL=  $$ (NUMBER, WHEN, WHO, WHERE, WHAT)
(   1,<2022-03-11 13:51:28.10 +0400>,<she>,<DPX200>,
      <created by zg, POWCHK disabled, PULCHK disabled
       configuration hash MD5:
       00 E9 B6 7A A2 85 ED C7 34 08 36 98 17 FE 4E 26
       data hash MD5: 16K
       7D A3 60 83 76 53 C0 D9 80 97 98 9B BD 19 AA CE>)
$$ ##END=
$$ 
$$ hash MD5
$$ 31 83 1C 6A 2C 47 D5 A0 B4 81 52 6A DB 4D 6B 90
##$RELAX= 
##$RELAX= 
##$RELAX= 
##$RELAX= 
##$RELAX= 
##$RELAX= 
$$ Bruker specific parameters
$$ --------------------------
##$DU= <F:/spectra>
##$EXPNO= 1
##$NAME= <H-F>
##$PROCNO= 1
##$TYPE= <nmr>
##$USER= <she>
##$AMP= (0..31)
100 100 100 100 100 100 100 100 100 100 100 100 100 100 100 100 100 100 
100 100 100 100 100 100 100 100 100 100 100 100 100 100 
##$AQSEQ= 0
##$AQ_mod= 1
##$AUNM= <au_zg>
##$AUTOPOS= <>
##$BF1= 200.13
##$BF2= 200.13
##$BF3= 200.13
##$BF4= 200.13
##$BF5= 200.13
##$BF6= 200.13
##$BF7= 200.13
##$BF8= 200.13
##$BYTORDA= 1
##$CFDGTYP= 0
##$CFRGTYP= 5
##$CHEMSTR= <none>
##$CNST= (0..31)
1 1 145 1 1 1 1 1 1 1 1 1 1 1 1 1 1 1 1 1 1 1 1 1 1 1 1 1 1 1 1 1 
##$CPDPRG= <>
##$CPDPRG1= <>
##$CPDPRG2= <>
##$CPDPRG3= <>
##$CPDPRG4= <mlev>
##$CPDPRG5= <mlev>
##$CPDPRG6= <mlev>
##$CPDPRG7= <mlev>
##$CPDPRG8= <mlev>
##$CPDPRGB= <>
##$CPDPRGT= <>
##$D= (0..31)
0 1.2 0 0 0 0 0 0 0 0.06 0 0.03 0 0 0 0 0.0002 0 0 0 0 0 0 0 0 0 0 0 0 
0 0 0 
##$DATE= 1646992287
##$DBL= (0..7)
120 120 120 120 120 120 120 120 
##$DBP= (0..7)
150 150 150 150 150 150 150 150 
##$DBP07= 0
##$DBPNAM0= <>
##$DBPNAM1= <>
##$DBPNAM2= <>
##$DBPNAM3= <>
##$DBPNAM4= <>
##$DBPNAM5= <>
##$DBPNAM6= <>
##$DBPNAM7= <>
##$DBPOAL= (0..7)
0.5 0.5 0.5 0.5 0.5 0.5 0.5 0.5 
##$DBPOFFS= (0..7)
0 0 0 0 0 0 0 0 
##$DE= 6
##$DECBNUC= <off>
##$DECIM= 32
##$DECNUC= <off>
##$DECSTAT= 4
##$DIGMOD= 1
##$DIGTYP= 9
##$DL= (0..7)
0 120 120 120 120 120 120 120 
##$DP= (0..7)
150 150 150 150 150 150 150 150 
##$DP07= 0
##$DPNAME0= <>
##$DPNAME1= <>
##$DPNAME2= <>
##$DPNAME3= <>
##$DPNAME4= <>
##$DPNAME5= <>
##$DPNAME6= <>
##$DPNAME7= <>
##$DPOAL= (0..7)
0.5 0.5 0.5 0.5 0.5 0.5 0.5 0.5 
##$DPOFFS= (0..7)
0 0 0 0 0 0 0 0 
##$DQDMODE= 0
##$DR= 18
##$DS= 0
##$DSLIST= <SSSSSSSSSSSSSSS>
$$ [...]
##$SUBNAM2= <"">
##$SUBNAM3= <"">
##$SUBNAM4= <"">
##$SUBNAM5= <"">
##$SUBNAM6= <"">
##$SUBNAM7= <"">
##$SUBNAM8= <"">
##$SUBNAM9= <"">
##$SW= 18.0517287032376
##$SWIBOX= (0..15)
0 0 2 0 0 0 0 0 0 0 0 0 0 0 0 0 
##$SW_h= 3612.71676300578
##$TD= 16384
##$TD0= 1
##$TE= 0
##$TE2= 300
##$TE3= 300
##$TEG= 300
##$TL= (0..7)
0 120 120 120 120 120 120 120 
##$TP= (0..7)
150 150 150 150 150 150 150 150 
##$TP07= 0
##$TPNAME0= <>
##$TPNAME1= <>
##$TPNAME2= <>
##$TPNAME3= <>
##$TPNAME4= <>
##$TPNAME5= <>
##$TPNAME6= <>
##$TPNAME7= <>
##$TPOAL= (0..7)
0.5 0.5 0.5 0.5 0.5 0.5 0.5 0.5 
##$TPOFFS= (0..7)
0 0 0 0 0 0 0 0 
##$TUNHIN= 0
##$TUNHOUT= 0
##$TUNXOUT= 0
##$USERA1= <user>
##$USERA2= <user>
##$USERA3= <user>
##$USERA4= <user>
##$USERA5= <user>
##$V9= 5
##$VALIST= <valist>
##$VCLIST= <CCCCCCCCCCCCCCC>
##$VD= 0
##$VDLIST= <DDDDDDDDDDDDDDD>
##$VPLIST= <PPPPPPPPPPPPPPP>
##$VTLIST= <TTTTTTTTTTTTTTT>
##$WBST= 1024
##$WBSW= 4
##$XGAIN= (0..3)
0 0 0 0 
##$XL= 0
##$YL= 0
##$YMAX_a= 402249
##$YMIN_a= -344186
##$ZGOPTNS= <>
##$ZL1= 120
##$ZL2= 120
##$ZL3= 120
##$ZL4= 120
##$ABSF1= 10
##$ABSF2= 0
##$ABSG= 5
##$ABSL= 3
##$ALPHA= 0
##$AQORDER= 0
##$ASSFAC= 0
##$ASSFACI= 0
##$ASSFACX= 0
##$ASSWID= 0
##$AUNMP= <proc_1d>
##$AZFE= 0.1
##$AZFW= 0.1
##$BCFW= 1
##$BC_mod= 2
##$BYTORDP= 1
##$COROFFS= 0
##$CY= 11.3945322036743
##$DATMOD= 1
##$DC= 2
##$DFILT= <>
##$DTYPP= 0
##$F1P= 2.36226072786647
##$F2P= -0.459571619588291
##$FCOR= 0.5
##$FTSIZE= 0
##$FT_mod= 4
##$GAMMA= 1
##$GB= 0.15
##$INTBC= 1
##$INTSCL= 1
##$ISEN= 128
##$LB= 0.24
##$LEV0= 0
##$LPBIN= 0
##$MAXI= 10000
##$MC2= 0
##$MEAN= 0
##$ME_mod= 0
##$MI= 1.114404
##$NCOEF= 0
##$NC_proc= 0
##$NLEV= 6
##$NOISF1= 3.799351
##$NOISF2= 2.8
##$NSP= 1
##$NTH_PI= 0
##$NZP= 0
##$OFFSET= 15.70392
##$PC= 1
##$PHC0= -16743.5
##$PHC1= 6.200781
##$PH_mod= 1
##$PKNL= yes
##$PPARMOD= 0
##$PSCAL= 0
##$PSIGN= 0
##$REVERSE= no
##$SF= 200.130013532006
##$SI= 16384
##$SIGF1= 3
##$SIGF2= 2
##$SINO= 400
##$SIOLD= 16384
##$SREGLST= <1H.CDCl3>
##$SSB= 0
##$STSI= 0
##$STSR= 0
##$SW_p= 3612.71676300578
##$SYMM= 0
##$S_DEV= 0
##$TDeff= 0
##$TDoff= 0
##$TI= <>
##$TILT= no
##$TM1= 0
##$TM2= 0
##$TOPLEV= 0
##$USERP1= <user>
##$USERP2= <user>
##$USERP3= <user>
##$USERP4= <user>
##$USERP5= <user>
##$WDW= 1
##$XDIM= 8192
##$YMAX_p= 0
##$YMIN_p= 0
$$ End of Bruker specific parameters
$$ ---------------------------------
##NTUPLES= NMR FID
##VAR_NAME=  TIME,          FID/REAL,        FID/IMAG
##SYMBOL=    X,             R,               I
##VAR_TYPE=  INDEPENDENT,   DEPENDENT,       DEPENDENT
##VAR_FORM=  AFFN,          ASDF,            ASDF
##VAR_DIM=   8192,          8192,            8192
##UNITS=     SECONDS,       ARBITRARY UNITS, ARBITRARY UNITS
##FACTOR=    0.0002768,     1,               1
##FIRST=     0,             0,               0
##LAST=      2.2672688,     0,               0
##MIN=       0,             -344186,         0
##MAX=       2.2672688,     402249,          0
$$ Real data points
##PAGE= N=1
##DATA TABLE= (X++(R..R)), XYDATA
$$ [...]
1594C776J41m594j285k00J068M913K38q719k292J1348M303j2173n865J1370O572
1609H601r231n917O357M373l643j834J459j347l8M564n05p442K14R578K17j0451
1625e045o87R916R07q196o77N581k61k646J829O3l926J894O168k719q258K920
1641c137R604k481r823J870Q702j232o363R20L060j087M93J803l793l165O234
1656A605N029p631p143P848Q806o978r406N188Q742l052o442Q02K925J017J317
1671B627j824n499J605R013k75j1457j851J2577M282j2221o191J0186P201p107
1685A066o848L155M961J033j836m665k113O891O362p635j0208O758J3053m554
1699E420j4283J652J3773J258j1291l538P329M752k373m525k818K858P615k80
$$ plain form
1594 3776 3917 -677 -1962 -2162 -1094 3819 4057 -4662 -6954 4394 8697 -3476 -9341 2029 8601
1609 8601 -630 -6547 -190 4183 540 -1294 165 -1182 -1220 3344 2839 -4603 -4389 5189 5406 -5045
1625 -5045 -5732 4184 5091 -3105 -3782 1799 1538 -1108 721 784 -3142 -1248 4920 2201 -6057 -3137
1641 -3137 6467 3986 -5837 -3967 4735 3503 -2860 -1940 1120 33 526 2329 -1464 -4629 1605
1656 1605 6634 -997 -8140 -292 8514 1536 -7870 -2682 6060 3008 -3434 -2632 293 1310 2627
1671 2627 803 -4696 -3091 5922 5647 -5810 -7661 4916 9198 -3023 -9214 972 8173 1066
1685 1066 -5782 -2627 2334 3367 1531 -3134 -5247 1644 8006 371 -9837 -3079 9974 5420
1699 5420 -8863 -7211 6562 7820 -3471 -7009 320 5072 2699 -1826 -4644 -1786 5829 5549
1713E549j0887l279J2463O787j2152r748J0089J1400o720j1431K878R491P33n948
1727g75l587J364N269L683n399q389M294J1941k012j3851q20J3955L715j2258
1741b870n938R141O759n102o143O52M059L419r30o467k862Q093O577q198r598
1756i408O891J1430m716j1593K098J0216M05p417k139L746K814L87k330m296Q86
1771c026P405J223r287l414R608N292q684o439O777O489m378n422J866L351N9
1786A420n20j431k535J935N358j634p382P50Q540K96q432j225P308J837n423j685
1802b823L096P99o81O71j218k713K581M572l193o120L051O948k474o803J581N697
1818B971p34l908L98J497n85J025J413l275k547M786M018n398n255N231N856m212
$$ plain form
1713 5549 -5338 -8617 3846 10633 -1519 -11267 -1178 10222 3502 -7929 -5051 4440 5173 -775
1727 -775 -4362 -2998 2271 5954 555 -7834 -3540 8401 6389 -7462 -8282 5673 9388 -2870
1741 -2870 -8808 333 7092 1990 -4153 -3501 558 3977 3047 -3420 -6282 1811 8388 190 -9408
1756 -9408 -2517 8913 4197 -7396 -5298 4918 5323 -2094 -4233 -487 2327 2714 384 -3912 -3026
1771 -3026 4379 5602 -3685 -7099 2509 7801 -883 -7322 -545 5944 1566 -3856 -1990 1361 1420
1786 1420 900 -531 -3066 -1131 4227 2593 -4789 -4039 4501 4797 -3635 -4860 2448 4285 -1138 -2823
1802 -2823 273 1072 391 1062 -156 -2869 -288 4284 1091 -5029 -1978 4970 2496 -4307 -2726 2971
1818 2971 2237 -1671 -1273 224 -361 664 2077 -1198 -3745 1041 5059 -339 -5594 -363 5493 1281
1834A281n786K793M807j277k913n9L22Q08K457q96n048J43P005J210q214k558
1850e925Q115L966p091m711N129M636k442l663j84J697K494J052m082l943M546
1865d06O743m051q774K604R756o92r438j267P732K812m970l660J458L405K057
1880C309j982n204j26P341K813q315n487Q055P548o456q643M096Q491j288p123
1895b971j179M367L260r63m215k719L936O188k820q777P50J0150J585j0110l799
1910g317Q657N489o289n937L042N262L92l531l180P76N302K306o205n325N886
1925f72P835m467r233K466R283j98q172j641N711K983k656l323o94K554L830j133
1941B473o097r67P443L017p483m921O586O089m846o269K731N452n29l699j220
$$ plain form
1834 1281 -4505 -1712 3095 1818 -1095 -1154 -832 -24 2433 1537 -3511 -3368 3637 4847 -3367 -5925
1850 -5925 2190 6156 -935 -5646 -517 4119 1677 -1986 -2170 -473 2021 3073 -1009 -4952 -406
1865 -406 6337 2286 -6488 -3884 5872 5180 -4258 -5525 2207 5019 49 -3611 -2153 1252 3309
1880 3309 1327 -3877 -4003 3338 6151 -2164 -7651 404 7952 1496 -7147 -3051 5440 4152 -2971
1895 -2971 -4150 217 3477 2514 -1701 -4420 -484 5704 2884 -5893 -5143 5007 6592 -3518 -7317
1910 -7317 1340 6829 540 -5397 -2355 2907 3299 -232 -3412 -2636 2666 4972 -1233 -6558 -672
1925 -672 7163 2696 -6537 -4071 5212 5014 -3158 -4799 912 3895 1239 -2084 -2778 -224 3606 2473
1941 2473 -3624 -4591 2852 5869 -1614 -6535 51 6140 1294 -4975 -2244 3208 2679 -1020 -2240
1956b240J272K236J600k565m108K036O004r63p125l33P125J659o307k568M672
1971C95K757k654k172N41R25J299Q41k593k733L175M391l046n365K338N706j301
1987B504n163K31L969M19k238n40K48P1J619R01l191k068M018L188m195l973L617
2004e83M295k640l985J429L012k22j465n65l55P07K400l26m159m58N387J470n708
2021a766k405N108L132l929l236K224K688m07j615j184j62K262K226k706m180
2036c950K385N847j542o796L67O760Q81n539k037L650K687j295k467j214J556
2051g07L366L2m797k019N398L976n229n533M247O342k682o303P74N248J059l325
2067a53k575R06L162J983l034m384J894O255j07p264j771P204L526o133m583M255
$$ plain form
1956 -2240 -968 1268 2868 303 -3805 -1769 4235 3272 -3853 -4186 2939 4598 -1709 -4277 395
1971 395 3152 498 -1674 -1133 -208 1091 1932 -661 -3394 -219 4172 1126 -4239 -1901 3805 2504
1987 2504 -2659 -2428 1541 1960 -278 -818 -570 -499 1120 2021 -1170 -3238 780 3968 -227 -4200 -583
2004 -583 3712 1072 -2913 -1484 1528 1306 -159 -724 -1079 -372 2028 1702 -2457 -2915 2472 3942 -1766
2021 -1766 -4171 937 4069 140 -3096 -872 1816 1409 -206 -1390 -1552 710 2936 230 -3950
2036 -3950 -1565 4282 2740 -4056 -3689 3071 3952 -1587 -3624 26 2713 1418 -1049 -2263 -707
2051 -707 2659 2691 -2106 -4125 1273 5249 20 -5513 -1266 5076 2394 -3909 -3135 2113 3172 -153
2067 -153 -2728 -1822 1340 3323 289 -4095 -2201 4054 3947 -3317 -5088 2116 5642 -491 -5074 -819
2083h19M781j860m092o23K562K756n73m177j793M616M125m106o077K826P198j127
2099C617p291o96O353K137m356k942J814L086Q26k389l223J120M872O78n623k607
2115d624N576M217m702n354L267N694j588m956k56L337J700j179k570j208K638
2130hL421k032m957P80N754P74n839k048N049L030l683l225K004K655j43j439
2146I3j563jK596J711l062l275K797M406k020m928Q13M787K60l957j054K607J249
2163A459q86q91r56K73K471N89l280j651L589K654l282l284K475L489j365l166
2179a762M26K087M11p07p98r97O94K598k52l737n58M294J257l997k056L204K550
2196B657k176k256P73J718L85n53j290r79J852K592j853l891J353M668n36m813
$$ plain form
2083 -819 3962 2102 -1990 -2613 -51 2705 2132 -2045 -3838 778 4903 797 -5280 -2454 4744 3617
2099 3617 -3674 -4370 1983 4120 -236 -3178 -1364 1722 2548 159 -3064 -1944 2928 3606 -2017 -4624
2115 -4624 952 5169 467 -4887 -1620 4074 2486 -2470 -2726 611 2311 1132 -1438 -2646 -8
2130 -8 3413 1381 -3576 -2796 2958 3732 -2107 -4155 894 3924 241 -2984 -980 1675 1532 93
2146 93 -1470 -1471 1125 2836 -226 -3501 -704 3702 1682 -3246 -2433 2354 2614 -1343 -2397 210 1459
2163 1459 573 -318 -1274 -1001 1470 2059 -1221 -2872 717 3371 89 -3195 -720 2769 1404 -1762
2179 -1762 -1336 751 1162 455 -343 -1340 -646 1952 1700 -2037 -2595 1699 2956 -1041 -3097 107 2657
2196 2657 481 -1775 -1002 716 1101 548 -742 -1721 131 2723 870 -3021 -1668 3000 2464 -2349
2212b349m12M198J315k948k005J424J961K37j340j807J84L070J198l737k658L694
2228B5L900l052m511J924M546m76l925q56K604J913q34k314j114K049K934j141
2244A672m462j19N152J582n135k799M245L604k829l870J040L409P14k232k143
2259b171N10L104J396l260l264K855M738j779n576M62N594R09m764k062L233K770
2275B695j304k810p96K175K554r10l860p21M479K275m245l722L435M588k126m713
2291c006O05M050Q70k734j931J036K440Q95k253k707J566M008m59m666q76M733
2307A571K006l999k928K819L062j204k787k70J784J611m93k395j092K669K570
2322B924k360l642J597M242o17m217m07L594J240k311j688Q68J581N98j023j901
$$ plain form
2212 -2349 -2761 1437 2752 -196 -2201 -777 1184 1421 81 -1726 -1542 1528 2726 -1011 -3669 25
2228 25 3925 873 -3638 -1714 2832 2356 -1569 -2425 179 2092 1258 -1056 -2170 -121 2813 1672
2244 1672 -2790 -2909 2243 3825 -1310 -4109 136 3740 911 -2959 -1919 1490 2204 -28 -2171
2259 -2171 -1661 1443 2839 -421 -3685 -830 3908 2129 -3447 -2985 2609 3518 -1246 -3308 -75 2695
2275 2695 1391 -1419 -2215 -40 2514 1604 -2256 -2977 1502 3777 -468 -4190 -755 3833 1707 -3006
2291 -3006 -2401 1649 2519 -215 -2146 -1110 1330 2225 -28 -2735 -1169 2839 2380 -2286 -3162 1571
2307 1571 3577 -422 -3350 -531 2531 1327 -1460 -1730 54 1665 1172 -1223 -2315 354 2924
2322 2924 564 -3078 -1481 2761 2144 -2073 -2480 1114 2354 43 -1645 -777 804 1402 379 -1522
2338a522J11K732J006l089k092K875K828k160l231J235K962j74k254n57J043J099
2354H12K04j078j530P64K610j09l127p79L290J563k884k045J998K212j004j867
2370i70p8R90J048k2j519j236J593K364j258l170O14L528R3l281q72K649J386
2387A859j543j511K56J253R83n25k018m18K596J575k711k583K291L187j364l464
2403b137L26L109O49k230j375R17J705M95j514j971R47L061L1l654j152L728K138
2420C073l120k754J982L079p19k742n67J881J613n98k268r09K383K356j982l474
2436b766J162M000p3m067j018L487J886k357k414R36K341N98j710j912P09K892
2452A694O46l311j905K991L047k320l672J275L715K1l243j097K170J804p03k192
$$ plain form
2338 -1522 -1411 1321 2327 -762 -2854 21 2849 689 -2542 -1307 1655 1481 -773 -1330 -287 812
2354 812 1016 -62 -1592 -828 1782 1673 -1454 -2233 1057 2620 -264 -2309 -311 1901 897 -970
2370 -970 -1048 -58 990 968 -551 -1787 -194 2170 912 -2258 -1644 1884 1977 -1304 -2176 473 1859
2387 1859 316 -1195 -939 314 1297 772 -1246 -1664 932 2507 -204 -2787 -496 2691 1327 -2137
2403 -2137 -1811 1298 1947 -283 -1658 -741 964 1459 -55 -2026 -1079 1982 2013 -1641 -2793 935 3073
2420 3073 -47 -2801 -819 2260 1541 -1201 -1768 113 1726 1128 -1140 -2049 334 2690 708 -2766
2436 -2766 -1604 2396 2323 -1744 -2762 725 2611 254 -2160 -1224 1117 1715 5 -1907 -1198 1694
2452 1694 2340 -971 -2876 115 3162 842 -2830 -1555 2160 2181 -1062 -2159 11 1815 1112 -1080
2468a080p93J871K228j221l247K13L681J017l712j941L034K677j949k918P40K543
2484A143N71j700j627O16K207P05k257k081J908L072j157l552J39L531P94l025
2500g13j469J920J835o07j839o27J347J667l95k364o99K593J731k230k577J646
2516g81K917p66k854n4K198Q46j225j307M1J442J091j194j903M24K469M30k697
2533i23j250K492J754j770k119R38J924M5j360p58M08J310O10j486j494J262K241
2550A824p50k577j8K684O89k292j334J584J432n23j316n27P96J397l6j944q47
2567a758K054J714j736k313J052K630j91k477n38J895J096j013j309q2J252J230
2583A506r01k043J47K578O16k649j453K275K030j430k452N03K329L85j685j144
$$ plain form
2468 -1080 -1873 -2 2226 1005 -2242 -2029 1652 2669 -1043 -2984 50 2727 778 -2140 -1400 1143
2484 1143 1714 14 -1613 -997 1210 1915 -342 -2423 -515 2557 1400 -2152 -2013 1518 2312 -713
2500 -713 -2182 -262 1573 966 -873 -1500 -153 1514 1119 -1245 -1944 649 2380 150 -2427 -781
2516 -781 2136 1370 -1484 -1538 660 1506 281 -1026 -985 457 1548 354 -1549 -1125 1344 1774 -923
2533 -923 -2173 319 2073 303 -1816 -878 1046 1091 -269 -1027 -619 691 1301 -185 -1679 -417 1824
2550 1824 1074 -1503 -1521 1163 1852 -440 -1774 -190 1242 719 -597 -1124 -328 1069 1033 -911 -1758
2567 -1758 296 2010 274 -2039 -987 1643 1452 -1025 -1563 332 1428 415 -894 -976 276 1506
2583 1506 605 -1438 -1291 1287 1903 -746 -2199 76 2106 676 -1776 -1273 1056 1441 -244 -1388
2599a388O29J663M71j679j583J409K535q86k946L0K977Q93k519j659J722K078
2615A747o64k053m83J547J407n63k199m67K449J529k270k352J580K791o77k856
2631a534k61K423J200j710j658O57J812N06j558j556Q90K463o1k862p95K711J721
2648B388k233k219J182K471j70k194p88J538J412n11j792o28J728J654j286k513
2664a961P24K834M5k737q92K215J632j296j945L08J827O70j316j457L96K015N86
2681A648k046j585J813K148j141k570M64K385L00j782j109J086J465j85j458p55
2697a322J166J547n20k063k64K216J095k017j674J481J957p04j779j91J297R37
2713A162o47j369j74J397R38j047j718N72K121O8k244o64J905J199j333j400M85
$$ plain form
2599 -1388 -759 904 1375 -304 -1887 -478 2057 1171 -1775 -1745 1232 2125 -394 -2053 -331 1747
2615 1747 1083 -970 -1453 94 1501 938 -1261 -1728 721 2250 -20 -2372 -792 1999 1322 -1534
2631 -1534 -1795 628 1828 118 -1540 -883 929 1435 -123 -1679 -789 1674 1613 -1249 -2044 667 2388
2648 2388 155 -2064 -882 1589 1419 -775 -1563 -25 1387 876 -916 -1544 184 1838 552 -1961
2664 -1961 -1237 1597 1642 -1095 -1987 228 1860 564 -1381 -1073 754 1424 108 -1349 -953 1062 1648
2681 1648 -398 -1983 -170 1978 837 -1733 -1269 1116 1416 -366 -1475 -389 1076 891 -567 -1322
2697 -1322 -156 1391 871 -1192 -1456 760 1855 -162 -1836 -355 1602 898 -881 -1072 225 1162
2713 1162 515 -854 -1028 369 1307 260 -1458 -886 1235 1303 -941 -1605 300 1499 166 -1234 -749
2730g49J400L88j008j136L87J585L50j589j071J273J756q34k123K86K016L67j600
2747c02q98R27J206j51j239p24R82J304l86j752l14J917R72j563j633J163J857
2764A366l87j840k74J382Q98o06j330k00J415R97j146j723O08K133K8k192p68
2781a639J863J421j320j676N27J578L78j283j129O47J625K27j820j009J628J718
2797A736j123k098M15K212L48j948j041J374J436n18j535m08J326J168p59j832
2813a247lK071P48j898j464J479J897p45k052%J757Q00j180j313L68J551N43j396
2831h4j380J034J892l76k213l37K091J032j672j523R73J688j37j525p32J084J307
2848A122m09j615m05J659J133j299j782Q31J964Kk018n14J578J090r60j339J68
$$ plain form
2730 -749 651 1039 31 -1105 -718 867 1217 -372 -1443 -170 1586 752 -1371 -1085 931 1298 -302
2747 -302 -1200 -273 933 782 -457 -1181 -199 1105 719 -1033 -1347 570 1542 -21 -1654 -491 1366
2764 1366 979 -861 -1135 247 1145 539 -791 -991 424 1421 275 -1448 -840 1293 1321 -871 -1639
2781 -1639 224 1645 325 -1351 -824 754 1132 -151 -1280 -633 992 1219 -601 -1610 18 1736
2797 1736 613 -1485 -1070 1142 1490 -458 -1499 -125 1311 793 -742 -1150 176 1344 585 -1247
2813 -1247 -1250 821 1569 -329 -1793 -314 1583 838 -1214 -1214 543 1343 163 -1150 -782 769 1312 -84
2831 -84 -1464 -430 1462 1086 -1127 -1464 627 1659 -13 -1536 -563 1125 988 -537 -1269 -185 1122
2848 1122 713 -902 -1307 352 1485 186 -1596 -765 1199 1201 -817 -1331 247 1337 377 -962 -794
2865g94J312O81j031j304M17J701K05j763r21J501J440r58j694K71J644M00j314
2882b07r28P16J265M8j245q51J006J415n55j698j2J765O21j494j159R99J345l20
2900G11j281l68J009R41n27j267j30J331Q27j174j385P27J651j06j699m16J387
2917B31R05q57j117J81J185M28q77j029L28J474K09j491p83J230J317r09j541
2934a116L06J500M00j265q96O92J125J7j201o72R94J200m94j537p1J619O47j405
2952a57j129R94J359l50j301l15J054R03o08j225j13J384P02j175j232O90J593
2969A074j61j658m38J371R60r85j173L22J235M16j098r28O35J354l4j428o61J400
2987B03J156r35j557L70J606J79j320p69R03J112k97j302l88J088J089p86j468
$$ plain form
2865 -794 518 1199 168 -1136 -719 982 1187 -576 -1497 4 1444 486 -1208 -937 707 1107 -207
2882 -207 -1135 -419 846 894 -351 -1202 -196 1219 664 -1034 -1046 719 1340 -154 -1313 -314 1031 711
2900 711 -570 -938 71 1012 485 -782 -912 419 1246 72 -1313 -586 1065 959 -740 -1156 231
2917 231 1136 279 -838 -657 528 956 79 -950 -622 852 1061 -430 -1213 17 1334 425 -1116
2934 -1116 -810 690 1090 -175 -1071 -379 746 763 -438 -1110 -116 1084 590 -947 -1018 601 1248 -157
2952 -157 -1286 -292 1067 717 -584 -899 155 1058 450 -775 -888 496 1198 23 -1209 -519 1074
2969 1074 913 -745 -1183 188 1148 163 -1010 -688 547 963 -135 -1063 -428 926 892 -536 -1197 203
2987 203 1359 424 -1133 -763 843 1022 -298 -1067 -164 948 651 -651 -1039 49 1138 352 -1116
3004a116K49J624L52j472r62J158J322n81j384j29J283O87r08j020K69J320L71
3021A063j260r80R63J330m08j599j31J424P64j189j104N98J261P4j229n66P67
3038b22J149k59j382l47J348Q83j034j261O07J456j4j422n28J069R47n57j166
3055g33J3J138N70q36j126L94J388N5j354n96J055J061o61j255R4J262M40j024
3073a15p67N33J044N1j061p07R97J097m94j401J8J322M98j055q87O08J123m6j231
3092d73m76R20Q70l90j107j63J148O55q87j153O37J264j24j246l97J022Q18n35
3110C83j089J11R43N60q49r61M33J217J21j316n45J083R15o91j069J22J104L08
3128G80q61p79N16J027o9j018m72Q66Q99m34j307J2J379M66j152q10O55J131j86
$$ plain form
3004 -1116 -867 757 1109 -363 -1325 -167 1155 574 -810 -939 344 1031 123 -897 -628 692 1063
3021 1063 -197 -1177 -214 1116 708 -891 -1022 402 1166 -23 -1127 -529 732 806 -423 -989 -222
3038 -222 927 668 -714 -1061 287 1170 136 -1125 -518 938 924 -498 -1026 43 990 433 -733
3055 -733 -720 418 988 152 -974 -580 808 863 -491 -1087 -32 1029 368 -887 -793 469 909 -115
3073 -115 -882 -349 695 746 -315 -1022 -25 1072 578 -823 -805 517 1015 -40 -927 -319 804 758 -473
3092 -473 -949 -29 841 451 -656 -819 329 984 97 -1056 -419 845 721 -525 -922 100 918 383
3110 383 -706 -595 348 908 59 -902 -469 748 869 -447 -992 91 1006 315 -754 -632 472 780
3128 780 -81 -860 -344 683 614 -404 -876 -10 889 455 -852 -840 539 1005 -147 -957 -302 829 643
3147F43j013m53Q80Q51n71j040K7J118M98j035r05O59J210k47j270k19J028P16
3165H77o58r75J20J144L90j057p02N42J147j43j116m74J051Q37o89j154K90J169
3183E99J83j001o43O96Q54j37j114k86R84P49o84j069K04J259K55j109o78P68
3201a70J019l48j065q3Q67O11o03r53J64J089L18j001p42P72R64k33j220j47J070
3220C09N50p94q93L45J030Q7r07n52O56R87l87j005j52R76O70p67r25L44J088
3239F60M2r70m98P86P29k88r82j27R29N84p05r48L40J014J37r80n83P99Q00l83
3259C56r75m4R69M20o53p81L10R58J86r84n79P54Q96m27r99r0J057M36p78p77
3279g45L95Q97N0r05l94O27P51k50r91j21R59N01p88p39M13R62Nr09l90O79P03
$$ plain form
3147 643 -370 -823 57 908 337 -703 -676 442 940 -95 -1000 -341 869 622 -648 -867 161 877
3165 877 219 -756 -636 508 898 -159 -861 -319 828 685 -431 -905 146 983 294 -860 -570 599
3183 599 782 -219 -862 -166 688 551 -563 -849 135 884 200 -869 -665 594 849 -260 -938 -170
3201 -170 849 501 -564 -647 220 831 228 -725 -561 528 846 -155 -897 -125 839 606 -614 -761 309
3220 309 859 65 -828 -483 547 634 -273 -825 -169 818 431 -574 -726 250 920 153 -772 -428 660
3239 660 702 -268 -766 20 749 461 -521 -648 281 865 160 -788 -448 566 703 -277 -860 -61 739 356
3259 356 -619 -663 306 726 73 -708 -398 560 746 -238 -817 -63 833 406 -593 -683 374 810 32 -745
3279 -745 -350 547 597 -308 -702 -75 676 426 -565 -686 273 774 -14 -753 -340 622 627 -282 -672 7 710
3300G10l72q42j7Q41M83o85q71L86R64O5j010l94P36P43m25r47P7Q94L39p22o62
3321g09M21Q21l5q16l20O98P03m23r42K6J005K95q08o00M55P99l3q89l21P00O58
3342F85m22q55L8Q37M18p68o58M55Q79q9r18k14O21P00m64q54R8Q90K98p43o10
3363f76M21R10o2r90l39Q63N75m55q18J70Q01J88p21o01N01P84j50q10k00O06
3383cO61m67q15J52R05J82p57n32N25P68j93q05j83O99N54m54q16J52Q27K29p91
3404a62n35N39P25j47q45j72P61N11n59p03J66Q36J66p16n13M91P29j23q33j61
3424e45P35N38n83p23J89Q62N1o79m48M59P12k06p34j91O91N26n08p84K26P92
3444C80J80p75m94O07P15k38q00j06P44M04n30o56J61Q67J00o99n03N75P13k44
$$ plain form
3300 710 338 -504 -521 320 803 118 -753 -367 597 662 -348 -742 -6 737 312 -635 -558 336 675 -47 -709
3321 -709 -288 533 498 -318 -638 60 763 340 -602 -576 429 724 -84 -684 -229 570 537 -352 -673 27 685
3342 685 263 -592 -554 283 701 -67 -725 -270 609 520 -398 -612 9 709 245 -609 -511 379 677 -66 -676
3363 -676 -255 655 593 -397 -736 127 702 247 -571 -401 400 588 -133 -734 -233 551 401 -409 -609 -3
3383 -3 658 191 -624 -472 433 615 -142 -674 -149 619 426 -379 -562 137 691 237 -579 -427 400 629 -162
3404 -162 -697 -158 567 420 -425 -597 164 675 116 -587 -421 415 581 -135 -648 -157 572 449 -384 -545
3424 -545 190 728 145 -578 -389 473 524 -155 -603 -144 568 362 -372 -563 128 654 146 -638 -412 380
3444 380 560 -215 -709 -102 613 375 -425 -531 213 617 87 -569 -408 459 559 -140 -643 -68 645 401
3464D01q48j04P05M35n23o76K73P05J54o94m52N40O96k60p82m9O26M29n03o63
3484e90L01O47J99p82l21M88O37k92p01jO33L89n10o51K40P89n1o50l46N56N93
3505E77m02o30k1P21L12n54n23K55P11k0o58l09N53N64k86p24k0O64L74o09n50
3526e75L40P17k5o72l17N04N16k55p07j5P29K28m51n83L05O99qo76k96N57N39
3547E54l34o13O1O43K36n10n53K99O82J2p37k67N71M39k84o14K2O03K79n75m71
3568e57K88P38r1o37k56M78N74l06o68JP13K42m98n06L60O26j04o39k45N98M49
3589E60l83n97R0O04J86n03m99L99N60j21n97j94N49M51l70n67Q6O21K38o34m10
3610e31L57N74m6o05k37N50N03l63n98J03N85J68n07n02L74O13j01o34j89O01
$$ plain form
3464 401 -447 -551 154 589 66 -610 -337 368 522 -172 -624 -84 612 352 -430 -479 147 576 73 -590
3484 -590 -289 358 557 -225 -546 -58 579 287 -414 -415 218 607 97 -554 -314 475 424 -226 -572 -16 577
3505 577 175 -455 -476 245 557 3 -520 -265 446 426 -232 -541 12 576 290 -434 -454 210 584 -25 -575
3526 -575 -235 482 457 -215 -532 -28 488 233 -474 -489 240 468 17 -566 -261 438 430 -246 -542 15 554
3547 554 220 -393 -332 311 547 37 -516 -217 465 477 -260 -527 44 483 199 -415 -393 210 489 -86 -557
3568 -557 -269 469 378 -259 -515 -37 537 231 -437 -436 277 519 21 -485 -125 501 397 -242 -487 111 560
3589 560 177 -420 -330 274 460 -43 -542 -143 417 296 -301 -495 54 505 135 -432 -346 275 513 -121 -531
3610 -531 -174 400 354 -251 -488 62 565 202 -396 -293 292 460 -47 -549 -175 438 337 -297 -486 115
3630A15L66l59n50O1O69J76o01m12M36N20j15n43j89N68L45l81n55K03N72J74
3650E00n57l75L76M99j46n97j37N30L77l99n94K37N89J51n69m05M45N13j47n98
3670c07j41N52L82l81n49K05O23Q2n98l21L50N49j87n54j18N85K97m26m81K11
3690b27N18P0m66l43L36N22k13n07p4M93L25l65m87J44N63O9n10k54M15M43k20
3711B32n65k1N06K50l66n06K44O00jn30k80L42M94j79n52LM94K53m25m82L25M91
3733C27Q4n23l20M60L94j86n28jM76K47l98m26J97N14L9n73j87L87L98j96n39
3754c54j5N26K21l80l82J88M86N9n31k01L62M25j91n52K7N29K15m49m00K42N16
3775C41j4m89k50M07L47j93m30r5N38K54l79m77K16N21l9m33k25M33L89k20n41
$$ plain form
3630 115 481 122 -428 -367 302 478 -123 -535 -99 421 306 -237 -426 142 487 106 -449 -246 326 500
3650 500 -57 -432 -56 443 297 -300 -437 93 470 71 -523 -286 303 454 -115 -520 -75 438 291 -307
3670 -307 -448 104 486 105 -444 -239 384 466 -132 -453 -103 446 259 -295 -413 172 469 43 -438 -227
3690 -227 291 361 -105 -448 -112 410 197 -310 -384 109 434 69 -418 -274 289 358 -152 -406 9 452 232
3711 232 -333 -354 152 402 36 -470 -226 374 373 -157 -437 -95 399 220 -332 -329 165 418 -7 -489 -164 327
3733 327 411 -112 -432 28 422 236 -292 -293 183 430 32 -394 -197 317 356 -217 -404 -17 381 185 -354
3754 -354 -369 157 378 -2 -384 -196 290 349 -182 -383 -21 404 213 -339 -312 217 432 -17 -417 -175 341
3775 341 327 -162 -412 -5 342 149 -281 -376 162 416 37 -440 -224 297 258 -175 -400 33 422 202 -339
3796c39N7M27K63m10l64K30M97j8m59k40M04L85k72n12P3N18J65m15m92L74M18
3817B90%n41j59M36L10j71m73j4N12J96l67l68K40M81o0m81j98M04L94k67m63
3838b99O5M73J09m14l19K58M31j6n10j40M60K85k92m42P8N48ml59k57K82M31j33
3860B35m73j03M32K78k34m61P8N18M7l84k73K78M15j33m72j24M54L01l29l71M4
3881b77N02R5m16k75K52M52j01m44j09M04L11k65m35J47M00J06m27k89L10L96
3901C37j24l81j74M43K13k61m04J39M30L9l29k50K87L54j35l59j28L73L06l12
3921F4m00J37M42K7l51k35K57L78q5m87mL54K33k49l62J27L61J08l91k26K54L89
3943C41j74m36j4L63K46k56l96J28L87J00m17k53L73K67o8l92k1L39J79k16l60
$$ plain form
3796 -339 -282 145 408 -2 -366 -136 361 343 -116 -356 48 433 161 -351 -278 240 405 -10 -502 -128 290
3817 290 290 -251 -410 26 336 165 -308 -322 190 386 19 -349 -109 372 312 -169 -367 37 431 164 -299
3838 -299 -234 239 348 -66 -385 -127 304 288 -222 -362 98 383 91 -351 -273 275 271 -88 -345 -63 368 235
3860 235 -238 -341 91 369 135 -326 -248 270 317 -67 -340 -62 353 220 -252 -376 78 379 50 -321 -277
3881 -277 225 320 -96 -371 -119 333 232 -212 -321 83 394 129 -306 -159 241 347 -80 -369 -59 337
3901 337 213 -168 -342 101 314 53 -351 -212 218 257 -72 -322 -35 319 184 -175 -303 70 376 64
3921 64 -336 -199 243 270 -81 -316 -59 319 234 -253 -257 97 330 81 -281 -154 207 315 -76 -302 -48 341
3943 341 167 -269 -283 80 326 70 -326 -198 189 289 -128 -381 -8 259 191 -201 -222 117 296 80 -280
3964b80J61L17O4m07j09K28K94j22l99ML92K04l15l11J26M07K0l30k68L29L01
3985C06j25m38J1L58J87k24k98Q1L35M8l52j79K67L13j61l45o3L73K35l08l14
4006b93J43L86j1l74j16K38L09j21l79m7M04J96k83l07R5M01J2m03o4K30K84j96
4028A04l64O1K88J79k78l10K32L16k6l59j37K89L09j94l84N1L40J62l10k48K07
4049g2L49q8l54j23L33K47j75k77o8M16R5l14k44J60L60o4l72l4K67K48j87l28
4071b25O6K83J30k75k37J52L22jl58q2K75K22k02k57O4K89N9k57k18J49L75j04
4093A70l32m9L04J06j68k49K2L23J51l45k20K37K72k5l76m0K78K08k01k54M1L09
4115A62K5k33j73J33L22n0l79j4K80J97j89l29O3K91J25k32k32J58L30m1l20j54
$$ plain form
3964 -280 -119 198 262 -145 -254 -26 268 146 -253 -249 143 347 32 -279 -153 254 274 -56 -324 5 306
3985 306 181 -257 -246 112 299 75 -223 -142 193 241 -111 -290 -23 290 129 -216 -279 94 329 21 -293
4006 -293 -150 236 225 -149 -265 -27 282 161 -218 -265 139 335 52 -255 -160 241 253 -150 -214 16 300 104
4028 104 -260 -199 89 268 -10 -320 -88 228 202 -157 -294 -5 304 110 -274 -223 117 279 -31 -279 -72
4049 -72 277 189 -165 -288 45 292 117 -160 -228 188 283 -31 -275 -115 245 181 -191 -225 42 290 103 -225
4071 -225 -159 124 254 -21 -258 -106 216 215 -143 -225 50 272 70 -187 -123 166 225 -32 -250 -101 274 170
4093 170 -162 -211 93 199 31 -218 -196 127 278 -67 -287 -50 222 197 -179 -219 59 267 66 -188 -147 162
4115 162 187 -46 -219 -86 236 186 -193 -207 73 270 81 -248 -185 106 231 -1 -233 -75 255 214 -106 -260
4137b60L28K03j71l29Q8K95P0l09j80K45K49ll75j16L51J77j68l22K4L26R2k59
4159d4k24K36K31m4l76KK65J88j92k56M7L46K0k31k02K50K20j39k54o0K96J61
4181B40j54l50J30K91J7k16j64J32K86n1l08o4L08J47k59j90Q5K72K0k44j24K02
4203FK18j16k85n9K94J89k06k64J15K46N7k77j49J84K48p7k43q5L42J09k58j92
4225b03Q2K95l0k29j34K14K27q4l11jL42O3j25l30O8L66k9k53j03J08K82j10k91
4248a86M8K12J44j39k84J02K53J1k36j62J98K09o3k71j3K51J13j46k24O8K93k4
4270A54j71j70J80J96j22k02nJ92J22j33k26R3K45Kk59o0J80J95j52k35K6K31
4292H1J06k27j48P8K16N8j84j31J80J78r3k03p2K95L7j87j70J02K51J0k67j01
$$ plain form
4137 -260 68 271 100 -229 -141 154 224 -85 -265 -20 229 226 -149 -265 86 263 95 -227 -203 123 215 -44
4159 -44 -268 -32 199 155 -221 -219 46 234 42 -214 -167 179 199 -32 -234 16 236 97 -157 -217 79 240
4181 240 86 -264 -134 157 174 -42 -206 -74 212 161 -147 -211 97 244 -15 -205 -120 152 172 -72 -196 6
4203 6 224 108 -177 -236 58 247 41 -223 -108 138 195 -82 -231 -47 201 124 -119 -204 138 247 -11 -203
4225 -203 -121 174 144 -85 -219 -5 222 138 -173 -174 168 231 106 -224 -156 210 181 -72 -175 -67 215 105 -186
4248 -186 -138 74 218 79 -205 -103 150 161 -75 -237 -39 170 107 -164 -177 74 187 41 -183 -115 178 154
4270 154 -17 -187 -7 189 67 -135 -140 52 174 41 -185 -92 153 155 -104 -164 16 211 59 -176 -150 81
4292 81 187 -40 -188 -110 106 164 -20 -151 29 207 114 -89 -161 134 171 -16 -186 -84 167 177 -90 -191
4314a91K20J89j36k85L5K54J15k40j58J46J59K9k35p6J85J66j38j51QJ72J12j87
4336gj68J35J94l5j73q7J26K33j53k26K1K52Q8k31j25M6K85n0k24q7J68K07j42
4359D7k13lL11P6k20j76J03K13k3k17r7J82J96p0k61M2J46R2j26k23J18K39Lk34
4383i5n3J58J85j52k44O9K46K6j65j22J26J54k5k07n4J56K01j30k23L4K20Q9k43
4406d9j53J94J12Pk03m8J78R3l4k47L1K17L3j50j63J65J78Nk38o2J75R1q1j98
4430a47L8K28Q5j54k41J11K16q9j55n7K05J37j24j69lK54M1j99j25J87Q9j7j76
4453f5r2K68O4j21k10J04J91nj81r7J64J45k7k59n7J99J38j48j50M5K09M2k44
4476h7j24J92J48p8j32m4J64J28j54j26N3K28Lj66j58J59J32l3j69p4J71R9j14
$$ plain form
4314 -191 29 218 82 -203 -168 86 201 -39 -197 -51 108 137 -98 -174 11 177 39 -112 -104 68 180 -7
4336 -7 -175 -40 154 119 -54 -141 -15 218 65 -161 -140 112 200 -31 -156 -110 175 125 -99 -186 -18 189 47
4359 47 -166 -169 142 218 -2 -178 -75 138 115 -102 -199 -17 179 109 -152 -110 36 128 2 -221 -103 136 139 -95
4383 -95 -148 10 195 43 -201 -132 114 140 -25 -147 -21 133 108 -99 -153 3 204 74 -149 -115 105 194 -49
4406 -49 -202 -8 104 111 -92 -140 38 131 97 -150 -119 98 131 -19 -182 -17 161 166 -72 -134 41 132 51 -147
4430 -147 -109 119 204 50 -191 -80 136 47 -108 -165 40 177 53 -116 -119 135 176 -23 -148 39 128 111 -65
4453 -65 -157 111 175 54 -156 -52 139 134 -47 -144 20 165 138 -121 -178 21 159 11 -139 -94 115 157 -87
4476 -87 -211 -19 129 51 -81 -125 39 167 13 -113 -60 168 171 5 -153 6 138 105 -64 -138 33 132 18
4499A8j53Q1J59mj67n3R4J83o7j91n6K05P3j19j61R1J50O0j82q7J79J35r3j92
4523i7J2J73L2j21j19R3J49jj08j87J16K02m9j68n1K06N1j37j29RJ99J4j35n3
4547i9O6K02p6j59k7J47J17j86j22J04K09o0j55o6N9J65l3j69j00K12R7r0j69
4570a33J0K14P0k23r5J83J19o6j63J0J82j1n8j08K7Q3J43k45n6J27J23r9j69O6
4594f9J17Q4j15j08M1J57%j89K2O6J45o6j69J6J41Q9j58j24J71N0k1j19p3J53
4618D1J24j18j63K0J81N1p5k03P3J92J2k38nJ26J16p3j46L6R2K4j01r4O8J44j2
4643G2j08k3P6J68j49j25K2J78k7j07p1R7Q2Jj60L3OJ92j00j42L2J07J01j78p8
4668a01J08P2oj03l3R9J03q4j30QJ57K1q9j45N6R1M5j48m3K26O3j57o7j4J35p
$$ plain form
4499 18 -135 -54 105 101 -66 -119 -25 158 91 -100 -156 49 122 3 -158 -67 83 143 -39 -126 53 188 95 -97
4523 -97 -85 88 120 -1 -120 -27 122 121 13 -174 -58 144 95 -73 -124 82 133 -4 -133 -124 75 89 -46 -99
4547 -99 -33 169 93 -66 -93 54 171 -15 -137 -33 176 116 -39 -105 -46 119 86 -83 -183 29 126 36 -133
4570 -133 -123 91 161 -62 -157 26 145 79 -84 -74 108 97 39 -69 -42 41 184 -61 -117 10 133 34 -135 -69
4594 -69 48 132 17 -91 -50 107 107 -82 -60 6 151 85 -84 -68 73 162 4 -120 51 101 80 -39 -112 41
4618 41 165 47 -116 -96 85 136 61 -142 -69 123 135 -103 -108 18 134 61 -85 -49 43 67 -34 -128 -60 84 72
4643 72 -36 -59 17 185 36 -89 -67 111 84 -23 -94 3 85 86 -74 -41 -35 157 57 -85 -53 54 155 -23 -101
4668 -101 7 79 73 -30 -63 36 139 55 -75 -67 90 111 22 -123 -67 24 69 -79 -122 104 167 10 -57 -71 64 57
4694E7n6q2N2J26M6j85k1N9J14l8j64M1R5N2j28m2O3P0Onq4Q0O0q8q4l0J99k3
4722I0m0j17L3J06k9j34MJ41J08p1j77QJ34O6j13p9Q3O0L8j76lR0O0L7j94k8J93
4749I0n1q8j3N7J07j01m2l4J18Q1j50l9K2Q9P9j47r1J02J13j0j34m4J02O6n1q9
4775e8mJ75j4j47j8J10O5k2j12q5J54K0l8j44N2J72oj62k4K4J24jj33K9Q2M9n9
4802B9q1J7J77o9j38kO5P6K3j67J5P4J10j32l3MJ08m2j8j06O2J47p0j42P1J9P7
4829G4k5j00M6O6M0j28m1O5P9l0r0PQ6M5o7j33J10N7o6o2k7J04L9K4j30J6J10
4856F9N9q7j15J2J51qj22j2Q5P3p4p2j4J13O4o5j17L2P2K4m4p2L5M7l6n6pQ1Q1
4885I7j18K9mO4N3j40j0j6J10N1j87L2R6N3r8j1m1Q5L0j27k2R4O7l6n3p1J12K7
$$ plain form
4694 57 1 -81 -29 97 143 -42 -63 -4 110 72 -92 -51 44 96 -32 -74 -11 59 65 60 -24 56 116 28 -56 -86 113 90
4722 90 50 -67 -34 72 43 -91 -87 54 162 91 -86 -78 56 122 9 -70 13 73 111 -65 -68 22 82 119 -75 -103 90
4749 90 39 -49 -62 -5 102 1 -41 -75 43 124 -26 -65 -43 46 125 -22 -113 -11 102 92 -42 -86 16 82 31 -58
4775 -58 -62 113 99 -48 -66 44 109 87 -25 -110 44 64 26 -118 -66 106 100 -62 -86 -62 62 61 -72 -43 39 88 29
4802 29 -52 -35 142 73 -65 -67 -2 74 97 -70 -55 19 129 -3 -36 -32 76 34 16 -90 -28 119 49 -93 -22 -3 74
4829 74 49 -51 -5 61 101 -27 -68 -3 76 46 -44 -37 49 94 27 -106 4 61 -5 -67 -94 10 49 73 -57 -41 69
4856 69 128 41 -74 -62 89 81 -41 -53 32 105 31 -41 -55 58 122 57 -60 -28 44 68 24 -48 -13 34 -2 -58 -65 16 97
4885 97 -21 8 4 68 121 -19 -29 -45 65 116 -71 -39 57 110 12 1 -40 45 75 -52 -74 20 87 51 -2 -73 39 66
4913F6r3Jl4R1M7j16o0J25J3m6k4j0P4M2q8n7M3R8L4k10K5R0O5m3p8K6M1O2j18
4942c4l3N7M0j7m9n9P1J08l5j06M9P6L1j25j1O4q6J18p0k5K3N7J1q0k7P4M1n2
4970A1j03M4J60q3r9j4R5Q1k3q3MJ5R9j27p4J23J13n6p4r2Q9Q0m0j43K9J05K5
4997F2q1OK0L8%n7n9J10Qj0r2K5J09Mr4q3J22J5m3n2JP5%l2n8L3J08m6Km4N6R
5029E2k8j19L6R3K5j2j19N3L3M9p8qj7J31m0r4k7N8Q6j04mj5J16J5n0q0N8M6l0
5058B6p1l8N9J35r2o1K5K6J5n9J2P8n1L6n7o1O1Q2o8j1k9K0J04n6o7L6O2j3q4
5087d1j5O2L6n4k0k7M2N6m8q2Q6N4K5j31qJ18J3r1o1Q2M5M6p4m5J5R2j03M5n1
5116c4J1Q3m9k4m3J18j2o9o1Q8M6q7mL4j3N7o1L1k8N6j2j04m9P8J48q0j09M0J22
$$ plain form
4913 66 -27 -26 -60 31 78 -38 -98 27 40 -6 -30 -40 34 76 -12 -69 -26 72 106 -104 -79 11 76 33 -45 -19 22 84 -34
4942 -34 -67 -10 30 13 -36 -95 -24 84 49 -57 -8 68 99 -26 -37 27 -59 59 -11 -36 -13 44 55 -25 -52 22 63 11
4970 11 -92 -48 112 29 -70 -84 11 92 69 -14 -10 5 104 -23 -97 26 139 83 9 -83 6 86 46 -97 -68 37 62
4997 62 -19 -13 7 45 45 -12 -71 39 47 37 -55 -30 79 83 -11 -94 28 43 0 -52 -51 24 24 -8 -66 -33 75 29 31 -13 43 52
5029 52 24 -95 -59 34 59 47 -72 -19 14 63 -15 -23 -40 91 51 -43 -70 -12 74 -30 -34 -49 67 82 32 -48 10 56 26
5058 26 -45 -83 -24 111 19 -42 -17 9 24 -35 -23 55 4 40 -17 -78 -17 65 -3 -14 -43 -23 81 25 -42 -6 56 43 -41
5087 -41 -56 6 42 -12 -32 -59 -17 39 -9 -91 -5 49 74 -57 -65 53 66 -25 -86 -4 41 87 13 -32 -17 75 -28 17 -34
5116 -34 -23 60 11 -13 -56 62 50 -19 -80 8 54 -33 -37 -3 -16 41 -20 11 -17 39 27 -77 -126 -48 100 20 -89 -49 73
5145G3j0k1o9RQ0j4j00JJ1R0q3Rk3R4L5o9j44R9J33m5j33N3J7J3Ql9j4R2Jqj02
5176e6O9N5k5m4rj5J05m4o7M7J7J1p4l5O2L8j9l7l6N3M5m8J6p1J02rj4l4K0Kk0
5207a5k1K4L9M1l3j7o2N0R3j02J0k3N7m3n1J7N7lJ4q8J2OO8l3m4P5J5n0%k8J2
5238b3O3kmo8L6K9p2L3J5J1M0m6n9M2N8j2r5nJ02Qq4n5O2QJ8%q7O6O0pl3n5Q3
5271B7K5l4k7M5L5j7r0J3J2L7l5jNM0Qj7p7k3O3L1m7qM4O5j9p0L4J0j2k4k5O3
5303C1K3K8o1q0N8L9l7Jn0J29m7n5k8P0j0L4j07pR5k2%lk2J8P3o3J6k8Q3J3j18
5334b7l6M5J03p4l9J1M3Lo7K6L4O5m4n5RJ7Ol7p5J04K5No8NKO9o6RmM8%J5j18
5367f6O7N1J6r3L0OL8l7m0j3N3P0p5k7L7L9r8L8l4N7RL2j04J7O3m9j6L9J2m9R4
$$ plain form
5145 73 63 42 -27 -18 62 48 -52 -51 -40 50 -33 -24 -47 47 82 13 -131 -32 101 56 -77 -24 -7 6 14 -25 -39 53 54 46 -56
5176 -56 13 68 43 -1 -10 -25 80 36 -31 16 33 44 -30 -65 -3 35 16 -21 -57 -4 41 -7 9 -62 40 31 17 -17 3 5 -15
5207 -15 -36 -12 27 68 35 18 -44 6 99 -3 7 -16 41 -2 -53 -36 21 18 32 -56 -44 -38 30 -3 -47 28 43 -7 -7 -35 -23
5238 -23 40 38 34 -34 2 31 -41 -8 7 18 58 12 -47 -5 53 41 -54 -59 43 51 -33 -88 -26 -18 0 0 -87 -21 39 32 -1 -56 27
5271 27 52 18 -9 36 71 54 -36 -23 -11 26 -9 -10 -5 35 43 26 -51 -74 -11 20 -27 -35 9 74 55 -15 19 29 17 -7 -32 31
5303 31 54 82 21 -59 -1 38 1 2 -48 81 34 -21 -49 21 11 45 -62 -69 26 4 4 1 -21 -3 70 7 23 -5 78 91 -27
5334 -27 -63 -18 85 11 -28 -17 26 29 -38 -12 22 87 43 -12 -3 14 20 -17 -92 12 37 42 -26 -21 -19 50 -16 -7 -11 37 37 52 -66
5367 -66 1 52 68 -25 5 11 49 12 -28 -41 12 82 7 -20 17 56 -42 -4 -38 19 28 60 -44 -27 36 -13 -29 10 22 -27 67
5398F7m3n2J8P8m6n4l9Q9jj6pkj6l0M5J1J7Kj9l0O1p8N5j0p1O4OM0m2J1nM4p0
5431b3RK8%nk0j8rL4K4l4OJ2M5n3ol2O0k9M0m2L1l4N3m8n0O5J8j1o0K9Q4l1p5
5464d2OK9K2J5l6l0J4N2P6r1n8J1M0kl3o2R9NPl5j9M8k0j9j2J00m4j3m6O9m3M1
5496B9n2k5K1J24r1o8L2N4k2K3o3L2N9o8k4j7J01m3L4m6qL2N0r0j5J8J03lr1k
5526a6M3M6l8o8M2j2K7j3k4jL0j2k8J4P3k7K8n7j3M6o6N3pl3M1k1n2LN2K2k7k6
5558b1K0N0m4k4L0m6N8l2K2j00P6j0J8j2jO9j8l7l7M7kL3m4j4K9RJ3k6KKJ7l7
5590a0M2Ml7L3l8m4N7%o5L3L8k8lK1l1K9k6nM1l2M7jJ3m5L1L3Mm5k8%j9O6n7m3
5624f5K0M0N7p6r%N3Kq5L3N9Ql7Pmj7NJ1k6lL6po4Q9K7l2n4KmJ00m3n6K4J7J4
$$ plain form
5398 67 24 -28 -10 68 22 -32 -71 18 17 1 -6 -8 -24 -54 -9 2 19 21 2 -28 33 -45 10 0 -71 -7 -1 39 -3 8 3 47 -23
5431 -23 -14 14 14 9 -11 -29 -38 -4 20 -14 -8 4 49 -4 -10 -42 18 -11 29 -13 18 -16 37 -11 -61 4 22 11 -49 -20 64 33 -42
5464 -42 -36 -7 15 30 -6 -36 -22 30 106 15 -43 -32 8 6 -27 -89 10 15 22 -13 -32 16 -4 -23 -35 65 21 8 -38 31 -12 29
5496 29 -23 -48 -27 97 6 -62 -30 24 2 25 -38 -6 53 -15 -39 -56 45 2 36 -10 -18 14 64 -26 -41 -23 80 77 -14 -16
5526 -16 27 73 35 -33 9 -3 24 11 -13 -14 16 4 -24 -10 63 36 64 7 -6 40 -26 27 20 -13 28 7 -45 -42 10 32 5 -21
5558 -21 -1 49 5 -19 11 -35 23 -9 13 -87 -11 -21 -3 -15 -16 53 35 -2 -39 8 6 39 -5 -19 10 19 32 6 8 10 27 -10
5590 -10 32 36 -1 32 -6 -50 7 7 -58 -25 13 -15 -18 3 -28 1 -25 -30 11 -21 26 25 38 -7 24 57 61 16 -12 -12 -31 35 -22 -65
5624 -65 -45 -5 52 -24 -33 -33 20 22 -63 -30 29 37 0 7 3 -14 -9 2 -24 -27 9 2 -62 27 54 22 -32 -30 -34 66 23 -33 -9 8 22
5659B2k9l9l3J28n5K6o5O8j7J4m2L3OJ4m0k3M9O6l6q1M3L1Nk7j2j2J1J2k6j0K0
5690AK0l3r2L1O8M9q6jM1J0Qk4J9J7L8l6j1q4M4O1q2L3n7J62o4r7J5QN9j9L0k2
5722FN9j8n7j4M9M8n5oLMj1J5n0M3m1m3M8K5L6l0k3M1k4KM7Rr4L9j1J7%n6J5N9
5756C2o3J9k6j6J4O8j8N4rm7j9J6l3N1kJJ1l7oOj9L4k0J5J4o8MO5L0j01P3n0N3
5789B6m9j7J0K6L7M2q9NK2N5r5oN6l9N9m5K6l5K4lq0O2lJ0l2P4k5qml4m0Q3K8
5822D1m7p5M7K2Lp0P4knK2k9K8K9m1L0j4L1L3m9m9j1N8l1L3o2L9l1Q4r0k2N5K1
5854B2l1l1j2K5R0q9l5M3L4J0k6l7K5K6j4K0q3N0K8k2J4j3qM6k2k2N2l9n4KO8
5885A7JN6q2mL8o2K0J0jN1k1l9k4N2K0m4jK8l6P1n5J5m6L7qJ5j7nN8Ll4j8l6L0
$$ plain form
5659 22 -7 -46 -79 49 -6 20 -45 23 6 20 -22 11 17 31 -9 -32 17 83 47 -34 9 40 45 18 6 -6 5 17 -9 -19 1
5690 1 21 -12 -104 -73 -5 44 -42 -43 -2 8 16 -8 11 28 66 30 19 -65 -21 40 -42 -9 -66 96 32 -65 -50 -42 17 -2 28 6
5722 6 65 47 -10 -24 25 73 18 12 15 19 8 23 -27 16 -25 -68 -20 5 41 11 -12 29 5 7 54 63 -31 8 -3 14 14 -42 -27 32
5756 32 -31 -12 -38 -54 -40 28 10 64 55 8 -11 5 -28 23 21 22 33 -4 -10 -4 -23 11 -9 6 20 -48 -44 21 51 -50 23 -27 26
5789 26 -23 -40 -30 -4 33 75 -14 -9 13 68 -27 -33 23 -16 43 -2 24 -11 13 10 -70 -8 -11 -1 -33 41 16 8 4 -30 -70 13 41
5822 41 -6 -81 -34 -12 -9 -79 -5 -7 -12 10 -19 9 38 -3 27 13 44 77 28 -21 -32 26 -5 28 -34 5 -26 58 -32 -54 1 22
5854 22 -9 -40 -52 -27 63 -26 -61 -18 16 26 0 -37 -12 14 0 20 -63 -13 15 -7 7 -6 -14 32 10 -12 40 1 -53 -51 17
5885 17 18 74 -8 -12 26 -36 -16 -6 -7 44 23 -16 -40 12 32 -12 -13 15 -21 50 -5 10 -36 1 -7 8 -9 -14 44 47 13 -5 -41 -11
5919a1J5J4k4L2o4K3M6l0Kl3O8k0k6L4pm6O0n4L0K7j3m8L0n8kL4J7m3N8m5N1j5
5951BlK1m1J2nK9RKK4n1K5K1p9M2k4k0O0Rk4Pn9J7L4J9l5mK1qj9N3Lj4Jm9Rk6
5987d1Q1j9j9m1O8j6K1m6J4K2k3k1j1M3n0N2LK4j23Q6Qj9j1k0Q2k6k0LoMK6mn3
6020c2QR6mj01J3nN2k9m9M8K7jo6QM8M3j09L8K9k7O6q7O5k6J8k7L6k2l3J20r8
6051al4K0O2n1JJ4%L5rok4k8M1m5K0j0P5l8l8J9Pll2kO6k6j8Jk7ON0j8j7J0J9
6086A9N1p1l9J3P0n7J0K2J4j8j8k4QM3k5j3pLJ8k1k9M9R7p8j8JN0j01O4k3L8l3
6118en8P1l6rK4M4j2k2Qj4Qjj8J4nK4L0k8m6J8j8M5l2L0k6O6k8m0M6n0RK2K3J
6152C5j2K5qq2P6Jjj2m0K1l0j4R5pk3j3qnj5O5n6Jj3O6k9k9%R0p0j8Nk1M1k6j3
$$ plain form
5919 -11 4 18 -6 26 -38 -15 31 1 3 -30 38 18 -8 26 19 -27 33 -21 9 36 23 -25 5 -53 -55 -21 -4 -47 11 -34 17 2
5951 2 -1 20 -21 -9 -14 15 24 26 50 -1 24 45 -34 8 -16 -36 24 33 9 16 -43 -26 8 27 -8 -12 9 1 -18 35 38 24 25 -24 -15 -41
5987 -41 40 21 2 -39 29 13 34 -12 2 24 1 -20 -31 12 -38 14 17 41 -82 4 12 -7 -18 -38 44 18 -2 1 -5 -1 25 21 -32
6020 -32 -24 72 68 -33 -20 -25 27 -2 -51 -3 24 23 -43 -35 13 56 -53 -15 14 -13 53 -34 31 5 23 -4 32 10 -23 97 -1
6051 -1 -35 -15 47 -4 -3 11 11 46 37 31 7 -21 20 -25 -5 -15 60 22 -16 3 10 7 -25 -27 39 13 -5 -4 -31 -25 25 7 -10 0 19
6086 19 70 -1 -40 -27 43 -14 -4 18 32 14 -4 -28 -20 23 -2 -15 -22 -19 -1 -22 -51 -2 95 17 -1 0 50 -51 13 -10 28 -5
6118 -5 -63 8 -28 -37 -13 31 19 -3 5 -9 -1 -2 -20 -6 -11 13 43 15 -31 -13 -31 14 -18 12 -14 52 24 -16 30 -20 -11 11 34 35
6152 35 23 48 40 -42 34 35 34 22 -18 3 -27 -41 54 47 24 11 3 -2 -17 48 -8 -7 -20 46 17 -12 -12 78 8 -10 -5 -26 15 -11 -24
6187b4K6nK2J3j5k6J1k8K6K0o7J07l9l8M8n9N3m6MpJ7Qj7K1j5M3Rp9K3O5J8p1
6219bk1N8Oj2q1J12j7j7Nl1P1k6Nn9j7K7J5j4J9L1K2p6RN2k2rk2J1J2kj9J8o5
6252c9MN1J7m1k2K1Rk0kJ5R6j04J1n1N1M8k0Opm1pP8r6J0N2J9r9M0M9rp0N5MJ0
6286A8L1q8P2j9k3Oj3J7J3pK1Lm6L6j7J7M0j09N7n4O4k0j9J7j6L5L5q3J6%nJ3
6318hml7N1j1RjJ1Nk7N5m5OK2J2p3J03q1RJ7l0J7K1n1M2j1Pk0j0M6L8m1kk7qP0
6353E4n3k3M6k2K5J9q0N4j9N6l7l3M0M5l8m6pL6Op7L7J7RK2k3j1J7oj8oj8P0j5
6386B1l7J1J4K5k4m4R1j5o7J6PNJ4K5o6M1L9j7k6n3L5L5m9n4P2M1k2j6L2J0m3
6417AL6k2m8M7%oJ8k4L8l1n4L9N4J0ln2Kl4M0j0k0M0j5rl3l2J00Om1j1l8R4l3
$$ plain form
6187 -24 2 -3 19 32 17 -9 2 -26 0 20 -47 60 21 -17 31 -28 25 -21 -17 -24 -7 1 -16 5 -10 33 42 -37 -14 51 69 -2
6219 -2 -23 35 41 29 -52 60 43 26 31 0 71 45 50 -9 -26 1 16 2 21 52 74 -2 7 59 37 28 6 17 29 27 8 26 -39
6252 -39 -35 16 33 -8 -30 -9 0 -20 -22 -7 89 -15 -4 -55 -4 44 24 30 23 -18 -25 53 -43 -33 19 38 -61 -21 28 19 -51 4 8 18
6286 18 49 -39 33 14 -9 -3 -16 1 14 7 28 31 -15 21 4 21 61 -48 9 -45 19 -1 -20 -3 -19 16 51 -32 -16 -16 -21 -8
6318 -8 -12 -49 2 -9 0 -1 10 15 -12 43 -2 4 26 38 -35 68 -13 -4 13 -17 0 21 -30 12 1 8 -12 -22 24 62 21 19 -8 -16 54
6353 54 1 -22 24 2 27 46 -34 20 1 57 20 -13 27 72 34 -12 -19 17 23 -54 -17 0 9 31 8 -3 14 8 -10 -16 -34 36 21
6386 21 -16 -5 9 34 10 -34 57 42 -25 -9 -2 3 17 42 -24 17 56 39 13 -40 -5 30 -19 -73 -1 40 18 2 34 44 1
6417 1 37 15 -33 14 14 8 26 2 40 9 -45 -6 48 58 55 3 5 -29 11 1 -19 21 6 -3 -36 -68 32 38 -3 -14 -52 42 9
6450Il8J1L8j6L6n3J5K6k8lj7K0k5K1J8n2J00l5m6LN3j9j6m1P5K3o1K5J3j0Ml5
6482eN4m7MJ13r2n2M6K6j2q4M4L3J9k7k2Q9r9n0L6j7J0O0l9J8Mm6M8j3j3N8K1
6513F5j06M0K6N6o6k8M9l7k8L0oj4M5m0k6N7j0K8pp3RM5Mj3k7N0Jp7L8M4pl3l2
6546d3L4L2P2n4k6n1M6j3p4O8Q1n7pkl3L3J0k0j3M2n5N4M8l9o0J4J0n0O6L4k3
6577B4p9N3J7M3p9k5J03Mo6J1l4M0mL4o8KP2Nr4N8n1N3rj6L8jk7jJ9Kmj0n4l9
6611h3R7oj1k2J5O8o5l4k5P7L9r8J2P7Ro8J3k9j5J14J1j04OJ8J1j9jnL0J8l5J5
6643A0k9M8k4j5J9J0l6M5n5K3L9j1m4j4Q9m0m2L1N0k3Pm9M0o6lM1Ql6M0m1O3p3
6675c8O1j9K2j6NN8n5k0NK9l4l6kQ0m3L1o5O9l5k9L6K6k6O1l5pk7n6P1o5K1Q8
$$ plain form
6450 9 -29 -18 20 4 40 -13 2 28 0 -3 -20 0 -25 -4 14 -38 62 27 -19 -16 37 18 2 -39 36 59 -2 23 36 26 30 -5
6482 -5 49 2 6 119 27 -25 21 47 35 -49 -5 28 47 20 -2 87 -12 -62 -26 -43 -33 27 -12 6 10 -36 12 -1 -14 44 65
6513 65 -41 -1 25 81 15 -13 36 -1 -29 1 -5 -19 26 -14 -40 17 7 35 28 -45 -36 9 13 0 -27 23 24 -53 -15 29 22 -11 -43
6546 -43 -9 23 95 41 15 -36 10 -3 -77 -9 72 15 8 6 -27 6 16 -4 -17 25 -30 24 72 33 -27 -13 -3 -53 13 47 24
6577 24 -55 -2 15 58 -21 -46 57 61 -5 6 -28 12 8 42 -26 -24 48 53 -41 17 -34 19 10 -6 32 31 4 3 22 24 20 10 -44 -83
6611 -83 14 8 -3 -25 -10 58 -7 -41 -66 11 50 -48 -36 41 50 -18 -5 -34 -49 65 76 -28 -22 -4 7 -12 -13 -18 12 30 -5 10
6643 10 -19 29 5 -10 9 19 -17 28 -27 -4 35 24 -20 -34 55 15 -27 4 54 31 38 -11 29 -37 -40 1 9 -27 13 -28 35 -38
6675 -38 23 4 26 10 15 73 18 -2 3 32 -2 -38 -40 40 -3 28 -37 32 -3 -32 4 30 4 65 30 23 -4 -60 11 -54 -33 55
6707E5o5k8P1Mm5j7JM6J1m0L4n9mR2k4k3k3j2J07p4m3M2RK8p8L2N8n9k6M7kMr
6740A0ko6L9Q6m4m0K8L6k1k6p1M1L5lMj2k6Pk7N8j5K7K4l0J1l2O3k3r8Q5%N5n2
6773B1p7M9J9JOJ0m7J3lMKm7P8n2k8R7k5k0n7O9rj6o0M1M5m2L8k9J6j0K8k1rP2
6807E7%m8j7J9M3ok5J2n7P7l9j7l7J11o6M1k5m4L4pll1L7P5j22k1P1k6P4j03Q4
6838D1Kn8M4%p3O6k1K1l3LO5l0l0oO5k1l9k7R3p2QnRNNK3k6m6N5K0m9J9KO7r3
6873a6RK4J6km7K8K3k4p8M1L9k1K5K3j4k0L3p5n0Q7M3l3k8k2P5N0p2k8N8J8m8
6904A4rQK4%pQn0M7K8r6M6m0N7l8j2j2J00n8n0L4L8l8L1O1j35N8l8M0j2RM3l0
6936B1l8%R7o4m7N0J8l4p6K4J03m2M9r2k7N5K8k6NM2k2O4p7o2L4PM1o3NK5K6N
$$ plain form
6707 55 -10 -38 33 37 -8 -25 -24 22 33 -7 27 -32 -36 56 32 9 -14 -26 81 7 -36 6 15 43 -35 -3 55 -4 -30 17 15 19 10
6740 10 8 -58 -19 67 23 -17 11 47 26 0 -71 -30 5 2 6 -6 -32 -25 -52 6 -9 18 42 12 23 -9 54 31 -67 18 18 73 21
6773 21 -56 -7 12 13 19 29 -18 -5 -8 -4 -2 -49 29 -23 -51 46 21 1 -56 13 4 -12 -72 -31 14 -28 10 -19 -3 -13 15 -6 -15 57
6807 57 57 9 -8 11 54 48 23 35 -22 55 16 -1 -38 73 7 48 23 -21 13 6 3 -28 9 84 -38 -59 12 -14 60 -43 41
6838 41 43 -15 29 29 -44 22 1 22 -11 -8 57 27 -3 -9 56 35 -4 -31 62 -10 -2 -7 2 7 12 35 9 -37 18 38 -11 8 10 77 -16
6873 -16 -7 17 33 31 -16 12 35 11 -67 -26 13 -8 17 40 26 6 39 -36 -86 1 44 11 -17 -39 36 86 14 -14 44 62 14
6904 14 5 13 37 37 30 38 -12 35 63 -33 13 -27 30 -8 -20 -32 68 10 -40 -6 32 -6 25 86 -49 9 -29 11 -1 8 51 21
6936 21 -17 -17 80 16 -31 19 37 3 -73 -49 54 12 61 -31 -58 -3 25 -1 4 46 24 88 11 -51 -17 -10 31 -32 -27 -2 24 29
6968B9k8m8L7J6Qq4M3Q8p8j7K7J4K7q6j5O8O1m9p2P4j7N2p4N6n9Q3j13M9k8M5
6998IL0k9m2O0j0n7rQL7L1n8L8k2kM4qML2m2M3n2k6N6K8r2oK8O2n6K3k6j4N0j8
7032A4m2K9L1j5j6PRk0K2o9J37j47O0rJ0j6K5Km5K7rN0m9j5K9L6j2p2L1J4J5k6
7064a4j4N6l5K4p6Q4m6J2On7K5J3J0J0J2RJ1p0K7oP4j3p8P6L2K7p9l4K5K7Qq1
7096c5J9M4m2M1n2jk0O2o9L0P6m4l7K2k4O5n8M4k3L8k1m4Q3p0L8M4o7K0K8l7J8
7127B8n8K9J8nnj8J6M2q5L7NJ3m0lM0k3K1K6k2o0P3N8j13JJ07J9r8j9j1N3j8Q
7159A6Rm6L4M6j8j38J07M0q6k6M7O3m8r6P2L8nL5q5J9lM2L1j15O7R5m6l9K5l%
7190C2J9o5j0Q2lk7l9j0N2no7M6O3l8j9k7k1P5l8j9OL6m0mK0L0mp1M9j8RK7K0
$$ plain form
6968 29 1 -47 -10 6 14 -70 -27 61 -17 -34 -7 7 34 -52 -67 1 62 13 -59 15 -2 50 -24 32 -27 56 -57 -8 -36 9
6998 9 39 10 -32 28 18 -39 -48 -40 -3 28 -30 8 -14 -16 28 20 24 56 14 57 5 -21 35 63 -29 -35 -7 55 -1 22 -4 -18 32 14
7032 14 -28 1 32 17 1 8 17 -3 19 -50 87 -60 0 -9 1 -15 10 12 -33 -6 -15 35 -14 -29 0 36 24 -48 -17 -3 12 -14
7064 -14 -28 28 -7 17 -59 25 -21 -9 -3 -60 -35 -22 -12 -2 10 19 30 -40 -13 -19 55 42 -36 40 72 99 20 -14 11 38 46 -35
7096 -35 -16 28 -14 27 -25 -26 -46 16 -53 -23 53 9 -28 -6 -30 35 -23 21 -2 36 15 -29 54 -16 22 66 -1 19 47 10 28
7127 28 -30 -1 17 12 7 -11 5 47 -38 -1 4 17 -23 -26 14 -9 12 38 16 -44 29 87 -26 -25 82 101 3 -16 -27 26 8 16
7159 16 25 -21 13 59 41 -97 10 50 -36 -62 -15 48 0 -96 -24 14 9 44 -41 -22 -25 17 48 -67 0 95 49 10 35 32 32
7190 32 51 -14 -24 58 55 28 -11 -21 31 26 -41 5 68 30 11 -16 -37 38 0 -19 -13 23 -17 -21 -1 29 25 -46 3 -15 -6 21 41
7223D1p3%P2k0m3kk5N9pl9N1M3j25N5N5Pj23P0lL4JNq6J6J3Q1j17Q4m7O5L3j18
7255d3QN7J0r1L5J02o6n4R3n0j2R4o1o2O4k5M0j01J8P6%l8n%L7m6K7%K0Qn8j8
7287d1O2qPk5j9K3k7J6j8L0M1K7o6qjL5p0N8l8k2R0n1rj5M0j2j4kON6r8OO1j4
7321@Jm4Q9m3NJ9j9n7P3j8ol2O8jl0l8J2O7mr2L4R1p6p9J03k3PL5k5%o6O0j4j8
7355b1k4O6J5j06QO0M9m6j5J2L2Rk8k0K8k0N0p7J7j8P5l4l9jN0j5q1L3O3J3m6
7386a1No7L4M8L6J8m0J1k1Oo0M6L2kOl6N9m2j10J30nm1L2k3k1Nj3P1j8l4M0l2
7418CKKJ7J8n4l1N3Nk8jM0j8m9N3l1jM9l6M8l3J4k6k8N4oK6m4kJ5k8O1n4l9M3
7452fJ7l7N3j2QM6p9M2k9k2L2k5k6M5K1j0m1k8P4J4l5QJ5j9j6N2m8J2P1o6L2M
$$ plain form
7223 41 -32 -32 40 20 -23 -25 -50 9 2 -37 14 57 -68 -13 42 49 -74 -4 -7 27 28 33 -53 -37 -24 57 -60 24 -23 42 75 -43
7255 -43 -35 22 32 -59 -24 78 12 -42 51 1 -11 83 22 -40 24 -1 39 -62 -44 32 32 -6 -11 -11 26 -20 7 7 27 35 -23 -41
7287 -41 21 13 20 -5 -24 -1 -28 -12 -30 0 41 68 2 -6 -7 28 -42 16 -22 -44 46 -5 -14 -29 11 -1 -15 -17 -11 45 -53 -47 14 0
7321 0 1 -43 46 3 8 27 8 -49 24 6 0 -32 36 35 5 -33 -21 46 42 -50 -16 75 -1 -80 23 0 7 42 17 17 -49 11 -3 -21
7355 -21 -45 21 36 -70 -62 -2 47 1 -14 -2 30 39 11 -9 19 -1 49 -28 -11 -29 46 12 -27 -28 22 7 -74 -41 22 35 -11
7386 -11 -6 -73 -39 9 45 63 23 34 13 19 -41 5 37 35 41 5 64 22 -88 42 37 -4 28 5 -16 -11 -24 47 29 -5 35 3
7418 3 5 7 24 42 -12 -43 10 15 -13 -14 26 8 -41 12 -19 -20 29 -7 41 8 22 -4 -32 22 16 42 -2 -4 11 -17 44 -10 -49 -6
7452 -6 11 -26 27 15 23 69 -10 32 3 -19 13 -12 -38 7 28 18 -23 -51 23 37 2 10 25 6 -10 42 -6 6 77 11 43 47
7484D7l5l2k6pP9l2m3O4J6J0k7l8L7K6k3j0q4J08PK0j17K7P9j7r6N8L9M1o7j1
7514gm3N4J4k0k1j7O7pk6QJ2L6m5kK7k9K5ko9J26p6Nm2JM4%M3q2J0N2p4oM2lL8
7549C3j5o9N1Oj0Kj6L0K8l5%KJ8K6l7nJ0Lp5j5M9N7k1k1K4Pk4j3O3n2k6M0o4l
7583e2R6l4K6j2%J1m6m2M6M7n6K8o2M2J5KqM9k9l4m6K8qN6O2j24M3rN8l9n8L3
7615a7N2K1l4k5ql6M7M7o6K6K0m5M5M9m0J8o4k1J7L6n3K2N5m0pj9jM4k5l3L5m3
7647d3L1l0M3k3J8M1Qo5P9n8J5Jn3Q9j9m5L7J2k9O8l6j5k6N7k3l2k9Q2L6j30L9
7678@L1J1m0m8P9Nl1NJ0R3r3k4j5%j3Q8o2j0k6N8l8J%mQ6j3m9RRk4l2l3R5Onm1
7714a5N9K0k5o8J4L6L1o7K0ll3O1qKoRk4j2K5J2J5m6l5N3J8rj29J26J8kl8n2P0
$$ plain form
7484 47 12 -20 -46 -53 26 -6 -49 15 31 41 14 -24 13 39 16 6 -78 30 37 57 -60 -33 46 29 -67 -9 30 71 4 -7
7514 -7 -50 4 18 -2 -23 -40 27 20 -6 2 14 50 5 3 30 1 26 24 -45 81 5 10 -32 -31 13 13 56 -26 -16 36 -38 -44 -2 -5 33
7549 33 18 -51 0 6 -4 -2 -18 12 40 5 5 7 25 51 14 9 19 22 -53 -68 -19 38 17 -4 20 27 3 -10 53 1 -25 15 -49 -52
7583 -52 44 10 36 24 24 35 -11 -53 -7 40 -16 12 -50 -8 7 9 1 50 21 -13 -59 -31 -39 17 79 -45 -2 -11 47 8 -50 -17
7615 -17 35 56 22 -3 -11 -47 0 47 -19 7 27 -18 27 76 36 54 -10 -31 -14 22 -31 -9 46 6 -1 -20 -21 23 -2 -35 0 -43
7647 -43 -12 -42 1 -22 -4 37 45 -20 59 1 16 17 -36 53 34 -11 26 38 9 77 41 26 0 57 34 2 -27 55 91 -39 0
7678 0 31 42 2 -46 33 38 7 12 22 115 22 -2 -17 -17 -30 58 -4 -14 -40 18 -20 -19 -19 -23 63 50 1 10 19 -5 -37 -70 25 31 26 -15
7714 -15 44 64 39 -29 -15 21 52 -15 5 2 -31 30 22 24 18 27 3 -9 16 28 43 -3 -38 15 33 24 -105 21 39 37 -1 -53 17
7747A7Ql6qK5QjJ6m8K3P1l4m5l9QJ3k7P9l7R0p3m6QQM9m8M6k7M7k8l9K1Nk0%M
7782a0N2l0m7M1j1Ql6N2k3nQ6q4l9M8RN9m9l0j8N6m2L2j0j4K8j0mQL5k2m5nK6
7815Fj9J9MJ2l8J8l6QL2J3Jj7N6n8K6o0N6k5prL2k9L0K1m4pL9K4k1n6M2j7N3q3
7849c4RNR4q0j6N3n0L4l7k0nM7Kmk1j6O7j0n4L4O1qk1q4P7j9LJm1P6n1ok2M7j8
7884gK3p0P3K6n3RJ3j3j3K1qm5J5O9l4ml8N3J9k0J7%J0n7RK6k9k3L3o8Q7J9J8
7917E8p2M3nn7L7M8m2Ok9Q3j44J29Oj2j4p7P9j6K4j5J3m0j8J1K5%jOn7N9pJ1J4
7950D6o4J13n7Jm1mk7nl0Q6jn7N4l1K8LkJ1K1K6k2o2k6R4m1No6M2PrL3n1J3m2
7984e5N6Ro1J6K1O1k7n4O9k8NLL8nq3M1orPQqM9r7O3l6k4L3oJ8J0O0n2q7L3K6
$$ plain form
7747 17 25 -11 -19 6 14 13 29 -19 4 75 41 -4 -43 -35 -22 -49 30 -7 83 10 -36 -28 -20 29 -19 27 0 47 19 -20 1 6 -14 -14 -10
7782 -10 42 12 -35 6 -5 3 -33 19 -4 -9 77 -7 -46 2 11 70 21 -9 -27 29 -13 19 9 -5 23 13 9 17 52 30 -15 -20 6
7815 6 -13 6 10 22 -16 2 -34 -26 6 19 20 3 59 1 27 -33 23 -2 -9 -18 14 -15 15 36 -8 -15 24 48 27 -29 13 -4 49 -34
7849 -34 -25 -20 74 -6 -22 31 -19 15 -22 -42 -47 0 2 -2 -23 -39 28 18 -36 -2 59 51 30 -54 23 4 7 8 -33 43 -8 -14 -36 11 -7
7884 -7 16 -54 19 45 -8 1 14 1 -12 9 1 -44 -29 40 6 2 -36 17 36 16 33 33 43 -14 -5 21 -8 -31 2 -66 21 40 58
7917 58 -14 29 24 -33 4 52 10 16 -13 70 -74 55 61 49 35 -42 37 21 45 30 43 3 -15 -4 21 21 20 26 -31 28 21 32 46
7950 46 -18 95 38 39 -2 -6 -33 -38 -68 18 17 -40 14 -17 11 14 12 23 44 70 48 -14 -40 54 13 18 -48 -6 1 -8 25 -26 -13 -55
7984 -55 1 10 -51 -35 -14 47 20 -34 35 7 12 15 53 48 -35 6 0 -9 -2 6 -2 47 -50 13 -23 -47 -14 -20 -2 8 68 16 -71 -38 -12
8019a2J0J7mJ4Jl7K5qj0KnQm5R8k0m6pK2L1j1m0JRj3L9m3L1M2n0N4p5O0%l3J8
8054B3m0Q3j3n7l6J0N8k5J5K4q2Q6l8k7K0j0n1N8k2N0p6L0j8M9K6p4K5k9M9Kl9
8085b9K9kj7M4k5k5j2N0M1o7J8KNl1M2j7J4n6M1j7K0m5J9P9r1M6mom2J2M6j5q
8118aO5r0M1l3pM9n1J5l4QM1K1m5M0J4l7L7l7m9K2L2j6MrN2o6L6k2N5l2l9L0p
8151a3L4k7j5L9k8L9Mj3J3n7L4K0m6J5N7q9N2j1l1M3l4j1L3LL3j4n5N5k4j1k5
8182c0M9ln3QL7M6J7o5m4
$$ plain form
8019 -12 -2 15 11 25 26 -11 14 6 -4 -2 -7 1 -44 54 34 -12 -19 3 34 23 -17 -16 -7 -20 19 -24 7 49 -1 53 -22 38 38 5 23
8054 23 -17 66 53 -4 -40 -30 28 3 18 42 -40 46 8 -19 1 -9 -60 -2 -24 26 -50 -20 -38 11 37 -37 -12 -41 8 10 -29
8085 -29 0 -2 -19 25 0 -25 -37 13 54 -13 5 7 12 -19 23 6 20 -36 5 -12 8 -37 -18 61 -30 16 12 6 -36 -24 22 7 -1
8118 -1 64 -26 15 -18 -25 24 -27 -12 -46 -38 3 24 -21 19 33 -4 33 -4 -53 -31 1 -15 -11 -20 32 -34 2 -20 35 3 -36 -6 -13
8151 -13 21 -6 -21 18 -10 29 33 20 33 -24 10 30 -16 -1 56 -33 19 8 -23 20 -14 -25 8 11 44 30 -25 30 6 -5 -30
8182 -30 19 16 -37 -29 8 54 71 6 -38
8191c8
$$ Imaginary data points
##PAGE= N=2
##DATA TABLE= (X++(I..I)), XYDATA
0@%%%%%%%%%%%%%%%%%%%%%%%%%lOoPj2J5j5J9k3K4k4L1l9M3m8N6o2O8q0Q7r5J08
47E7j20J31j43J61j80J96k12K31k52K71k92L14l33L47l52L41k97J89O3o65K267
68A722p872N6670L40934k68201m67439J73662M03910m2028l02223n7004J49151
79a8718J25510J7618j40126j85527J13037L24926m7598m24633l3070M68590J16241
90C16250m55384j80300L86871K15131k79890k10268J51492J66513k5456q6246
100a287q1684j9099J54556J34406j90670k41644J90965L24720j63165l70101J16033
111a46970L70618o1729l25825J2489K44436K1899j38751l3121K5269J7918Q0654
122F6887K1278j65422p3924K21408J26864k46851j66830K43296J83734k17499
$$ plain form
0 0 0 0 0 0 0 0 0 0 0 0 0 0 0 0 0 0 0 0 0 0 0 0 0 0 0 -3 3 -3 4 -8 7 -8 11 -12 12 -12 19 -20 23 -25 31 -31 37 -43 44 -51 57
47 57 -63 68 -75 86 -94 102 -110 121 -131 140 -152 162 -171 176 -176 165 -132 57 120 -545 1722
68 1722 -6150 50520 391454 123253 -344186 -170524 233386 191358 -110865 -167869 -18718
79 -18718 106792 124410 -15716 -201243 -88206 236720 189122 -235511 -268581 200009 316250
90 316250 -139134 -319434 67437 282568 2678 -207590 -56098 110415 84959 -1287
100 -1287 -82971 -102070 52486 186892 -3778 -245422 -54457 270263 107098 -263003 -146970
111 -146970 223648 161919 -163906 -151417 93019 114918 -23833 -56954 -31685 -13767 66887
122 66887 88165 -77257 -151181 70227 197091 -49760 -216590 26706 210440 -7059
132g059j73577J77464J38019j33004q4826R1308K1897n8309M2328L6806j00703
143d9656k5606J47558K0872j78960j6668J93634Q919j90817N926J73791k8054
154F0939j46826N4879J16148q2289q5984J06128N8672j23379l5234J31130J3134
165F7318j28832J0184J16084l7231r5153O8126O7920j01703l8456J35565J2045
176G5867j65149P357J85947j7098j93309J8221J84825j3576j58204R362J14501
187D8744j1635n7661K4193n521m8169O6692Q1277j17742j19128J50272J54518
198A65840j60546j80859J48543J91348j18218j81648P6551J48785l2321r3077
208c5602n412K0668K9565O0901l5823j40445K3683K06974M410k49770m2079K62768
$$ plain form
132 -7059 -180636 -3172 134847 1843 -82983 8325 30222 -28087 14241 51047 -49656
143 -49656 -75262 72296 93168 -85792 -102460 91174 100093 -90724 -84798 88993 60939
154 60939 -85887 -31008 85140 2851 -83133 22995 81667 -41712 -76946 54184 67318
165 67318 -61514 -51330 64754 27523 -67630 496 68416 -33287 -71743 63822 75867
176 75867 -89282 -81925 104022 86924 -106385 -88164 96661 83085 -75119 -65757 48744
187 48744 37109 -20552 3641 -1880 -50049 16643 97920 -19822 -138950 11322 165840
198 165840 5294 -175565 -27022 164326 46108 -135540 -58989 89796 57475 -35602
208 -35602 -41014 -20346 9219 70120 34297 -106148 -82465 124509 128919 -120851 -162930 99838
220I9838Q0555k44736j10913J98444J24455j31448j15143N3524Q0277K3281k3499
231C4635q8198m8751J32692J25676j50897j95194J41964K45360j09575k67349
241a79637O2646K57010j0929k14025l3830J44069O2073n6420o7563l6556M9346
252b3816J22221j0999j89298m1049K28726R6149k36746j43776K14239J73986j67440
263B2197j80145J05060J58632l8283j10746k1253M2603O4859L6660q7054j15497
274a22967Q6854J82875o6320k28438L2321K46414O306k34798m0678J96373O2701
285A20643j37689o6776O7582N0802K806j7760o4261k7484J09816P6735j35176
296b0762j21641J39520J53857j25956j67522J00469J60715o9622j33433M0162
$$ plain form
220 99838 180393 -64343 -175256 23188 147643 16195 -98948 -45424 34853 58134 34635
231 34635 -53563 -102314 30378 156054 5157 -190037 -48073 197287 87712 -179637
241 -179637 -116991 140019 129090 -84935 -118765 25304 87377 30957 -36606 -73162 -23816
252 -23816 98405 87406 -101892 -142941 85785 181934 -54812 -198588 15651 189637 22197
263 22197 -157948 -52888 105744 67461 -43285 -64538 -21935 42924 79584 -7470 -122967
274 -122967 -36113 146762 80442 -147996 -115675 130739 137045 -97753 -138431 57942 120643
285 120643 -17046 -83822 -16240 34562 37368 19608 -44653 -72137 37679 114414 -20762
296 -20762 -142403 -2883 150974 25018 -142504 -42035 118680 49058 -84375 -44213
306d4213Q9924j7565l6135N632k0052m303P1517J1910j12541k4997J38781L8578
318I6536j48950m8153J43892M9774j27435m1978J03103K4762p5846j8M9568k8504
330c249k7119N6718R477q0209M031R6462j4474j03058K4050J00215l4384q9315
342f0855M6699P3150o0605n4367P4624L5623q7123j9191R4925N449r5940N869
354d1742Q8482j6543p2819K7597N0106m0866k2811N7093m895p5480K9384R4270
366G1776m7070j10434N6250J20829n5740j21673M7541J10490l4735q6535K1384
377b7917N0829j1432o754Q049m0769j3796Q5157K7752j20553m7600J41667O9214
389A13847j45941q7580J32777R7103j04676r3062O6918P3709k5275l9280j3245
$$ plain form
306 -44213 45711 28146 -7989 -2357 -22409 -26712 44805 56715 -55826 -80823 57958 96536
318 96536 -52414 -100567 43325 93099 -34336 -76314 26789 51551 -24295 -24313 25255 -3249
330 -3249 -30368 26350 35827 -44382 -40351 56111 41637 -61421 -37371 62844 28460 -60855
342 -60855 -14156 58994 -1611 -55978 18646 54269 -32854 -52045 42880 48329 -47611 -41742
354 -41742 46740 30197 -42622 -15025 35081 -5785 -28596 28497 23602 -51878 -22494 71776
366 71776 24706 -85728 -29478 91351 35611 -86062 -38521 71969 37234 -49301 -27917
377 -27917 22912 11480 4726 12775 -27994 -41790 43367 71119 -49434 -97034 44633 113847
389 113847 -32094 -119674 13103 110206 5530 -87532 -20614 53095 27820 -11460 -24705
400b4705o837M2812N9180n8616j09960N9454J51446m6164j77775K2659J83941
411I5435N355j68580l1272J33119M8007q2475n1398K3002L8906L7065j1397q9150
423e3383k7276J25953P0755j42642j11353J38455J42084j15185j56327P8864J50010
434I9955l6723j22547k883P6837L3204j8420m9447m4911M9210J03549l3900j49329
446i5405P347J75558K4400j79623n4614J61815P6021j26183q3168P9448P3525
457E9121k8827m7434j8166Q368N5953L7919p9713q3537Q7956J21432q1313j45925
469a14166O2840J53262l7587j42361J1730J14676Q183p4475j8346K6919J6642
480G317K1428m102o4332j6094R6384L8837j14185n9339J17330P3684j07020p8512
$$ plain form
400 -24705 -31542 11270 70450 11834 -98126 -38672 112774 66610 -111165 -88506 95435
411 95435 100790 -67790 -99062 34057 82064 -411 -51809 -28807 10099 47164 35767 -53383
423 -53383 -80659 45294 116049 -26593 -137946 509 142593 27408 -128919 -50055 99955
434 99955 63232 -59315 -62198 14639 47843 29423 -20024 -64935 -15725 87824 53924 -95405
446 -95405 -88058 87500 111900 -67723 -122337 39478 115499 -10684 -93852 -14404 59121
457 59121 30294 -17140 -35306 -26938 29015 66934 -12779 -96316 -8360 113072 31759 -114166
469 -114166 -51326 101936 64349 -78012 -66282 48394 56577 -17898 -36244 -9325 7317
480 7317 28745 24643 -39689 -55783 40601 79438 -34747 -94086 23244 96928 -10092 -88604
492h8604Q7260P2498o2786n5357L8646K9331j8452K613M398l6222L084O6260n316
505C7353q8442M336R9796k688j00470K095R1558m479p6171J0724N7459k0504l8354
518b7787L2804K0486m5708m306N7012r226o3856K0573O4492k9887n8262L7758
530e907M6588m4904l1563N2359J5735o0593j977O8402q521p4010J5323P4944j9498
543B6378o9419K1667N6269k3334l6007K5703J1214k9545J4800L5909l8701m4779
555d9845N7724N5966o9318o6755P2386P4245o7211p4852N4923O5793l7720m6427
567c1091J9093J7562k668J6489q356n1538J1691Q2760o914j06309m799J19081
579E5001K0123j19267l4645J06632M4386q1861m5651M7994L6522r480j6778k7274
$$ plain form
492 -88604 -1344 71154 8368 -46989 -8343 20988 2536 5149 9547 -26675 -23591 42669 37353
505 37353 -51089 -46753 53043 50355 -50115 -48020 43538 39059 -37112 -26388 31071 10567 -27787
518 -27787 5017 25503 -20205 -24511 32501 23275 -40581 -20008 44484 14597 -43665 -5907
530 -5907 40681 -4223 -35786 16573 32308 -28285 -30262 38140 29619 -44391 -29068 45876 26378
543 26378 -43041 -21374 34895 11561 -24446 1257 12471 -17074 -2274 33635 -5066 -49845
555 -49845 7879 63845 -5473 -72228 158 74403 7192 -67660 -12737 53056 15336 -31091
567 -31091 -11998 5564 2896 19385 11029 -40509 -28818 53942 47028 -59281 -64080 55001
579 55001 75124 -44143 -78788 27844 72230 -9631 -55282 -7288 29234 19754 2976 -24298
591b4298j1274N6846M3713p4211p6344P7414J03455o7285j20605M7577J23791
602G8779k3511j11873m4Q5085J8279m6344k8005R96K7391M4335j6310q3184l382
615e7788J10266K8787j21833n4431J17491P4936r9164q5160P1090Q1603l7715
626B8082o3864M650L3556K3321M367m2654m4555N0811Q1085m7454j09166L3790
638d8031J24700j3732j25690p563J12221K4889q5833l3883N0459L2192j1033j9698
650a002k6367n61N6502K5258p5801m9936Q2700P0449p7890q3385O4149Q6042m5568
663B4590p8000K6370N8856r616l1618j779k39O558L1948n132n9060q93P7874R839
677D9698q6674j8547Q5669K4641p6510k5517O1794K0575m3997r796K5626n517
$$ plain form
591 -24298 -35572 21274 64987 -9224 -85568 -8154 95301 28016 -92589 -45012 78779
602 78779 55268 -56605 -56649 28436 46715 371 -27634 -26638 753 45088 28778 -54406 -57788
615 -57788 52478 81265 -40568 -94999 22492 97428 -1736 -86896 -15806 65797 28082
626 28082 -35782 -31132 2424 25745 30112 -12542 -57097 -6286 74799 27345 -81821 -48031
638 -48031 76669 62937 -62753 -70316 41905 66794 -19039 -52922 -2463 29729 18696 -1002
650 -1002 -27369 -27930 28572 53830 -21971 -71907 10793 81242 3352 -80033 -15884 70158 24590
663 24590 -53410 -27040 31816 22200 -9418 -11197 -11436 -4878 27070 21938 -37122 -38015 39859 49698
677 49698 -36976 -55523 30146 54787 -21723 -47240 14554 35129 -8868 -18664 6962 1445
689A445q941K2750m540l9458J4308N2418k0066o0294K2348O1611k2653n6935K2957
702a5050M7234k4587l4349K8081K0226l3055o316L8506n623m2335J5052M3037
714C0821k1649l9782K6229L2487k9281k1802L1940Q865l5474M620L9773j7083
726I664m4598K6919M8586l3121n0394L4872M8074l2408m0701K7142K7933k0548
738A420j0540J4708r578j1400L0694J1832m9731j5784O4249K2242p2199k9187
750e3274P2264L4432o4040l5773M8614L1297k8888k0450P604L516J1589J7791
762B4682k5678m1235L2822O2741l2126p9233K5022Q7814j3313q6273J63P4320
774B9706J1261n3109j7820K5517J8038M596j0797l3313l122N6565K1582p1275
$$ plain form
689 1445 -7496 15254 10714 -28744 -14436 37982 17916 -42378 -20030 41581 18928 -38007 -15050
702 -15050 32184 7597 -26752 1329 21555 -11500 -17816 20690 15067 -27268 -12216 30821
714 30821 9172 -30610 -4381 28106 -1175 -22977 8963 17828 -17646 -13026 26747 9664
726 9664 -34934 -8015 40571 7450 -42944 -8072 40002 7594 -33107 -5965 21968 1420
738 1420 -9120 5588 -3990 -15390 15304 27136 -22595 -38379 25870 48112 -24087 -53274
750 -53274 18990 53422 -10618 -46391 2223 33520 4632 -15818 -8214 -4698 6891 24682
762 24682 -996 -42231 -9409 53332 21206 -58027 -33005 54809 41496 -44777 -44614 29706
774 29706 40967 -12142 -29962 -4445 13593 18189 7392 -25921 -29043 27522 49104 -22171
786b2171m1446P5851N8597p0357o9993N6131P2331l6062o4448J4061M6606N886
798B4986k0713k0680r609K7843M0646k6379o7523J7346Q6435k997r4732j3013
810e8390R1471K7153p7111l6108N4448L7056k7142k9551p99J4285K4983O662m2689
823a5732k9950N1526N1726n1538o8340M4040P7025l1225p6197J6292O5754k450
835C0931m6823p467K2601J1787L883r974k8854K546M9396Q418o2714k0679O7745
848B0796L1318o4908l7983N5200L8663m0999l2889K4935K0951r902m652k246j3466
861a5182J0018L1248j3205m5621J2544N4891r475n7783N825N4557k918m6100K533
874a8668L3752m870j9938R865O359j6619N337K3618j4469k9501K0233L2886k3211
$$ plain form
786 -22171 -63617 12234 70831 474 -69519 -13388 58943 22881 -41567 -27506 19100 24986
798 24986 4273 -16407 -26016 1827 42473 16094 -51429 -34083 52352 49355 -45377 -58390
810 -58390 33081 60234 -16877 -52985 1463 38519 11377 -18174 -18973 -4688 20295 26957 -15732
823 -15732 -45682 5844 57570 6032 -62308 -18268 58757 27532 -48665 -32373 33381 30931
835 30931 -15892 -23359 -758 11029 14912 4938 -23916 -21370 28026 36444 -26270 -46949 20796
848 20796 52114 -12794 -50777 4423 43086 2087 -30802 -5867 15084 5182 530 -1716 -15182
861 -15182 -5164 26084 12879 -32742 -20198 34693 25218 -32565 -26740 27817 24899 -21201 -18668
874 -18668 15084 10214 -9724 141 6500 -10119 -4782 18836 4367 -25134 -4901 27985 4774
887D774l3062K4440K9467k4640k2830K4707J4026k5342l912K6661n654k8050J3656
900e759K8955j9369k8193K2461K5282k3033j9639K1981J1030k0368n69J9344j1138
913I85j9371K2454K0412l1786k2602L7779K4583l9517k5165L6722K3502l0069
925b073j8615K0850J0119j0564J590J634j5359M799K9781p769m2797P083N2438
938C1117l403n6725k195N4661P731m6414j1699L2660J2366j5273q890l140P92
951h412J9923J0963l2770k4860M0391L8561m1669m9385L7070N5028k7746n3705
963c6611J5725M5276l199l0321p083J0560J3060J1131j3415l2111Q295M9147J103
976C1557o0233j2874O3715K3856n9258l1650M7785L4343l1361l0921J2612K1509
$$ plain form
887 4774 -28288 -3848 25619 979 -21851 2856 16882 -8460 -12372 14289 8635 -19415 -5759
900 -5759 23196 3827 -24366 -1905 23377 344 -19295 2686 13716 -6652 -7221 12123 985
913 985 -18386 4068 24480 -7306 -29908 7871 32454 -7063 -32228 4494 27996 -2073
925 -2073 -20688 162 10281 -283 1307 2941 -12418 -7619 22162 14393 -28404 -21321 31117
938 31117 27714 -29011 -31206 23455 31186 -15228 -26927 5733 18099 2826 -6064 -9204 -8412
951 -8412 11511 22474 -10296 -35156 5235 43796 2127 -47258 -10188 44840 17094 -36611
963 -36611 -20886 24390 21191 -9130 -16213 -5653 7407 18538 5123 -26988 -18693 30454 31557
976 31557 -28676 -41550 22165 46021 -13237 -44887 2898 37241 5880 -25041 -12429 9080
988I080N490p042j9794j0504K8747K8841l1222m5359K7812N7308j9769o2465R288
1001b9589N9766J163m9530r508L3170J3873j3243j3503p314Q085K5280J511l8743
1014a8582j3588M6386K5837m7677l5638M3151M0844l3990l9983K2390L2912j0147
1026A1915k0493m29M826P515J1888j0381k7047Q914L8793m427m6079j520M8042
1039B1517O875m4837j0122L7035J0317k6093p343J3675J532j652O343q151j4893
1052a5797J4725K2979j7701k9091J7781L2452j6096l2123J3969K8004j2346k0769
1064a4013J1657J1466j1935j709J2999p334j4640J4325J6065j8754j7021K0883
1076A989J6459k0939j4184J9976R503j8417k696J7214n143j6402J2840J6004j8944
$$ plain form
988 9080 14570 7528 -12266 -22770 5977 34818 3596 -41763 -13951 43357 23588 -38877 -29589
1001 -29589 30177 31340 -18190 -27698 5472 19345 6102 -7401 -14715 -6630 18650 20161 -18582
1014 -18582 -32170 14216 40053 -7624 -43262 -111 40733 6743 -33240 -10850 22062 11915
1026 11915 -8578 -9007 -4181 3334 15222 4841 -22206 -13292 25501 21074 -25005 -26525 21517
1039 21517 28392 -16445 -26567 10468 20785 -5308 -12651 1024 2556 904 7247 -904 -15797
1052 -15797 -1072 21907 4206 -24885 -7104 25348 9252 -22871 -8902 19102 6756 -14013
1064 -14013 -2356 9110 -2825 -4534 8465 1131 -13509 816 16881 -1873 -18894 1989
1076 1989 18448 -2491 -16675 3301 12804 -5613 -8309 8905 3762 -12640 200 16204 -2740
1089b740j5627K2541J4979k3051j3612K1111J0696j7457o202J3132k49q998Q221
1102B744N527j6997l411K5280K589l1595l208L4797M805l3981o767K9237Q036
1115A7056k1259p075J1447L538j143K877q201j1523J5461K1163j9839k9808K0693
1128f613L5903j8326l8288J3101L6108o451k9461k08J8971M772n878o091q373
1141a0834L956K1756J723l2576r323L9024J7365m0288k3778L6363K7542k7976
1153B954k7486J6775K3227m909j4935n701L305J3371J0335j7229k4267J6785L6139
1166B8364j2696m4080O133M6421J513m2841q465L3816J3236k0960j4309O439J1386
1179C957P757m641j9544n067K7918J5914l1679k5910L0947L2885k6101l5684J8328
$$ plain form
1089 -2740 -18367 4174 19153 -3898 -17510 3601 14297 -3160 -9362 3770 3521 -5477 2744
1102 2744 8271 -8726 -12137 13143 15732 -15863 -19071 15726 20531 -13450 -20217 9020 17056
1115 17056 -4203 -11278 169 3707 2564 5441 -2760 -14283 1178 22341 2502 -27306 -6613
1128 -6613 29290 10964 -27324 -14223 21885 15434 -14027 -14235 4736 9508 3630 -2461 -10834
1141 -10834 -6878 14878 16601 -15975 -25298 13726 31091 -9197 -32975 3388 30930 2954
1153 2954 -24532 -7757 15470 10561 -4374 -10075 -6770 6601 16936 -293 -24560 -7775 28364
1166 28364 15668 -28412 -22279 24142 25655 -17186 -25651 8165 21401 441 -13868 -7429 3957
1179 3957 11714 7073 -12471 -17538 10380 26294 -5385 -31295 -348 32537 6436 -29248 -10920
1192a0920L3495r282k6555O62J5704N597k870q599j0349P919K2361m095l1452
1205a8384j633L6550P700l7014j2705L3332J5559k5914j5568J6452J2342o427
1217D290o272k443j795R011J0888j2830j9460J3422K6074j1743k9705Q762K9572
1230A7771n447k6030K700J9448j251j1053J607K295l545N631O855j1902j0545
1243a3466J6019J3930j7780j5870J7521J5826j5870j3470J3439R224j1164l424
1255e085R176k859q192Q694P739j3161p982J6051P973j7014p337J6198N608j3984
1269d175k507J1260j859q251O894N809j1979m246J6555L656j9508l821K0391M206
1283A2425j9085m279J5740L148j0756o85M858l295O70Q463n250j4133Q237J9361
$$ plain form
1192 -10920 22575 13293 -13262 -12600 3104 8701 5831 -2768 -13117 -5198 17163 13068 -18384
1205 -18384 -20017 16533 24233 -12781 -25486 7846 23405 -2509 -18077 -1625 10717 4290
1217 4290 -1982 -4425 -6220 2791 13679 849 -18611 -5189 20885 9142 -20563 -11801 17771
1230 17771 12324 -13706 -11006 8442 7191 -3862 -2255 40 -3505 2126 8981 -2921 -13466
1243 -13466 2553 16483 -1297 -17167 354 16180 310 -13160 279 9503 -1661 -5085
1255 -5085 4091 1232 -6960 1734 9473 -3688 -11670 4381 12354 -4660 -11997 4201 9809 -4175
1269 -4175 -6682 4578 2719 -5532 1362 7171 -4808 -9054 7501 11157 -8351 -12172 8219 12425
1283 12425 -6660 -10939 4801 7949 -2807 -3492 1366 -1929 -1259 7204 1954 -12179 -3942 15419
1297A5419r216k3069Q166K4620n636k3358K667J9220J66j2618j719M181J654M679
1311E156O73j3045m643J9545R624k3372j4758K3808J8995k1283k1106J6032K0410
1324A6036r309j6663K292R924L750r63p789q833R119J8268p567k5888L997L0381
1338A6755J280l1216o544K8015J0689k1436j2641J2529J1709k689p779o745J267
1351f806J4140O751j8682j5120J9873K2201j7891k6829J3305K8168p347k5615
1363a3852J248J9760L815j1177o754R82P307R138n023j7921P78K4080M689k6925
1377i855j0259K6270J4571k2424j6745J6046J6183q747j2615J348O641M573J050
1390F037q523r128R923J6538q939k1863O204K4614k515k4177j005K0736L593j5041
$$ plain form
1297 15419 6203 -16866 -8700 15920 10284 -13074 -10407 8813 8979 -3639 -5358 -1177 477 5156
1311 5156 5829 -7216 -11859 7686 17310 -6062 -20820 2988 21983 700 -20406 -4374 16036
1324 16036 6727 -9936 -7644 2280 6030 5067 -2722 -11555 -2436 15832 8265 -17623 -13626 16755
1338 16755 18035 -13181 -19725 8290 18979 -2457 -15098 -2569 9140 6451 -1328 -8073 -6806
1351 -6806 7334 14085 -4597 -19717 156 22357 4466 -22363 -9058 19110 11763 -13852
1363 -13852 -12604 7156 10971 -206 -6960 -5978 1329 10467 5444 -12477 -11699 12381 17070 -9855
1377 -9855 -20114 6156 20727 -1697 -18442 -2396 13787 5040 -7575 -6227 414 4987 6037
1390 6037 -2486 -11614 -1691 14847 5908 -15955 -9751 14863 12348 -11829 -12834 7902 11495 -3546
1404c546m461Q071L500q82p47n587l320J0361P876j3292j1893J3965J4600j3017
1418A628j5530J0642J4502p855j1267N237O575l173j174K300m337k315R074L356
1432G663j2455m690J4220N729j4323n902J2818N052j0350l008P486k66m732L884
1446A126K729p598j636J0641J301j2716j502J3290J737j2349j386J0076L49o689
1460b627J594L032m395M51P680k913j0926M217J3635m369j4982L318J4833j904
1474F644j2983N79R365l0m433K61j024j781O458M119j0733p115J3273J0295j3834
1489i39j2875J2555J4330r597j3888N624J1424j681o781j727P82L719N966m158
1503B754j2319K914J7061j82j9800l231J9924O637j7676r145J3297R983p515q737
$$ plain form
1404 -3546 -8007 64 3564 2682 1935 -3652 -6972 3389 11265 -2027 -13920 45 14645 1628
1418 1628 -13902 -3260 11242 3387 -7880 -2643 3932 759 -415 1885 -2452 -4767 4307 7663
1432 7663 -4792 -9482 4738 10467 -3856 -9758 3060 8112 -2238 -5246 2240 1974 -2758 1126
1446 1126 3855 -3743 -5379 5262 6563 -6153 -7655 5635 7372 -4977 -6363 3713 4062 -2627
1460 -2627 -1033 1999 -2396 -1945 5735 2822 -8104 -3887 9748 5379 -9603 -6285 8548 6644
1474 6644 -6339 -5760 3605 3575 -858 -597 -1621 -3402 3056 7175 -3558 -10673 2600 12895 -939
1489 -939 -13814 -1259 13071 3474 -10414 -4790 6634 4953 -1828 -3555 -2773 946 6912 2754
1503 2754 -9565 -6651 10410 10228 -9572 -12803 7121 13758 -3918 -13063 234 10217 2702 -6035
1517f035J252N319M673j26r248o030J2006J2060j2253j6982J0338J9946o697k0444
1531a2221K279J8350J869j3869n028P574O251l03n484p105K898J3251J063j7447
1545g922n635J8982J0011j7666j3224J4037J4691q899j3795L402J0537J553n233
1558H39n087j141O814P831o837j3581N169J7486k411j9080r10J8080M078j5101
1572c851o224J0369O788m786n567o34K467N359J820q747o384J0574J0346j0494
1586A036j3029R022J3974o433j3093L487J0564p97o793r71K253J314K618n92o942
1601d382j220J0182L359j1972n251J1972O330j0421o374P896N215m938l202K521
1615b85K99o09L024k94o116M09Q673n5j0213m33J0352Q50r221r11P010K49m198
$$ plain form
1517 -6035 -4783 536 5209 5083 -4165 -10195 1811 13871 1618 -15364 -5026 14920 8223 -12221
1531 -12221 -9942 8408 10277 -3592 -8620 -1046 5205 4902 -582 -7687 -4789 8462 9525 -7922
1545 -7922 -13557 5425 15436 -2230 -15454 -1417 13274 4375 -9420 -6018 4519 6072 839
1558 839 -4248 -5389 1425 9256 2419 -11162 -5993 11493 9082 -9998 -10908 7172 11250 -3851
1572 -3851 -10075 294 7082 2296 -3271 -3905 -1438 3921 5741 -3006 -9390 1184 11530 1036
1586 1036 -11993 -2971 11003 4570 -8523 -5036 5528 4731 -2062 -3033 -780 534 3152 2560 -4382
1601 -4382 -5602 4580 7939 -4033 -9284 2688 9018 -1403 -7777 119 5334 396 -2806 -285
1615 -285 14 -595 2429 2135 -3981 -3572 5101 5046 -5167 -5600 4752 5602 -3619 -4530 2480 2729 -1469
1632a469R08J392k834R98N025k357p366K914R083k764r801K215R410j595p546
1647c787J059M731q47j233J308k208k369M996M130p107o098P905Q013p586r218
1662h311O123R205m143p773J869M800K48q41j610l415J879P355j040j0355p87
1677f796J2244L136j2588n306J1366O908q754p241N170O085j019l526l044j6N879
1692B498M252p451q415P377J1747n752j3952L177J4265l2j2889k559R610M306
1706F182n013m808k41L942N411j699r429j497J1980N068j2598q370J1296J0771
1720A0995q523j1718M872J0651r92p958k323L739M680J109n517o206N083J0356
1734H248l360j3036O09J4186K346j3374m869J0884O508p133o679K847N346J452
$$ plain form
1632 -1469 -561 831 -2003 -1005 4020 1663 -5703 -2789 6294 3530 -6271 -4056 5354 3759 -3787
1647 -3787 -2728 2003 1156 -77 1231 -977 -3346 1650 5780 -1327 -7425 480 8493 907 -8311
1662 -8311 -2188 7017 2874 -4899 -3030 1770 2018 1177 -433 -3848 -1969 5386 4346 -6009 -6796
1677 -6796 5448 8584 -4004 -9310 2056 8964 210 -7031 -1861 4224 3205 -321 -3365 -3381 2498
1692 2498 6750 -701 -9116 -1739 10008 4256 -9696 -6519 7746 7714 -5175 -7734 1876 6182
1706 6182 1169 -3639 -3880 62 5473 3774 -5655 -7152 4828 9896 -2702 -11072 224 10995
1720 10995 2472 -9246 -4374 6277 5285 -2673 -4996 -1257 3423 4532 -985 -7191 -2108 8248
1734 8248 4888 -8148 -7539 6647 8993 -4381 -9250 1634 8142 1009 -5670 -2823 2523 3975
1748C975k616n118r78P464M817q349q237P692J0640n944j1647L340J1070p06r009
1763c606j427N696K682j650k765k444J827N958J72q515k341R618M451r350n941
1778g635P881O582n611o073L046M481q43j994q64j042J746M025j910o484J285
1793c410Q044k46q591p89Q003J584o429j817M317J324j876l4l60j725K102L647
1809C744l033n372L210O563k705p035J998O339j134m888M78K663l70j81Q64k210
1825a069j961M109L349n268m593N426N631m815n877L487N441j947l905M27J718
1840A53O26J012r35l859N97O118M52p746j854Q277L293p767m400O126M862l821
1856A134m275J074K771J461m18l340k524M479N397m351p926L386R502j728r732
$$ plain form
1748 3975 1359 -3759 -4737 2727 7544 -805 -9042 -1350 9290 3346 -8301 -4961 6109 5403 -3606
1763 -3606 -5033 663 3345 1695 -1070 -3514 -1687 4271 4443 -4072 -6413 3205 7656 -1694 -7635
1778 -7635 246 6828 1217 -4856 -1810 2671 1828 -166 -1030 -2072 -326 3699 1789 -4695 -3410
1793 -3410 4634 4388 -4203 -4992 3011 4595 -1834 -3651 666 1990 114 80 -280 -2005 97 3744
1809 3744 711 -4661 -1451 5112 2407 -4628 -2630 3709 2575 -2313 -1835 828 458 277 1141 -1069
1825 -1069 -3030 1079 4428 -840 -5433 -7 5624 809 -5068 -1581 3860 1913 -1992 -1565 153
1840 153 779 1791 856 -3003 -2406 3712 4164 -3582 -5436 2841 6134 -1633 -6033 93 4955 1134
1856 1134 -3141 -2067 704 2165 1747 -1593 -4117 362 5759 1408 -6518 -3132 6370 4642 -5090
1871e090l44Q761K136o477l324L300L573K97k782l744R76O334J556q048m233Q339
1887A230O658p385q261N361Q795k687p993j7N962K328k827l843q33M242M501l513
1903A718p580J857R658M45j0425k776R621M687p627n814M676N790j315m590j878
1918c553K247M368P35n844l865O144O695n272q656L506R566j409q825p96P062
1933B103K380m226l324J083L077K267j991n000J42O811K022p647m000P119N554
1948F370n791o274L743O019j608m702l18K522J791K26k519k881K407N185j581
1963B589o682L51P247J087o861k205N572K700l668k568J556J620M55n1k141j772
1979b771K982L618l227m975K753N653j800n534P13M729J83l215n54J286M01O81
$$ plain form
1871 -5090 -5434 3327 5463 -1014 -4338 -1038 2535 2832 50 -3694 -2718 3616 5172 -2876 -7109 1230
1887 1230 7888 503 -7758 -2397 6398 3711 -4282 -4299 1663 3991 1164 -2679 -3512 730 5231 1718
1903 1718 -5862 -4005 5653 6098 -4327 -7103 2518 7205 -422 -6236 -1560 4230 2915 -1675 -3553
1918 -3553 -1306 3062 3797 -2047 -5912 232 6927 1655 -7001 -3495 6071 4662 -4163 -4959 2103
1933 2103 4483 257 -3067 -1984 1093 3360 1369 -3631 -3489 3322 5344 -2303 -6303 816 6370
1948 6370 579 -5695 -1952 4067 2459 -2243 -2561 -39 1752 1978 -541 -3422 -1015 4170 2589
1963 2589 -4093 -3742 3505 4592 -2269 -4474 1098 3798 130 -2438 -882 738 1193 1142 -999 -2771
1979 -2771 211 3829 602 -4373 -1620 4033 2233 -3301 -2588 2141 2324 -891 -1445 -159 242 923
1995I23M03k438j524L701K689m244l665M040M167l271m151K036L571q09k320k60
2011a152N90P09J450o19l356l5M905J025n683j987N519K854m586l274L159L020
2027B539j248k217n05P58J846J163k608l258K648N120k037o438R30O861L43o292
2043b395j519M613K460k518k637K9K127K368q44m123r94N188L089n490m787M854
2059e79O054l528o486J836N847J45m388j879K112L006N16l324l168K606N328j119
2075B979o785q21P329K706o752m134N259M787l038m569O16L465J776j644l631
2090b457n16M495K958m445n207L501O767j927p450J74O927J474n437k656L134
2105f65L102m36k814k188J902M190k99n379j605N751L461n216m873M075N552k364
$$ plain form
1995 923 1326 -1112 -2636 1065 3754 -490 -4155 -115 4052 781 -3370 -1334 2237 1428 -892 -1152
2011 -1152 -562 147 1597 978 -2378 -2413 2492 3517 -2166 -4153 1366 4220 -366 -3640 -481 2539
2027 2539 1291 -926 -1431 -673 1173 2336 -272 -3530 -882 4238 2201 -4237 -3307 3554 3897 -2395
2043 -2395 -3914 699 3159 641 -1996 -1967 160 2528 1684 -2439 -3433 1755 4844 -646 -5433 -579
2059 -579 5475 1947 -4539 -2703 3144 3289 -1099 -2978 -866 2140 2656 -668 -3836 -1230 4098 2979
2075 2979 -3806 -4627 2702 5408 -1344 -5478 -219 4568 1530 -3039 -2423 1042 2818 1174 -2457
2090 -2457 -2973 1522 4480 35 -5172 -1671 5096 3169 -4281 -4107 2820 4294 -1143 -3799 -665
2105 -665 2437 2001 -813 -3001 -1099 3091 2792 -2587 -4192 1559 5020 -196 -5069 -994 4558 2194
2121B194n406N64M264J045k340k191l2K587K433k490m212J393N484J8n943j416
2137d048N501K584m432l187K941K978j052k139o98P97K096Q99k904k540L061L886
2153C743k420m720J305M955k66m396p46L282J188j701j159j26P02J684J81k923
2169a417j189L540K215l503l053K910L501j898l437R03K755M7j504o45j38R02
2185a1J734m35l329q7M115Q89m222j738L668K310k744k431J424K123j88j159r49
2202a030j73J655J796j923l331J743M331r68m789L0M525J012l663j712K216K091
2218A810o24j693j103P97K461M99l395k022L774L291l438m237K539M602j230m299
2234b268k35L341J420j671k243j15K261K131j677l788N47M969Q15n272k208M740
$$ plain form
2121 2194 -3212 -2648 1616 2661 321 -1870 -1902 685 3118 628 -3584 -2191 3293 3311 -2632 -4048
2137 -4048 1453 4037 -395 -3582 -641 2337 1285 -854 -1552 -755 1341 2240 -664 -3204 -143 3743
2153 3743 1323 -3397 -2092 2863 2597 -1799 -2545 737 1925 224 -935 -1061 -359 1325 1506 -1417
2169 -1417 -2606 934 3149 -354 -3407 -497 3004 1106 -2331 -1428 1327 1374 -130 -775 -913 -11
2185 -11 1723 1288 -2041 -2128 1987 2876 -1346 -3084 584 2894 150 -2281 -857 1266 1078 -81 -1030
2202 -1030 -1203 452 2248 325 -3006 -1263 3068 2100 -2689 -2659 1866 2878 -785 -2497 -281 1810
2218 1810 1186 -507 -1610 -813 1648 2147 -1248 -3270 504 3795 357 -3880 -1341 3261 2031 -2268
2234 -2268 -2503 838 2258 587 -1656 -1771 490 2621 944 -2844 -2297 2672 3487 -1785 -3993 747
2250G47L309l646l764J886L728j25k873j565J430K688M22l321k332L191M011k305
2266A481n277J130N683K72n212j586M092K542k334k831J99K598J720j610l280
2281b413K12M147J434m336l083L900M247k888m702J388M441J06l441j445J871
2296e62K296J6k517j923K134L387j015m420k67M874J466m421k538L481L052j980
2312A063l058M22K392R78j188k076l62K676J821k617l143K016L991j082m353J25
2328b395L894R68l056j431J583J694j21j332j285N47K408M55k937j546L008K492
2344B946k564l092J685L137o99k669k65J695R04m45j155r26J049K131m85k979
2360a732l13L307J210l113j865K500K168j515k010L72J536N44n00j267p22J639
$$ plain form
2250 747 4056 410 -3354 -1468 2260 2135 -738 -2303 -873 1815 2237 -1084 -3416 -225 3786 1481
2266 1481 -3796 -2666 3017 3289 -1923 -3509 583 3125 791 -2040 -1841 757 2477 867 -2413
2281 -2413 -2201 1946 3380 -956 -4039 -139 4108 1220 -3482 -2094 2347 2453 -988 -2433 -562
2296 -562 1734 1750 -767 -2690 -556 2831 1816 -2604 -2871 2003 3469 -952 -3490 -9 3043 1063
2312 1063 -1995 -1573 819 1797 609 -1467 -1829 847 2668 51 -3092 -1076 2915 1833 -2520 -2395
2328 -2395 1499 2467 -589 -2020 -437 1257 1136 -196 -1481 -934 1474 1929 -1008 -2554 454 2946
2344 2946 382 -2710 -1025 2112 1413 -1256 -1521 174 1078 633 -522 -1448 -399 1732 1247 -1732
2360 -1732 -2045 1262 2472 -641 -2506 -6 2162 647 -1363 -991 545 1089 589 -678 -1400 239
2376B39J808j478k889J051L393k73l460n76L021J257k172j595Q96J533M29j035
2392A49j554J03K319J096k673k095K552K943j858l423Q94L339J40k627j062J518
2408b39J600j87j697j311J258K561m59l383n53L644J635l427k535K628L059j424
2424A170k921M0K430J048j195k019j29K422J580k279k906J635L867p40m112m26
2440b535L811J513l004k242J671K475j76k125j326J280K502q0l195j275L238K563
2456C095k734l495J871L822o15l539n99K757J505j401k132k5K112J485j638k756
2472b287P03L571M19l747j602L416K342k477k850J306K802N6k249j151J189J933
2488A374J73k343j391K141K536j479l396O91L667K54l286j207K513J742j339j861
$$ plain form
2376 239 2047 569 -2320 -1269 2124 1851 -1609 -2185 836 2093 -79 -1674 -778 755 1184 149
2392 149 -1405 -1302 1017 2113 -560 -2655 -103 2840 982 -2441 -1547 1792 1932 -695 -1757 -239
2408 -239 1361 1174 -523 -1834 -576 1985 1526 -1857 -2410 1234 2869 -558 -3093 -465 2594 1170
2424 1170 -1751 -1711 719 1767 572 -1447 -1576 846 2426 147 -2759 -1124 2743 2003 -2109 -2535
2440 -2535 1276 2789 -215 -2457 -786 1689 1513 -612 -1938 -658 1844 1764 -1431 -2706 532 3095
2456 3095 361 -3134 -1263 2559 1944 -1595 -2194 563 2068 667 -1465 -1490 622 2107 469 -2287
2472 -2287 -1584 1987 2406 -1341 -2943 473 2815 338 -2512 -1206 1596 1652 -597 -1748 -559 1374
2488 1374 1547 -796 -2187 -46 2490 1011 -2385 -1694 1973 2227 -1059 -2266 247 1989 650 -1211
2504a211p2J563J200p92k098j18K466J252k513k166J939K830j242k887L48K544
2520A043M73j688j148O94J473N18j344j569Q46K263k5k660q50K620J560k197j970
2537a961J345K090n29j635m22Q83J095O5j476j036J455J822r77k447L52K718M44
2554A786k615r81J916J484j064j419k1J055J054m76j734m58K120J321k002k080
2570b114J373K563o57k547j20K172Q51j480j264M82J326O44j097j586M96K414
2586A456J83k713r41K458J781j881k341J047K445j09j975q54J198J425q5j705
2602f11j104J591K092j172k813N29K957M52k769j286K212J842j234k093J66J829
2618E88R32j081j803N0K379J038k383k058J881K706j096k940J70K707P28k085
$$ plain form
2504 -1211 -1283 280 1480 688 -1410 -1528 938 2190 -323 -2489 -550 2280 1038 -1849 -1501 1043
2520 1043 1516 -172 -1320 -626 847 1365 21 -1548 -702 1561 1536 -1124 -1974 646 2206 9 -1961
2537 -1961 -616 1474 945 -690 -1112 -229 866 931 -545 -1581 -126 1696 719 -1728 -1376 1342 1786
2554 1786 -829 -1810 106 1590 526 -893 -914 141 1195 719 -1015 -1473 647 1968 -34 -2114
2570 -2114 -741 1822 1165 -1382 -1502 670 1521 41 -1223 -741 585 1229 132 -1454 -958 1456
2586 1456 1639 -1074 -2015 443 2224 343 -1998 -951 1494 1385 -590 -1444 -246 1179 1094 -611
2602 -611 -1715 -124 1968 796 -2017 -1488 1469 1921 -848 -2134 78 1920 686 -1407 -1241 588
2618 588 1520 439 -1364 -1314 1065 2103 -280 -2338 -457 2249 1153 -1787 -1617 1090 1818 -267
2634b67j466J134J852q1j724j068J214K063m73k711l91K907J277k553j932J647
2650e72K474n96k495k73J847J194j070j681p5J853J148j593k089J038K690l20
2666A480k875n21K558J307j855j763Q38J878K13j557j156R01J815L4k013j094
2682a810J978J864j509k368P75K531qk203o91J486J230o86j441k74J316J204r10
2699D84j827J42K120P42k183j391J773J819j073j867K61J608N64j037j093K25
2715g33J401N59j293j323Q83J926l63k145l87K133R33j734j290Q48J461qj239
2732c71p67P49J309M4j656p20J543J443j103j981N79K130N2j867n83J286J100
2749A187o20j266k20J060J057o78j670N6J871P01j859j279J384J776p48j966O3
$$ plain form
2634 -267 -1733 -599 1253 1172 -552 -1620 -406 1657 1184 -1527 -1918 989 2266 -287 -2219 -572
2650 -572 1902 1306 -1189 -1462 385 1579 509 -1172 -1247 606 1754 161 -1928 -890 1800 1480
2666 1480 -1395 -1916 642 1949 94 -1669 -831 1047 1260 -297 -1453 -552 1263 1297 -716 -1810
2682 -1810 168 2032 523 -1845 -1070 1461 1453 -750 -1441 45 1275 589 -852 -1126 190 1394 484
2699 484 -1343 -1201 919 1661 -522 -1913 -140 1679 606 -1261 -1000 608 1172 135 -958 -733
2715 -733 668 1227 -66 -1389 -506 1420 1057 -1088 -1475 658 1591 -143 -1433 -585 876 868 -371
2732 -371 -1138 -389 920 964 -692 -1412 131 1574 471 -1510 -931 1199 1251 -616 -1199 87 1187
2749 1187 567 -699 -919 141 1198 520 -1150 -1094 777 1478 -381 -1660 -276 1500 752 -1214 -1151
2766a151J677O26j054j116K29J390O78j327j445R41K007k99k225m87K147J070
2782A661j589j533R22J590l8j550p22J004J423k38j748o83J782J381j368j972
2798a678P85K236k9k105p18J651J263q88j542Q0J405Q36j053j594M38J963M11
2815A461k077j058J642J710j113k023L61J946M29j563r94P67J523Oj523r54J335
2832a25J654p95k034M9K096P57j869j298J313J595n18j636l25J344R96p57j450
2849a003j1J609P88j524j419J004J905l57k053k56J808Q40j288j279N65J371L78
2866A078j256r35O82J526k8j773p02J683J314j292j622O18J715M0j576o11J011
2883a28J124l37j328l97J119J145q07j605L20J702M23j624r34J253J261o62j376
$$ plain form
2766 -1151 526 1152 98 -1018 -789 601 1279 -48 -1493 -552 1455 1156 -1069 -1556 591 1661
2782 1661 72 -1461 -539 1051 1013 -537 -1259 -255 1168 930 -818 -1501 281 1662 294 -1678
2798 -1678 -893 1343 1314 -791 -1509 142 1405 517 -1025 -945 460 1296 243 -1351 -913 1050 1461
2815 1461 -616 -1674 -32 1678 565 -1458 -1097 849 1278 -285 -1279 -512 1011 1017 -506 -1460 -125
2832 -125 1529 734 -1300 -1251 845 1602 -267 -1565 -252 1343 825 -811 -1136 208 1204 447 -1003
2849 -1003 -1014 595 1383 -141 -1560 -556 1349 992 -1061 -1317 491 1331 43 -1236 -671 700 1078
2866 1078 -178 -1113 -431 1095 1067 -706 -1408 275 1589 297 -1325 -707 1008 1048 -528 -1139 -128
2883 -128 996 659 -669 -1066 53 1198 391 -1214 -894 808 1231 -393 -1327 -74 1187 525 -851
2900h51L0J238O15p90j158J75J377M67j210j155R63J538m91j632j95J553O92j162
2918Dj074N77J177J39r95q49O64J296j44j457n00J407J064j090j423N58J583J18
2936A055j474o55R52J077l53j228l03J050J004p74j461K80J583L69j487r43J231
2953g7J232o50j435K2J296O09q52j079K74J377L82j313r87R49J448m28j684j32
2971a048J573O91j224j068O22J285j2j165p39Q72J169l23j508j91J408R19j168
2988I3j361O79J588n4j598m46J243R77o26j301m0J246P35r77j286N22J547Q6j609
3007e82o91J348J159r10j351K84J336L72j152q65O29J245N2j319p05J111J219
3024A180p04j465J77J482M79j346j007R53J217k82j194m34J032Q88o19j215k3
$$ plain form
2900 -851 -821 417 1032 242 -916 -741 636 1103 -107 -1262 -299 1239 748 -884 -1079 474 1166 4
2918 4 -1070 -493 684 823 -172 -1021 -357 939 795 -662 -1162 245 1309 219 -1204 -646 937 1055
2936 1055 -419 -1074 -122 955 602 -626 -929 121 1125 351 -1110 -830 753 1122 -365 -1308 -77
2953 -77 1155 505 -930 -908 388 997 145 -934 -660 717 1099 -214 -1201 -252 1196 768 -916 -1048
2971 -1048 525 1216 -8 -1076 -454 831 819 -346 -1085 -213 956 633 -875 -1066 342 1261 93
2988 93 -1268 -589 999 945 -653 -1099 144 1121 495 -806 -846 400 1135 158 -1128 -606 941 1027 -582
3007 -582 -1273 75 1234 324 -1027 -743 593 965 -187 -1052 -423 822 874 -445 -1150 -39 1180
3024 1180 476 -989 -812 670 1149 -197 -1204 -251 966 684 -510 -944 88 976 357 -858 -881
3041h81J422N54j195j124Q96J352k70j445l20J248P92q60j066L29J087M27j075
3058a29r20O63J312j13j423m33J269Q54q87j188L96J240J53j104o09P47R60k16
3076E72j100l77J002R51p55j310L53J380K58j225p33Q27J088l36j193j94R96O83
3094H87o06j038J36J160L81j059r77Q81J231m57j290j26J188N79p94j003L48J128
3112E69K11r59p35N94J138j35j287k69J165P94r21j049M08J196M4j020n82P22
3130a16R21k83j126k04R68P39p25j088L01J249K48j308n97R38R53l97j094j40
3148g61J008O36o93j012L30J062K47j039p46P94J135m70j196o0J199M65r05q55
3166h61M32J064J02j026o15Q03R64l74j109j44J087O69q88j056N35J261j43j106
$$ plain form
3041 -881 541 1095 -100 -1224 -328 1024 754 -691 -1011 237 1029 169 -897 -568 519 946 -129
3058 -129 -1049 -386 926 813 -610 -1043 226 1080 193 -995 -599 641 794 -310 -919 -172 788 572
3076 572 -528 -905 97 1048 293 -1017 -664 716 974 -251 -984 -157 931 595 -598 -792 204 887
3094 887 281 -757 -621 539 920 -139 -1116 -235 996 539 -751 -877 311 890 96 -907 -559 569
3112 569 780 -179 -914 -320 818 683 -604 -873 292 1086 165 -884 -476 720 764 -256 -838 -116
3130 -116 805 522 -604 -808 160 899 174 -914 -613 636 884 -424 -1021 -83 870 473 -621 -761
3148 -761 247 883 190 -822 -492 570 817 -222 -968 -174 961 491 -705 -765 434 899 -6 -861
3166 -861 -429 635 737 -289 -904 -101 863 489 -620 -764 323 992 104 -952 -417 844 701 -405
3184d05m17Q59P67l64j062o8J023N59q30r70M70J169Pj185n26R99Q79n98j107
3203h00J21J056L91p38q54L91J091J12j126m97R08Q56n02j153J31J111M18j028
3221a12p57O53Q95j41j026k67O99Q50m42j055QJ071M00q87p59N35J048j31j057
3240d75l03R45O41n30q89J7J002M15q58p76N48J035j30j102l30R00O91o02r08
3259g09J65R81K50q14o09M68Q55q0r51l52Q67P47n43j021J91J127J26q39o09N97
3279a53Q63k16r09k62Q35N86m93r56J52R47L26q49p03O65Q48k41r27k08Q86N04
3299F95n40p83J97Q52L30q66o60N44R38j59j016k02Q87N88p14q04K40R95J32q73
3319b19n46N34Q13j36r61k38R10N55n75q59K87R43J29q68n19O27P55k49q29j47
$$ plain form
3184 -405 -822 37 804 440 -622 -690 333 892 62 -908 -438 731 738 -447 -973 26 905 307 -800
3203 -800 -679 377 768 30 -824 -433 658 770 -356 -853 55 911 409 -744 -613 498 916 -112
3221 -112 -869 -216 679 538 -488 -755 -56 794 352 -703 -695 376 776 -111 -870 -335 713 582 -475
3240 -475 -778 167 808 278 -611 -594 408 823 -35 -811 -263 772 642 -460 -790 110 801 199 -709
3259 -709 -544 437 687 -127 -736 -268 587 507 -444 -796 71 818 275 -746 -555 572 698 -141 -750 -153
3279 -153 710 494 -415 -677 158 744 251 -705 -553 394 720 -129 -832 -167 681 440 -487 -695 191 695
3299 695 155 -628 -431 421 751 -115 -775 -231 707 548 -468 -670 217 805 91 -713 -473 522 654 -219
3319 -219 -765 -231 582 446 -515 -753 157 712 137 -722 -435 508 637 -231 -750 -123 632 383 -446 -593
3339e93P86N12n59p72K39Q89J81q95n24O54P60k82r34p5P98N25o93p83M18P96
3359D48J60q43m97N86P40k14q96o1Q74M53o77p72M07Q36L7q12l52N56P14l48q40
3380e01j2P79M51o58p27L00Q92N4r27l14O82O56m23p95j4Q12L85o73o18L38P96
3401D83O8q73l31O30O86l98p86MQ42L50p08o07L59P63Kp77l85O81O10l16q45m5
3423e93Q72L86o67o82M56P71j1q33k78O57N48l32q18O5P51L01n91o73M32P68n5
3444D74q63k68O71O13m32p38L8P91L15o11o29L87P11m1p39k66O80N68l63p89P3
3465d18P75K54o49n84M47P31j59p05k52O02N71m01p43L2Q13K87o51n76L80P61
3485E15j06p96j60O65M75m69n94J13P19J98o48m99M46O75j35p65j90O49N12l85
$$ plain form
3339 -593 193 705 146 -626 -387 502 683 -212 -736 -82 678 396 -538 -613 185 710 17 -766 -348 448
3359 448 608 -235 -732 -146 594 380 -516 -577 297 750 73 -699 -292 544 581 -231 -583 -27 687 339 -501
3380 -501 -513 266 717 59 -668 -368 524 578 -349 -663 19 675 252 -543 -557 255 640 -33 -651 -313 483
3401 483 551 -322 -653 -23 663 265 -521 -517 325 675 -33 -640 -281 482 484 -293 -678 3 613 297 -548 -593
3423 -593 279 665 -2 -684 -228 543 532 -301 -579 78 626 294 -524 -459 292 593 2 -671 -239 529 474
3444 474 -389 -657 14 627 195 -543 -505 286 601 -10 -639 -252 459 418 -321 -587 93 661 298 -491 -418
3465 -418 357 611 -38 -622 -175 556 397 -308 -560 42 613 212 -531 -499 314 601 -50 -626 -246 515
3485 515 409 -387 -547 118 593 124 -470 -357 362 560 -88 -587 -141 534 399 -366 -556 93 605 220
3505B20p54K17O98J88p06m29L71O67r0p45j28N95M88m92o87J83P89J23o08m82
3525e82M49O86j99p10j36O36M31m64o10J38O45K01o44m16M96N58j80o37j34O01
3545A29L95l75o69K46O20J43o17l28L46O18r7p49j25N94M21m80n45J55O75J81
3565E38o69m27M49N73j23p21r8N99L70m75n99K39O71R8n93m00M81N43j71o43j02
3586d60O47L43m13n81K39N99M3n68l89M21N95j78p13l9O71K40m71m81K29N95R1
3607D20o01l67M73N12j58o61j4N80L75n14n27K87N87K2o05l02M58N48k34o99r
3628d29O26L13m19n07J69O46P2o71l07M93M66k10n81r6O24K88m48m77K53N73J
3649C79n61k20L76N11k46o38J4O18K06m59m10K15O18o5n87l01M90N35l27n49O9
$$ plain form
3505 220 -534 -317 381 569 -137 -566 -195 472 382 -363 -491 104 592 100 -587 -404 385 508 -100 -582
3525 -582 -133 553 354 -356 -492 144 575 111 -499 -361 284 485 -159 -575 -79 479 299 -338 -472 129
3545 129 524 149 -520 -274 346 489 -128 -456 -110 508 411 -338 -463 131 552 72 -473 -318 357 538
3565 538 -131 -558 -109 464 341 -380 -478 121 491 16 -583 -344 327 425 -168 -568 -87 456 285 -358 -460
3586 -460 187 530 117 -464 -225 374 417 -151 -540 -119 476 298 -415 -454 217 457 -14 -495 -266 329 420
3607 420 -181 -548 -75 437 279 -382 -396 184 559 45 -482 -195 392 414 -191 -493 -35 513 279 -420 -429
3628 -429 197 510 91 -416 -247 399 471 -200 -507 -14 452 242 -339 -435 189 477 29 -448 -195 378 379
3649 379 -182 -402 -26 485 239 -399 -385 233 439 -20 -430 -215 403 338 -249 -550 -60 475 148 -401 -332
3670c32M89L00n03m62L33N85p2n47k05M85M49l41n36L9N46K67n27m49L47M77L3
3691C76n68k73N49M36m04n25J15N48J64n34l72K81N18J0n90j28M55L79l05n06
3711c74N2N84K20n19m26L94N50j30o14j02L93M33l59m86R8N26J69m55l19J94N57
3732C86j02n64j02M61K95l20m30R2M99J41m83k99L07M80o7n38j71N05L54l38m53
3753c47R7N23N1m34l20L87M08j02n34q0M06L73l68m35J33N48Q9m79l31L31M48
3774C64q9n54p8M96K88k77n06J01M67J21l97l38K98M75j00n45j25M86L36l78m43
3795c98J41N11Q6n14j78K49M71j28m80j22M58L29l80m32J52N57k9l96l36L50M53
3816C64j08n04j56N36K61l01n29K30M75N8m40k99L69L49j34m76m2M72K67k86m71
$$ plain form
3670 -332 157 457 -46 -508 -175 410 338 -209 -414 71 520 179 -357 -318 228 495 -32 -481 -134 343 376
3691 376 -192 -465 84 520 116 -409 -294 254 418 -116 -488 -207 311 321 -269 -397 58 437 132 -374
3711 -374 -322 262 482 -37 -463 -69 481 351 -263 -365 28 461 102 -384 -286 240 409 -46 -365 -171 386
3732 386 284 -280 -382 79 374 54 -376 -284 215 356 -127 -426 -119 361 294 -244 -415 90 444 106 -347
3753 -347 -250 273 324 -110 -430 -43 365 263 -271 -351 55 428 60 -375 -242 306 395 -84 -415 -84 364
3774 364 275 -279 -357 139 427 150 -356 -255 212 333 -64 -402 -104 371 271 -274 -399 87 423 45 -398
3795 -398 -257 254 340 -174 -352 -103 368 240 -240 -362 96 425 45 -387 -235 322 293 -103 -439 -89 364
3816 364 256 -248 -404 132 393 92 -437 -207 268 326 -114 -413 -44 305 171 -305 -347 125 392 106 -365
3837c65J95M70L0m34k74L79M09k01m64l7L82K68l85l13J58M57Km22k41L39M13
3858C66j92m79n9N11K20l68l36J81M19M7m73k09L80L19j46m42o1M71K30l38l64
3879c23J57M50nm23k08L36L41j98l91L8M04K40m49l24K19M30qm34k04L58L72k13
3901A65m34L1L77K45l67l62K09M24n6m16j14K92K94j98l83M5L71R6k89l31K53
3922a48M32J1m56j36K82M38k66m18O8L31J96l75k53K08L67m0m31j16L16K96k00
3943A06m06L9M60J41l73k88K25L21o4l67j34K72L19j66l35N9L80J62l20l90K23
3964a36M52j12l60j41K99L43k84l18lL90K00l98k49J99L82n3l76j77L64K66k02
3985H6l91J15M15Q0l38l11K19L97p0l71j44M11K18j93l47K1M18J08l88k17J86
$$ plain form
3837 -365 -170 300 330 -104 -378 1 410 209 -255 -292 90 358 -27 -340 -182 275 277 -145 -386 -47 366
3858 366 174 -305 -364 147 367 -1 -337 -156 263 310 -163 -372 8 327 181 -261 -322 149 379 41 -323
3879 -323 -166 284 279 -144 -352 -16 325 127 -264 -226 178 418 -31 -355 -136 294 286 -148 -352 6 378 165
3901 165 -269 -238 139 384 17 -345 -136 288 232 -184 -298 -6 288 90 -293 -248 123 219 -70 -401 -148
3922 -148 284 295 -161 -297 -15 423 157 -261 -193 138 334 -41 -294 -86 281 241 -190 -306 10 306 106
3943 106 -300 -261 199 340 -33 -321 -96 225 161 -206 -340 -68 251 85 -250 -191 189 351 31 -359 -136
3964 -136 316 204 -156 -297 2 345 61 -257 -260 130 330 -68 -317 -118 264 211 -165 -342 22 288 86
3985 86 -305 -190 225 305 -33 -344 -125 272 202 -169 -313 98 316 123 -224 -203 215 323 -65 -282 -96
4006i6L56j01l67l2K51L04l16k58J12K98J38l19k79K81L18j05l42j32L67K09k27
4027F0l17O8L91J13l30l18K70L55j16l70q1L60K09k56l35J01L58Q4l69k00K47
4048g6L02q0l07j28M14J68k67k70J21L25P7l41k79L84K46p6m11J3K70J37j90l02
4070b70J14L41K3l36j63K31K59n2l60p9L55K38k82k71R1L50Pk80j87J87L69j54
4092A31l18j8K82K39k73k71R5L13M8l07j78K08K61p9l35RK35K23k76k42J53K93
4114A93L8l84j13K29K82j36l16M4K62J71k53k36P7L16L3l15j25K47K21r8l50Q
4136b05K67J88k27l00J86K61Kk68j24K33K55j57k71j8L18J42k83k07J21K82l4
4157A61k54j82K82K76j29l98K7K88J73j99k58J10K68k6k99j03K74J86j43k20L5
$$ plain form
4006 -96 260 159 -208 -240 11 315 -1 -259 -147 151 289 -30 -309 -28 290 185 -157 -289 78 287 60
4027 60 -257 -189 202 315 -15 -333 -63 292 176 -194 -275 85 294 38 -297 -196 162 246 -123 -323 -76
4048 -76 226 146 -161 -289 125 293 26 -244 -123 202 279 -62 -341 43 289 213 -198 -185 85 222 32 -270
4070 -270 -156 185 208 -128 -291 -60 199 147 -213 -292 63 301 19 -252 -161 189 196 -84 -271 -84 285 131
4092 131 -187 -205 77 316 43 -228 -133 180 228 -79 -257 -49 212 133 -202 -193 42 265 -11 -253 -100 193
4114 193 231 -153 -266 -37 245 109 -207 -163 99 270 17 -219 -142 174 207 -108 -233 14 235 137 -213 -205
4136 -205 62 250 23 -277 -91 170 172 -96 -220 13 268 111 -160 -178 140 282 -1 -208 -87 195 161
4157 161 -93 -275 7 283 154 -244 -217 71 244 45 -213 -103 165 139 -160 -263 11 197 54 -166 -131
4178a31K25J10k02k35J64K80ql46r4K04K58o3l29l7L50P8k66j93J02L07l7k90
4200a53o3J98K83j58l18Q0K72L7j65k48J70K42Ol27p2K36J92j22k92M4K91N7k36
4223d6j33J45K13k5k35j65K10K09j55j83m4L08J21k58j68J25K04lk46p3K45J74
4245B20j39k64L5K66R7k62j47J05K90q7k24l0J62J57j47k61L7L53Lk23j26P7K70
4268A62j5k49n3K58J22j74k05L0K14R7j88j64J03L04r6l04l2K41J94k17k06J3
4290a65K79N7k35j44J71K07o2k58m3K43J29j63j78J9K90M2j88j93J92J80m9k37
4312a06j2J80J15j00k27R2K03L0k13j67J74J78n5k91j3J96K02j64k61J06K47N9
4334A73j97k01K12J67n4k16lJ69K00j93j86M7J82R9k45j48J91J94j69j31n8K04
$$ plain form
4178 -131 94 204 2 -233 -69 211 203 -143 -237 -33 225 162 -167 -204 146 224 -42 -235 -133 174 137 -153
4200 -153 -216 -18 265 107 -211 -131 141 178 13 -235 -65 177 183 -144 -216 20 212 90 -202 -158 133 190 -46
4223 -46 -179 -34 179 154 -81 -246 -36 173 18 -165 -209 99 220 -38 -206 -81 123 120 -126 -199 46 220
4245 220 81 -183 -148 118 215 -47 -194 -89 201 114 -110 -140 22 179 32 -229 -192 161 164 -59 -185 -108 162
4268 162 147 -102 -155 103 225 51 -154 -124 90 187 -1 -165 -62 242 146 -158 -190 51 245 28 -178 -165
4290 -165 114 171 -64 -208 -37 170 108 -150 -193 50 179 16 -162 -143 147 189 1 -192 0 180 131 -106
4312 -106 -118 62 177 77 -150 -58 145 175 -38 -205 -31 147 92 -199 -212 -16 186 22 -239 -133 114 173
4334 173 -24 -225 -13 154 100 -116 -119 50 250 57 -129 -82 100 199 -46 -194 -3 191 22 -109 -167 37
4356C7J35j02j96k0K65K3j79j51J98J35n0k29K2J88Q7r8k65J29K76k1k16j85J89
4379b8J94n7k59J3J71J27j42j76R3J76O4k26j04J28J92mk98JK52O9j70j74M7K52
4403A41K3k42p8J57J51p5j88rJ94O9j50j98J53J63L2j76j24J62J56j83j32kK22
4426F6P6j73j47O5K82kk63j7J54J14j04j64k5K45P4j64j69J20J27J6j91L0J5K06
4450A71r8k29K7K44O7k08j63Q8K36m4j69o2J36J95j49j81J9J69Q2j69p1K4J77
4473I2pj86k1J34J50r2j94k5K49K2j34j51P4J73M3j94l2J12J51j05k00j3K13J13
4497A72j84r9P8J40lj49m3J25Q0q5k05M2J55P6j50j42J75J28lj59r7J92R5n8k45
4522a64N2K41L8j11j82J70J07q4j04j00J11J43p9j45K4J85Rj54o1J1K07p8j33
$$ plain form
4356 37 172 70 -126 -146 119 142 -37 -188 10 145 95 -134 -112 76 163 65 -200 -71 205 184 -32 -217 -28
4379 -28 166 109 -150 -137 34 161 19 -157 -64 112 176 -50 -154 -26 166 162 -136 -135 117 186 16 -158 -111 141
4403 141 164 -78 -156 1 152 77 -111 -120 74 143 -7 -205 -52 111 143 -33 -157 5 161 -22 -154 -156 66
4426 66 142 -31 -178 -113 169 167 -96 -113 41 155 51 -113 -138 107 181 17 -152 -32 95 111 -80 -50 -35 171
4450 171 73 -156 -129 115 182 -26 -189 -101 135 91 -78 -140 -4 191 42 -139 -120 49 131 -38 -109 -85 92
4473 92 85 -101 -122 12 162 70 -124 -149 100 122 -12 -163 -89 84 127 -67 -99 13 164 59 -141 -154 59 172
4497 172 -12 -111 -33 107 104 -45 -88 37 117 32 -173 -131 24 100 -50 -192 -17 111 108 -51 -148 44 139 81 -164
4522 -164 -112 129 167 56 -126 44 151 67 -37 -137 -26 117 38 -107 -83 102 111 -43 -104 -93 114 36 -97
4545i7o5J22J51q2j74k7K67Lj28j05O6J68M7k37n8J45J37r8j33l0K04N6j16j81
4569a65R3J83K2j75j05J90O8j15q0k8J76O1j77r8J13K10j17j59l1J19J64j56j80
4592a87J00J69M9j91j18J41J40k9j67n1J77J07j36j62Q5J32M7k01n1J43M6K5j79
$$ plain form
4545 -97 -162 -40 111 29 -145 -172 95 98 -30 -135 -69 99 146 -91 -149 -4 133 35 -98 -128 76 132 16 -165
4569 -165 -72 111 133 -42 -147 43 111 -4 -84 -112 64 125 -52 -150 -37 173 56 -103 -134 -15 149 -7 -187
4592 -187 -87 82 131 -60 -178 -37 103 74 -93 -144 33 140 4 -158 -73 59 106 -95 -146 -3 43 68 -111
$$ [...]
8191D0
##END NTUPLES=NMR FID
##END=
