##TITLE=1H_LY-DIX-5
 CD3CN,8 sc, 
 10.02.2021
##JCAMPDX= 6.0         $$ Bruker NMR JCAMP-DX V2.0
##DATA TYPE= NMR FID
##DATA CLASS= NTUPLES
##ORIGIN= UXNMR, Bruker Analytische Messtechnik GmbH
##OWNER= root
$$ XWIN-NMR		Version 3.5
$$ Wed Feb 10 10:56:32 2021 Russian Standard Time (UT+4h)  she@DPX200
##.OBSERVE FREQUENCY= 200.1315066352
##.OBSERVE NUCLEUS= ^1H
##.DELAY= (6, 6)
##.ACQUISITION MODE= SIMULTANEOUS
##.ACQUISITION SCHEME= undefined
##.AVERAGES= 8
##.DIGITISER RES= 18
##SPECTROMETER/DATA SYSTEM= spect
##.PULSE SEQUENCE= zg30
##.SOLVENT NAME= CD3CN
##.SHIFT REFERENCE= (INTERNAL, CD3CN, 0, 15.7039)
##AUDIT TRAIL= $$ (NUMBER, WHEN, WHO, WHERE, WHAT)
$$ ##TITLE= Audit trail, XWIN-NMR		Version 3.5
$$ ##JCAMPDX= 5.01
$$ ##ORIGIN= Bruker BioSpin GmbH
$$ ##OWNER= she
$$ F:/spectra/data/she/nmr/H-F/1/audita.txt
$$ ##AUDIT TRAIL=  $$ (NUMBER, WHEN, WHO, WHERE, WHAT)
(   1,<2021-02-10 10:55:09.76 +0400>,<she>,<DPX200>,
      <created by zg, POWCHK disabled, PULCHK disabled
       configuration hash MD5:
       00 E9 B6 7A A2 85 ED C7 34 08 36 98 17 FE 4E 26
       data hash MD5: 16K
       D3 50 97 74 33 B1 0D 7C 3C B2 8E 22 10 B0 D8 93>)
$$ ##END=
$$ 
$$ hash MD5
$$ 1C 6C 3C 85 BB E3 D0 D5 CA 62 DE F3 B4 1F 85 BE
##$RELAX= 
##$RELAX= 
##$RELAX= 
##$RELAX= 
##$RELAX= 
##$RELAX= 
$$ Bruker specific parameters
$$ --------------------------
##$DU= <F:/spectra>
##$EXPNO= 1
##$NAME= <H-F>
##$PROCNO= 1
##$TYPE= <nmr>
##$USER= <she>
##$AMP= (0..31)
100 100 100 100 100 100 100 100 100 100 100 100 100 100 100 100 100 100 
100 100 100 100 100 100 100 100 100 100 100 100 100 100 
##$AQSEQ= 0
##$AQ_mod= 1
##$AUNM= <au_zg>
##$AUTOPOS= <>
##$BF1= 200.13
##$BF2= 200.13
##$BF3= 200.13
##$BF4= 200.13
##$BF5= 200.13
##$BF6= 200.13
##$BF7= 200.13
##$BF8= 200.13
##$BYTORDA= 1
##$CFDGTYP= 0
##$CFRGTYP= 5
##$CHEMSTR= <none>
##$CNST= (0..31)
1 1 145 1 1 1 1 1 1 1 1 1 1 1 1 1 1 1 1 1 1 1 1 1 1 1 1 1 1 1 1 1 
##$CPDPRG= <>
##$CPDPRG1= <>
##$CPDPRG2= <>
##$CPDPRG3= <>
##$CPDPRG4= <mlev>
##$CPDPRG5= <mlev>
##$CPDPRG6= <mlev>
##$CPDPRG7= <mlev>
##$CPDPRG8= <mlev>
##$CPDPRGB= <>
##$CPDPRGT= <>
##$D= (0..31)
0 1.2 0 0 0 0 0 0 0 0.06 0 0.03 0 0 0 0 0.0002 0 0 0 0 0 0 0 0 0 0 0 0 
0 0 0 
##$DATE= 1612940109
##$DBL= (0..7)
120 120 120 120 120 120 120 120 
##$DBP= (0..7)
150 150 150 150 150 150 150 150 
##$DBP07= 0
##$DBPNAM0= <>
##$DBPNAM1= <>
##$DBPNAM2= <>
##$DBPNAM3= <>
##$DBPNAM4= <>
##$DBPNAM5= <>
##$DBPNAM6= <>
##$DBPNAM7= <>
##$DBPOAL= (0..7)
0.5 0.5 0.5 0.5 0.5 0.5 0.5 0.5 
##$DBPOFFS= (0..7)
0 0 0 0 0 0 0 0 
##$DE= 6
##$DECBNUC= <off>
##$DECIM= 32
##$DECNUC= <off>
##$DECSTAT= 4
##$DIGMOD= 1
##$DIGTYP= 9
##$DL= (0..7)
0 120 120 120 120 120 120 120 
##$DP= (0..7)
150 150 150 150 150 150 150 150 
##$DP07= 0
##$DPNAME0= <>
##$DPNAME1= <>
##$DPNAME2= <>
##$DPNAME3= <>
##$DPNAME4= <>
##$DPNAME5= <>
##$DPNAME6= <>
##$DPNAME7= <>
##$DPOAL= (0..7)
0.5 0.5 0.5 0.5 0.5 0.5 0.5 0.5 
##$DPOFFS= (0..7)
0 0 0 0 0 0 0 0 
##$DQDMODE= 0
##$DR= 18
##$DS= 0
##$DSLIST= <SSSSSSSSSSSSSSS>
$$ [...]
##$SUBNAM2= <"">
##$SUBNAM3= <"">
##$SUBNAM4= <"">
##$SUBNAM5= <"">
##$SUBNAM6= <"">
##$SUBNAM7= <"">
##$SUBNAM8= <"">
##$SUBNAM9= <"">
##$SW= 16.9725356469052
##$SWIBOX= (0..15)
0 0 2 0 0 0 0 0 0 0 0 0 0 0 0 0 
##$SW_h= 3396.73913043478
##$TD= 16384
##$TD0= 1
##$TE= 0
##$TE2= 300
##$TE3= 300
##$TEG= 300
##$TL= (0..7)
0 120 120 120 120 120 120 120 
##$TP= (0..7)
150 150 150 150 150 150 150 150 
##$TP07= 0
##$TPNAME0= <>
##$TPNAME1= <>
##$TPNAME2= <>
##$TPNAME3= <>
##$TPNAME4= <>
##$TPNAME5= <>
##$TPNAME6= <>
##$TPNAME7= <>
##$TPOAL= (0..7)
0.5 0.5 0.5 0.5 0.5 0.5 0.5 0.5 
##$TPOFFS= (0..7)
0 0 0 0 0 0 0 0 
##$TUNHIN= 0
##$TUNHOUT= 0
##$TUNXOUT= 0
##$USERA1= <user>
##$USERA2= <user>
##$USERA3= <user>
##$USERA4= <user>
##$USERA5= <user>
##$V9= 5
##$VALIST= <valist>
##$VCLIST= <CCCCCCCCCCCCCCC>
##$VD= 0
##$VDLIST= <DDDDDDDDDDDDDDD>
##$VPLIST= <PPPPPPPPPPPPPPP>
##$VTLIST= <TTTTTTTTTTTTTTT>
##$WBST= 1024
##$WBSW= 4
##$XGAIN= (0..3)
0 0 0 0 
##$XL= 0
##$YL= 0
##$YMAX_a= 677584
##$YMIN_a= -643503
##$ZGOPTNS= <>
##$ZL1= 120
##$ZL2= 120
##$ZL3= 120
##$ZL4= 120
##$ABSF1= 10
##$ABSF2= 0
##$ABSG= 5
##$ABSL= 3
##$ALPHA= 0
##$AQORDER= 0
##$ASSFAC= 0
##$ASSFACI= 0
##$ASSFACX= 0
##$ASSWID= 0
##$AUNMP= <proc_1d>
##$AZFE= 0.1
##$AZFW= 0.1
##$BCFW= 1
##$BC_mod= 2
##$BYTORDP= 1
##$COROFFS= 0
##$CY= 11.3945322036743
##$DATMOD= 1
##$DC= 2
##$DFILT= <>
##$DTYPP= 0
##$F1P= 15.9154993809931
##$F2P= -4.1035820241983
##$FCOR= 0.5
##$FTSIZE= 0
##$FT_mod= 4
##$GAMMA= 1
##$GB= 0.15
##$INTBC= 1
##$INTSCL= 1
##$ISEN= 128
##$LB= 0.24
##$LEV0= 0
##$LPBIN= 0
##$MAXI= 10000
##$MC2= 0
##$MEAN= 0
##$ME_mod= 0
##$MI= 1.114404
##$NCOEF= 0
##$NC_proc= 0
##$NLEV= 6
##$NOISF1= 3.799351
##$NOISF2= 2.8
##$NSP= 1
##$NTH_PI= 0
##$NZP= 0
##$OFFSET= 15.70392
##$PC= 1
##$PHC0= -10758.43
##$PHC1= 10.40095
##$PH_mod= 1
##$PKNL= yes
##$PPARMOD= 0
##$PSCAL= 0
##$PSIGN= 0
##$REVERSE= no
##$SF= 200.130013532006
##$SI= 16384
##$SIGF1= 3
##$SIGF2= 2
##$SINO= 400
##$SIOLD= 16384
##$SREGLST= <1H.CDCl3>
##$SSB= 0
##$STSI= 0
##$STSR= 0
##$SW_p= 3612.71676300578
##$SYMM= 0
##$S_DEV= 0
##$TDeff= 0
##$TDoff= 0
##$TI= <>
##$TILT= no
##$TM1= 0
##$TM2= 0
##$TOPLEV= 0
##$USERP1= <user>
##$USERP2= <user>
##$USERP3= <user>
##$USERP4= <user>
##$USERP5= <user>
##$WDW= 1
##$XDIM= 8192
##$YMAX_p= 0
##$YMIN_p= 0
$$ End of Bruker specific parameters
$$ ---------------------------------
##NTUPLES= NMR FID
##VAR_NAME=  TIME,          FID/REAL,        FID/IMAG
##SYMBOL=    X,             R,               I
##VAR_TYPE=  INDEPENDENT,   DEPENDENT,       DEPENDENT
##VAR_FORM=  AFFN,          ASDF,            ASDF
##VAR_DIM=   8192,          8192,            8192
##UNITS=     SECONDS,       ARBITRARY UNITS, ARBITRARY UNITS
##FACTOR=    0.0002944,     1,               1
##FIRST=     0,             0,               0
##LAST=      2.4114304,     0,               0
##MIN=       0,             -643503,         0
##MAX=       2.4114304,     677584,          0
$$ Real data points
##PAGE= N=1
##DATA TABLE= (X++(R..R)), XYDATA
$$ [...]
3471I65j601K264K612j013k737l70J945J142j792j578J43J131J05j288j007M7
3487a032N00j63m22r16k36K87R21m55r79l63J116J265l04j578k33K327J621j600
3505b44k120J081K950Q90k430j899K308L511q73l720m84L604K422k700m157J438
3521d23M255O82m686l005L131M567j773o026j059N614K868m334n676J862O887
3536B884N70p072l838N762O163l290p307l48Q445L874o771o559M323Q908l24r085
3552c665l346Q127P348m886r624J761J0110K543q523p928P404R180k193j0092
3566c784l554R719Q156q039j0848L150J2040J621j2758o762R758J1442n112j3664
3580h635o59J3442O222j1545j0682O662J3956j076j4339n238J2779J0303q261
$$ plain form
3471 965 -636 1628 4240 3227 490 120 2065 3207 1415 -163 -20 1111 1216 -72 -1079 -1032
3487 -1032 -532 -695 -1117 -2033 -2269 -1982 -1061 -1516 -2495 -2858 -1742 -477 -781 -2359 -2592 -265 1356 -244
3505 -244 -2364 -1283 1667 2557 127 -1772 536 4047 3174 -546 -1030 2574 4996 2296 -1861 -423
3521 -423 3832 4514 -172 -3177 -46 4521 2748 -3278 -4337 1277 4145 -189 -5865 -4003 2884
3536 2884 3454 -3618 -7456 -1694 4469 1179 -6128 -6476 1969 5843 -928 -7487 -3164 5744 5420 -3665
3552 -3665 -7011 1116 8464 3578 -6046 -4285 5825 8368 -155 -8083 -679 8501 6308 -3784
3566 -3784 -7338 2381 10537 2498 -8350 -5200 6840 8461 -4297 -11059 -1301 10141 5029 -8635
3580 -8635 -9294 4148 10370 -1175 -11857 -5195 8761 7685 -6654 -11892 887 11190 2929
3593B929j3303K576J5319L880j3561j0248J0670J3593m083j5747j973J5058Q120
3606A3230j1711j3574O593J5410O67j5623p247J1935J3269p681j5831L89J6838
3619F664N594j4138j1389Q779J5564k432j6768m407J4979J0789j0616j5318M524
3632h175J6576L318j5845r709J1949J4576n527j6735j698J6448Q298j2717j3556
3645a2797O967J6340J81j6696o623J3192J2649q266j5758J523J6265N570j4356
3658a809j1029R364J4811k852j6345l522J4391J0121j0605j4371M641J6174K313
3671A1282j5152q769J1459J3761o176j5977m97J5325P238j2436j2306P285J5006
3684A0043q22j5363n482J2633J0807q233j3874J917J4741L965j2760r199Q670
$$ plain form
3593 2929 -10374 -7798 7521 11401 -2160 -12408 -1738 11855 7772 -7975 -9948 5110 13230
3606 13230 1519 -12055 -5462 9948 10615 -5008 -12255 -320 12949 5268 -10563 -10174 6664
3619 6664 12258 -1880 -13269 -4490 11074 8642 -8126 -12533 2446 13235 2619 -12699 -8175
3632 -8175 8401 11719 -4126 -13835 -1886 12690 7163 -9572 -11270 5178 13476 759 -12797
3645 -12797 -5830 10510 10691 -6005 -12628 564 13213 4947 -10811 -9288 6977 12547 -1809
3658 -1809 -12838 -3474 11337 8485 -7860 -11382 3009 13130 2525 -11846 -7205 8969 11282
3671 11282 -3870 -12639 -1180 12581 6405 -9572 -10069 5256 12494 58 -12248 -4963 10043
3684 10043 9221 -6142 -11624 1009 11816 3583 -10291 -8374 6367 10332 -2428 -11627 -2957
3697b957J2858l556j3791k504J2879P587r314j1556M961J3195Q59j2626n706R896
3711B25J0019n694j2132N15J2727M131j0422q220O832J0545k003j1275k890J0074
3725B432O420p113r276K730J0058J351r526n156O751P793l819q519l48Q416L383
3740E577o753n510L724P279p90p252j989O133M589l461n921J397O357J168n029
3755d81l151L762M719j763m778k84M279J968l036l079J266L474k06k971j462K083
3771C40J837j362k268k68J779N65j368r69P4J207j37p90m41O78K75j50L88k04
3789h14p4m72P44R43j034n27O74K701r15j244l82J711J486q52k350M55K675J13
3807B838j829k140J811K762k51l903j410L202K529k872l951R76L622J134m437
$$ plain form
3697 -2957 9901 6345 -7446 -9950 2929 10516 1202 -10354 -5393 7802 8661 -3965 -9671 225
3711 225 10244 4550 -7582 -7067 5660 9791 -631 -8851 -2019 8526 6523 -4752 -7642 2432
3725 2432 8852 1739 -7537 -4807 5251 6602 -2924 -8080 -1329 6464 2645 -5874 -6222 2194 5577
3740 5577 -1176 -6686 -2962 4317 3527 -3725 -5714 419 5008 1547 -4374 -2977 3380 4548 -481
3755 -481 -3632 130 4849 3086 -1692 -1976 2303 4271 1235 -1844 -578 2896 2690 -281 -1743 340
3771 340 2177 815 -1453 -1721 58 623 -745 -1714 -1640 -433 -570 -1360 -1801 -1123 -848 -998 -610 -814
3789 -814 -888 -1360 -616 327 -707 -1234 -560 2141 1226 -18 -400 1311 2797 1945 -405 50 2725 2838
3807 2838 1009 -1131 680 3442 3191 -712 -2122 1080 3609 737 -3214 -2238 1384 2518 -1919
3822a919k829K602M290j470m443q77L914L422k982n662K717N679Q71n571k758
3837e016M780M819j813o399p25P369L143m947n846L191P451N27p715l982O525
3852A362O843m470p497K68P226M419q571n972M242R060k309r417l176Q587O269
3867F864o242r140J789J0325J664r329o084P226R271k820j1086j070J1104N558
3881H030q178q907M727J1751M23j1485m932J0353R226o032j1434J112J2646L975
3895A1275j0933r025P783J1774k825j3282l172J1608Q097r229j2003L613J3219
3908F900J439j2989p226R509J1106m962j3783o28J3522N844j0921r898N934J3601
3922G448n31j3667m640J2096R926p238j2514K137J4234L930j2278q404Q912J2463
$$ plain form
3822 -1919 -4748 -2146 2144 674 -3769 -4646 -732 2690 -292 -5954 -3237 2442 3313 -2258 -5016
3837 -5016 -236 4583 2770 -3629 -4354 3015 6158 1211 -4635 -1444 6007 6534 -1181 -5163 1362
3852 1362 8205 3735 -3762 -3494 3732 8151 -420 -6392 -2150 6910 4601 -4816 -7992 595 6864
3867 6864 622 -8518 -6729 3596 5260 -4069 -10153 -2927 6344 3524 -7562 -8632 2472 8030
3881 8030 -148 -9055 -4328 7423 7846 -3639 -8571 1782 11008 4976 -6458 -5346 7300 11275
3895 11275 342 -8683 -900 10874 8049 -5233 -8405 3203 11300 2071 -9932 -6319 6900
3908 6900 8339 -4650 -11876 -2367 8739 3777 -10006 -10634 2888 8732 -2189 -12087 -6153 7448
3922 7448 6917 -6750 -11390 706 10632 3394 -9120 -6983 7251 11181 -1097 -9501 -589 11874
3936A1874l720j3538k241J2818P938r992j1952M920J3162P34j3259o745R840J1104
3950A0943o239j3992L77J3245M876j1380j0086O652J2739j527j3370m404J1775
3963c91Q958p642j1588K235J3353L637j1918p542Q952J1319l081j1972k355J2148
3977D113P486r066j0487M897J2385M07j1426o145R759R560n886j2091O40J1821
3991E967L651r859q578N440J1238j945j2229l212J0018O847o815j0440K560J1510
4005D153J735j0703n639P690Q837l498r769p29R893N670q217p215N078Q960M4
4020F290q532l696Q058P102n290q055J743P876K378p199n250M700P182k298q219
4035c210n54O304L058m696o147J967O879o79o520k220M489L661k258n472J6N872
$$ plain form
3936 11874 8154 -5384 -7625 5193 13131 3139 -8813 -3893 9269 10003 -3256 -10001 -161 10943
3950 10943 4704 -9288 -8911 4334 9210 -2170 -12256 -5604 7135 5608 -7762 -12166 -391
3963 -391 8567 925 -10663 -8428 4925 8562 -3356 -10898 -1946 9373 6292 -5680 -8035 4113
3977 4113 11599 2533 -7954 -3057 9328 9735 -1691 -7836 1923 11483 5597 -6494 -5854 5967
3991 5967 9618 -241 -8819 -3379 7859 5914 -6315 -9527 491 7338 523 -9917 -7357 4153
4005 4153 5888 -4815 -10454 -2764 6073 2575 -7194 -7923 1970 7640 -577 -7792 -2714 6246 6290
4020 6290 -2242 -5938 2120 9222 3932 -4123 -2380 5496 7874 675 -4575 125 7307 5009 -3210
4035 -3210 -3764 2540 5598 902 -5245 -3278 3601 2922 -3598 -5818 -1329 2332 74 -5398 -5382 490
4051D90J769m596k642K607L735k81l703j310M137K863k585k402J301K380J300
4066C063j915j997J844K607j202k140Q11J146N41o44j734M6J600p68j040K68l34
4083A52m51O35o08j020N43o46m8P17j116j034J129R81p87k77o57N81K296n94k413
4102b617Q01K515M44j352j215Q66L202L76l544m50K966J636j374k565m62L884
4118C111J505m126k519K961K904p84m066j935L784L178l332m989J664M488N40
4133B384m141l675K913N739k084o096k10N623K732l674n265J875P290N29p047
4148c107k297N495M697j928o221j037P951L318o734m887M069O363L36p709l833
4163e524P170O100n290p980J799P432L506q015p089O384Q663l514r218p59P343
$$ plain form
4051 490 2259 -2337 -4979 -2372 1363 1082 -2621 -3931 206 3069 484 -1918 -617 1763 3063
4066 3063 1148 -849 995 3602 2400 260 1071 2217 2758 2114 380 426 2026 1258 218 486 152
4083 152 -299 336 -272 -1292 -749 -1395 -1443 -726 -1842 -2876 -1747 -766 -1553 -1830 -2487 -1906 390 -204 -2617
4102 -2617 -1816 699 1143 -209 -1424 -558 2644 3020 -524 -974 1992 3628 2254 -311 -773 3111
4118 3111 4616 490 -2029 932 3836 3052 -1014 -2949 835 4013 681 -4308 -2644 1844 2384
4133 2384 -1757 -5432 -2519 3220 1136 -4960 -5170 453 3185 -489 -5754 -3879 3411 3940 -3107
4148 -3107 -5404 91 4788 2860 -3361 -4398 3553 6871 137 -4750 -681 5682 6018 -1691 -5524
4163 -5524 1646 7746 2456 -5524 -3725 3707 7213 -802 -7891 -1507 7156 3642 -5576 -6335 1008
4178A008N378o021q712L086J0393N42j0279l814P407P879l490j0851K40J0657
4192C423M667r301p063N777R454m83j0746m286J1166P800p673r758K616J0868
4206F461K718j0311p748Q299J0293m497j1858j28R801O326q526j0310M938J2612
4220H070j487j2264l345Q891Q706n910j1418J259J2586L476j1057p496O762J1105
4234G878k250j1883l103J2258O951q488r356K942J1065K256j0476p269R496R453
4248I474m982j1044M38J0769N086r045r584O019J0567j554j0379l939R019Q283
4262I128o241j1233K292J1552K038j0102o246O382R573j822j1607k139J1045N534
4276H154p426q573L188J0330J680j0490n440Q558Q126m567r399k47R430M603p966
$$ plain form
4178 1008 6386 365 -8347 -5261 5132 5674 -4605 -8419 -1012 6867 3377 -7474 -7234 3423
4192 3423 8090 -1211 -8274 -2497 6957 6474 -4272 -8558 2608 10408 2735 -7023 -4407 6461
4206 6461 9179 -1132 -8880 -581 9712 5215 -6643 -6771 3030 9356 830 -9480 -4542 8070
4220 8070 6583 -5681 -9026 -135 8571 2661 -8757 -7498 5088 8564 -2493 -9989 -3227 7878
4234 7878 5628 -6255 -9358 2900 9851 1363 -7993 -5051 6014 8270 -2206 -9475 21 9474
4248 9474 4492 -6552 -6114 4655 9741 696 -8888 -2869 7698 6144 -4235 -8174 845 9128
4262 9128 2887 -8346 -6054 5498 7536 -2566 -8812 -2430 7143 5321 -6286 -8425 2620 8154
4276 8154 728 -7845 -4657 5673 7353 -3137 -8577 -19 8107 3540 -5859 -6106 3324 7927 -39
4291c9q045N579R539j578r214l177P541P319n578r337K459R522J167p928n001
4306f771N480P924k194r582q46R032L478o259o351K900Q079M24q396k936O881
4321H63N318m247o790P22O956K803o422m907M715N588j889n663j652N412L957
4336D764m084n521K468N390p6m351k738L744M162j903m975N66M665P78l142k563
4352b816J544L987j25m229m96L203J161j563j935J41K818K72k542q17J684J243
4368A530j004r53m37J361N75j285q96P43L12k47j86l10K64K73l22o2M30k72l92
4387h78Q50K27n69m84O3O06J181j200j022J451J796r19j468J88J399J179j489
4404I11k042Q02L136q48k474j068J998K068q20l630K91L070J228k937l206K268
$$ plain form
4291 -39 -8084 -2505 7034 5456 -3758 -6935 606 7925 2347 -6990 -4531 4991 6158 -1770 -6771
4306 -6771 -1291 6633 4439 -5143 -5989 3043 6521 262 -6089 -3189 4890 5314 -3082 -6018 863
4321 863 6181 1934 -4856 -4134 2822 5625 -797 -5704 -989 4599 2710 -2953 -4605 807 4764
4336 4764 680 -4841 -2373 3017 2941 -1410 -4148 -404 3758 1855 -3120 -2554 2111 2889 -253 -2816
4352 -2816 -1272 2715 2590 -1639 -2135 1068 2229 666 -1269 -1128 1690 1962 -580 -1397 287 1530
4368 1530 526 -427 -864 497 1072 -213 -1109 -366 -54 -301 -487 -797 -533 -260 -582 -644 -214 -486 -878
4387 -878 -28 199 -370 -854 -791 -185 996 -204 -1226 225 2021 1102 -366 -178 1221 2400 911
4404 911 -1131 -329 2807 1959 -515 -1583 415 2483 1663 -1967 -1676 1394 2622 -315 -3521 -1253
4420a253K872K47m400j079L005K508k123l528O53M477J121l299l833L330M479
4435C177j442m516o89L615M730l608m875J112N515Q57l830l524K563O333j474
4450C944o930l57N833K599l426n575K306O562m84p466j825M742N808l891p077
4465e237o06P362L600o677n462M030P009j125p761k016O843O181n981o456K701
4480c595P896J063p266l937N587O933k574q804j00Q374M773p253p107M226R363
4495G579o66r271l818P968O329m784r511Q11J0097K712q851p156O175Q864j998
4510D480j0333k511R515N690o752r153L204J0443R42r508n251P899Q576m090j0102
4525f951N2J0606M542q267p720N299J0258j131j0309k899R124O897o094r388K110
$$ plain form
4420 -1253 1619 1866 -2534 -3613 -608 1900 -223 -3751 -3098 1379 2500 -799 -4632 -1302 3177
4435 3177 1735 -2781 -3470 145 4875 1267 -3608 -2496 3019 3876 46 -3478 -915 5418 3944
4450 3944 -2986 -3343 2490 5089 1663 -3912 -1606 4956 4472 -2994 -4819 -77 5731 1840 -5237
4465 -5237 -5843 1519 5119 -1558 -7020 -2990 4019 2894 -4867 -6883 -40 6141 160 -6296 -3595
4480 -3595 4301 5364 -1902 -5839 -252 6681 4107 -4697 -4797 3577 8350 1097 -6010 -1784 7579
4495 7579 6913 -2358 -6176 1792 8121 3337 -6174 -5363 4734 7446 -1405 -8561 -2386 6478 4480
4510 4480 -5853 -8364 1151 6841 89 -9064 -5860 4583 5525 -3983 -9234 -1335 7241 3151 -6951
4525 -6951 -6899 3707 8249 -18 -7738 -2439 7819 6688 -3621 -6520 2604 9501 3407 -5981 -3871
4540c871J0422K021r545o122O458Q936l082j0350j569R226N328p498q909L980
4554d575R632M27r617m901P375P795m068r539L67R491L818p652p015M887R380
4569E805j115r203k309Q314O274n418q193K161R440K034q689n029O169Q037l052
4584E226q875r77Q493M082o644p084L360Q183k87q225l721O118O453m406p842
4599f146R4Q120K667o938n497M216P556j314p883j556O616M875m470o502K210
4614c952P519J418o605l453N233N748k513o351Q9O539K200m574m352K674N808
4629E428q66n512k005M808L451l354m966O60N250L31m427l009L101L533j656m243
4645c476n73L497K208k943k997J689L473l06l036r89K802K242j261k429M37L019
$$ plain form
4540 -3871 6551 8572 -973 -7095 -637 8299 5217 -5133 -6702 2524 7852 354 -8555 -4575
4554 -4575 5057 5484 -4133 -9034 -1659 6136 2068 -7471 -7104 2387 6205 -1447 -8462 -3575 5805
4569 5805 4690 -4513 -6822 1492 7766 2348 -5845 -3684 5756 7790 -899 -5928 241 8278 5226
4584 5226 -3649 -4626 3867 7949 1305 -5779 -2419 5764 5477 -2748 -6469 -351 6102 1696 -6146
4599 -6146 -6052 2068 4735 -2203 -7700 -3484 4072 2758 -5125 -6681 -65 4810 340 -6162 -3952
4614 -3952 3567 4985 -1620 -5073 160 5908 3395 -2956 -2867 3672 5872 1298 -3054 -380 5428
4629 5428 4562 -950 -2955 1853 5304 1950 -3016 -2356 2894 3225 -1202 -4211 -1110 2423 767 -3476
4645 -3476 -4049 -552 1656 -1287 -4284 -2595 878 572 -2464 -3453 -651 1591 330 -2099 -1662 1357
4661A357O94k101r12J548J569l55j261k20J386Q21r73p38J96J023n46m43l74J46
4679H17j82k32J4j38n07m01J13K54l91j064P9O23K70p91p98P81J339l46j407j64
4699b131J614J174j167j379N19K460N55k006j090K095K247j050k508K6K723J629
4715C711k617k016J330L099k88l543j280K806K146k046l706L46L705J043l600
4730i10k988K033L823p85m166j262M027K503k608m354J159M699J344m431k635
4745d551L264M653j384n273k94N481K933l995m443K121N834M41n703k551M855
4760A388M624k694o289K52O100K512n768m807L472N973q84p065k024N956M274
4775E020m176o753J177P324J620o668m685M946O884k213p616j276P564M317n454
$$ plain form
4661 1357 2051 -50 -962 586 2155 1800 539 319 1705 2526 1553 815 1011 2034 1488 1045 671 817
4679 817 635 403 417 279 -228 -629 -516 -262 -653 -1717 -1638 -1015 -745 -1536 -2334 -1553 -214 -560 -1967 -2131
4699 -2131 -517 657 -510 -1889 -1370 1090 1645 -361 -1451 644 2891 1841 -667 -641 2082 3711
4715 3711 1094 -922 408 3507 3219 -324 -1604 1202 3348 1302 -2404 -2058 1647 2690 -910
4730 -910 -3898 -1865 1958 1173 -2993 -4255 -228 2275 -333 -4687 -3528 1171 2515 -1916 -4551
4745 -4551 -1287 3366 1982 -3291 -3585 1896 4829 834 -3609 -1488 4346 4787 -916 -3467 1388
4760 1388 6012 3318 -2971 -2719 3381 5893 125 -4682 -1210 4763 3879 -3186 -5210 746 5020
4775 5020 844 -5909 -4732 2592 4212 -2456 -7141 -2195 4689 2476 -5140 -6416 1148 5465 11
4790A1o453K859Q208L91p502l755O737O283l413q200O06Q270L271p211o212M895
4806a215P936j337q967k260P717N409n501p978K444Q478J168q299n022O235P372
4821F180l342q596j020Q936M134p010p386L998Q755L4q339l300P021O390m190
4836B265q393J341Q910J924o725o906O249Q080k063r010j206P791N246n605p780
4851e882L143Q537N43q170m673O551O644l446q243m94Q294L399o808n970L609
4866b966P692m85q046k790O845N293m162p318J300Q063J858o851m970N005O911
4881E379j890p307j216O972M241n289o110K696P015O41p056l076N407N224l093
4896B538o491K38O434K600n481n136L627O000q82o399j779N272M294l832n688
$$ plain form
4790 11 -6442 -3583 4625 5016 -2486 -6241 496 6779 3366 -4834 -4228 4042 7313 102 -6110 -1215
4806 -1215 6721 5384 -3583 -5843 1874 7283 1782 -6196 -3752 4726 5894 -2405 -7427 -1192 6180
4821 6180 2838 -5758 -6778 2158 6292 -718 -8104 -4106 4649 4683 -3656 -6956 65 6455 2265
4836 2265 -6128 -4787 4123 6047 -678 -7584 -1335 6745 4682 -4328 -5534 2257 7503 1898 -5882
4851 -5882 -2739 5798 6341 -1829 -6502 49 6693 3247 -4996 -5490 2804 6203 -605 -6575 -2966
4866 -2966 4726 4241 -3805 -6595 250 5543 1381 -5937 -4637 3426 5284 -1567 -6537 -1532 5379
4881 5379 3489 -3818 -5034 1938 6179 890 -5220 -2524 4491 5132 -1924 -5000 407 5631 2538
4896 2538 -3953 -3715 2719 5319 -162 -5298 -1671 4329 3447 -2952 -4731 541 4835 1003 -4685
4911d685J518N829R81n070l360L843M988j908n314n85M990K657l572m397K210
4926a875M795J36m914j661L897L164k146m063N21M246R25l677k164K195L453q97
4942A935l590q29L393J841k386k693J183K778K07k684j153J977J793j133k074
4957a435L08J773N56j553j025J205J414n11j420J86N71Q54p38r53L83P21K30r06
4975c40R1K84j81J35j3j26R2n76L01Q84o01k67k79Q77J20o65q53R67Q41K3j223
4996e09o26J457J121r50j471K80K157K12j952j074J281K214j007k387m27K506
5012H25J368k052k375R76K886K65l144j392K401K337j385l301K55L498J242l155
5028g51k528K150L526n11m051q50L765K591k651l574P74M305J116l887k807L195
$$ plain form
4911 -4685 -3167 2662 3643 -1427 -4787 -944 4044 2136 -3178 -3763 1227 3884 312 -4085 -1875
4926 -1875 2920 3056 -1858 -3519 378 3542 1396 -2667 -2146 2100 3025 -652 -2816 -621 2832 1935
4942 1935 -1655 -2484 909 2750 364 -2329 -1146 1632 1839 -845 -1998 -21 1772 639 -1435
4957 -1435 -1127 646 1202 -351 -1376 -171 1243 732 -688 -502 69 923 185 -768 -385 336 566 -340
4975 -340 -249 35 -146 -11 -24 -150 -58 -634 -333 551 -50 -317 -596 281 401 -264 -1117 -150 691 714 -509
4996 -509 -1135 322 1443 493 -978 -698 1459 1671 -281 -1355 -74 2140 1133 -1254 -1681 825
5012 825 2193 141 -2234 -1258 1628 1893 -1251 -2643 -242 2095 710 -2591 -2336 1162 2404 -751
5028 -751 -3279 -1129 2397 1886 -2165 -3015 750 3341 690 -2884 -2110 2195 3311 -576 -3383 -188
5044a88M062j603m402n81M441K553l451m213J611N138M41m979k764L906M159j906
5060B224n662l48N515K419m980m050K623N362k64n759k085N223L937l182n897
5075d924J004O714J687n680l929L905N984j547o512j355O389M189m991n529K140
5090b455P098R17o927l463N298N477k550p538m4P204L001n815o003L395P437p36
5106D296p668k921O507N590m612p648J750P794K027p549m408N229P041k683p717
5121d972m85O826M550n921o227L135P880O58p680l019O459N247l433o776LP906
5137D151K470o695n078M181P072q51q355k636P285N286n448o204R33Q116Q52p240
5153b161m343N305O331k445p773r86P407L561n364o687L522P841m85o782k806
$$ plain form
5044 -188 3874 2271 -2131 -2712 1729 4282 831 -3382 -1771 3367 3808 -1171 -3935 -29 4130 2224
5060 2224 -3438 -3786 1729 4148 -832 -4882 -2259 3103 2839 -2920 -5005 218 4155 973 -4924
5075 -4924 -3920 2794 4481 -1199 -5128 -1223 4761 3214 -3298 -4653 1736 5925 934 -4595 -2455
5090 -2455 4643 5560 -1367 -4830 468 5945 3395 -4143 -4187 3017 6018 203 -5800 -2405 5032 4296
5106 4296 -3372 -6293 214 5804 1192 -6456 -4706 3088 5115 -2434 -6842 -1613 5428 2745 -4972
5121 -4972 -5457 1369 5919 -2 -6229 -3094 4786 5444 -2236 -5255 1204 6451 3018 -3758 -3755 4151
5137 4151 6621 -74 -5152 -971 6101 5250 -3105 -5741 1544 6830 1382 -4822 -3889 4227 5079 -2161
5153 -2161 -6504 -1199 5132 2687 -5086 -6072 1335 4896 -468 -7155 -3633 4208 3723 -3059 -5865
5168e865N772N747l613o714J114O705K184n672m450M092O285j041o778j654O125
5183B237L561l565o808K384O302J425o040m388M086N395k443n750L7N033K360
5198C826m421m909K863N596n49n737j840M768L719k824n141J334M981J616m460
5213a178l382L941M398j628m378m74M442K426l235l619K189M275rm335j702L573
5229A304K615j797m262M46L907R12l018k980K020K988p13l560p07K856J505k100
5245e84k725J038K543J98k219j150J822J866q64j646J03J918Q67j430r42J093
5261a12J429l55r95P8J023O92o49o58L68O32k78k28l15K46J79l61l75K02j22n38
5281a37M6L83k96n77n97N18N05n77j049K54J383k90j094n90J156J230o68j556
$$ plain form
5168 -5865 -93 5654 2041 -4673 -3559 3146 5330 -342 -4792 -700 5585 4544 -2234 -3888 2237
5183 2237 5798 2233 -4575 -2191 4111 5536 -504 -4892 -806 4589 2146 -3604 -3567 1466 3826
5198 3826 -595 -5504 -2641 2955 2406 -3331 -5171 -403 3316 492 -4649 -3315 1666 3282 -1178
5213 -1178 -4560 -619 3779 2151 -2227 -2701 1741 4167 932 -2687 -498 3777 3768 -567 -2269 1304
5229 1304 3919 2122 -2140 -1694 2213 3125 107 -2873 -853 2135 1422 -2138 -2845 11 1516 -584
5245 -584 -3309 -2271 272 470 -1749 -2899 -1077 789 -75 -1721 -1618 300 1167 -263 -1205 -112
5261 -112 1317 962 -33 45 1068 1760 1111 453 821 1453 1175 947 632 878 1057 696 321 523 401 -137
5281 -137 -91 292 -4 -581 -1178 -660 -155 -732 -1781 -1527 -144 -434 -1528 -2118 -962 268 -400 -1956
5299a956L97J943M97j565p33J032K254l11k228j66K048J596j592j834O07K417
5315B406M91k687j326K241J898j502k889J0K498J406k518k845J757K913l20l221
5331a688j096K150K790k452l385R36L653N52k770k376K318L374k56m571m28L519
5347B70K884k622l385J339M262J083m601j889L650L293k267l588j59M376J758
5362D404l331m458K833M568l76m967j878L348L790k689n556P08N042J320l921
5377a163l362K531M478q4n426k588N011M159l526m478J012O424N54n645k764M660
5393b07M948k164n493m45O138K600m858m104K511N648j28n708k403M795M576k688
5409C018o624N27O565J140n660l996L491O301j806p227l90N330L704m181n456
$$ plain form
5299 -1956 -1559 384 881 -684 -1417 -385 1869 1558 -670 -836 1212 2808 1216 -618 -11 2406
5315 2406 2897 210 -1116 1125 3023 1521 -1368 -1358 1140 2546 28 -2817 -1060 1853 1533 -1688
5331 -1688 -2784 -634 2156 -296 -3681 -2745 908 1460 -1310 -3686 -1368 2006 1750 -2821 -3249 270
5347 270 3154 532 -2853 -1514 2748 3831 -770 -2659 991 4284 2017 -1571 -1730 2646 4404
5362 4404 1073 -3385 -552 4016 3640 -1327 -3205 143 3933 1244 -4312 -3604 1438 2758 -1163
5377 -1163 -4525 -1994 2484 2400 -3026 -5614 -603 3556 30 -4448 -3436 2988 3542 -2103 -4867 -207
5393 -207 4741 2577 -2916 -3361 2777 5377 519 -3585 -1074 4574 4446 -1262 -3665 1130 5706 3018
5409 3018 -3606 -3079 3486 4626 -1034 -5030 -1539 4762 2956 -4271 -4661 669 4373 192 -5264
5424e264J201P358P62o653l136N330M618k749n536n40P014K951n367n078L736
5439a353N393n3n831k953O825L743l754n413J478N853J441n754l473M284M050
5454D483r26n668j398N784K871m085o149K265O738j95o401k460M470M043k073
5469A299o178K05O293K050n365l624L638M918l1n801j837M974L968l724m812J799
5485b228M748J432m059l573L593M613j976m759k67M357K246l438m116J928M983
5500C484n64m491j728L317L098j299m996J83M450J600m110k437J906L776k14m401
5516b426j085L799K256k246l224O38L978P07l219k377K906L170j698k983P0K668
5532I34J925k452k810J831K931p48k281j334K369K123j768j793M9K868Kk609q7
$$ plain form
5424 -5264 -4063 3295 4057 -2596 -5732 -402 4216 1467 -4069 -4609 2405 5356 -11 -5089 -1353
5439 -1353 4040 3987 -1844 -4797 2028 5771 2017 -3396 -1918 3935 5376 -378 -3851 433 4483
5454 4483 3557 -2111 -3509 2275 5146 1061 -5088 -2823 3915 3720 -2681 -5141 -671 3372 1299
5469 1299 -4879 -4674 1619 3669 -1696 -5320 -1682 3236 3205 -2596 -4433 541 4509 785 -4027 -2228
5485 -2228 2520 3952 -107 -3680 -87 4526 2550 -2209 -2476 1881 4127 689 -3427 -1499 3484
5500 3484 2920 -1571 -3299 18 3116 1817 -3179 -2996 1454 3054 -1056 -3493 -1587 2189 1975 -2426
5516 -2426 -3511 288 2544 298 -2926 -2288 1690 2397 -822 -3199 -293 2877 1179 -1804 -1734 934
5532 934 2859 407 -2403 -572 2359 1611 -670 -2004 365 2488 720 -1073 -1024 1844 1846 -763 -850
5549h50P23J932j019j755j524L259l49o17j000R20M57J48r42m96J370j50r88O32
5567b49O73l20M27q87M4M88M98q87L2O88k89j37J69l39L94n0p29O99P55r58l48
5588c26J39Q75q1q48q38J052R12n41j247P1J164P69j007j780J172J707j68j962
5606i37k86J500J291r97k233L94K874k52k096r39J468J862o32k420m93K913J350
5623B367k552j796J485K208J08k885j416K553K451j771l068M78L075J319k660
5638a04k704J924L548o69l569n97K597K483j887l750Q23M076M67l423k253K299
5654g39L747j157m048o70M196J778k965l274J533M012K95m177k488L660L660k445
5670I18m009J23M206K082l640l759K608M950r86m694j171M112L399k754m984R59
$$ plain form
5549 -850 -127 1805 786 -969 -2493 766 417 -200 -1200 -280 177 325 -617 -1113 257 107 -881 -249
5567 -249 424 104 531 -356 -312 176 674 -213 -181 507 218 81 250 -89 305 255 -474 225 980 22 -326
5588 -326 -187 688 607 -241 -1079 -27 885 344 -903 -832 332 1101 94 -1686 -514 1193 1025 -937
5606 -937 -1223 277 1568 571 -1662 -1268 1606 1354 -742 -1681 -213 1649 1017 -1403 -1896 1017 2367
5623 2367 -185 -1981 -496 1712 1820 -1065 -2481 72 2523 752 -2316 -1838 1237 2556 -104
5638 -104 -2808 -884 2664 1995 -1574 -2171 426 2909 1022 -2728 -1905 2171 2638 -785 -3038 -739
5654 -739 3008 1851 -2197 -2867 1329 3107 142 -3132 -1599 2413 2708 -1469 -3957 -297 3363 918
5670 918 -3091 -2968 1238 3320 -320 -4079 -1471 3479 2493 -2201 -3372 740 4139 1385 -3599 -2640
5686b640N484Q93m621k932L276M575j143n569o79N265K448m041m183J869N299
5701C301M99n753k350M541L923k687n380M72N333K314n104m230L624N103q27n687
5717b908j640N109L908l678n448J976N820N64n151k872L726N265k199n752l5N434
5733B119K602m274m440K387N729m06n745j979M839L844l263n171O97N822J418
5748D179n223l547L385M963j358n862n18M714L460l943m758K074N198j90m858
5763b284k083L856L778j855m654L34M685J917l878l423K707M421k38n631m64M141
5779A329L062k915m380M60M502J629m270k591L002L472j341m083j399M956J922
5794C355m054k684R44N634q77m482j945L439L487k293m011O62L805J289k729l203
$$ plain form
5686 -2640 2844 3737 -884 -3816 -540 4035 2892 -2677 -3356 1909 4357 316 -3867 -1998 3301
5701 3301 3800 -1953 -4303 238 4161 1474 -3906 -3434 1899 4213 -891 -5121 -1497 3606 2779 -2908
5717 -2908 -4548 561 4469 791 -4657 -2681 3139 3703 -1448 -4320 -594 4671 2472 -3280 -3315 2119
5733 2119 4721 447 -3993 -1606 4123 3717 -2028 -4007 832 4676 1413 -3758 -3061 2761 4179
5748 4179 -1044 -4591 -1206 3757 2399 -3463 -3981 733 4193 250 -4508 -2434 2764 2574 -2284
5763 -2284 -4367 -511 3267 1412 -3242 -2908 1777 3694 -184 -3607 -900 3521 3283 -2348 -2812 1329
5779 1329 4391 1476 -2904 -2444 2058 3687 -583 -3174 -172 3300 1959 -2124 -3523 1433 3355
5794 3355 -699 -3383 -2439 3195 2318 -2164 -4109 -670 2817 524 -3487 -2825 980 2269 -460 -3663
5810c663K872L212n92k992j107L227J727k268k246J005K773R97l061j302J848
5825D30K270o33k709n46K428J423k151j629R02K178l71k640p43J682R71q70j926
5842a934O39J741J9j177j411R96J660o33j428p1J531P24r66r49O05J162l01n32
5860c25j06P45P03n00l29J83O29J02m24j38J89P3o3k85Q1J49l28k07J4M78o17
5881B4q15N27O30n45n91j58N16M60r11q61Q58P94l25j058JJ163R53j054j122P80
5901g34J526L53j593r12J668J358j131j342M71J918Q24j779j433R23K431o68k518
5918f38m25J992J412j816k056O33K206K99k572j298J878K028j185l091J10K632
5934A09J252k214k412J686K863m94k694o57K222K518j999k677Q36L065J224k983
$$ plain form
5810 -3663 -791 2421 1829 -1163 -2270 957 2684 416 -1830 -825 1948 2945 -116 -1418 430
5825 430 2700 2067 -642 -1188 1240 2663 512 -1117 -215 1963 1592 -1048 -1791 -109 862 -8 -1934
5842 -1934 -1295 446 465 -712 -2123 -1127 533 -100 -1528 -1599 -68 656 -310 -1259 -654 508 207 -325
5860 -325 -431 314 1017 517 188 371 1000 1102 678 540 729 802 739 454 535 684 356 149 163 641 24
5881 24 -791 -264 366 -179 -770 -928 -412 48 -863 -1724 -866 -72 -397 -1455 -1454 -291 662 -392 -1514 -734
5901 -734 792 1145 -448 -1360 308 1666 535 -807 -336 1582 2406 627 -806 117 2548 1880 -638
5918 -638 -1063 929 2341 525 -1531 -898 1308 1607 -965 -2263 -385 1643 458 -2633 -2523 109
5934 109 1361 -853 -3265 -1579 1284 790 -1904 -2561 -339 2179 180 -2497 -1661 1404 2628 -355
5950c55k021K370K959m88l385m99L161K004k564l151J286L427L29l473j892K716
5966D24K604j314m104j62L696J710k999l373J699L870l79l891j772L550L009k047
5982E21m179O81M130J461l665k481K460L931q30m219r18M171K887k879l714J344
5998a299M567M75m329k388L595L798k062m545j74M689J941m025l635K312M432
6013C352l72n035k231M547L294k877m653R67M634J439m600l185L188M566j458
6028A576m997l47M672K334l265l837J962M824K48m664j893L685M061k320m825
6043b786N64M816J797m085l349K728M037n85m890j095M055K639k849m121J023
6058b101M307Q84m367k643L477L430j733m485j22M145J939l040l599J941M002
$$ plain form
5950 -355 -2376 -6 2953 2465 -920 -1419 1742 3746 1182 -1969 -683 2744 3073 -400 -2292 424
5966 424 3028 1714 -2390 -2552 1144 2854 -145 -3518 -1819 2051 1672 -2219 -3991 -441 2568 521
5982 521 -3658 -2977 1153 2614 -1051 -3532 -1072 2859 2029 -2190 -3108 1063 3950 1071 -2643 -1299
5998 -1299 3268 3743 -586 -2974 621 4419 2357 -2188 -2362 2327 4268 243 -3392 -1080 3352
6013 3352 2980 -2055 -4286 261 3555 678 -3975 -3008 1626 3065 -1535 -4720 -1532 3034 1576
6028 1576 -3421 -3768 904 3238 -27 -3864 -1902 2922 3170 -1494 -3387 298 4359 2039 -2786
6043 -2786 -2222 2594 4391 306 -3043 -315 3722 3137 -1753 -2848 1207 3846 997 -3124 -2101
6058 -2101 2206 3090 -1277 -3920 -443 2987 1254 -3231 -3353 792 2731 -309 -3908 -1967 2035
6073B035p5l840j427L379K832k163l581O04M025J085l080k506K327L289p49l290
6089a135r87L642J984k289l354J016L310L46l044j897K419K612j431l342K19K934
6105A003J156k495k514J582K771l22k780j017K235J849j461k342L27K985O82k383
6121g24j401J691K174p89j961m90K491J117j567j770P89K095J98j791j460K068
6137F70J267r55j790K00J601O91j826r07R80J241l70j562k63R98O19o43r11J60
6155h00J002Q6p85k83O11L69m39n83P5Q93J53m49J01K57p0M2l07K81K31k70k35
6176a20Q20k99j65j81L63P2Q9p61j06N19O33p81p70O35O90k36j045p9R11M62o66
6197a5j080M56J155K29j696m51J131J322o56j653K27J330R09j284j582J161J784
$$ plain form
6073 2035 1960 -1880 -3307 72 2904 741 -2840 -2236 1789 2874 -206 -2712 -385 2904 2155 -1135
6089 -1135 -2122 1520 3504 1215 -2139 -1123 2187 2533 -511 -2408 11 2623 1192 -2150 -1931 1003
6105 1003 2159 -336 -2850 -1268 1503 1181 -1599 -2616 -381 1468 7 -2335 -2008 977 1659 -724
6121 -724 -2125 -434 1740 951 -1010 -1500 991 2108 541 -1229 -440 1655 1853 62 -1398 670
6137 670 1937 982 -808 -608 993 1684 -142 -1049 -69 1172 802 -760 -1023 -25 594 -49 -960 -800
6155 -800 202 288 -497 -780 -169 200 -239 -822 -747 146 299 -150 -49 208 138 180 -127 154 385 115 -120
6176 -120 700 401 236 55 418 490 579 -182 -288 231 864 83 -687 -52 638 402 -643 -722 189 651 -15
6197 -15 -1095 -639 516 745 -951 -1402 -271 1051 395 -1258 -1031 299 1208 -76 -1658 -497 1287
6214A287k29k079j74J760J189j054k285Q51K284nj982j257J660J938q65k317k67
6231a545K450J238k239j913J328K500k46k698j154K425K237j631k684K04K935
6246A207Q46k651j950J879K937p98l039o66K880J896k170k521P86L083L95l274
6262a160j432K432K826j499l060n21L506J679k459l190J749L304J65l969j297
6277b926L148K524j730l333K22L880J018l113k917K429L561l77m382q73L717K323
6293C171k532l365Q96M178M02l695k395L129L292j513l973j26M140J605l365k969
6309c120J497M226l09m030j486L379K960k109m005O11M171J027l568k733K617
6324h72L861o92m356p38L750K574k908l632J397M263K78m084k105L679L013j777
$$ plain form
6214 1287 1058 -1021 -1195 565 1754 700 -1585 -734 1550 1545 -437 -1694 -34 1904 1039 -1278 -1545
6231 -1545 905 2143 -96 -2009 -681 1819 1573 -1125 -2279 146 2383 752 -1932 -1728 1207
6246 1207 2053 -598 -2548 -669 2268 1470 -1569 -2235 645 2541 371 -2150 -1364 1719 2114 -1160
6262 -1160 -2592 -160 2666 1167 -1893 -2414 1092 2771 312 -2878 -1129 2175 2340 -1629 -2926
6277 -2926 222 2746 1016 -2317 -2095 1785 2803 -310 -3227 -798 2763 2386 -1996 -2869 848 3171
6293 3171 639 -2726 -1830 2348 2750 -945 -3340 -211 3081 1568 -2405 -2531 1609 3214 -151 -3120
6309 -3120 -1623 2603 2294 -1736 -3222 157 3117 1008 -2997 -2386 1785 2812 -756 -3489 -872
6324 -872 2989 2297 -2059 -2797 953 3527 619 -3013 -1616 2647 2925 -1159 -3264 415 3428 1651
6340A651m410L43M065J483l307k929K220L665o72m012j321L571K665k357l597
6355b942P98M003P33l815k018K749L226j340l809l23L791J796k715k957J701L478
6371B356J75l731j385L072K383j499l452M96L293P34k457k320J788L148n90l395
6387a384o50K766K002k093k698O54K883L15k690j535K121K258j353k365l04K375
6403C02J421j902k289J366K329K20k458o76J777J642j028k236J99K526O81j903
6419b9j263R75K228o20k045n64K207J095j180j617J11J688K30j435q24O36J725
6436A318n83j719QP84P02q54j062O76J003lj061l88P93N37l49j097P94Q49k14
6455A34l42l07P14K22M9p66J25N99L06m12k30P2M07R9k65q9K29k5m70O77K54r73
$$ plain form
6340 1651 -2759 -2416 1649 3132 -175 -3104 -884 2781 2109 -1903 -3224 347 3012 655 -2942
6355 -2942 -2144 1859 2592 -1223 -3241 -492 2734 1394 -2415 -2738 1053 2849 134 -2823 -1122 2356
6371 2356 2531 -1200 -2585 487 2870 1371 -2081 -1585 1708 2442 -15 -2335 -547 2601 2011 -1384
6387 -1384 -2034 732 2734 641 -2057 -1403 1480 1795 -895 -2430 -309 1949 596 -1769 -2073 302
6403 302 1723 -179 -2468 -1102 1227 1447 -1011 -1687 90 1732 704 -1532 -1333 1193 1874 -29
6419 -29 -1292 -317 1911 1291 -754 -1318 889 1984 804 -813 -702 986 1216 -219 -1043 -407 1318
6436 1318 735 -984 -976 -192 510 -344 -1406 -730 273 270 -791 -1179 -386 151 -198 -1295 -501 348 134
6455 134 -208 -515 199 421 470 -296 -171 428 734 322 92 164 571 670 405 316 545 520 50 727 981 8
6477Hl17L87K39J20p32K66K90n79l22m67N99K91N2j026N76nM09L62j007l65J161
6498f0Q09o90j296J479O61K2j261L18J530j9j340o68N63K236r99r09o29P74J576
6517B097j610j344k14K251O54k103j596J593J388p4k116m60K404R46k112j691
6533a987K18K465j19k330q59J374K896j162k129m50L142Q23j825k006J048K716
6549A815n73k375n33K409J926j922k141K76M015l00k762j775J978K415q36k323
6565g06o79K317J992j929l928J809K416L70l012j031J873J997j150l279O20L031
6581G11N93j641k582J648L109m92k970q94K904K194j739l089Q72L180J173l117
6597a40k224K324L031p78l309r00L520J835k721k906J255L397K52l754j257K304
$$ plain form
6477 8 -309 78 317 437 -295 -29 261 -318 -640 -1107 -508 -217 -165 -1191 -615 -620 -211 151 -856 -1221 -60
6498 -60 749 59 -1237 242 903 925 -336 -18 1512 1493 153 -515 48 2284 1285 376 -253 521 2097
6517 2097 487 -857 -1071 1180 1834 -269 -1865 -272 1116 1042 -1074 -1534 870 1816 -296 -1987
6533 -1987 -1769 696 577 -1753 -2612 -1238 1658 496 -1633 -2083 1059 1882 57 -1949 -901 1815
6549 1815 1242 -1133 -1666 743 2669 747 -1394 -1118 2897 2597 -165 -1940 38 2453 1617 -706
6565 -706 -1385 932 2924 995 -2933 -1124 1292 1662 -1350 -2381 -508 1489 339 -2940 -2320 711
6581 711 1304 -337 -2919 -1271 1838 1346 -1624 -2518 386 2580 841 -2248 -1376 1804 2977 -140
6597 -140 -2364 -40 2991 2213 -1096 -1996 1524 3359 638 -2268 -1013 2384 2636 -1118 -2375 -71
6613g1K713j537l567j48L662J241k939k882K162L111k36l613j438L563K445k344
6629A22l048R23L633Q46l331k244K928L128j342l418j59L511J651k618k975J830
6645e63L446j84l335j441K750K423j823l481N13L431J097l224k328J892L071q74
6661A370l325p32L088J670k053k817Q83L031L94k993j307K360K342r34l037k9
6677b089L004J273k521j801J393K958m58k472q40K371J691j530k444O30K518O70
6693B353k391j812J663K601j114k540k53K332J042j883j948P60K194L3k177j042
6709b182J578J818j091j798j47K092Q17j669j122Q98J657M8j505o92J508J060
6725A270q11j321N18J287M39j376p38J021J385q21j308J4J337N22p65j306N64
$$ plain form
6613 -71 2642 1105 -2462 -2610 1052 2293 -646 -3528 -1366 1745 1509 -2104 -3542 21 2466 122
6629 122 -2926 -2003 1630 2476 -855 -3099 -171 2957 1615 -1803 -1962 1549 3200 582 -2393 -563
6645 -563 2883 2699 -636 -2077 673 3096 1273 -2208 -1695 1736 2833 -391 -2719 -827 2244 1370
6661 1370 -1955 -2687 401 2071 18 -2799 -1916 1115 1509 -1484 -2791 -431 1911 977 -2060 -2089
6677 -2089 915 2188 -333 -2134 -741 2217 1759 -713 -1553 818 2509 979 -1465 -835 1683 2353
6693 2353 -38 -1850 -187 2414 1300 -1240 -1493 839 1881 -2 -1950 -1190 1004 1037 -1140 -2182
6709 -2182 -604 1214 123 -1675 -1822 270 1087 -582 -1704 -806 851 899 -606 -1298 210 1270
6725 1270 459 -862 -344 943 1382 6 -732 289 1674 853 -455 -441 896 1418 653 -653 -89
6742h9J053k06j151k26O13M81m55r28K77P45m4p49J3M3N78m8m42R7L37O7n62J46
6764d50L66R7n3O0j82K96J57m11J90L60j33n1q7L68k01k15j79M22K56k53o14M65
6786B08L08J11o79n18N53N09m14j023P31Q00p4p24j008Q74J128p80r87j80J363
6805A98N16j091p59L63J467L32j671j69R23J123p42j222j64J894Q41j817j311
6822a289J188J717p81j383p57K079P84j671j055Q97K065k59k934Q0J374R03K32
6839A190k923L86K408K29k211j639K097K359j119k122n51K027J750j593k260O97
6855a275K770M71k549j109J511K034n35k388o32K398J739j938k088R64K026K51
6871A650k463j224K314K030j600k360M7K406J141j863j934P99K921m14k838n40
$$ plain form
6742 -89 964 758 -393 -619 -6 475 20 -908 -631 114 70 -679 -666 -623 -45 -93 -535 -438 -101 -34 -596 -450
6764 -450 -84 13 -40 20 -162 134 291 -120 70 430 297 246 159 527 326 111 -68 354 610 357 -257 208
6786 208 516 627 -52 -570 -17 492 78 -945 -214 586 512 -212 -1220 -346 782 2 -985 -1165 198
6805 198 714 -377 -1136 -773 694 1026 -645 -814 109 1232 490 -732 -896 998 1839 22 -1289
6822 -1289 -101 1616 835 -548 -1305 774 1558 -113 -1168 -271 1794 1535 -1399 -1319 55 958 1190
6839 1190 -1733 -1347 1061 1290 -921 -2560 -463 1896 777 -1345 -1896 131 1881 288 -1972 -1275
6855 -1275 1495 1966 -583 -1692 -181 1853 1318 -1070 -1702 696 2435 497 -1591 -627 1399 1650
6871 1650 -813 -2037 277 2307 707 -1653 -1606 800 1941 78 -1856 -1057 1864 1450 -1388 -1928
6887a928K066J874j288k778L03L031N77k530j645J670K489m50k755q07K573J980
6903B382k284j922O81K950L36k759j686K161K777j667k829p1K885J318k360k487
6919b575J844K967o56k841r11K511K007j517l081Q13K910P90k978j492J847K256
6935A894l54l233m23K942J458k041k486J344K657J72k641j660K733J840j568k646
6951b012O11K380J133k508k016J780K750q26k755m79K348J728j876k348O92L126
6967A728J25k417j436J933J864p20k607O6K518Q20j981j491Q24K325N5k350q97
6984a641J831J838j538j727J74K163O27k140j331J277J635n40j515n83J450J448
7000A428j322j871P45J933K25j676n73R25J483q74j408nJ314Q78j260q59P48J067
$$ plain form
6887 -1928 138 2012 724 -2054 -1751 1280 1857 -673 -2318 -648 1841 1391 -1364 -2171 402 2382
6903 2382 98 -1824 -1143 1807 2143 -616 -2302 -141 2636 969 -1860 -1931 954 2272 -88 -2575
6919 -2575 -731 2236 1580 -1261 -2172 339 2346 829 -2252 -1439 1471 2261 -717 -2209 -362 1894
6935 1894 1540 -1693 -2116 826 2284 243 -2243 -899 1758 1930 -711 -2371 362 2202 634 -2012
6951 -2012 -1401 979 2112 -396 -2412 -632 2118 1292 -1463 -1942 406 2134 258 -2090 -1398 1728
6967 1728 1853 -564 -2000 -67 1797 1077 -1530 -1464 1054 1874 -107 -1598 -774 1551 1606 -744 -1641
6984 -1641 190 2028 490 -1237 -1063 1100 1727 -413 -1744 -467 1168 628 -887 -1470 -20 1428
7000 1428 106 -1765 -1020 913 1138 -538 -1111 -186 1297 423 -985 -990 324 1202 -58 -917 -169 898
7018H98p7j307k88J156Q78p15j314J51J411L33j252o49M66J174m68r08j92J229
7036E26R9m80j019M66P06j8o49m90P57L05k89m75Q4K76L81l34q2j08P36q8o37
7057c33K09K26L06l34K49m91M76L3J3l18M17j59m13J65Q27r89J82K5J63L18l95
7078A77o12O29K93m45m83o87Q30K02l09j150J534J28n04o08Q89K52M74r55o65
7097a010Q77L15K20r41j81J101N24n95j228O94J337k62j004m58Q95R39m78j220
7115d75j84J868m9j119j047O35J456q1j867l75J364J082j139j442K35J534O14
7132A010j733r63J318J170m56j636j17J565J197j285j773J159J670J10k058m08
7148a230J459J659j005j697Q8J881O45j628j499J277K073p16j936l18J604J299
$$ plain form
7018 898 821 -486 -774 382 1260 545 -769 -618 793 1126 -126 -775 -309 865 397 -511 -703 526
7036 526 625 145 -874 -408 298 280 -369 -859 -102 203 -86 -561 -477 -201 180 -154 -236 -344 392 304 -333
7057 -333 -124 102 408 74 323 -168 308 341 354 36 453 294 -119 46 873 -116 66 91 254 572 177
7078 177 -435 194 487 42 -441 -1128 -298 -96 -405 -1555 -21 107 -397 -1005 -116 136 610 -345 -1010
7097 -1010 -133 182 402 -539 -720 381 905 310 -918 -224 1113 851 -153 -611 284 1223 745 -475
7115 -475 -659 1209 1160 41 -1006 -371 1085 1004 -863 -1238 126 1208 69 -1373 -1138 396 1010
7132 1010 -723 -1686 -368 802 346 -1290 -1407 158 1355 70 -1703 -544 1126 1236 -822 -1230
7148 -1230 229 1888 883 -814 -726 1155 1800 172 -1327 -50 2023 1307 -629 -947 657 1956
7164A956j466j752L21K085K64k326p55J170J976r17k311k84K241J514k171j602
7180b057R16K318o8k319q31J987J908j406k100L35K295R25j713j790J283K489
7196B172m52k478p70K200J587j407k212N46K439M26k380j482J849J750n28k722
7212a462l73K483J173k020j718P26K619j42k357j329K091K087j386k406L31K392
7228G09Q42k182j697J508K711o55k459l56K114J603j810j695L71L038q7k521r81
7245a547K026J739q83k420Q0K254P34j779j816J113K079l88k234q78K085J260
7261A425j377j693K35K192k6j670j132J347K071q66k054k72K072J202j423j677
7277a646Q37J767L01j963m82J664J150r13j606J14J792N34j395j097R89J371k06
$$ plain form
7164 1956 490 -1262 -941 1144 1408 -918 -1673 -503 1473 556 -1755 -2039 202 1716 -455 -2057
7180 -2057 -1141 1177 1109 -1210 -2041 -54 1854 448 -1652 -1317 978 1903 190 -1600 -317 2172
7196 2172 1720 -758 -1528 672 2259 852 -1360 -814 1625 2051 -329 -1811 38 1788 1260 -1462
7212 -1462 -1835 648 1821 -199 -1917 -1191 1428 1286 -1071 -2400 -309 1778 392 -2014 -1683 709
7228 709 1551 -631 -2328 -820 1891 1236 -1223 -1579 535 2138 328 -1367 -996 2042 1955 -566 -1547
7245 -1547 479 2218 1335 -1085 -1005 1249 1983 204 -1612 -499 1580 1192 -1042 -1920 165 1425
7261 1425 48 -1645 -1410 782 756 -914 -2046 -699 1372 506 -1548 -1820 252 1454 31 -1646
7277 -1646 -809 958 1259 -704 -1186 478 1628 715 -891 -777 1015 1549 154 -943 46 1417 1211
7294A211j645k80J210R13j021j549N39J522J18j499o43Q00J094p51j147o0J340
7311A52L11o72j269M75J296K19j137l31R01N80k75q73J47J084o1o01l38N15Q68
7330I91j45r80j2N87N26p18m94J43N73K04o96m07O29M28k91m86j59J96J4r5m18
7351f10L80L2l02J04j28L43J28k54p0J3K72k04M2m7K58m5J58j84J74J06j68J01
7373I9N96l37M8m19L15M19j44n12J50N2J70l08l41K11L86q8p89N1P59J25m82o89
7395g28K54N98O1p83k71J035K25m74r03L00Q77L09j039m41R43Q08j96j314J2J490
7415G63K82o88j102P15J187j40j328k23J077P42q73j160J01J327N77j447j013
7432a203Q36J547o39j440m8J228Q37j457r83P43J112L44j373j032J485J238q64
$$ plain form
7294 1211 -434 -714 496 1409 388 -1161 -622 900 1018 -481 -1124 -324 770 19 -1128 -1188 152
7311 152 463 -209 -1478 -1003 293 512 -625 -956 -55 525 250 -623 -476 608 547 -54 -392 123 991
7330 991 846 -134 -146 441 967 249 -245 -102 471 675 -21 -428 201 629 338 -148 -307 -111 -97 -192 -610
7351 -610 -230 -198 -500 -396 -524 -181 -53 -307 -377 -364 -92 -296 -254 -301 -43 -88 70 -114 60 166 -2 99
7373 99 695 358 406 -13 302 721 577 65 215 267 437 129 -212 -1 385 297 -492 -441 318 443 -39 -728
7395 -728 -474 124 185 -598 -869 166 391 -83 -986 -686 191 500 -539 -980 -37 771 575 -739 -727 763
7415 763 1045 357 -745 -30 1157 1017 -311 -534 543 1285 412 -748 -647 680 1257 -190 -1203
7432 -1203 -367 1180 541 -899 -947 281 1118 -339 -1322 -579 533 877 -496 -1528 -43 1195 331
7449C31j543L10J504M62j257j182R40J568k49j513n04J298J338j272j257K11J844
7466A029M00j628j297J400J703o61j873l16J765J061j446j488N82J930Q8j946
7482f97o11J182J217n22j734k28J914R45j679j564J232J775k96j677n95J496J316
7499A474j037j986O53K016N61k300r10J459J886p84k193j9J771J054j567j435
7515a357O32K077J32k010j055J626J519q69k058L90J771O20j692j365J059J960
7531A380k96k074n35J508J328j087j705K15K083K42j604j048J311J972r96j817
7547a123j84K064O52j223j216N44J952k63k276j54J373J498q35k167N56J626J72
7564I96j057j465J431J373j15k151j91J943R38j732j469R10J520L09j686q01J558
$$ plain form
7449 331 -1212 -902 602 1064 -193 -1375 -435 1133 884 -629 -1133 165 1503 231 -1026 -815 1029
7466 1029 1429 -199 -1496 -96 1607 946 -927 -1243 522 1583 137 -1351 -769 1161 1249 -697
7482 -697 -1308 -126 1091 569 -1165 -1393 521 1466 -213 -1777 -545 1230 934 -743 -1338 158 1474
7499 1474 437 -1549 -896 1120 1681 -619 -1529 -70 1816 1032 -1161 -1180 591 1645 78 -1357
7515 -1357 -725 1352 1484 -526 -1581 45 1564 695 -1363 -973 798 1418 -274 -1639 -580 1380
7531 1380 1084 -990 -1525 -17 1311 224 -1481 -1266 817 1059 -545 -1593 -282 1690 694 -1123
7547 -1123 -1307 757 1409 186 -1030 -486 1466 1203 -1073 -1227 146 1644 809 -1358 -802 824 996
7564 996 -61 -1526 -95 1278 1163 -988 -1179 764 1702 -30 -1499 -589 931 1240 -446 -1247 311
7581C11P58p59j251L91M39P39m57r97J562J154j961Rj032J185J270r27j168j260
7599a994L279K28k470o11J582P32j007n25m31Q01J815p84k381J389K106j603m54
7616c28J39J208K24r56q52L24M53M9Mj030Q75K33L19j759P65O01K65n83m25K62
7636b12N37m54j8o30M54P85l32l86J58J10J99k91j21K36J67j23k66J62P1N5j48
7657d7q6M48l99l7K81p9J6k6n0J04N4l5j20K02R4L7l65j81J76M26k82n36J5M66
7681G6L12m72k23J34N25k92m25j96Q47j06m04l53L72P04K9q70k38N67N23k62q92
7702f44J06Q96J51p11n15R37N60j33r79j58R56N26o94j019N11R22lj000n21Q09
7722cJ045q25j130K12J154L32r87p38O41J121k69j236m11J188P11p43j117L00
$$ plain form
7581 311 1069 310 -941 -550 -111 628 171 -826 736 1890 -71 -62 -1094 91 1361 434 -734 -1994
7599 -1994 1285 1513 -957 -1568 14 746 -261 -786 -1217 -416 1399 615 -1766 -377 1729 126 -328
7616 -328 -189 1019 1243 287 -565 -241 212 261 265 -765 110 343 662 -1097 -332 269 534 -49 -474 -212
7636 -212 325 -129 -147 -777 -323 462 130 -256 -98 12 211 -80 -201 35 202 79 -187 -25 46 101 -47
7657 -47 -133 315 -84 -121 160 81 97 71 21 125 179 144 24 226 320 357 -8 -189 -13 413 131 -405 -390 76
7681 76 388 -84 -307 -173 352 60 -365 -561 286 180 -224 -577 -205 499 528 -342 -580 -13 510 248 -644
7702 -644 -538 358 509 -202 -717 220 780 647 -332 -490 466 992 298 -721 -210 712 709 -291 -812 -3
7722 -3 1042 217 -913 -701 453 785 -202 -940 -299 822 553 -683 -1094 94 805 62 -1055 -755
7740g55J337K03j351l85Q63J246o46j386L67J098M93r33j184P10J380p3j402n46
7758i64J302O59l91j443q0J497N67j370j067P54J761k34j935o5J222R19j700p33
7776a301O52J002R55j728q21J027J661j061j549L24J450R10j779j171Q00J729
7792A100j96j543l1J299M76p81p39j35J757M67j822m73L03J333l53j403m01J926
7810G84R67j498j453K13K077j34j518l82k1J662n87j850Q08J266J017j732j355
7827a736J570Q44m4n69j732J802R55q47j207k8K208j3j383o68P67J710n19j883
7845g73j23J253R02m14j658N43J675l02j414r15O20J349q34m82m57J552O34r41
7863B15j233P51J365j045j127n35K143j57j56j268J070N80K24j158q03J053J101
$$ plain form
7740 -755 582 785 -566 -951 -88 1158 512 -874 -507 591 1084 151 -1033 -323 1057 984 -418 -964
7758 -964 338 997 606 -837 -917 580 1147 -223 -1290 -536 1225 991 -944 -1009 213 1132 -568 -1301
7776 -1301 -649 353 1308 -420 -1241 -214 1447 386 -1163 -839 611 1521 -258 -1429 -629 1100
7792 1100 904 -639 -670 629 1105 324 -415 -550 1207 1674 -148 -621 -318 1015 662 -741 -1142 784
7810 784 1751 253 -1200 -987 1090 956 -562 -944 -965 697 110 -1740 -932 334 1351 -381 -1736
7827 -1736 -166 678 634 65 -1667 135 1090 243 -964 -992 1216 1203 -180 -848 -81 1629 1110 -773
7845 -773 -896 357 1259 845 -813 -270 1405 1103 -311 -1226 -606 743 -91 -573 -1030 522 1156 215
7863 215 -1018 -267 1098 53 -1074 -1609 534 377 221 -1047 23 603 827 -331 -1134 -81 1020
7880A020p3j303m05J575o6m59r25O27R65K80j886N16M32J25m9j099M63J190M86
7899A414j472q46J32R54p12k38o40K001m61j26o72n18J871n31J59r62R11n27J181
7918I18r93l01J100m57J94q77O95O46l60o57j90J027l10j4m17O18j34R12j480
7937h0n3k37O60Q34j313O09q43J142p93j86q6r4Q01j019K76R62q02k22K82k66
7957d28J65M5j04M13l99N72p61Q47k51J91P4o85P19r1o49N35k44Q33j43o72M21
7978C88J8N67j533k37N50P13k0q11O15m83J464m53o15r46J205J15o29m02K55J492
7998A253r66j436J004L40J84p59o34M02J197n63J13q92J303q4l54j100J041J092
8016A141k97r49l16R05P00q11j254J216J15P00j556k63Q52N71j01j012p55J452
$$ plain form
7880 1020 947 -356 -761 814 748 289 -636 -9 956 1236 -650 -134 298 423 374 -725 -262 928 1414
7899 1414 -58 -904 -772 182 -530 -768 -1408 593 132 6 -666 -1184 687 156 315 -647 264 -263 918
7918 918 -75 -376 724 267 461 -416 279 925 565 -92 -282 745 435 421 4 622 488 1400 -80
7937 -80 -133 -370 290 1124 -189 420 -423 719 -74 -260 -346 -440 361 -658 -382 580 -222 -444 -162 -428
7957 -428 -263 -218 -322 91 -308 264 -497 350 99 290 364 -321 398 307 -342 193 -51 782 639 -33 388
7978 388 406 973 -560 -797 -247 466 446 -365 250 -233 1231 778 163 -783 422 537 -92 -494 -239 1253
7998 1253 287 -1149 -145 195 379 -380 -1014 -612 585 22 135 -757 546 462 108 -992 49 1141
8016 1141 844 -105 -421 484 1184 373 -881 335 450 1150 -406 -669 183 754 653 -359 -1114 338
8034C38K94r69r96R14M41P68p80j241M64J491m06j508M59P27Q03j011r56J356
8052A88Q75l57j568j60O63J119q84l38r7J307O73j603m60P63J295p01q59n20J055
8071C91N96r65q94M13R26L96j212o47Q83J003m64j418k1J409L66q72r73J36J789
8090H42J7j615m57J106J163q13j167n7J687K05r79q41O67J161j77j184l81J150
8108C27R06j142j032M71J542j58j016q39Q86J142o52j318j58J548M65j090r37
8125a055O23J493m10j215q25J546J026r88j237L81J253J83j172o70J010R48j64
8142G27j577j80J434Q48q56j356Q06J284J81j471p37R60O39m05j120J12J406N22
8160A217j464o83Q52R09q3j280k30R51N26n29r79O6J272J74j168m75R30Q33m59
$$ plain form
8034 338 632 -337 -1333 -419 22 790 10 -1231 -767 724 318 -1190 -731 -4 799 -212 -1168 188
8052 188 1063 706 -862 -1022 -359 760 -124 -462 -559 748 1421 -182 -642 121 1416 715 -144 -664 391
8071 391 987 22 -872 -459 467 863 -349 -996 -113 890 426 -992 -1013 396 762 -110 -1083 -947 842
8090 842 859 -756 -1213 -107 1056 243 -924 -981 706 911 -68 -909 -242 919 742 -442 -823 327
8108 327 1233 91 -941 -470 1072 914 -102 -941 -55 1087 435 -883 -1041 507 972 -118 -1055
8125 -1055 -432 1061 651 -564 -1389 157 1183 195 -1042 -661 592 775 -397 -1067 -57 891 727
8142 727 -850 -1030 404 1252 396 -960 -154 1130 1311 -160 -897 63 702 297 -823 -711 695 1217
8160 1217 -247 -930 -78 831 748 -532 -762 189 715 186 -793 -727 545 719 -449 -924 6 839 380
8179C80j172JJ191M52r27p27O02Q77J19j259m01J147
$$ plain form
8179 380 -792 -791 400 852 -75 -802 -200 677 796 -463 -864 283
8191B83
$$ Imaginary data points
##PAGE= N=2
##DATA TABLE= (X++(I..I)), XYDATA
0@%%%%%%%Jj%qJ6j6K4l4M2m9O2q1R4j14J41j65J92k29K71l12L61m20M81n51O31
32C36p21Q18r23J043j176J319j478J653j840K047k276K525k792L087l411L762
48A973m148M570n035N546o110O739p439Q224r112J0125j1289J2648j4264J6209
62H637j8612K1678k5732L1377l9851N4145q4322K61069m09247l65499P33811L37303
74E04757l06802n80467l1068N91777L65387o21569n65518M30893O67553k25881
84B29062o28802j00160N20717L71193l31308n74516J28157O45367J43020o05470
94b02740l39983M98007M94530k74509m89748P902M58541L02679l44936n17675
104d07932K39444O30568p8743n83589q1379M17530K61554j80754m36637n8767
$$ plain form
0 0 0 0 0 0 0 0 0 1 0 0 -8 8 -8 16 -18 24 -25 37 -44 50 -64 77 -88 104 -125 146 -166 195 -225 256 -295 336
32 336 -385 433 -490 553 -623 696 -782 871 -969 1078 -1198 1327 -1465 1622 -1789 1973
48 1973 -2175 2395 -2640 2906 -3204 3535 -3904 4320 -4792 5333 -5956 6692 -7572 8637
62 8637 -9975 11703 -14029 17348 -22503 31642 -52680 208389 -200858 -566357 167454 504757
74 504757 197955 -382512 -413580 178197 543584 -77985 -643503 -212610 454943 229062
84 229062 -399740 -499900 20817 392010 60702 -513814 -385657 259710 402730 -202740
94 -202740 -542723 -44716 449814 175305 -314443 -306541 152000 454679 109743 -407932
104 -407932 -168488 462080 383337 -200252 -281631 135899 397453 216699 -219938 -278705
114b78705N35022K04996n30962l07180L57908L38285j37670l76273j18943L33727
124B0205K91784k67348m17351J30558M32309J2460l83232j68402K71682K83604
134B06269j24918l24181l3301L21604K11608k59047l11839K02035L51688p5548
144A64370k75920n8633J89382K24717p3270l24637n707L65631P5946l08210j23240
155a49571J73902J66688j2458k19587j36940K32407J99595k10789k29385J02913
165h3225K01625K023j81278j17802J15811J75328n4377k12081k7725J96312R1291
176A05902j55783j35945R9133J49775k1344j14806n5258Q3591J47540m4970j79215
187a21380M3036J74052j0640r8282j8884L0191P9043L7392j14409o0741J32918
$$ plain form
114 -278705 256317 461313 -69649 -376829 -18921 319364 181694 -194579 -313522 20205
124 20205 311989 44641 -372710 -242152 190157 202617 -180615 -349017 -77335 206269
134 206269 81351 -242830 -276131 45473 257081 -1966 -313805 -111770 239918 164370
144 164370 -111550 -170183 19199 243916 170646 -153991 -159698 205933 281879 -26331 -149571
155 -149571 24331 191019 178561 -41026 -177966 54441 254036 43247 -186138 -83225
165 -83225 118400 120423 -60855 -178657 -62846 112482 58105 -153976 -181701 14611 105902
176 105902 -49881 -185826 -86693 63082 41738 -73068 -128326 -44735 102805 57835 -121380
187 -121380 -78344 95708 85068 -13214 -32098 -1907 77136 114528 119 -60622 72296
198G2296N8806j08742l8980M7589J8725J3386l0041o5455L0832O2274l9617n6578
210c5505J3305K7309q345k2066n018J082n873O126N839j5564n297J3970o530K509
224c4058L0561k5367l9763O2863M4491o2929j9307M4390J7086J9010j4223o5975
236d3221L7997J06861l9924j05926L0583Q6571Q957m9579o4839J1417J11332J4202
248A04431j36206m8827J13092P6322p8244j16757J6594J23532L2905j17061r6399
259a26618P3338J39436k6507j68792l2022J62355Q0279j20678j16902M9173J45574
270E8636M4909j53468j19165J49760J71395r9371j72258K5282J60452P9025j20011
281B5186j60917P5655K16255j1636k19687n7488J78969J29070j06119j86908J2712
$$ plain form
198 72296 131102 22360 -16620 30969 49694 63080 33039 -32416 -1584 60690 21073 -35505
210 -35505 -22200 5109 -3236 -25302 -30320 -29238 -35111 -28985 -23146 -38710 -44007 -30037 -36567 -34058
224 -34058 -3497 -28864 -68627 -5764 38727 -24202 -43509 881 17967 36977 22754 -43221
236 -43221 -5224 101637 61713 -44213 -13630 72941 81898 32319 -32520 -21103 90229 104431
248 104431 -31775 -80602 32490 108812 30568 -86189 -69595 53937 86842 -30219 -126618
259 -126618 -53280 86156 59649 -109143 -141165 21190 101469 -19209 -136111 -86938 58636
270 58636 103545 -49923 -169088 -19328 152067 52696 -119562 -94280 66172 145197 25186
281 25186 -135731 -60076 156179 144543 -75144 -132632 46337 175407 69288 -117620 -104908
292a04908K11761P2961j98129j55625J34869K04947n4107k31450m5998K06361
302D0682J25199j43561j96611M9014K32376M9076k32015j37438J85997J98934
312A71653r9268k21028j5532K15574J34553j71984k22361J10564K67652j4339
322A55484k52650q7170J99420J87272j08381k53959P267K77414R6579k43314j86189
333b08227J61247K48729m9814k74014p2444K47250J78564j78018k60288O9498
343a37517K93680M3220k78824j52771K08369K30439j00275k73763k9262K74648
353G7944J47352k27254k37931J41534K80802k3863k73446j01429K25588K13835
363B23132j40857k82870L9332L00364P3373k59747j73776J76048K48137o2694
$$ plain form
292 -104908 106853 179814 -18315 -173940 -39071 165876 111769 -119681 -165679 40682
302 40682 165881 22320 -174291 -125277 107099 156175 -75840 -213278 -27281 171653
312 171653 72385 -148643 -164175 51399 185952 13968 -208393 -97829 169823 155484
322 155484 -97166 -184336 15084 202356 93975 -159984 -152717 124697 221276 -22038 -208227
333 -208227 -46980 201749 151935 -122079 -194523 52727 231291 53273 -207015 -137517
343 -137517 156163 199383 -79441 -232212 -23843 206596 106321 -167442 -196704 77944
353 77944 225296 -1958 -239889 -98355 182447 158584 -114862 -216291 9297 223132
363 223132 82275 -200595 -161263 139101 212474 -47273 -221049 -45001 203136 140442
373A40442k81785n6685K66248J63673k02748k42732J03551K80009J2127k70118
383h8018j25373K10964K14667j17742k68925O137K74895J01906k32605j87975
393b12069J49545K39422l9556k49067p5041K19579J72435j55639k33071O6375
403a17087K48267L4284k19832j28479J55403J98506o8900k32155k5070K22493
413F7430J08290j73681j72586R3370K04593o82k03748q7813J65789J57957j00378
424E8541j98228K0748K03672N9069j69356j25751J07303J71494k8027j83695m9037
435a33267J65838J15586j15964j54303N0639J65069K4820j44693r2369J03044
445a5600J40027m7954j59018j3399J44588O8895j07758j12602N1050J30844P343
$$ plain form
373 140442 -141343 -198028 68220 231893 29145 -213587 -110036 169973 182100 -88018
383 -88018 -213391 -2427 212240 94498 -174427 -168290 106605 208511 -24094 -212069
393 -212069 -62524 176898 137342 -111725 -186766 32813 205248 49609 -183462 -117087
403 -117087 131180 165464 -54368 -182847 -27444 171062 102162 -129993 -155063 67430
413 67430 175720 2039 -170547 -77177 127416 126734 -77014 -164827 962 158919 58541
424 58541 -139687 -118939 84733 143802 -25554 -151305 -44002 127492 99465 -84230 -133267
435 -133267 32571 148157 32193 -122110 -71471 93598 118418 -26275 -118644 -15600
445 -15600 124427 76473 -82545 -95944 48644 117539 9781 -102821 -51771 79073 86416
456H6416j30032o5205J02845J01266o2575j21330Q980J15673M1647r3494q1999
467i7808N5050J07231r969j09980l0929R6512O4948o0091q1596K0442Q9573K3685
479F7068p6095n2832N5856P6016k4225p7821m349O7163L2267m3956n1494J6480
491a5922O0619L965n8043k5874M2076L4340k6538m0552K657L1812J3605k8845
503f700k8087J4917K7927p299k6210k719J6077O903o789n915m95O812N837k394
517h135K07M044l818J857J4726N321j5984o550K0635J6300j0275k0685J408K7246
531B6297J7015k9447k9374K1900M0262r840m8044j2865M2124K9336l4727n2129
543c9492P605O0910J2056o6394m0408N0087N5403k8386p1567o445P3092L7682
$$ plain form
456 86416 -43616 -108821 -5976 95290 32715 -88615 -79635 36038 77685 -15809 -97808
467 -97808 -42758 64473 54504 -55476 -86405 10107 75055 14964 -66632 -46190 43383 67068
479 67068 -9027 -61859 -6003 70013 45788 -32033 -36382 30781 63048 19092 -32402 -15922
491 -15922 44697 48662 -9381 -35255 6821 41161 14623 -25929 -23272 8540 22145 -6700
503 -6700 -34787 -19870 8057 758 -25452 -28171 -12094 -5191 -11980 -17895 -18390 -11578 -5741 -8135
517 -8135 -7928 -3884 -7702 -5845 8881 14202 -1782 -8332 12303 28603 18328 -2357 -949 26297
531 26297 43312 13865 -15509 6391 46653 36813 -11231 -24096 18028 47364 12637 -39492
543 -39492 -31887 29023 41079 -25315 -65723 -15636 39767 11381 -60186 -66631 6461 44143
555D4143o0929o7128L7603R0053l149r1019l0271Q1534P1611m8054r2195J2565
567e5236J09475L4930r4580p1512P2841J02793k6943j11813k1360J06367P0751
578A15713q0649j09212L6124J24815J1447j24218o7192R2591J02727n2683j31678
589h2215r544J28425N9344j10641j11123O4080J34729r229j41434n2423J19140
600a0891J05715p4411j40711J9553J56787M5954j34839r8050R8222J44455l0204
611H1580j56221l1868J50566J00572j06597j44211N2821J66887J9521j55245q8576
622a10771J19633J41902o3772j72312j1202J65902P7590j38515j40828P6681J67207
633A11515r641j76271p1820J43232J30225r5608j74440K1281J81063N3025j61597
$$ plain form
555 44143 -16786 -83914 -46311 43742 40593 -50426 -80697 837 72448 24394 -67801 -55236
567 -55236 54239 89169 -5411 -76923 -4082 98711 71768 -40045 -61405 44962 115713
578 115713 35064 -74148 -38024 86791 98238 -25980 -93172 -581 102146 49463 -82215
589 -82215 -91759 36666 96010 -14631 -125754 -61674 73055 63826 -77608 -130031 -10891
600 -10891 94824 20413 -120298 -100745 56042 101996 -32843 -130893 -32671 111784 81580
611 81580 -74641 -106509 44057 144629 38032 -106179 -53358 113529 133050 -22195 -110771
622 -110771 8862 150764 86992 -85320 -96522 69380 146970 8455 -132373 -55692 111515
633 111515 101874 -74397 -146217 -2985 127240 31632 -142808 -121527 59536 112561 -49036
644d9036j19895J11767J68366l7006j85484l6905J77511J13645j28076j60052
654a45165O5564J90951K1563j78824r1969J45230J58179p7708j86522K830J87832
665I1961P6428j55312j40254R3132J79691k2557j90543n9452J59043J20891j11858
676D1170j73155L6236J81584L3422j68700j07771J17234J54388n5556j80126j9993
687a41267J70096Q7083j31151j39815P3653J70037M122j66800o9148J44441J29801
698A31052q5571j57119K3998J67808N2598j39668j03837R6469J46556l1774j56950
709e6438l0598J38755Q9302j00103j31410M4048J41436J4779j36287p4885R6452
720d949J10638n4659j35020p826J25779N3607j01968r9809N3696J18186m114j21080
$$ plain form
644 -49036 -168931 -57164 111202 74196 -111288 -148193 29318 142963 14887 -145165
654 -145165 -79601 111350 132913 -45911 -137880 7350 165529 87821 -98701 -95871 91961
665 91961 168389 13077 -127177 -34045 145646 123089 -67454 -126906 32137 153028 41170
676 41170 -131985 -95749 85835 119257 -49443 -157214 -39980 114408 58852 -121274 -141267
687 -141267 28829 115912 -15239 -155054 -81401 88636 92758 -74042 -143190 1251 131052
698 131052 45481 -111638 -87640 80168 132766 -6902 -110739 -14270 132286 100512 -56438
709 -56438 -87036 51719 141021 40918 -90492 -46444 94992 109771 -26516 -101401 -4949
720 -4949 105689 51030 -83990 -91816 33963 87570 -14398 -114207 -60511 57675 53561 -67519
732f7519m6300J00614Q5482o1672j04280J6645J11777L5945r1468p1056O7011
743b4821J00328j9771r9036j9224R2275O2010o0999q2835K7689R3404J3914q3042
755a08m8492N8504P2221k9790q4922p200P3834L4519n8825o2425K5031O8412r24
768C9835p1242l1510N1137M6712l1854n9026O99N7394K2812m8050l9912L1071
780c1934N0481o241m7339j1536M2952L3346k4191l6679J1771M3638R580l2417
792A431j8060K5304L0329q838k9293r74K5412J1430j6030j9949O879J8195j875
805B3961j8555p314Q757M525o641r607l055K468r68n113m21j232n526m57P091
820a2087Q69r385n134P863J3184j185j6681j807K1892J4430j4985j8778J1802
$$ plain form
732 -67519 -113819 -13205 72277 10605 -93675 -77030 34747 70692 -20776 -91832 -24821
743 -24821 75507 55736 -43300 -62524 29751 91761 30762 -52073 -24384 69020 82934 -108
755 -108 -48600 9904 82125 52335 -32587 -39787 34047 68566 9741 -52684 -27653 40759 39835
768 39835 -31407 -62917 -11780 34932 3078 -55948 -55249 2145 24957 -23093 -63005 -31934
780 -31934 18547 12306 -35033 -46569 -3617 29729 5538 -31141 -19370 24268 33848 1431
792 1431 -16629 8675 39004 30166 873 -101 25311 36741 20711 762 7641 25836 23961
805 23961 5406 -1908 6849 11374 4733 -4874 -7929 -5461 -6429 -11542 -11963 -13195 -18721 -19178 -12087
820 -12087 -11218 -20603 -25737 -17874 -4690 -5875 -22556 -24363 -2471 11959 -3026 -21804 -10002
833a0002L0508M468k9440j3975L0338K9992j6913l6801L431M1911J5848l8884
845A0481l3332K7110M4576j1922n2586j4439M6282L3170l8249n5000J4515N9802
857C0408N743o0256l5562M4479N4634k5223o9382l811O8549L2699n6581n5712
869g0015L4167P5449k214p7535k6601P1003N8482m2998p6001J4656Q7010K5521
881G0924p6730n5149N7546Q0628k2729r0018j4020Q2532N3026o5498q1872L1464
893b9896R2806O806r3700m8516P0376P9478m1768j00168k796R5793M2602q1963
905a0946p8042M6462J00391o979j02852l8651Q8801P6127n6543j00900J6873J09795
917D3536L2972r6855p1788P1821J03299k5700j13097k0896J08205O8137p9916
$$ plain form
833 -10002 20506 24974 -4466 -18441 11897 41889 24976 -11825 -8394 33517 49365 10481
845 10481 -22851 4259 48835 36913 -15673 -30112 16170 49340 11091 -43909 -29394 30408
857 30408 36151 -24105 -59667 -15188 39446 14223 -55159 -58970 9579 42278 -14303 -70015
869 -70015 -35848 39601 37387 -40148 -66749 4254 62736 19738 -56263 -41607 45403 70924
881 70924 -5806 -60955 -3409 77219 54490 -35528 -49548 32984 86010 20512 -61360 -29896
893 -29896 62910 69716 -23984 -72500 -2124 77354 35586 -64582 -67378 28415 71017 -10946
905 -10946 -88988 -42526 57865 50886 -51966 -90617 -1816 74311 17768 -83132 -66259 43536
917 43536 76508 -20347 -92135 -20314 82985 57285 -55812 -76708 31497 99634 19718
928A9718j00445L9412J19289J1824j14662o0325Q9842R7545n0731j19903k854
939g1290J19932N0367j00179r6544N8550J20201j1257j26233m3952J07039Q8178
950I4812p1977j19657K1730J27596L2400j13710q0367Q1869J14278l3108j26159
961g2293j8439J21097O9118r1448j05949M8316J29167O016j27254n5844J05313
972G800R9325o2095j25090J0767J28803M3671j11955q8755P3057J18040k4165
983F9403j28743l0024J13777P6423q1986j10647L4003J23338J5854j15813o4659
994i9074Q7055R9275m4988j17277l681J13251N1429r0340q8081N3626J09044p130
1006F3109j09531l7225R3212P6369o0355r7707J8588J04965K5270r2913o2426
$$ plain form
928 19718 -80727 -41315 77974 89798 -24864 -85189 4653 102198 51467 -68436 -71290
939 -71290 48642 99009 -1170 -97714 -39164 81037 69780 -56453 -100405 6634 94812
950 94812 22835 -96822 -75092 52504 84904 -28806 -109173 -27304 86974 53866 -72293
961 -72293 -90732 30365 99483 8035 -97914 -49598 79569 85585 -41669 -97513 7800
972 7800 107125 45030 -80060 -69293 59510 103181 -8774 -97529 -24472 93568 69403
983 69403 -59340 -89364 24413 100836 18850 -91797 -57794 65544 81398 -34415 -99074
994 -99074 -12019 87256 42268 -75009 -78690 34561 85990 -4350 -92431 -38805 70239 63109
1006 63109 -46422 -83647 9565 85934 25579 -72128 -53540 51425 76695 -16218 -78644
1017g8644O5001Q8573k7575r6739j5064R0193N0765o7528p6815L2148Q8540N485
1029E8340q4747m0797O5651O5880l5554p9963R55P8024L1127o2543n6015L7085
1041b2557P0050n710p0948k3882N9224M7489l6866o2494J0237O4794J7215n5428
1053h876m0712L7219N5016j3962n8430j0474N1267L1890l6369m7203J7006N1229
1065B7601M806m6250k4498L4110L8138j6831m3617k427M1633J8965l1410l0606
1077c0386J7057L6866L71l5341j4041K7996K4720j5379k9085K363K8805R693k2354
1090A285j8482J3417K1729l913k1181n788J6001J1542j0079j6458L621J3786J186
1103F666j0576o395N112O674j180o826j215L929J213l02m07o92j915K715M191
$$ plain form
1017 -78644 -13643 74930 47355 -49384 -64448 25745 76510 8982 -67833 -35685 52855 58340
1029 58340 -26407 -67204 -1553 64327 28773 -51190 -50235 27789 58916 -3627 -59642 -22557
1041 -22557 47493 41783 -29165 -53047 6177 53666 16800 -45694 -35457 29337 46552 -8876
1053 -8876 -49588 -12369 42647 28685 -29745 -40219 11048 42938 6569 -40634 -23628 27601
1065 27601 32407 -13843 -38341 -4231 33907 17076 -26541 -28968 12665 31630 220 -30386
1077 -30386 -13329 23537 23908 -11433 -25474 2522 27242 11863 -17222 -14859 13946 23639 1285
1090 1285 -17197 -3780 17949 14036 -7145 -12933 3068 14610 4531 -11927 -8306 5480 6666
1103 6666 -3910 -10305 -5193 1481 301 -6525 -7740 -3811 -2598 -2900 -3307 -3999 -5914 -3199 992
1118I92J167m287m578N681J0931k713j2440q34J3718R021r935j6012N455K2306
1132A8472K048k2550j1571J7686K0324j0446k8087j769K9316J3349k8009k5866
1144b7103J7006L2093l697l7738j5388L4248K8516k5702l9308R091M3550J1398
1156B6966m2234k9355L2457M5233j5476n0777m017N0680K7972l7171m6628K2019
1168b0331N9545J796n7554k3554M7507M7100k6246o1398K285O4626K3114n5713
1180A177m5967L4616O0148q496o9411k2353O2694M4689m6444o4519J6463O9640
1192C2237J4327o8747m5678N2586O5967k7331p6346n567P2716L9509n7148o6377
1204f9852L4295Q2514j617p8277l0402O4851O3904l6348q0661O506Q7223K8595
$$ plain form
1118 992 2159 -2128 -6706 -1025 9906 7193 -5247 -6081 7637 16658 6723 -9289 -3834 18472
1132 18472 20520 -2030 -13601 4085 24409 13963 -14124 -15893 13423 26772 -1237 -27103
1144 -27103 -10097 21996 18299 -19439 -34827 -579 27937 2235 -37073 -27982 15568 26966
1156 26966 -15268 -44623 -12166 33067 17591 -33186 -37203 13477 41449 4278 -42350 -20331
1168 -20331 39214 41010 -16544 -40098 7409 54509 28263 -33135 -30850 33776 56890 1177
1180 1177 -44790 -10174 49974 41478 -27933 -50286 12408 57097 10653 -53866 -37403 32237
1192 32237 46564 -22183 -67861 -15275 50692 23361 -52985 -58552 14164 53673 -3475 -69852
1204 -69852 -35557 46957 45340 -32937 -63339 1512 65416 29068 -51593 -45087 42136 70731
1216G0731p1629n7154M5780P9772j0005q7862k6064Q0073N5622n6825p8315J8557
1228c7319Q6081J9024q4943n6780O4031P7451l4227r0076r888Q5105M7647p0393
1240d287q0199M1072R3959l969r1404l6574P5061P3776m5171r4956J2438J00584
1252D0330K8900q2032o1674N3914R1960j3695j00182k2059R3433N8062o4112q2234
1264e9389K4565R6808J8028r5132n4485P3763P8170l9411r3156p050Q9913M5610
1276G8234p8847p9052M7145R1047j1593r2146l3950P6434O8577n3316r1736K0064
1288e9139R4911J7252q0155n3486N6631Q3389k2638r3392p717Q8777M2677o0914
1300F196o6773L0458Q6621P171q5108l5102P0843N9233l8615p2730J860P7105
$$ plain form
1216 70731 -898 -58052 -12272 67500 57495 -30367 -56431 23642 79264 22439 -55876 -37319
1228 -37319 48762 67786 -17157 -73937 -9906 67545 33318 -56758 -66646 18459 66106 -4287
1240 -4287 -84486 -43414 50545 46576 -44828 -81402 -6341 67435 22264 -72692 -60254 40330
1252 40330 69230 -12802 -74476 -20562 71398 57703 -42479 -64538 28895 86957 22845 -59389
1264 -59389 -34824 61984 80012 -15120 -69605 4158 82328 42917 -50239 -57289 32624 78234
1276 78234 -613 -79665 -32520 58527 46934 -45212 -79162 -2728 65849 12533 -79203 -59139
1288 -59139 35772 53024 -27131 -80617 -23986 59403 36765 -56627 -64344 24433 67110 6196
1300 6196 -60577 -30119 56502 63673 -21435 -56537 14306 73539 34924 -37806 -35946 41159
1312D1159L1019o9621n6090M5773O5250j5058p0438k2711N9759M8212m7620o6904
1324e7270K0994O5412N881n8156l7490M0513N8023k2086o6503P57N9531K3554
1336C3160l9969m3658K0562N9640K780n7349j6794M7049L5316k1694m3029k04
1348b4190N1092K1814m4295l1161L0066L6741o201l8083j6965L4699L1162k9152
1360A5527l7848J1245L2366N664k9160k6742J8663L3730j2898l6407j378K6035
1372a203J2027j5589k6707M703L2670J387k8955o314J8891J4591k537j9832m470
1385b1338K5986J1672j8782r421J2060J2353L755j1146j0092J3983J4394j0909
1397A2515r680N331M167L761k587j1243K570R317o573n509J746m013n49L915o515
$$ plain form
1312 41159 72178 2557 -53533 -7760 57490 42432 -28006 -50717 9042 57254 9634 -57270
1324 -57270 -36276 29136 35017 -23139 -60629 -20116 37907 15821 -50682 -49925 9606 33160
1336 33160 -6809 -50467 -29905 29735 32515 -24834 -41628 5421 40737 19043 -23986 -24190
1348 -24190 26902 48716 4421 -26740 3326 40067 33866 -4217 -21182 13517 44679 15527
1360 15527 -22321 -11076 21290 26954 -2206 -28948 -10285 23445 10547 -25860 -27238 -1203
1372 -1203 10824 -4765 -31472 -26769 5901 7288 -21667 -27981 -9090 5501 2964 -16868 -21338
1385 -21338 4648 16320 -2462 -11883 177 12530 16285 5139 -4953 9030 23424 12515
1397 12515 2835 8166 12333 16094 13507 2264 4834 14151 7578 2069 3815 -198 -747 3168 -3347
1412c347m110K746l871k20O126q271q092R492M970m798l450l998N691J5074p306
1427c364j6675R652J6778J63r484q489Q135K2620k276k5963R76K5396Q293j4221
1441A1541j8356L838K9309N563l4008j3599K6807J9033j4286k9077n755L3228
1453A4238J6780l5723k8393K2760L0784p340l5043j6414L3467L2353k9329m2329
1465d4189J5895M2486N455l6541k7854K9443M7968j6534n1977K843M8735K1105
1477C6835l2705l9762J8484N6787J438n6651j7488M6196L6530k4327n1229j42
1489b6034N8723K1230n5131l8864L5428M8360r727n7098k1433N3766M1571m4614
1501F177n6035J9084N6943R256n4825l9656M3217N9115k5478o6451O10O0686K9364
$$ plain form
1412 -3347 -7457 -4711 -8582 -8802 -2676 -10947 -19039 -9547 -4577 -9375 -12825 -16823 -11132 3942 -3364
1427 -3364 -20039 -10387 6391 6554 -2930 -11419 -3284 19336 17060 -8903 -7927 17469 25762 11541
1441 11541 -6815 -2977 26332 31895 -2113 -15712 11095 30128 15842 -13235 -18990 14238
1453 14238 31018 -4705 -33098 -10338 20446 13106 -21937 -38351 -4884 27469 -1860 -44189
1465 -44189 -28294 14192 19647 -16894 -44748 -15305 32663 16129 -35848 -33005 15730 36835
1477 36835 4130 -35632 -17148 39639 41077 -15574 -33062 13134 49664 25337 -25892 -26034
1489 -26034 32689 53919 -1212 -40076 -4648 43712 33985 -23113 -44546 9220 50791 6177
1501 6177 -49858 -30774 26169 35425 -19400 -59056 -15839 43276 17798 -48653 -48043 12643 42007
1514D2007m4814n4128K6981P1251k325o8597k0674N5870M7708k9244o5392M494
1526c6863P4034K3083o4452m3826M1729O1252r966p0582k2084O7207M6350n1506
1538A4376o3095K0477O7279J2570o6310m6223N1575O5120l0496p3848k280O6977
1550A6122L5127n3596o3269L2174P7416n825p4864k3935O0488N3399l5537p2615
1562e4915R559Q0725J9689o8802m3378M6051O5994j3639p6041j5600P3927M2246
1574F5816n5135o0407K5521P0327Q679p0806l9624N8424N9191l5885o9588K540
1586d0947O6757K9032n7573n6876L7796O8942j3286o9337j7866N7438M5324l9303
1598A0101o4716J6722P0288R179o1828l3157M3832N4414j8969o4343m471O4288
$$ plain form
1514 42007 -2807 -56935 -29954 41297 38972 -29625 -50299 5571 53279 24035 -41357 -36863
1526 -36863 37171 60254 -4198 -48024 -6295 54957 44991 -25591 -47675 19532 65882 14376
1538 14376 -48719 -28242 39037 51607 -14703 -60926 -9351 55769 25273 -48575 -50855 16122
1550 16122 51249 -2347 -65616 -33442 43974 38149 -36715 -60650 -162 53237 17700 -54915
1562 -54915 -45356 35369 55058 -13744 -57122 -11071 54923 41284 -34757 -50357 23570 65816
1574 65816 10681 -49726 -24205 46122 54801 -16005 -55629 2795 61986 26101 -43487 -40947
1586 -40947 25810 54842 -2731 -59607 -21811 47131 33845 -35492 -53358 4080 49404 10101
1598 10101 -54615 -37893 32395 41574 -20254 -53411 -9579 44835 25866 -38477 -42948 21340
1610B1340K7526m8745m3851K6107N6217Q21n8257k3362N0817L9884l2102m9101
1622c2706P000N0803J7706m6219l6955L2740M5707j3841m7701r377M0388K8887
1634C6432k9910m2763J3982M5860K524l9575k0537K7325L4501j2823m1505j463
1646b7952L9535J4443k8248k5919J4661L3611J224l4566j2819K9405K1983j6666
1658H692k6588K314K8467J0866k4810j9967J6845K3878n929k2720o969J9373J6375
1671A9827j3618k2148O399K0515K486j6482j1594R877J7523l873j8947j897J5138
1684C206P038q969j1281K497J3341K903j2602n316Q952O658l262o835k258O890
1698I62N338n787n044K777L596N77j767l316O14L191K05j608j50j829M83M287
$$ plain form
1610 21340 48866 121 -43730 -17623 38594 39415 -18842 -42204 8613 48497 16395 -32706
1622 -32706 -25706 25097 42803 -3416 -40371 -7631 38076 24235 -23466 -32843 7545 36432
1634 36432 6522 -36241 -22259 23601 26125 -13450 -33987 -6662 27839 15016 -26489 -27952
1646 -27952 11583 26026 -2222 -28141 -13480 20131 21355 -13211 -26030 3375 25358 8692
1658 8692 -17896 -15582 12885 23751 -1059 -21026 -4181 19697 13768 -8952 -15921 3452 19827
1671 19827 6209 -15939 -9540 10975 13461 -3021 -14615 -4738 12785 8912 -10035 -11932 3206
1684 3206 10244 1275 -10006 -7509 5832 8735 -3867 -9183 -231 6427 3165 -3670 -5928 962
1698 962 6300 513 -4531 -1754 1842 2419 652 -2664 -2050 1141 1346 -262 -412 -2241 -1758 2529
1714B529j40m468k034L195M579K74o896l545Q089O598o396q312J491J0771M707
1729A0442j0879j0079Q889J4269l805j6235l290J4786J1619j1794j8314N484K1511
1742A2604J745k0635j1500J5361J9790q511k5342j869K6070J1290k1362k1239
1754b3598J2175K8141p42k9894j1997K7127K3172j7611k9899M740L3619J0143
1766B5376k9948k3977K3359L3209q933l5972p689L5738K1389k5862l3231J2785
1778a3756L9439K880l8475k0221L0415L3927j8280m2621J238M2231J5990l6375
1790c608l2774K1667M2747n574m6073j3653L9869L1528k7458m3780R205M8191
1802B0287J1524m3759k9615L2222M3923j2977m9055p104M7376K8576l4947m3093
$$ plain form
1714 2529 2389 -2079 -4113 -918 3661 3935 -2961 -6506 1583 8181 1785 -6527 -5036 5735 10442
1729 10442 -437 -10516 -1627 12642 8837 -7398 -10688 4098 15717 3923 -14391 -8907 12604
1742 12604 14349 -6286 -17786 -2425 17365 8854 -16488 -18357 7713 19003 -2359 -23598
1754 -23598 -11423 16718 15976 -13918 -25915 1212 24384 6773 -23126 -18386 15233 25376
1766 25376 -4572 -28549 -5190 28019 19086 -16886 -24575 11163 32552 6690 -26541 -13756
1778 -13756 25683 28563 -9912 -30133 282 34209 15929 -26692 -25454 16777 32767 -3608
1790 -3608 -36382 -14715 28032 22458 -23615 -37268 2601 34129 6671 -37109 -27904 20287
1802 20287 31811 -11948 -41563 -9341 34582 21605 -27450 -34554 12822 41398 6451 -36642
1814c6642J8366N1152M229m9142k4845L9721M2116k2364n1566O09N1708K0876
1826D4218m4074l9932K6600N0648o453n4814j7248M6867L5416l2142n0862J0579
1838c1197N4682J1669n0710l3040L6026M8658j5579n5999p006N3082L0519l9855
1850A250m6424K1591N6562L433n4158k5109M3889M5894k4944n4552K466N6739
1862B6637K2007m7350m1348L0563N3896q517n7176j6019N0170L5870l6211n1622
1874c9100J3792N5305Q302n2988l1389L9076M5468k0085n5299l819N3124K4574
1886C6961m2730m2367K4734N2375k384n2506j8552M5023L8008k7611m8159Q885
1898b8323N2451J4064m4148l1257L1969M5379j1982m8423p486M5005K6649l3126
$$ plain form
1814 -36642 -18276 32876 37105 -12037 -36882 2839 44955 22591 -28975 -28366 23342 44218
1826 44218 144 -39788 -13188 37460 31007 -23807 -41055 5812 41228 9086 -41776 -31197
1838 -31197 23485 35154 -15556 -48596 -12570 36088 20509 -35490 -42496 10586 41105 1250
1850 1250 -45174 -23583 32979 36412 -17746 -42855 1034 46928 21984 -32568 -30102 26637
1862 26637 48644 1294 -40054 -9491 44405 35888 -21288 -37307 12863 48733 12522 -39100
1874 -39100 -25308 29997 38299 -14689 -46078 -7002 38466 18381 -36918 -40737 12387 36961
1886 36961 -5769 -48136 -23402 28973 26589 -25917 -44469 554 38562 10951 -37208 -28323
1898 -28323 24128 38192 -5956 -37213 -5244 40135 28153 -20270 -27756 17249 43898 10772
1910A0772l9652J6258M5214J926m3976k0878L3236L3385k0676m2185J463M0322
1922A5209J3805l4804k8949K1006L5077o041l8530j0270L2655K3316k2770l1445
1934c1741R020L4597O521k9917j7645K2616K7778q817k9245k375K9282J5084j9564
1947E594k2339J0986K7233J336k4647j1280J9533J9237j0877k3238M07K1408P743
1960B1096j8281j6183R634J8015l297j9335o820J4396J0670j0140j5710J987J4786
1973H18L933j3279r907Q308J2473k441j1730j892J0842P055n622p684L238R543
1987C655L272o602m290N449P733j198n671o52N710L021k408l619K34K195J497
2002H326k965k176k41R34m21p86k868j860L76J158l82l045l781O75N193m88o632
$$ plain form
1910 10772 -28880 -12622 32592 34518 -9458 -30336 2900 36285 15609 -26576 -25113 15209
1922 15209 29014 -5790 -34739 -13733 21344 15303 -23227 -33497 -842 22474 -296 -31741
1934 -31741 -22721 11876 18397 -11520 -29165 -6549 21229 12412 -16833 -19208 10074 25158 5594
1947 5594 -16745 -5759 21474 22810 -1837 -13117 6416 25653 14776 -8462 -8055 13353 21096
1960 21096 2815 -13368 -3734 14281 10984 -8351 -15171 -775 9895 -245 -15955 -13968 818
1973 818 4751 -8528 -18435 -10127 2346 -95 -11825 -13717 -2875 4180 -1442 -9126 -5888 3655
1987 3655 6927 325 -3965 1484 9217 8019 2348 1696 7406 10427 8019 4400 4634 6829 8326
2002 8326 5361 3185 2944 3878 3457 2671 -197 -2057 -1681 -523 -905 -3950 -7731 -7056 -1863 -2351 -8983
2019h983j979M819M282j602p963P13J0001L351p053o415N810J2992j208j2545
2033e780k676J1550J2402p466j4160L640J6156M797j5500j0665J2100J5931n777
2046A4552k0205k650J7706J0570j5688j9285P659K1788J49k4686j1429J8578J7799
2059A4858j1517k5525R21K6332Q904k3198j9036J5706K6632l741k9407p128K7898
2072A699J9589j8278k6869R307L1964O616k9342j7955K3908K9130j0567l3439
2084a4237k419L3197J6681k5933k9317J4868L5549j319l6905j4720K9095K6832
2096C1372j9613l6955L788L6483J1256l4295k6156K2322L5010r920l8488q554
2108c3750L7027K2433k7475l2463J2773L9561M162l7208j9440L1316L2948j5050
$$ plain form
2019 -8983 -10962 -6143 -1861 -3463 -11426 -10713 -712 2639 -4414 -10829 -5019 7973 6765 -5780
2033 -5780 -8456 3094 15496 8030 -6130 -2490 13666 18463 2963 -7702 4398 20329 14552
2046 14552 -5653 -8303 9403 19973 4285 -15000 -7341 14447 14596 -10090 -21519 -2941 14858
2059 14858 3341 -22184 -21263 5069 13973 -9225 -28261 -12555 14077 10336 -19071 -26199 1699
2072 1699 21288 3010 -23859 -14552 17412 24028 -5314 -23269 639 29769 19202 -14237
2084 -14237 -16656 16541 33222 7289 -22028 -7160 28389 27070 -9835 -24555 4540 31372
2096 31372 11759 -25196 -21408 15075 26331 -7964 -34120 -11798 23212 13292 -25196 -33750
2108 -33750 3277 25710 -1765 -34228 -21455 18106 22268 -14940 -34380 -3064 29884 14834
2120A4834l8454o82L9611J9345l1299l2269J9639M0734k100m0554j5929L5044
2132G920L0498k1564m1869N486M3080J1439l9234k7941K5489L8619j0444m5192
2144b3713q789M0126K3594k9994l8560J3914M4040L238m2014k1360L3076L5184
2156B8742j8263m1917Q74M2557J9869l6276l1873K2825M2646l466m3490j2813
2168c0585L7977L0614k4735m0329P960M5370R858m0057k5926K8005L8158j2151
2180B4159m4934n780M0460K1871l2090l5517J5870M0978J26m1386j7554L2350
2192a447L1002k0610l9362L540L9469J3465l4764k6075K3153L5841q311l8176
2204b2275o290L4117K2562k3803l1423J1310L6491M710l3533j6726K5187K8355
$$ plain form
2120 14834 -23620 -24302 15309 34654 3355 -28914 -9275 31459 29359 -11195 -27124 7920
2132 7920 38418 16854 -25015 -19529 23551 34990 -4244 -32185 -6696 31923 21479 -23713
2144 -23713 -32502 7624 31218 1224 -37336 -23422 20618 23856 -18158 -39518 -6442 28742
2156 28742 10479 -31438 -30564 11993 31862 -4414 -36287 -13462 29184 25718 -17772 -30585
2168 -30585 7392 38006 13271 -27058 -19098 26272 36130 -3927 -29853 -1848 36310 24159
2180 24159 -20775 -26555 13905 35776 3686 -31831 -15961 25017 25143 -16243 -33797 -1447
2192 -1447 29555 8945 -30417 -26877 12592 26057 -8707 -34782 -11629 24212 15901 -22275
2204 -22275 -28565 5552 28114 4311 -27112 -15802 20689 25399 -8134 -24860 327 28682
2216B8682j3058l3136L35L2137J3270k5816k3615J4553K9705l177l0186j0451
2228b0757K4983J9238j7453k5516N022K6173N808k4278j5360J6139K1440p944
2240G495k3156l293K1352J2432j5898j8078Q977K0528J299j9178q501J4758J5093
2253A3830p602j6662P13J6888O951j2896j1523P921J4268q90j4397m929J1543
2266C215R294o682j1996J189J1235L518j0030p327N728Q553j621r726k569P127
2280i2N375m671p479J133O752K011n513l421K789N064o62m172j243L313K587o93
2296A078k704j46K455J336o81j358o32J354J782J26j803j248R62K334L16k820
2312C51k406K079L753o60m808j982M321M107l108o515L15P479K393o657n954M484
$$ plain form
2216 28682 15624 -17512 -17177 14960 28230 2414 -21201 -6648 23057 19880 -10306 -20757
2228 -20757 4226 23464 6011 -19505 -14483 11690 17498 -6780 -22140 -6001 15439 7495
2240 7495 -15661 -18954 2398 14830 -1068 -19146 -10169 10359 11658 -7520 -16021 -1263 13830
2253 13830 6228 -10434 -9721 7167 14118 1222 -10301 -2380 11888 10998 -3399 -8328 3215
2266 3215 12509 5827 -6169 -4980 6255 9773 -257 -7584 -1856 6697 5076 -4650 -7219 -92
2280 -92 5283 612 -6867 -5734 1018 3029 -2484 -5905 -3116 1948 1286 -2886 -4129 -816 1771 1078
2296 1078 -1626 -1772 683 2019 1338 -20 -652 702 2484 2610 807 -441 521 2855 3171 351
2312 351 -2055 24 3777 3117 -1691 -3673 648 4755 1647 -4868 -4553 2926 5319 -1338 -7292 -2808
2328b808Q543j065r835l102Q867P408n982j0626J669J2838L309j1825q023Q424
2342b208J2756l379j5248k783J5044R049j1430j4519N622J7573J528j7628r177
2355a4800J4198J5624p792j9955n33K0766R398j7976j6446J1014K1648j868k3120
2368i842p688K0416J6618j3892k2719N021K4954N871k3303j5330J6905K2910p609
2381A2312k6861l390K5714J4057k0389k2718J0324K8034O11k7927j3079K2942
2393c70K2935j4218k8925J834L0141J0797k5714k1965J7129K8896m150l1544q476
2406b3630K8363K0654j9594k8945Q054L2515O360l0328j8616K2943K8247j1000
2418A5023l2543k861L1960J6031k5122k6797J3785L2411j59l3213j3956K7364
$$ plain form
2328 -2808 5735 4670 -5165 -8267 600 8008 2026 -8600 -6931 5907 9216 -2609 -10632 -2208
2342 -2208 10548 7169 -8079 -10862 4182 13231 1801 -12718 -7096 10477 12005 -5623 -14800
2355 -14800 -602 15022 7230 -12725 -13258 7508 16906 -1070 -17516 -6502 15146 13278 -9842
2368 -9842 -17530 2886 19504 5612 -17107 -12086 12868 18739 -4564 -19894 -2989 19921 12312
2381 12312 -14549 -17939 7775 21832 1443 -21275 -10951 17083 17694 -10233 -23312 -370
2393 -370 22565 8347 -20578 -18744 11397 22194 -3520 -25485 -8356 20540 16390 -15154 -23630
2406 -23630 4733 25387 5793 -23152 -15098 17417 23777 -6551 -25167 -2224 26023 15023
2418 15023 -17520 -20381 11579 27610 2488 -24309 -10524 21887 21728 -11485 -25441 1923
2430A923K4956j7414l2646L186L3395J0888k9482k3737J9418L1887o384l4709
2442a8719q210L0931K1623k1628l1130Q867L5768O268l2948j9274K4875L0566
2454B6989j1916l5011k313L4792J7079k7252k7649J5487L4192o08l4476j3853
2466b4539K9001K5432j8718l2896M273L4164R497l0493k2853K0510L0985q620
2478A5743l4580o356L0637J9228k3121k9472J0531L3848K938l2108j6115K4880
2490c947K7094j3440l2086P20L2501J3157k6095k2826J6623L0442l124l0914q868
2503b0763K7752K0005j8540k6472O783K9542N173k7033j6276J9853K3334r998
2515A3360k7459k100K5061J1943k0245k1195J0984K4261k008k4400q809J9405
$$ plain form
2430 1923 26879 9465 -23181 -19995 13400 24288 -5194 -28931 -9513 22374 15990 -18719
2442 -18719 -26929 4002 25625 3997 -27133 -18266 17502 23770 -9178 -28452 -3577 26989
2454 26989 15073 -19938 -22251 12541 29620 2368 -25281 -9794 24398 23790 -10686 -24539
2466 -24539 4462 29894 11176 -21720 -17447 16717 26214 -4279 -27132 -6622 24363 15743
2478 15743 -18837 -25193 5444 24672 1551 -27921 -17390 16458 19396 -12712 -28827 -3947
2490 -3947 23147 9707 -22379 -21659 10842 23999 -2096 -24922 -8299 22143 19019 -11895 -20763
2503 -20763 6989 26994 8454 -18018 -11235 18307 23480 -3553 -19829 24 23358 13360
2515 13360 -14099 -16199 8862 20805 560 -20635 -9651 14610 12602 -11798 -20607 -1202
2527a202J6418j1799k2825L803K2367N739j8575j3463J2682J8947l657j9895l593
2540a5053J8797J1079j2433j4457N553J7722K862j6199q039J2803J2849o373j3891
2553d780l54J3176O381j0969j0921O253J1282j516j1680m163P810P259n376j0931
2567h529J149R243J614p289n774L456P179n39p871j665O496L633l003m325L66
2582e859N832K920m349k506L478L646m2j978j073K234L564j381k149R59O62R01
2598D859N23j798j427J254N47q88q01j938o60K525r5l886j596J385J557J39m189
2615d489l227M240L987l815m540N34N251L218m311o400M591Q528r54o908k015
2630f310O936P096l172r961J536J2388K447r457n924N804J1032r37j3690l600
$$ plain form
2527 -1202 15216 3417 -19408 -15605 6762 12501 -6074 -19537 -6855 12092 8435 -11460 -15053
2540 -15053 3744 14823 2390 -12067 -6514 11208 14070 -2129 -10168 2635 15484 9111 -4780
2553 -4780 -5134 8042 14423 3454 -7467 -1214 10068 8552 -3128 -7291 519 7778 2402 -8529
2567 -8529 -7380 1863 3477 -3812 -9586 -6130 1049 510 -7361 -9026 -2530 1103 -1900 -6225 -5859
2582 -5859 -27 2893 -1456 -3962 -484 3162 3120 1142 69 2303 5867 4486 2337 3296 3958 4859
2598 4859 5382 3584 2157 3411 3958 3070 2269 331 -329 2196 2101 -1785 -3381 -1996 -439 -300 -4489
2615 -4489 -7716 -3476 511 -3304 -7844 -7310 -2059 1159 -3152 -9552 -4961 3567 2613 -4295 -6310
2630 -6310 626 7722 4550 -5411 -3875 8513 10960 1503 -4421 1383 12415 11478 -2212 -5812
2644e812J3125O993r567j1561K659J3228K931j5198r688J1566J2570p238j5769
2657a1761j163J4656Q808j3699j5900R093J8396k407j7478o530J4845J5577r636
2670B801k0035M097K2191N363j7848j2798J2613K0879l269k3667l770K2712J2461
2683B1730j5660j8504O086K3630L716k4387j2548K0173J8281j2176k2565j405
2695a3629K3692R526k1345j9993J3410K4084m788k4874p968K1261J8057j6115
2707A318k4247P057K5253M320k2278j4773J6936K3279o540k7244j325K6057J3220
2720B1033j8145k2045R135K8629L283k8495j1208K2868J9692j1911k6006k26K8202
2733A4806J1288k6203k0169J7244K3656m890k6185r964K3538J9095j8136k7013
$$ plain form
2644 -5812 7313 14306 4739 -6822 -4163 9065 11996 -3202 -12890 -1324 11246 4008 -11761
2657 -11761 -12924 1732 10540 -3159 -19059 -9966 8430 6023 -11455 -17985 -3140 12437 2801
2670 2801 -17234 -13137 9054 14417 -3431 -16229 -3616 17263 13994 -9673 -13443 9269 21730
2683 21730 6070 -12434 -6348 17282 20998 -3389 -15937 4236 22517 10341 -12224 -13629
2695 -13629 10063 19589 -1756 -21749 -8339 15745 10957 -13917 -21885 -624 17433 1318
2707 1318 -22929 -15872 9381 13701 -8577 -23350 -6414 16865 10325 -16919 -18244 7813 21033
2720 21033 2888 -19157 -10022 18607 21890 -6605 -17813 5055 24747 12836 -13170 -13396 14806
2733 14806 26094 -109 -20278 -3034 20622 15732 -10453 -20417 3121 22216 4080 -22933
2745b2933P902K7138L336k3769j6453J7339K5299q594k9995j023K6016J3590j7888
2758c5k3253J0100K9257J101k8193j0765K4116J9664j2065k5577Q95K9026J0964
2771B5235k5396j8452J6671K3375l489k5812q777K3668J7866k0204k3045Q604
2783i756K4528K805k3252j6131J7944K2031j1024k5624J146K2858R888j8127j9216
2796b1930R725K5876k569k5126n887J8898J6231j2314k0264K856K4997P191k1971
2809d287j2607J4370K0269n981k0269m528K1139J2495j7219j6443R687J6678K102
2822A5406j8280r775J4720J6285j1887j7981K010J6541N588j4146j2940Q677J6101
2835A0319l943j6584k436J3068P357p150j3630K944J5609J533j2992n539Q640
$$ plain form
2745 -22933 -15031 12107 15443 -8326 -24779 -7440 17859 9265 -20730 -21753 4263 17853 -35
2758 -35 -23288 -13188 16069 17170 -11023 -21788 2328 21992 9927 -15650 -14755 14271 25235
2771 25235 -161 -18613 -1942 21433 17944 -7868 -16645 7023 24889 4685 -18360 -9756
2783 -9756 14772 17577 -5675 -21806 -3862 18169 7145 -18479 -17333 5525 15413 -2714 -21930
2796 -21930 -12205 13671 11102 -14024 -19911 -1013 15218 2904 -17360 -14504 10493 17684 -4287
2809 -4287 -16894 -2524 17745 11764 -8505 -13033 8106 20601 3382 -13061 -3374 13304 15406
2822 15406 -2874 -12649 2071 18356 6469 -11512 -9502 7039 12627 -1519 -14459 -5782 10319
2835 10319 6376 -10208 -12644 424 7781 631 -12999 -10055 5554 7087 -5905 -11444 -2804
2848b804R703k260j1266j963J2393N671r581o539N239Q106J569q454n222P687
2862B279P303n213o588N52N372L596m787o556L383O396k576m933j284K104L620
2877B668j034o184J76M906q0l414q17K18K473J408k726j648K289J219k83J33j521
2894b217K69L090j82j220N75M3r1K551n52l317J555K722l20j436j270r5L624J113
2912D842o019n78L778J190j146m645q67N131K746n624m241L974M141k99n417m100
2928g134O351O236n120p181K164P177K615o263p161M637J0618k398r114k607Q808
2943A628P112n174j0729J074J3766J988j1889o454Q695R320k567j2900k985J3576
2957D461P988j1099j1785N739J3101J326j3976q612J2850J2730p870j5733J208
$$ plain form
2848 -2804 6899 4639 -6627 -8590 3803 9474 -107 -6646 -1407 6699 8268 -186 -5408 2279
2862 2279 9582 4369 -2219 -1667 3705 7301 2514 -4042 -659 5737 3161 -1772 -3056 -952 2668
2877 2668 1634 -4550 -4374 532 452 -2962 -3779 -3561 -1088 320 -2406 -4054 -1765 -546 -829 -696 -2217
2894 -2217 -1948 1142 960 -260 315 358 267 2818 2266 -1051 504 3226 2906 1470 200 105 3729 4842
2912 4842 -1177 -1755 2023 3213 2067 -2578 -3445 1686 4432 -1192 -5433 -1459 2682 2383 -3034 -7134
2928 -7134 -783 5453 333 -6848 -4684 2493 5108 -1155 -8316 -3679 6939 4541 -4573 -7180 1628
2943 1628 8740 3566 -7163 -6089 7677 9665 -2224 -8678 17 9337 6770 -6130 -9115 4461
2957 4461 12449 1350 -10435 -4696 8405 9731 -4245 -12857 -7 12723 4853 -10880 -9672
2970i672J5189O129j2798j3335R128J7401k884j7763m703J5489J2046j0204j8064
2983a4041M435K0496K815j8758j0222J3437J6710n477k0962k817K1344R993j6786
2996A67j6171Q753K0298Q09k1484r705J8763J6367j2007k0505K563K1255P619
3009A6722j8962j6219J3840K0987n319k2226m440J9855J4067j4391k1018P184
3021i920K3229K204k1609j1670J6054J9558q239k3760j030K3350J0089j8863j7789
3034a8396J0460K2650o04k4096r104K0815J6875j3197k1870K770K3545P451k0980
3047c681j5647J4650K1518o347k2556l776K0660J4689j6196k1115P949K3842J974
3060A5964k2129j0838J6960J7977p576k4123M31K2547Q808j7607j7750J0565K1712
$$ plain form
2970 -9672 5517 11646 -1152 -14487 -5359 12042 9158 -8605 -13308 2181 14227 4023 -14041
2983 -14041 -9606 10890 13705 -5053 -15275 -1838 14872 9395 -11567 -14384 6960 16953 167
2996 167 -16004 -7251 13047 13856 -7628 -17333 1430 17797 5790 -14715 -12152 9103 16722
3009 16722 -2240 -18459 -4619 16368 11049 -11177 -15617 4238 18305 3914 -17104 -9920
3021 -9920 13309 15513 -6096 -17766 -1712 17846 9607 -14153 -15183 8167 18256 -607 -18396
3034 -18396 -7936 14714 14110 -9986 -19090 1725 18600 5403 -16467 -13697 9848 17299 -3681
3047 -3681 -19328 -4678 16840 10493 -12063 -15839 4821 19510 3314 -17801 -9852 13990 15964
3060 15964 -6165 -17003 -43 17934 10358 -13765 -13334 9213 18021 414 -17336 -6771 14941
3073A4941j351k3705p437J9932J5391j3044k1098L555K2615N922k1107j4075J5227
3086d234J9712o455k2200l055K0722J2399j6053j8193Q953K1280M76k0095r262
3099a6005J6702J6376r767k0213K511K0157O183j6613j3340J0956J7993l574j9434
3112h068l911J6698J0625j2112j5954N270J7227J842j6767r264J2939J3090o846
3125D769j5777o16J5640O666j3279j1214P895J3886j477j3954m130J2134R079
3138I622p546j1196L049J2410K472j0170o486P480R768k967j0662l88R612M139
3152I137o487p260L193Q545k98q151l319N595N345l672o550r9N976J862n279m239
3168e701K761M758j016m820j330L401L166k523l299P12L244J268k221j664J819
$$ plain form
3073 14941 13590 -10115 -17552 2380 17771 4727 -16371 -12816 9799 15721 -5386 -19461 -4234
3086 -4234 15478 9023 -13177 -16232 4490 16889 836 -17357 -8404 12876 13352 -6743 -16005
3099 -16005 697 17073 7306 -12907 -10396 9761 15944 -669 -14009 -3053 14940 11366 -8068
3112 -8068 -11979 4719 15344 3232 -12722 -7452 9775 11617 -5150 -14414 -1475 11615 4769
3125 4769 -11008 -11624 4016 10682 -2597 -13811 -5916 7970 6493 -7461 -11591 543 9622
3138 9622 2076 -9120 -6071 6339 8811 -1359 -7845 -365 9403 6436 -4226 -4614 4998 9137
3152 9137 2650 -4610 -1417 7128 6830 -1321 -4640 955 6300 2628 -3922 -4021 1955 3817 -1462 -5701
3168 -5701 -2940 1818 802 -4018 -5348 -1947 1219 -1304 -4603 -3891 -647 621 -1600 -3264 -1445
3183a445K346K54j523m98J597R98O07r55k83P59P70L08k72r02j44J092Q72j152
3201B429j791k11J440R46k111k329M81K599l43l510j817K521K561j592m289m66
3217e482M539J955l608m079K262N846J75n595k066N273N111k286o653R97P296
3232C685K901n578n354M277P974j112p956k441P387O102n181q787J445R439J988
3247H789r121o805O412R011k968j1894k217J0690O095q980j0208L699J2364Q40
3261E707j2770o351J0512J0764n897j3141K76J4397O200j1837j0485Q087J4886
3274A0348j393j5129m135J3889J0844r187j4398L762J6670L031j4856r958J1167
3287F55J4864n656j7229j936J5939Q540j3546j5014P146J7016l24j8194q025J4806
$$ plain form
3183 -1445 901 1155 -368 -866 731 1729 2336 1381 1098 1857 2627 2935 2663 1761 1617 2709 3581 2429
3201 2429 638 427 1867 2813 702 -1627 -1146 1453 1110 -2400 -4217 -1696 865 -727 -5016 -5482
3217 -5482 -943 1012 -2596 -6675 -4413 1433 1608 -3987 -6053 -780 4331 2045 -4608 -3611 3685
3232 3685 6586 1008 -4346 -69 7905 6793 -1163 -3604 3783 9885 4704 -4083 -2638 6801 8789
3247 8789 -332 -7137 -725 8286 5318 -6576 -8793 1897 7992 -988 -11196 -7497 4867 5707
3261 5707 -7063 -13414 -2902 7862 1965 -11176 -10900 3497 9697 -2140 -12625 -4538 10348
3274 10348 8955 -6174 -10309 3580 14424 5237 -9161 -5399 11271 14302 -554 -10512 655
3287 655 15519 9863 -7366 -9302 6637 15177 1631 -13383 -6237 10779 10455 -7739 -15764 -958
3301i58J3233r556j7943J686J8801N909j6712j2754J1530J7762l604j9447l514
3314a5567J8396J1854j2321j7058O073J9953K923j8063r566J4127J6546p350j8976
3327i029m28J8621Q984j5089j5292Q358J8891j806j9459o754J5638J3065j0732
3340D968j8908L023J8885M587j6978j3291J2074J7347m484k0256l219J8032J0517
3353A2297j2997j7053O716J9896K533j9133q912J5368J5509p806j6386l28J8472
3366H176Q088j4812j3082Q077J8381j802j8325o256J5725J3353j0433j7737K935
3379g712J8201L745j7062j0665J0762J5230m834j7942k497J5058Q967j2904j3968
3392a5621N952J7166J257j7570o662J2589J3807q387j5629J688J6999N232j3275
$$ plain form
3301 -958 12275 2719 -15224 -13538 5263 11172 -5540 -18294 -6764 10998 7394 -12053 -15567
3314 -15567 2829 14683 2362 -14696 -8623 11330 14253 -3810 -13376 751 17297 9947 -9029
3327 -9029 -9457 9164 18148 3059 -12233 -3875 15016 13210 -6249 -13003 2635 15700 4968
3340 4968 -13940 -10917 7968 12555 -4423 -17714 -5640 11707 7223 -13033 -16252 1780 12297
3353 12297 -700 -17753 -11037 8859 11392 -7741 -16653 -1285 14224 6418 -9968 -10296 8176
3366 8176 16264 1452 -11630 -3553 14828 13026 -5299 -11555 4170 17523 7090 -10647 -7712
3379 -7712 10489 14234 -2828 -13493 -2731 12499 7665 -10277 -12774 2284 11251 -1653 -15621
3392 -15621 -9669 7497 8754 -8816 -15478 -2889 10918 2531 -13098 -11410 5589 10821 -2454
3405b454j0893R735J5220k603j5573l174J3939R483r273j3303M643J4204K300
3418A2251j4137o704R376J1138m810j3421m71J1580N735j1047r293O166J1074
3431G437j901j2070l637R390P348o557r503K579R738K531r847n138O398Q276k838
3446B206q213o03Q073M560n504o203L267P678K60o191k679N237M914k798n553
3461a549M73N117J758m004l487J866L973m51m226j695L105J949k242k736k17K298
3477f8P43k218j772R73J481k64q56j112J028R37k80l65p2L03N14J121l42n09j2
3496g70J438J048m55j385L13K156Q60j732j575J437K070Q3l092j254K338K465
3512C945j863l699L22L002J874l548l796J687M527m16n227j736L688M170l030
$$ plain form
3405 -2454 -13347 -3612 11608 9005 -6568 -9742 4197 13680 4407 -8896 -4253 9951 12251
3418 12251 -1886 -8590 786 11924 7114 -6307 -6778 4802 10537 -510 -9803 -3637 7437
3431 7437 5536 -6534 -10171 -781 6567 10 -9493 -6914 2824 5355 -4492 -9630 -3232 5044 2206
3446 2206 -6007 -6610 1463 6023 519 -5684 -2417 5261 5521 -670 -3349 1888 6802 4004 -1549
3461 -1549 -1076 4041 5799 1795 -1692 174 4147 3696 -530 -2225 880 2829 587 -2149 -2366 -68
3477 -68 675 -1543 -3315 -2342 -861 -1125 -1981 -3093 -2065 -1128 -1408 -1773 -1845 -1542 -1028 93 -249 -758 -770
3496 -770 668 1716 1261 -124 189 2345 3205 1473 -102 1335 3405 3488 396 -858 1480 3945
3512 3945 2082 -1617 -1295 1707 3581 33 -3763 -2076 2451 2035 -3192 -4928 -1240 2930 -100
3527a00n587Q65N902K268n543m357L711O559o61p003k108P058N283m585o733J512
3543c519Q273J984p359n298N689Q196k421r218j759Q642N938p128q107K296J0311
3558F520J185j0554l948N879Q757m445j0840K21J0748M144r494q728O072J1944
3572G461j736j2254l705J1195Q780p980j1304J806J4582K381j1917q306R901J1936
3586A0840m508j3929j324J3535P878j1015j2092N721J5396o25j4300o636J2209
3599A150J1962p454j5453Q31J5249N373j2873j1556R291J3922k386j5916m565
3612a2425J4876R656j0334j4050M172J6721K320j5527q919J1896J3768n925j6386
3625a0157o89J6026Q182j3365j2973P265J6689o59j6847o178J4077J2391q891
$$ plain form
3527 -100 -5687 -4822 1080 3348 -2195 -6552 -2841 3718 3057 -3946 -6054 1004 6287 1702 -5031 -3519
3543 -3519 4754 6738 -621 -5919 -230 7966 5545 -3673 -5432 3210 9148 2020 -6087 -3791 6520
3558 6520 7705 -2849 -6797 -918 7839 3394 -7446 -7225 3523 7667 -1827 -10555 -4483 7461
3572 7461 5725 -6529 -10234 961 9741 1761 -9543 -7737 6845 9226 -2691 -10997 -1096 10840
3586 10840 6332 -7597 -8921 4614 12492 1477 -10615 -4894 10502 9877 -4423 -11059 1150
3599 1150 13112 5658 -9795 -8964 6285 11658 -1215 -12771 -3480 10442 8056 -7860 -12425
3612 -12425 2451 12107 1773 -12277 -8105 8616 10936 -4591 -13510 -1614 12154 6229 -10157
3625 -10157 -10846 5180 13362 -3 -12976 -5711 10978 10319 -6528 -12706 1371 13762 4871
3638D871j6061K053J6965M706j4497j1330J0147J5051l331j6608l758J5056R837
3651A3101j1025j3971M682J6400J983j5469q954J2232J3512o360j5999o02J6070
3664E600O991j2729j2610P689J5581q88j6237n828J3908J1122q840j4978K546
3677h673J6000M162j4432r949R834J4038m136j5400k165J4079Q458j0816j2792
3690a1792N542J4463J094j3992o582J1119J1070o022j3733N42J4005N017j1224
3703d93j0113P562J2726j802j3307l653J1635Q100q023j1499L245J2484J965j1884
3717c057o609Q871R365m218j1596m75J0847M862q976q064N002J0036p77j0037
3731d826l374Q557O385m976q494J701R120J829p238n052N376P019j853p622n80
$$ plain form
3638 4871 -11190 -9137 7828 12534 -1963 -13293 -3146 11905 8574 -8034 -11792 3264 13101
3651 13101 2076 -11895 -7213 9187 11170 -4299 -13253 -1021 12491 6131 -9868 -10470 5600
3664 5600 12591 -138 -12748 -5059 10522 9634 -6603 -12431 1477 12599 3759 -11219 -8673
3677 -8673 7327 11489 -2943 -12892 -3058 10980 6844 -8556 -10721 3358 11816 1000 -11792
3690 -11792 -6250 8213 9307 -4685 -11267 -148 10922 4900 -8833 -8291 5714 10731 -493
3703 -493 -10606 -3044 9682 7880 -5427 -9080 2555 10655 2632 -8867 -5622 6862 8827 -3057
3717 -3057 -9666 -795 8570 4352 -7244 -7719 3128 7990 -986 -9050 -4048 5988 5211 -4826
3731 -4826 -8200 357 6742 1766 -6728 -5027 4093 5922 -1316 -6368 -992 6027 4174 -3448 -4028
3746d028O593L516m943n046K370O135k6n705k370M562L699k708m897L93M167J361
3762C073l629k945K414L030q10l241q59K472J692j823k196P76J944K48j435p28
3778b017R82J391l56p73J4Q20M90k89J4L02k45N62R55j83n43q98J035Q21l13j729
3798D0o7J489J365k166j548L52K398L98l219j396J754K096j411k839j72L044J774
3815A892l236k843J502M130K35m511j569L483L714j846m837P35M865K319m238
3830b05k882K482N486k50n930j925N663M364l886n797R88O471K299o847m852M290
$$ plain form
3746 -4028 2565 6081 1138 -3908 -1538 4597 4571 -1134 -3504 1058 4757 2049 -2848 -2455 1712 3073
3762 3073 -556 -3501 -1087 1943 1133 -2108 -2967 -495 1197 -626 -2822 -2046 -102 146 -1289 -2017
3778 -2017 -1035 356 0 -773 -759 61 551 262 276 578 333 895 1850 1667 1124 226 1261 2082 1769 40
3798 40 -27 1462 2827 661 -887 -535 1863 2261 -958 -2354 -600 1496 85 -2754 -2926 118 1892
3815 1892 -1344 -4187 -2685 1445 1680 -2831 -4400 -917 2797 951 -3886 -3151 1714 4033 -205
3830 -205 -3087 -605 4881 4631 -1299 -3224 2439 6803 2917 -2880 -1892 4579 6878 31 -4821 -531
$$ [...]
##END NTUPLES=NMR FID
##END=
