##TITLE=1H_LY-DHAAPER1
 CDCl3,8 sc, 
 3.9.2021
##JCAMPDX= 6.0         $$ Bruker NMR JCAMP-DX V2.0
##DATA TYPE= NMR FID
##DATA CLASS= NTUPLES
##ORIGIN= UXNMR, Bruker Analytische Messtechnik GmbH
##OWNER= root
$$ XWIN-NMR		Version 3.5
$$ Fri Sep  3 09:56:27 2021 Russian Standard Time (UT+4h)  she@DPX200
##.OBSERVE FREQUENCY= 200.1313
##.OBSERVE NUCLEUS= ^1H
##.DELAY= (6, 6)
##.ACQUISITION MODE= SIMULTANEOUS
##.ACQUISITION SCHEME= undefined
##.AVERAGES= 8
##.DIGITISER RES= 18
##SPECTROMETER/DATA SYSTEM= spect
##.PULSE SEQUENCE= zg30
##.SOLVENT NAME= CDCl3
##.SHIFT REFERENCE= (INTERNAL, CDCl3, 0, 15.7039)
##AUDIT TRAIL= $$ (NUMBER, WHEN, WHO, WHERE, WHAT)
$$ ##TITLE= Audit trail, XWIN-NMR		Version 3.5
$$ ##JCAMPDX= 5.01
$$ ##ORIGIN= Bruker BioSpin GmbH
$$ ##OWNER= she
$$ F:/spectra/data/she/nmr/H-F/1/audita.txt
$$ ##AUDIT TRAIL=  $$ (NUMBER, WHEN, WHO, WHERE, WHAT)
(   1,<2021-09-03 09:54:57.65 +0400>,<she>,<DPX200>,
      <created by zg, POWCHK disabled, PULCHK disabled
       configuration hash MD5:
       00 E9 B6 7A A2 85 ED C7 34 08 36 98 17 FE 4E 26
       data hash MD5: 16K
       FC 8A C2 76 85 FC B2 09 79 04 09 29 80 74 1D C7>)
$$ ##END=
$$ 
$$ hash MD5
$$ 1E B7 A0 8C D6 4B E2 31 06 AD B8 1F A0 BD B2 67
##$RELAX= 
##$RELAX= 
##$RELAX= 
##$RELAX= 
##$RELAX= 
##$RELAX= 
$$ Bruker specific parameters
$$ --------------------------
##$DU= <F:/spectra>
##$EXPNO= 1
##$NAME= <H-F>
##$PROCNO= 1
##$TYPE= <nmr>
##$USER= <she>
##$AMP= (0..31)
100 100 100 100 100 100 100 100 100 100 100 100 100 100 100 100 100 100 
100 100 100 100 100 100 100 100 100 100 100 100 100 100 
##$AQSEQ= 0
##$AQ_mod= 1
##$AUNM= <au_zg>
##$AUTOPOS= <>
##$BF1= 200.13
##$BF2= 200.13
##$BF3= 200.13
##$BF4= 200.13
##$BF5= 200.13
##$BF6= 200.13
##$BF7= 200.13
##$BF8= 200.13
##$BYTORDA= 1
##$CFDGTYP= 0
##$CFRGTYP= 5
##$CHEMSTR= <none>
##$CNST= (0..31)
1 1 145 1 1 1 1 1 1 1 1 1 1 1 1 1 1 1 1 1 1 1 1 1 1 1 1 1 1 1 1 1 
##$CPDPRG= <>
##$CPDPRG1= <>
##$CPDPRG2= <>
##$CPDPRG3= <>
##$CPDPRG4= <mlev>
##$CPDPRG5= <mlev>
##$CPDPRG6= <mlev>
##$CPDPRG7= <mlev>
##$CPDPRG8= <mlev>
##$CPDPRGB= <>
##$CPDPRGT= <>
##$D= (0..31)
0 1.2 0 0 0 0 0 0 0 0.06 0 0.03 0 0 0 0 0.0002 0 0 0 0 0 0 0 0 0 0 0 0 
0 0 0 
##$DATE= 1630648497
##$DBL= (0..7)
120 120 120 120 120 120 120 120 
##$DBP= (0..7)
150 150 150 150 150 150 150 150 
##$DBP07= 0
##$DBPNAM0= <>
##$DBPNAM1= <>
##$DBPNAM2= <>
##$DBPNAM3= <>
##$DBPNAM4= <>
##$DBPNAM5= <>
##$DBPNAM6= <>
##$DBPNAM7= <>
##$DBPOAL= (0..7)
0.5 0.5 0.5 0.5 0.5 0.5 0.5 0.5 
##$DBPOFFS= (0..7)
0 0 0 0 0 0 0 0 
##$DE= 6
##$DECBNUC= <off>
##$DECIM= 32
##$DECNUC= <off>
##$DECSTAT= 4
##$DIGMOD= 1
##$DIGTYP= 9
##$DL= (0..7)
0 120 120 120 120 120 120 120 
##$DP= (0..7)
150 150 150 150 150 150 150 150 
##$DP07= 0
##$DPNAME0= <>
##$DPNAME1= <>
##$DPNAME2= <>
##$DPNAME3= <>
##$DPNAME4= <>
##$DPNAME5= <>
##$DPNAME6= <>
##$DPNAME7= <>
##$DPOAL= (0..7)
0.5 0.5 0.5 0.5 0.5 0.5 0.5 0.5 
##$DPOFFS= (0..7)
0 0 0 0 0 0 0 0 
##$DQDMODE= 0
##$DR= 18
##$DS= 0
##$DSLIST= <SSSSSSSSSSSSSSS>
$$ [...]
##$SUBNAM2= <"">
##$SUBNAM3= <"">
##$SUBNAM4= <"">
##$SUBNAM5= <"">
##$SUBNAM6= <"">
##$SUBNAM7= <"">
##$SUBNAM8= <"">
##$SUBNAM9= <"">
##$SW= 20.0189088683792
##$SWIBOX= (0..15)
0 0 2 0 0 0 0 0 0 0 0 0 0 0 0 0 
##$SW_h= 4006.41025641026
##$TD= 16384
##$TD0= 1
##$TE= 0
##$TE2= 300
##$TE3= 300
##$TEG= 300
##$TL= (0..7)
0 120 120 120 120 120 120 120 
##$TP= (0..7)
150 150 150 150 150 150 150 150 
##$TP07= 0
##$TPNAME0= <>
##$TPNAME1= <>
##$TPNAME2= <>
##$TPNAME3= <>
##$TPNAME4= <>
##$TPNAME5= <>
##$TPNAME6= <>
##$TPNAME7= <>
##$TPOAL= (0..7)
0.5 0.5 0.5 0.5 0.5 0.5 0.5 0.5 
##$TPOFFS= (0..7)
0 0 0 0 0 0 0 0 
##$TUNHIN= 0
##$TUNHOUT= 0
##$TUNXOUT= 0
##$USERA1= <user>
##$USERA2= <user>
##$USERA3= <user>
##$USERA4= <user>
##$USERA5= <user>
##$V9= 5
##$VALIST= <valist>
##$VCLIST= <CCCCCCCCCCCCCCC>
##$VD= 0
##$VDLIST= <DDDDDDDDDDDDDDD>
##$VPLIST= <PPPPPPPPPPPPPPP>
##$VTLIST= <TTTTTTTTTTTTTTT>
##$WBST= 1024
##$WBSW= 4
##$XGAIN= (0..3)
0 0 0 0 
##$XL= 0
##$YL= 0
##$YMAX_a= 661260
##$YMIN_a= -578429
##$ZGOPTNS= <>
##$ZL1= 120
##$ZL2= 120
##$ZL3= 120
##$ZL4= 120
##$ABSF1= 10
##$ABSF2= 0
##$ABSG= 5
##$ABSL= 3
##$ALPHA= 0
##$AQORDER= 0
##$ASSFAC= 0
##$ASSFACI= 0
##$ASSFACX= 0
##$ASSWID= 0
##$AUNMP= <proc_1d>
##$AZFE= 0.1
##$AZFW= 0.1
##$BCFW= 1
##$BC_mod= 2
##$BYTORDP= 1
##$COROFFS= 0
##$CY= 11.3945322036743
##$DATMOD= 1
##$DC= 2
##$DFILT= <>
##$DTYPP= 0
##$F1P= 2.36226072786647
##$F2P= -0.459571619588291
##$FCOR= 0.5
##$FTSIZE= 0
##$FT_mod= 4
##$GAMMA= 1
##$GB= 0.15
##$INTBC= 1
##$INTSCL= 1
##$ISEN= 128
##$LB= 0.24
##$LEV0= 0
##$LPBIN= 0
##$MAXI= 10000
##$MC2= 0
##$MEAN= 0
##$ME_mod= 0
##$MI= 1.114404
##$NCOEF= 0
##$NC_proc= 0
##$NLEV= 6
##$NOISF1= 3.799351
##$NOISF2= 2.8
##$NSP= 1
##$NTH_PI= 0
##$NZP= 0
##$OFFSET= 15.70392
##$PC= 1
##$PHC0= -13516.56
##$PHC1= 14.20097
##$PH_mod= 1
##$PKNL= yes
##$PPARMOD= 0
##$PSCAL= 0
##$PSIGN= 0
##$REVERSE= no
##$SF= 200.130013532006
##$SI= 16384
##$SIGF1= 3
##$SIGF2= 2
##$SINO= 400
##$SIOLD= 16384
##$SREGLST= <1H.CDCl3>
##$SSB= 0
##$STSI= 0
##$STSR= 0
##$SW_p= 3612.71676300578
##$SYMM= 0
##$S_DEV= 0
##$TDeff= 0
##$TDoff= 0
##$TI= <>
##$TILT= no
##$TM1= 0
##$TM2= 0
##$TOPLEV= 0
##$USERP1= <user>
##$USERP2= <user>
##$USERP3= <user>
##$USERP4= <user>
##$USERP5= <user>
##$WDW= 1
##$XDIM= 8192
##$YMAX_p= 0
##$YMIN_p= 0
$$ End of Bruker specific parameters
$$ ---------------------------------
##NTUPLES= NMR FID
##VAR_NAME=  TIME,          FID/REAL,        FID/IMAG
##SYMBOL=    X,             R,               I
##VAR_TYPE=  INDEPENDENT,   DEPENDENT,       DEPENDENT
##VAR_FORM=  AFFN,          ASDF,            ASDF
##VAR_DIM=   8192,          8192,            8192
##UNITS=     SECONDS,       ARBITRARY UNITS, ARBITRARY UNITS
##FACTOR=    0.0002496,     1,               1
##FIRST=     0,             0,               0
##LAST=      2.0444736,     0,               0
##MIN=       0,             -578429,         0
##MAX=       2.0444736,     661260,          0
$$ Real data points
##PAGE= N=1
##DATA TABLE= (X++(R..R)), XYDATA
$$ plain form
0 0 0 0 0 0 0 0 0 -2 0 -8 8 -8 10 -16 24 -24 32 -40 48 -58 72 -82 102 -121 137 -162 190 -218 251 -290 331
31 331 -374 426 -483 546 -613 691 -773 864 -964 1071 -1191 1322 -1464 1619 -1790 1974
47 1974 -2177 2400 -2645 2911 -3208 3538 -3902 4311 -4777 5303 -5907 6609 -7439 8436
61 8436 -9658 11200 -13217 15976 -19996 26427 -38369 68028 -298615 -232837 614990 430496
73 430496 -242486 -534748 -53227 340466 260055 -77443 -203656 -169041 1651 210116
83 210116 261992 -76963 -402868 -186420 387970 437483 -181442 -578429 -114093 511429
93 511429 375639 -287478 -474611 620 385704 199935 -156553 -224536 -68712 64713
103 64713 154392 154282 -53011 -292964 -157171 272789 364664 -101310 -453351 -131903 386820
$$ packed form
0@%%%%%%%kKqJ6j6J8k6M0m8N6p2Q8j06J30j54J84k23K58k99L52m08M69n41O21
31C31p05Q00r09J029j159J304j464J637j828K035k262K513k786L083l409L764
47A974m151M577n045N556o119O746p440Q213r088J0080j1210J2516j4048J5875
61H436j8094K0858k4417K9193l5972M6423o4796J06397l66643O5778Q47827j84494
73D30496o72982k92262M81521L93693q0411l37498j26213L4615J70692K08465
83B10116N1876l38955l25905K16448N74390M9513o18925l96987M64336O25522
93E11429j35790o63117j87133M75231L85084j85769l56488o7983J55824J33425
103F4713Q9679j10k07293k39953J35793M29960R1875m65974l52041L21448N18723
$$ plain form
114 386820 309539 -215744 -370041 28276 314861 104690 -187538 -140939 52406 76283
124 76283 15332 33873 11505 -120588 -113722 131216 239695 -41775 -311013 -107293 280172
135 280172 236331 -166105 -283499 36963 248524 49269 -170787 -67375 105623 35776
145 35776 -92580 -8800 114307 12472 -138219 -40966 146050 78189 -134977 -110707 111210
156 111210 131960 -84388 -143962 61125 155850 -33918 -162082 7000 164644 18089
166 18089 -170797 -53114 170758 100545 -149594 -148249 98846 171660 -31865 -154405 -22601
177 -22601 98585 28535 -42519 20336 37440 -80491 -94839 100706 187111 -47527 -256831
188 -256831 -66429 254657 188840 -171607 -259914 44832 249418 66931 -172137 -121711
$$ packed form
114C86820p7281n25283j54297L98317K86585k10171k92228M6599J93345K3877
124G6283o0951J8541k2368j32093O866K44938J08479k81470k69238K03720L87465
135B80172m3841m02436j17394L20462K11561j99255k20056J03412J72998o9847
145C5776j28356Q3780J23107j01835j50691R7253J87016o7861k13166K4270K21917
156A11210K0750k16348n9574K05087R4725j89768j28164J69082J57644j46555
166A8089j88886J17683K23872p0213k50139J345K47095P2814k03525j22540J31804
177b2601J21186p0050p1054O2855J7104j17931j4348J95545Q6405k34638k09304
188b56831J90402L21086o5817l60447q8307L04746K04586j82487k39068N0426
$$ plain form
198 -121711 65538 99015 15894 -16182 -28702 -78060 -37173 127767 154924 -89380 -262139
209 -262139 -36349 292422 199879 -209353 -316551 43188 322369 125733 -214372 -214668 50041
220 50041 180392 76489 -54937 -99192 -82829 10539 149956 134988 -105559 -256068 -31510
231 -31510 287902 200877 -205319 -322140 40985 339577 135854 -241636 -245151 73783 235768
242 235768 79023 -117877 -138032 -40974 69877 143455 82624 -125378 -228529 -9620 279054
253 279054 190267 -199686 -319910 30368 335583 146911 -233865 -247984 74507 238128
263 238128 64056 -137447 -121340 4917 77352 86613 35656 -89291 -154717 -2378 210586
274 210586 143409 -166688 -263336 35302 297592 123425 -224131 -228984 84744 236420 49019
$$ packed form
198a21711J87249L3477q3121l2076j2520m9358M0887J64940K7157k44304j72759
209b62139K25790L28771r2543m09232j07198L59739K79181j96636l40105k96K64709
220E0041J30351j03903j31426m4255J6363R3368J39417j4968k40547j50509K24558
231c1510L19412q7025m06196j16821L63125K98592k03723l77490l515L18934J61985
242B35768j56745j96900k0155R7058J10851P3578o0831k08002j03151K18909K88674
253B79054q8787l89953j20224L50278L05215j88672l80776j4119L22491J63621
263B38128j74072k01503J6107J26257P2435R261n0957j24947o5426J52339K12964
274B10586o7177l10097r6648K98638K62290j74167l47556m853L13728J51676j87401
$$ plain form
285 49019 -153088 -111136 35618 80689 46072 10534 -49174 -100859 -21219 136263 120499
296 120499 -101073 -200264 9514 221833 97292 -176362 -173003 87946 192069 4994
306 4994 -152761 -62981 81794 65393 -19448 -19355 3625 -35750 -38687 59767 97459 -36670
318 -36670 -144367 -24777 149207 89996 -112134 -127772 57933 130119 -14198 -111961 -8804
329 -8804 91518 15908 -78502 -15414 78034 21157 -79942 -33208 77610 46736 -71568
340 -71568 -60683 60347 71256 -45230 -75016 31978 73059 -27259 -75693 25730 87315
351 87315 -19213 -107012 -1721 126374 45050 -122845 -95294 85966 125989 -28285 -118655
362 -118655 -21758 78572 39156 -29274 -15092 3693 -33352 -24671 66662 78828 -59781 -136713
$$ packed form
285D9019k02107M1952J46754M5071l4617l5538n9708n1685P9640J57482j5764
296A20499k21572r9191K09778K12319j24541k73654L359K60949J04123j87075
306D994j57755Q9780J44775j6401q4841R3K2980l9375k937R8454L7692j34129
318c6670j07697J19590J73984n9211k02130j5638J85705P2186j44317r7763J03157
329h804J00322p5610r4410O3088R3448n6877j01099M6734J10818l0874j18304
340g1568J0885J21030J0909j16486k9786J06994M1081j00318m8434J01423O1585
351H7315j06528q7799J05291J28095q1324j67895K7551J81260M0023j54274r0370
362a18655R6897J00330l9416o8430J4182J8785l7045Q681R1333J2166j38609p6932
$$ plain form
374 -136713 9173 168042 69468 -150429 -142404 85562 176525 519 -156298 -70315 93360
385 93360 96257 -14834 -63554 -35930 -9971 24661 75963 43500 -91310 -132666 37158 191327
397 191327 67127 -179584 -171418 94113 219270 23118 -188294 -114765 100108 143438 2485
408 2485 -98313 -65424 9000 56852 70859 14589 -96614 -110352 50408 180039 51988
419 51988 -182005 -165043 103871 228276 18575 -210019 -127353 120502 172846 -3483 -133354
430 -133354 -77465 37154 80135 55514 -9648 -89943 -87968 48706 158340 48323 -161036
441 -161036 -152711 89520 209453 19050 -195848 -116676 121274 163137 -20387 -140692 -58378
452 -58378 65280 77020 18029 -30803 -61483 -48712 42162 117321 34001 -130942 -126417 75997
$$ packed form
374a36713J45886J58869r8574k19897Q025K27966R0963j76006j56817Q5983J63675
385I3360K897j11091m8720K7624K5959L4632N1302l2463j34810m1356J69824J54169
397A91327j24200k46711Q166K65531J25157j96152k11412P3529K14873M3330j40953
408B485j00798L2889P4424M7852J4007n6270j11203j3738J60760J29631j28051
419E1988k33993J6962K68914J24405k09701k28594Q2666K47855N2344j76329j29871
430a33354N5889J14619M2981k4621o5162q0295J975J36674J09634j10017k09359
441a61036Q325K42231J19933j90403k14898P9172K37950M1863j83524j20305Q2314
452e8378J23658J1740n8991m8832l0680J2771R0874P5159q3320j64943M525K02414
$$ plain form
464 75997 182268 18577 -174747 -106594 110606 148983 -24068 -132236 -42898 72916 60210
475 60210 -10438 -30372 -21748 -20864 12265 65400 34604 -75229 -92812 42290 131285 18433
487 18433 -130980 -79642 92637 115533 -34342 -112934 -16479 77890 35186 -38438 -22624
498 -22624 17781 -3580 -23453 22727 49064 -19044 -74575 -5680 83782 37279 -73438 -60756
510 -60756 52810 72245 -30309 -72563 12302 66474 -2765 -62524 -4152 61137 11650 -60909
522 -60909 -21579 59421 34637 -52608 -47319 38658 53391 -21561 -48312 11623 38448 -12532
534 -12532 -32357 23013 40017 -32072 -63565 23408 89500 7282 -99755 -50561 82404 85704
546 85704 -42229 -95839 -3517 75549 32197 -37530 -30116 5714 3577 2783 31178 19338 -51117
$$ packed form
464G5997J06271j63691j93324O8153K17200L8377j73051j08168Q9338J15814j2706
475F0210p0648j9934Q624Q84L3129N3135l0796j09833j7583J35102Q8995j12852
487A8433j49413N1338J72279K2896j49875p8592R6455R4369m2704p3624J5814
498b2624M0405k1361j9873M6180K6337o8108n5531O8895Q9462m6503j10717J2682
510f0756J13566J9435j02554m2254Q4865N4172o9239n9759N8372O5289m9487p2559
522f0909L9330Q1000k4784q7245N289Q5977J4733p4952k6751N9935K6825n0980
534a2532j9825N5370J7004p2089l1493Q6973O6092q2218j07037M9194J32965L300
546H5704j27933n3610R2322P9066m3352o9727P414L5830k137p94K8395j1840p0455
$$ plain form
559 -51117 -62136 39940 103732 3603 -120530 -63947 98472 114150 -42893 -130298 -24432
570 -24432 101255 69984 -42477 -71567 -13828 31025 36359 27448 -10095 -65914 -49985 58495
582 58495 110041 -3927 -134344 -72116 107383 133159 -38970 -150059 -40422 114415 92976
593 92976 -46490 -97523 -20651 54597 52701 10908 -33004 -60581 -27171 64071 94544 -14972
605 -14972 -129447 -63673 109865 133233 -40632 -156383 -44422 121956 102948 -50871 -110449
616 -110449 -20229 67985 55150 -3592 -39300 -45294 -14399 51345 73911 -11491 -106638 -54872
628 -54872 93964 116897 -37296 -142041 -36637 118868 94115 -59322 -110355 -7629 80346
639 80346 48439 -23872 -44233 -25062 1610 37417 50175 -8208 -80877 -46652 71682 98014
$$ packed form
559e1117j1019J02076O3792j00129j24133N6583J62419J5678j57043q7405J05866
570b4432J25687l1271j12461k9090N7739M4853N334q911l7543n5819J5929J08480
582E8495N1546j13968j30417O2228J79499K5776j72129j11089J09637J54837k1439
593I2976j39466n1033P6872P5248j896m1793m3912k7577L3410R1242L0473j09516
605a4972j14475O5774J73538K3368j73865j15751J11961J66378j9008j53819n9578
616a10449R0220Q8214j2835n8742l5708n994L0895O5744K2566q5402r5147N1766
628e4872J48836K2933j54193j04745J05404J55505k4753j53437n1033J02726Q7975
639H0346l1907p2311k0361J9171K6672L5807J2758n8383p2669L4225J18334K6332
$$ plain form
651 98014 -25078 -117672 -34326 98806 79626 -52946 -93327 2712 74601 29824 -36718
662 -36718 -31967 2795 8396 8500 22250 5801 -42537 -38593 37990 71271 -8407 -84506 -31036
675 -31036 72064 61415 -41866 -71107 9812 60888 10934 -40191 -12854 24948 3510 -22830
687 -22830 4634 30138 -5793 -41220 -3034 47842 17928 -45856 -31956 36404 39824 -25427
699 -25427 -42529 16087 42206 -9193 -40677 6428 43341 -1756 -48507 -8723 50500 23461
711 23461 -45271 -37723 31518 44996 -13001 -40254 -985 25751 908 -13853 10781 14296
723 14296 -24290 -29039 28761 53048 -14348 -71480 -15888 71340 48820 -49964 -68783 16739
735 16739 68200 15178 -47125 -31093 16226 22669 5491 2317 -6345 -29403 -15982 41501 52409
$$ packed form
651I8014j23092r2594Q3346J33132j9180j32572m0381R6039P1889m4777o6542
662c6718M751L4762N601J04J3750j6449m8338L944P6583L3281p9678p6099N3470
675c1036J03100j0649j03281k9241Q0919N1076m9954n1125K7337L7802k1438k6340
687b2830K7464K5504l5931l5427L8186N0876k9914o3784J3900O8360L420o5251
699b5427j7102N8616K6119n1399l1484M7105L6913m5097m6751L9784N9223k7039
711B3461o8732P548O9241J3478n7997k7253L9269K6736k4843j4761K4634L515
723A4296l8586m749N7800K4287o7396n7132N5592Q7228k2520r8784j8819Q5522
735A6739N1461n3022o2303J6032M7319O443j7178l174q662k3058J3421N7483J0908
$$ plain form
748 52409 -26252 -82877 -13976 87706 61399 -60347 -91993 12502 91857 35002 -59541
759 -59541 -58305 12710 46345 21718 -9355 -26025 -30256 -1643 49163 46382 -34499 -84076 -10014
772 -10014 92296 63112 -64414 -99110 12547 101992 41308 -68890 -71121 17103 63299
783 63299 25649 -24974 -37370 -20669 12793 46811 33603 -37226 -75757 -6220 87237 60191
795 60191 -61196 -97584 9826 101157 43445 -69508 -73281 20161 68200 21766 -34397 -35872
807 -35872 -7026 18336 33800 20491 -30276 -58805 -3975 72996 50866 -54433 -87208 10114
819 10114 94344 39095 -68852 -69846 24420 68943 15306 -40992 -31105 5257 19139 18475 11142
832 11142 -16766 -40185 -8638 50263 42887 -35831 -68628 3400 73291 31883 -55882 -55088 24855
$$ packed form
748E2409p8661n6625O8901J01682k6307j21746l1646J04495P9355n6855r4543
759e9541J236P1015L3635k4627l1073j6670m231K8613N0806k781q0881m9577P4062
772a0014J02310k9184j27526l4696J11657Q9445o0684j10198k231Q8224M6196
783F3299l7650n0623j2396J6701L3462L4018j3208p0829l8531O9537R3457k7046
795F0191j21387l6388J07410R1331n7712j12953l773R3442M8039m6434n6163j475
807c5872K8846K5362J5464j3309n0767k8529N4830P6971k2130j05299l2775R7322
819A0114Q4230n5249j07947r94R4266M4523n3637n6298R887L6362J3882o64p333
832A1142k7908k3419L1547N8901p376p8718l2797P2028O9891m1408q7765P94P9943
$$ plain form
845 24855 57027 3981 -40601 -17902 17693 13797 -1175 3220 803 -19879 -15484 24933 35839
858 35839 -14200 -49619 -6756 49808 27640 -37486 -39840 19337 39981 -4923 -32760 -1674
870 -1674 24636 1348 -20816 1750 22876 -2076 -27513 -2225 31222 10452 -30205 -18795
882 -18795 24887 24087 -17470 -24934 11594 22527 -10354 -22088 11463 25753 -11390 -33692 5065
895 5065 41084 8385 -41413 -24233 31889 35199 -15145 -35013 -110 24914 6759 -10804
907 -10804 -1136 2912 -12158 -7568 23100 23030 -23319 -42453 8942 54530 15725 -51595 -40345
920 -40345 32552 53495 -5186 -48880 -18083 29194 26692 -4020 -15843 -11291 -7306 7371 28591
933 28591 14949 -33925 -44413 16602 64424 16975 -62231 -51183 36424 68507 340 -61462
$$ packed form
845B4855L2172n3046m4582K2699L5595l896j4972M395k417k0682M395M0417J0906
858C5839n0039l5419M2863N6564k2168o5126k354N9177K0644m4904k7837L1086
870a674K6310k3288k2164K2566K1126k4952k5437K5288L3447k0770m0657J1410
882a8795M3682q00m1557p464L6528J0933l2881j1734L3551J4290l7143k2302L8757
895E065L6019l2699m9798J7180N6122L310n0344j9868L4903K5024j8155j7563
907a0804R668M048j5070M590L0668p0m6349j9134N1395M5588l8805o7320J1250
920d0345P2897K0943n8681m3694L0797M7277k502l0712j1823M552L985J4677K1220
933B8591j3642m8874j0488O1015M7822m7449p9206J1048Q7607L2083o8167o1802
$$ plain form
945 -61462 -31308 34292 42096 -1068 -28083 -19416 -577 16920 27169 7085 -35773 -39712 19946
958 19946 63407 15189 -63472 -52501 37587 72864 1735 -67404 -36804 38706 50682 -1860
970 -1860 -37741 -22849 7408 22983 21653 -150 -32935 -32275 19428 56751 13738 -58046 -49378
983 -49378 34615 69571 2003 -66195 -35890 40704 51465 -6310 -42629 -19215 16232 23285
995 23285 11241 -5963 -24524 -22264 15946 45572 12078 -48635 -43448 29276 62146 2525
1007 2525 -59928 -32217 38664 46553 -9550 -40376 -12095 20018 16303 412 -5201 -10631 -13895
1020 -13895 5191 29485 13609 -31073 -34751 17525 47216 4575 -45792 -25380 31468 36445
1032 36445 -11247 -33422 -4057 20895 7822 -8781 -2292 3117 -7625 -6982 14477 17920 -12312
$$ packed form
945f1462L0154O5600P804m3164k7015Q667J8839J7497J0249k0084m2858l939N9658
958A9946M3461m8218p8661J0971R0088L5277p1129o9139L0600P5510J1976n2542
970a860l5881J4892L0257J5575j330k1803l2785O60N1703L7323m3013p1784Q668
983d9378Q3993L4956o7568o8198L0305P6594J0761n7775l6319K3414L5447P053
995B3285j2044j7204j8561K260L8210K9626l3494o0713N187P2724L2870n9621
1007B525o2453K7711P0881P889n6103l0826K8281L2113l715j5891n613n430l264
1020a3895J9086K4294j5876m4682l678N2276K9691m2641n0367K0412N6848M977
1032C6445m7692k2175K9365K4952j3073j6603O489N409j0742O43K1459L443l0232
$$ plain form
1045 -12312 -28174 2264 31966 10020 -28343 -19518 20196 24026 -10483 -22071 4737 18097
1057 18097 -3730 -16395 4125 17384 -3990 -20688 1033 23841 5459 -23729 -13096 18501
1069 18501 17027 -11717 -16297 7013 13108 -5984 -9723 9811 11114 -14056 -18696 13052 28202
1082 28202 -4594 -33688 -8626 31603 21715 -21165 -28616 6112 24851 4910 -14230 -6920
1094 -6920 3224 198 1983 11770 3254 -20920 -17701 19890 33788 -6576 -42225 -13559 38344
1107 38344 32578 -21611 -41380 -1108 34245 17657 -16282 -20556 -2492 9037 11759 9943 -5545
1120 -5545 -25103 -13908 25728 35827 -9742 -47539 -15309 43035 38548 -22766 -48631 -3994
1132 -3994 40499 23967 -19456 -28369 -3190 16185 15513 5093 -10981 -23226 -8843 26421 32468
$$ packed form
1045a2312j5862L0438K9702k1946l8363Q825L9714L830l4509j1588K6808J3360
1057A8097k1827j2665K0520J3259k1374j6698K1721K2808j8382k9188J0633L1597
1069A8501j474k8744m580K3310O095j9092l739J9534J303k5170m640L1748J5150
1082B8202l2796k9094K5062M0229r888m2880p451L4728J8739j9941j9140P310
1094f920J0144l026J785R787q516k4174L219L7591J3898m0364l5649K8666N1903
1107C8344n766n4189j9769M0272L5353j6588l3939m274J8064J1529K722j816j5488
1120e545j9558J1195L9636J0099m5569l7797L2230N8344m487o1314k5865M4637
1132c994M4493j6532m3423q913K5179J9375o72j0420j6074j2245J4383L5264O047
$$ plain form
1145 32468 -11526 -46583 -14464 43374 39634 -22635 -51051 -5645 43359 27587 -21450 -33110
1157 -33110 -2674 21564 16495 -384 -13719 -18334 -4202 22884 26295 -10785 -40619 -12653
1169 -12653 39081 36225 -21334 -48206 -4516 42943 26137 -23596 -33364 998 24660 13547
1181 13547 -6025 -13011 -11133 -1412 16187 20068 -6716 -32227 -12735 30592 31790 -15792 -41083
1194 -41083 -5047 36562 22086 -21485 -27932 4408 22155 6909 -9341 -7283 -2210 -1496 5884
1207 5884 13250 344 -20723 -13213 18846 25458 -8422 -31163 -5940 27508 17226 -17291 -21096
1220 -21096 6104 17638 781 -10301 -767 5019 -3517 -4462 8298 9031 -9470 -15452 5693
1233 5693 19840 1269 -20020 -8285 16126 12222 -10773 -12568 6532 10640 -5516 -9152 6835
$$ packed form
1145C2468m3994l5057L2119N7838l740o2269k8416M5406M9004j5772m9037j1660
1157c3110L0436K4238n069j6879j3335m615J4132K7086L411l7080k9834K7966
1169a2653N1734k856n7559k6872M3690M7459j6806m9733r768L4362K3662j1113
1181A3547j9572o986J878R721J7599L881k6784k5511J9492M3327J198m7582k5291
1194d1083L6036M1609j4476m3571o447L2340J7747j5246j6250K058N073P14P380
1207E884P366j2906k1067P510L2059O612l3880k2741K5223L3448j0282l4517l805
1220b1096K7200J1534j6857j1082R534N786q536r45J2760P33j8501n982K1145
1233E693J4147j8571k1289J1735K4411l904k2995j795J9100M108j6156l636J5987
$$ plain form
1246 6835 10557 -7592 -14164 5843 18299 -445 -19794 -6586 16893 12004 -10491 -12817 4374
1259 4374 9139 -2273 -4572 4584 2401 -10166 -5789 14190 13968 -12390 -22495 4325 26770
1272 26770 7491 -23645 -17724 14108 21943 -1873 -17571 -6299 7906 6785 1450 419 -4985
1285 -4985 -11210 -689 18649 13452 -16925 -26688 5075 32691 11596 -27848 -25720 13470 30323
1298 30323 3936 -22702 -14759 8035 14370 5326 -3866 -10060 -10633 2999 20402 12489 -18678
1311 -18678 -28053 5137 34822 13555 -29418 -29370 13180 34396 6163 -26126 -18826 9729 19218
1324 19218 5844 -8159 -12404 -7735 6302 19401 9626 -18874 -26246 5824 34007 13295 -29143
1337 -29143 -29813 12990 35615 6760 -27875 -20363 11576 21873 4405 -11902 -12106 -3154 7992
$$ packed form
1246F835L722j8149o572K0007J2456j8744j9349J3208K3479m889k2495k326J7191
1259D374M765j1412k299R156k183j2567M377J9979k22k6358j0105K6820K2445
1272B6770j9279l1136N921L1832P835k3816j5698J1272J4205j121n335j031n404
1285d985o225J0521J9338n197l0377r763L1763K7616k1095l9444K128L9190J6853
1298C0323k6387k6638P943K2794O335r044r192o194n73J3632J7403p913l1167
1311a8678r375L3190K9685k1267m2973M8M2550K1216k8233l2289P300K8555R489
1324A9218j3374j4003m245M669J4037J3099r775k8500p372L2070K8183k0712m2438
1337b9143o70M2803K2625k8855l4635P512L1939J0297j7468j6307k04Q952J1146
$$ plain form
1350 7992 15142 6168 -16000 -21560 5059 29339 12031 -25775 -27409 11503 33170 6565 -26659
1363 -26659 -19183 12113 20899 1985 -12787 -8920 280 5863 9460 5294 -9822 -16883 1171
1376 1171 22363 12014 -18960 -23157 7950 27281 5650 -22331 -15291 11612 16801 -1509 -11814
1389 -11814 -3880 3444 2360 2830 4618 -2769 -11735 -3432 14284 11932 -10895 -18442 2939 20181
1403 20181 5949 -15925 -11384 8810 11429 -3418 -8492 1229 4818 -2627 -3029 5741 4986 -7576
1417 -7576 -9355 5927 12932 -1577 -13939 -3190 12295 7057 -8192 -7578 4756 5569 -4207 -3806
1431 -3806 5922 4287 -8103 -7457 8418 12151 -5294 -15899 -1110 15408 7220 -10884 -10120 5014
1445 5014 9094 -279 -4497 -146 -214 -3929 1291 9569 2734 -12870 -10092 11329 17640 -4218 -21255
$$ packed form
1350G992P150q974k2168n560K6619K4280j7308l7806j634L8912K1667k6605l3224
1363b6659P476L1296Q786j8914j4772L867R200N583L597m166j5116p061J8054
1376A171K1192j0349l0974m197L1107J9331k1631k7981P040K6903N189j8310j0305
1389a1814P934P324j084M70J788p387q966Q303J7716k352k2827p547K1381J7242
1403B0181j4232k1874M541K0194K619j4847n074R721L589p445m02Q770p55j2562
1417g576j779J5282P005j4509j2362J0749J5485n238j5249O14J2334Q13r776M01
1431c806R728j635j2390O46J5875L733j7445j0605J4789J6518q188j8104P64J5134
1445E014M080r373m218M351o8l715N220Q278o835j5604K778K1421O311k1858j7037
$$ plain form
1460 -21255 -6072 17939 14267 -9419 -16624 -335 12350 6569 -3774 -5978 -4104 -1214 6075
1473 6075 10589 -201 -15866 -10310 13775 20553 -4063 -24769 -9273 19783 19241 -8329 -21222
1486 -21222 -4051 14810 11199 -3691 -10016 -6127 963 8513 10005 -2032 -16417 -9796 14479
1499 14479 21194 -3922 -25870 -10461 20689 21541 -8137 -23899 -5593 16935 13823 -4742 -12994
1512 -12994 -6262 3657 9563 8002 -3648 -15156 -8164 13755 19738 -3673 -24431 -10313 19782
1525 19782 21306 -7655 -23842 -5647 17632 14074 -5942 -13866 -4757 5780 8501 4832 -3863
1538 -3863 -11840 -6407 10771 16491 -2149 -20664 -9939 16465 19282 -5895 -21269 -5487 15821
1551 15821 12473 -6075 -12154 -2426 5770 5273 2223 -1798 -7112 -5716 6002 12853 604 -15336
$$ packed form
1460b1255J5183K4011l672k3686p205J6289J2685n781j0343k204J874K890P289
1473F075M514j0790j5665N556K4085O778k4616k0706J5496K9056n42k7570j2893
1486b1222J7171J8861l611j4890o325L889P090P550J492j2037j4385O621K4275
1499A4479O715k5116k1948J5409L1150Q52k9678j5762J8306K2528l112j8565q252
1512a2994O732R919N906j561j1650j1508O992K1919N983k3411k0758J4118L0095
1525A9782J524k8961j6187J8195K3279l558k0016p924R109J0537K721l669q695
1538c863p977N433J7178N720j8640j8515J0725K6404K817k5177j5374J5782K1308
1551A5821l348j8548o079R728Q196m97l050m021n314J396J1718O851j2249j5940
$$ plain form
1565 -15336 -9432 11729 15939 -3765 -17109 -4542 13016 9621 -5939 -9275 168 5075 1709
1578 1709 -102 826 -2452 -5646 730 9307 4139 -9466 -9606 5737 12503 -248 -11883 -4570
1592 -4570 8387 6491 -4186 -5241 2047 3017 -2275 -1348 4311 2043 -6206 -4891 6140 8250 -3402
1607 -3402 -10173 -735 9233 3986 -6385 -5116 3125 3635 -1575 -1038 3111 -1 -5907 -1607 8223
1622 8223 5642 -7792 -10120 4154 12700 1733 -11386 -6650 6806 8225 -1597 -6194 -1799 1554
1636 1554 1228 2585 3063 -3072 -8296 -919 11130 7454 -9385 -13653 3215 16232 5295 -12798
1650 -12798 -11351 5453 12228 2120 -7753 -6160 590 4439 5107 2042 -5639 -9324 104 12712
1664 12712 8335 -10158 -15708 2277 17913 7706 -13347 -14327 4395 14775 4421 -9167 -8831
$$ packed form
1565a5336N904K1161M210j9704j3344J2567J7558l395j5560l336R443M907l366
1578A709j811R28l278l194O376Q577n168j3605j40J5343O766j2751j1635P313
1592d570J2957j896j0677j055P288R70n292R27N659k268q249J315J1031K110j1652
1607c402o771R438R968n247j0371J269Q241N10n210N37M149l112n906M300R830
1622H223k581j3434k328J4274Q546j0967j3119M736J3456J419r822m597M395L353
1636A554l26J357M78o135n224P377J2049l676j6839m268J6868J3017j0937j8093
1650a2798J447J6804O775j0108r873J593O750L849O68l065p681l685R428J2608
1664A2712m377j8493n550J7985J5636j0207k1053r80J8722J0380j0354j3588L36
$$ plain form
1677 -8831 571 6760 6189 720 -7057 -8948 1164 12960 8050 -10573 -16180 2068 18662 8571
1691 8571 -13724 -15771 4103 16178 5429 -10232 -10136 1269 8244 5957 -718 -6929 -7507 1473
1705 1473 11562 7246 -9299 -14848 1244 17050 8689 -12494 -15318 3295 15631 5433 -10085
1718 -10085 -9895 1838 8203 4758 -1543 -5652 -5440 891 8782 6501 -6528 -12552 -335 13948
1732 13948 8408 -9654 -13566 1999 13348 4849 -8752 -8183 2325 6838 2638 -1861 -3212 -3188
1746 -3188 -357 5320 5684 -3248 -9673 -1907 10219 7784 -6590 -11055 745 10412 3950 -6723
1760 -6723 -5901 2320 4590 576 -1228 -255 -1498 -2638 1657 5620 802 -6884 -4455 5770 7631
1775 7631 -2299 -8306 -1484 6446 3512 -3643 -3444 1469 1725 -1171 40 2801 -247 -4953 -1785
$$ packed form
1677h831R402O189n71n469p777j891J0112J1796m910j8623n607J8248J6594j0091
1691H571k2295k047J9874J2075j0749j5661R6J1405O975k287o675o211n78Q980
1705A473J0089m316j6545n549J6092J5806q361k1183k824J8613J2336j0198j5518
1718a0085J90J1733O365l445o301m109K12O331P891k281j3029o024J2217J4283
1732A3948n540j8062l912J5565J1349q499j3601N69J0508M513m200m499j351K4
1746c188K831N677L64q932o425P766J2126k435j4374m465J1800R667o462j0673
1760f723Q22Q221K270m014j804R73j243j140M295L963m818p686K429J0225J861
1775G631r930o007O822P930k934p155J99M913K56k896J211K761l048m706L168
$$ plain form
1790 -1785 5829 4830 -4355 -7262 1390 7743 2203 -5699 -4151 2488 3516 -190 -1081 213 -1214
1805 -1214 -2377 1823 5532 318 -7474 -4529 6463 8368 -2692 -9902 -2179 8186 5972 -3865
1819 -3865 -6641 -623 3906 2851 390 -1425 -3560 -2680 3533 7203 300 -9318 -6165 7078 10845
1834 10845 -1590 -11824 -4877 8482 8952 -2448 -8709 -3224 4396 5341 1414 -2884 -5059 -2550
1848 -2550 4645 7878 178 -10039 -6881 7295 11958 -733 -12782 -6517 8664 10778 -1704
1861 -1704 -10236 -4662 5126 6965 1356 -4261 -5587 -1694 5307 7610 -274 -9921 -6744 7133 12085
1876 12085 -409 -12854 -6914 8507 11285 -1429 -10647 -4916 5455 7191 887 -4640 -5096 -1051
1890 -1051 4862 6577 -104 -8600 -6334 5879 11055 290 -11483 -6898 7437 10588 -943 -9799
$$ packed form
1790a785P614r99r185k907Q652O353n540p902J548O639J028l706q91J294j427
1805a214j163M200L709n214p792K945J0992J905j1060p210P723J0365k214r837
1819c865k776O018M529j055k461j815k135Q80O213L670o903r618L153J3243L767
1834A0845j2435j0234O947J3359M70j1400o261N485P620R45l927m298k175K509
1848b550P195L233p700j0217L158J4176M663j2691j2049O265J5181K114j2482
1861a704q532N574R788J839n609n617j326L893P001K303p884r647L177J3877M952
1876A2085j2494j2445N940J5421K778j2714r218N731J0371J736o304n527m56M045
1890a051N913J715o681q496K266J2213N176j0765j1773M585J4335L151j1531q856
$$ plain form
1904 -9799 -4651 5147 6500 317 -4345 -3853 -559 3536 4951 453 -6321 -5607 3896 9080 1203
1919 1203 -9123 -6322 5641 9081 -387 -8136 -3783 4481 5137 -248 -3353 -2239 -305 1622 3403
1934 3403 1501 -3827 -5082 1423 7175 2442 -6398 -5878 3376 7284 576 -5773 -3054 2962 3242
1949 3242 -379 -1488 -516 -809 -780 1966 3170 -1044 -4987 -1487 5002 4110 -3179 -5651 398 5173
1965 5173 1956 -3108 -2442 941 1332 -129 546 992 -1631 -3006 989 4894 1503 -5070 -4344 3194
1981 3194 5965 -232 -5625 -2527 3344 3584 -496 -2274 -1153 -367 598 2439 1955 -2590 -4780 436
1997 436 6484 3319 -5416 -6653 2011 7545 2099 -5816 -4950 2065 4970 1592 -2315 -3019 -1554 1241
2013 1241 3822 2475 -3447 -6120 40 7607 4854 -5489 -8341 830 8720 4043 -5725 -6792 986
$$ packed form
1904i799N148R798J353o183m662M92L294M095J415m498o774P14R503N184p877
1919A203j0326K801J1963L440r468p749M353Q264O56n385l105J114J934J927J781
1934C403j902n328j255O505N752m733q840N20R254L908o708o349K719O016K80
1949C242l621j109R72k93K9K746J204m214l943L500O489q92p289k472O049M775
1965E173l217n064O66L383L91j461O75M46k623j375L995L905l391o573P26P538
1981C194K771o197n393L098N871K40m080j778J121P86R65J841m84m545k190N216
1997D36O048l165q735j237Q664N534n446p915Q66P015K905l378l907p04J465K795
2013A241K581j347n922k673O160P567k753j0343k852R171P890m677r768j067P778
$$ plain form
2028 986 6199 3186 -2472 -4434 -2109 2026 4750 2388 -3940 -6433 74 7937 5379 -5525 -9047
2043 -9047 369 9310 5085 -5817 -7841 567 7067 3951 -2819 -5234 -2081 2541 4828 2026 -4019
2058 -4019 -6276 -32 7590 5321 -5123 -8983 -211 8966 5295 -5456 -7872 350 6901 4001
2072 4001 -2825 -4960 -1730 2489 4221 1808 -3292 -5457 -431 6485 5116 -3976 -8236 -792 7796
2087 7796 5137 -4526 -7198 0 6177 3549 -2608 -4253 -1181 2104 3082 1445 -2118 -4203 -1015
2102 -1015 4692 4566 -2452 -6760 -1483 6098 4779 -3168 -6144 -458 4910 2922 -1952 -3088 -801
2117 -801 1136 1824 1527 -466 -3108 -2050 2742 4441 -359 -5233 -2618 3872 4507 -1299 -4556 -1144
2133 -1144 3054 2155 -824 -1485 -501 -326 227 1846 1435 -1942 -3333 536 4338 1830 -3652 -3734 1580
$$ packed form
2028I86N213l013n658j962K325M135K724k362o328k493O507P863k558j0904l522
2043i047R416Q941m225j0902k024Q408O500l116o770k415L153M622K287k802o045
2058d019k257O244P622k269j0444l860Q772R177l671j0751k416Q222O551k900
2072D001o826k135L230M219J732k413n100k165N026O916j369r092m260P444Q588
2087G796k659r663k672P198O177k628o157j645L072L285R78j637l563k085L188
2102a015N707j26p018m308N277P581j319p947k976N686N368j988m874j136K287
2117h01J937O88k97j993k642J058M792J699m800m874K615O490O35n806l257L412
2133a144M198q99k979o61R84J75N53J619m11l377j391L869L802k508n482q2N314
$$ plain form
2150 1580 4215 686 -3024 -2008 1067 1599 472 -143 -655 -1687 -909 2292 2997 -1053 -4465 -1298
2166 -1298 4321 3810 -2282 -4879 -444 4131 2574 -1764 -2944 -660 1393 1819 1101 -817 -2899 -1745
2182 -1745 2730 4375 -509 -5497 -2851 4334 5462 -1165 -5881 -2212 3958 4228 -640 -3717 -2115
2197 -2115 1123 2858 2101 -998 -3903 -2442 3034 5286 66 -6098 -3922 4185 6568 -303 -6521
2212 -6521 -3474 3853 5412 61 -4345 -3030 1213 3644 2435 -1370 -4183 -2386 3161 5472 306
2227 306 -6181 -4390 3846 6953 364 -6638 -4236 3566 5819 462 -4550 -3519 1153 3796 2487
2242 2487 -1284 -4026 -2445 2740 5280 702 -5652 -4610 3121 6786 937 -6107 -4454 3032 5680
2257 5680 769 -4219 -3388 956 3413 2207 -955 -3424 -2318 2014 4626 1135 -4550 -4384 2204
$$ packed form
2150A580K635l529l710J016L075N32j127o15n12j032P78L201P05m050l412L167
2166a298N619n11o092k597M435M575j557m338j180K284K053M26p18j918k082J154
2182a745M475J645m884m988K646P185J128o627m716L669O170K70m868l077J602
2197b115L238J735p57l099k905J461N476K252n220o164K176Q107K383o871o218
2212f521L047P327J559n351m406J315M243K431j209l805k813J797N547K311n166
2227C06o487J791Q236L107o589p002K402P802K253n357n012J031M672K643j309
2242B487l771k742J581N185K540m578o354J042P731L665n849p044J653P486K648
2257E680m911m988Q31M344K457j206l162k469J106M332K612l491n685J66O588
$$ plain form
2272 2204 5995 1365 -5153 -4256 2321 5037 898 -3635 -2978 734 2730 1776 -628 -2431 -2107 1053
2288 1053 3644 1682 -3232 -4090 949 5054 2057 -3669 -3987 1268 4046 1235 -2451 -2356 198 1602
2304 1602 1354 368 -1228 -2120 -469 2600 2539 -1467 -3874 -620 3738 2788 -2032 -3564 -77 2777
2320 2777 1506 -1110 -1535 -434 385 960 1369 27 -2207 -1900 1626 3315 100 -3648 -2198 2462
2336 2462 3474 -303 -3182 -1481 1646 2019 214 -1020 -1216 -699 840 2272 983 -2367 -3060 698
2352 698 3962 1595 -3353 -3516 1349 4142 1185 -2865 -2751 485 2356 1479 -529 -1958 -1708 673
2368 673 3091 1896 -2412 -4079 45 4518 2724 -3132 -4666 365 4583 2424 -2526 -3686 -363
2383 -363 2612 2338 -257 -2466 -2338 591 3613 2317 -2461 -4589 -372 4808 3469 -2895 -5210 -265
$$ packed form
2272B204L791m630o518Q97O577K716m139m533O57L712J996r54k404j803L24L160
2288A053K591j962m914q58N039M105k997n726l18N255K778k811l686R5K554J404
2304A602k48r86j596q92J651L069o1m006k407L254M358r50m820j532L487K854
2320B777j271k616m25J101Q19N75M09j342k234L07L526J689l215l748J450M660
2336B462J012l777k879J701L127L73j805j234j96N17J539J432j289l350o93L758
2352F98L264k367m948j63M865K793k957m050J14L236J871q77k008j429K50K381
2368F73K418j195m308j667M124M473j794n856j534N031M218k159m950j160L323
2383c63K975k74k595k209J28K929L022j296m778k128M217N180j339o364k315M945
$$ plain form
2399 -265 4877 3209 -2393 -4260 -857 2881 2879 -147 -2750 -2574 562 3624 2515 -2211 -4757 -854
2415 -854 4634 3893 -2315 -5388 -915 4653 3728 -1857 -4403 -1278 2712 3028 83 -2622 -2609 385
2431 385 3324 2529 -1806 -4482 -1293 4026 3972 -1763 -5055 -1286 4148 3729 -1457 -4124 -1313 2444
2447 2444 2788 143 -2210 -2259 5 2692 2438 -1125 -3876 -1566 3197 3815 -990 -4475 -1703 3339
2463 3339 3479 -779 -3507 -1424 1793 2373 458 -1519 -1854 -451 1711 2340 -181 -2996 -2147 1935
2479 1935 3590 149 -3581 -2266 2040 3159 37 -2524 -1616 829 1741 813 -504 -1314 -1114 696
2495 696 2304 974 -2080 -2651 648 3260 1216 -2472 -2545 812 2680 879 -1521 -1648 -48 1054
2511 1054 1182 496 -1004 -1753 -283 2218 2059 -1215 -3106 -541 2972 2288 -1474 -2946 -411 2249
$$ packed form
2399b65N142j668n602j867L403L738kl026k603J76L136L062j109m726k546L903
2415h54N488p41o208l073M473N568r25n585k546L125L990L16k945k705J3K994
2431C85K939p95m335k676L189N319n4n735l292L769N434m19n186k667K811L757
2447B444L44k645k353m9K264K687k54l563k751K310M763O18m805l485K772N042
2463C339J40m258k728K083L217N80j915j977l35J403K162O29k521k815Q49M082
2479A935J655l441l730J315M306J119l122k561R08K445R12r28j317q10K00J810
2495F96J608j330l054n71L299K612k044l688p3L357J868j801k400j27J600J102
2511A054J28o86j500p49J470K501j59l274j891K565L513o84l762j472K535K660
$$ plain form
2527 2249 1780 -653 -1773 -980 451 1544 1256 -598 -2386 -1168 2094 2881 -390 -3504 -1703 2524
2543 2524 3278 -468 -3257 -1617 1790 2579 347 -1813 -1840 -74 1846 2030 -412 -2860 -1913 2015
2559 2015 3566 194 -3761 -2652 2201 3935 256 -3463 -2368 1404 3044 975 -1849 -2336 -412
2574 -412 2052 2392 -193 -3068 -2315 1760 3907 752 -3691 -3155 1761 4203 954 -3346 -2953 1127
2590 1127 3224 1466 -1661 -2603 -655 1963 2595 182 -2916 -2627 1325 3919 1263 -3286 -3462 1138
2606 1138 4122 1398 -2973 -3216 588 3204 1710 -1396 -2582 -878 1716 2468 438 -2527 -2575 841
2622 841 3630 1597 -2743 -3464 613 3775 1665 -2524 -3109 256 2764 1752 -1037 -2167 -930 1236
2638 1236 2236 716 -1896 -2466 174 3092 1954 -1889 -3198 -104 3125 1977 -1707 -2890 -300
$$ packed form
2527B249m69k433j120P93J431J093k88j854j788J218L262P87l271l114J801M227
2543B524P54l746k789J640L407P89k232k160k7J766J920J84k442k448R47L928
2559B015J551l372l955J109M853J734l679l719J095L772J640k069k824m87J924
2574d12K464L40k585k875P53M075K147l155m443N36M916K442l249m300L93M080
2590A127K097j758l127r42J948K618O32k413l098K89L952K594k656m549j76M600
2606A138K984k724m371k43L804K616j494l106j186J704K594P52k030k965m8L416
2622H41K789k033m340p21M077L162k110m189n85L365K508j012k789j130J237K166
2638A236J000j520k612n70K640K918j138l843j309L094L229j148l684j183K590
$$ plain form
2653 -300 2144 1738 -492 -1752 -1164 510 1732 1110 -987 -2324 -678 2257 2327 -807 -2909 -952
2669 -952 2249 2207 -741 -2368 -881 1379 1618 249 -1083 -1251 -331 1196 1566 -109 -2135 -1430 1460
2686 1460 2568 150 -2469 -1658 1343 2361 199 -1846 -1367 565 1523 891 -455 -1396 -1063 721
2702 721 1965 661 -1882 -2172 665 2791 1154 -2021 -2391 445 2407 1180 -1321 -1849 -258 1396
2718 1396 1579 119 -1515 -1725 216 2190 1447 -1545 -2771 -130 2823 1940 -1603 -2892 -394 2374
2734 2374 1890 -818 -2224 -893 1302 1975 589 -1543 -2145 -106 2420 1919 -1308 -3098 -665 2886
2750 2886 2507 -1207 -3218 -920 2259 2310 -453 -2358 -1348 1052 2216 928 -1398 -2364 -371 2405
2766 2405 2364 -885 -3163 -1138 2587 2890 -701 -3274 -1446 2008 2660 -1 -2282 -1722 762 2248
$$ packed form
2653c00K444m06k230j260N88J674J222o22k097j337J646K935P0l134k102J957
2669i52L201m2k948j627J487K260K39j369j332j68R20J527L70j675k026P05K890
2686A460J108k418k619Q11L001J018k162k045M79J932R58o32j346r41L33J784
2702G21J244j304k543k90K837K126j637l175l70K836J962j227k501n28J591J654
2718A396J83j460j634k10J941J974p43k992j226K641K953q83l543j289K498K768
2734B374m84k708j406J331K195O73j386k132o02K039K526n01l227j790K433L551
2750B886l79l714k011K298L179N1k763j905J010K400J164j288k326r66J993K776
2766B405m1l249k278K025L725L03l591k573J828L454O52k661k281N60K484J486
$$ plain form
2782 2248 1290 -1179 -2464 -754 2114 2455 -496 -3059 -1558 2129 3043 -99 -3019 -1798 1603 2661
2798 2661 336 -2063 -1836 470 2016 1362 -844 -2239 -1031 1617 2412 -20 -2677 -1755 1605 2888
2814 2888 302 -2574 -1934 1077 2512 703 -1598 -1811 59 1646 1381 -349 -1954 -1284 1007 2279
2830 2279 564 -2070 -2018 793 2625 931 -1906 -2030 465 2103 1083 -1008 -1650 -466 1074 1519
2846 1519 296 -1420 -1636 314 2065 1133 -1391 -2229 -29 2191 1414 -1163 -2046 -260 1569 1360
2862 1360 -337 -1411 -886 451 1401 813 -878 -1780 -436 1692 1681 -683 -2219 -823 1685 1803 -402
2879 -402 -1933 -953 1042 1531 321 -1083 -1326 -158 1340 1377 -289 -1910 -1114 1293 2151 89 -2132
2896 -2132 -1571 1135 2163 392 -1730 -1549 407 1642 946 -763 -1604 -717 1188 1751 213 -1897
$$ packed form
2782B248r58k469j285J710K868L41k951k563J501L687R14l142k920J221L401J058
2798B661k325k399K27K306J546o54k206j395J208K648P95k432k657R22L360J283
2814B888k586k876O40L011J435j809k301k13J870J587k65j730j605O70K291J272
2830B279j715k634N2K811J832j694k837j24K495J638j020k091o42J184J540M45
2846A519j223j716k16J950J751r32k524q38K200K220p77k577q83J786J829k09
2862A360j697j074N25J337R50n88j691r02J344K128j1k364j536J396K508J18k205
2879d02j531R80J995M89j210j404k43J168J498L7j666j621P96K407Q58k062k221
2896b132N61K706J028j771k122J81J956J235o96j709q41Q87J905N63j538k110
$$ plain form
2912 -1897 -1652 869 2371 740 -2014 -2079 591 2329 1011 -1474 -1965 -2 1730 1380 -461 -1737
2928 -1737 -1124 925 2046 662 -1730 -1999 459 2465 1292 -1713 -2421 54 2367 1499 -1129 -2138
2944 -2138 -520 1499 1672 -60 -1805 -1418 631 2074 982 -1520 -2285 -79 2390 1694 -1289 -2564
2960 -2564 -400 2147 1921 -701 -2136 -896 1276 1832 219 -1524 -1580 231 1958 1345 -1168 -2253
2976 -2253 -527 2035 1918 -806 -2441 -870 1772 1983 -268 -1955 -1143 926 1796 538 -1269 -1639
2992 -1639 -102 1634 1554 -592 -2027 -868 1572 2016 -282 -2158 -1194 1252 1950 232 -1575 -1353
3008 -1353 406 1547 896 -758 -1621 -484 1254 1693 -77 -1796 -1301 996 1968 319 -1715 -1504
3024 -1504 628 1825 660 -1134 -1432 -92 1224 1070 -279 -1361 -888 725 1686 495 -1412 -1524
$$ packed form
2912a897K45K521J502j631k754o5K670J738j318k485m91J963J732l50j841j276
2928a737O13K049J121j384k392k69K458K006j173l005p08K475K313q68k628j009
2944b138J618K019J73j732j745L87K049J443j092k502p65K206K469o96k983j275
2960b564K164K547k26k622j435J240K172N56j613j743n6J811J727o13k513j085
2976b253J726K562j17k724j635J571K642K11k251j687Q12K069Q70j258j807l70
2992a639J537J736q0k146j435J159K440M44k298j876R64K446O98j718j807K22
3008a353J759J141o51j654q63J137J738M39j770j719M95K297R72j649k034K11
3024a504K132J197j165j794k98J340J316j54j349j082M73J613R61j191j907j12
$$ plain form
3040 -1524 355 1861 852 -1278 -1617 53 1610 1069 -675 -1381 -537 813 1245 186 -1160 -1197 244
3057 244 1632 975 -910 -1737 -248 1632 1296 -707 -1708 -498 1289 1440 -123 -1304 -997 426
3073 426 1268 722 -859 -1548 -307 1429 1478 -430 -1856 -792 1315 1668 -135 -1740 -1020 930 1608
3090 1608 352 -1149 -1343 41 1362 1071 -555 -1634 -708 1251 1734 -89 -1846 -1259 981 1887
3106 1887 326 -1569 -1320 549 1678 766 -976 -1522 -279 1276 1406 -181 -1629 -1046 980 1857
3122 1857 355 -1726 -1574 606 1943 732 -1365 -1685 79 1591 1123 -578 -1620 -669 1078 1542
3138 1542 191 -1432 -1305 631 1885 769 -1444 -1783 156 1813 1040 -1070 -1661 -271 1392 1281
3154 1281 -388 -1433 -865 745 1498 485 -1243 -1435 189 1709 1056 -1034 -1770 -135 1625 1288
$$ packed form
3040a524J879J506j009k130l39J670J557n41j744p06Q44J350M32j059j346l7J441
3057B44J388o57j885q27J489J880l36k003j001J210J787J51j563j181L07J423
3073D26Q42n46j581o89J241J736M9j908j426J064K107L53j803j605P20J950O78
3090A608j256j501j94J384J321k91j626j079R26J959M83j823j757N87K240R06
3106A887j561j895K49J869J129r12j742n46J243J555J30j587j448N83K026Q77
3122A857j502k081J52K180J337j211k097l20J764J512m68j701j042R51J747M64
3138A542j351j623J27J936J254j116k213l39J939J657p73k110n91J390J663j11
3154A281j669j045N68J610P53j013j728j92J624J520o53k090p36J635J760l37
$$ plain form
3170 1288 -637 -1691 -622 1103 1346 5 -1272 -1160 383 1423 735 -901 -1484 -198 1435 1276
3186 1276 -535 -1646 -580 1218 1423 -211 -1453 -909 730 1313 391 -1011 -1222 -64 1197 1048
3202 1048 -539 -1435 -562 1133 1442 -165 -1477 -858 817 1461 271 -1165 -1010 434 1187 646 -612
3219 -612 -1214 -323 971 1146 -74 -1314 -965 741 1395 307 -1277 -1160 348 1385 580 -867 -1164
3236 -1164 -105 1041 940 -258 -1169 -711 588 1326 360 -1124 -1215 285 1475 748 -898 -1343 -64
3253 -64 1265 896 -507 -1256 -471 895 1115 143 -1030 -975 339 1333 655 -881 -1372 -58 1314 1030
3271 1030 -590 -1439 -430 1102 1179 -247 -1283 -817 570 1199 369 -910 -1107 68 1221 952 -553
3288 -553 -1399 -442 1132 1288 -194 -1397 -739 826 1361 131 -1188 -1023 264 1220 767 -655 -1315
$$ packed form
3170A288j925j054J069J725K43j341j277J12J543J040o88j636n83J286J633j59
3186A276j811j111J066J798K05j634j242N44J639N83r22j402k11J158J261j49
3202A048j587q96Q73J695L09j607j312O19J675O44j190j436J55J444P53n41j258
3219f12o02Q91J294J75j220j240L49J706O54j088j584J17J508J037q05j447k97
3236a164J059J146j01j198r11M58J299P38r66j484r1J500J190p27j646m45J279
3253f4J329l69j403p49P85J366K20r72j173N5J314R94o78j536m91J314J372k84
3271A030j620q49J009J532P7j426j036M66J387O29q30j279j97J175J153k69j505
3288e53q46R57J574J56j482j203O58J565N35j230j319J65J287R56m53j422o60
$$ plain form
3305 -1315 -309 1137 1227 -242 -1387 -705 899 1443 131 -1303 -1054 481 1337 437 -992 -1183 18
3322 18 1156 920 -426 -1287 -606 910 1264 -41 -1293 -935 655 1420 409 -1093 -1166 241 1271
3339 1271 708 -684 -1203 -204 955 1071 -163 -1168 -811 579 1265 340 -1115 -1118 261 1356 679 -893
3357 -893 -1208 -128 1133 914 -384 -1199 -537 727 1125 197 -977 -977 277 1244 569 -804 -1255 -87
3375 -87 1182 953 -515 -1270 -390 878 995 -55 -1028 -694 461 1100 516 -749 -1075 -21 1013 884
3393 884 -506 -1180 -347 901 1086 -198 -1144 -681 594 1048 213 -833 -869 163 1067 640 -500 -1097
3411 -1097 -404 926 964 -130 -1111 -614 639 1169 194 -985 -918 179 1003 468 -683 -978 -178 881
3429 881 930 -168 -1002 -627 588 1091 165 -959 -859 336 1115 453 -726 -1004 -7 943 726 -300
$$ packed form
3305a315J006J446R0j469j145O82J604N44j312j434K49J535Q56r00j429j91J201
3322A8J138k36j346q61O81J516L54j305j252L58J590P65j011j502p3J407J030
3339A271n63j392n19R99J159J16j234j005L57J390O86r25j455lJ379J095o77j572
3357h93l15J080J261k19j298q15O62J264L98r28j174%J254R67o75j373m51J168
3375h7J269k29j468p55Q80J268J17j050r73L34J155O39n84j265l26J054J034j29
3393H84j390o74Q33J248J85j284r46M63J275M54q35j046l6J032R04m27j140n97
3411a097O93J330L8j094r81M97J253N30r75j179O7J097Q24n35j151k95Q00J059
3429H81M9j098q34L75J215N03r26j124J00J195P79o62j179k78R97R50k17j026
$$ plain form
3447 -300 -983 -433 645 1058 81 -937 -786 350 1110 502 -765 -1024 48 1091 712 -424 -1029 -317
3465 -317 804 840 -70 -952 -730 403 1054 357 -762 -1012 54 1022 727 -522 -1102 -254 927 947 -111
3484 -111 -1025 -586 628 976 201 -863 -811 187 1019 647 -540 -1072 -197 941 863 -278 -1044 -485 730
3503 730 984 70 -928 -735 391 990 396 -603 -922 -101 882 807 -338 -1030 -432 685 952 2 -988
3522 -988 -718 455 1077 323 -813 -857 106 918 651 -432 -1020 -279 751 876 -72 -948 -671 493 1090
3541 1090 252 -791 -896 218 988 473 -579 -913 -146 795 714 -257 -921 -535 516 949 184 -858
3559 -858 -797 241 984 444 -623 -906 -43 844 698 -377 -913 -387 634 792 16 -893 -679 338 884
3578 884 399 -663 -801 28 920 741 -414 -893 -244 734 827 -68 -794 -528 457 859 292 -697 -795 106
$$ packed form
3447c00o83N50J078M13r77j018J51J136P60o08j267k59J072J043l79j136o05P12
3465c17J121L6r10q82K22J133O51o97j119k50J066R68k95j249n80Q48J181K0j058
3484a11r14M39J214L48p75j064N2R98Q32l72j187n32Q75J138p8j141p66N59J215
3503G30K54r14r98J93J126N99n94r99l19Q21R83p5j145o92N98J117K67r50r90
3522i88K70J173O22p54j136m4R63Q12k67j083n88P41J030J25r48q76K77J164N97
3541A090q38j043j05J114P70n15j052l34P67R41q1r71o64L86J051M33p65j042
3559h58O1J038P43n40j067k83Q63Q87j46j075n36N26J021J58p76r09K14J017N46
3578H84m85j062j38Q29Q92j79j155m79O49R78R3q95p26K66R85M02n67r89r8R01
$$ plain form
3598 106 888 605 -466 -928 -257 750 780 -216 -974 -500 551 880 168 -741 -695 251 850 492 -536
3617 -536 -877 -171 790 741 -166 -896 -385 565 879 64 -808 -709 324 863 381 -548 -776 45 810 636
3637 636 -280 -826 -425 536 873 7 -808 -614 326 881 279 -700 -807 -2 846 525 -337 -854 -204 675
3657 675 734 -125 -880 -538 431 923 261 -684 -774 89 849 508 -518 -864 -188 782 690 -107 -797 -460 478
3678 478 733 124 -720 -667 199 831 454 -522 -832 -74 725 631 -291 -875 -382 533 801 29 -738 -644 261
3699 261 820 302 -541 -790 -1 767 645 -316 -909 -358 586 730 -69 -818 -578 366 849 220 -624 -731
3719 -731 72 829 509 -388 -803 -249 674 761 -127 -802 -475 453 891 201 -695 -706 202 847 469 -463 -798
3740 -798 -149 614 642 -182 -831 -430 525 797 90 -734 -627 242 852 351 -526 -694 -9 737 622 -310
$$ packed form
3598A06P82k83j071m62O71J007L0r96p58M74J051L29p12r09M6R46N99l58j028
3617e36l41P06R61m9r07p30N11R50L14q15q72R9J033N39m82r29k28Q21P65j74
3637F36r16n46M01R61L37q66q15J94R40N55o02r79j07Q05Q48l21q62n17O50Q79
3657F75N9q59p55L42R69M92o62r45r0Q63P60l41j026l46O76R70r2p97o90L37R38
3678D78K55o09q44N3Q66O32l77r76l10P58P99r4r22n84M93R15K68p72p67R4R05
3699B61N59n18q43k49P89P68j22r61n93N51R44J44p99p49K40R44M83o29q44j07
3719g31Q03P57l20q97m15N54R23Q7q88o75L27R28M38o90q96j1R08O45l78r32l35
3740g98O49P63K8q24o49M01R55K72p07q24J07Q69O10n01q77j68O85P46j15r32
$$ plain form
3760 -310 -738 -297 571 749 -5 -774 -524 270 842 302 -590 -757 28 779 533 -334 -786 -180 611 703
3780 703 -74 -729 -518 365 780 211 -620 -705 57 760 500 -439 -848 -146 635 626 -91 -810 -359 446 743
3801 743 111 -664 -583 152 743 372 -454 -675 -101 675 681 -255 -770 -377 475 740 62 -697 -488 298 763
3822 763 297 -535 -715 14 675 566 -260 -735 -259 504 680 -7 -763 -488 329 708 228 -556 -696 138
3842 138 730 492 -377 -740 -244 559 594 -106 -667 -414 325 782 224 -594 -619 175 724 396 -419 -672 -137
3863 -137 638 622 -182 -709 -345 415 742 134 -648 -566 142 787 361 -405 -693 -81 652 563 -285 -747 -323
3884 -323 446 688 6 -672 -529 232 744 267 -546 -705 -51 707 467 -327 -736 -253 553 734 -54 -705
3904 -705 -471 343 724 155 -559 -656 97 692 462 -302 -730 -193 581 617 -67 -672 -430 430 697 126 -629
$$ packed form
3760c10m28M41Q68J78p54p69K50P94N72n40q92j67P85P51k46q67m52O06P91R2
3780G03p77o55K11Q83M15n69q31q5P62P03k60r39m09P02P81rp17p19M51Q05K97
3801G43o32p75Q1P35N91l71q26k21N74P76Or36n15L93Q52K65o78p59K09P86M65
3822G63m66q32j80P29O61j09q26m75M76P63J76o87p56K75Q17L79m80p84j40Q34
3842A38N92k38q69l63M96Q03L5p00n61K53P39M57n58q18k5P94N49l28q15k53N35
3863a37P75j6q04n27L64P60L27o08p82Q2P08O45m26p66k88O12P33q9q48m62M24
3884c23P69K42o82o78J43P61N12m77q13j59O54P58k40p94m09M83Q06J81p88o51
3904g05K34Q14L81n69p14r7P53N95k30p64m28N37P74L6o84o05K42Q60K67n71p55
$$ plain form
3925 -629 -596 132 691 369 -405 -679 -76 589 554 -192 -722 -377 444 676 66 -616 -566 249 743 322 -505
3946 -505 -637 -44 641 519 -237 -710 -228 489 606 16 -665 -547 280 695 297 -493 -593 44 661 424
3966 424 -306 -696 -127 590 623 -140 -663 -431 388 691 145 -564 -624 107 752 433 -380 -689 -93 576 521
3987 521 -192 -727 -400 389 601 91 -579 -552 173 660 316 -392 -629 -62 634 560 -187 -643 -253 502 646
4008 646 -58 -638 -483 303 623 241 -504 -599 -10 637 451 -274 -693 -217 458 617 -52 -632 -365 356
4028 356 638 166 -547 -554 49 664 367 -316 -638 -113 519 512 -147 -640 -409 359 636 116 -636 -511 241
4049 241 629 345 -378 -587 -105 581 480 -159 -664 -338 410 626 -6 -630 -487 189 711 338 -444 -618
4069 -618 -20 549 483 -264 -678 -213 488 648 8 -629 -447 286 652 179 -519 -555 66 673 404 -326 -660
$$ packed form
3925f29L3P28N59l22p74k74O03O65l5p46n30L45Q21K32o10o82N0Q15M94m21q27
3946e05j32N93O85j22p56m73M82P17J17n90o81J18Q27M15l98p90j00O37O17k37
3966D24p30l90N69P17L3p63n23K32Q19L03n46p09o0P31O45l19q13l09N96O69n5
3987E21p13n35L27P89K12n10o70K7P25M87l44p08k37N67O96p4p47m56L90P55J44
4008F46p04n80J55P86L20l82p45r5N89O47j86p25m19M76O75J59o69n80K67P21
4028C56K82m72p13pO03O15k97o83l22N25O32po59m93K31P68K77n20p52J25P52
4049B41L88k84p23k09M82O86j01o39n05L26P48K16o32o24J43O76N22l73p82j74
4069f18N98N69o6p47m14M65P01J60o40o37J82P33L66m73o98l6O21O07k69p30l34
$$ plain form
4090 -660 -171 531 540 -142 -630 -398 371 667 180 -490 -483 69 629 389 -390 -677 -56 554 525 -165 -642 -348
4112 -348 385 677 22 -606 -515 227 618 268 -438 -661 -69 574 488 -216 -681 -261 490 634 0 -650 -483
4133 -483 269 641 212 -501 -554 57 642 430 -274 -677 -218 453 549 -124 -649 -397 388 637 191 -497 -489
4154 -489 140 579 374 -373 -590 -106 573 500 -124 -676 -320 403 525 59 -584 -500 201 574 311 -389 -588
4175 -588 -12 600 405 -210 -616 -231 443 544 -14 -564 -435 249 596 241 -480 -579 1 598 370 -319
4195 -319 -622 -171 464 547 -61 -565 -397 280 620 190 -503 -483 138 578 301 -338 -557 -145 516 470 -187
4216 -187 -572 -262 372 547 86 -540 -422 160 597 291 -378 -584 -92 512 421 -191 -602 -266 417 572
4236 572 -37 -549 -444 195 623 264 -409 -515 3 536 421 -255 -583 -252 494 580 -4 -582 -365 264
$$ packed form
4090f60M89P02Ro82m88K32P69K96m87o70PN52N60k40p79k87O21O10k9o90m77K94
4112c48P33K92o55o28R1P42L91l50p06k23N92O43q6p04m65M20P51J44o34o50J67
4133d83P52L72m29p13n3O11N85k12p04m03M59O71R6o73n25K52P85K49m46o88Q
4154d89O29M39k05p47k17M84O79p3o24n52L56P23J22m66o43Q4P01L73k63p00j99
4175e88N76O12j95o15m06L85O74J01n58n50J29O84L47l55p21r9N80N97k28o89
4195c19l03M51O35Q3o08n04J68O77L40m30o93K0O21M40k77o39k19M12O61m6o57
4216a87l85L10O34J75m61o26J18N82M37l06o69k06M92O04r1o12m11L36O83J55
4236E72o09n12J05O39M28l59o73j06N18N33j15o76l28L31P46Q6n84n78K17O29
$$ plain form
4256 264 587 146 -499 -526 51 535 347 -327 -525 -162 514 506 -114 -581 -367 357 604 101 -527 -469 139
4277 139 573 320 -346 -596 -53 543 475 -211 -644 -223 402 575 29 -516 -455 270 610 271 -466 -586 16
4298 16 640 438 -266 -653 -195 486 470 -77 -563 -450 267 584 166 -468 -543 95 613 357 -314 -684 -148
4319 -148 495 477 -112 -594 -327 332 584 119 -549 -474 166 604 300 -350 -526 -41 506 404 -183 -619 -276
4340 -276 377 565 4 -531 -475 178 609 212 -389 -555 32 500 402 -243 -590 -200 429 502 -76 -574 -384
4361 -384 307 573 176 -470 -479 70 561 315 -342 -571 -96 473 493 -75 -540 -317 316 517 111 -472 -452
4382 -452 164 555 284 -332 -540 14 509 363 -144 -590 -277 316 504 35 -512 -436 174 521 272 -373
4402 -373 -499 44 573 429 -184 -602 -226 373 485 -58 -520 -336 232 578 189 -387 -508 33 513 380
$$ packed form
4256B64L23m41o45k7N77M84j88o74j98L63O76qo20m67K14P24K47n03o28N8O08
4277A39M34k53o66k50N43N96o8o86m33M21O25J73n46n45O1P25L40l39p37j20O02
4298A6O24k02p04l87M58O81j6n47m86J13P17L17m18o34p5O38N18k56o71l70N36
4319a48O43j8n89m82K67O59K52m65o68P5O40M38l04o50j76M85N47j02n87m36L43
4340b76O53J88n61n35N6O53M31l97o01j66N87M68r8o45l47L90O29P3n78m98J90
4361c84O91K66l97o46rN49M91k46o57k29M75N69K0n68m65K23O33K01m06n83K0
4382d52O16L91k71o16k08N54M95j46n07m46L13N93J88m69n47P6O10L47k49o45
4402c73j26N43N29j44o13m18L76N99J12n43m62J84N68L46l89n76j21N41M80j33
$$ plain form
4422 380 -243 -579 -193 481 517 -54 -487 -332 263 555 133 -402 -461 115 512 347 -321 -551 -95 432 440
4443 440 -126 -519 -309 339 552 121 -486 -466 129 567 253 -355 -537 -58 442 375 -183 -585 -255 380 578
4464 578 -24 -504 -403 255 593 161 -355 -463 102 523 404 -216 -524 -155 478 547 -119 -568 -398 294
4484 294 584 175 -414 -448 78 527 341 -284 -571 -131 476 412 -127 -537 -348 288 562 81 -482 -407 166
4505 166 591 260 -361 -515 -29 499 411 -207 -591 -230 426 511 -26 -494 -401 200 565 184 -421 -478 86
4526 86 504 383 -242 -542 -153 430 503 -92 -511 -288 234 549 97 -443 -462 1 516 336 -264 -522 -120
4547 -120 452 469 -73 -523 -298 342 527 130 -430 -421 115 509 280 -366 -508 -90 457 373 -157 -508 -244
4568 -244 382 552 -10 -460 -380 246 551 172 -336 -457 26 464 381 -182 -560 -203 360 504 3 -516 -368
$$ packed form
4422C80o23l36L86O74L6n71m33J55N95K92m22n35n9N76L97j65o68k30M56N27Q
4443D40n66l93K10O48K13m31o07K0N95M38l14o08j82M79N00o7n58m02L30O35J98
4464E78o02m80J01O58L38m32n16j08N65M21j19o20l08L69O33O9o66m49J70O92
4484B94K90m09n89l4N26M49j86o25k87M40O07o4n39m10J89O36K74m81n63P5N73
4505A66M25l31o21j54M86N28q8o18l84L61O56Q5n37m68R3O01L65l81o05n7N64
4526H6M18j21o25l00L89N83P3n95m19K23N22L15m52n40j9M63N15j80o00k58M02
4547a20N72J7n42m50K25O40J85l97n60RN36L94k29o46j42M18N47q4n30l51K64
4568b44O26J70n62m50Q0O26L05l79n08j21M83M38q3n63l78L57N63J44n01n19J48
$$ plain form
4589 -368 237 545 167 -438 -493 21 514 293 -218 -543 -179 423 409 -56 -494 -300 248 527 169 -417 -501
4610 -501 69 541 213 -308 -529 -102 456 364 -84 -564 -293 325 465 64 -430 -409 91 507 298 -339 -467
4631 -467 1 464 389 -188 -559 -218 382 427 4 -487 -342 221 534 166 -337 -477 -9 526 356 -196 -537
4652 -537 -187 393 479 -118 -542 -274 321 537 146 -391 -421 105 513 333 -361 -483 -124 458 471 -109 -539
4673 -539 -319 370 514 27 -578 -404 163 516 269 -284 -437 -42 428 340 -203 -582 -254 320 537 -15
4693 -15 -485 -356 222 531 178 -401 -486 146 538 320 -228 -503 -237 426 444 -85 -542 -367 286 480 99
4714 99 -421 -472 76 517 245 -314 -542 -82 449 418 -66 -490 -211 312 458 98 -455 -437 146 527 259
4735 259 -355 -520 -45 466 341 -202 -492 -166 350 434 43 -411 -317 164 497 171 -333 -461 3 513 351
$$ packed form
4589c68O05L08l78o05n5N14M93k21n11l25L64O02j4m65m38J94N48K79l58n86q4
4610e01N70M72l28n21k21M27N58r2m48m80K71O18J40m01m94K1N00M16k09o37j28
4631d67M68M63p5n77l71L41O00M5m23m91J45N63L13l68n03j40M68N35j70n52l41
4652e37L50N80Q6n97m24K68N95K16l91n37l0N26M08j80o94j22L59N82J3n80m30
4673e39K20O89J44m87o05J74N67L53k47n53j53L95M70q8n43l79L28N74K17n52
4693a5m70J29N78L09l53n79q5O32L92k18n48k75K66O63J8n29m57J75O53J94l81
4714I9n20n1N48M41k72n59k28M60N31l1m84m24K79N23J46l60n53J8N83L81k68
4735B59o14j65M75N11j25n43k90L26N16Q4l91m54R4M81L33l26n04j28M64N10j62
$$ plain form
4756 351 -188 -545 -154 372 411 -53 -445 -259 201 480 125 -418 -394 73 433 273 -207 -515 -131 441 405
4777 405 -98 -489 -283 285 439 20 -465 -367 125 420 243 -291 -500 -76 359 318 -121 -422 -231 375 492
4798 492 14 -402 -392 180 465 201 -285 -433 29 481 349 -214 -435 -219 341 497 -20 -428 -358 200 490
4819 490 170 -399 -439 109 445 292 -219 -433 -122 337 428 -90 -448 -266 267 450 84 -410 -345 54 466
4840 466 240 -337 -450 -67 439 324 -95 -454 -232 336 466 28 -463 -355 99 566 233 -269 -504 -29
4860 -29 458 342 -277 -504 -172 371 418 -37 -479 -310 226 457 133 -366 -410 66 527 328 -245 -538 -97
4881 -97 341 398 -68 -483 -241 306 475 101 -441 -365 136 442 255 -301 -427 -10 432 427 -185 -510 -175 311
4903 311 467 31 -412 -307 191 438 121 -383 -400 -25 407 291 -88 -422 -174 363 399 -52 -461 -333 212
$$ packed form
4756C51n39l57L91N26L9m64l92J86M60K79l55n43K4M67L60j60m80l08L84N72l6
4777D05n03l91K06N68J54m19m85R8M92K95j77n34k09M24M35m1m39l01J91O06J17
4798D92m78m16J0N72K85k64m86j48M62M52j32n63k21K16N60J56n17m08P0N58K90
4819D90l20n69m0N48L36j53n11k14L11M59R1n18l58J82N33J83l66m94O5L99M12
4840D66k26n77j13L83N06j15m19l59K22N68J30m38m91J08M54M67l33n02k35M75
4860b9M87j16o19k27L32N43M7m55m42J69N36K31l24m99m4M76M61j99n73k93M41
4881i7M38N7m66m15K42N47J69l74n42P6N01L06j87n56j26M17M42no12l25L35M86
4903C11J56m36m43J05M98K47l17n04j7L75M32j16l79l34K48N37L6m51m09J28N45
$$ plain form
4924 212 470 81 -367 -374 69 472 273 -273 -521 -138 329 355 -63 -415 -255 257 428 72 -472 -377 104
4945 104 420 185 -294 -359 -15 449 272 -126 -429 -220 262 379 76 -398 -313 139 439 168 -324 -449 -19
4966 -19 392 312 -167 -411 -123 351 401 -63 -326 -283 156 438 236 -321 -392 58 471 308 -232 -429 -162 345
4988 345 383 -77 -432 -231 295 415 134 -369 -404 83 449 311 -249 -409 -82 368 372 -122 -462 -283 251
5009 251 442 34 -379 -332 178 410 155 -341 -379 -24 382 340 -137 -461 -183 316 441 20 -464 -301 230
5030 230 492 151 -387 -416 47 397 288 -274 -471 -124 364 327 -57 -419 -288 226 473 89 -409 -362 114
5051 114 514 233 -227 -440 -20 362 359 -145 -489 -170 281 436 10 -438 -371 199 470 170 -315 -442 51
5072 51 423 321 -166 -373 -144 272 371 -12 -373 -330 189 448 238 -338 -380 27 430 246 -231 -396 -65
$$ packed form
4924B12K58l89m48pM43M03j99n46k48L83M67K6m18l52J60N12J71l56n44R5M81
4945A04L16k35m79o5L44M64j77l98l03K09M82J17l03m74Q5M52L00k71m92j25M30
4966a9M11q0m79k44K88M74N0m64k63M3M39K82k02n57p1M50M13j63n40j97K67N07
4988C45L8m60l55K01N26J20k81n03l5M87L66j38n60j60L27M50Mm94l40J79N34
5009B51J91m08m13M7N10K32k55m96l8L55M06m2m77l24K78M99J25m21m84J63N31
5030B30K62l41n38k9M63L50j09n62j97L47M88l7l84l62J31N14K47l84m98M7M76
5051A14M00k81m60k13M20L82ln04l44L19M51J55m26m48O7N70K71l00m85j27M93
5072E1L72j02m87k07K29M16R9l83l61M3N19K59k10n76m2M07M03j84m77j65L31
$$ plain form
5093 -65 382 334 -77 -404 -254 223 353 32 -353 -291 69 344 237 -257 -460 -94 337 284 -193 -458 -215
5114 -215 310 361 51 -336 -301 115 370 160 -237 -373 -34 382 331 -104 -418 -201 252 384 -1 -384 -224
5135 -224 171 405 109 -311 -328 5 311 208 -130 -345 -126 225 407 65 -389 -256 189 379 37 -357
5155 -357 -376 46 418 245 -213 -375 -52 330 333 -45 -367 -221 222 381 83 -400 -338 103 495 177 -299
5176 -299 -370 -65 363 277 -124 -326 -153 273 347 94 -378 -298 141 420 190 -337 -447 33 444 324 -199
5197 -199 -395 -176 375 388 -81 -398 -283 194 395 168 -329 -371 22 452 302 -208 -488 -108 396 390 -89
5218 -89 -476 -188 271 412 66 -374 -297 82 400 195 -213 -384 -76 381 313 -161 -451 -180 352 394 -58
5239 -58 -394 -287 140 351 167 -288 -346 41 353 244 -178 -396 -136 370 436 -60 -438 -295 266 404 96
$$ packed form
5093f5M47m8m11l27J50M77J30l21l85O2L60K75j07m94k03L66M31n3m77k65K43
5114b15N25N1l10l87L5M16K55k10l97j36L39M16n1m35l14K17M53J32l85l83J60
5135b24L95K34k96m20j7L33L06j03l38k15K19L51J82l42m54J33M45J90l42l94
5155c57j9M22L72j73m58j62L23L82Ll78l22J46M43J59k98m83O2M41L92l18m76
5176b99p1L05M28q6m01k02J73M26P4k53m72Q0M39K79k30n27j10M80M11j20n23
5197a99j96K19N51J3m69l17J15M77K01k27m97m2L93M30j50n10k80L80N04om79
5218h9l87K88M59J41l46m40P7L79L18k05m08j71L08M57o8m74k90K71N32M2m52
5239e8l36J07M27K11j84m55n8L87L12j09m22k18K60N06O6m96l78J43N61J38l08
$$ plain form
5260 96 -344 -282 96 354 168 -227 -386 -83 314 312 -89 -392 -219 300 404 80 -357 -361 157 414 191 -303
5282 -303 -416 51 331 230 -185 -352 -174 222 307 69 -379 -282 165 419 156 -281 -326 11 386 213 -231
5303 -231 -338 -126 291 268 -1 -266 -186 134 362 148 -337 -371 -44 392 253 -162 -389 -48 314 357 -83
5324 -83 -322 -221 211 313 78 -233 -281 66 342 209 -248 -425 -122 339 293 -93 -387 -200 246 290 43
5345 43 -298 -265 130 356 268 -213 -363 -43 295 309 -98 -397 -169 242 483 60 -338 -283 111 395 86 -322
5367 -322 -342 -11 364 249 -87 -359 -166 238 394 -12 -393 -338 240 404 88 -346 -338 57 319 174 -201
5388 -201 -388 -47 326 374 -55 -422 -242 207 409 141 -360 -359 95 456 272 -281 -359 -23 390 261 -152
5409 -152 -436 -206 311 377 62 -296 -304 168 447 143 -340 -396 16 509 283 -184 -457 -65 340 270 -110 -365
$$ packed form
5260I6m40O2L78K58j86l95j59L03L97km01l03J73N19J04l24m37mN18K57k23m94
5282c03j13M67K80j01m15j67J78L96Q5k38m48R7M47K54k63m37m5L37L75j73m44
5303b31j07K12M17k3k69k65Q0L20K28k14m85l4L27M36j39m15k27L41L62M3m40
5324h3k39J01M32J02k35l11m8L47K76j33m57j77L03M61m6l86k94J87M46M4k47
5345D3l41L3L95K26q8m81j50L20L38J4m07k99K28M11K41m23l98N5L94K84l09m08
5367c22k0L31L75j15l36k72J93M04J56m06l81N5N78J64l16m34QL95K62j45l75
5388b01j87L41L73M8m29l67J80M49K02k68n01JM54L61j84n53p8L36M13j29m13
5409a52k84K30N17O6l15l58qM72K79l04m83n6M12M93k26m67k73L92M05p0l80k55
$$ plain form
5431 -365 -256 140 370 84 -311 -372 55 371 225 -243 -436 -77 391 275 -150 -358 -163 306 318 -61 -322
5452 -322 -232 89 351 234 -233 -334 -49 344 280 -153 -414 -134 321 327 -54 -370 -204 182 286 57 -242
5473 -242 -251 41 334 256 -104 -356 -148 269 307 -42 -408 -222 181 349 31 -240 -244 52 305 136 -106 -282
5495 -282 -92 236 308 -35 -365 -224 146 337 131 -275 -345 85 324 156 -186 -249 -21 233 212 -75 -277
5516 -277 -170 86 311 95 -241 -342 12 348 198 -258 -363 -56 252 272 -203 -371 -183 228 273 6 -335
5537 -335 -240 80 329 238 -233 -408 -13 409 290 -149 -375 -64 294 339 -38 -359 -251 199 344 123 -263
5558 -263 -321 25 358 297 -247 -382 -81 345 337 -86 -488 -198 268 430 21 -325 -229 130 372 157 -232 -360
5580 -360 -24 364 361 -163 -402 -185 310 446 -63 -481 -305 223 501 89 -343 -300 109 342 268 -136 -364
$$ packed form
5431c65J09L96K30k86l95o1M27L16j46m68j93L59M68j16m25k08J95M69J2l79k61
5452c22R0L21K62j17m67j01K85L93o4m33k61K80M55Ol81l16J66L86J04k29k99
5473b42rK92K93p8l60k52K08M17L8l49l66J86M03J68l18k71mK96K53j69k42j76
5495b82J90L28P2l43l30J41L70J91k06m06p0M30K39j68l42o3K28K54k1k87k02
5516b77J07K56K25k16l36j01L54L36j50m56j05L07L08K0m75j68J88M11M5k67l41
5537c35R5L20K49r1m71j75L95M22j19m39k26L11L58M5l77l21J08M50J45k21l86
5558b63n8L46L33o1n44j35L01M26qm23m02K90M66J62m09l46R6L59K42k15l89j28
5580c60L36L88ln24k39K17M95J36n09m18J76N28K78m12m32M3M09K33p4m04k28
$$ plain form
5601 -364 -105 314 334 -33 -409 -294 249 406 86 -399 -325 158 390 134 -255 -322 12 331 227 -127 -334
5622 -334 -189 222 289 41 -301 -285 110 455 128 -348 -354 64 356 131 -214 -320 -24 245 189 -49 -290 -201
5644 -201 147 394 115 -280 -275 19 329 205 -238 -338 24 284 242 -76 -279 -83 159 212 33 -214 -265 -1
5666 -1 263 210 -141 -385 -68 329 238 -137 -316 -152 201 238 20 -270 -93 9 277 192 -107 -312 -135 263
5688 263 266 -34 -309 -187 205 332 2 -298 -189 108 266 118 -147 -197 -44 168 231 -69 -346 -200 180
5709 180 362 32 -333 -260 170 356 129 -298 -323 8 273 175 -103 -262 -105 178 293 61 -293 -304 128
5730 128 442 209 -295 -350 32 404 179 -247 -356 -32 261 326 -35 -318 -167 178 356 75 -278 -341 57
5751 57 431 249 -264 -428 -35 491 267 -244 -433 -56 295 334 -67 -355 -206 122 369 149 -296 -400 -24
$$ packed form
5601c64K59M19K0l67l76J15N43J57l20m85P4M83K32k56l89o7L34L19j04l54k07
5622c34J45M11O7k48l42J6L95L45l27m76oM18K92k25l45j06K96K69n6k38k41Q9
5644b01L48K47k79l95NK94L10j24m43j00L62K60m2l18k03J96K42N3j79k47n1K64
5666aK64n3l51k44L17L97r1l75j79J64L53L7k18k90J77J02K68q5k99k05J77L98
5688B63Ll00k75J22L92J27l30l00J09K97J58j48k65n0J53K12O3l00k77J46L80
5709A80J82l30l65P3M30J86k27m27k5L31K65r8k78j59J57K83J15k32l54j1M32
5730A28L14k33n04n5L82L72k25m26j09L24K93O5l61k83J51L45J78k81l53o3L98
5751E7L74j82n13j64L93N26k24n11j89L77L51L9m01k88J49L28K47k20m45j04L76
$$ plain form
5772 -24 380 279 -235 -452 -68 391 300 -121 -424 -156 287 316 -37 -311 -245 97 287 241 -196 -350 -50 387
5794 387 325 -120 -384 -116 305 293 -99 -350 -144 220 329 18 -268 -218 19 278 195 -121 -315 -142 341
5815 341 380 -74 -379 -156 212 307 -29 -322 -209 78 247 39 -97 -175 -28 255 266 26 -289 -168 171
5836 171 353 -2 -289 -171 120 310 89 -270 -239 70 231 143 -56 -174 -86 133 238 100 -215 -313 61
5857 61 278 143 -234 -316 3 308 127 -121 -263 -79 152 185 73 -153 -151 -42 199 137 -101 -316 -87 367
5879 367 188 -96 -289 -44 240 257 -7 -269 -197 37 224 120 -105 -279 -18 256 260 -70 -309 -226 225 318
5901 318 -48 -331 -256 172 278 76 -208 -272 -34 259 224 -61 -305 -137 238 385 -49 -443 -283 228 374
5922 374 112 -356 -255 141 293 112 -187 -287 -96 242 272 -63 -356 -209 250 410 51 -353 -305 162 440
$$ packed form
5772b4M04j01n14k17L84M59r1m21l03K68M43K9l53k74O6L42J90m6m37j54L00M37
5794C87o2m45k64K68M21j2l92k51K06L64J09l11k86N0K37K59q3l16j94J73M83
5815C41L9m54l05K23L68R5l36k93J13K87J69k08j36p8J47K83J1k40l15J21L39
5836A71J82l55k87J18K91J90k21l59L1L09J61q8j99j18Q8K19J05j38l15r8L74
5857F1K17j35l77q2L19L05j81k48j42J84K31L3j12k26KJ09K41o2k38k15K29M54
5879C67j79k84j93K45K84J7k64k62P2K34J87j04k25j74K61K74Ml30k39Q3M51R3
5901C18l66k83P5M28J06k02k84o4K38K93l5k85k44J68L75J47m34l94J60N11J46
5922C74k62m68J01L96J52j81k99j00J91L38L0l35k93J47M59J60l59m04M8M67K78
$$ plain form
5943 440 78 -315 -240 91 411 217 -265 -354 -63 266 280 -66 -344 -282 149 384 137 -345 -277 133 402 217
5965 217 -375 -311 85 387 180 -222 -334 -119 221 250 35 -251 -215 132 335 132 -332 -360 35 412 190
5986 190 -213 -324 47 312 213 -141 -241 -96 129 203 47 -240 -212 84 305 158 -273 -351 4 351 189
6007 189 -184 -260 4 293 119 -65 -145 -97 102 120 84 -106 -151 -69 284 186 -19 -290 -105 247 158 -115 -161
6030 -161 -69 107 142 -26 -110 -153 -9 91 126 -24 -238 -132 135 221 5 -250 -191 113 211 111 -148 -166 49
6053 49 155 104 30 -98 -176 39 195 97 -159 -234 32 254 187 -165 -310 10 282 179 -103 -221 -127 154 202
6076 202 3 -188 -236 5 264 170 -148 -336 -100 281 217 -188 -330 -17 272 260 -112 -277 -98 145 294
6097 294 87 -227 -282 -35 313 287 -141 -385 -92 335 347 -127 -407 -71 269 297 -66 -314 -196 182 249 133
$$ packed form
5943D40l62l93P5L31L20j94m82q9K91L29J4l46k78O2M31K35k47m82O8M10K69j85
5965B17n92O4L96L02k07m02j12K15L40K9k15k86L6L47K03k03m64k8L95L77k22
5986A90m03j11L71K65r9l54j00J45K25P4j56k87K8K96K21j47m31p8L55L47j62
6007A89l73p6K64K89j74j84q0M8J99J8l6j90m5Q2L53r8k05k71J85L52q9k73m6
6030a61R2J76L5j68q4m3J44J00L5j50k14J06K67Q6k16k55N9L04R8j00k59j8K15
6053D9J06n1p4j28p8K15J56r8k56p5K66K22o7l52j45L20K72j03k82j18R4K81M8
6076B02j99j91m8K41K59r4l18j88K36L81o4m05j42L13K89j2l72j65J79K43J49
6097B94k07l14n5K47L48k6m28k44K93M27J2m74k80L36L40K8l63k48J18L78O7j16
$$ plain form
6119 133 -193 -280 -60 323 341 -180 -464 -169 306 345 -107 -413 -177 311 273 -69 -311 -198 179 284 122
6140 122 -206 -261 -45 316 296 -87 -360 -207 268 345 -60 -337 -188 278 295 31 -292 -166 79 276 120
6161 120 -161 -246 -59 227 277 -23 -359 -159 232 363 -32 -343 -208 153 335 5 -268 -178 123 167 75 -96
6183 -96 -191 -119 62 176 61 -231 -266 109 282 18 -223 -167 69 241 36 -186 -100 69 87 66 -26 -83 -116 -29
6207 -29 139 75 -125 -141 64 265 165 -158 -129 56 158 115 -118 -112 3 78 85 66 -52 -198 -85 153 205 1
6231 1 -193 -120 212 200 -20 -166 -59 104 94 33 -21 -52 -89 74 159 81 -172 -172 66 329 84 -228 -200 106 285
6256 285 58 -196 -209 -12 189 148 -50 -188 -125 113 257 2 -222 -262 32 352 145 -241 -290 62 343 125
6278 125 -230 -272 -10 270 168 -61 -235 -171 111 272 117 -278 -305 87 416 132 -304 -370 67 364 170
$$ packed form
6119A33l26q7K20L83J8n21k84K95M75L9m52l06K36M88l8l42k42J13L77J05j62
6140A22l28n5K16L61k0l83k73J53M75P7m05k77J49M66J7k64l23J26K45J97j56
6161A20k81q5J87K86N0l00l36K00L91J31l95l11J35L61J82l30k73R0L01M4r2j71
6183i6r5P2J81J14j15k92l5L75J73k64k41N6K36J72k05k22Q6J69J8k1r2n7l3Q7
6207b9J68o4k00j6K05K01j00l23K9J85J02m3k33OJ15P5Pj9j18j46J13K38N2k04
6231Aj94P3L32j2k20j46J07J63j0o1n4l1l7J63Q5p8k53%K38K63k45l12K8L06J79
6256B85k27k54j3J97K01m1j98j38O3K38J44k55k24m0K94L20k07l86m9L52K81k18
6278A25l55m2K62K80j02k29j74O4K82J61j55l95k7L92L29k84m36o6M37K97j94
$$ plain form
6299 170 -253 -276 -24 230 173 9 -229 -161 158 293 133 -277 -363 55 394 234 -278 -365 68 392 223 -227
6321 -227 -352 4 257 185 -8 -250 -116 89 294 109 -258 -339 -1 359 175 -188 -319 42 386 221 -295
6342 -295 -348 18 219 166 -38 -185 -126 131 188 48 -162 -329 -34 226 210 -190 -281 7 307 148 -177 -219
6364 -219 50 192 72 -104 -90 -69 62 71 79 -20 -191 -47 185 182 -58 -220 -69 179 97 -33 -139 -30 94
6387 94 84 -29 -21 14 -16 39 70 60 -74 -199 28 173 4 -124 -56 115 144 16 -120 -51 61 0 7 129 -9
6412 -9 -94 -67 88 137 -93 -226 -56 103 96 -65 -186 -4 45 9 -54 -122 -82 -28 108 169 -28 -214 -166 148 243
6437 243 -54 -341 -49 203 282 -6 -240 -77 182 136 51 -106 -146 8 161 245 -75 -262 -175 221 337 20
6459 20 -337 -252 231 307 -13 -275 -159 161 251 54 -195 -252 -25 182 209 -80 -233 -175 192 325 -55 -406
$$ packed form
6299A70m23k3K52K54n7j64k38O8L19J35j60m10q6M18L39j60n12q7M33L24j69m50
6321b27j25L56K53p2j93k42J34K05K05j85l67q1L38L60j84l63j31L61L44j65n16
6342b95n3L66K01n3k04j47N9K57N7j40k10j67K95K60j6m00r1K88L00j59l25m2
6364b19K69J42j20j76J4K1J31RQr9j71J44K32lk40j62J51K48q2j30j06J09J24
6387I4j0j13QL5l0N5L1j0j34j25K27J45j69j28O8J71K9j28j36O9J12o1PJ22j38
6412iq5K7J55M9k30j33J70J59pj61j21J82M9l6o3o8M0N4J36O1j97j86M8L14R5
6437B43k97k87K92K52P9k88k34J63K59m6q5j57m0J54J53Q4l20j87Q7L96J16l17
6459B0l57Q5M83P6l20k62J16L20R0j97k49n7K27K07K7k89j53N8L67J33l80l51
$$ plain form
6481 -406 -276 268 398 -34 -354 -192 157 286 76 -194 -184 78 212 122 -94 -264 -133 228 345 -11 -404
6502 -404 -211 206 381 -23 -350 -225 194 326 31 -271 -171 13 223 141 -63 -240 -236 166 252 -8 -301
6523 -301 -247 203 322 -38 -366 -160 190 231 -7 -212 -109 51 135 59 -40 -202 -134 91 233 88 -203 -197 113
6546 113 244 -10 -230 -89 204 150 -63 -177 -66 85 39 31 19 -49 -29 -12 212 135 -119 -149 7 161 1
6569 1 -182 -89 96 128 -98 -146 62 -16 -84 -75 98 38 -110 -34 56 159 -7 -148 -66 54 117 -107 -31 64 68 -47
6595 -47 15 56 -15 -171 -93 111 121 -153 -139 18 204 74 -194 -125 83 173 63 3 -116 8 54 134 51 -63
6619 -63 -215 -55 194 198 -163 -287 -3 312 136 -201 -270 19 152 105 -78 -167 -23 63 178 57 -157 -270
6641 -270 -24 290 224 -175 -325 -2 384 237 -230 -325 -31 328 179 -141 -218 -93 140 187 10 -179 -243 -49
$$ packed form
6481d06J30N44J30m32l20J62L49J29k10k70J0K62J34r0k16j70J31L61J17l56l93
6502d04J93M17J75m04l27J25M19J32k95l02J00J84K10q2k04j77MM02Q6k60k93
6523c01N4M50J19l60l28K06L50M1k38k05J03J60Q4p6r9j62O8K25J42j45k91OL10
6546A13J31k54k20J41K93n4k13j14J11J51m6qj2o8K0J7K24p7k54l0J56J54j60
6569Aj83R3J85L2k26m8K08p8o8RJ73o0j48P6R0J03j66j41Q2J20O3k24P6R5Mj15
6595d7O2M1p1j56P8K04J0k74J4J57J86j30k68O9K08R0j10o0j19J24M6Q0q3j14
6619f3j52J60K49Ml61j24K84L15j76l37o9K89J33m7j83q9J44Q6J15j21k14j13
6641b70K46L14o6l99j50L23L86j47m67r5K94L59j49l20p7J25K33M7j77j89o4J94
$$ plain form
6663 -49 370 254 -178 -391 18 324 223 -159 -405 -17 305 215 -111 -203 -50 183 255 39 -192 -199 -19 293
6685 293 254 -171 -328 30 432 231 -228 -382 -45 326 158 -157 -323 -27 157 136 -20 -222 -98 -53 204
6706 204 147 -99 -273 -37 292 275 -198 -296 26 267 125 -136 -177 -12 184 19 -59 -121 -100 -4 137 153 -71
6729 -71 -184 -50 214 114 -195 -183 -11 223 106 -132 -154 76 136 3 -23 0 -40 -25 62 70 -5 -139 -56 109
6753 109 164 -65 -123 -22 110 58 -112 -21 74 57 -84 -92 83 55 -130 -128 62 156 8 -134 -88 144 67 -36 -24
6778 -24 7 -27 -30 79 69 -80 -116 -22 188 90 -148 -208 73 250 -13 -207 -133 98 164 5 -91 -120 18 73 53
6803 53 50 -132 -167 15 199 82 -157 -221 82 359 73 -308 -149 120 264 16 -153 -168 15 128 68 28 -148
6826 -148 -160 94 302 105 -316 -267 164 341 54 -331 -233 194 339 58 -265 -189 27 229 147 -130 -219 -171
$$ packed form
6663d9M19j16m32k13M09L06j01l82k46L88L22r0l26r2J53K33P2k16k31pJ80L12
6685B93l9m25j57L58M02k01m59j54L37L71j68l15j66K96J84k1j56k02J24M5K57
6706B04n7k46j74K36L29j7m73r8L22K41j42k61m1J65J96j65p8o2K1R6J41J6k24
6729g1j13J34K64j00l09J2J72K34j17k38k2K30O0j33k6K3m0J5Q7Qp5j34Q3J65
6753A09N5k29n8J01J32n2j70R1R5j7j41qJ75k8j85KJ90R4j48j42M6K32p7j03J2
6778b4L1l4lJ09j0j49l6R4K10r8k38o0K81J77k63j94P4K31O6j59r6k9J38N5k0
6803E3lj82l5J82J84j17k39o4L03K77k86l81J59K69J44k48j69j5J83J13o0m0j76
6826a48j2K54K08j97m21M9M31J77k87l85R8M27J45k81l23P6K16K02q2k77q9M8
$$ plain form
6848 -171 116 258 17 -270 -321 146 424 56 -324 -262 207 280 59 -268 -186 124 212 49 -81 -133 -20 85
6870 85 222 16 -283 -220 138 312 45 -310 -228 177 366 32 -244 -230 151 224 41 -140 -121 -38 94 112 1
6893 1 -217 -135 141 285 25 -338 -193 166 294 -37 -248 -149 166 106 -60 -205 -73 41 29 105 6 -98 -97
6916 -97 25 182 -11 -175 -145 134 175 -24 -212 -68 106 76 -107 -111 -3 98 -39 5 88 -10 -72 -55 63 76
6940 76 -78 -117 47 48 -29 -59 15 108 -42 -113 17 79 84 -96 -86 105 149 -58 -172 8 111 86 -14 -116 40
6965 40 14 31 18 21 -80 -132 76 185 85 -183 -149 150 237 -127 -296 -47 265 147 -74 -141 -34 95 110 46
6989 46 -40 -173 -98 130 208 -43 -311 -93 207 253 -118 -352 -147 248 191 -54 -264 -91 190 195 80 -117 -182
7012 -182 5 259 155 -63 -253 -69 294 311 -96 -431 -160 298 289 -120 -275 -93 182 208 11 -178 -183 27
$$ packed form
6848a71K87J42k41k87n1M67K78l68l80O2M69P3k21l27Q2L10Q8j63j30n2J13J05
6870H5J37k06k99O3L58J74k67l55Q2M05J89l34k76J4L81P3j83j81J9Q3J32J8j11
6893Ak18Q2K76J44k60l63J45L59J28l31k11R9L15o0j66j45J32J14j2P6r9j04J
6916i7J22J57j93j64L0K79M1j99j88J44J74l0j83mJ08J01j37M4Q3r8o2J7J18J3
6940G6j54l9J64Jp7l0P4R3j50p1J30O2Nj80J0J91M4k07j14J80J03k5j00j02J56
6965D0k6J7j3Lj01n2K08J09j00k68L4K99Q7l64j69K49L12j18k21o7J07J29J5o4
6989D6q6j33P5K28P8k51k68K18L00M6l71k34K05L95n7k45k10J73K81Nj15j97o5
7012a82J87K54j04k18j90J84L63J7m07l35K71M58rm09j55J82K75K6j97j89nK10
$$ plain form
7034 27 214 155 -52 -194 -93 250 308 -86 -384 -136 336 244 -142 -339 -77 212 199 -94 -219 -121 104 160
7056 160 111 -48 -176 -54 255 178 -136 -359 -59 261 255 -162 -297 -37 256 106 -166 -227 -74 129 137 3
7078 3 -29 -166 -4 72 142 -132 -284 -62 238 159 -165 -208 54 224 84 -123 -174 17 82 -12 -74 -34 -73 -39 25
7103 25 104 -11 -115 -64 161 41 -121 -162 78 149 20 -160 -72 123 58 -147 -32 18 83 -16 -73 19 64 18 -38
7128 -38 -2 -17 -100 -57 10 77 -57 -108 7 123 25 -174 -67 196 126 -79 -133 26 120 65 -136 -98 30 49 3
7153 3 -9 -14 -113 -97 114 129 -45 -207 -88 244 150 -187 -226 9 230 124 -205 -195 7 182 57 -49 -85 -54
7177 -54 0 162 164 -124 -256 -33 304 172 -210 -304 35 301 151 -184 -268 79 192 28 -127 -143 -23 82
7199 82 138 73 -177 -255 32 335 136 -244 -329 25 368 149 -264 -298 62 231 29 -165 -223 -51 181 114 22
$$ packed form
7034B7J87n9k07j42J01L43N8l94k98K48M72r2l86j97K62K89j3k93j25R8K25N6
7056A60m9j59j28J22L09p7l14k23L00L20om17j35K60K93j50k72o1J53K03Qj34
7078Cl2j37J62P6P0k74j52K22L00p9l24m3K62J70j40k07n1J91O5r4o2M0l9L4O4
7103B5P9j15j04N1K25j20j62m1K40P1j29j80Q8J95o5k05J15N0O5r9n7R2M5m6n6
7128c8L6j5q3M3O7O7j34n1J15J16r8j99J07K63p0k05n4J59R4n5k01L8J28J9m6
7153Cj2nr9J6K11J5j74j62J19L32r4l37l9K35K21j06l29J0K02J75j25j06l6L1
7177e4N4J62Kk88j32K23L37j32l82r4L39K66j50l35q4L47J13j64j55j6J20J05
7199H2N6o5k50p8K87L03j99l80q5L54L43k19m13l4L60J69k02j94n8J72K32o7r2
$$ plain form
7222 22 -190 -260 19 282 93 -251 -239 69 366 65 -283 -281 177 282 36 -220 -161 38 141 112 -72 -146 -120
7245 -120 74 185 37 -197 -212 99 315 25 -251 -173 189 306 15 -307 -94 165 183 47 -101 -61 -36 16
7267 16 94 -32 -120 -122 79 231 28 -276 -136 159 226 -60 -222 -69 92 110 -60 -116 10 52 -47 -7 6 -66
7291 -66 -41 20 113 -35 -99 -70 180 143 -77 -161 55 210 53 -122 -34 104 62 -92 -141 35 78 12 -47 -4 5 -27
7317 -27 -40 30 56 -65 -78 33 179 -95 -170 -8 208 131 -129 -156 89 245 1 -173 -53 75 108 -32 -81
7340 -81 -84 -36 26 85 21 -155 -202 73 213 40 -234 -204 79 307 27 -237 -142 91 120 -38 -219 -108 22 95
7364 95 109 -38 -189 -187 117 270 26 -361 -252 158 353 13 -301 -129 209 225 -3 -254 -128 61 135 79
7386 79 -25 -148 -111 166 255 -30 -328 -205 215 273 38 -396 -166 195 230 -19 -260 -116 151 130 26 -161
$$ packed form
7222B2k12p0K79K63j89l44J2L08K97l01l48KM58J05k46k56N9J99J03k9j84p4K6
7245a20J94J11j48k34j5L11K16k90k76P8L62J17k91l22K13K59J8j36j48M0K5N2
7267A6P8j26q8kK01J52k03l04J40K95O7k86j62J53J61J8j70n6J26M2r9M0J3p2
7291f6K5O1R3j48o4K9K50l7k20q4K16J55j57j75Q8J38m2j54m9J76M3o6n9M3Rl2
7317b7j3P0K6j21j3J11J46k74p5J62K16p7k60k7K45J56k44j74J20J28L3j40m9
7340h1lM8O2N9o4j76m7K75J40j73k74L0K83K28k80k64R5K33K9j58j81J11J30P3
7364I5J4j47j51KL04J53k44l87J09M10J95l40l14J72L38J6k28k51J26J89P4n6
7386G9j04j23L7K77Q9k85k98J23M20N8k35m34K30L61L5k49k41J44K67k1j04j87
$$ plain form
7408 -161 -158 -29 153 171 -3 -211 -191 182 258 -70 -289 -167 197 260 -122 -270 -85 141 201 -49 -121 -1 11
7431 11 145 117 -28 -170 -75 179 246 -102 -257 -1 240 188 -118 -287 28 174 110 -55 -111 10 86 104 -4
7454 -4 -114 -80 -43 83 138 -73 -188 -65 200 121 -134 -187 6 176 3 -138 -47 59 93 -13 -85 2 -14 -32
7478 -32 1 18 -58 -36 -22 86 90 -80 -70 123 146 -50 -152 -39 166 71 -131 -82 37 147 -26 -118 14 53 -35
7503 -35 -40 -17 -24 -70 -17 87 66 -126 -177 -10 206 68 -242 -109 131 211 -104 -213 -96 143 142 -25 -72 -63 -47 84
7529 84 95 -35 -144 -79 83 267 -23 -243 -84 237 264 -54 -302 -27 292 127 -130 -238 -29 76 125 89
7551 89 -118 -141 -95 190 211 -103 -281 -100 224 273 -197 -321 -89 255 222 -207 -265 -46 188 154 25 -196 -73
7574 -73 52 124 106 -94 -281 -31 239 164 -134 -305 -70 329 134 -220 -230 29 212 87 -105 -195 -89 75
$$ packed form
7408a61LJ29J82J8j74k08K0L73P6l28k19J22L64O3l82j48J85K26O0k50p2J20J2
7431A1J34k8j45j42R5K54O7l48j55K56K41n2l06j69L15J46o4j65n6J21P6J8j08
7454dj10L4L7J26N5k11j15J23K65p9k55n3J93J70j73j41R1J06L4j06p2Q7j6j8
7478c2L3J7p6K2J4J08Mj70J0J93K3j96j02J13K05r5k02M9J19J10j73r2J32L9q8
7503c5nK3pm6N3J04k1j92n1J67K16j38l10J33K40Q0l15j09J17K39jj67m7RJ6J31
7529H4J1j30j09O5J62J84k90k20J59L21K7l18k48K75L19j65k57j08K09J05M9l6
7551H9k07k3M6K85K1l14j78J81L24M9m70j24K32L44l3m29n8K19K34l4j29k21J23
7574g3J25P2j8k00j87K50K70p5k98j71K35L99j95l54j0K59J83j25j92r0J06J64
$$ plain form
7596 75 143 6 -113 -198 8 296 76 -226 -257 1 295 132 -260 -205 99 209 35 -129 -123 -15 128 68 -24
7619 -24 -78 -108 26 116 153 -103 -201 45 266 66 -272 -122 152 211 28 -221 -110 132 89 -48 -71 -48 -25 7
7643 7 -7 42 -123 -98 80 173 24 -187 -53 110 176 -17 -154 -16 175 97 -124 -108 47 39 34 -58 31 -1 -30 -19
7669 -19 61 4 -106 -82 96 66 -129 -179 80 157 29 -161 -51 142 141 -49 -102 -29 128 -2 -27 -75 -31 8 -12
7694 -12 94 26 -110 -75 77 187 -16 -204 -71 207 205 -76 -203 52 174 82 -127 -186 13 113 122 -3 -97
7717 -97 -76 -11 155 158 -160 -189 13 257 152 -145 -208 98 305 -4 -144 -162 69 183 69 -32 -91 -96 82 180
7741 180 8 -127 -187 54 267 88 -246 -251 119 302 113 -289 -239 129 208 56 -195 -168 15 94 118 -2 -151
7764 -151 -146 88 277 60 -226 -253 141 214 34 -294 -146 144 215 21 -172 -102 68 59 55 -91 -173 -89 121 177
$$ packed form
7596G5O8j37j19q5K06K88k20l02l1K58K94j63l92N5L04J10j74j64OJ08J43o0r2
7619b4n4l0J34R0L7k56r8K46K21k00l38J50K74N9j83k49J11K42m3j37k3K3K3L2
7643Gj4M9j65K5J78R3j49k11J34J63O6j93j37J38J91p8k21J6J55qnr2Q9l2k9J1
7669a9Q0n7j10K4J78l0j95n0K59P7j28j90J10J93jj90n3P3J57j30k5m8M4L9k0
7694a2J06o8j36L5J52J10k03j88J33K78kk81j27K55J22r2k09n9J99J00Rj25r4
7717i7K1O5J66Ll18k9K02K44j05k97o3L06K07l09j40j8K31J14j14j01n9nJ78R8
7741A80j72j35o0K41K13j79l34nL70J83j89m02N0L68P9j52k51K7J83P9K4j20j49
7764a51NK34J89k17k86k7L94P3j80l28J48K90P1j94j93P0J70rmj46q2Q4K10N6
$$ plain form
7788 177 9 -192 -161 144 190 44 -287 -136 150 171 -79 -178 -38 143 102 -31 -89 -62 29 100 101 -40 -137 -11
7812 -11 118 137 -41 -177 0 163 138 -153 -231 26 194 41 -52 -40 35 37 10 -16 -26 5 -25 87 103 -17 -107
7837 -107 -37 82 68 -126 -107 52 148 -29 -154 -8 151 108 -86 -100 -25 82 -11 -55 -14 -40 -53 -10 135 -20
7861 -20 -115 -50 112 122 -49 -165 -2 149 114 -175 -120 49 101 8 -65 -66 72 14 0 45 -7 -87 -20 131 50 -123
7887 -123 -164 27 209 78 -195 -184 95 165 -1 -149 -86 68 171 78 -68 -57 -38 22 100 -77 -139 -96 111 222
7911 222 -4 -218 -224 145 230 -39 -293 -152 92 221 -22 -124 -99 85 94 46 -101 -169 -82 45 228 3 -261
7934 -261 -139 186 168 -18 -334 -65 260 164 -83 -219 -94 132 106 -8 -84 -109 36 127 173 -52 -202 -78
7956 -78 154 206 -92 -270 -62 223 152 -133 -186 9 140 90 -91 -113 -66 16 93 90 -88 -188 -31 175 114 -145
$$ packed form
7788A77j68k01L1L05M6j46l31J51K86K1k50r9J40J81m1j33n8K7R1P1Jj41r7J26
7812a1J29J9j78j36J77J63k5k91p8K57J68j53r3J2P5Kk7k6j0L1l0J12J6j20r0
7837a07P0J19j4j94J9J59R6j77j25J46J59m3j94j4P5J07r3m4M1k6j3M3J45j55
7861b0r5O5J62J0j71j16J63J51l5k89N5J69N2r3p3jJ38n8j4M5n2q0O7J51q1j73
7887a23m1J91J82j31k73J1K79P0j66j48O3J54J03r3j46J1J9O0P8j77o2M3K07J11
7911B22k26k14oL69Q5k69k54J41K44J29k43j02K5J84Rm8j47o8Q7J27J83k25k64
7934b61J22L25j8j86l16K69L25r6k47j36J25K26k6j14p6k5J45R1M6k25j50J24
7956g8K32N2k98j78K08K85p1k85n3J95J31n0j81k2M7Q2P7lj78j00J57K06o1k59
$$ plain form
7980 -145 -156 18 263 144 -164 -151 25 158 10 -111 -76 22 20 37 -29 -83 -80 -9 109 82 -54 -145 59 159 59
8005 59 -119 -189 105 136 -31 -152 -51 142 47 -14 -21 -32 -15 -16 21 5 -27 -126 38 94 -17 -128 -76 126 118 -68
8031 -68 -193 11 175 111 -109 -90 64 70 35 -86 -73 -4 4 21 48 -17 -94 10 112 61 -55 -133 89 177 47 -155
8057 -155 -103 81 124 -49 -156 -45 36 94 3 -54 -69 -24 27 80 -11 -187 -136 67 189 16 -170 -46 124 156
8081 156 -48 -175 -54 121 119 -38 -124 -42 40 97 36 -80 -114 -60 86 160 -11 -199 -16 209 164 -95 -208 5
8105 5 225 154 -94 -186 -43 141 141 21 -162 -120 5 147 86 -167 -214 -41 175 155 -182 -234 -5 204 139 -174
8129 -174 -153 63 172 99 -72 -105 -24 77 82 48 -125 -109 16 232 49 -151 -206 19 265 63 -183 -140 66
8152 66 192 28 -67 -113 4 50 41 3 -72 -65 26 61 10 -104 -144 70 181 -4 -196 -129 124 175 -61 -101 -64 79
$$ packed form
7980a45j1J74K45j19l08J3J76J33j48j21L5R8kJ7o6n4LP1J18k7j36r1K04J00j00
8005E9j78p0K94L1j67j21J01J93r5o1pj1J7jL7j6l2r9J64N6j11j11N2K02qj86
8031f8j25K04J64o4k20J9J54Ol5j21J3O9QJ7K7o5p7J04J02n1j16p8K22Q8j30k02
8057a55N2J84M3j73j07J11Q1N8r1n7j5M5N1N3r1j76N1K03J22j73j86J24J70L2
8081A56k04j27J21J75kj57q6Q2Q2N7o1j16l4N4J46P4j71j88J83K25m5k59j13K13
8105EK20p1k48r2J43J84%j20j83M2J25J42o1k53m7J73K16k0l37n2K29K09o5l13
8129a74K1K16J09p3j71l3Q1J01Nl4j73J6J25K16j83k00n5K25K46k02k46M3K06
8152F6J26j64r5m6J17M6rl8p5PR1L5n1j14m0K14J11j85j92O7K53N1k36m0L7J43
$$ plain form
8178 79 83 -25 -17 5 -35 34 71 -22 -121 -59 108 191 -46
$$ packed form
8178G9Mj08QK2m0O9L7r3r9O2J67Q3k37
8191d6
$$ Imaginary data points
##PAGE= N=2
##DATA TABLE= (X++(I..I)), XYDATA
$$ plain form
0 0 0 0 0 0 0 0 0 0 0 0 0 0 0 0 0 0 -5 5 -8 8 -8 8 -12 12 -15 17 -18 21 -26 29 -29 36 -43 44 -50 58 -63 70 -78
39 -78 84 -95 106 -114 126 -141 156 -166 185 -204 223 -246 274 -301 333 -373 416 -464 526 -600 690
60 690 -805 955 -1160 1451 -1894 2623 -3989 7071 -16955 111626 661260 337063 -434668
73 -434668 -519983 87723 457970 183197 -215795 -259510 -63777 117885 215116 136495 -164591
84 -164591 -350386 -47113 419934 319936 -303193 -529567 38779 570367 259406 -414422
94 -414422 -448666 142284 452821 116920 -281620 -238735 33033 161107 134700 46314 -124516
105 -124516 -241019 -45129 304253 269771 -201578 -427804 -14736 438704 233928 -308099
115 -308099 -354942 119558 355023 48389 -256984 -136804 115449 118365 -7492 -22847 -13975
$$ packed form
0@%%%%%%%%%%%%%%%%nJ0j3J6j6J6k0K4k7L2l5L9m7N5n8O5p9Q7r4J08j21J33j48
39g8J62j79K01k20K40k67K97l22L51l89M27m69N20n75O34p06P89q80R90j126J290
60F90j495J760k115K611l345M517o612J1060k4026J28581N49634l24197p71731
73d34668q5315O07706L70247k74773l98992m3715J95733J81662R7231p8621l01086
84a64591j85795L03273M67047r9998o23129k26374N68346N31588l10961o73828
94d14422l4244N90950L10537l35901l98540M2885K71768J28074k6407q8386j70830
105a24516j16503J95890L49382l4482m71349k26226M13068M53440k04776n42027
115c08099m6843M74500K35465l06634l05373J20180K52253K916j25857j5355Q872
$$ plain form
126 -13975 -84634 -56289 137515 178170 -98304 -286576 -29899 309063 179796 -229096 -270739
137 -270739 99897 275046 14558 -211174 -66520 133414 54673 -92588 -19213 100850
147 100850 6066 -128204 -25280 143965 58916 -143184 -96048 123767 122719 -97350 -138081
158 -138081 73138 150503 -47633 -159404 20515 163716 5763 -166952 -33382 172769
168 172769 75702 -163831 -126043 127216 163836 -66554 -169296 15 129230 32790 -67261
179 -67261 -9268 31546 -52499 -59019 98765 140348 -83086 -227861 -3825 267024 130978
190 130978 -221505 -233441 110217 264812 15861 -217508 -103639 118844 119480 -18834 -62998
201 -62998 -32860 -33524 4492 111649 92801 -120656 -214101 35806 290778 118803 -264319
$$ packed form
126a3975p0659K8345J93804M0655k76474j88272K56677L38962j29267m08892m1643
137b70739L70636J75149k60488k25732J44654J99934p8741j47261P3375J20063
147A00850r4784j34270J02924J69245q5049k02100M7136K19815j048k20069m0731
158a38081K11219P7365j98136j11771J79919J43201j57953j72715J33570K06151
168A72769r7067k39533L7788K53259L6620k30390j02742J69311J29215r6440j00051
179f7261N7993M0814q4045o520J57784M1583k23434j44775K24036K70849j36046
190A30978l52483j1936L43658J54595k48951k33369J13869K22483O36j38314m4164
201f2998L0138o64L8016J07157j8848k13457r3445K49907K54972j71975l83122
$$ plain form
212 -264319 -268584 132834 335589 46986 -280030 -184249 133500 212527 23055 -125176 -103389
223 -103389 -18613 65945 128614 59670 -142087 -203634 45477 285849 117258 -259793 -271530
234 -271530 130112 346143 51415 -302936 -202831 162057 256537 10310 -187267 -123915
244 -123915 37381 118625 104357 559 -151473 -163181 68765 269108 100059 -254858
254 -254858 -266742 121680 343861 63305 -296411 -210130 156969 257306 2394 -195692
264 -195692 -104923 70686 111248 49871 -26021 -100676 -99356 53053 193393 70408 -201978
275 -201978 -210860 108840 293666 45648 -273175 -186843 158578 246062 -12043 -203005 -91324
286 -91324 94479 107032 13835 -38717 -58001 -59701 20842 127208 70220 -127458 -165918 59839
$$ packed form
212b64319m265M01418K02755k88603l27016R5781L17749P9027j89472j48231K1787
223a03389Q4776Q4558O2669o8944k01757o1547K49111K40372j68591l77051j1737
234b71530M01642K16031k94728l54351J00105L64888R4480k46227j97577O3352
244a23915J61296Q1244j4268j03798j52032j1708K31946K00343j69049l54917
254b54858j1884L88422K22181k80556l59716Q6281L67099J00337k54912j98086
264a95692R0769J75609M0562o1377p5892p4655J320J52409J40340j22985k72386
275b01978q882L19700J84826k48018l18823Q6332L45421Q7484k58105j90962J11681
286i1324J85803J2553r3197n2552j9284j700Q0543J06366n6988j97678l8460K25757
$$ plain form
298 59839 219208 44601 -206936 -141602 134989 190223 -39449 -178508 -40119 119087
308 119087 71830 -46306 -45984 4870 -9624 -15675 53555 67494 -54020 -124614 8873 152636
320 152636 58955 -135097 -113809 84835 132312 -33982 -122686 -79 101065 13956 -83406
331 -83406 -15459 77399 17384 -79040 -26427 79712 40340 -74706 -53494 66785 66622 -53066
343 -53066 -74250 37633 73845 -29019 -73687 26188 79964 -23884 -96601 11212 117891
354 117891 20796 -128603 -70837 108596 115061 -57725 -126885 852 101986 35939 -52784
365 -52784 -31745 11556 -8428 -8590 53814 49060 -69194 -109642 39032 157089 28064 -166133
377 -166133 -109071 122679 166020 -42687 -172845 -39131 129184 90452 -53245 -86741 -16524
$$ packed form
298E9839J59369j74607k51537O5334K76591N5234k29672j39059J38389J59206
308A19087m7257j18136L22N0854j4494o051O9230J3939j21514p0594J33487J43763
320A52636r3681j94052K1288J98644M7477j66294q8704J22607J01144q7109r7362
331h3406O7947R2858o0015r6424N2613J06139l9372j15046K1212J20279j63j19688
343e3066k1184J11883L6212j02864m4668R9875N3776j03848p2717J07813J06679
354A17891r7095j49399N7766J79433O465j72786o9160J27737J01134o6047q8723
365e2784K1039M3301j9984j62O2404m754j18254m0448J48674J18057j29025j94197
377a66133N7062K31750M3341k08707j30158J33714J68315l8732j43697l3496P0217
$$ plain form
388 -16524 29496 38872 47103 4021 -91879 -88663 72460 168573 10937 -195939 -123529 144012
400 144012 204564 -35943 -213275 -75243 149116 138607 -46965 -128916 -41487 56286 70797
411 70797 35736 -26662 -92010 -62331 82377 151381 -4231 -191497 -111302 151473 205557
422 205557 -44913 -229919 -78518 171875 160104 -61626 -163166 -45025 89014 89627 13914
433 13914 -51478 -81647 -38892 78609 129899 -4524 -169393 -103235 133022 189324 -36980
444 -36980 -211791 -72407 164204 147749 -71562 -160731 -24942 107020 76325 -21295 -60617
455 -60617 -46648 -7151 60245 87646 -9128 -132504 -81318 111340 161724 -30639 -186666
466 -186666 -66192 148065 134891 -67637 -147948 -14623 105410 58101 -39799 -50056 -10674
$$ packed form
388a6524M6020R376Q231m3082r5900L216J61123R6113j57636k06876P2410K67541
400A44012O0552k40507j77332J38032K24359j0509j85572q1951Q7429R7773J4511
411G0797l5061o2398o5348K9679J44708O9004j55612j87266Q0195K62775N4084
422B05557k50470j85006J51401K50393j1771k21730j01540J18141J34039O13p5713
433A3914o5392l0169M2755J17501N1290j34423j64869O6158K36257N6302k26304
444c6980j74811J39384K36611j6455k19311q9169J35789J31962l0695r7620l9322
455f0617J3969L9497O7396K7401r6774j23376N1186J92658N0384j92363j56027
466a86666J20474K14257j3174k02528q0311J33325J20033m7309r7900j0257L9382
$$ plain form
477 -10674 5610 22252 45924 7780 -75547 -64013 63960 116394 -13547 -136083 -50553
488 -50553 115962 102090 -64398 -119245 5920 97737 30208 -57111 -32100 24670 9599
499 9599 -17569 15051 34623 -24162 -63061 8761 81927 21908 -80349 -50243 64106 68250
511 68250 -41068 -73362 20483 69852 -6607 -64076 -856 61469 7459 -61261 -16510 60220
523 60220 27490 -57134 -41519 46344 51618 -29825 -51883 15446 43657 -10379 -34019 17227
535 17227 34220 -28545 -50145 30782 77506 -10522 -97682 -28696 94421 70182 -64612 -94851
547 -94851 18321 88861 21012 -57425 -35112 19539 19207 2182 14256 4868 -44076 -38963 50239
560 50239 84888 -21390 -116242 -33102 114500 92020 -73954 -127799 8473 120809 51653
$$ packed form
477a0674J6284J6642K3672l8144q3327J1534J27973N2434j29941j22536Q5530
488e0553J66515j3872j66488n4847J25165R1817o7529q7319K5011N6770j5071
499I599k7168L2620J9572n8785l8899P1822P3166o0019j02257L0106J14349M144
511F8250j09318l2294R3845M9369p6459n7469O3220O2325n4010o8720M4751P6730
523F0220l2730q4624J5615Q7863N274q1443k2058O7329K8211n4036k3640N1246
535A7227J6993o2765k1600Q0927M6724q8028q7160O8986J23117k4239j34794l0239
547i4851J13172P0540o7849p8437K2313N4651l32j7025J2074r388m8944N113Q9202
560E0239L4649j06278r4852Q3140J47602k2480j65974n3845J36272J12336o9156
$$ plain form
571 51653 -73993 -76934 11703 55372 30620 -1837 -29091 -51221 -17467 68809 82658 -35783
583 -35783 -127984 -33361 127540 106822 -76626 -148195 -1789 138025 71822 -82653 -101930
594 -101930 10305 80696 42374 -22587 -49563 -40173 6139 69146 62574 -45242 -117907 -22618
606 -22618 127108 102461 -79615 -151922 -2523 145895 79182 -88786 -113564 12749 94125
617 94125 43649 -36375 -53685 -25175 15124 54241 45441 -36597 -95367 -20184 106433 88691
629 88691 -69765 -135195 424 136408 69515 -91779 -108066 24703 100640 33058 -53467
640 -53467 -52256 -3867 25980 36543 25010 -27708 -69868 -17818 81515 74636 -51990 -112922
652 -112922 -4958 112724 60273 -77762 -90586 27103 87669 17078 -56476 -34647 17958
$$ packed form
571E1653j25646k941Q8637M3669k4752l2457k7254k2130L3754Q6276J3849j18441
583c5783r2201R4623J60901k0718j83448p1569J46406J39814o6203j54475j9277
594a01930J12235P0391l8322o4961k6976R390M6312O3007o572j07816p2665R5289
606b2618J49726k4647j82076p2307J49399J48418o6713j67968k4778J26313Q1376
617I4125n0476q0024j7310K8510M0299L9117q800q2038n8770P5183J26617j7742
629H8691j58456o5430J35619J35984o6893j61294j6287J32769P5937o7582q6525
640e3467J211M8389K9847J0563j1533n2718m2160N2050R9333o879j26626o0932
652a12922J07964J17682n2451j38035j2824J17689O0566p0591p3554K1829N2605
$$ plain form
663 17958 22445 6174 7171 -4417 -34920 -21003 43684 56106 -25905 -81241 -11545 81058 48214
676 48214 -58323 -68977 25241 68193 2902 -50591 -13858 31250 8982 -22181 1302 25829
688 25829 -6246 -35652 2486 45427 10022 -48237 -25713 41460 36483 -31011 -41770 20391
700 20391 42581 -12178 -41212 7677 41465 -4568 -45830 -2548 50453 16046 -48747 -30843
712 -30843 39463 42584 -22402 -44363 4583 33457 2654 -18862 3858 12041 -18219 -20127 28330
725 28330 40545 -24136 -63933 639 74256 33325 -62751 -60844 34250 71421 439 -59636
737 -59636 -25841 31831 29789 -3291 -11463 -9060 -16839 -2403 38083 33318 -37738 -69852 8305
750 8305 89275 38394 -77599 -79794 37885 96274 12930 -78808 -50638 36422 56715 7674
$$ packed form
663A7958M487j6271R97j1588l0503J3917O4687J2422q2011n5336O9696R2603l2844
676D8214j06537j0654R4218M2952o5291n3493L6733M5108k2268l1163K3483K4527
688B5829l2075k9406L8138M2941l5405n8259K2524O7173m977o7494j0759O2161
700B0391K2190n4759k9034M8889L3788m6033m1262M3282N3001l4407o4793J7904
712c0843P0306L121o4986k1961M8946K8874l0803k1516K2720Q183l0260j908M8457
725B8330J2215o4681l9797O4572P3617m0931r6076J907R5094L7171p0982o0075
737e9636L3795N7672k042l3080q172K403p779J4436M0486m765p1056l2114P8157
750H305Q0970n0881j15993k195J17679N8389q3344r1738K8170Q7060K0293m9041
$$ plain form
762 7674 -29582 -28113 -11665 15535 43313 23067 -46456 -67913 14807 92606 37054 -82483
774 -82483 -84610 40173 105174 15775 -89225 -60421 43817 72120 7308 -46564 -36013 1498
786 1498 29158 37602 9125 -46906 -57083 18526 86181 33609 -78694 -82485 37162 103991
798 103991 18145 -89055 -62459 45553 75171 3396 -53657 -32775 13323 30903 23698 -270
810 -270 -36193 -41222 16207 69893 27386 -67739 -71866 34180 94797 15244 -85398 -58077
822 -58077 47543 73369 -2543 -57340 -26795 22782 28415 9317 -4984 -20917 -26945 6492
834 6492 48326 25904 -45865 -57724 21066 73868 14821 -67061 -45980 40961 58623 -9341
846 -9341 -50608 -13354 29100 17917 -7785 -6155 -1188 -12431 -6597 24568 25875 -21196 -43910
$$ packed form
762G674l7256J469J6448K7200K7778k0246o9523k1457Q2720P7799n5552j19537
774h2483k127J24783O5001q9399j05000K8804J04238K8303o4812n3872J0551L7511
786A498K7660Q444k8477n6031j0177P5609O7655n2572j12303l791J19647O6829
798A03991q5846j07200K6596J08012K9618p1775n7053K0882M6098J7580p205k3968
810b70l5923n029N7429N3686m2507r5125m127J06046O0617p9553j00642K7321
822e8077J05620K5826p5912n4797L0545M9577N633j9098j4301j5933o028L3437
834F492M1834k2422p1769j1859P8790N2802n9047q1882K1081Q6941J7662o7964
846i341m1267L7254M2454j1183k5702J630M967j1243N834L1165J307m7071k2714
$$ plain form
859 -43910 4507 51623 17903 -44897 -35280 28483 41216 -11397 -36977 515 28323 1978
871 1978 -22124 167 21122 -2555 -25089 589 29831 6110 -31280 -14715 28145 22158
883 22158 -21042 -24900 14151 23876 -10421 -21836 10765 23225 -11975 -29495 9014 37656
895 37656 811 -42524 -16531 37815 30700 -23920 -36551 6834 31023 5015 -17614 -5291
907 -5291 5700 -5024 -3472 18549 14313 -24853 -32972 17755 49891 2560 -55382 -28908 43665
920 43665 48805 -19368 -53536 -7713 40454 24782 -16353 -23480 -5558 5075 12070 19412 2136
933 2136 -33786 -29716 28044 56656 -1060 -66536 -35249 51667 62601 -18417 -68206 -17714
945 -17714 49579 39635 -17237 -37904 -11727 14582 21318 15312 -6916 -34252 -23222 31063 53922
$$ packed form
859d3910M8417M7116l3720o2800R617O3763J2733n2613k5580L7492K7808k6345
871A978k4102K2291K0955k3677k2534K5678K9242k3721l7390J6565M2860n987
883B2158m3200l858L9051R725l4297j1415L2601J2460l5200j7520L8509K8642
895C7656l6845m3335K5993N4346p115n4620j2631M3385K4189k6008k2629J2323
907e291J0991j0724J552K2021m236l9166q119N0727L2136m7331n7942K6474P2573
920D3665N140o8173l4168M5823M8167j5672m1135p127J7922J0633O995P342j7276
933B136l5922M070N7760K8612n7716o5476L1287Q6916J0934q1018m9789N0492
945a7714O7293r944n6872k0667K6177K6309O736o006k2228k7336J1030N4285K2859
$$ plain form
958 53922 -3784 -66860 -34801 53338 65598 -18600 -73519 -20995 55126 47017 -20107 -47515
970 -47515 -13252 23547 26091 8448 -13739 -30198 -15871 29366 46726 -4357 -60600 -32318
982 -32318 48976 62186 -16904 -70944 -20254 55671 46634 -23589 -50089 -8665 30552 24095
994 24095 -1694 -16834 -20448 -7728 23143 35576 -3571 -50051 -28427 41393 55253 -13843
1006 -13843 -63632 -18490 51275 42013 -24025 -45813 -3039 31079 16334 -9099 -12433 -7422
1018 -7422 -4102 9831 22778 2973 -32413 -24702 25822 42540 -6839 -48161 -15530 40060
1030 40060 32684 -21332 -36515 2538 27827 7446 -14220 -5984 4844 -2519 -3851 11753 11835
1043 11835 -14761 -23697 7892 30899 3942 -30949 -15240 24775 22594 -15125 -23584 6967
$$ packed form
958E3922n7706o3076L2059Q8139J2260q4198n4919N2524P6121q109o7124k7408
970d7515L4263L6799K544j7643k2187j6459J4327M5237J7360n1083n6243K8282
982c2318Q1294J3210p9090n4040N0690P5925r037p0223k6500M1424L9217o457
994B4095k5789j5140l614J2720L0871J2433l9147m6480K1624O9820J3860o9096
1006a3843m9789M5142O9765r262o6038k1788M2774L4118j4745k5433l334N011
1018g422L320J3933J2947j9805l5386P711N0524J6718m9379m1322L2631N5590
1030D0060p376n4016j5183L9053K5289k0381k1666Q236J0828p363j332J5604Q2
1043A1835k6596q936L1589K3007k6957l4891J5709M0015k181l7719q459L0551
$$ plain form
1055 6967 20108 -3637 -16735 3964 16648 -4210 -18774 2955 22401 1745 -24545 -9576
1067 -9576 21478 15553 -15195 -17162 8926 14884 -5924 -11160 7448 9610 -12188 -14223 14673
1080 14673 23744 -9594 -31653 -1512 33753 15543 -27294 -26406 13658 27977 244 -20034
1092 -20034 -7161 8160 4392 370 5442 -798 -17279 -9648 22058 26215 -14507 -39220 -2941
1105 -2941 42005 23893 -31182 -38769 10373 39793 10828 -26121 -21091 6199 16249 8801 47
1118 47 -10822 -18893 -3119 27558 25366 -19493 -43473 -2220 47447 27908 -34405 -45612 9462
1131 9462 46815 15684 -30829 -28358 7614 24066 11190 -6043 -15601 -15510 2321 27123 20972
1144 20972 -21058 -41468 -803 47272 28005 -34746 -47572 8678 49586 18233 -33396 -32543
$$ packed form
1055F967J3141k3745j3098K0699J2684k0858j4564K1729J9446k0656k6290J4969
1067i576L1054n925l0748j967K6088N958k0808n236J8608K162k1798k035K8896
1080A4673R071l3338k2059L0141L5265j8210m2837Q88M0064J4319k7733k0278
1092b0034J2873J5321l768m022N072o240j6481P631L1706M157m0722k4713L6279
1105b941M4946j8112n5075p587M9142K9420k8965l6949N030K7290J0050p448q754
1118D7j0869q071J5774L0677k192m4859k3980M1253M9667j9539o2313j1207N5074
1131I462L7353l1131m6513K471L5972J6452j2876j7233r558R1J7831K4802o151
1144B0972m2030k0410M0665M8075j9267o2751j2826N6250M0908l1353n1629Q53
$$ plain form
1156 -32543 8870 29270 11435 -11344 -17357 -10116 6145 22778 15484 -18817 -35173 -215
1168 -215 41947 25071 -31933 -44187 8642 47725 16662 -34434 -31717 12008 30874 8007
1180 8007 -15843 -15182 -3440 7176 15626 10920 -13170 -27612 -2411 33193 22922 -24616 -38139
1193 -38139 5397 40448 14584 -29847 -26581 12637 26385 2496 -16140 -8467 2989 3862 5402
1206 5402 7588 -3771 -17862 -6367 21029 19863 -14564 -29502 1254 30401 12281 -22953
1218 -22953 -20323 11352 20086 -1880 -14063 -1570 7140 -961 -3967 6134 6250 -9410 -12157
1231 -12157 8285 18149 -2417 -20551 -4955 18436 10628 -13521 -12903 8327 11630 -5743 -9701
1244 -9701 5940 9379 -7490 -12193 7188 16358 -3500 -19404 -2963 18922 9820 -13761 -12955
$$ packed form
1156c2543M1413K0400j7835k2779o013P241J6261J6633p294l4301j6356L4958
1168b15M2162j6876n7004j2254N2829L9083l1063n1096K717M3725J8866k2867
1180H007k3850O61J1742J0616Q450m706k4090j4442K5201L5604j0271m7538j3523
1193c8139M3536L5051k5864m4431L266L9218J3748k3889j8636P673J1456Q73J540
1206E402K186j1359j4091J1495K7396j166l4427j4938L0756K9147j8120l5234
1218b2953K630L1675Q734k1966j2183J2493Q710q101l006J0101J16j5660k747
1231a2157K0442R864k0566j8134J5596K3391p808k4149O18K1230L303j7373l958
1244i701J5641L439j6869m703J9381R170j9858j5904J6441K1885r102k3581Q06
$$ plain form
1257 -12955 7213 11476 -2667 -6829 2864 2940 -7251 -3365 12580 9457 -14222 -18580 8991 25395
1271 25395 1354 -26218 -13119 19532 20945 -7776 -20689 -2946 13132 7630 -2739 -3894
1283 -3894 -4194 -5661 3272 15778 6441 -19175 -20624 11950 30839 3020 -31702 -19517 21453
1296 21453 29517 -4569 -27846 -10653 15869 16114 -655 -10108 -8993 -3317 8067 16738 4151
1309 4151 -21148 -20902 13107 32849 3996 -33710 -22402 22203 33566 -3361 -31893 -13921
1321 -13921 18407 20670 -1239 -14804 -10565 334 10968 14770 947 -20835 -18414 13681 31585
1334 31585 3508 -33256 -22451 22056 34328 -2971 -33307 -14973 20185 22633 -2981 -18085
1346 -18085 -9663 4610 11603 10143 -1644 -17090 -14221 11839 26863 3304 -29038 -20413 19697
$$ packed form
1257a2955K0168M263j4143m162R693P6j0191L886J5945l123k3679m358K7571J6404
1271B5395k4041k7572J3099L2651J413k8721j2913J7743J6078n502j0369j155
1283c894l00j467Q933J2506r337k5616j449L2574J8889k7819l4722J2185M0970
1296B1453Q064l4086k3277J7193K6522K45j6769r453J115N676J1384Q671j2587
1309D151k5299K46L4009J9742k8853l7706J1308M4605J1363l6927k8532J7972
1321a3921L2328K263k1909j3565M239J0899J0634L802j3823k1782K421L2095J7904
1334C1585k8077l6764J0805M4507J2272l7299l0336J8334L5158K448k5614j5104
1346a8085Q422J4273O993j460j1787j5446K869K6060J5024k3559l2342Q625M0110
$$ plain form
1359 19697 31863 -2419 -31356 -14032 19851 21363 -4587 -17869 -6691 6606 8618 5383
1371 5383 -960 -11009 -11499 6456 20711 5263 -21736 -18048 14277 26438 -961 -25775 -11363
1384 -11363 17296 17026 -6179 -14949 -1982 7709 3930 198 705 -3812 -8645 210 13774 7678
$$ packed form
1359A9697J2166l4282k8937J7324L3883J512k5950j3282J1178J3297K012l235
1371E383o343j0049m90J7955J4255j5448k6999L688L2325J2161k7399k4814J4412
1384a1363K8659k70k3205q770J2967R691l779l732N07m517m833Q855J3564o096
$$ [...]
8191a60
##END NTUPLES=NMR FID
##END=
