##TITLE=1H_LY-Choral.2
 CDCl3, 8 sc, 
 20.10.2020
##JCAMPDX= 6.0         $$ Bruker NMR JCAMP-DX V2.0
##DATA TYPE= NMR FID
##DATA CLASS= NTUPLES
##ORIGIN= UXNMR, Bruker Analytische Messtechnik GmbH
##OWNER= root
$$ XWIN-NMR		Version 3.5
$$ Tue Oct 20 13:07:35 2020 Russian Standard Time (UT+4h)  she@DPX200
##.OBSERVE FREQUENCY= 200.1315066352
##.OBSERVE NUCLEUS= ^1H
##.DELAY= (6, 6)
##.ACQUISITION MODE= SIMULTANEOUS
##.ACQUISITION SCHEME= undefined
##.AVERAGES= 8
##.DIGITISER RES= 18
##SPECTROMETER/DATA SYSTEM= spect
##.PULSE SEQUENCE= zg30
##.SOLVENT NAME= CDCl3
##.SHIFT REFERENCE= (INTERNAL, CDCl3, 0, 15.7039)
##AUDIT TRAIL= $$ (NUMBER, WHEN, WHO, WHERE, WHAT)
$$ ##TITLE= Audit trail, XWIN-NMR		Version 3.5
$$ ##JCAMPDX= 5.01
$$ ##ORIGIN= Bruker BioSpin GmbH
$$ ##OWNER= she
$$ F:/spectra/data/she/nmr/H-F/1/audita.txt
$$ ##AUDIT TRAIL=  $$ (NUMBER, WHEN, WHO, WHERE, WHAT)
(   1,<2020-10-20 13:06:26.00 +0400>,<she>,<DPX200>,
      <created by zg, POWCHK disabled, PULCHK disabled
       configuration hash MD5:
       00 E9 B6 7A A2 85 ED C7 34 08 36 98 17 FE 4E 26
       data hash MD5: 16K
       1D 73 C1 54 49 1B 05 8F 6F D4 BC 6E 92 38 71 8B>)
$$ ##END=
$$ 
$$ hash MD5
$$ B7 CF 27 3C 26 B1 89 38 97 D6 35 A1 25 26 FA DB
##$RELAX= 
##$RELAX= 
##$RELAX= 
##$RELAX= 
##$RELAX= 
##$RELAX= 
$$ Bruker specific parameters
$$ --------------------------
##$DU= <F:/spectra>
##$EXPNO= 1
##$NAME= <H-F>
##$PROCNO= 1
##$TYPE= <nmr>
##$USER= <she>
##$AMP= (0..31)
100 100 100 100 100 100 100 100 100 100 100 100 100 100 100 100 100 100 
100 100 100 100 100 100 100 100 100 100 100 100 100 100 
##$AQSEQ= 0
##$AQ_mod= 1
##$AUNM= <au_zg>
##$AUTOPOS= <>
##$BF1= 200.13
##$BF2= 200.13
##$BF3= 200.13
##$BF4= 200.13
##$BF5= 200.13
##$BF6= 200.13
##$BF7= 200.13
##$BF8= 200.13
##$BYTORDA= 1
##$CFDGTYP= 0
##$CFRGTYP= 5
##$CHEMSTR= <none>
##$CNST= (0..31)
1 1 145 1 1 1 1 1 1 1 1 1 1 1 1 1 1 1 1 1 1 1 1 1 1 1 1 1 1 1 1 1 
##$CPDPRG= <>
##$CPDPRG1= <>
##$CPDPRG2= <>
##$CPDPRG3= <>
##$CPDPRG4= <mlev>
##$CPDPRG5= <mlev>
##$CPDPRG6= <mlev>
##$CPDPRG7= <mlev>
##$CPDPRG8= <mlev>
##$CPDPRGB= <>
##$CPDPRGT= <>
##$D= (0..31)
0 1.2 0 0 0 0 0 0 0 0.06 0 0.03 0 0 0 0 0.0002 0 0 0 0 0 0 0 0 0 0 0 0 
0 0 0 
##$DATE= 1603184785
##$DBL= (0..7)
120 120 120 120 120 120 120 120 
##$DBP= (0..7)
150 150 150 150 150 150 150 150 
##$DBP07= 0
##$DBPNAM0= <>
##$DBPNAM1= <>
##$DBPNAM2= <>
##$DBPNAM3= <>
##$DBPNAM4= <>
##$DBPNAM5= <>
##$DBPNAM6= <>
##$DBPNAM7= <>
##$DBPOAL= (0..7)
0.5 0.5 0.5 0.5 0.5 0.5 0.5 0.5 
##$DBPOFFS= (0..7)
0 0 0 0 0 0 0 0 
##$DE= 6
##$DECBNUC= <off>
##$DECIM= 32
##$DECNUC= <off>
##$DECSTAT= 4
##$DIGMOD= 1
##$DIGTYP= 9
##$DL= (0..7)
0 120 120 120 120 120 120 120 
##$DP= (0..7)
150 150 150 150 150 150 150 150 
##$DP07= 0
##$DPNAME0= <>
##$DPNAME1= <>
##$DPNAME2= <>
##$DPNAME3= <>
##$DPNAME4= <>
##$DPNAME5= <>
##$DPNAME6= <>
##$DPNAME7= <>
##$DPOAL= (0..7)
0.5 0.5 0.5 0.5 0.5 0.5 0.5 0.5 
##$DPOFFS= (0..7)
0 0 0 0 0 0 0 0 
##$DQDMODE= 0
##$DR= 18
##$DS= 0
##$DSLIST= <SSSSSSSSSSSSSSS>
$$ [...]
##$SUBNAM2= <"">
##$SUBNAM3= <"">
##$SUBNAM4= <"">
##$SUBNAM5= <"">
##$SUBNAM6= <"">
##$SUBNAM7= <"">
##$SUBNAM8= <"">
##$SUBNAM9= <"">
##$SW= 16.880792210976
##$SWIBOX= (0..15)
0 0 2 0 0 0 0 0 0 0 0 0 0 0 0 0 
##$SW_h= 3378.37837837838
##$TD= 16384
##$TD0= 1
##$TE= 0
##$TE2= 300
##$TE3= 300
##$TEG= 300
##$TL= (0..7)
0 120 120 120 120 120 120 120 
##$TP= (0..7)
150 150 150 150 150 150 150 150 
##$TP07= 0
##$TPNAME0= <>
##$TPNAME1= <>
##$TPNAME2= <>
##$TPNAME3= <>
##$TPNAME4= <>
##$TPNAME5= <>
##$TPNAME6= <>
##$TPNAME7= <>
##$TPOAL= (0..7)
0.5 0.5 0.5 0.5 0.5 0.5 0.5 0.5 
##$TPOFFS= (0..7)
0 0 0 0 0 0 0 0 
##$TUNHIN= 0
##$TUNHOUT= 0
##$TUNXOUT= 0
##$USERA1= <user>
##$USERA2= <user>
##$USERA3= <user>
##$USERA4= <user>
##$USERA5= <user>
##$V9= 5
##$VALIST= <valist>
##$VCLIST= <CCCCCCCCCCCCCCC>
##$VD= 0
##$VDLIST= <DDDDDDDDDDDDDDD>
##$VPLIST= <PPPPPPPPPPPPPPP>
##$VTLIST= <TTTTTTTTTTTTTTT>
##$WBST= 1024
##$WBSW= 4
##$XGAIN= (0..3)
0 0 0 0 
##$XL= 0
##$YL= 0
##$YMAX_a= 262152
##$YMIN_a= -249757
##$ZGOPTNS= <>
##$ZL1= 120
##$ZL2= 120
##$ZL3= 120
##$ZL4= 120
##$ABSF1= 10
##$ABSF2= 0
##$ABSG= 5
##$ABSL= 3
##$ALPHA= 0
##$AQORDER= 0
##$ASSFAC= 0
##$ASSFACI= 0
##$ASSFACX= 0
##$ASSWID= 0
##$AUNMP= <proc_1d>
##$AZFE= 0.1
##$AZFW= 0.1
##$BCFW= 1
##$BC_mod= 2
##$BYTORDP= 1
##$COROFFS= 0
##$CY= 11.3945322036743
##$DATMOD= 1
##$DC= 2
##$DFILT= <>
##$DTYPP= 0
##$F1P= 16.9975609425685
##$F2P= -3.02152046262296
##$FCOR= 0.5
##$FTSIZE= 0
##$FT_mod= 4
##$GAMMA= 1
##$GB= 0.15
##$INTBC= 1
##$INTSCL= 1
##$ISEN= 128
##$LB= 0.24
##$LEV0= 0
##$LPBIN= 0
##$MAXI= 10000
##$MC2= 0
##$MEAN= 0
##$ME_mod= 0
##$MI= 1.114404
##$NCOEF= 0
##$NC_proc= 0
##$NLEV= 6
##$NOISF1= 3.799351
##$NOISF2= 2.8
##$NSP= 1
##$NTH_PI= 0
##$NZP= 0
##$OFFSET= 15.70392
##$PC= 1
##$PHC0= -10685.28
##$PHC1= 6.800892
##$PH_mod= 1
##$PKNL= yes
##$PPARMOD= 0
##$PSCAL= 0
##$PSIGN= 0
##$REVERSE= no
##$SF= 200.130013532006
##$SI= 16384
##$SIGF1= 3
##$SIGF2= 2
##$SINO= 400
##$SIOLD= 16384
##$SREGLST= <1H.CDCl3>
##$SSB= 0
##$STSI= 0
##$STSR= 0
##$SW_p= 3612.71676300578
##$SYMM= 0
##$S_DEV= 0
##$TDeff= 0
##$TDoff= 0
##$TI= <>
##$TILT= no
##$TM1= 0
##$TM2= 0
##$TOPLEV= 0
##$USERP1= <user>
##$USERP2= <user>
##$USERP3= <user>
##$USERP4= <user>
##$USERP5= <user>
##$WDW= 1
##$XDIM= 8192
##$YMAX_p= 0
##$YMIN_p= 0
$$ End of Bruker specific parameters
$$ ---------------------------------
##NTUPLES= NMR FID
##VAR_NAME=  TIME,          FID/REAL,        FID/IMAG
##SYMBOL=    X,             R,               I
##VAR_TYPE=  INDEPENDENT,   DEPENDENT,       DEPENDENT
##VAR_FORM=  AFFN,          ASDF,            ASDF
##VAR_DIM=   8192,          8192,            8192
##UNITS=     SECONDS,       ARBITRARY UNITS, ARBITRARY UNITS
##FACTOR=    0.000296,      1,               1
##FIRST=     0,             0,               0
##LAST=      2.424536,      0,               0
##MIN=       0,             -249757,         0
##MAX=       2.424536,      262152,          0
$$ Real data points
##PAGE= N=1
##DATA TABLE= (X++(R..R)), XYDATA
$$ [...]
823 -9191 -45320 -65373 -62671 -42250 -8130 30617 56373 63800 53241 24244 -12596 -42925 -59856
836 -59856 -59091 -36885 -2403 31114 56955 66425 52312 22962 -11890 -44903 -62396 -57127 -34822
849 -34822 -1317 35508 59410 63396 49711 20317 -16977 -46013 -59330 -55751 -32671 2055
861 2055 33907 55916 61600 45340 14546 -18715 -48462 -62694 -54793 -30035 2019 36025 57539
874 57539 57680 40930 11182 -24485 -51235 -61006 -54233 -29901 4925 35214 54184 57585 40280
887 40280 8848 -23852 -50480 -62880 -53065 -26202 6015 38173 58094 56234 37162 7290
899 7290 -27234 -52157 -58138 -48149 -22198 12715 41367 56280 56178 37241 5478 -25964 -49070
912 -49070 -58302 -47231 -19167 12806 43125 60941 57649 36232 5714 -28609 -52689 -57140 -43531
925 -43531 -16970 17749 45974 57823 53911 32818 66 -30687 -50709 -56360 -42839 -13854
937 -13854 17354 43882 58628 52338 29175 -1706 -33776 -55946 -58059 -42264 -14947 18691
949 18691 46210 55956 49159 26857 -6667 -36927 -54337 -57117 -41670 -11556 19681 43634 55493
962 55493 47738 22918 -7661 -36927 -56261 -55919 -37266 -9603 22793 48156 55389 45859 22847
975 22847 -9707 -38424 -53086 -52381 -35645 -5607 25069 46927 55879 47285 22012 -8497 -35570
988 -35570 -52968 -51172 -31783 -3203 27078 50711 55786 43710 19426 -11945 -39122 -51179
1000 -51179 -46988 -28764 406 29966 47897 53284 42093 15828 -13570 -38119 -52251 -49098
1012 -49098 -28173 -185 28216 49111 53099 38760 13841 -16690 -42776 -53360 -46827 -27275
1024 -27275 2234 30751 46806 48884 35326 8404 -20809 -41916 -52196 -46672 -24368 3795
1036 3795 29585 47577 49177 33099 7602 -20723 -44724 -53117 -43934 -22950 6202 34083 48757
1049 48757 48005 33319 6479 -22731 -42518 -49874 -42052 -18639 10193 34607 50152 49377 31398
1062 31398 4903 -22453 -43753 -50002 -38027 -15056 12961 39161 51604 47343 29991 3053
1074 3053 -26045 -43808 -47919 -38034 -13715 15417 37812 49905 47352 28059 506 -26091 -45606
1087 -45606 -50148 -36756 -12688 14993 39817 50234 43174 23822 -3490 -31433 -47433 -48010 -35646
1100 -35646 -10979 17531 38164 46831 41887 21460 -6004 -30576 -47075 -49951 -35298 -10228
1112 -10228 16141 39204 48914 40661 20594 -6281 -32854 -48024 -46891 -32263 -7414 21078
1124 21078 40698 46953 39775 18467 -9070 -31809 -44775 -44885 -28763 -3345 21872 41730 49007
1137 49007 39032 17584 -7971 -32680 -46013 -42467 -26574 -2051 25087 43398 47079 37770 16372
1150 16372 -10814 -32640 -43801 -41918 -24623 1191 24866 42060 46597 34830 12036 -12586
1162 -12586 -34902 -46509 -40626 -22848 1125 26778 42731 43298 31743 9794 -16871 -36865
1174 -36865 -45096 -40917 -23234 2837 25744 40166 43364 30805 7033 -17187 -37414 -47286 -39863
1187 -39863 -20620 3800 28270 42629 41479 27734 5302 -20313 -39292 -44125 -36854 -17969
1199 -17969 8377 30251 41816 42208 28073 4151 -19520 -37275 -44384 -35968 -15161 8943 31797
1212 31797 45384 43002 27224 4142 -20915 -39386 -42689 -32979 -12739 12955 34378 43821 40938
1225 40938 25454 669 -22632 -38339 -42648 -32271 -10624 13521 33650 44847 40317 22442
1237 22442 -558 -24634 -41373 -43130 -31854 -11360 14201 35002 42531 37642 21210 -4004
1249 -4004 -27359 -40733 -43081 -31731 -8905 15183 33310 42210 36309 17320 -5717 -28288 -42896
1262 -42896 -42525 -28904 -7466 17211 36006 41733 34388 16878 -7595 -29617 -40804 -40509 -27715
1275 -27715 -4423 18668 35339 42330 35336 15513 -7569 -28144 -41090 -39081 -23697 -1646
1287 -1646 21476 38912 42476 32912 14178 -9551 -30415 -39167 -35832 -21646 1211 23502 37549
1300 37549 41200 32375 12075 -10766 -29441 -39792 -36808 -20340 1244 22713 38738 40644 29347
1313 29347 9890 -13229 -32957 -40618 -34936 -19673 3059 24644 36719 37381 26824 6112 -16919
1326 -16919 -33073 -40320 -35463 -17719 4289 24188 37458 37790 24371 4411 -17560 -35278 -41087
1339 -41087 -33526 -16609 5900 26717 37777 36010 24221 3154 -19359 -34352 -39143 -31950 -13271
1352 -13271 9170 27807 38692 37342 22422 1717 -19231 -35181 -38983 -28582 -10311 11557
1364 11557 31523 40126 36209 22270 745 -20976 -34685 -36975 -28349 -9351 13367 30917 39500
1377 39500 36580 20970 -1042 -21449 -36153 -38453 -26876 -7159 14060 32619 39604 33248 17532
1390 17532 -3824 -25328 -37223 -37017 -26299 -6563 15724 31252 37462 32049 15459 -6394 -25328
1403 -25328 -37543 -38750 -26087 -6214 14762 31917 38198 30356 13856 -7209 -27842 -38446
1415 -38446 -36108 -23662 -4130 18197 32651 36138 29539 11917 -9639 -27135 -36866 -34863 -21303
1428 -21303 -603 19119 33758 38280 28961 11310 -8803 -27662 -36880 -32784 -19163 454 21585
1441 21585 34996 36884 28351 10744 -10817 -27385 -34812 -31551 -17544 3454 22142 34352 36814
1454 36814 26559 7684 -12017 -28824 -36460 -30773 -15651 3666 23212 34852 34480 24059 6248
1467 6248 -14804 -29994 -35571 -30833 -16008 4719 22427 32940 33982 22823 3405 -15668 -31069
1480 -31069 -37194 -30235 -13933 5377 23761 34472 32411 19714 1399 -18653 -32775 -35294 -28227
1493 -28227 -12533 8294 25222 33371 32268 20248 261 -18087 -31464 -35468 -27405 -10109 9340
1506 9340 26367 35823 32731 19026 787 -18725 -32338 -33538 -24573 -7905 12448 28805 35267
1519 35267 32011 18399 -1376 -19859 -31304 -33429 -23778 -5811 13468 28625 36349 31441 16310
1532 16310 -2295 -21205 -33197 -33356 -23441 -5952 13704 29612 34529 29232 15232 -5106 -23273
1545 -23273 -33264 -33727 -23231 -4712 14408 28174 33937 28039 11686 -7201 -24651 -35193 -33532
1558 -33532 -21560 -3764 15528 29866 33349 25913 11339 -8597 -25827 -33427 -32121 -20700 -1977
1571 -1977 16565 29085 33341 26458 9730 -8841 -24726 -33750 -31051 -17609 760 18862 31944
1584 31944 33462 24565 8838 -10131 -25815 -32185 -28101 -15777 2914 20731 30948 32926 24855
1597 24855 7653 -10389 -24803 -32131 -28194 -14330 3403 20221 31952 32597 22313 6349 -12009
1610 -12009 -27091 -32176 -26889 -13638 4537 21831 30579 30227 20908 3437 -14758 -27705 -32481
1623 -32481 -27764 -12781 5109 20694 30578 30467 18999 2438 -15144 -29302 -33181 -26204 -12278
1636 -12278 5513 22096 30244 28579 18229 972 -17065 -28595 -31851 -25449 -10325 8203 22823
1649 22823 31362 29385 17033 -289 -17113 -29429 -31915 -23227 -8098 9849 25522 32645 28670
1662 28670 17331 -253 -17704 -28273 -30013 -22614 -6791 11298 25292 32259 29343 16332 -1412
1675 -1412 -17641 -29108 -30711 -21108 -5197 12515 26933 32667 27116 13905 -3369 -20655 -30161
1688 -30161 -29679 -20648 -4457 13242 26102 30546 26218 12334 -5437 -20827 -30425 -30632 -20566
1701 -20566 -4104 12809 26575 30952 24440 10604 -6951 -23118 -31498 -29456 -18856 -2815 15066
1714 15066 26828 29541 23268 8824 -8902 -22885 -30295 -28583 -17161 -196 15910 27466 30610
1727 30610 22817 8207 -8203 -23068 -30311 -26717 -15293 1059 17853 28443 29767 22212 7921
1740 7921 -9486 -22725 -28552 -25542 -13425 3741 18827 28836 30071 21412 5741 -10602 -23876
1753 -23876 -29604 -24375 -11760 4158 19799 28981 28144 19403 4806 -12141 -24775 -28461 -24499
1766 -24499 -12054 4853 19359 27375 27729 18054 2316 -13413 -25612 -30031 -24282 -10516 5374
1779 5374 20325 28320 26296 15614 680 -15775 -27075 -29269 -23044 -9788 7074 20667 27426
1792 27426 26083 15789 -48 -15432 -26084 -29096 -22617 -8431 7588 21784 29197 25973 14895
1805 14895 -297 -16202 -26703 -27690 -20272 -6558 10162 23625 28768 25985 14759 -1750 -16840
1818 -16840 -25840 -27436 -19596 -4741 10981 24188 30138 25756 13597 -1807 -16968 -26875 -27033
1831 -27033 -18375 -4539 11870 24482 28242 23890 12363 -4139 -18701 -26768 -27193 -18657 -3290
1844 -3290 12475 23825 28097 22904 9592 -5992 -20137 -28637 -27376 -17216 -2948 12742 24478
1857 24478 27275 21046 8934 -7059 -20852 -27563 -26305 -16713 -1744 13690 23557 26996 21288
1870 21288 7646 -7543 -20692 -27781 -25610 -14618 423 15278 25930 27172 19827 6692 -8767
1883 -8767 -21801 -26725 -23358 -13217 2256 16888 25820 27166 20163 6293 -8858 -20288 -26245
1896 -26245 -23091 -11477 3184 17210 26435 26965 18434 5339 -9892 -22316 -26278 -21600 -10714
1909 -10714 4370 18387 25749 25357 17238 3202 -11856 -22538 -26677 -22309 -10194 4690 17277
1922 17277 25402 25126 15736 1761 -12511 -23914 -27318 -21429 -10237 4547 18218 25030 23738
1935 23738 15012 668 -13893 -23683 -26570 -21595 -8802 6252 18784 26023 24224 14031 -183
1948 -183 -14088 -24345 -26546 -19580 -7131 7597 20395 26210 23417 14229 -98 -14526 -23269
1961 -23269 -24690 -18876 -5993 9105 20651 26457 24451 13377 -1169 -14404 -23903 -25427 -17275
1974 -17275 -4481 10039 22329 27034 22812 12195 -2448 -16697 -24609 -24307 -17219 -4054 11089
1987 11089 21704 25357 22300 10860 -3650 -16558 -24736 -25228 -16809 -3590 10098 21493 25498
2000 25498 20414 9033 -5376 -18776 -25809 -24169 -15844 -2373 12044 21871 24270 19670 7994
2013 7994 -7041 -18864 -25313 -24374 -15070 -1103 12181 22258 24990 18824 7153 -6604 -18952
2026 -18952 -25137 -22399 -13343 41 13879 23296 24366 18604 6752 -7889 -18976 -23695 -21622
2039 -21622 -11656 2636 15200 23670 25078 17961 5390 -8208 -19742 -24407 -20302 -10009 3152
2052 3152 16200 23933 23701 16725 4488 -9529 -19917 -23331 -19958 -9990 3981 15783 22819 23090
2066 23090 15683 2240 -10680 -20779 -24998 -20124 -8985 4108 16583 23593 22103 13750 1038
2079 1038 -12743 -22304 -24375 -19773 -9013 5467 16511 22556 21577 13283 22 -12473 -21640 -24529
2093 -24529 -18984 -7304 5840 17461 23686 21412 12496 -177 -13449 -22234 -23620 -17563 -6047
2106 -6047 8051 19425 24010 21494 12239 -972 -13479 -21591 -23302 -16605 -4222 8848 19437
2119 19437 24690 21559 11597 -1016 -13750 -21978 -22264 -15671 -3864 9552 20341 23714 20274 10892
2133 10892 -2652 -14878 -22241 -22608 -15647 -2948 10329 20006 23971 19721 8792 -4192 -16294
2146 -16294 -23470 -22750 -14617 -2869 10169 20235 22620 17891 7752 -5388 -17146 -22973 -22100 -14788
2160 -14788 -1857 10618 19816 22365 17719 6690 -6325 -17377 -23596 -21635 -12519 -375 12250
2173 12250 21374 22581 16574 6051 -6991 -18019 -22544 -19777 -11569 1152 13612 20944 22259
2186 22259 16782 5269 -7477 -17071 -21914 -19249 -9750 2401 13995 21975 22170 15557 4394 -8165
2200 -8165 -18367 -21784 -17930 -8943 3797 15758 21565 21536 14941 2836 -9690 -18570 -22107 -18660
2214 -18660 -8029 4021 14884 21301 20841 13092 1744 -10143 -19714 -22399 -17552 -8021 4347
2227 4347 15429 20865 19526 12275 230 -11907 -20253 -22264 -17731 -7109 5757 15934 21690
2240 21690 19969 11194 -1065 -12446 -20981 -22433 -16338 -6017 6343 17312 21573 19275 11290
2253 11290 -572 -12728 -19897 -20866 -15752 -4540 7806 17357 21951 19846 10737 -1681 -12732
2266 -12732 -20290 -21101 -14146 -2928 9043 18867 22788 19081 9915 -2187 -14079 -20604 -20067 -13665
2280 -13665 -2316 9722 18650 21742 18451 8670 -3514 -14114 -20475 -20760 -13374 -1890 9415
2293 9415 18588 21164 16826 6901 -4885 -16069 -21485 -19749 -12879 -1577 10720 18725 20496 16033
2307 16033 5826 -6632 -16523 -21596 -20186 -12220 -271 10637 18951 20860 14978 4677 -6688
2320 -6688 -16503 -21326 -18370 -10581 625 12464 19332 19899 14747 4602 -7415 -16588 -20241 -18074
2334 -18074 -9004 2783 13508 20010 20738 14181 3308 -7656 -16814 -20534 -16572 -7809 3220 14232
2348 14232 20206 19641 13348 3129 -8487 -16833 -19346 -16054 -7576 4219 13943 19743 19531 12658
2362 12658 1683 -9137 -17634 -20726 -16140 -6638 4507 14701 19808 18383 10804 569 -10948
2375 -10948 -19052 -20116 -15982 -6573 5087 14342 19082 17946 10655 -837 -11525 -18503 -20498 -15516
2389 -15516 -5470 5696 14867 19810 17565 9521 -1222 -11969 -19282 -19845 -14210 -4491 7077 16613
2403 16613 20241 17626 9778 -1912 -12356 -18733 -19358 -13496 -2861 7975 16836 20462 17637 8907
2417 8907 -1487 -12208 -18962 -18327 -12206 -2274 8973 17253 19932 17024 8261 -3124 -13126 -18942
2431 -18942 -18734 -12036 -1263 9837 17439 20268 16188 7112 -4302 -14047 -19804 -18804 -11468 -1235
2445 -1235 9706 17355 18921 14711 5935 -5270 -14730 -19607 -18239 -11547 -597 9898 16750 18721
2459 18721 14153 4358 -6269 -15272 -20045 -18176 -9942 491 10729 17970 18728 13362 4095 -7073
2473 -7073 -15739 -19078 -16546 -9288 1844 11768 17788 18494 13208 3572 -7033 -15117 -18608 -15864 -7270
2488 -7270 3020 12214 18614 18578 12237 3045 -7345 -15737 -18252 -14865 -6876 3708 13824 18849
2502 18849 18189 12098 1712 -8689 -15811 -18384 -14721 -6012 4344 13442 18379 17541 10487 806
2516 806 -9017 -16571 -18715 -14041 -5926 4306 13499 17983 16129 9795 -366 -10810 -17382 -18751
2530 -18751 -14569 -5358 5534 13709 18135 16476 8848 -1488 -11093 -17918 -18887 -13363 -4753 5581
2544 5581 14502 18107 15762 8807 -1310 -11308 -17116 -17725 -12637 -3601 7152 14877 18268 16350 8316
2559 8316 -2051 -11096 -17584 -17920 -11448 -2346 8211 16278 19062 15724 7740 -2073 -12096 -17446
2573 -17446 -16865 -11243 -1537 8860 15993 18407 15218 7053 -3450 -12203 -17324 -16912 -10729 -925 8961
2588 8961 16160 18379 13987 5718 -4358 -13734 -18367 -16723 -10194 -456 9653 16244 17306 13423
2602 13423 4540 -6268 -14247 -18315 -16914 -9619 413 9481 16148 17365 12272 3519 -6256 -14421
2616 -14421 -18110 -15814 -8609 605 10347 16227 16623 12177 3247 -7058 -14360 -17388 -15406 -7678 2331
2631 2331 11399 17062 17634 11930 2782 -7093 -14482 -17144 -13987 -6474 2874 12318 17454 16482 11264
2646 11264 2897 -7311 -14460 -16512 -13662 -6035 3985 12388 16888 16749 10612 1259 -8023 -14776
2660 -14776 -17345 -13595 -5011 4146 12804 17501 15836 9458 357 -9131 -15943 -17173 -12949 -5034 4601
2675 4601 12579 16254 15187 9011 -733 -9951 -15786 -17379 -13011 -4349 5022 12827 16570 14529 7690
2690 7690 -1267 -10597 -16753 -17111 -12389 -3916 6104 14008 16801 14654 7951 -2011 -10908 -15926 -16743
2705 -16743 -11621 -2574 6820 14106 17135 14451 7257 -1780 -10566 -15883 -15707 -10359 -1935 7634 14859
2720 14859 16936 14387 7323 -2981 -11158 -15821 -15727 -10032 -1118 8449 15174 17420 13973 5934 -3551
2735 -3551 -11945 -16473 -15513 -9299 -676 8216 15005 16280 12466 4817 -4419 -12565 -16210 -15299 -9156
2750 -9156 -162 8553 14413 15807 12025 3595 -5438 -13290 -16920 -15194 -8583 279 9411 15490 15737
2765 15737 10947 3280 -6348 -14094 -16483 -14509 -7934 1236 9994 15167 15636 11074 2621 -6265 -13151
2780 -13151 -15944 -13566 -6493 2440 10546 15859 15806 10430 2171 -6598 -13685 -15460 -12697 -5914 3251
2795 3251 11941 15874 15442 10214 1648 -7413 -13450 -15752 -12438 -4984 4102 11759 15775 14880 9028
2810 9028 817 -7682 -14244 -15716 -11949 -4616 4167 11867 15248 13892 8270 -272 -9184 -14713 -16279
2825 -16279 -12315 -4488 4712 11995 15681 14234 7653 -1326 -9581 -15476 -16287 -11656 -3723 5193 12375
2840 12375 15311 12980 6960 -1611 -10380 -15119 -15234 -11011 -2864 6067 12588 15673 13420 6588 -2344
2855 -2344 -10418 -15457 -15480 -9722 -1750 7093 13993 16348 12954 6364 -2323 -10489 -14975 -14133 -9396 -886
2871 -886 7992 13963 15936 13079 5773 -3209 -10753 -14964 -14121 -8778 48 7982 14202 15847 11809
2886 11809 4739 -3975 -11836 -15421 -14130 -8065 187 8614 14221 15036 11296 3563 -5348 -12104 -15650
2901 -15650 -14303 -8169 610 8535 13811 14542 10199 2747 -5711 -12482 -15821 -13236 -7299 822 9198
2916 9198 14180 14320 10001 2199 -6391 -12942 -15253 -13213 -6802 2089 9873 14454 14656 9653 1932
2931 1932 -6289 -12791 -15148 -12015 -5306 2848 10664 14851 14181 9089 1561 -6975 -12606 -13827 -11359
2946 -11359 -4643 3815 10937 14756 14219 9157 742 -7454 -12908 -14672 -11041 -3661 4262 11585 15225
2961 15225 13519 7757 137 -8322 -13450 -14313 -10652 -3800 4878 11391 14075 12574 6903 -1419 -9005
2976 -9005 -13649 -14664 -10740 -3160 4775 11484 14671 12232 6169 -1683 -9739 -14689 -14665 -10243 -2772
2991 -2772 5920 12424 14252 12492 5952 -2494 -10110 -13810 -14394 -9462 -1641 6357 12267 14727 11780
3006 11780 5248 -2450 -9834 -14047 -13468 -8308 -1033 7095 13012 14480 11835 5490 -2914 -10408 -13836
3021 -13836 -13209 -8354 119 8159 13341 15185 11904 4394 -3525 -10447 -14236 -12946 -7392 226 7974
3036 7974 13492 14081 10542 3619 -4414 -11111 -14111 -12587 -7609 500 8098 13046 13661 10038 2763
3051 2763 -5094 -11585 -14709 -12930 -6494 914 8285 13364 13478 9051 1841 -5919 -12278 -14284 -12068
3066 -12068 -6264 1610 9073 13189 13167 8952 1649 -6192 -11783 -14161 -11447 -5268 2691 9524 13590
3081 13590 13197 8204 1282 -6255 -12246 -13599 -10680 -4327 3586 10497 14051 13176 8302 676 -6864
3096 -6864 -12222 -13500 -10454 -3696 4392 10402 13694 12653 7197 -41 -7386 -12322 -13031 -9670 -3060
3111 -3060 4528 11019 13716 11716 6975 -683 -8270 -12769 -13721 -10057 -2829 4925 10698 13337 11790
3126 11790 5935 -1808 -8804 -13441 -13807 -9588 -2516 4855 10806 13236 11061 5378 -2063 -9381 -13145
3141 -13145 -13427 -9190 -2042 5879 11286 13376 11155 4976 -2632 -9270 -13463 -13162 -8276 -1081 6456
3156 6456 12293 13893 10861 4887 -2634 -9475 -13153 -11985 -7505 -431 7153 12234 13440 10863 4380
3171 4380 -3208 -9465 -12896 -12135 -6749 449 7445 12667 14041 10276 3830 -3799 -10405 -13372 -11800
3186 -11800 -6823 573 8044 12362 13054 9696 3056 -4979 -10663 -13387 -11896 -6299 1392 8039 12221
3201 12221 12709 8458 1711 -5284 -11569 -13567 -11321 -5872 1214 8592 12136 12124 8101 1480 -6133
3216 -6133 -11408 -13410 -11373 -5196 2497 8753 12282 12488 7641 534 -6477 -11658 -12863 -10022 -3948
3231 -3948 3169 9511 12913 11798 7376 698 -6185 -11223 -12216 -9337 -3698 3983 9896 13109 12322
3246 12322 7226 349 -6820 -11510 -12593 -9096 -2684 4316 10150 13181 11721 6468 -192 -7634 -11903
3261 -11903 -11996 -8946 -2783 4522 10285 12384 11098 5766 -1391 -8049 -11930 -12435 -8790 -2304 4749
3276 4749 10236 12588 10667 4795 -1976 -8938 -12873 -12416 -8363 -2128 5375 10852 12293 10407 4698
3291 4698 -2807 -9301 -12678 -12491 -7882 -926 5833 11018 12702 9741 3985 -2875 -8999 -12659 -11487
3306 -11487 -6922 -663 6818 11470 12713 9806 4075 -3241 -9426 -12494 -11326 -7033 349 7318 12095
3321 12095 12838 9688 3501 -3428 -9524 -12483 -10984 -5671 1048 7529 11987 12230 8904 2862 -4368
3336 -4368 -10071 -11927 -10806 -5793 1566 7888 11677 12137 8255 2004 -5153 -10439 -12646 -10749 -5489
3351 -5489 1683 7817 11841 11518 7337 1159 -5895 -10970 -12390 -10121 -4933 2016 8245 11295 10709
3366 10709 6899 523 -5963 -10809 -12303 -9905 -3814 2847 8550 11723 10954 6608 480 -6219 -11091
3381 -11091 -11995 -9105 -3656 3631 9458 12013 11332 6657 35 -6660 -10304 -11470 -8527 -2473 4069
3396 4069 9408 12167 10698 5678 -598 -6422 -10709 -11314 -7801 -2199 4375 9987 12030 10287 5676
3411 5676 -1136 -7448 -11245 -11429 -8158 -2146 4662 9834 11881 10125 4956 -2074 -7745 -11597 -11583 -7776
3427 -7776 -1665 4879 9789 11392 9248 4446 -2352 -8555 -11808 -11315 -7676 -1453 5079 9710 11396
3442 11396 9430 3762 -2681 -8814 -11487 -11306 -7292 -985 5703 10384 11874 9191 3891 -2812 -8799
3457 -8799 -11441 -10434 -6359 -181 6645 10489 11835 9082 3527 -3290 -8478 -11214 -10412 -5723 791
3472 791 6831 11354 12074 8982 3138 -3387 -8999 -11485 -9870 -5773 692 7029 11277 11396 8479 2648
3488 2648 -4002 -9409 -11477 -10203 -5366 1104 7053 10625 11052 7601 1546 -4703 -9849 -11523 -9775
3503 -9775 -4985 972 7206 10759 10237 7067 1520 -5471 -10046 -11538 -9948 -4856 1863 7503 10696
3518 10696 10754 6601 775 -5336 -10108 -11215 -8847 -3628 2202 8027 10790 10221 6492 522 -5648
3533 -5648 -9906 -10765 -8406 -3426 3327 8540 11281 10454 6193 25 -5697 -9810 -10928 -7997 -2691
3548 -2691 3613 8808 11449 10073 5714 -109 -6150 -9934 -10453 -7493 -2372 3774 8978 10914 9506
3563 9506 5337 -1220 -6778 -10058 -10824 -7430 -1956 4250 8849 11190 9354 4652 -1481 -7301 -11097
3578 -11097 -11005 -7626 -2143 4603 9169 10665 9139 4080 -2241 -7927 -10583 -10851 -7064 -1295 4918
3593 4918 9217 10702 8460 3375 -2168 -7602 -11099 -10490 -6118 -647 5342 9730 10857 8600 3635
3608 3635 -2689 -8116 -10463 -9989 -6031 86 5967 10379 11310 8474 3237 -2925 -7967 -10586 -9470
3623 -9470 -5176 491 6364 10372 10893 7911 2820 -3592 -8417 -10348 -9196 -5023 1019 6907 10104
3638 10104 10439 7902 1993 -3970 -8653 -10947 -9291 -4697 1120 6684 10025 10135 6504 1337 -4726
3653 -4726 -9417 -10666 -8955 -4445 1432 6922 10011 9621 6150 407 -5290 -9337 -10530 -8653 -3766
3668 -3766 2032 6926 10028 9578 5785 636 -5060 -9609 -10504 -8195 -3100 2868 8098 10292 9527 5876
3684 5876 33 -5415 -9463 -9892 -7579 -2109 3560 8106 10554 9378 5090 -487 -5653 -9430 -9752
3699 -9752 -6791 -2014 3632 8622 10678 8929 5168 -737 -6284 -9721 -9828 -7249 -2130 4014 8485
3714 8485 10767 9139 4234 -1515 -6905 -9988 -9749 -6227 -1268 4262 8707 10306 7844 3554 -2148
3729 -2148 -7407 -10168 -9858 -6508 -1138 4545 8770 9967 8007 3595 -2395 -7486 -10449 -10099 -6067
3744 -6067 -797 5024 9032 10078 7737 3017 -2531 -7741 -10049 -9361 -5335 40 5796 9222 9935
3759 9935 8013 2875 -2926 -7627 -9806 -8810 -4905 681 5931 9788 10453 7548 2562 -3176 -7941
3774 -7941 -9909 -8491 -4570 909 6555 9914 9907 7132 2069 -3898 -8071 -9908 -8470 -4297 1407 6563
3790 6563 9565 9438 6365 1116 -4427 -8495 -10234 -8192 -3833 1448 6790 9506 9202 6004 608
3805 608 -4996 -9014 -10139 -8135 -3743 2011 6622 9285 8833 5305 -72 -5229 -9195 -9945 -7723 -2837
3821 -2837 2476 7185 9653 8559 5064 -52 -5701 -9130 -9398 -7264 -2446 3140 7635 9815 9135
3836 9135 4937 -503 -5360 -8795 -9359 -6630 -1853 3304 8077 10106 8919 4807 -261 -5761 -8954
3851 -8954 -9137 -6281 -1455 4078 8298 9416 8199 4333 -1289 -6298 -8944 -9191 -6293 -1095 3863
3866 3863 8149 9865 8027 3652 -1447 -6640 -9711 -9233 -6445 -1565 4312 8314 9422 7486 3289
3881 3289 -2103 -7160 -9603 -9528 -5876 -1011 4332 8079 9568 7404 2738 -2488 -7227 -9686 -9007 -5821
3897 -5821 -396 4949 8629 9331 7215 2959 -2741 -7214 -9270 -8812 -5302 266 5393 8854 9611 7470
3913 7470 2700 -2913 -7187 -9290 -8144 -4412 708 6006 9174 9504 6941 2106 -3205 -7459 -9200
3928 -9200 -7911 -4084 1239 5886 9109 9441 6658 1746 -3476 -7849 -9406 -7972 -3852 1292 6045
3943 6045 9169 8662 5736 1112 -4266 -8127 -9320 -7588 -3585 1574 6581 8584 8282 5341 492
3958 492 -4771 -8247 -9540 -7865 -3149 2012 6388 8791 8416 5093 111 -4699 -8381 -9529 -7237
3973 -7237 -2901 2123 6781 8889 8150 5120 -199 -4893 -8298 -8926 -6805 -1931 3093 7161 9163
3988 9163 8423 4409 -589 -4923 -8340 -8733 -6011 -1729 3491 7371 9277 8118 4829 -198 -5400
4003 -5400 -8376 -8747 -6276 -1580 3686 7371 9256 8281 4010 -1106 -5621 -8553 -8789 -5776 -1263 3692
4019 3692 7604 8834 7365 3313 -1783 -6405 -9038 -8713 -6012 -1302 3943 7333 8693 7137 3243
4034 3243 -2323 -6552 -9163 -8902 -5733 -860 4111 7909 9030 6887 2919 -2149 -6832 -8785 -8127
4049 -8127 -5305 -182 4653 8062 8797 7060 2689 -2601 -6763 -8894 -8018 -4286 196 4864 8351
4064 8351 9135 6845 2217 -2636 -6939 -8594 -7713 -4226 778 5568 8596 8706 6318 1795 -3276 -6916
4080 -6916 -8554 -7523 -3704 1261 5686 8455 8579 5649 1221 -3396 -7734 -9001 -7212 -3373 1397
4095 1397 5640 8254 8080 5409 897 -4379 -8076 -8734 -7347 -3450 1656 5855 8417 7982 4737 164
4111 164 -4804 -7753 -8963 -6894 -2530 1889 6144 8371 7529 4497 -104 -4719 -7917 -8522 -6461 -2361
4127 -2361 2602 6743 8556 8155 4512 -122 -4541 -7994 -8564 -6177 -1727 2980 6909 8846 7473
4142 7473 4291 -426 -4993 -7978 -7908 -5267 -1372 3501 7495 8572 7709 4075 -1112 -5009 -7909 -7997
4158 -7997 -5356 -990 3583 7453 8631 7313 3520 -964 -5395 -8362 -8212 -5535 -1416 3849 7087
4173 7087 8219 6922 3187 -1999 -6407 -8569 -8447 -5383 -980 3798 7173 8212 6549 2461 -2068
4188 -2068 -6236 -8693 -8064 -5041 -500 4348 7559 8121 6586 2591 -2353 -6526 -8379 -7951 -4618 163
4204 163 4543 7770 8508 6596 2018 -2516 -6525 -8460 -7215 -3703 560 5102 8198 8317 6174 1936
4220 1936 -2943 -6607 -8081 -7234 -3706 1001 5477 8022 8152 5933 1521 -3087 -6572 -8058 -6929
4235 -6929 -3500 1145 5441 8046 7919 5290 886 -3614 -7224 -8302 -6807 -3373 1372 5487 7813
4250 7813 7541 4954 275 -4199 -7253 -8299 -6611 -3107 1693 5578 7861 7362 4083 285 -4161
4265 -4161 -7571 -8553 -6372 -2402 2085 6135 7950 7219 4291 -168 -4759 -7263 -7938 -5972 -1983 2644
4281 2644 6309 8080 7146 3739 -439 -4577 -7251 -7798 -5304 -1508 2825 6794 8359 7165 4209
4296 4209 -227 -4826 -7362 -7383 -5301 -1246 3289 6884 8454 6792 3292 -925 -5011 -7650 -7748 -5032
4312 -5032 -1041 3678 6910 8039 6342 3331 -1283 -5493 -8079 -7626 -4999 -1034 3555 6632 7935
4327 7935 6471 2841 -1946 -6062 -8044 -7692 -4892 -861 3861 6829 7598 5925 2289 -2022 -6151
4342 -6151 -8061 -7222 -4352 -214 4133 7246 7593 5692 1849 -2684 -6011 -7659 -7181 -3905 165 4569
4358 4569 7435 8002 5791 2137 -2455 -6129 -7531 -6569 -3571 776 4941 7544 7977 5879 1829 -2841
4374 -2841 -6237 -7695 -6554 -2942 1152 5250 7522 7589 5179 1005 -3028 -6466 -7639 -6292 -3039
4389 -3039 1328 5066 7460 7350 4710 765 -3765 -7056 -7804 -6313 -2900 1523 5278 7283 7251 4310
4405 4310 89 -4313 -7027 -7558 -5918 -2624 2016 5607 7375 6376 3779 -118 -4379 -7056 -7737 -5774
4421 -5774 -2141 2390 5834 7197 6760 3967 -458 -4700 -7186 -7279 -5173 -1401 2572 6077 7818 6478
4437 6478 3409 -485 -4587 -6962 -7235 -4963 -971 3446 6441 7905 6602 3225 -917 -4699 -7002
4452 -7002 -7200 -4849 -907 3330 6361 7604 6368 3113 -973 -4980 -7463 -6899 -4848 -1128 3540
4467 3540 6446 7554 6166 2711 -1678 -5436 -7081 -7155 -4397 -488 3639 6397 7291 5594 2035 -2062
4483 -2062 -5637 -7765 -7095 -4410 -440 4048 6762 7113 5695 2081 -2375 -5914 -7939 -7148 -4142 145
4499 145 4000 6648 7392 5386 1831 -2440 -5878 -7410 -6569 -3419 424 4554 7235 7122 5290 1680
4515 1680 -2464 -6090 -7261 -6299 -3111 1216 5039 7162 7522 5254 1488 -2594 -5993 -7262 -5844
4530 -5844 -2497 1268 4944 7513 7142 4729 1089 -3281 -6243 -7334 -6007 -2618 1413 5143 6986
4545 6986 6830 4302 80 -3840 -6464 -7359 -5903 -2635 1673 4982 7066 6343 4142 -38 -3691 -6967
4561 -6967 -7472 -5455 -2346 1906 5568 7028 6271 3680 -640 -4424 -6890 -7118 -5167 -1486 2330 5569
4577 5569 7047 6097 3326 -378 -4473 -6885 -6629 -4865 -1098 2814 5902 7537 6330 3556 -703
4592 -703 -4431 -6455 -6922 -4691 -948 3114 6074 7454 6336 3025 -981 -4607 -6709 -6376 -4340 -559
4608 -559 3423 6294 7155 5704 2410 -1219 -4979 -6915 -6737 -4308 -547 3141 6120 7009 5723 2557
4624 2557 -1868 -5378 -6947 -7025 -4373 -562 3446 6297 7028 5221 1882 -2169 -5715 -7252 -6575 -3841
4640 -3841 66 3817 6401 6903 5124 1682 -2250 -5522 -7195 -6420 -3358 560 4154 6748 7073 5000
4656 5000 1577 -2479 -5745 -7092 -5974 -3313 812 4575 6869 6879 4852 1186 -2777 -5512 -6668
4671 -6668 -5691 -2622 1085 4778 7036 6900 4650 695 -2788 -5984 -6800 -5521 -2271 1401 4741 7007
4687 7007 6469 4328 657 -3154 -5748 -6932 -5532 -2088 1456 4886 6544 6195 3883 11 -3472
4702 -3472 -6260 -7085 -5406 -2152 1744 5127 6626 5837 3466 -277 -4067 -6423 -6880 -5135 -1749 1879
4718 1879 4973 6533 5964 3166 -544 -4178 -6352 -6630 -4968 -1236 2486 5446 7026 5950 2739
4733 2739 -639 -4317 -6561 -6494 -4478 -962 2991 6003 6870 5800 2886 -934 -4369 -6369 -6241 -4047
4749 -4047 -346 3011 5737 7090 5579 2609 -811 -4457 -6411 -6180 -3944 -682 3254 6102 6799
4764 6799 5438 2316 -1660 -4865 -6580 -6430 -4065 -381 3412 5835 6729 5120 1831 -1924 -4826
4779 -4826 -6797 -6220 -3779 -209 3411 6092 6443 4819 1719 -2122 -5329 -6598 -5988 -3761 -86 3766
4795 3766 5947 6529 4408 1340 -2352 -5496 -6836 -5712 -3104 827 4029 6552 6639 4778 1334 -2710
4811 -2710 -5374 -6284 -5589 -2683 782 4608 6320 6563 4721 784 -2725 -5453 -6486 -5159 -2396 1309
4827 1309 4474 6486 6375 4233 643 -3119 -5610 -6198 -4881 -2090 1889 4801 6195 6072 3680 232
4843 232 -3350 -5873 -6469 -5345 -2201 1567 4798 6104 5558 3197 -114 -3541 -6084 -6621 -4780 -1873
4859 -1873 2027 5039 6170 5698 3103 -641 -4238 -5902 -6469 -4570 -1312 2252 4802 6104 5677 2991
4875 2991 -741 -3933 -6116 -6288 -4263 -1169 2362 5198 6554 5415 2884 -601 -3970 -5863 -5656
4890 -5656 -3962 -883 2683 5295 6144 5417 2742 -1063 -3944 -6054 -5945 -3366 -305 3106 5790 6326
4906 6326 5115 2350 -1083 -4386 -6008 -5817 -3894 -542 3115 5658 6188 5071 2200 -1352 -4760
4921 -4760 -6165 -5939 -3593 -42 3142 5461 6386 4806 1813 -1919 -5319 -6557 -5999 -3501 65 3488
4937 3488 5706 5937 4730 1264 -2398 -5161 -6324 -5785 -2979 482 3599 5765 6116 4425 1238 -1998
4953 -1998 -5131 -6439 -5527 -2905 834 4132 6062 6127 4323 1059 -2821 -5213 -5873 -5229 -2325 1265
4969 1265 4268 6334 6252 4056 917 -2714 -5228 -5880 -4674 -2025 1192 4244 6108 5798 3891 508
4985 508 -2558 -5103 -5618 -4974 -2141 1504 4429 6045 5593 3367 92 -3178 -5700 -6110 -4656 -1802
5001 -1802 1709 4485 5923 5455 2990 -240 -3531 -5737 -6103 -4565 -1602 1882 4624 5642 5404 2567
5017 2567 -396 -3779 -5652 -6051 -4166 -1085 1911 4957 5883 5007 2712 -838 -3928 -5580 -5716 -3860
5033 -3860 -849 2661 5053 6043 5353 2499 -743 -3908 -5588 -5464 -3602 -154 2658 5349 6212 4941
5049 4941 2193 -792 -4322 -5827 -5600 -3267 -293 3018 5600 5926 4617 2022 -1734 -4171 -5800
5064 -5800 -5635 -3378 -185 3055 5245 6001 4498 1877 -1559 -4449 -5953 -5506 -3555 -105 3274 5302
5080 5302 5596 4080 1499 -1995 -4586 -6112 -5615 -2935 218 3551 5394 5801 4206 1082 -2227 -5061
5096 -5061 -5811 -5227 -2641 483 3573 5848 5718 4154 1081 -2368 -4941 -5740 -4995 -2706 739 3820
5112 3820 5660 5639 4099 948 -2427 -4785 -5762 -4815 -1796 1523 4262 5895 5564 3935 776 -2636
5128 -2636 -5011 -5772 -4350 -1823 1472 4362 5836 5373 3394 289 -2926 -4922 -5703 -4498 -1566 1573
5144 1573 4230 5532 4963 2769 -282 -3177 -5197 -5738 -4522 -1713 1588 4448 5774 4728 2458
5159 2458 -416 -3584 -5662 -5734 -4163 -1078 1828 4310 5760 4775 2131 -412 -3687 -5527 -5601 -3833
5175 -3833 -929 2247 4650 5697 4679 2352 -810 -3490 -5350 -5385 -3597 -576 2819 5059 5916 4796
5191 4796 2153 -1052 -3904 -5315 -5232 -3249 -412 2738 5073 5913 4641 2046 -1088 -4010 -5447 -4882
5207 -4882 -3079 -21 3171 4717 5547 4223 1644 -1464 -4272 -5586 -5078 -3108 84 2958 5095
5222 5095 5560 4049 1484 -1978 -4696 -5710 -5087 -2890 118 3336 5037 5365 4194 852 -2142 -4711
5238 -4711 -5815 -5086 -2729 320 3471 5267 5522 3518 1160 -2327 -4698 -5431 -4960 -2474 638 3566
5254 3566 5489 5429 3634 841 -2270 -4500 -5514 -4595 -1975 1143 3906 5328 5278 3556 754 -2594
5270 -2594 -4439 -5495 -4193 -1860 1225 4340 5435 5156 3107 358 -2736 -4621 -5277 -4034 -1650
5285 -1650 1596 4262 5585 5002 2860 38 -2987 -4911 -5307 -3645 -1134 1623 4285 5366 4627 2508
5301 2508 -524 -3281 -5113 -5312 -4212 -1323 1796 4173 4943 4461 2224 -491 -3479 -5161 -5374 -3817
5317 -3817 -1219 2097 4216 5106 4303 2051 -569 -3415 -5433 -5054 -3500 -474 2458 4908 5420 4509
5333 4509 2226 -787 -3454 -5076 -5169 -3038 -356 2441 4781 5472 4237 1835 -796 -3769 -5126 -4875
5349 -4875 -2916 -269 2919 5195 5411 3953 1960 -1238 -3870 -5106 -4979 -2953 17 2994 4860
5364 4860 5219 4131 1494 -1446 -4037 -5170 -4726 -3019 -10 2663 4524 5049 3524 1185 -1927 -4293
5380 -4293 -5332 -4818 -2723 265 3039 4725 4881 3614 884 -2071 -4480 -5529 -5001 -2362 599 3154
5396 3154 4800 4976 3559 752 -2043 -4346 -5244 -4453 -2269 625 3537 4951 5148 3466 453 -2340
5412 -2340 -4295 -5174 -4197 -1784 1176 3744 5309 5058 3411 683 -2642 -4612 -4944 -3972 -1916 1418
5428 1418 4022 5210 4741 2938 17 -2514 -4481 -4915 -3621 -1435 1553 3745 5028 4757 2463 -89
5444 -89 -2649 -4829 -5020 -3925 -1230 1494 3987 4976 4541 2438 -498 -2973 -5159 -5091 -3675 -1163 1725
5461 1725 3951 4902 4321 2057 -714 -3336 -4946 -4821 -3396 -986 1863 4008 4772 4041 2298 -760
5477 -760 -3482 -4723 -4627 -3139 -376 2064 4444 4871 4321 1977 -820 -3299 -4790 -4517 -2999 -446
5493 -446 2819 4586 5227 4117 1882 -927 -3569 -4924 -4371 -2834 -62 2825 4648 4990 4118 1673
5509 1673 -1196 -3444 -5104 -4752 -2918 142 2418 4663 5080 3717 1192 -1744 -4085 -5278 -4470 -2532
5525 -2532 75 2856 4580 4859 3501 913 -1765 -4040 -5137 -4688 -2364 373 2847 4496 4733 3347
5541 3347 893 -1949 -4402 -5011 -4293 -2464 353 3033 4699 4621 3574 917 -2134 -4214 -4958 -4177
5557 -4177 -1949 901 3295 4855 4980 3181 510 -1949 -4189 -4614 -3773 -1651 1278 3419 4902 4592
5573 4592 2881 520 -2308 -4057 -4607 -3873 -1575 1404 3834 5000 4491 2901 -55 -2401 -4535 -4730
5589 -4730 -3445 -1176 1570 3909 5161 4311 2337 -170 -2933 -4640 -4670 -3416 -1268 1488 3441 4648
5605 4648 4125 2128 -383 -2966 -4269 -4716 -3548 -973 1469 3807 4846 3990 2040 -673 -3081 -4585
5621 -4585 -4849 -3130 -789 1941 3930 4946 3862 2045 -739 -3046 -4583 -4629 -2794 -447 2259 4156
5637 4156 4765 4080 1751 -985 -3075 -4622 -4291 -2939 -296 2180 4206 5028 4017 1834 -1161 -3064
5653 -3064 -4690 -4213 -2470 -119 2543 4277 4851 3711 1602 -1361 -3530 -4534 -4128 -2359 -70 2601
5669 2601 4246 4543 3437 1152 -1375 -3651 -4932 -4341 -2395 261 2847 4408 4634 3382 1033 -1752
5685 -1752 -4054 -4750 -4426 -2364 294 2831 4472 4682 3238 886 -1526 -3701 -4583 -3902 -2079 579
5701 579 2705 4237 4414 3035 574 -1901 -3849 -4711 -3948 -1804 856 3037 4302 4542 2945 398
5717 398 -1981 -4060 -4547 -3360 -1919 1415 3565 4707 4095 2897 411 -2051 -3979 -4488 -3512 -970
5733 -970 1464 3431 4728 4388 2784 244 -2369 -4195 -4431 -3809 -1237 1293 3832 4591 4180 2556
5749 2556 -292 -2831 -4418 -4701 -3409 -1088 1426 3468 4053 3854 1984 -533 -2843 -4138 -4584 -3358
5765 -3358 -1027 1446 3732 4670 3845 1989 -528 -2832 -4191 -4370 -3014 -429 2015 3852 4619 3944
5781 3944 1939 -599 -2854 -4343 -4382 -2954 -316 2274 4057 4835 3867 1896 -633 -3297 -4164 -4177 -2761
5798 -2761 -165 2131 4070 4630 3808 1509 -801 -3223 -4398 -4266 -2855 7 2226 4114 4577 3705
5814 3705 1384 -1152 -3195 -4373 -4007 -2457 -11 2326 4316 4353 3288 1172 -1532 -3741 -4782 -4110
5830 -4110 -2337 -21 2558 3979 4471 2895 893 -1739 -3653 -4477 -4006 -2203 461 2833 4271 4258
5846 4258 2939 831 -1838 -3727 -4458 -3890 -2003 602 2969 4572 4499 2919 630 -1567 -3866 -4422
5862 -4422 -3473 -1716 841 3181 4466 4151 2872 394 -1980 -3850 -4268 -3311 -1535 903 3132 4413
5878 4413 4088 2733 207 -1805 -3883 -4289 -2954 -1163 1203 3442 4474 4110 2165 264 -2511 -3792
5894 -3792 -4044 -3190 -835 1348 3468 4379 3661 2053 -387 -2392 -3797 -4243 -3198 -1007 1107 3446
5910 3446 4260 3546 1857 -432 -2785 -4015 -4239 -3205 -1007 1824 3477 4176 3439 1776 -556 -2930
5926 -2930 -4087 -4183 -2568 -391 1962 3452 4390 3396 1576 -387 -2838 -4013 -4039 -2542 -445 2286
5942 2286 3894 4362 3488 1461 -799 -3141 -4041 -3875 -2333 46 2082 3654 4421 3440 1314 -1182
5958 -1182 -3090 -4137 -3908 -2417 -122 1875 3768 4203 3160 1045 -1182 -3361 -4372 -3974 -2329 105
5974 105 2468 3934 4026 3249 999 -1590 -3636 -4257 -3924 -2093 347 2210 4014 4106 2734 807 -1404
5991 -1404 -3556 -4194 -3870 -2043 622 2686 3879 3966 2777 770 -1688 -3595 -4355 -3505 -1440 861
6007 861 2780 4186 3891 2614 443 -1929 -3642 -4100 -3335 -1573 887 3104 4336 4049 2700 425
6023 425 -2124 -3565 -3894 -3088 -1164 1129 3101 3997 3961 2207 110 -2115 -4000 -4191 -2963 -1369 1131
6040 1131 3283 4141 4065 2035 -197 -2461 -3853 -4288 -3016 -831 1560 3210 4066 3530 1640 -486
6056 -486 -2697 -3832 -4026 -2797 -686 1447 3472 3787 3429 1733 -655 -2587 -3938 -3956 -2720 -652
6072 -652 1664 3512 4255 3321 1553 -702 -2500 -4072 -3973 -2605 -560 1911 3718 4121 3211 1539 -777
6089 -777 -2855 -3914 -3800 -2267 -110 2080 3690 3988 3423 1466 -682 -2854 -3780 -3639 -2200 -103
6105 -103 2017 3717 4151 3129 1103 -1120 -3034 -4195 -3620 -2021 -1 2280 3480 4164 2965 1052
6121 1052 -1427 -3160 -3951 -3431 -1924 -138 2276 3521 3708 2810 472 -1692 -3172 -4053 -3714 -2076
6137 -2076 -70 2293 3726 3874 2569 531 -1789 -3410 -4192 -3459 -1969 484 2528 3906 3929 2471
6153 2471 670 -1875 -3251 -3853 -3141 -1330 716 2834 3958 3904 2511 446 -1964 -3703 -3852 -3209
6169 -3209 -1223 1130 2790 4047 3708 2344 301 -1969 -3494 -3775 -2766 -994 1082 3105 4117
6184 4117 3476 2107 -20 -2248 -3394 -3880 -2864 -624 1353 3017 3722 3530 1924 -466 -2373 -3501
6200 -3501 -3823 -2736 -926 1516 3235 3857 3305 1692 -414 -2799 -3651 -3750 -2672 -678 1522 3074
6216 3074 3676 3082 1421 -739 -2424 -3638 -3602 -2397 -495 1623 3293 3749 3169 1594 -901 -2597
6232 -2597 -3863 -3659 -2399 36 1967 3441 3940 3282 1344 -803 -2774 -3837 -3450 -1958 -213 2338
6248 2338 3689 3545 3109 1264 -878 -2852 -3680 -3648 -1924 15 2225 3154 3488 2913 1252 -1202 -2968
6265 -2968 -4022 -3397 -1847 24 2293 3382 3713 3014 721 -1589 -3096 -3798 -3319 -1795 245 2148
6281 2148 3510 3656 2480 476 -1527 -3159 -3819 -3173 -1607 391 2342 3495 3414 2178 668 -1813
6297 -1813 -3249 -3812 -2927 -1170 567 2584 3915 3492 2118 537 -1807 -3170 -3386 -2840 -1256 961
6313 961 2898 3580 3381 2061 51 -1946 -3198 -3472 -2547 -987 1254 2869 3456 3713 2132 37 -1961
6330 -1961 -3509 -3390 -2628 -874 1327 3026 3856 3460 1709 -350 -2168 -3476 -3928 -2640 -630 1167
6346 1167 2853 3626 2982 1512 -582 -2439 -3487 -3720 -2318 -592 1403 3082 3578 2846 1312 -473
6362 -473 -2575 -3492 -3487 -2579 -438 1358 2844 3726 3036 1216 -595 -2534 -3710 -3291 -2430 -221 1699
6379 1699 3426 3531 2699 1472 -720 -2469 -3697 -3483 -2067 28 1763 3632 3600 2626 1137 -619
6395 -619 -2563 -3503 -3353 -1999 -83 1683 3264 3623 2950 888 -742 -2908 -3502 -3180 -1900 244 2141
6412 2141 3333 3426 2781 773 -1265 -2895 -3331 -3249 -1679 277 2247 3185 3486 2181 486 -1600 -2913
6429 -2913 -3751 -3123 -1527 213 2210 3360 3482 2331 509 -1844 -2937 -3704 -3008 -1453 566 2425
6445 2425 3577 3245 2207 196 -1846 -3222 -3586 -2746 -1232 833 2530 3387 3312 1982 68 -1529
6461 -1529 -3040 -3441 -2825 -809 1055 2804 3623 3354 2006 193 -1749 -3177 -3477 -2391 -843 984
6477 984 2722 3564 3018 2047 -83 -1966 -3375 -3328 -2260 -714 1197 2517 3500 2833 1568 -237 -2226
6494 -2226 -3258 -3268 -2506 -632 1270 2849 3296 2998 1409 -214 -2389 -3303 -3202 -2202 -577 1281 2800
6511 2800 3302 2690 1016 -716 -2552 -3488 -3516 -2223 -527 1191 2745 3515 2664 1321 -641 -2641 -3525
6528 -3525 -3116 -2085 -306 1396 3275 3623 2738 1104 -831 -2761 -3317 -2889 -1794 -79 1744 3241
6544 3241 3638 2637 674 -801 -2755 -3246 -2875 -1854 16 1879 3154 3645 2338 965 -977 -2974
6560 -2974 -3423 -3004 -1815 256 1987 3170 3281 2450 544 -1128 -2837 -3546 -2848 -1504 297 1918
6576 1918 3077 3306 2185 547 -1543 -2765 -3565 -3184 -1684 316 2160 3401 3128 2195 180 -1552
6592 -1552 -2961 -3305 -2757 -1523 392 2345 3405 3133 1996 193 -1450 -2668 -3324 -2727 -1246 784
6608 784 2348 3045 2905 1884 120 -1599 -2993 -3220 -2552 -784 1054 2544 3198 3055 1644 -15 -1743
6625 -1743 -3076 -3204 -2083 -766 1299 2976 3390 2978 1709 -196 -1954 -2996 -3154 -2364 -726 1240
6641 1240 2601 3393 2902 1481 -439 -2072 -2883 -3180 -2404 -783 1177 2745 3234 2529 1161 -539 -2198
6658 -2198 -2996 -3172 -2001 -249 1462 2910 3308 2847 1170 -600 -2252 -3326 -3180 -1851 -214 1516
6674 1516 3173 3113 2520 1186 -722 -2108 -3171 -3109 -1931 -186 1586 2896 3316 2717 1122 -652 -2403
6691 -2403 -3099 -3129 -1565 295 1636 2950 3451 2663 1144 -914 -2523 -3137 -2780 -1795 244 2035 2952
6708 2952 3330 2304 671 -1423 -2626 -3058 -2836 -1647 412 2149 2920 3251 2050 556 -1196 -2726
6724 -2726 -3207 -3086 -1479 323 2048 3056 2913 2168 502 -1528 -2785 -3230 -2858 -1532 384 2079
6740 2079 2951 2993 1835 278 -1597 -2881 -3284 -2633 -1014 591 2289 3155 2979 1807 147 -1537 -2749
6757 -2749 -3002 -2601 -908 875 2266 3113 3187 1797 -15 -1894 -2809 -2809 -2619 -879 1085 2577 3284 3011
6775 3011 1856 91 -1905 -2769 -2995 -2188 -623 1004 2346 3132 2768 1526 -65 -1994 -2741 -3388 -2015
6792 -2015 -832 1317 2306 3004 2449 1420 -300 -2150 -3099 -3162 -1970 -675 1443 2387 2835 2411 1288
6809 1288 -557 -2330 -3050 -3006 -1848 -190 1312 2397 3034 2499 936 -535 -2142 -2873 -2740 -1750 -179
6826 -179 1469 2625 3251 2639 740 -725 -2237 -2943 -2781 -1575 173 1607 2999 3128 2420 1136 -1118
6843 -1118 -2335 -2977 -2834 -1574 -36 1799 2812 3001 2469 750 -733 -2628 -3043 -2720 -1697 264
6859 264 2051 2916 3202 2170 729 -906 -2211 -3325 -2763 -1739 230 2214 2917 3016 2102 721 -1364
6876 -1364 -2729 -3113 -2332 -1455 256 2034 2657 2874 2061 260 -1438 -2444 -3151 -2562 -1187 424 2087
6893 2087 2907 2817 1864 336 -1489 -2725 -2851 -2429 -968 764 2413 2811 2821 1738 -21 -1616 -2566
6910 -2566 -2727 -2277 -907 1084 2443 3019 2672 1508 23 -1389 -2762 -3092 -1963 -545 973 2452
6926 2452 2893 2594 1482 -139 -1595 -2539 -2790 -1962 -636 1156 2428 2834 2533 1493 -317 -2047 -2630
6943 -2630 -2719 -1891 -685 873 2354 2898 2216 1334 -517 -2005 -2779 -2864 -2144 -512 1085 2449 2754 2548
6961 2548 1118 -460 -1840 -2907 -2999 -1685 -382 1188 2433 2748 2226 732 -644 -2065 -2694 -2715 -1838
6978 -1838 -209 1317 2562 3052 2394 945 -794 -2172 -2932 -2506 -1480 -26 1830 2738 2986 2248 944
6995 944 -779 -2120 -2919 -2418 -1514 144 1772 2748 3001 2073 708 -924 -2324 -2811 -2593 -1520 255
7012 255 1879 2843 2770 2086 519 -1099 -2699 -3002 -2644 -1647 171 1696 2578 2931 1959 467 -1265 -2293
7030 -2293 -3023 -2658 -1193 435 2021 2527 2730 1851 15 -1492 -2449 -2982 -2649 -986 524 1909 2732
7047 2732 2565 1581 361 -1555 -2580 -3183 -2333 -851 596 2396 2693 2671 1443 -104 -1460 -2027 -2568
7064 -2568 -2161 -705 1069 2345 3159 2646 1461 -30 -1799 -2354 -2312 -1969 -407 999 2530 2747 2645
7081 2645 1372 -74 -1716 -2661 -2683 -2021 -235 1123 2198 2505 2661 1211 -442 -1998 -2973 -2600 -1650
7098 -1650 -492 1396 2229 2669 1991 1093 -769 -1842 -2720 -2847 -1653 -245 1105 2368 2497 2367 1118
7115 1118 -794 -1985 -2669 -2608 -1794 -221 1360 2486 2730 2197 860 -678 -2140 -2715 -2682 -1669 32
7132 32 1684 2427 2732 2158 550 -621 -2120 -2694 -2459 -1363 304 1680 2760 2976 1993 918 -743
7149 -743 -2111 -2738 -2485 -1445 219 1564 2508 2770 2034 658 -834 -2103 -2755 -2403 -1321 216 1899
7166 1899 2513 2464 1485 154 -1071 -2520 -2577 -2188 -1204 368 1804 2726 2563 1608 400 -1214 -2374 -2603
7184 -2603 -2372 -1115 480 1756 2470 2229 1382 -161 -1350 -2592 -2784 -2101 -783 711 2105 2561 2323
7201 2323 1354 127 -1562 -2500 -2773 -1991 -970 761 2400 2829 2504 1494 -307 -1511 -2478 -2672 -1709
7218 -1709 -529 1173 2188 2507 2582 1289 -2 -1619 -2328 -2520 -2069 -626 1197 2348 2880 2348 887
7235 887 -263 -1790 -2520 -2757 -1813 -422 1105 2522 2667 2211 1050 -450 -1817 -2698 -2658 -1623 -170
7252 -170 1325 1992 2703 1935 787 -660 -1873 -2586 -2752 -1580 -166 1088 2184 2628 2012 650 -971
7269 -971 -2048 -2558 -2339 -1446 -164 1576 2253 2485 1968 908 -765 -1887 -2484 -2428 -1480 121 1584 2548
7287 2548 2558 2043 891 -711 -2110 -2563 -2371 -1176 231 1657 2714 2553 1661 722 -904 -1944 -2769
7304 -2769 -2375 -1208 264 1751 2468 2836 1658 556 -1107 -2126 -2423 -2213 -965 537 1916 2289
7320 2289 2380 1501 -152 -1247 -2366 -2562 -2307 -1052 602 1816 2443 2416 1427 -70 -1278 -2159 -2631 -2331
7338 -2331 -758 637 1803 2421 2447 1423 128 -1468 -2407 -2569 -1949 -1010 646 1998 2740 2372 1424
7355 1424 -37 -1439 -2462 -2525 -1838 -718 723 2097 2680 2232 1219 -119 -1495 -2254 -2297 -1627 -491
7372 -491 1194 1698 2495 2311 1147 -340 -1376 -2361 -2414 -1740 -420 1093 2087 2569 1970 937 -421 -1770
7390 -1770 -2430 -2579 -1763 -196 921 2247 2407 2261 815 -449 -1883 -2693 -2329 -1646 -224 1106 1972
7407 1972 2583 1732 654 -830 -2035 -2499 -2106 -1483 -113 1160 2241 2577 1947 653 -655 -1967 -2363
7424 -2363 -2474 -1350 -44 1288 2295 2651 1914 671 -815 -1925 -2445 -2186 -1056 10 1581 2285
7440 2285 2471 2014 412 -1078 -1841 -2370 -2237 -936 338 1548 2448 2492 1802 388 -720 -2060 -2314
7457 -2314 -2167 -955 197 1630 2241 2242 1524 348 -1134 -2127 -2465 -1960 -1091 463 1717 2474 2085 1588
7475 1588 247 -1289 -2446 -2506 -2117 -1044 547 1771 2370 2192 1391 175 -1196 -2264 -2602 -1949 -904
7492 -904 646 1943 2429 2397 1289 7 -1271 -2375 -2344 -2092 -465 869 2001 2483 2362 1377 -296
7509 -296 -1125 -2410 -2222 -1731 -235 872 1994 2410 2189 1116 -161 -1653 -2285 -2275 -1559 -240 1248
7526 1248 2233 2581 1892 755 -307 -1907 -2387 -2378 -1352 -480 1203 1932 2496 2021 807 -279 -1668 -2325
7544 -2325 -2256 -1272 -225 1442 2216 2391 1881 642 -812 -1638 -2283 -2295 -1325 159 1141 2150 2166 1595 712
7563 712 -894 -1944 -2348 -1912 -1160 102 1297 2044 2218 2016 550 -962 -1840 -2603 -2181 -1122 49
7580 49 1308 2219 2337 1607 569 -1021 -1807 -2462 -2079 -903 597 1541 2422 2418 1884 480 -1074 -1801 -2258
7599 -2258 -1872 -944 455 1544 2441 2208 1432 333 -896 -2063 -2478 -1912 -938 488 1655 2456 2057
7616 2057 1475 112 -1220 -2134 -2438 -1876 -1062 471 1628 2011 2223 1190 62 -1180 -2254 -2708 -1828
7633 -1828 -612 517 1702 2026 2027 1248 39 -1546 -2242 -2338 -1846 -821 585 1713 2292 1937 1142 -277
7651 -277 -1595 -1976 -2313 -1481 -290 636 2152 2269 1847 826 -372 -1457 -2107 -2350 -1353 -155 799 1891
7669 1891 2406 1884 829 -301 -1598 -2117 -2100 -1330 -308 888 2026 2247 2015 1009 -484 -1358 -2043
7686 -2043 -1808 -1213 -180 992 1890 1956 1917 300 -777 -1807 -2409 -2166 -1206 -53 1041 1754 2179 1833
7704 1833 794 -642 -1902 -2096 -1633 -1257 -110 1318 1957 2238 1611 560 -803 -1866 -2276 -2000 -1173
7721 -1173 256 1220 2057 1945 1528 331 -916 -1958 -2252 -1981 -926 426 1398 2366 2356 1734 315 -785
7739 -785 -1746 -2250 -1968 -714 380 1473 2236 2339 1612 400 -755 -2020 -2080 -1899 -692 347 1508
7756 1508 2247 1995 1399 309 -821 -2035 -2234 -1665 -683 529 1650 2071 2278 1176 6 -1264 -2100
7773 -2100 -2333 -1595 -597 511 1660 2048 1787 968 -135 -1336 -1998 -2057 -1523 -574 583 1647 2168 1970
7791 1970 1040 -158 -1635 -2028 -2245 -1542 -407 925 1852 2185 1974 839 -183 -1525 -2140 -2224 -1557 -216
7809 -216 966 1755 2076 2080 846 -283 -1616 -2297 -1954 -1140 77 1192 2012 2040 1739 803 -408 -1366 -1843
7828 -1843 -1990 -1305 -34 1209 1813 2436 1802 595 -505 -1424 -2098 -1983 -1129 -9 1112 1772 2242 1483
7846 1483 675 -474 -1686 -2370 -2314 -1396 109 1242 1938 2225 1623 433 -902 -1877 -2176 -1949 -1188 24
7864 24 1225 2132 1931 1411 445 -976 -1775 -2198 -2083 -1006 -7 1339 1859 2123 1525 519 -866 -2002
7882 -2002 -2101 -1864 -672 163 1634 2121 2149 1382 16 -968 -1983 -2084 -1752 -717 280 1580 2304 2219 1451
7901 1451 -4 -873 -1708 -2306 -1421 -625 491 1352 1947 2024 1200 -53 -1038 -1881 -2061 -1612 -772 744 1856
7920 1856 2219 1795 839 -179 -1243 -2170 -2139 -1649 -478 535 1532 2156 1686 778 -278 -1157 -1524 -2098
7938 -2098 -1746 -484 874 1493 2134 1531 918 -205 -1284 -1835 -2211 -1313 -333 969 1895 2105 1762 642
7956 642 -461 -1345 -2077 -1994 -1368 -56 963 1735 2199 1623 772 -385 -1450 -2226 -1983 -1084 -239 1357
7974 1357 2017 2170 1801 613 -584 -1162 -1997 -1987 -1119 90 1236 2043 2038 1466 483 -481 -1500 -2066 -2029
7993 -2029 -1266 17 1001 1943 2140 1518 428 -702 -1531 -2025 -1773 -1058 -109 1169 1766 1871 1276 472
8011 472 -828 -1793 -2323 -1656 -978 106 1238 1912 1865 1461 314 -1052 -1575 -2143 -1620 -801 176 1206
8029 1206 1888 1901 1249 382 -930 -1382 -1873 -1558 -605 608 1286 1898 1966 1128 283 -795 -1850 -1899 -1437
8048 -1437 -612 614 1564 1913 2069 1165 74 -989 -1925 -2092 -1739 -858 570 1490 1904 1832 1181 -93
8066 -93 -1247 -1949 -2069 -1440 -627 443 1480 1895 1528 814 -107 -1078 -1977 -2025 -1601 -404 532 1661 2011
8085 2011 1358 1006 -556 -1288 -1872 -2032 -1473 -440 722 1466 1853 1677 825 -334 -1420 -1872 -1695 -1133
8103 -1133 56 721 1674 2117 1658 635 -341 -1421 -2118 -1790 -1137 -78 1171 2091 1897 1544 644 -365
8121 -365 -1477 -1616 -1756 -1096 -223 906 1975 2033 1603 646 -437 -1621 -1959 -1785 -863 97 1435 2010
8139 2010 1894 1361 591 -561 -1204 -1953 -1620 -817 190 1200 1571 2025 1177 341 -571 -1716 -1884 -1746
8157 -1746 -915 -41 1208 2039 1922 1090 363 -622 -1411 -1941 -1804 -875 275 1071 1882 2006 1493 231 -789
8176 -789 -1687 -1914 -1590 -791 399 1163 1879 2021 1305 418 -1077 -1690 -2011 -1662 -796
8191g96
$$ Imaginary data points
##PAGE= N=2
##DATA TABLE= (X++(I..I)), XYDATA
0 0 0 0 0 0 0 0 0 0 0 0 0 8 -8 8 -8 8 -16 16 -16 24 -24 32 -36 42 -50 58 -72 80 -91 106 -121 138 -154 178
34 178 -199 225 -253 282 -319 351 -392 435 -483 537 -593 655 -723 796 -880 966 -1067 1175
52 1175 -1294 1429 -1579 1748 -1940 2163 -2419 2723 -3090 3537 -4104 4845 -5860 7343 -9733
67 -9733 14218 -25635 122078 179260 -49861 -157294 -248363 -241168 -182275 -43387 111106 238473
79 238473 262152 211655 105373 -15978 -160767 -240005 -222892 -145165 -38370 98719 202877
90 202877 246802 210258 98905 -41921 -153321 -230554 -241929 -159836 -18834 112013 203492
101 203492 235729 187056 72848 -56643 -174532 -231268 -204707 -132334 -21901 108172 190046
112 190046 203685 159532 65255 -55716 -161138 -213358 -203597 -125901 -2991 106501 184767
123 184767 211705 153907 45249 -67231 -164248 -210253 -181640 -98778 10453 120895 189096
134 189096 190959 140303 48811 -66612 -156210 -187274 -166308 -92709 21479 122380 183996
145 183996 195279 135746 32887 -69548 -152014 -186673 -152107 -66514 34420 126697 183907
156 183907 175678 114876 26987 -77205 -153223 -171966 -144462 -69185 37228 126971 174296 172531
168 172531 113634 12370 -87659 -157525 -181585 -142712 -53921 41775 124817 172006 153508
179 153508 86323 -527 -93661 -158605 -166563 -128404 -53492 42886 123204 158314 145945 87628
191 87628 -8495 -100892 -157072 -171900 -129652 -39109 54624 129524 167343 143417 71482 -16407
203 -16407 -101852 -157020 -156793 -107049 -30339 59286 132770 156775 134421 74658 -16039 -99914
215 -99914 -144895 -149759 -104548 -17790 71038 135541 162863 135582 61412 -25766 -101791 -148642
227 -148642 -142407 -85928 -9147 73331 138769 153450 122418 60192 -26466 -104450 -142304 -137960
239 -137960 -90864 -8259 76289 132110 149575 119478 44343 -41122 -108528 -147441 -135340 -75320
251 -75320 100 75057 130064 136562 98792 35083 -43923 -112730 -141898 -128833 -80468 -2431
263 -2431 77345 125414 135895 104382 30220 -52382 -114069 -145922 -129252 -66339 11164 81872
275 81872 129356 130647 86949 20827 -51505 -111769 -132032 -109047 -58709 13977 86483 125206
287 125206 127159 93391 23535 -53860 -108953 -132430 -113330 -50470 27237 93417 134694 132329
299 132329 83257 13180 -56652 -112347 -126716 -96544 -41451 28768 94922 125980 118297 79288
311 79288 11813 -61045 -109315 -123598 -101308 -40525 34792 93865 126948 120683 68244 -2540
323 -2540 -69084 -119432 -128936 -93375 -33539 35067 96040 122336 106945 61582 -5098 -74981
335 -74981 -117859 -123176 -95811 -34258 39699 93907 119645 108696 55344 -15452 -77867 -119616
347 -119616 -123363 -83676 -20799 44880 99330 120638 98611 49301 -14622 -79190 -115387 -113325
359 -113325 -80368 -19042 52461 102789 121488 105282 51603 -19747 -79231 -114511 -114025 -71106
371 -71106 -4567 58206 106707 122313 93741 40679 -21525 -80464 -109989 -100471 -63171 -4552
383 -4552 60658 104672 114472 92873 40192 -28859 -84048 -111620 -107465 -63537 2333 62316 104952
396 104952 115568 83364 26669 -34559 -88665 -113432 -99212 -56722 648 60902 99622 102551
408 102551 76409 24830 -40014 -89417 -109344 -100203 -56172 7480 63390 99302 104906 71397
420 71397 14294 -44074 -91390 -111503 -92325 -45586 10837 66866 101695 98858 68586 17698
432 17698 -44065 -89205 -103293 -88581 -43799 18486 72230 101600 102410 68110 9757 -46556
444 -46556 -87159 -102263 -79565 -30127 24533 75334 103919 95415 60537 9882 -47209 -88194
456 -88194 -97228 -77635 -33377 26465 77742 101530 97506 61737 1713 -54126 -91365 -102190
468 -102190 -76695 -24155 31045 77181 100467 87484 46663 -5045 -57688 -93547 -96419 -70600
480 -70600 -26458 29924 76528 93957 84912 48077 -9721 -63029 -95511 -101859 -74161 -20493
492 -20493 35611 78961 98926 83397 38554 -14437 -64162 -96810 -94180 -62868 -16045 38286
504 38286 80907 93606 78645 40601 -14920 -64369 -90726 -90641 -61431 -8074 46218 84080 98648
517 98648 80612 33887 -19033 -65168 -92895 -86414 -50923 -2805 49008 87370 95111 74369
529 74369 33933 -19675 -66700 -88291 -83031 -52512 245 51881 84352 93452 72437 24489
541 24489 -27905 -68974 -91268 -81692 -43623 4705 51176 84086 87240 61412 19488 -30309
553 -30309 -73543 -90008 -79778 -47628 2748 52281 80816 85374 62635 15151 -36278 -74678
565 -74678 -92038 -79844 -39446 10178 53530 81993 81862 52129 9610 -36494 -74640 -85790
577 -85790 -69789 -35657 11878 57188 81068 80324 55749 10434 -39269 -73043 -85449 -71012
589 -71012 -29485 20309 61359 85863 82786 50491 5520 -39362 -73517 -81382 -61149 -23554
601 -23554 22155 64212 83208 76331 49036 4290 -42892 -72359 -79167 -62537 -21369 27311
613 27311 64326 84227 77259 42295 -3388 -46367 -76865 -82256 -58471 -18919 25574 64749
625 64749 81142 69916 39201 -5304 -51176 -77953 -80652 -60282 -18540 29652 64509 79112
637 79112 69081 32946 -14367 -54324 -79368 -80583 -53020 -10823 31661 66488 78658 62569
649 62569 29883 -13253 -55456 -78280 -75725 -51801 -10601 36372 69211 79519 66971 29902
661 29902 -17766 -56024 -77235 -74663 -44348 -344 41012 71843 80037 59790 23363 -17987
673 -17987 -55653 -73919 -66050 -39346 653 44014 72130 76965 60695 24095 -22001 -57662
685 -57662 -74769 -69900 -38414 5880 45679 72416 77106 54557 15457 -25435 -60361 -76140
697 -76140 -63961 -33797 4899 45161 69262 69012 49408 12668 -30633 -62573 -74240 -65231 -33890
710 -33890 9667 46622 68428 69764 45645 5419 -33842 -64721 -76301 -61138 -28456 10265
722 10265 47632 69430 65959 43235 7457 -33869 -63685 -71269 -58582 -27215 15715 51267
734 51267 69292 67654 42548 2261 -35745 -62329 -70492 -52874 -18235 20112 53599 71610
746 71610 64891 39021 3482 -35396 -62175 -66228 -51334 -19348 22082 55756 70789 66462 40173
759 40173 -966 -38769 -63054 -68493 -49569 -13105 24901 55415 70142 60111 30519 -5268
771 -5268 -41612 -65279 -65543 -46680 -14520 24748 55582 66574 57935 30852 -9144 -46044 -66937
784 -66937 -69301 -49064 -10941 27213 56013 68098 56006 24056 -12882 -47413 -68237 -64991
796 -64991 -42250 -8516 29257 57416 64705 52040 24031 -14784 -48645 -65034 -63083 -40730
808 -40730 -2651 34285 59304 68104 53637 20531 -16455 -47721 -65187 -59736 -34254 146
820 146 35708 62160 66485 50268 21193 -16350 -49057 -62428 -56861 -33545 3843 39512 61055
833 61055 65473 48849 14769 -21699 -49773 -63508 -55481 -27692 6466 38605 60762 61655 42421
846 42421 12598 -22653 -52581 -63068 -54765 -30196 5416 39705 58602 60060 42445 7945
858 7945 -28543 -54013 -64557 -54422 -24830 9953 39551 58175 56400 34202 3400 -29101
870 -29101 -55044 -61591 -48807 -23522 10427 42281 57911 55454 37053 3678 -31106 -53771
882 -53771 -61032 -49455 -19301 15766 44469 60965 57309 33496 1094 -29766 -53291 -58099 -42267
895 -42267 -15192 17540 47277 59801 53787 33361 802 -32575 -52711 -56351 -43027 -12691
907 -12691 21939 47798 60644 55078 29577 -3825 -33803 -55081 -57812 -39810 -11451 20473
919 20473 48474 59229 50244 27393 -5276 -37493 -56071 -56774 -41570 -11138 23393 47620 57073
932 57073 49011 22203 -11785 -40014 -57681 -57513 -37039 -6988 23835 48579 56495 44598 19954
945 19954 -11162 -41333 -57763 -55071 -37455 -7203 27071 49703 56541 46854 20266 -14149 -41348
958 -41348 -56370 -53751 -31697 -235 29508 51286 57307 42709 16443 -13311 -41187 -54298
970 -54298 -48331 -28958 614 32211 52588 56037 44602 17601 -15642 -41399 -53751 -50271 -28092
983 -28092 4013 32762 52480 56412 40290 12633 -16987 -42698 -54088 -46084 -24853 3560
995 3560 33102 50797 51135 36758 10581 -21240 -44927 -53717 -47544 -25188 6685 33338 49491
1008 49491 51330 33823 5168 -23222 -46179 -55276 -44877 -22028 6173 33492 49855 47815
1020 47815 31813 5789 -24942 -46611 -52377 -43721 -20736 10426 36406 49754 48591 30576
1032 30576 1476 -26250 -45673 -51735 -39146 -14243 13359 38000 51727 47189 28618 2665
1044 2665 -25510 -45275 -49043 -38037 -14559 15921 40512 51777 48775 29125 -491 -28166
1056 -28166 -45424 -49713 -35737 -9059 18591 41014 51837 44435 23382 -3277 -30062 -47317
1068 -47317 -47838 -33610 -10123 18532 41578 49613 43130 22800 -6701 -33436 -48645 -50255 -35469
1081 -35469 -7887 19994 41094 49586 40783 17560 -9706 -34636 -49828 -48259 -31170 -7009
1093 -7009 20812 42286 47417 38407 17695 -11426 -36285 -48707 -47120 -30732 -2819 24264 42796
1106 42796 49287 39389 15217 -11953 -34814 -48690 -44977 -26452 -1548 24932 44920 49079 37945
1119 37945 16316 -11643 -35561 -46133 -42476 -25216 1992 28975 45182 48796 36949 11955
1131 11955 -14988 -35860 -46703 -41101 -21044 4106 28318 45247 46768 32796 10978 -15416
1143 -15416 -37832 -46657 -40709 -22949 3568 29042 43531 44806 32128 7082 -19986 -39068
1155 -39068 -47462 -40397 -19332 6589 29004 43250 42248 26525 3514 -21069 -40814 -46394 -37495
1168 -37495 -18754 6820 30842 42905 41582 27672 3425 -22856 -40344 -45967 -37705 -15503
1180 -15503 10451 31688 44705 42499 24875 1482 -22060 -40034 -43878 -32753 -12392 12489
1192 12489 34886 44734 40592 25134 816 -24246 -39344 -42449 -32472 -9727 16359 35760 45586
1205 45586 41587 22802 -1737 -24680 -40647 -42994 -29726 -8614 15468 36350 44572 38139 21268
1218 21268 -2910 -27833 -41752 -42192 -30859 -7877 18080 36294 43363 37216 17165 -8461 -29717
1231 -29717 -43046 -43492 -28417 -5834 17505 36381 42770 34034 15661 -7843 -31068 -43814 -42099
1244 -42099 -28978 -6199 19845 37420 42247 35007 14714 -10997 -31615 -43088 -41209 -24837
1256 -24837 -654 21664 38588 43191 32320 12321 -10509 -31466 -41676 -37387 -22178 -11
1268 -11 24348 39891 42686 33526 13129 -12282 -31697 -40857 -37632 -20648 3610 25472 40022
1281 40022 42985 30490 9413 -13277 -32564 -41026 -34416 -18119 4102 26693 40099 39766 28175
1294 28175 7423 -16762 -34635 -40953 -35484 -17939 6147 26581 38575 39223 25485 3381 -18315
1307 -18315 -35345 -42054 -34081 -16018 5326 26381 38248 36236 23371 3036 -20049 -36392
1319 -36392 -40602 -32954 -14786 8851 28570 38398 36653 21973 -886 -21863 -36185 -40212 -29973
1332 -29973 -10344 10922 29803 39884 35892 21094 696 -21281 -36100 -37923 -28389 -10021
1344 -10021 13490 32046 40020 36683 21070 -2243 -22928 -35516 -37786 -26315 -5242 16030
1356 16030 33061 40858 34033 16996 -4029 -24006 -37074 -36636 -24821 -5619 16482 33932 39136
1369 39136 33215 16803 -6379 -26752 -37963 -38202 -25796 -3951 17510 32943 39045 30921 12261
1382 12261 -8874 -27992 -39568 -36990 -23124 -3750 17869 33859 37011 28602 11713 -11113
1394 -11113 -30218 -39038 -36493 -22848 -782 20346 34143 38034 29153 10031 -11312 -28977 -38450
1407 -38450 -34763 -19494 610 20933 35523 37782 27794 10181 -11745 -29911 -36909 -32498 -18065
1420 -18065 4161 24790 36358 37951 27329 7309 -13653 -29393 -36745 -30970 -14469 5812
1432 5812 24495 36642 36507 24695 7154 -13896 -30727 -36082 -30387 -15612 5767 25298 35578
1445 35578 35019 23955 3395 -17276 -31553 -37124 -30252 -12812 7531 24902 35145 33129 19389
1458 19389 1069 -18424 -33307 -36582 -28407 -12565 7461 25752 34341 31985 19832 -138 -20427
1471 -20427 -33101 -36424 -28727 -10501 10125 26252 34905 32068 17457 -1681 -20096 -33208 -34885
1484 -34885 -24611 -7518 11925 29009 35737 30691 17526 -2012 -21491 -32881 -33641 -23794 -5420
1497 -5420 15148 29770 36273 31924 16249 -3736 -21042 -32782 -33361 -21901 -4127 14900 30708
1510 30708 36202 29471 15145 -4639 -23456 -33648 -32653 -22095 -3250 16966 30450 34687 28474
1523 28474 11981 -8480 -25161 -34624 -33619 -20508 -2083 16310 30302 34270 26067 10442 -8474
1536 -8474 -26511 -35479 -32675 -21174 -2411 17379 30369 33360 26252 9323 -11481 -27308 -35056
1549 -35056 -32333 -17957 1448 19217 31507 33942 23889 7103 -11213 -27525 -34412 -29543 -16060
1562 -16060 2148 21127 32506 33406 24868 7817 -12357 -27124 -32962 -28831 -14354 5323 22091
1575 22091 32981 33854 23017 5327 -12835 -27265 -32838 -26567 -12051 5726 23436 33217 31711
1588 31711 21203 4129 -15253 -28632 -32679 -26838 -12186 7285 22879 31957 31401 19316 1385
1601 1385 -16080 -28889 -33337 -26079 -11145 6544 22559 31614 28786 17535 598 -18102 -30588
1614 -30588 -32620 -25570 -10490 8868 24639 31118 28686 15972 -2462 -19117 -30106 -32435 -23879
1627 -23879 -7526 9677 24528 32036 28081 15314 -1186 -18448 -29975 -30853 -22453 -7446 11902
1640 11902 26443 32114 28592 15503 -3250 -19717 -29301 -30292 -20473 -3216 14193 27332 33287
1653 33287 27576 13270 -3703 -20118 -30115 -29310 -19259 -3644 14282 28094 32207 26841 13110
1666 13110 -5439 -21655 -30337 -30052 -19799 -2042 15048 27040 31862 25177 9727 -7669 -23275
1679 -23275 -32201 -29586 -18262 -2189 15383 27921 30176 23053 8959 -9404 -24809 -31973 -29502
1692 -29502 -18377 -170 16919 27788 30503 22809 7003 -10445 -24404 -31642 -28309 -15501 781
1705 781 17398 28922 29940 21622 7013 -10826 -25261 -30323 -26436 -13939 3780 20463 29723
1718 29723 30494 21571 4659 -12089 -24463 -29862 -25099 -11325 5393 20300 30246 29636 19842 4843
1732 4843 -11919 -25078 -29231 -24168 -11494 5726 21519 29293 28494 19074 2340 -14532 -26003
1745 -26003 -29893 -23717 -9420 7335 21153 29101 27071 15326 210 -15388 -27214 -29730 -22757
1758 -22757 -9650 7012 21862 28536 25813 15424 -903 -17279 -27480 -29794 -22726 -7850 8576
1771 8576 21827 28584 25500 13395 -2551 -17329 -27609 -28937 -20162 -6126 10067 23715 29140
1784 29140 24893 13656 -2877 -18577 -27264 -27477 -19686 -4217 12629 24547 29473 25577 12859
1797 12859 -3091 -17544 -26854 -27051 -17504 -3128 12625 25414 29681 24336 12067 -3893 -19357
1810 -19357 -27249 -26448 -17616 -2068 14564 25837 29142 23654 9874 -6793 -20574 -28074 -26954
1823 -26954 -16507 -1116 13666 25363 28368 21627 8526 -6885 -21644 -28802 -26664 -16864 -1871
1836 -1871 14593 25076 27214 20876 6702 -9512 -22746 -28728 -26355 -14759 848 15712 25651
1849 25651 27378 19527 5553 -9678 -22861 -28661 -24781 -13398 1572 17177 26620 27057 19823
1862 19823 5774 -10269 -22433 -27167 -24067 -11960 4179 18067 26601 27601 18754 4149 -10549
1875 -10549 -22579 -26923 -21863 -9783 4817 19641 27452 26483 17910 3454 -12422 -23249 -26365
1888 -26365 -21551 -9377 6549 19393 26564 25907 16260 1419 -12839 -23532 -27083 -21116 -8355
1901 -8355 5625 19014 26209 23788 14285 590 -14981 -25143 -26806 -20945 -8250 7373 19872
1914 19872 25700 23691 12963 -2046 -15988 -24902 -26854 -19756 -6621 7748 19913 25939 22769
1927 22769 12532 -1437 -15584 -25086 -25420 -18713 -6059 9603 21602 25928 23326 12628 -2927
1940 -2927 -16375 -24391 -25314 -17052 -3263 11070 22698 27491 23008 11096 -2964 -16315 -24869
1953 -24869 -24433 -16145 -3384 11835 23484 26592 22331 11227 -4098 -17506 -24400 -24723 -16055 -2149
1967 -2149 12424 22378 26296 21253 8729 -5518 -18299 -26111 -24630 -15099 -1939 12724 23280
1980 23280 25395 19556 7666 -7326 -20338 -26063 -24718 -15420 -629 13586 22711 25207 18777
1993 18777 6015 -8207 -20059 -26059 -23728 -13146 15 13684 23743 24430 17833 5843 -8760
2006 -8760 -21096 -25588 -22498 -12201 2526 16309 24074 25171 17998 4587 -9473 -19961 -24908
2019 -24908 -21148 -9969 3712 16312 24879 24522 16877 4557 -9265 -20477 -24072 -19985 -9935
2032 -9935 4529 17547 24513 24105 16245 2409 -11551 -21186 -24377 -19932 -7886 6052 17769
2045 17769 24322 22924 13787 868 -12408 -22260 -24316 -18963 -8199 5695 17780 23327 21539
2058 21539 13079 -300 -13832 -22209 -24319 -19375 -7029 6959 17612 23275 21232 11301 -1505
2071 -1505 -14194 -22986 -24552 -17412 -5916 7760 19458 23846 20683 11454 -2354 -15056 -22768
2084 -22768 -23178 -16660 -4456 9691 19587 24326 21222 10525 -2587 -14549 -22286 -22612 -14925 -2992
2098 -2992 10114 20925 24751 20517 10480 -3082 -15677 -22522 -21818 -14768 -1993 12164 21624
2111 21624 24162 20240 8951 -4966 -16430 -23128 -22564 -13803 -1375 11281 20894 23539 18303 7721
2125 7721 -5212 -17560 -23433 -22234 -13943 -1680 11880 20727 22832 17716 6350 -7907 -18659
2138 -18659 -23741 -22571 -12937 455 12519 21129 23013 16540 5051 -7931 -18998 -24100 -21143
2151 -21143 -11778 868 13722 21589 22189 16627 4947 -8592 -18427 -22776 -20142 -10324 2858 14715
2165 14715 22178 22961 15593 3891 -8684 -18731 -22534 -18375 -8671 3752 16025 23035 22247 15296
2179 15296 3353 -9865 -19231 -21987 -18079 -7846 5382 16149 22333 21564 13683 1422 -10141
2192 -10141 -19048 -22209 -17153 -6949 5056 16118 21909 20120 12088 204 -12380 -20901 -22436
2205 -22436 -17193 -6885 6429 16899 21537 19532 10931 -1752 -13486 -21021 -22652 -16522 -5590
2218 -5590 6414 16460 21582 18508 10031 -1505 -13170 -21212 -21591 -15706 -4983 7846 17968
2231 17968 21581 18999 9999 -2740 -14121 -20930 -21242 -14499 -2572 9223 18972 22444 18831 8924
2245 8924 -2654 -14019 -21038 -20245 -13068 -2135 10094 19621 22307 18439 9062 -3832 -14790 -20762
2259 -20762 -20367 -12914 -749 10861 19203 22243 17791 7078 -5033 -15426 -21702 -20133 -11905 -710
2273 -710 11386 20127 21291 16343 6082 -6499 -17359 -21871 -20177 -12266 89 11782 18938 20628
2287 20628 15349 4351 -7183 -17140 -21887 -19599 -10939 638 12053 19909 20589 14321 3625 -8307
2301 -8307 -18201 -21677 -18651 -9928 2728 14206 20158 20488 13978 2670 -9147 -17482 -21093 -17317
2315 -17317 -7746 3784 14007 20734 20210 13009 2750 -8876 -17762 -20211 -16218 -7076 4719 15759
2329 15759 20842 19764 13069 1323 -9997 -17791 -20436 -16009 -5782 5923 15482 20808 19126 11544
2343 11544 481 -10444 -19006 -20486 -14985 -5938 5580 15626 19793 17805 10411 -762 -12171
2356 -12171 -18600 -20170 -15363 -4945 6462 15346 19495 17262 8967 -2261 -12502 -19802 -20357 -14274
2370 -14274 -4592 6713 16478 20009 16715 8753 -2703 -13397 -19184 -19615 -13852 -3067 8322 16378
2384 16378 19959 16932 7855 -3060 -12797 -18925 -18860 -12025 -1849 9009 17842 20564 16665 8026
2398 8026 -3491 -14278 -19395 -18249 -11372 -701 11129 18531 20291 16738 6848 -4906 -14002 -19076
2412 -19076 -18140 -10752 -433 10348 17909 19923 15190 5910 -5129 -14997 -19707 -17633 -10978 47
2426 47 11199 18004 19156 14407 4673 -7215 -15973 -20373 -18592 -10036 956 11248 18102 19009 13341
2441 13341 3342 -7307 -16622 -20129 -17186 -9379 1290 11827 18163 18372 13070 3127 -7999 -16130
2455 -16130 -19492 -16653 -8274 3066 12714 18624 18810 12231 2102 -8319 -16472 -19351 -15382 -6497
2469 -6497 4015 14255 19671 18526 12302 1697 -9022 -16357 -18131 -14574 -5753 5243 14394 18885
2483 18885 17992 11135 772 -9348 -16457 -18342 -13998 -4810 5318 14330 19092 16991 9874 -165
2497 -165 -10788 -17783 -18596 -14029 -4893 6498 14845 18369 16387 8548 -1908 -11586 -17928 -18946 -13628
2512 -13628 -4033 5995 14524 18099 15195 7492 -2211 -11913 -18356 -18046 -12583 -3437 7189 15086
2526 15086 18011 15466 7298 -3471 -12759 -17641 -18164 -11783 -1693 8296 15947 18915 15393 6992
2540 6992 -2938 -12530 -17614 -16799 -10843 -1313 9057 16534 18383 14900 6880 -3804 -12880 -17187 -16525
2555 -16525 -10189 -53 9910 16870 18861 14948 5629 -4620 -13425 -18206 -16686 -9357 369 10375
2569 10375 17292 18283 13779 5094 -5727 -14673 -18434 -16441 -9687 631 10154 16064 17583 12701
2583 12701 3477 -6804 -14362 -18786 -16279 -8587 814 10386 16942 17125 11697 2816 -7733 -15789
2597 -15789 -18565 -15637 -8236 2481 12127 17147 17068 11476 1672 -7893 -15340 -17981 -14821 -6271 3438
2612 3438 12064 17473 17088 10858 1826 -7774 -15166 -17103 -13300 -5909 4427 13579 17868 16489 10848
2627 10848 958 -8636 -15478 -17508 -13208 -4616 5487 13527 17913 16475 9474 141 -9023 -15835
2641 -15835 -16822 -12525 -4573 5189 13703 16912 15191 8623 -732 -10451 -15952 -16879 -12699 -4066 5751
2656 5751 13153 16901 14719 7439 -2007 -10684 -16908 -17394 -12114 -3705 5961 14090 17049 14264 6905
2671 6905 -2790 -12023 -16826 -16881 -11614 -2548 7132 13929 16669 14363 6429 -2786 -11351 -16521 -16466 -10393
2687 -10393 -1501 7852 15198 17249 13673 6125 -3221 -11873 -16607 -15476 -9813 -549 9325 15708 17303
2702 17303 14206 5695 -4194 -11926 -16286 -15344 -9043 263 9016 15696 17077 13063 5147 -4462 -12561
2717 -12561 -16502 -14947 -8695 380 9780 15298 16656 12220 3914 -5984 -13797 -17170 -15453 -8257 997
2732 997 9639 15482 16472 11262 2919 -6485 -13865 -17349 -14728 -7956 1072 10643 15386 15437 10752 2313
2748 2313 -7417 -14464 -16657 -14025 -6891 2669 10835 15887 15860 10171 1477 -7576 -14246 -16785 -13185
2763 -13185 -5769 3634 12111 16428 15494 9874 1384 -7872 -14271 -15740 -12506 -4650 4853 12295 16021
2778 16021 15181 9186 533 -7904 -13966 -15578 -11595 -3640 4778 12739 16513 14362 8666 -199 -9234
2793 -9234 -15028 -15660 -11671 -3810 5549 13186 15800 13847 7712 -1751 -9796 -15103 -15738 -11175 -3307
2808 -3307 5452 12333 15515 13012 6310 -2435 -10414 -15510 -15574 -10918 -3208 6312 13387 15562 13295
2823 13295 6222 -3190 -11138 -15453 -15714 -10349 -1568 7194 13568 15992 12756 5480 -3290 -10859 -15644
2838 -15644 -14644 -9363 -1111 8183 14284 15937 12880 5406 -3492 -11520 -14753 -13933 -8606 540 8634
2853 8634 14467 16055 12556 4396 -4097 -11759 -15610 -13884 -7947 837 9339 15116 15945 11440 3936
2868 3936 -5132 -12665 -15221 -13682 -7804 1275 9346 14318 15170 10726 2462 -5968 -12977 -15872 -13780
2883 -13780 -6937 1060 9612 14787 14535 9629 2058 -6983 -13691 -16216 -13537 -6553 2102 10550 14680
2898 14680 14306 9446 1264 -7459 -13466 -15406 -12745 -5604 3243 10450 14895 14070 8866 979 -7322
2913 -7322 -13293 -14934 -11595 -4906 3990 11524 15186 14495 9094 465 -7903 -13340 -14759 -11369 -3495
2928 -3495 4955 11861 15657 14207 7920 -35 -8038 -13655 -14133 -10411 -3337 5116 12364 14937 12988
2943 12988 7206 -1175 -8992 -13580 -14196 -10301 -2625 5937 11917 14728 12553 5980 -2267 -9988 -14913
2958 -14913 -14784 -9884 -2344 5772 12515 14654 11821 5495 -2662 -10564 -14595 -14066 -9698 -1631 6681
2973 6681 12364 14323 11851 4637 -3325 -10115 -14470 -13770 -8581 -771 6884 13315 14779 11450 4762
2988 4762 -3335 -10860 -14669 -13036 -8146 51 8409 13955 14992 11944 4206 -4125 -10776 -14292 -12621
3003 -12621 -6884 888 8562 13731 14592 10668 3663 -4383 -11394 -14259 -12432 -6707 1196 9385 14222
3018 14222 14205 10266 2871 -5845 -12172 -14635 -12914 -6402 1696 9155 13671 14056 9140 1716 -5958
3033 -5958 -12718 -14702 -12128 -6190 1597 9412 13388 12886 8877 1214 -7024 -12833 -14338 -12159 -5545
3048 -5545 2737 9559 13721 13203 8062 797 -7055 -12974 -14626 -11212 -4456 3367 10763 14078 13131
3063 13131 8219 249 -7542 -12497 -13530 -10519 -3611 4554 11142 13958 12651 7458 -333 -7404 -12586
3078 -12586 -13122 -9667 -2627 4931 11398 14180 12527 7011 -863 -8177 -12933 -13044 -9286 -2393 5677
3093 5677 11497 13527 11969 6045 -1947 -8586 -12901 -13413 -8923 -2105 5586 11233 13231 10943 4901
3108 4901 -2430 -9660 -13603 -13091 -8720 -1861 5845 11681 13101 10572 4648 -3643 -10337 -13539 -13275
3123 -13275 -7935 -896 6572 11714 13672 10620 4264 -3405 -10230 -13463 -12482 -7320 -385 7310 12351
3138 12351 13429 10042 3980 -3937 -10348 -12908 -12215 -7052 815 7949 12919 13800 10161 3328 -4033
3153 -4033 -10438 -13517 -11794 -6135 1118 8595 13483 13584 9858 3255 -4625 -10858 -13026 -11466 -6282
3168 -6282 1667 8775 12679 12915 8981 1842 -5366 -11200 -13561 -11331 -5727 1545 8522 12928 12646
3183 12646 8315 1125 -6328 -12209 -13769 -11145 -5562 2403 9177 12740 12159 7949 256 -6747 -12053
3198 -12053 -13580 -10485 -4274 2955 9486 12817 11787 6830 78 -7061 -11853 -12915 -9387 -3598 3982
3213 3982 10438 13100 11866 7098 -263 -7333 -11539 -12666 -9279 -2574 5074 10542 13420 11868 6112
3228 6112 -600 -7441 -12008 -12172 -8445 -2054 5055 11115 12895 11059 6049 -1141 -8277 -11855 -12118
3243 -12118 -8583 -1423 5675 10670 13020 10924 4928 -2003 -8701 -12925 -12391 -8020 -1684 5626 10961
3258 10961 12765 9748 4334 -2886 -9280 -12760 -12061 -7977 -956 6114 10863 12001 9557 3613 -3759
3273 -3759 -9418 -12912 -12003 -7324 -180 6404 11636 12530 9309 3649 -3709 -10066 -12735 -11494 -6736
3288 -6736 525 7668 11874 12481 9227 2969 -4089 -9664 -12160 -10910 -5663 1402 7820 12176 12842
3303 12842 8844 2584 -4424 -10158 -12228 -10601 -5268 1700 8590 12511 12373 8714 1928 -5222 -10706
3318 -10706 -12416 -10628 -4901 2368 8411 12045 12170 7821 1083 -5740 -10863 -12700 -10082 -4529 2333
3333 2333 8597 12052 11187 6637 494 -6636 -11313 -12637 -10144 -4002 2941 8698 11793 11233 6504
3348 6504 -318 -6750 -11430 -12748 -9735 -3625 3215 9308 12048 10914 6137 -237 -7320 -11308 -11530
3363 -11530 -8676 -2646 4394 9693 11984 10842 5624 -1029 -7106 -10935 -11274 -7716 -1636 4739 10609
3378 10609 12538 10571 5513 -927 -7568 -11332 -11460 -7485 -1438 5280 10675 12075 10204 4938 -2008
3393 -2008 -7710 -11283 -11310 -7389 -1061 5289 10022 11809 9289 3770 -2594 -8623 -11756 -11037 -7273 -864
3409 -864 5707 10405 11617 9118 3659 -3318 -9091 -11877 -11291 -6867 -395 5887 10449 11725 8752
3424 8752 2994 -3360 -9174 -12005 -10710 -6231 120 6657 10859 11315 8529 2986 -3838 -9308 -11777
3439 -11777 -10307 -5631 1122 7065 11136 11825 8785 2547 -3835 -9049 -11757 -9923 -5031 1220 7548
3454 7548 11919 11882 8028 2396 -4463 -9362 -11361 -9444 -4542 2004 7981 11298 11373 7647 1239 -4889
3470 -4889 -9792 -11687 -9671 -4391 2161 7834 11472 10901 6938 1229 -5344 -10660 -11736 -9574 -4647
3485 -4647 2065 7745 10819 10256 6670 267 -6061 -10382 -11479 -9241 -3886 2557 7787 11120 10116
3500 10116 5913 -82 -6115 -10724 -11228 -8426 -3420 3155 8646 11169 10322 6136 -129 -6528 -10175
3515 -10175 -11149 -8122 -2360 4175 9019 11467 10267 5511 -497 -6385 -10306 -10303 -7256 -1994 4406 9473
3531 9473 11655 9649 5291 -821 -6974 -10451 -10476 -7164 -1452 4799 9415 11330 9676 4366 -1621
3546 -1621 -7213 -10637 -10441 -7110 -1467 4750 9580 10710 8793 4101 -2653 -8204 -11013 -10378 -6654
3561 -6654 -1006 5355 9194 10523 8541 3302 -2993 -8344 -11138 -10599 -6141 -442 5419 9709 10821
3576 10821 8235 3303 -3236 -8813 -11281 -9994 -6010 117 6191 9970 10855 8118 2973 -3332 -8355
3591 -8355 -10790 -9685 -5369 949 6609 10662 10992 7851 2428 -3511 -8429 -10636 -9321 -5044 1366
3606 1366 7338 10708 10956 7880 2174 -4405 -8921 -10635 -9285 -4491 1886 7314 10682 10722 6777 1192
3622 1192 -4480 -9162 -10878 -8761 -3975 1959 7254 10356 9823 6304 703 -5476 -9869 -10872 -8783
3637 -8783 -3903 2319 7371 10171 9840 5814 117 -5806 -9859 -11013 -8224 -3150 2501 7825 10356
3652 10356 9299 5340 -151 -6105 -9825 -10248 -7541 -2510 3519 8242 10179 9319 5219 -684 -5953
3667 -5953 -9857 -10282 -7100 -1779 4056 8821 10950 9249 4969 -706 -6135 -9972 -9840 -6678 -1566
3682 -1566 4595 8842 10539 8963 4431 -1716 -6670 -9710 -9833 -6382 -971 4602 8728 10302 8342
3697 8342 3619 -2312 -7422 -10066 -9902 -6039 -965 5036 9248 10004 8214 3312 -2916 -7907 -10486
3712 -10486 -9871 -6339 -561 5036 8755 9887 7561 2533 -3181 -8229 -10400 -9507 -5426 -198 5530
3727 5530 9263 9733 7276 2284 -3573 -8059 -10176 -9137 -5000 693 6334 9677 10410 7562 2176
3742 2176 -3585 -7878 -10236 -8893 -4486 1341 6935 10061 9953 6975 1947 -3833 -8384 -9877 -8284
3757 -8284 -3825 1886 7049 9770 9768 6713 1357 -4160 -8469 -10172 -8169 -3719 1898 7209 10319 9867
3773 9867 6210 948 -5049 -9281 -10455 -8184 -3512 2369 7354 9640 9215 5488 51 -5703 -9074
3788 -9074 -10260 -7770 -2889 2450 7174 9706 8575 4782 -668 -5904 -9437 -9920 -7270 -2477 3125
3803 3125 7940 9500 8642 4774 -686 -6236 -9436 -9612 -6985 -1751 3557 7827 9973 8591 4119
3818 4119 -1050 -6170 -9229 -8913 -5967 -1255 4368 8518 10084 8214 4199 -1532 -6227 -9027 -8895
3833 -8895 -5861 -577 4736 8392 9707 8188 3590 -1739 -6485 -9253 -9285 -5706 -490 4635 8761
3848 8761 9357 7471 3350 -2552 -7084 -9450 -8687 -5368 -282 5161 8273 9302 6954 2432 -2942
3863 -2942 -7382 -9792 -9071 -5277 -155 4990 8818 9510 7024 2497 -3152 -7790 -9864 -8769 -5309
3878 -5309 -1 5563 8829 9104 6830 1790 -3543 -7553 -9649 -8453 -4251 787 6066 9068 9825
3893 9825 6582 1873 -3430 -7791 -9278 -8067 -4159 1313 6730 9612 9443 6576 1877 -3848 -7663
3908 -7663 -9245 -7981 -3425 1611 6822 9415 9383 5993 1078 -4140 -8355 -9445 -7322 -3151 2013
3923 2013 6875 9354 8499 5479 353 -4913 -8557 -9551 -7758 -3165 2067 6706 9052 8424 5116 -180
3939 -180 -5224 -8940 -9790 -7211 -2779 2233 6983 8993 8225 4453 -589 -5319 -8734 -8989 -6704 -2212
3955 -2212 3133 7349 9046 7794 4512 -961 -5580 -8641 -8824 -6279 -1240 3349 7573 9207 7978
3970 7978 4207 -632 -5733 -8748 -8811 -5843 -1217 4079 7937 9438 8028 3937 -1510 -5830 -8571
3985 -8571 -8567 -5507 -714 4345 7635 9139 7336 3438 -1645 -6323 -9148 -8468 -5366 -933 4186 8193
4001 8193 8914 7210 3197 -2568 -6875 -9060 -8722 -5628 -379 4341 7923 8502 6621 2196 -2782 -7036
4017 -7036 -9230 -8524 -4704 -83 4806 8244 8629 6432 2206 -3108 -7263 -9026 -8190 -4765 336 5349
4033 5349 8330 8927 6512 2004 -2932 -7202 -9202 -7794 -4094 904 5805 8750 8761 6346 1585 -3357
4049 -3357 -7196 -8403 -7340 -3657 1850 5927 8803 8694 6223 1092 -3569 -7077 -8828 -7315 -2839
4064 -2839 1550 6199 8811 8471 5502 1040 -4032 -7851 -8798 -7229 -2870 1882 6328 8648 7987 4937
4080 4937 -177 -4743 -8045 -9078 -6921 -2627 2380 6418 8536 7511 4374 -246 -5183 -8204 -9102
4095 -9102 -6554 -2405 2718 6765 8464 7780 4510 -392 -5280 -8147 -8516 -6285 -1690 3367 6948
4110 6948 8663 7527 3877 -702 -5389 -7997 -8092 -5408 -1103 3563 7623 8925 7281 3659 -991
4125 -991 -5593 -7975 -8099 -5337 -749 4228 7407 8907 7170 3503 -1440 -5813 -8214 -8228 -4951 -519
4141 -519 4156 7598 8445 6712 2803 -1949 -6044 -8480 -7816 -5117 -303 4479 7672 7982 6081 2370
4157 2370 -2287 -6495 -8695 -8073 -4905 -458 4329 7756 8180 6324 2315 -2728 -6774 -8627 -7708 -4650
4173 -4650 -100 4820 7661 8155 5953 1890 -3053 -6767 -8374 -7370 -3886 779 5234 7780 8277
4188 8277 5925 1628 -2824 -6806 -8174 -7150 -3597 1045 5450 8376 8436 5950 1580 -3057 -6795
4203 -6795 -8035 -6872 -3461 1662 5651 8331 8472 5330 1061 -3416 -7375 -8249 -6705 -3022 1915
4218 1915 5982 8382 8028 5035 466 -4258 -7389 -8080 -6499 -2907 1976 5929 8175 7540 4560 347
4234 347 -4566 -7807 -8523 -6404 -2480 2062 6048 8081 7120 4025 -437 -5062 -7544 -8181 -6018 -2051
4250 -2051 2835 6558 7768 7208 3488 -805 -4927 -7653 -8102 -5559 -1231 3061 6734 8358 7077
4265 7077 3764 -687 -5165 -7683 -7630 -5181 -1073 3621 7096 8103 7128 3311 -1312 -5200 -7460 -7564
4281 -7564 -4527 -393 3875 7159 7886 6660 2865 -1429 -5483 -7759 -7307 -4881 -511 3888 7075
4296 7075 7913 6528 2695 -1946 -6082 -7844 -7445 -4447 -239 4093 7130 7700 5975 1776 -2407 -6236
4312 -6236 -8281 -7564 -4222 -162 4488 7308 7493 5505 1978 -2760 -6496 -8009 -7390 -4264 502 4450
4328 4450 7307 7690 5540 1539 -2979 -6346 -7969 -6954 -3525 626 5112 7643 7578 5509 1315 -3129
4344 -3129 -6648 -7952 -6742 -3163 1611 5612 7850 7677 5152 1106 -3230 -6549 -7950 -6514 -2802
4359 -2802 1344 5406 7952 7724 5072 553 -3646 -6827 -7977 -6105 -2629 1954 5958 7733 7085
4374 7085 4584 197 -4209 -7159 -7914 -6111 -2395 2136 5802 7661 6863 3903 -284 -4400 -7578
4389 -7578 -7990 -5708 -2224 2415 5805 7415 6641 4027 -642 -4775 -7261 -7634 -5611 -1774 2793 5910
4405 5910 7537 6355 3328 -1062 -4845 -7471 -7242 -5002 -1084 3250 6613 7649 6520 3261 -1087
4420 -1087 -5123 -7100 -6764 -4957 -621 3689 6568 7820 6345 2892 -1270 -4912 -7174 -6884 -4305
4435 -4305 -261 3886 6998 7810 5990 2353 -1866 -5521 -7405 -6846 -4317 87 4138 6709 7343 5776
4451 5776 1872 -2394 -5592 -7636 -6778 -4439 54 3919 6822 7085 5447 1999 -2531 -6106 -7874
4466 -7874 -6760 -3960 180 4258 6942 7115 4929 1458 -2881 -6106 -7513 -6717 -3523 616 4334
4481 4334 7154 7295 5095 1281 -2892 -6345 -7598 -6270 -3251 1021 4904 7238 7088 4999 1165
4496 1165 -3070 -6280 -7006 -6080 -2906 1560 5323 7420 7370 4615 702 -3259 -6544 -7357 -5703 -2241
4512 -2241 1776 5645 7254 6952 4405 406 -3632 -6461 -7250 -5856 -2292 1736 5337 7344 6733 4036
4528 4036 -408 -4035 -6855 -7550 -5658 -2059 1917 5454 7104 6384 3456 -433 -4302 -7149 -7350 -5630
4544 -5630 -1919 2512 5911 6933 6298 3144 -943 -4422 -7127 -7387 -5048 -1246 2902 5975 7222
4559 7222 6081 3154 -1004 -4641 -6909 -6579 -4675 -785 3513 6370 7228 5948 2896 -1394 -4836
4574 -4836 -6808 -6602 -4308 -315 3749 6308 7420 5710 2613 -1422 -5115 -6889 -6362 -4294 -251
4589 -251 3651 6378 7088 5633 2420 -1864 -5336 -7137 -6486 -3962 137 3925 6281 7170 5247 1584
4605 1584 -2377 -5847 -7268 -6539 -3568 61 4167 6570 6840 4891 1609 -2497 -5993 -7372 -6710 -3520
4621 -3520 492 4114 6368 6727 5003 1202 -2576 -5803 -7356 -6142 -2973 623 4556 7000 6976 4688
4637 4688 947 -2946 -6051 -7210 -5843 -2654 1579 4989 6934 6898 4726 888 -3086 -6042 -7028 -5570
4653 -5570 -2325 1664 5149 6927 6922 4465 767 -3356 -5900 -6845 -5321 -2192 1840 5565 6826 6740
4669 6740 3976 -129 -3815 -6390 -7030 -5421 -1679 2159 5320 7184 6200 3350 -418 -4235 -6620
4684 -6620 -6993 -5347 -1901 2070 5529 6740 5668 3126 -758 -4306 -6437 -6914 -4703 -1278 2472
4699 2472 5371 6702 5909 2465 -1027 -4717 -6635 -6371 -4430 -1056 3150 6063 6918 5595 2855 -1079
4715 -1079 -4541 -6165 -6247 -4068 -524 3329 5849 6895 5449 2571 -1190 -4504 -6374 -5990 -3659 -115
4731 -115 3490 6101 6961 5303 2086 -1763 -4889 -6628 -6096 -3702 204 3889 6263 6549 5213 1779
4747 1779 -1997 -5235 -6820 -6049 -3455 323 3718 6074 6599 4736 1845 -2432 -5401 -6998 -5943
4762 -5943 -3527 408 3866 5920 6345 4413 1141 -2889 -5626 -6947 -5820 -2827 742 4077 6201
4777 6201 6343 4124 914 -2750 -5864 -6914 -5448 -3012 824 4722 6503 6263 4262 781 -2794
4792 -2794 -5528 -6277 -5386 -2462 1402 4744 6855 6538 4106 423 -3072 -5626 -6425 -5195 -1957 1882
4808 1882 5160 6775 6267 3808 267 -3516 -6021 -6283 -4830 -1831 1959 4733 6467 5915 3567 -287
4824 -287 -3667 -6079 -6576 -4730 -1732 1959 5065 6483 5618 3267 -726 -4327 -6325 -6464 -4669 -1509
4840 -1509 2178 4983 6513 5529 2759 -785 -4029 -6306 -6412 -4403 -1270 2237 5291 6184 5057 2566
4856 2566 -1088 -4156 -6079 -6238 -4058 -741 3050 5723 6363 5339 2317 -1201 -4292 -6082 -6050 -3326
4872 -3326 42 3137 5709 6557 5184 2027 -1123 -4430 -6254 -5654 -3397 -154 3289 5695 6291 4984
4888 4984 1870 -1558 -4661 -6034 -5909 -3275 383 3634 5627 6310 4776 1221 -2171 -5028 -6308
4903 -6308 -5763 -3233 260 3610 5843 6098 4483 1222 -2437 -5038 -6435 -5385 -3178 377 3673
4918 3673 5848 6103 4026 1012 -2621 -5172 -6420 -5768 -2690 656 3919 5919 5967 3952 873 -2911
4934 -2911 -5255 -6468 -5358 -2302 1338 4643 6025 6042 4048 310 -2739 -5212 -5926 -4755 -2062 1460
4950 1460 4413 6233 5808 4001 508 -3084 -5185 -6132 -4416 -1805 1739 4721 6346 5754 3708 -39
4966 -39 -3587 -5625 -6053 -4558 -1757 1950 4995 6399 5346 2951 -127 -3430 -5795 -6161 -4647 -1677
4982 -1677 1889 4605 5990 5387 2974 -512 -3803 -6215 -6111 -4115 -1199 2051 5054 5595 5003 2574
4998 2574 -1046 -4263 -5985 -5967 -4085 -706 2665 5337 5822 4836 2568 -1257 -4222 -5935 -5573 -3686
5014 -3686 -802 2698 5273 6007 4906 2192 -1415 -4120 -5798 -5652 -3330 2 3075 5927 6001 4744
5030 4744 1919 -1368 -4278 -5559 -5060 -2904 510 3638 5573 6175 4784 1575 -1677 -4562 -5839
5045 -5839 -5368 -3121 212 3571 5299 5927 4045 1333 -1984 -4918 -5938 -5412 -2983 288 3683 5541
5061 5541 5588 4203 1024 -2740 -5247 -6045 -5084 -2693 482 3781 5719 5699 3921 386 -2702 -5103
5077 -5103 -6181 -5180 -2531 933 4057 5660 5666 3808 858 -2508 -5169 -5971 -4748 -2011 1401 4220
5093 4220 6005 5695 3575 304 -2634 -5401 -5973 -4159 -1849 1553 4662 6114 5606 3348 310 -3148
5109 -3148 -5320 -5760 -4584 -1443 1859 4524 5925 5337 3157 131 -3216 -5570 -5807 -4047 -1388 2207
5125 2207 4508 5890 4877 2670 -682 -3704 -5550 -5562 -4233 -1324 2191 4426 5564 4814 2511 -903
5141 -903 -3834 -5453 -5786 -3622 -891 2168 4774 5749 4708 2157 -1077 -3958 -5735 -5548 -3538 -710
5157 -710 2694 4986 5935 4558 2237 -1268 -3950 -5619 -5360 -3187 -158 2972 5116 5912 4501 2098
5173 2098 -1259 -4171 -5379 -4860 -3344 197 3150 5344 5736 4295 1647 -1676 -4166 -5323 -5054 -2877
5189 -2877 465 3535 5306 5733 4149 1126 -1892 -4582 -5996 -4981 -2757 273 3318 5437 5524 3708
5205 3708 993 -2471 -4490 -5757 -5059 -2874 569 3348 5335 5255 3678 714 -2616 -4793 -5844 -4933
5221 -4933 -2299 837 3460 5402 5227 3630 479 -2581 -4942 -5954 -4718 -2176 1090 3940 5329
5236 5329 5373 3392 441 -2749 -4816 -5430 -4180 -1698 1472 3993 5609 5104 3307 627 -2984 -4860
5252 -4860 -5252 -4147 -1363 1778 4460 5776 5382 3147 -413 -3128 -5027 -5429 -3918 -1271 1876 4553
5268 4553 5556 4925 2726 -215 -3019 -5242 -5446 -3910 -1340 2176 4536 5448 4482 2239 -613 -3694
5284 -3694 -5432 -5280 -3659 -973 2219 4434 5270 4218 1816 -1121 -3891 -5393 -5442 -3580 -562 2274
5300 2274 4635 5350 3863 1717 -1201 -3951 -5199 -5006 -3054 -277 2558 4692 5107 4221 1859 -1346
5316 -1346 -3758 -5293 -4774 -3099 229 2837 5006 5513 4293 1797 -1421 -4235 -5152 -4636 -2848 528
5332 528 3076 5128 5206 4146 1290 -1549 -3903 -5175 -4639 -2576 131 3151 5288 5411 3781 986
5348 986 -2009 -4561 -5406 -4589 -2361 675 3290 4906 5001 3676 849 -2227 -4330 -5579 -4726 -2296
5364 -2296 917 3608 5003 5153 3132 659 -2241 -4495 -5228 -4322 -2546 687 3555 4981 4963 3380
5380 3380 451 -2545 -4678 -5359 -4314 -1816 1184 3809 5286 5006 3040 257 -2689 -4510 -5237 -3891
5396 -3891 -1406 1502 3984 5114 5183 3085 26 -2685 -4619 -5135 -3769 -1269 1569 4111 5292 4767
5412 4767 2377 -29 -2819 -4743 -5185 -3644 -1235 1843 4203 5263 4467 2382 -436 -3162 -4693
5427 -4693 -4837 -3498 -1210 2214 4144 4761 4356 2140 -607 -3357 -5118 -5007 -3471 -515 1865 4244
5443 4244 4713 3992 1946 -943 -3653 -5125 -4922 -3274 -364 2364 4339 4964 4047 1736 -1192 -3706
5459 -3706 -5141 -4715 -2972 -174 2699 4640 5069 3904 1719 -1228 -3694 -4814 -4521 -2391 317 2937
5475 2937 4563 4985 4123 1367 -1518 -3814 -4981 -4625 -2289 407 3032 4884 5044 4048 946 -1585
5491 -1585 -3720 -4944 -4352 -2279 283 3037 4565 4706 3592 912 -2123 -4317 -4983 -4282 -2478 422
5507 422 3195 4580 4658 3044 585 -2030 -4209 -5163 -4279 -2250 514 3117 4825 4643 2822 266
5523 266 -2206 -4354 -4933 -4239 -1866 982 3547 4980 4566 3024 486 -2274 -4259 -5042 -3990 -1551
5539 -1551 1281 3341 4983 4700 3170 223 -2426 -4417 -4779 -3668 -1445 1753 3812 5045 4630 2800
5555 2800 58 -2762 -4221 -4952 -3689 -1013 1640 4025 5082 4270 2340 -71 -2681 -4538 -4653 -3516
5571 -3516 -913 1554 3943 4788 4094 2110 -593 -3303 -4759 -4726 -3529 -721 2022 4222 4741 4209
5587 4209 2059 -1056 -3522 -4800 -4943 -3138 -830 2100 4138 4550 3781 1751 -1193 -3404 -4654 -4674
5603 -4674 -3193 -323 2319 3961 4772 3887 1621 -1202 -3324 -4812 -4453 -2720 -62 2475 4512 4772
5619 4772 3706 1499 -1265 -3270 -4522 -4497 -2510 235 2950 4398 4910 3754 1303 -1322 -3508 -4588
5635 -4588 -4165 -2485 109 2827 4387 4725 3763 1051 -1653 -3581 -4835 -4374 -2208 177 3036 4572
5651 4572 4703 3293 794 -1859 -4050 -4997 -4285 -2189 479 2716 4279 4549 2899 876 -1896 -3986
5667 -3986 -4795 -4203 -2290 497 2796 4261 4591 2910 329 -2211 -4137 -4761 -4071 -1803 971 3149
5683 3149 4701 4600 2831 429 -2027 -4323 -4823 -3441 -1511 1176 3336 4745 4539 2879 600 -2100
5699 -2100 -4247 -4458 -3658 -1281 1511 3653 4886 4282 2823 145 -2345 -4075 -4693 -3405 -1157 1490
5715 1490 3836 4674 4346 2234 -141 -2691 -4556 -4483 -3393 -936 1475 3592 4601 4004 2098 -681
5731 -681 -3084 -4436 -4651 -3221 -770 1630 3665 4505 3600 1632 -747 -3060 -4588 -4415 -3258 -433
5747 -433 2039 4156 4634 3667 1659 -864 -3368 -4569 -4532 -2867 -366 2044 3900 4685 3516 1498
5763 1498 -1033 -3215 -4299 -3995 -2598 -154 2580 4260 4556 3665 1387 -1124 -3158 -4367 -4234 -2344
5779 -2344 219 2586 4271 4734 3743 1202 -1259 -3432 -4512 -3884 -2356 266 2733 4401 4508 3219
5795 3219 1283 -1655 -3577 -4461 -3961 -2224 495 2484 4207 4141 3073 724 -1811 -3709 -4643 -3918
5811 -3918 -2074 458 2785 4269 4197 2973 873 -1924 -3965 -4519 -3790 -2080 354 3055 4068 4151
5827 4151 2614 621 -1896 -3760 -4382 -3920 -1867 736 3085 4421 4054 2682 340 -2107 -3883 -4187
5843 -4187 -3536 -1560 1231 3219 4538 4208 2702 213 -2300 -3914 -4227 -3195 -1056 1417 3546 4431
5859 4431 3895 2234 62 -2619 -4041 -4363 -3243 -973 1314 3307 4311 3843 2388 -234 -2701 -4239
5875 -4239 -4375 -3263 -1118 1435 3266 4494 3742 1871 -611 -2945 -4440 -4411 -3110 -734 1716 3641
5891 3641 4257 3593 1535 -874 -3132 -4246 -4093 -2928 -520 1799 3761 4387 3539 1552 -755 -3076
5907 -3076 -4220 -4029 -2466 -250 2273 3842 4484 3510 1621 -1060 -3243 -4328 -3962 -2654 -81 2337
5923 2337 3863 4345 3307 1490 -1182 -3242 -3653 -3689 -2243 -28 2434 4233 4563 3545 1530 -1452
5939 -1452 -3265 -4150 -3890 -2100 141 2525 4200 4255 3169 726 -1810 -3443 -4325 -4000 -2190 532
5955 532 2743 4186 4181 2757 706 -1857 -3610 -4459 -3612 -1838 377 2695 3951 3854 2787 252 -2065
5972 -2065 -3686 -4571 -3699 -1720 1010 2847 4211 3983 2666 655 -1970 -3929 -4229 -3386 -1481 923
5988 923 3284 4277 3876 2560 106 -1944 -3627 -4276 -3172 -1150 1255 3194 4192 3886 2362 58
6004 58 -2099 -3534 -3844 -2886 -1155 1112 3406 4207 3684 1983 -413 -2585 -4135 -4229 -3128 -915 1590
6021 1590 3307 4031 3769 2051 -736 -2676 -3836 -3987 -2959 -801 1747 3084 4298 3399 1580 -582
6037 -582 -2684 -4189 -4171 -2687 -837 1625 3692 4023 3246 1450 -869 -3006 -4146 -3948 -2412 -328
6053 -328 1818 3460 4185 3160 1310 -1186 -2952 -3932 -3632 -2362 -280 2050 3764 4088 3156 1335
6069 1335 -891 -3164 -3877 -3610 -2018 32 2508 3883 4066 2976 1175 -1176 -2978 -3978 -3534 -1957
6085 -1957 145 2571 3563 3949 3016 794 -1424 -3328 -4020 -3631 -1809 250 2482 3676 4026 2799
6101 2799 904 -1785 -3204 -4003 -3739 -1817 410 2584 3829 3871 2465 476 -1781 -3706 -4185 -3521
6117 -3521 -1655 556 2656 3853 3756 2606 234 -1980 -3747 -4095 -3211 -1192 754 3158 4050 3474
6133 3474 2133 166 -1975 -3549 -3900 -3165 -1069 1154 2986 4236 3943 2351 133 -2157 -3310 -3619
6149 -3619 -2947 -1007 1243 3145 4416 3684 2101 -114 -2042 -3383 -3748 -2773 -722 1431 3081 4031
6165 4031 3524 1858 -264 -2206 -3723 -3677 -2799 -509 1465 3182 4080 3493 1189 -614 -2768 -3914
6181 -3914 -3835 -2666 -704 1559 3461 3641 3176 1215 -715 -2634 -3896 -3692 -2633 -551 1857 3260
6197 3260 3816 3097 1347 -860 -2885 -3856 -3793 -2478 174 1772 3566 3963 2848 1202 -1064 -2939
6213 -2939 -3786 -3436 -2107 -17 2191 3530 3855 3176 1097 -1027 -2993 -3605 -3373 -1974 429 2366
6229 2366 3704 3990 2782 1138 -1505 -3074 -3539 -3093 -1676 672 2367 3973 4111 2680 852 -1582
6245 -1582 -3313 -3854 -3213 -1728 457 2350 3709 3588 2441 546 -1482 -3067 -3788 -3417 -1632 350
6261 350 2396 3440 3569 2355 130 -1782 -3567 -3703 -3022 -1538 761 2411 3712 3364 2234 175
6277 175 -1917 -3265 -3956 -2970 -1290 999 2858 3839 3353 2129 150 -1763 -3212 -3612 -2688 -972 1228
6294 1228 2884 3779 3284 1894 58 -2169 -3360 -3371 -2493 -917 1473 3150 3742 3491 1876 -302 -2149
6311 -2149 -3607 -3549 -2335 -700 1553 3038 3709 3368 1665 -666 -2327 -3521 -3542 -2443 -423 1667
6327 1667 3131 3490 3171 1253 -606 -2599 -3688 -3454 -2275 -394 1882 3255 3686 2771 1173 -1059
6343 -1059 -2806 -3558 -3594 -1919 -96 1960 3262 3508 2789 1160 -1514 -2590 -3600 -3101 -1767 77
6359 77 2239 3115 3412 2848 1255 -917 -2596 -3804 -3519 -2018 212 2342 3503 3607 2689 1063 -1095
6376 -1095 -2777 -3284 -3223 -1794 359 2072 3594 3605 2565 706 -1435 -2899 -3832 -3054 -1644 479 2418
6393 2418 3468 3622 2509 668 -1136 -3034 -3780 -3250 -1657 549 2486 3586 3336 2221 506 -1452
6409 -1452 -3118 -3534 -3118 -1460 501 2438 3599 3127 1944 -24 -1571 -3489 -3799 -3128 -1104 1161
6425 1161 2562 3670 3083 2012 96 -1852 -3455 -3654 -2548 -1382 1039 2656 3806 3488 2031 -17
6441 -17 -1834 -3095 -3370 -2482 -685 1285 2946 3741 3016 1915 -124 -1964 -3164 -3296 -2281 -382 1372
6458 1372 2917 3444 3172 1656 -384 -2396 -3252 -3456 -2293 -315 1450 2649 3383 3154 1555 -406
6474 -406 -2462 -3512 -3268 -2137 -572 1504 3078 3380 2872 1149 -786 -2699 -3352 -3323 -1944 -287 1650
6491 1650 3009 3354 2678 1057 -962 -2514 -3415 -3175 -2134 -179 1673 2958 3508 2580 912 -1155
6507 -1155 -2452 -3302 -3254 -1814 45 2068 3096 3482 2583 978 -1239 -2369 -3313 -2959 -1385 232 2219
6524 2219 3181 3602 2794 912 -1185 -2718 -3426 -2716 -1310 329 2294 3379 3374 2104 694 -1303 -2734
6541 -2734 -3558 -3056 -1425 424 2076 3356 3266 2153 599 -1597 -2993 -3674 -2827 -1594 495 2258
6557 2258 3356 3205 2159 332 -1765 -3175 -3370 -2951 -1114 708 2244 3535 3123 1753 218 -1669
6573 -1669 -2792 -3603 -2804 -1077 655 2414 3539 3101 1964 -13 -1841 -3250 -3362 -2608 -680 1099
6589 1099 2536 3387 3258 1847 -224 -1873 -3041 -3426 -2544 -827 1548 2787 3095 3062 1706 -322 -2061
6606 -2061 -2907 -3352 -2339 -567 1319 2699 3359 2806 1501 -488 -1841 -3099 -3053 -1920 -519 1536
6622 1536 3000 3251 2900 1272 -413 -2367 -3487 -3149 -2280 -517 1526 2980 3073 2282 1209 -527 -2480
6639 -2480 -3486 -3113 -2136 -144 1480 2863 3400 2360 961 -910 -2522 -3212 -2990 -1880 -136 1782
6655 1782 2974 3078 2235 906 -623 -2397 -3176 -2812 -1621 329 1877 3097 3240 2796 856 -935
6671 -935 -2442 -3189 -2889 -1564 246 2316 3226 3291 2347 644 -1147 -2672 -2990 -2689 -1304 426 1992
6688 1992 3162 3330 2084 570 -1446 -2889 -3361 -2765 -1265 666 2206 3059 3183 2293 546 -1427
6704 -1427 -2804 -3350 -2705 -1399 492 2030 2859 3147 2081 79 -1705 -2848 -3143 -2710 -1189 574
6720 574 2337 2999 2802 1968 25 -1699 -2981 -3348 -2323 -755 926 2370 3151 3064 1838 -132 -1910
6737 -1910 -2688 -3115 -2215 -845 1172 2306 3038 2885 1782 -369 -2008 -3074 -3107 -2169 -730 1290 2744
6754 2744 3143 2877 1226 -217 -1830 -2821 -2751 -2177 -627 1342 2631 3206 3040 1433 -309 -2206 -3266
6771 -3266 -3058 -2136 -321 939 2689 3208 2429 1203 -715 -2195 -2846 -2878 -1764 -184 1272 2649 2853
6788 2853 2444 1081 -768 -2121 -3313 -3235 -1821 -265 1640 2863 3283 2296 692 -792 -2324 -3042
6804 -3042 -2849 -1620 -15 1825 2739 2894 2399 810 -717 -2196 -3225 -2780 -1411 355 1779 3158
6820 3158 3126 2311 796 -928 -2134 -3026 -2485 -1324 362 1766 2858 2863 2250 622 -1080 -2557 -2921
6837 -2921 -2640 -1340 470 2074 3044 3092 1978 219 -1308 -2352 -3000 -2748 -1063 456 1999 2879 3008
6854 3008 1965 436 -1179 -2739 -3109 -2497 -1153 474 2163 2952 2783 1917 -85 -1615 -2783 -3231
6870 -3231 -2417 -832 487 2197 2915 2598 1695 151 -1683 -2908 -3035 -2294 -852 1069 2382 3047 2773
6887 2773 1564 8 -1686 -2788 -2889 -2226 -821 966 2371 3032 2801 1482 -269 -1736 -2748 -2703
6903 -2703 -1971 -389 1293 2698 3109 2632 1374 -341 -1733 -2743 -2933 -1764 -121 1289 2383 3208
6919 3208 2497 1228 -565 -2121 -3041 -2987 -1691 -374 1294 2637 3135 2560 1197 -776 -2104 -2988 -3005
6936 -3005 -1721 -28 1383 2587 3081 2166 916 -888 -2254 -2880 -2627 -1697 -249 1487 2799 2927
6952 2927 2035 843 -1048 -2298 -3037 -2854 -1647 13 1659 2839 2853 2423 799 -703 -2096 -2804 -2463
6969 -2463 -1541 292 1875 2870 3026 2032 490 -845 -2312 -2731 -2270 -1164 232 1824 2731 2834 2013
6986 2013 596 -1101 -2377 -2688 -2672 -1403 348 1839 2821 2746 1862 452 -1324 -2582 -2832 -2451 -1039
7003 -1039 567 2030 2955 2647 1860 267 -1443 -2859 -2926 -2454 -1224 800 2027 2631 2791 1721 34
7020 34 -1552 -2689 -3107 -2415 -1016 792 2046 2940 2512 1257 -59 -1546 -2596 -3039 -2277 -600 918
7037 918 2276 2931 2465 1595 -153 -1671 -2583 -2729 -1752 -459 869 2333 2800 2700 1479 -337 -1566
7054 -1566 -2647 -2742 -2035 -427 1349 2431 2727 2435 1307 -491 -1866 -2753 -2582 -1976 -170 1261 2225
7071 2225 2861 2387 1002 -375 -2038 -2622 -2635 -1828 -109 1239 2373 2607 2184 812 -917 -2160 -2800
7088 -2800 -2643 -1857 -244 1389 2469 2722 1954 811 -1009 -2310 -2707 -2742 -1692 229 1180 2617 2657
7105 2657 2070 610 -1019 -2236 -2841 -2490 -1495 119 1544 2483 2807 2137 521 -843 -2000 -2686 -2334
7122 -2334 -1144 380 1725 2785 2742 1963 602 -1215 -2191 -2868 -2317 -991 373 1719 3052 2600 1866
7139 1866 354 -1146 -2430 -2691 -2426 -1284 465 1967 2771 2495 1899 171 -1459 -2408 -2752 -2355 -1133
7156 -1133 584 2130 2742 2488 1455 41 -1490 -2646 -2611 -2387 -854 864 1958 2684 2253 1295 -246
7173 -246 -1745 -2455 -2787 -2166 -670 765 2066 2562 2385 1156 -277 -1478 -2484 -2603 -1841 -583 795
7190 795 2321 2825 2415 1344 -5 -1810 -2355 -2495 -1850 -449 1004 2373 2883 2273 1123 -310 -1605
7207 -1605 -2343 -2471 -1876 -314 1246 2317 2592 2136 955 -295 -1973 -2482 -2548 -1488 -229 1264 2346
7224 2346 2735 2049 713 -518 -2122 -2667 -2412 -1570 106 1290 2293 2307 1778 773 -709 -2012 -2741
7241 -2741 -2280 -1311 -115 1445 2458 2715 1837 705 -872 -2148 -2794 -2381 -1401 257 1635 2389 2577
$$ [...]
##END NTUPLES=NMR FID
##END=
