##TITLE=1H_LY-Choral1
 CDCl3, 8 sc, 
 20.10.2020
##JCAMPDX= 6.0         $$ Bruker NMR JCAMP-DX V2.0
##DATA TYPE= NMR FID
##DATA CLASS= NTUPLES
##ORIGIN= UXNMR, Bruker Analytische Messtechnik GmbH
##OWNER= root
$$ XWIN-NMR		Version 3.5
$$ Tue Oct 20 13:00:58 2020 Russian Standard Time (UT+4h)  she@DPX200
##.OBSERVE FREQUENCY= 200.1315066352
##.OBSERVE NUCLEUS= ^1H
##.DELAY= (6, 6)
##.ACQUISITION MODE= SIMULTANEOUS
##.ACQUISITION SCHEME= undefined
##.AVERAGES= 8
##.DIGITISER RES= 18
##SPECTROMETER/DATA SYSTEM= spect
##.PULSE SEQUENCE= zg30
##.SOLVENT NAME= CDCl3
##.SHIFT REFERENCE= (INTERNAL, CDCl3, 0, 15.7039)
##AUDIT TRAIL= $$ (NUMBER, WHEN, WHO, WHERE, WHAT)
$$ ##TITLE= Audit trail, XWIN-NMR		Version 3.5
$$ ##JCAMPDX= 5.01
$$ ##ORIGIN= Bruker BioSpin GmbH
$$ ##OWNER= she
$$ F:/spectra/data/she/nmr/H-F/1/audita.txt
$$ ##AUDIT TRAIL=  $$ (NUMBER, WHEN, WHO, WHERE, WHAT)
(   1,<2020-10-20 12:59:19.70 +0400>,<she>,<DPX200>,
      <created by zg, POWCHK disabled, PULCHK disabled
       configuration hash MD5:
       00 E9 B6 7A A2 85 ED C7 34 08 36 98 17 FE 4E 26
       data hash MD5: 16K
       2A B1 81 76 67 67 FA 8B 30 8E 5F 8D 92 07 DE 31>)
$$ ##END=
$$ 
$$ hash MD5
$$ 0A 4E 32 0A 75 E4 62 86 36 15 BB C9 B9 0D DE CF
##$RELAX= 
##$RELAX= 
##$RELAX= 
##$RELAX= 
##$RELAX= 
##$RELAX= 
$$ Bruker specific parameters
$$ --------------------------
##$DU= <F:/spectra>
##$EXPNO= 1
##$NAME= <H-F>
##$PROCNO= 1
##$TYPE= <nmr>
##$USER= <she>
##$AMP= (0..31)
100 100 100 100 100 100 100 100 100 100 100 100 100 100 100 100 100 100 
100 100 100 100 100 100 100 100 100 100 100 100 100 100 
##$AQSEQ= 0
##$AQ_mod= 1
##$AUNM= <au_zg>
##$AUTOPOS= <>
##$BF1= 200.13
##$BF2= 200.13
##$BF3= 200.13
##$BF4= 200.13
##$BF5= 200.13
##$BF6= 200.13
##$BF7= 200.13
##$BF8= 200.13
##$BYTORDA= 1
##$CFDGTYP= 0
##$CFRGTYP= 5
##$CHEMSTR= <none>
##$CNST= (0..31)
1 1 145 1 1 1 1 1 1 1 1 1 1 1 1 1 1 1 1 1 1 1 1 1 1 1 1 1 1 1 1 1 
##$CPDPRG= <>
##$CPDPRG1= <>
##$CPDPRG2= <>
##$CPDPRG3= <>
##$CPDPRG4= <mlev>
##$CPDPRG5= <mlev>
##$CPDPRG6= <mlev>
##$CPDPRG7= <mlev>
##$CPDPRG8= <mlev>
##$CPDPRGB= <>
##$CPDPRGT= <>
##$D= (0..31)
0 1.2 0 0 0 0 0 0 0 0.06 0 0.03 0 0 0 0 0.0002 0 0 0 0 0 0 0 0 0 0 0 0 
0 0 0 
##$DATE= 1603184358
##$DBL= (0..7)
120 120 120 120 120 120 120 120 
##$DBP= (0..7)
150 150 150 150 150 150 150 150 
##$DBP07= 0
##$DBPNAM0= <>
##$DBPNAM1= <>
##$DBPNAM2= <>
##$DBPNAM3= <>
##$DBPNAM4= <>
##$DBPNAM5= <>
##$DBPNAM6= <>
##$DBPNAM7= <>
##$DBPOAL= (0..7)
0.5 0.5 0.5 0.5 0.5 0.5 0.5 0.5 
##$DBPOFFS= (0..7)
0 0 0 0 0 0 0 0 
##$DE= 6
##$DECBNUC= <off>
##$DECIM= 32
##$DECNUC= <off>
##$DECSTAT= 4
##$DIGMOD= 1
##$DIGTYP= 9
##$DL= (0..7)
0 120 120 120 120 120 120 120 
##$DP= (0..7)
150 150 150 150 150 150 150 150 
##$DP07= 0
##$DPNAME0= <>
##$DPNAME1= <>
##$DPNAME2= <>
##$DPNAME3= <>
##$DPNAME4= <>
##$DPNAME5= <>
##$DPNAME6= <>
##$DPNAME7= <>
##$DPOAL= (0..7)
0.5 0.5 0.5 0.5 0.5 0.5 0.5 0.5 
##$DPOFFS= (0..7)
0 0 0 0 0 0 0 0 
##$DQDMODE= 0
##$DR= 18
##$DS= 0
##$DSLIST= <SSSSSSSSSSSSSSS>
$$ [...]
##$SUBNAM2= <"">
##$SUBNAM3= <"">
##$SUBNAM4= <"">
##$SUBNAM5= <"">
##$SUBNAM6= <"">
##$SUBNAM7= <"">
##$SUBNAM8= <"">
##$SUBNAM9= <"">
##$SW= 16.880792210976
##$SWIBOX= (0..15)
0 0 2 0 0 0 0 0 0 0 0 0 0 0 0 0 
##$SW_h= 3378.37837837838
##$TD= 16384
##$TD0= 1
##$TE= 0
##$TE2= 300
##$TE3= 300
##$TEG= 300
##$TL= (0..7)
0 120 120 120 120 120 120 120 
##$TP= (0..7)
150 150 150 150 150 150 150 150 
##$TP07= 0
##$TPNAME0= <>
##$TPNAME1= <>
##$TPNAME2= <>
##$TPNAME3= <>
##$TPNAME4= <>
##$TPNAME5= <>
##$TPNAME6= <>
##$TPNAME7= <>
##$TPOAL= (0..7)
0.5 0.5 0.5 0.5 0.5 0.5 0.5 0.5 
##$TPOFFS= (0..7)
0 0 0 0 0 0 0 0 
##$TUNHIN= 0
##$TUNHOUT= 0
##$TUNXOUT= 0
##$USERA1= <user>
##$USERA2= <user>
##$USERA3= <user>
##$USERA4= <user>
##$USERA5= <user>
##$V9= 5
##$VALIST= <valist>
##$VCLIST= <CCCCCCCCCCCCCCC>
##$VD= 0
##$VDLIST= <DDDDDDDDDDDDDDD>
##$VPLIST= <PPPPPPPPPPPPPPP>
##$VTLIST= <TTTTTTTTTTTTTTT>
##$WBST= 1024
##$WBSW= 4
##$XGAIN= (0..3)
0 0 0 0 
##$XL= 0
##$YL= 0
##$YMAX_a= 42405
##$YMIN_a= -40367
##$ZGOPTNS= <>
##$ZL1= 120
##$ZL2= 120
##$ZL3= 120
##$ZL4= 120
##$ABSF1= 10
##$ABSF2= 0
##$ABSG= 5
##$ABSL= 3
##$ALPHA= 0
##$AQORDER= 0
##$ASSFAC= 0
##$ASSFACI= 0
##$ASSFACX= 0
##$ASSWID= 0
##$AUNMP= <proc_1d>
##$AZFE= 0.1
##$AZFW= 0.1
##$BCFW= 1
##$BC_mod= 2
##$BYTORDP= 1
##$COROFFS= 0
##$CY= 11.3945322036743
##$DATMOD= 1
##$DC= 2
##$DFILT= <>
##$DTYPP= 0
##$F1P= 16.9975609425685
##$F2P= -3.02152046262296
##$FCOR= 0.5
##$FTSIZE= 0
##$FT_mod= 4
##$GAMMA= 1
##$GB= 0.15
##$INTBC= 1
##$INTSCL= 1
##$ISEN= 128
##$LB= 0.24
##$LEV0= 0
##$LPBIN= 0
##$MAXI= 10000
##$MC2= 0
##$MEAN= 0
##$ME_mod= 0
##$MI= 1.114404
##$NCOEF= 0
##$NC_proc= 0
##$NLEV= 6
##$NOISF1= 3.799351
##$NOISF2= 2.8
##$NSP= 1
##$NTH_PI= 0
##$NZP= 0
##$OFFSET= 15.70392
##$PC= 1
##$PHC0= -10686.58
##$PHC1= 9.600892
##$PH_mod= 1
##$PKNL= yes
##$PPARMOD= 0
##$PSCAL= 0
##$PSIGN= 0
##$REVERSE= no
##$SF= 200.130013532006
##$SI= 16384
##$SIGF1= 3
##$SIGF2= 2
##$SINO= 400
##$SIOLD= 16384
##$SREGLST= <1H.CDCl3>
##$SSB= 0
##$STSI= 0
##$STSR= 0
##$SW_p= 3612.71676300578
##$SYMM= 0
##$S_DEV= 0
##$TDeff= 0
##$TDoff= 0
##$TI= <>
##$TILT= no
##$TM1= 0
##$TM2= 0
##$TOPLEV= 0
##$USERP1= <user>
##$USERP2= <user>
##$USERP3= <user>
##$USERP4= <user>
##$USERP5= <user>
##$WDW= 1
##$XDIM= 8192
##$YMAX_p= 0
##$YMIN_p= 0
$$ End of Bruker specific parameters
$$ ---------------------------------
##NTUPLES= NMR FID
##VAR_NAME=  TIME,          FID/REAL,        FID/IMAG
##SYMBOL=    X,             R,               I
##VAR_TYPE=  INDEPENDENT,   DEPENDENT,       DEPENDENT
##VAR_FORM=  AFFN,          ASDF,            ASDF
##VAR_DIM=   8192,          8192,            8192
##UNITS=     SECONDS,       ARBITRARY UNITS, ARBITRARY UNITS
##FACTOR=    0.000296,      1,               1
##FIRST=     0,             0,               0
##LAST=      2.424536,      0,               0
##MIN=       0,             -40367,          0
##MAX=       2.424536,      42405,           0
$$ Real data points
##PAGE= N=1
##DATA TABLE= (X++(R..R)), XYDATA
$$ [...]
2263F68r75j210j33K22J118R02J226K00J3m30j548j174n01j07N51R23J307P31
2281A783L44j55q38j169r95p40L0N09P91J158R69J84l80p30r37j364o25J29N15
2300a521J286Q86Q47L47q28o74j242p27p08O1Q76J213J201N60J99q01o49j154
2318h28j034j72J75J054Q94J117N42j38l73j075j102p76j07M05J074P66J244M42
2336B108j45o60j122r19n45k82L74J012J279P12L55l07r06r36j144l24P4O19J070
2355C13M74P70K36k34r09r38r77l82J8N62P78J124Q21k7l28j188q86r13l11nR48
2376a054J097R70K80Nl58j028r98q75J7M66N18J205P30N59j72m14j198p93q96
2395a939J29M85P77J084P43L81j71p71p52r41o57J5P91O52J188N25K49j16q32
$$ plain form
2263 668 -307 -1517 -1650 -1428 -310 592 1818 2018 2031 1601 53 -1121 -1622 -1729 -1178 -255 1052 1783
2281 1783 2127 1972 1134 -35 -1030 -1770 -1740 -1231 -440 718 1687 1871 1491 761 -176 -1540 -2165 -2036 -1521
2300 -1521 -235 651 1498 1845 1017 343 -899 -1626 -2334 -2273 -1397 -184 1017 1577 1776 975 326 -828
2318 -828 -1862 -2034 -1859 -805 89 1206 1748 1610 1237 162 -940 -1716 -1823 -1418 -344 422 1666 2108
2336 2108 1963 1303 181 -738 -1283 -1565 -1191 -179 1100 1812 2167 1860 954 18 -1126 -1450 -1376 -757 313
2355 313 787 1557 1793 1559 650 -288 -1265 -1647 -1629 -1067 -289 835 1656 1629 1301 113 -773 -1686 -1997 -2002 -1054
2376 -1054 43 1013 1293 1298 940 -88 -1086 -1961 -1944 -1478 -960 245 975 1534 1362 948 -250 -1043 -1939
2395 -1939 -1810 -1325 -548 536 1279 1660 1489 718 -34 -975 -1632 -1617 -826 -174 1014 1539 1788 1672 840
2414H40q64j158j61k41Q04J048R52O79J49l27j021r43q04k09k09Q02Q94J171M75
2433A877O5o40r08j096q11j90K12P97J053Q38N51l36p34p73j068p15P9j25J244
2452f80J035O24L54o0n44j154q67n90J88L42P28Q79R73L91n30n94q29j281l26
2471a941M27M38R39J208P52l9n21r04p74o50l26L2N77J124P62O85J19n94p56p54
2491a96q50m66J82J009Q13R96M74o4o55p36r58p25l46K65R39Q88M45O78J25q30
2511I88r17j021m77l85N21Q77P14Q90K88j10r49q47q16l49j01M65R02P39P26L65
2531A503m42q69p65q77l14N5N87J019Q33O12M6m13o36j073o45l90J12O44J165
2550A52Q47N26K29n12j086j004n74J26J40Q54N55J303M29m12m34r71p27o69j27
$$ plain form
2414 840 -24 -1182 -1343 -1584 -780 268 1220 1899 2048 1721 700 -243 -1047 -1256 -1465 -663 231 1402 1877
2433 1877 1942 1302 394 -702 -1513 -1703 -1491 -694 359 1197 1748 1412 678 -95 -1163 -1878 -1799 -1924 -680
2452 -680 355 979 1333 1273 729 -425 -1292 -1882 -1694 -1352 -624 255 1228 1619 1089 495 -334 -1615 -1941
2471 -1941 -1514 -1076 -137 1071 1823 1784 1263 359 -415 -1065 -1391 -1359 -782 342 1104 1789 1908 1314 558 -196
2491 -196 -1046 -1512 -1330 -321 492 1488 1962 1898 1243 507 -451 -1176 -1522 -1257 -318 570 1015 1693 1818 988
2511 988 71 -950 -1427 -1812 -1291 -414 300 1190 1478 1368 419 -428 -1244 -1593 -1694 -1229 -327 412 1138 1503
2531 1503 1061 192 -573 -1450 -1764 -1709 -1122 -103 730 1342 1388 975 339 -734 -1379 -1769 -1657 -1013 152
2550 152 999 1525 1754 1242 156 -848 -1422 -1296 -1156 -302 253 1556 1985 1573 1139 168 -559 -1228 -1355
2569a355j22J127J201O95L75j95q75q34r45m61j35O47N07J029Q35L06j77r66p63
2588a06j210k63K6K29J131J066O49q7l78n49q57j246k3J13M24J046P04P42j26
2607A285p29o57r28o70o7K90O47J183M77L96n9l10r91n85q15l0M31N10J028P73
2627A179M30j91k49j231q29l60k3L49P20J063N38J99j22o83q11p45m76L15J20
2646h07P62P72J024q9k30p95j088l86n51J23N63P68Q14O49j87l61m79j147n16
2665a161m13L81O42Q28L51O79j44l45p80p66o71m45L52Q03J102O61J11J08q88
2684D05p80p97l87P9K96O02Q41P98j7J3m95j063p16k18J49K60Q18R31P80J56m44
2705A211p21p96p02j93J55L92R81Q54K85K89m30p80o79q12k18J55N93M96J192
$$ plain form
2569 -1355 -1477 -350 851 1546 1921 1726 851 17 -928 -1389 -1524 -877 -370 659 1494 1800 1623 657 -106
2588 -106 -1316 -1579 -1553 -1324 -193 873 1522 1435 1057 508 -349 -1595 -1618 -1505 -1081 -35 669 1411 1285
2607 1285 556 -101 -1029 -1699 -1766 -1476 -829 354 831 1227 1168 858 -133 -718 -1533 -1563 -1132 -622 406 1179
2627 1179 1609 1418 1169 -62 -891 -1251 -1274 -925 -205 858 1396 1595 1473 790 -21 -766 -1242 -927 -807
2646 -807 -45 727 1751 1662 1432 637 -451 -837 -1388 -1265 -702 66 880 1529 1342 981 502 -645 -1161
2665 -1161 -1574 -1193 -551 277 628 1307 1163 818 38 -728 -1399 -1844 -1492 -689 413 1074 1185 1293 405
2684 405 -375 -1172 -1559 -1480 -1184 -582 259 1057 1040 1053 558 -505 -1221 -1439 -1290 -1030 -212 719 1499 1655 1211
2705 1211 490 -306 -1008 -1201 -1046 -654 327 1181 1466 1755 1325 545 -134 -946 -1164 -1009 -416 80 1272
2724A272L59L3o84p25o38o59k26J83P17P99Q46J60Jp25n48q82o47J34k15J017
2744d28O94O55M41j09n66r60o82p00J75L74Q88N45P62K69n20p39n90o42l49k59
2764a741P44O47J047M87O5k12p94p52n46l92J50N77Q31P19O08J37o29o14q80l65
2784i13n01N59M00J063M49M70k08m97o82l76p98J5J65N30R16O54M35m77k20j068
2804h4m67m83j58M60O98O48M26K13m36j83j048k67m02k21N37M68N81Q40l8q4o65
2825C35j087m11j80m2P43O18O18L83Q3m93p06m29q30j66K82O47R79M77J48K27
2845A196o19m12o73o69j75J91O75Q92N21M73l13l76r54m78m58QL71O79Q74O25
2865A378O9k00o10q40m27l82k51P76L82J029K83K20j7p33r01n21m50k3O97P03
$$ plain form
2724 1272 1631 1664 980 255 -383 -1042 -1268 -1085 -368 431 1277 1437 1438 713 165 -717 -1364 -1230 -1445 -428
2744 -428 266 921 1362 1253 687 -273 -955 -1655 -1480 -1106 -218 327 1089 1358 838 99 -491 -1133 -1482 -1741
2764 -1741 -997 -350 697 1184 1249 1037 243 -509 -1055 -1447 -1297 -720 111 830 1438 1575 946 332 -548 -913
2784 -913 -1414 -855 -455 608 1057 1527 1319 822 140 -236 -1034 -1019 -854 -324 592 1246 1681 1204 984 -84
2804 -84 -551 -1034 -1192 -732 -34 614 1040 1253 817 634 -414 -681 -1083 -1304 -767 -299 282 1122 1084 1000 335
2825 335 -752 -1163 -1343 -1385 -642 -24 594 977 1060 567 -139 -568 -1398 -1564 -1282 -635 344 821 969 1196
2845 1196 577 165 -508 -1177 -1352 -1161 -486 406 927 1400 1087 711 -243 -721 -1179 -1171 -800 -121 753 1378
2865 1378 1447 1247 637 -203 -630 -1012 -1263 -487 -105 924 1207 1427 1410 677 -224 -745 -1195 -1218 -521 182
2885A82O42L90K21p17n82m47o64l36K87M71O55O64J98J08l33p34q06j49o14L70
2905a194P28O33P36J55p9n22o97m99l74j17M27M49M30Q66K31q3o44m27o90l74
2925a045j25K59P64Q27L18J84o0k70q99p92m62L62O17J72R72N37N9k23p37n91
2945a33p08l70j40O58Q60Q27J28J38k7j090k25j059MJ96O74N73N28K74J84p64
2965E28m79n68o15J4J75M66O70O68Q8j58n32l23r06k95m6L13O83M46P74K69k49
2986I23q18m54p98k67L8K16P53P34J058j51k70q13l97o81k54J53M39P59O74N45
3006A389r9k41p24r55l03m7L49N64N91L79N50l87j85o60p05j29k65J73N90M20
3026C05P75J68n6k74q63p49m17N8K67O51N59P84K6k10m06p56p86o71K19N05O56
$$ plain form
2885 182 824 1214 1435 718 136 -311 -975 -1311 -1024 -553 102 766 964 1072 739 5 -801 -950 -1564 -1194
2905 -1194 -466 167 903 1058 979 457 -240 -739 -1113 -1230 -803 -354 76 942 1173 1090 446 19 -671 -1045
2925 -1045 -1170 -911 -147 680 998 1182 1122 852 -47 -839 -1301 -939 -322 -150 822 1359 1418 1195 458 -133
2945 -133 -841 -1211 -1351 -693 167 994 1122 1260 1233 143 -82 -1141 -1137 -941 -267 306 834 1108 1292 528
2965 528 49 -519 -1134 -1120 -945 -479 191 859 947 789 257 -66 -972 -1267 -1313 -1000 -317 129 903 1172 923
2986 923 105 -349 -1147 -1414 -1376 -1160 -407 327 1385 1234 964 151 -246 -927 -1181 -1028 -589 170 844 1389
3006 1389 1290 1049 325 -630 -933 -980 -631 -67 524 903 1453 1066 881 221 -484 -613 -878 -705 -115 305
3026 305 1080 1248 1192 918 55 -694 -1111 -1053 -786 -135 424 1208 1234 1024 618 -138 -924 -1595 -1376 -871 -215
3047b15N85O01j28%l77r28o32j70j18O30N37N56M51K47j94m75r38q17L19O3M83
3068e20M90O75K79m9N0r78o71j27k08P2P60O66K94K94L21o75k90q98n09LN76P10
3090B65M23L03J19K09q63n23l49m33p0J92R01M48O10R1j71o75q97k11m67J51M53
3111d94O43M92L21L46l00q39m38o00l13K58M20M25P11M47Jk49p25p33m83m10M69
3132a051O46M18O56J27P5n36m11n70m54pO2M82R21N31R5j11m72o17n47j59j41
3153a063L64N71M96R00J70m91n83l81n67l28K5L78N97O72N37j36k47n96m64m48
3173e94j10j09M11O68M97L47R8l37n62p05m07k95K76N52N83L30L94J48o17l78
3193A90p87n67r1K88L39M96J006N4k02m92k90n63m19k64K86O37N14N35R6K00o52
$$ plain form
3047 -215 370 971 843 843 466 -462 -1094 -1264 -1382 -752 -215 341 792 1039 845 370 -568 -1385 -1066 -1003 -520
3068 -520 -30 645 924 875 925 -53 -724 -851 -1059 -987 -227 439 733 1027 1348 673 383 -515 -1024 -1021 -445 265
3090 265 688 991 1110 1319 456 -67 -416 -849 -919 -727 174 622 1232 1323 1152 477 -420 -631 -1098 -947 -494
3111 -494 149 641 962 1308 1008 169 -269 -869 -1182 -924 -504 -79 632 1079 1080 831 106 -627 -1110 -1520 -1051
3132 -1051 -405 13 669 796 871 335 -76 -646 -1100 -1107 -1045 -563 358 889 984 873 401 -216 -763 -922 -1063
3153 -1063 -699 -128 368 1268 1438 947 364 -17 -584 -912 -887 -509 88 760 1297 1161 914 318 -146 -594
3173 -594 -704 -813 -402 266 763 1110 1208 871 309 -396 -803 -1098 -822 -270 313 643 1037 1185 568 190
3193 190 -597 -1164 -1255 -967 -628 -132 874 928 726 234 -56 -619 -1038 -1302 -1016 -379 135 670 766 966 314
3214C14p76m29k51o1O01N46M27N47%k8m63q30k30l60J17K34O76N98L77r3On19
3236D03p70j08k47o0O86K45O09K55j08l04l36l38o54J0J02K79P29L46J90ol70
3257E53m83l71o41j63K39O45N00N03M1j20m60m51p32j67k59P36K76P79J00M32
3277I57l57l27o92l99l45P7M23K91R05J25Q3k56m15n05n49q1R9L50P21K35O02
3298I42J74j0j010o29k91m6J91M66L85N23M32l04m04l15n05k57l8J9N07N55O80
3319A065j57J30k90p31o84r9nL3Q09M16L91K84n68j94m79l35m85qJ65N47N04N66
3341H75k64O4l22q22k40k40r6L01P57L58L39Mj71m28l52r49K51j20M78O60N69
3362F52L25r2m19m10m66n76j26L89M13M49N91L58k23n28m93o87k4Q1L20N30N57
$$ plain form
3214 314 -462 -891 -1142 -1203 -602 -56 371 918 918 890 427 -403 -633 -993 -876 -642 34 632 1009 916 922 403
3236 403 -367 -475 -722 -782 -96 149 758 1013 905 601 265 -73 -727 -717 -615 -336 393 739 929 923 553
3257 553 70 -301 -942 -1105 -866 -221 279 782 823 703 243 -208 -940 -1107 -1366 -630 -354 425 525 957
3277 957 600 273 -419 -818 -1163 -1086 -663 -372 533 658 741 485 70 -435 -984 -1065 -966 -616 105 340 942
3298 942 1116 1106 96 -533 -824 -870 -679 -213 172 695 1127 823 419 104 -401 -658 -696 -677 -170 385 1065
3319 1065 908 1038 748 17 -667 -766 -771 -738 71 487 878 1162 594 400 -79 -414 -899 -907 -742 -195 309 875
3341 875 611 675 353 -469 -709 -949 -1045 -744 13 371 710 714 543 115 -237 -1186 -935 -1055 -577 83 652
3362 652 977 885 466 56 -410 -986 -1112 -723 -310 139 730 1088 865 337 -156 -843 -867 -786 -466 64 621
3383F21K94K13l15k93o92l03p7k44K75M89O50K94K97k27m64o07m33k09K82J49
3403c00N14L90L01j32o8m74o89k07o9j85P73K20L79M17k92o5n40m95k53m78L16
3424i37N80L41M59M60j82k65q27j31o41O7L12M75L94N89J15j52l20n67l44k39
3444h13r0J44N60N95O97j51j41m05o19l53j85R2L74K14R90Q7p9k83k39n46k01
3465c52j99K7L83L97N23K41J02k55n29o47l84j79N52L35L99J70M61k82n20k15
3485B8l52l86j87L00L53L81O40K4ln35m58l11k63p3K96M30M26L65q9j3k46r60
3507f33mj64mR5P83L99K16J31m34j57m68m07o30N04L26M52P13O3K64m33l73m72
3529b33j23l82K79K61M28M60J10Q9m10l70n00l96J72K01L21N10L68K09l9n68l12
$$ plain form
3383 621 915 1128 813 520 -172 -475 -552 -796 -521 -32 618 912 1209 982 518 -89 -522 -731 -449 -300
3403 -300 214 604 905 773 705 231 -458 -665 -734 -919 -146 74 453 870 578 513 -27 -522 -775 -1253 -937
3424 -937 -357 -16 443 903 721 456 -371 -502 -1143 -1076 -764 -289 105 694 809 657 337 -230 -574 -813
3444 -813 -903 -759 -199 396 1093 942 801 396 -223 -576 -761 -669 -295 -81 909 996 917 634 395 -151 -352
3465 -352 -551 -524 -141 256 779 1020 1122 867 338 -309 -693 -872 -320 15 414 584 1045 763 243 28
3485 28 -324 -710 -897 -597 -244 137 777 801 798 263 -195 -506 -769 -842 -546 -116 310 675 586 573 327 -633
3507 -633 -637 -801 -805 -710 73 472 688 819 385 228 -240 -647 -1277 -773 -447 5 718 781 1045 612 239 -233
3529 -233 -356 -738 -459 -198 230 690 800 889 479 109 -391 -787 -615 -414 -93 417 785 994 955 387 75
3550G5l90j69l54K04M99Q81MP0l42k34l06l77m13mL11N46L00L31l8J7m97n15j78
3573e79n23M45Q1J74P59K06J9j77l49m00m16k43K12L67M98N14K11k30j88k67p36
3594f22k94J48J27M34M23N01K7J42m10p16k63j00K8K30K23N19N41L7p3l53q42
3615b93r1k27p1O32J38O03K19pj56l97l81m83j48j54K73O88O35q1J11j61l71n37
3637b59m13k23K39M07J95O92M3Q5j67p16m62R2l36M1M72M72L14J41j63k58k21
3658b5n27l50J9J90N73K74M90m4j06j84m28l07l02K1Q2O22L32N29n7l03m6m41
3680A2l93k73K8L51L98L36L15j30j38k21k51l55j0q3PO81J85J24K55j11l37n21
3702a31p07M7K55L63O19L04M4K4n04l19m82j34rM7L97L56L73K83l28j97l37n67
$$ plain form
3550 75 -315 -484 -838 -634 -135 746 750 820 478 244 -62 -439 -852 -856 -545 1 301 632 594 611 114 -401 -579
3573 -579 -1102 -657 -576 -402 357 563 582 405 56 -344 -760 -1003 -791 -424 74 588 799 569 381 114 -622
3594 -622 -916 -768 -641 -207 216 717 744 886 476 -240 -503 -603 -575 -345 -122 397 938 975 902 549 -293
3615 -293 -384 -611 -682 -50 88 691 910 903 747 350 -31 -514 -662 -816 -543 145 780 699 810 649 278 -259
3637 -259 -672 -895 -656 -249 -54 638 681 766 599 -117 -579 -487 -823 -782 -310 162 476 617 454 196 -25
3658 -25 -552 -902 -883 -693 -120 154 644 600 494 310 -118 -425 -727 -706 -624 -2 330 859 802 499 453 12
3680 12 -381 -654 -626 -275 123 459 774 644 506 285 34 -321 -331 -414 -407 274 459 583 838 727 390 -131
3702 -131 -838 -791 -536 -173 446 750 794 818 314 -5 -487 -621 -630 -583 -186 170 543 826 498 301 -36 -603
3724f03l27j93M37M53K57K39L23j20m61j94l80l95K81J66N54K78J72K51k65k56
3744B17n06k69l83K07L13M79L64L63l38L0l79n54mj10K5M96L56K47K83j01m42
3765B94j93n40k36QL41j6P73M09K5p5l66o40l08k83L69r4L43P60N3K74m07k23
3787B68n45q2n69K71J70M37L94K36K73k16m16m32j89m49K8K52N12K49M36R5k89
3808D34m16l00n81n5L14J99N79M88qJ82m24m06n83j61J95k49N73K23M89n0K39
3829F82l71l83m70R1j78J66M11L78M16L18l64l08n11l79j8j51J04N73K42L57M22
3850A027l14m54n36j32k74K32J34K80J73N28P8j19l38n59j68l05j26M78M67J97
3870B69M54p8j78m00m98j90j50L0L01M99M00M4o4j23m81k63q0j37m7L75L72L00
$$ plain form
3724 -603 -930 -1123 -686 -233 24 263 586 466 5 -189 -569 -964 -683 -517 37 315 487 738 473 217
3744 217 -289 -558 -941 -734 -421 58 422 785 447 477 98 -456 -460 -570 -545 -49 307 554 837 736 294
3765 294 101 -439 -675 -667 -326 -342 431 840 865 790 424 -216 -524 -807 -438 -532 -189 571 624 898 491 268
3787 268 -277 -359 -928 -657 -487 -50 344 580 853 637 221 -211 -400 -849 -821 -569 -57 192 628 723 434
3808 434 18 -282 -863 -918 -604 -405 174 662 654 836 412 6 -577 -738 -543 -792 -219 4 493 443 682
3829 682 311 -72 -542 -451 -629 -463 -52 326 742 1060 696 388 -123 -502 -520 -671 -567 6 248 605 1027
3850 1027 713 259 -277 -409 -683 -451 -317 -37 136 664 742 623 285 -274 -442 -747 -873 -395 72 269
3870 269 723 645 467 67 -431 -621 -771 -741 -440 59 459 503 439 316 -165 -428 -508 -645 -692 -317 55 355
3892C55J87j01j63m78l21j44J7K89K19K30N00J79l72r5m65P8l47OK42J41N82R9
3914F38J07r8l95m67j20o9l00M59L77P25o6j80r9l14n38j72j48M3M18L59K74J15
3936E49Q9l8n13n10m09K43j06M26K24O38M5k40J9m32m25j76J59l96O87L48M12
3957E94j04j28k65k81n02j19K25J52K40M66K39j50mp6n37j01n27K11M96J34O04
3978E67j7J74k66l06m44K0j96J12K33L65K81K2J49j25l55l03m25j25L35K83K19
3999A98K51L19k71j68k32n75k13R7L72K61J76K23K12j03l15l62k19m04J19J32
4019e02K03M71L52j57l7k40m42k58k72J55M21J42M40O9K04O1n64m39j90q5j9K53
4041d34M74K12L87K2l49l91k16n29L40n6K05J54P28J0K33m49m98J76m46l4J01
$$ plain form
3892 355 542 441 278 -200 -521 -665 -648 -359 -140 90 590 769 397 302 -163 -85 -432 -426 -184 -43 539 638
3914 638 745 647 252 -215 -335 -404 -704 -245 132 857 791 611 512 198 -340 -512 -660 -617 -199 160 434 549
3936 549 638 600 87 -423 -832 -589 -695 -269 -45 593 638 398 417 -15 -440 -616 -457 -853 -166 182 594
3957 594 490 362 97 -184 -686 -805 -580 -428 -188 278 517 367 363 287 -250 -351 -878 -667 -171 -37 567
3978 567 550 724 458 152 -292 -272 -468 -356 -123 242 523 545 694 569 214 -89 -514 -639 -304 -21 198
3999 198 449 768 497 329 97 -478 -691 -594 -222 39 215 438 650 547 232 -130 -349 -753 -634 -502
4019 -502 -299 172 524 367 330 90 -352 -610 -882 -727 -306 -164 276 345 549 610 46 -393 -583 -668 -687 -434
4041 -434 40 252 639 661 312 -79 -295 -824 -484 -540 -335 -181 547 557 790 341 -157 19 -427 -461 -360
4062c60M03jP32J53j19n88j53m70O6k65J42O50J1L98J72Jo12k51k07m14L17j51
4084e46M69K58M07Q1k08l04n38K72p41Q7M36K81K73J98J15k6m11k35o28J8O8K81
4106c93M15K50L66j48j70k69o26qQ3n0Q4N40L88k00M02m11l76l41O3k22L14L49
4128D0L24M79l85J40n17r8n64M28l50L66L11L6M32j41k0m95j10k89k99K76J54
4149b82L94L07K94J2l47j96o21j17K11j91L20L58M13J61l13j5o55M0n52K89P6
4170d14K63Q9L67J35j54n0l71l09Pl63L63L54O1N18k0j0l43j85j28l76l52M00
4192e18N76L80J38k02qk88k61k90l37L57L17n2M01J92L13j23n51l21k05J60j61
4213d83L83K25J13L42J84l80j14p42L63j99n4L66O8N15m1K6j15n40k51k68K48
$$ plain form
4062 -360 43 42 774 927 808 220 67 -403 -337 -602 -460 190 201 599 771 772 160 -91 -298 -712 -395 -546
4084 -546 -77 181 588 669 461 157 -381 -109 -850 -763 -327 -46 227 425 540 514 103 -132 -760 -742 -674 -393
4106 -393 22 272 638 490 320 51 -575 -583 -500 -550 -466 74 462 262 664 253 -123 -464 -401 -623 -309 40
4128 40 364 843 458 598 81 -17 -581 -153 -503 -137 174 210 642 501 481 -14 -124 -413 -712 -436 -282
4149 -282 112 419 713 725 378 182 -439 -556 -345 -536 -216 142 555 716 403 388 -267 -227 -779 -490 -414
4170 -414 -151 -62 305 440 286 236 -135 -444 -437 -800 -437 -83 -22 496 476 466 123 -62 -190 -566 -918 -518
4192 -518 58 438 576 374 366 78 -183 -473 -810 -453 -136 -188 213 405 718 595 44 -277 -482 -322 -483
4213 -483 -100 125 238 580 764 384 270 -472 -109 -308 -362 4 72 587 546 572 457 -83 -334 -602 -354
4234c54k37M98N05K22L0k35j81j16p32l5J4J86M60O6K92K12k83l20j11k27m49
4255g95K59P0L40K41J83J02o7q6n61j52l08K75J90L50M43K12k92J7l80k17l16
4276d92q9M0M29J41L52K98l9k18k04m72k16J40J26J12N88j36J11M6k48k50k24
4297b05k89J83J26J85J7M26q0N6k24l65j1k39p4R0L92J86K58K43l33j62n4r36
4319h10J42J05N41K4K28K63P4p2o06l80j1k18J70L27L40R9P4M0J57p25k77j62
4341f77QL55N5K38L68J68j08k86m3m83j7j33O1P08L1K89j9J38l69Om75j09k27
4364e21J84M32K42J78J67l78l9k24l42j07J94J42O8K18J02k0j07J54n67j16m5
4385c85l6j2L51L09L39k4m32j96Lo26M3J13J10O59K30J76k73j99j61m28M3k06
$$ plain form
4234 -354 -591 -93 412 634 664 429 248 132 -600 -635 -621 -435 25 91 383 595 312 -8 -119 -346 -795
4255 -795 -536 -466 -126 115 298 400 333 247 -314 -466 -774 -499 -309 41 484 696 404 421 41 -176 -492
4276 -492 -581 -541 -112 29 381 679 640 422 218 -254 -470 -330 -204 -92 496 360 471 517 269 19 -205
4297 -205 -494 -311 -185 0 17 443 363 419 195 -170 -181 -420 -494 -404 -12 174 432 675 342 180 126 -810
4319 -810 -668 -563 -22 2 230 493 567 495 -111 -491 -502 -720 -550 -223 117 216 290 330 487 -238 -515 -677
4341 -677 -669 -314 -259 -21 347 515 407 121 78 -405 -422 -555 -494 214 245 534 515 653 284 290 -185 -294 -521
4364 -521 -337 95 337 515 682 304 265 41 -301 -408 -214 -72 -4 214 316 296 189 343 -224 -340 -385
4385 -385 -421 -433 -82 227 566 542 110 -86 -83 -709 -666 -553 -443 216 446 622 349 150 -11 -439 -396 -602
4407f02K20J51L07K13q6j03p6q5m73j5K58j9L25lM19n3q0nk44l06q0j17J19L35
4431@K44L93j79k34j9k94m83P2j0L59L35L97j77J73k74k80M1l89O8j11jO53L25
4454F09q6j48j48r1k70k49j62PL73L47K64N2r5j65l09l07k12RJ01L11J38L04o
4477B67N1k28j57l16j68J88J67L27N9L74Rk27l22j82l63k77J96N77P3Q1K24j02
4499B51p5r7k92k20K8J37K39P3L96M7LJ19m86o49J87NJ53K40L33L23j24J90n03
4522B78l99j64l5k50J87N59j38M53j26J17j54m60j35p0k23K54J57L61K08L6j69
4543B87k80l20j07J28k54K83k5P66j74Q7o4m36j30j89J23j47J62L70J2k6L52j85
4565B33k00m91Kj44K44L39j64L58K63j35m6j78k33k41q6K61O9M94J34Q8j31n19
$$ plain form
4407 -602 -382 -231 76 289 203 100 24 -61 -534 -549 -291 -310 15 12 431 378 298 293 49 -257 -337 -454 -335 0
4431 0 244 637 458 224 205 -89 -572 -500 -510 -151 184 581 404 577 303 23 64 -325 -257 -368 -369 284 609
4454 609 523 375 227 136 -134 -383 -545 -538 -165 182 446 498 403 238 -71 -378 -590 -581 -480 -169 -31 273 267
4477 267 318 90 -67 -383 -551 -363 -196 131 190 564 573 346 24 -158 -521 -798 -602 -25 48 129 353 251
4499 251 176 79 -213 -433 -405 -268 -29 44 440 487 490 609 123 -526 -339 -334 -181 59 392 715 591 781 278
4522 278 -121 -285 -320 -570 -383 176 38 491 365 482 328 -132 -267 -337 -560 -306 -149 212 420 456 287
4543 287 7 -313 -420 -292 -546 -263 -288 478 304 391 327 -109 -239 -428 -305 -452 -290 80 92 66 418 233
4565 233 33 -458 -456 -600 -356 -17 -181 177 440 305 259 81 -152 -393 -479 -218 -149 345 479 567 436 -83
4587h3K6l81R2N6L37J26L17n8p2j86Lj62k93k4k08L86mO62k33P8l2l78q7j70r6
4612c84Q7M0J87O9L75j53o1P7o61RL4N7L3L07J03K38R5n93L28m24k49k4K12K91
4636gj07K15K01J13l40l13j9Q9k26L3L03oK35K07O1l78j13l74j65L36J37M05L6
4659C23n2K20n8m52j07Q1l42l5M63K00Q4J65R3k57k25k15j70m0j18K04J61L61
4681B84R2Q1k37j93k77k61J43J2J88L36K55m7k61N2l21k33q3k27M21K81L07n6
4703B56r1Q6j24m52N0J7j14j58N13NK83K59m22j52k67q0q1N4NL13K59r7L18oj08
4728B66m52l42oK09M45L08r3J13k34K1j79j95Lp9p0L41NJ64J19r6l04N9k53R1
4752a59m7j17K57J16J68J41K8l94k9j89k5j27J58K48L41k2k0r4J10k27k41l46
$$ plain form
4587 -83 -57 -438 -346 -290 47 173 490 432 360 174 177 15 -278 -302 -510 -124 -128 534 301 379 347 -31 -118 -288 -384
4612 -384 -297 -257 -70 -1 374 221 160 237 -424 -415 -381 -324 -291 16 119 357 452 -141 187 -237 -486 -510 -298 -7
4636 -7 -114 101 302 415 75 -238 -257 -168 -394 -361 -58 -64 171 378 439 61 -52 -426 -591 -255 -118 287 323
4659 323 271 491 433 -19 -126 -45 -387 -422 41 241 325 490 583 326 101 -114 -284 -324 -442 -238 -77 284
4681 284 376 457 220 27 -250 -511 -368 -356 -168 168 423 376 115 167 -154 -387 -470 -697 -276 5 312 256
4703 256 165 251 127 -325 -275 -258 -372 -530 -17 -12 271 530 108 -44 -311 -391 -472 -418 -413 -100 159 62 380 374 266
4728 266 -186 -528 -534 -325 120 428 335 448 214 235 56 -139 -136 -215 -285 56 61 225 344 248 -56 3 -250 -159
4752 -159 -206 -323 -66 50 218 359 387 -7 -36 -225 -250 -377 -219 29 370 348 328 234 344 117 -124 -470
4774d70J5L00L09J24M4R6k17k10k59J79m48JL27K58JP1J05J52l52k73k07R9J29
4797b26j10L88L74j45R9J9n86M2k4k72O23l76K74J58J54j40J87m64j40j91m5k58
4819f59P04K06K02K0k35j02r4l28L9m35N47K24J25J58J6k72j69j19k30L09l57
4840d50J50M63J45Q0O1k17l21n5k68l7L14j81K49L37M0k87J43j61k01j09Q0j16
4862c41K31J61L58k71pO5n36J31k18K62m1J27K03K11J8k20o2Lk20j62M5N7L29
4885A23K73j28J68R3m34k13k8k52J47K80K7L10j05L1j49j2Ql56j59Q6J60L58K20
4908D48j29qj07m81J52k20k09K21K32J48M78j14k41j42J26l60j17o6K18P9P2L18
4930B98k18J40k06k16k56m2K26o2N03L4p4K84m39L37n46j44J5r8K53K12P2L09
$$ plain form
4774 -470 -455 -155 154 278 322 418 201 -9 -268 -89 -537 -536 -209 49 50 121 226 378 26 -247 -454 -355 -226
4797 -226 -336 52 426 281 380 399 -187 -145 -169 -441 182 -194 80 238 392 252 439 -25 -165 -356 -401 -659
4819 -659 45 251 453 473 238 136 42 -286 -247 -682 -135 89 214 372 388 116 -53 -172 -402 -93 -450
4840 -450 -300 163 308 388 449 232 -89 -144 -412 -449 -135 -316 -67 270 310 23 166 5 -196 -305 -225 -341
4862 -341 -110 51 409 138 131 196 -340 -209 -427 -165 -206 -79 124 335 353 133 71 74 -146 -308 -263 -206 123
4885 123 396 268 436 529 95 -118 -146 -398 -251 29 56 366 261 292 143 131 139 -217 -376 -290 -130 228 448
4908 448 319 311 204 -277 -125 -345 -554 -333 -101 47 525 411 170 28 154 -206 -323 -389 -171 -92 -20 298
4930 298 80 220 14 -202 -458 -500 -274 -336 167 201 127 411 -28 309 -237 -381 -366 -464 -211 1 73 382
4952C82j1j74p4k97L2k58K37L33n2L66j67l69L05j14m50j12J83l6L21J41L5K79
4974E00l4l30k16k40o4K35M3N3K98q8R7m5j33qm65K8K04qQ5J25K49l4Ol33j77
4999b52j69j3J90j07M33J65J36nJ19l40l81j96j89L16J15K61m4L02k1j2K04n88
5021g6k76j14L2N91N8J12j4P8l42l63J89k19O3j2J76L77n0j5K41k72k56j44k29
5044d65L07RK67J2N6R7J8j52r1j89k79M16k02M63j0O6Pk28J07k19l38Po0K43j01
5069b59K83K29k41J22k04k56J06l93L20K56P7m8J43K3j25Lk96j9k07K14J14K33
5091G5m2J91K13m67o1l06j35L31K89j02J4N59j46k20r9Ll4k45j4L34QJ49k2L61
5115F34j50q3m81k81K62J40m7R2L76l9O7m07M5k99j62J9R7m4M24j42M35j49r7
$$ plain form
4952 382 371 197 123 -174 -142 -400 -163 170 118 484 317 -52 253 139 -311 -423 -240 -276 45 186 221 500
4974 500 466 136 -80 -320 -384 -149 -106 -53 245 157 254 209 76 68 -397 -369 -165 -173 -88 37 286 252 258 -75 -252
4999 -252 -421 -434 -244 -351 82 247 383 378 497 157 -224 -420 -609 -293 -178 83 39 341 320 308 512 -76
5021 -76 -352 -466 -434 157 215 327 313 391 49 -314 -125 -344 -281 -293 -117 260 210 195 436 164 -92 -236 -465
5044 -465 -158 -149 118 130 186 283 301 149 58 -131 -410 6 -196 267 257 323 330 102 209 -10 -348 -341 -401 -158 -259
5069 -259 24 253 12 134 -70 -326 -220 -613 -293 -37 40 -8 135 158 33 36 -260 -279 -486 -272 -158 75
5091 75 33 224 437 -30 -91 -397 -532 -201 88 -14 0 559 413 193 94 97 63 -182 -196 138 146 295 273 634
5115 634 484 401 -80 -361 -99 41 -6 86 462 423 490 83 128 -171 -333 -314 -217 -261 163 21 456 307 210
5138B10J46l97q8l42L76j23J64J75j42K53k07j47p0n3K5q0K81p2K78P4j19J41
5160B83k93k75j25K58j92K55M32P8k4j22k38m2j40o0J37pN3L13J40k04J25j71
5182A81m03k54J97n5M52P0J41J67k35K99m11k86j63K64m52N92k48N98p1P3q7n12
5204a43L0r5j24k6K82K69pK17k06m4j42J87n61J01j06L66K93k44L82j16qj22k05
5227b2k66r8J70J43J63J26nq3l2l6l65j56P5K95K31j37L53j97k79J39k23l9j06
5250c49j03M57M2K2M48l04m4n0n88L29j88K18J95j78K70j2J9r6j95L1k52J07J30
5273i1J95r4K75J17P1k08l02O7l33J28j48J72K98J89j33o9j39R2k27J4K2k34L19
5296a9K20L4K8n6j96j22l50K38j26K14J68O1j6L30j52k59k28j69j11J46K18K93
$$ plain form
5138 210 356 -41 -129 -471 -95 -218 -54 121 -21 232 25 -122 -192 -245 -220 -300 -19 -91 187 261 142 283
5160 283 -10 -285 -410 -152 -344 -89 343 421 397 275 37 -5 -145 -205 -68 -75 -22 291 431 227 352 181
5182 181 -222 -476 -279 -334 118 188 329 496 261 560 149 -137 -300 -36 -488 104 -144 454 383 456 369 -143
5204 -143 -113 -208 -332 -358 -76 193 186 403 197 153 11 198 -363 -262 -368 -2 291 47 429 313 305 183 -22
5227 -22 -288 -386 -216 -73 90 216 211 128 96 60 -305 -461 -386 -91 140 3 356 159 -120 19 -204 -243 -349
5250 -349 -452 5 47 69 517 213 169 119 -469 -140 -328 -110 85 -93 177 165 184 88 -107 -76 -328 -221 -91
5273 -91 104 10 285 402 473 265 -37 30 -303 -175 -323 -151 147 336 203 134 -5 87 -140 -126 -104 -338 -19
5296 -19 201 235 263 207 11 -111 -461 -223 -349 -135 33 94 78 408 256 -3 -231 -400 -511 -365 -147 146
5318A46J29L6n2j18J1k66k14P8P7M2L87K1N6j61k42k4J32k46j59L44K29l2Q6j62
5342I8J96l6l40k6l50Q9K31j44L25P6J40j84J37k85k66K52j5R6k28K03K01Q7r7
5365A60k71K04l81O8J18j6k2K66M49l37k72j18O7k41K37k43J79J72k0M09j46j6
5387B46l44O6k45o5M62o4M6K22p3k22P0m01K40j99J38j40J97K41M9J36L4m08j00
5410a14k91P8J83K00K84p4m6J28L1k19j97k33K24j52J32K32n8M52r6k66j27k66
5432a95mj30J89j05K42J59K61j78j24j05k36k54K27K07n7K75k8n0J76l59M8m9
5454i0k55P2k6K96k30L60J14Q9l47m51K26R8p4R2K21n5K37j93J66m59N6j39L27
5477C5k53J35L75j9M8j91k2j22j71J65o6l4mJ75K40j72Q4P8M5l73K17m04K94n1
$$ plain form
5318 146 275 311 259 141 152 -114 -328 -250 -173 -131 256 277 333 172 -70 -94 38 -208 -367 -23 206 174 260 98
5342 98 294 258 -82 -108 -458 -369 -138 -282 43 119 259 75 212 -73 -339 -87 -102 -6 -234 -31 170 257 160
5365 160 -111 93 -288 -220 -102 -118 -140 126 575 238 -34 -152 -85 -326 -89 -332 -153 19 -1 408 262 246
5387 246 -98 -32 -277 -342 120 56 102 324 251 29 99 -302 -62 -261 -123 -263 -66 175 224 360 394 -14 -114
5410 -114 -405 -327 -144 56 340 266 220 348 379 160 -37 -270 -46 -198 -66 166 108 560 464 198 71 -195
5432 -195 -199 -329 -140 -245 -3 156 417 239 115 10 -226 -480 -253 -46 -103 172 144 94 270 -89 -41 -90
5454 -90 -345 -273 -299 -3 -233 127 241 330 -17 -468 -242 -144 -218 -126 95 40 277 84 250 -209 -153 -292 35
5477 35 -218 -83 292 273 321 130 108 -14 -185 -20 -86 -120 -124 51 291 119 203 281 326 -47 170 -234 60 9
5501IL80k43K56j85j14j58l07J15L0M6J71J37j3L98m23J16l87K35n47J93K17l4
5523a08J17J73Kl13J38j11q9q4j3L0L81j53m3L63j98j36l20J51L0L1J26r5J87
5546F6K10j63J8n4k24n7K42p8Q0jK7K62k49K02l30k6j26K8j12K46M62k8k0j39
5570B36j42j28k76o5J41K06M9RJ71L7j48R9l88k42K97K75k59K95p0n1nM4k10r3
5594b18lp7R3n7K83J05L5L2m5o0k29q5QK55j13q5M74j69Q6j12l17m0K43j46J30
5619a2J02k8N29k94o7K0n14K39l26M69j71J98j31L34k39J65k09k8l48M4K40k29
5641b56K91L46Q8l89J57j11k07Q7j39j9R5J22O9j13J25M7k78K8N0n02M03K12o8
5664C8q9K05J99j20k55J6j2l19L08j24K76k17N14l68l09K13r2k68J62OL41J13
$$ plain form
5501 9 389 146 402 217 103 -55 -362 -247 -217 -171 0 137 124 522 99 215 -172 63 -484 -291 -74 -108
5523 -108 9 182 184 -129 9 -102 -191 -275 -288 -258 123 -30 -73 290 92 -44 -364 -213 -183 -152 -26 -121 66
5546 66 276 113 131 77 -147 -204 38 -40 40 39 66 328 79 281 -49 -75 -201 -173 -285 -39 423 395 375 236
5570 236 94 -34 -310 -375 -234 -28 21 30 201 238 90 189 -199 -441 -144 131 -128 167 97 46 41 85 -125 -218
5594 -218 -221 -298 -205 -262 21 126 161 193 148 88 -141 -226 -218 37 -76 -161 313 144 230 118 -199 -239 4 -142 -12
5619 -12 90 62 591 297 230 250 -264 -25 -351 118 -53 145 14 348 109 274 65 37 -311 -267 -27 -256
5641 -256 35 381 469 80 237 126 -81 6 -133 -152 -57 65 134 21 146 193 -85 -57 -7 -509 -106 106 38
5664 38 -51 154 353 233 -22 -6 -18 -337 -29 -153 123 -94 420 52 -257 -44 -136 -404 -242 -236 105 218
5686B18j67L9N2r1j37Nj70MJ82K43m5k0O7N6j65j47P7J65l40L15j15J05J01N8
5710B90k3m0l05l5R6k26J4O78j75J60k98J26j69L1j01j63K00k86M32K2Pl0K6l94
5734a63R2k00J21R5K06k69J83%j0M9k69Rm8lJ29n2K53K89n13O2M0q2m71P0K77
5759b05J24Q9O7r0J93qj47j62j77J67j34N2L61M27n76J27J59k50k35J20q4J76
5781fk42L15J93j41M1J28p42L42j27J39n5N64l60K54j14j5j44j00k0k16L27j17
5803i6L90l25J87R6j69n2P1l6j88J34j61L33n1O0j96k17Q9O9k08rK42l02M22J67
5827B50K59k89j59j41n4o8k2K63m5k8J00J43n7j32M0k33k65J88l2M33J19k33R2
5850A29j42O3M8j23j94K1R4p5M26K6j25L8k95J77j56k92K22K58J15l4k0J25l49
$$ plain form
5686 218 51 90 142 51 -86 -81 -251 -247 -65 178 133 113 180 236 71 -76 1 166 -174 141 26 131 232 290
5710 290 267 227 -78 -113 -17 -243 -229 449 274 434 136 262 93 124 23 -140 60 -226 206 228 235 205 231 -163
5734 -163 -71 -271 -150 -55 151 -118 65 65 55 104 -165 -156 -204 -207 -78 -130 123 412 -101 -39 1 -81 -552 -482 -205
5759 -205 -81 8 75 -15 178 170 23 -139 -316 -149 -283 -231 130 557 -19 108 267 17 -218 -98 -182 -6
5781 -6 -248 67 260 119 160 288 -454 -112 -239 -100 -155 409 49 303 189 174 30 -70 -90 -306 21 -96
5803 -96 294 -31 156 252 83 31 102 66 -122 12 -149 184 133 193 -3 -220 -131 -62 -270 -279 -37 -339 83 250
5827 250 509 220 61 -80 -134 -202 -224 39 -6 -34 66 209 152 20 60 -173 -438 -250 -282 151 270 37 129
5850 129 -13 50 98 -25 -219 -198 -104 -179 247 273 148 186 -109 68 -88 -380 -158 100 215 181 161 286 -63
5873f3kJ39k33K0n9J87J16J7J11j51n4P1Rm37j85L26J54P3O1Olj73L1j14O3j27
5899b17J17J25NJ1J76j41l60L06n1j37k12M63j04Q0M6J31k65J3l2j52qk48L12
5922a42J1J21K07j79J34o6L0k23j27OK0O1L18M4o7J21k36R5k46K57k68k7L27k83
5946a12J50J20l8l3k72n2N2l1N7K91j04K5J20ok63k92M1K72oj86L04J69k9m0j12
5971B5j97N6l11J99K62R2J43ll03J81N3n50L89k80p2J14J11R8M3K23l7k45P9j49
5995g9r3Q4K10M7k3J03M2k59j98K0j69J65j23K72n7L19n4j3j06J01l07J08k22
6018b32K57Q4J01J76k58J52j90l35N0K84j60k6K18L20l18o5K13l49j65J81r2L7
6040a17Q8J03K17k25O1k27k8l0P3J23l39pJ79J17r3L57l04J52l05J04O1k46L18
$$ plain form
5873 -63 -65 74 -159 -139 -198 -11 105 122 233 82 28 99 108 -329 -514 -188 -34 39 100 106 103 -70 -39 -153 -90 -217
5899 -217 -100 25 30 41 217 76 -284 22 -29 -166 -378 85 -19 61 107 238 -27 -14 -46 -198 -206 -454 -142
5922 -142 -131 -10 197 18 152 86 116 -107 -234 -228 -208 -147 171 215 148 269 33 128 -118 139 -129 -156 171 -112
5946 -112 38 158 120 87 -185 -237 -185 -216 -159 132 28 53 173 167 -96 -388 -347 -75 -81 -267 37 206 177 137 25
5971 25 -172 -116 -427 -228 34 126 269 266 -37 144 197 -353 36 -244 -316 -202 -91 7 50 273 236 -9 70 -79
5995 -79 -172 -88 122 169 146 249 291 32 -166 -146 -315 -150 -273 -1 -58 261 207 194 88 189 -118 -10 -232
6018 -232 25 109 210 386 128 280 90 -245 -195 89 -71 -97 121 441 123 58 271 -78 -243 -62 -154 -117
6040 -117 -29 74 291 66 127 -100 -128 -158 -85 38 -301 -308 -129 -12 -105 252 -52 100 -205 -101 -40 -286 32
6063C2k04K34K6J98l84l3k24K50pK33K77m18j00K32J31k26O5r7j43J46P7o3R5
6086I7K46j87o3j1k26Ro0P1j1L27m1J21j11m8k59J73k77J99L0j71K15p2J59J21
6110B31j40k79j33K93k3k8J83j13P8P4j22K8k45N1k20J54J05J6J33L1Q7k25K01
6133A37%k80K01j90J96m0l1J01M4l2j05o9m7J02k8p3J14o8K71j21J19J34m48j97
6157c10L99l86K12R7j8R1J29j64j49lj17J21P5Kl5K8L95k48J49m47J25k86K7L56
6181D3j60K81o0J4j08J18j54l6l10R6K09P9k1N5r2M8J16k42o4J71n7J84j54L08
6205B64r7k17J57j95K51l31J6o2J91k65L14Q3N6l06L05l96K09p6r1J73n2O3J36
6228A30L43k49k43L5j41M2j30J26L75l07M78l35J17l37K52l06Q0j57K62o8K40
$$ plain form
6063 32 -172 62 88 286 -98 -131 -355 -105 -112 121 398 -20 -120 112 243 17 82 -15 -158 -12 65 2 97
6086 97 343 156 93 82 -144 -135 -195 -124 -135 192 151 272 161 113 -146 27 -250 -51 -21 -192 23 -49 110 231
6110 231 91 -188 -321 -28 -51 -79 104 -9 69 143 21 49 -196 -145 -365 -211 -106 -90 43 74 161 -64 137
6133 137 137 -143 58 -132 64 24 -7 94 138 106 1 -68 -115 -13 -41 -114 0 -68 203 82 201 335 -113 -310
6157 -310 89 -297 -85 12 -6 85 214 50 -99 -102 -219 -98 -23 -21 -56 -28 367 119 268 -179 -54 -340 -313 43
6181 43 -117 164 104 118 10 128 -26 -62 -372 -276 -67 12 -9 46 -46 2 118 -124 -188 -17 -74 110 -44 264
6205 264 167 -50 107 -88 163 -168 -152 -214 -23 -288 26 109 165 -141 164 -232 -23 -99 -190 -17 -69 -6 130
6228 130 473 224 -19 16 -125 -83 -213 -87 288 -19 459 124 241 -96 156 -150 -70 -227 35 -33 207
6249B07O7k4r0j51j86r4P4M6K63q0Q2J47j35p9M5j04j20m7r5K72l4M3K9J0M1j26
6275c9M8j86J80l72L70r6J24J69r9j67j68N3o3J30J44K3k7K68l2k63J38k19o9
6298a53PJ90p1K44l51K28J76k02K27l65j92O8J12j68M18O8p1%j38j54j6n7K57
6321E7l29J95L68p2rm8j24j37j08L26j93Q2j80J44K05k82J49m1J05k77j12J84
6343i7J97j1N7J4J71k37r1j51R0K0N6j50o8K72K88k66m59L03J5n8K06j50J79m36
6367c06N76j29L0j38n4M9k40rR2P4JJ24O0j21J73n9l24K61k4M8J24K4l8J01j69
6392A26L0k69j0P3P7k6k45L01P6L4P7O2m52K23j84j11L40K6L8j53J78q6j20o6
6416f1M8k83L10Kk05K65L4l2j57p1K76k32l1J40J77j38O8J64j55kj87m7l4o9j1
$$ plain form
6249 207 274 250 160 9 -177 -271 -197 -151 112 32 114 261 126 47 92 -12 -132 -179 -274 -2 -36 7 36 46 87 -39
6275 -39 9 -177 3 -369 1 -95 29 198 99 -68 -236 -183 -246 -116 28 51 24 292 260 -3 135 -84 -153
6298 -153 -146 44 -27 217 -134 94 270 68 295 -70 -262 -194 -82 -250 168 236 165 165 27 -127 -143 -200 57
6321 57 -272 -77 291 219 210 162 38 -99 -207 119 -74 8 -172 -28 177 -105 44 3 108 -169 -281 -97
6343 -97 100 89 146 160 331 94 3 -148 -58 -38 18 -132 -200 72 360 94 -365 -62 -47 -105 101 -49 130 -306
6367 -306 270 141 171 33 -21 28 -212 -221 -129 -55 -54 70 130 9 182 123 -201 60 36 84 208 232 194 295 126
6392 126 156 -113 -123 -50 27 1 -244 57 133 167 244 306 -146 77 -107 -218 122 148 186 33 211 125 5 -61
6416 -61 -13 -296 14 16 -189 76 110 78 -79 -150 126 -106 -137 3 180 42 110 274 119 117 -70 -117 -151 -220 -231
6441b31K95J0K05k80J23j30O2l35J64j09J06L75l9k1j79L1K6k41m1L82l70J9K10
6464C2K9J70J51k96L08n74K21n3k21R9K54q3Q7q4N6k04K10K3j35J0k34M22j60
6487B8o1J38j20K1j48j02J70j06QJ42L03j25j37J86q7m03K57J95m79M72j43JJ38
6510A48J72j78j55k58J02K08j99N06j80j79L10k27j78R5m6L3l5O1mR8J65j32l
6533A24j43o5K14k54r3J78O3R4N6j04%l41K63j01j21J77l5pK34k68K32k30r9l1
6557b57K32k58K09K54k48M60l09Q6k82J56j32R5n6j84N18j95j53j85K19K6j74
6578a78K39j79nL8J18J40k76J85j58K42j57l03K24j1K0j46M12m7l06J06O6J25
6600A49k54m6o6J73m4K56r5J32k73L02k53j22J21J37Q2J47j27J33J71o36J44k10
$$ plain form
6441 -231 64 74 279 -1 122 -8 54 -281 -117 -226 -120 255 216 195 16 47 73 -168 -209 173 -197 -178 32
6464 32 61 231 382 86 394 -180 41 -12 -233 -134 120 37 124 40 96 -108 102 125 -10 0 -234 188 28
6487 28 -33 105 -15 6 -142 -244 -74 -180 -172 -30 273 148 11 197 110 -293 -36 159 -320 152 9 10 148
6510 148 320 142 -13 -271 -169 39 -160 346 166 -13 297 70 -108 -13 -59 -26 -61 0 -4 94 259 127 124
6533 124 -19 -84 130 -124 -217 -39 24 118 174 70 70 -271 -8 -109 -230 -53 -88 -95 139 -129 103 -127 -226 -257
6557 -257 -25 -283 -74 180 -68 392 83 169 -113 43 -89 6 -50 -234 284 89 -64 -249 -30 -4 -178
6578 -178 61 -118 -123 -85 33 173 -103 82 -76 166 9 -294 -70 -81 -61 -207 205 158 -148 -42 24 149
6600 149 -105 -151 -217 -44 -88 168 73 205 -68 234 -19 -141 -20 117 199 346 219 352 523 -113 31 -179
6622a79o9L5K54QJ80J02O6M8m02k35K68j73O5j05J09L92k61j28J18j07l7j19o4
6645b34J44J17p1J68k2O1m4k00j37K16k04J5K90k3q9J92j24r9j29nQ7q7J77k35
6669b36J92K57k7l6k0l2l81M2K77O2n7Mk00N04l49j57K36j58p8n9L86k46J70Q0
6693A74k55K89k37j25l4J02N2J3J08J1q5j4J74p2l09J9K9K09m72K58L09k3j2l05
6717a96J66k6n1j50R6L39k33J87k25K83l04j81J85j09J10j22K42K02K41m96L2
6738a0J02k88J8J70M5q8K15M6k5l2j38l4r5J82j57l6J55K1J55L5n6k92J33Q3k34
6763a25K77l19M15l6j43J96l7k63O8j96J91k41J91k8J02m2K46k86J21K6k10O1
6785c2l41L52K00N8m52K85M9j04j61j29K57j60J15jJ82j3o2n0q7O3K2KJ5q1m0
$$ plain form
6622 -179 -248 -213 41 49 229 331 397 445 43 -192 76 -97 -32 -137 -28 364 103 -25 93 -14 -51 -170 -234
6645 -234 -90 27 -44 124 102 163 119 -81 -218 -2 -206 -191 99 76 -13 179 55 -44 -173 -178 -91 -178 -1 -236
6669 -236 -44 213 186 150 130 98 -283 -241 36 98 41 45 -155 349 0 -157 79 -79 -157 -216 170 -76 94 174
6693 174 -81 208 -29 -154 -188 -86 -34 -21 87 98 13 -1 173 101 -208 -189 -160 49 -423 -165 144 121 109 -196
6717 -196 -30 -56 -107 -257 -161 178 -55 132 -93 190 -114 -295 -110 -219 -109 -231 11 213 454 -42 -10
6738 -10 92 -196 -178 -8 37 -51 164 210 185 153 15 -19 -114 68 -89 -125 30 51 206 241 185 -107 26 109 -125
6763 -125 152 -167 248 212 69 265 228 -35 33 -163 28 -213 -22 -50 52 10 256 -30 91 117 -93 -32
6785 -32 -373 -21 179 237 -215 70 119 15 -146 -275 -18 -178 -63 -64 118 105 43 -7 -94 -31 -9 -7 8 -73 -113
6810a13L00j53K2J9r5M8l3k57K31j65K32K18j5m64L94k70n1J42O7j30k8L14k38
6833b5ll2P4R8k72L45k96o7J1n2L07k8K02k12k59J61n4j8K17l60L63j26M8J84
6857B06r0j94K7P8n3J7P0J86k38j18J3Q9R7j74j63J36J58l7J55K0j57j86q1L01
6881F2j58q2K45j51R9J20oj11O6l65J90j54M8K76L9k21J73n6j70J70k86K28l39
6904c83M30L01l04K38k56J60k91J20k23M84k27q7Q9J93k04M7L1p0K1j09N8l70
6926c52L89j49N9M36k19j1k71N3l7%%l5J25J17o9r3J02lj46QJ76o2k57J67j74
6951b46K22J46k35R9K6k16L13k12J15r9J05J51q7O7m5k37j89J20Q0L6O4j0J36
6974A04N9j73q1j08J00K31k22L79n00L55j08j98j17J05K09j72m6J43l8J33J27
$$ plain form
6810 -113 187 34 56 75 -20 28 -5 -262 -31 -196 36 254 239 -225 169 -101 -152 -10 57 -73 -101 213 -25
6833 -25 -28 -60 14 112 -160 185 -111 -178 -167 -219 88 60 262 50 -209 -48 -102 -120 97 -263 100 -26 22 206
6857 206 116 -78 -51 27 -26 -9 61 247 9 -109 -96 -7 90 -84 -247 -111 47 10 165 185 28 -158 -239 62
6881 62 -96 -178 67 -84 15 135 129 18 84 -281 -91 -245 -197 79 118 -103 70 14 -156 14 -272 -44 -383
6904 -383 47 348 44 282 26 186 -105 15 -208 276 49 -38 51 244 40 87 118 48 69 -40 18 -352
6926 -352 37 -112 -53 383 164 153 -118 -65 -102 -102 -102 -137 -12 105 36 -57 45 42 -104 -96 80 18 -239 -72 -246
6951 -246 -24 122 -113 -14 12 -204 109 -103 12 -87 18 169 82 149 104 -133 -322 -202 -122 -86 -22 -32 104
6974 104 163 -10 -91 -199 -99 132 -90 289 -211 144 36 -162 -279 -174 35 -137 -183 -40 -78 55 182
6995A82j53Qk70RL99l22J17L04k76p2K32Q4j31m1l4p8j18l6M4K48k78K70J9k0
7019H7K2j59J7M6j75L57j78o5J43K51m29O4l6k42j1J57j6L5J93J02j37J5k61j69
7043c89L36j89J00J06kJ47j40J49j50k46L33j04J65m3j7M7K71j15l83R0N1q9m
7066g6k8J8K64r1M7O7j22p0m5J22k05K19n6MK12l8m1k49K15j32j70J92r5N6j04
7091a06J69O8k15L15m13K2J45j04R1p0K05J34j74J36k7P4k48k34J42L2L6K35j21
7114I2J03k65K36q1p2k02J93O0o5j30J86K03q1j82k0q3J1K18k81M28k02J48o4
7137A50j55L9j64K61j44K01j44k7K55l44L23k03j39m3j7J63j35K34l0P5J25n8
7159B23j40j13m4j04LJ47N7J72o0Lm2j17J5k63K48j57J09L23L2l67J80m6k37J40
$$ plain form
6995 182 29 37 -233 -224 175 -147 -30 274 -2 -74 158 242 111 70 36 -42 -160 -196 -152 96 -182 88 107 87
7019 87 109 -50 -33 13 -162 195 17 -48 95 346 -83 -19 -55 -297 -308 -151 -167 -132 61 163 26 41 -220 -389
7043 -389 -53 -242 -142 -36 -38 109 -31 118 -32 -278 55 -49 116 73 56 103 374 259 -124 -34 17 -72 -76
7066 -76 -104 -86 178 87 134 201 79 9 -36 86 -119 100 44 48 260 222 181 -68 147 15 -155 37 -58 -2 -106
7091 -106 63 131 -84 231 -182 -160 -15 -119 -28 -98 107 241 67 203 176 250 2 -232 -90 -58 -22 213 92
7114 92 195 -70 166 85 13 -189 4 64 -1 -131 55 258 177 -5 -25 -108 -97 121 -160 268 66 214 150
7137 150 -5 34 -130 131 -13 188 44 17 272 -72 251 48 -91 -134 -151 12 -123 111 81 156 281 223
7159 223 83 -30 -74 -178 -175 -28 29 201 141 144 102 -15 0 -263 -15 -172 -63 260 292 -75 105 59 -178 -38
7183c8P7j15l3J85J38m78J11L7p6N57m24J94j03j14K47k71RK27K6j63j0J30m09
7206b96L20j30L69l23J54j36L8M0J5l6oJ13j23K10o7k54J91K71m71L67k83m3L6
7229d4j46K58L2p8j26K13l7j25o1m7J60j50O7j2J27j03K97k64j37N3j08J48J91
7252A08k17K02Q5l75O2l7K16k85J97k2O6j91K23J62k22J12kk33K94r5K76m15r
7275a00K42p6nKL8j2J44j60O5J02j21p1j67K70j40r7j18K44k37j3J98J19N2J27
7299B86k94p3o2P8j3l8J16k5J6L8O1N9k29J67j70k79L28L4L55m88K13j24K83n11
7323b72O8J63l37L81l63M12l0qj04P3o7O9Kk4k19M67l43K71j07k2o1q1J32j00
7347a00j08J88n5L04j91j21K24l13R5J73K2j66J21p9J82n5k10K61q5R1l07k9J34
$$ plain form
7183 -38 39 -76 -109 76 214 -264 -153 -116 -192 365 -59 135 32 -82 165 -106 -97 130 156 -7 -17 113 -296
7206 -296 24 -106 263 -60 94 -42 -4 36 51 15 9 122 -1 209 142 -112 79 350 -121 246 -37 -80 -44
7229 -44 -190 68 100 22 -104 109 72 -53 -114 -161 -1 -151 -84 -96 31 -72 225 -39 -176 -123 -231 -83 108
7252 108 -109 93 178 -197 -135 -172 44 -241 -44 -66 0 -191 32 194 -28 84 82 -151 143 48 324 -91 -100
7275 -100 142 66 61 63 101 89 233 73 138 240 119 48 -119 151 11 -86 -204 40 -197 -210 -12 107 159 286
7299 286 -8 -81 -143 -65 -78 -116 0 -25 -9 29 90 149 -80 87 -83 -362 -34 0 355 -133 80 -44 239 -272
7323 -272 -204 -41 -378 3 -360 52 22 14 -90 -17 -84 -15 -13 -37 -256 211 -132 139 32 10 -51 -132 0 -100
7347 -100 -208 -20 -75 229 38 -83 141 -172 -77 96 118 -48 73 -6 176 121 -89 172 87 178 -129 -158 -24
7370b4o4K68m30L15n1O1J03j34p9o0k64K25J34J85J51j25j71Nr2P1Jj52R2M6n9
7395d8J8rJ85j41m5n8k35N88l70M57l65j44J65L1K4N6k38J63R2P6m56M52M6k52
7419hj24R6J57k91R5L0L4j62J48O5K40m04k5K10k81K67j4J9J87j25j44Jj07K44
7443A08j27o6m7J33J26r9k5J98k01J04j67J9k35R7K02L4LJ97l1j77j40j68J05
7466a57rJ88j32K48j05j14K47k43k22J63K2P0J04K8J5J45j47R2j61k4J08k76P8
7489h2J76l1k8K20j74L70n82rK78l17j37K69J19j87K29j49L9j5M4o8Mq3K9L14
7513B29m40M84N9k56j49Q5k05m8K56J05j66J40k02JK09k0j21m0Pj39kK50lp9r0
7538a35j3K3j19O6K38j02J38j0L1m4j56qM2j47Q7N6j09J44L5J63n9j28ko4m4K12
$$ plain form
7370 -24 -88 180 -250 65 14 75 178 44 -35 -95 -359 -134 0 185 336 211 40 45 -47 24 25 -127 -35 11 -48
7395 -48 -30 -39 146 5 -40 -98 -333 255 -115 342 -23 -167 -2 29 53 109 -129 34 126 202 -254 198 244 -8
7419 -8 -132 -36 121 -170 -75 -45 -11 -173 -25 40 280 -124 -149 61 -220 47 33 52 239 114 -30 -29 -136 108
7443 108 -19 -85 -132 1 127 28 3 201 0 104 -63 -44 -279 -182 20 54 57 254 223 46 -94 -262 -157
7466 -157 -166 22 -110 138 33 -81 166 -77 -299 -136 -114 -44 60 88 103 248 101 193 32 8 116 -160 -82
7489 -82 94 63 35 255 81 451 -131 -140 138 -179 -316 -47 72 -115 114 -35 4 -11 33 -35 -31 -114 -85 229
7513 229 -211 273 332 76 -73 12 -193 -241 15 120 -46 94 -108 -107 102 82 -39 -79 -72 -211 -213 37 34 -45 -135
7538 -135 -148 -125 -244 -178 60 -42 96 86 117 73 -83 -91 -49 -196 -109 -53 -162 -18 17 180 121 -7 -9 -73 -117 95
7564I5j60j28J73J43J29j67k8N3j71K36k25j4J45p8M1K02j58KM1k27l62L51K60
7587A53L5k8k26J25M5L23l57j95M55l44M3m5J7j39M7L04k75k04J83J11Oj20O3
7610b3j63J29N0K03Q2m81J72k63K67j53M70l43K19q1j39K6j2R4m0J67j16j7K04
7633B52j91R0j75j46J65m2N5J30k51K11K34k08r6J90l10p6N9K27n9Q7j56K06J5
7656B11n4o4k52K67k64K71J23j13l60N42J2K4j86k31Q3j54J68L9mk6L1K33j62
7679A34l34K68Jj89J68l37K35J67j28L33k78M6k36J49K4j76j99K89L57l35K65
7700B24k98R6K7l8p5m0J04J24j43J60J2j13J29k90P7J12J83j85j79L47r2l5k61
7723a54J11J60l51R4K18L3q4m4L6j68J25q3J9qJ87k4j18Q7m3K6R4K4k48n9K75
$$ plain form
7564 95 -65 -193 -20 123 252 85 57 110 -61 175 -50 -64 81 3 44 246 88 90 131 -96 -458 -107 153
7587 153 188 160 -66 59 104 427 70 -125 330 -14 29 -16 1 -138 -91 213 -62 -266 -83 28 34 -86 -23
7610 -23 -186 -57 -7 196 278 -203 -31 -294 -27 -180 290 -53 166 85 -54 -28 -40 54 14 181 65 48 252
7633 252 61 151 -24 -170 -5 -47 8 138 -113 98 332 124 28 218 -92 -168 -109 118 59 146 -10 196 211
7656 211 157 93 -159 108 -156 115 238 125 -235 307 319 343 157 -74 9 -145 23 62 58 32 63 296 134
7679 134 -200 68 69 -120 48 -289 -54 113 -15 318 40 86 -150 -1 23 -153 -352 -63 294 -41 224
7700 224 -74 22 49 11 -64 -104 0 124 -19 141 153 40 169 -121 -44 68 251 66 -113 234 142 107 -154
7723 -154 -43 117 -234 -140 78 111 27 -17 19 -149 -24 -107 -88 -96 91 67 -51 36 -7 19 113 137 -111 -170 105
7748A05Oj52J58l4p8N5K22k47j51K36J52k87J03m6o0J71k34K74k45kK24j39k18
7771a87J53O6l2j1J26Q9k29k09K91M2J31N5q0j61j33L30l01J01k09Jj4K79N0k46
7795i8O1K22j85j51J3P2J4k5R9l0j14J88q3K08J6k99J07n9Nj08K74K04k21k25
7819a15K7L8r4k50M23K04k47q1K21j81k1j95R2J35n1J58q4p9N3r1Q9n3kJ47j50
7844a07k7lK31J10j88L5J47m17k2P3j1r3L26l2N1m5J42L9r1J16k32P2j59N0L7
7869BR1L7rr8k36m3J80J44p6j46Q7rr3J13j07J27K28N3j46q9j10M23p5l71N0N6
7895a7pK3j87M81k59k74L55j48L1J41qk87J44m7J25J65J1k63J24j58K02k70N3
7918g0K49l48q1L69j71J15r1j12J80n0L6k59J50J41j89K24j22P1PJ6J50j14j65
$$ plain form
7748 105 111 -41 117 83 5 60 282 35 -116 120 272 -15 88 42 -18 153 -81 193 -52 -54 170 31 -187
7771 -187 -34 32 0 -11 115 204 -25 -234 57 99 230 285 205 44 -89 241 -60 41 -168 -167 -181 98 148 -98
7795 -98 -37 185 0 -151 -138 -66 -52 -77 22 -8 -122 66 -17 191 207 -92 15 -44 -39 -147 127 331 110 -115
7819 -115 -88 -50 -144 -394 29 233 -14 -95 126 -55 -76 -271 -179 -44 -95 63 -21 -100 -47 -138 -49 -102 -104 43 -107
7844 -107 -134 -137 94 204 16 51 198 -219 -241 -168 -179 -272 54 22 73 28 170 209 118 234 2 74 -85 -35 2
7869 2 93 130 121 23 -213 -256 -76 68 -8 -154 -67 -76 -169 -56 -163 -36 192 245 99 10 -100 323 248 -123 -73 -17
7895 -17 -24 -1 -188 293 34 -240 115 -33 -2 139 131 -156 -12 -59 66 231 242 -21 103 -55 147 -123 -70
7918 -70 179 -169 -250 119 -52 63 -28 -140 40 -10 26 -233 -83 58 -131 93 -29 42 49 65 215 101 -64
7941f4j65K77K28l90N9R3k9Q3L8l55O8K25n9j29J06J33j60K01l39K92j26J54l66
7964b25K77R7k13p0J34p6J74o5l8Kp2j06J07J34k2K03K1l91J85k20Q6O7J16J02
7988B07k57Q5O8k05L6n6q0J30o3K14j73J66k6o5m8%R7j48M7L29o1k85J52J56k01
8013A9k03J49K3n2J19k05K94k22J7K62K9l67J97k8J8j4j63K67M3k59J28Q5l55
8036b18K00j6J64j2k54l9J24j53K91J34l60P1L7L0n5J94j64P6K92n05J39M68n92
8059a48J53q0N8O6J8N6oRp1l01J05K67k5l08K56p7j85R0J14n8J9P2o7n2J20M8
8085G3l82L13R2j59j1K43J41l69o5J53j52J81J40p6j60KN7l5Lj20J15K04l52L03
8109A39k7k33M73m12J59j49k34J05L22qk34J85pj47J86k6m8R8k1k03K12N2j90
$$ plain form
7941 -64 -229 48 276 -114 -55 38 9 92 130 -225 -157 68 9 -120 -14 119 -41 160 -179 113 -13 141 -225
7964 -225 52 149 -64 -134 0 -76 98 33 -5 -3 -75 -181 -74 60 38 241 262 -129 56 -164 -78 -11 105 207
7988 207 -50 35 103 -102 -66 -122 -202 -72 -135 79 -94 72 46 -19 -67 -67 30 -118 -71 258 197 -88 64 220 19
8013 19 -184 -35 -12 -64 55 -150 144 -78 -61 201 230 -137 60 32 50 36 -127 140 183 -76 52 137 -218
8036 -218 -18 -34 130 118 -136 -175 -51 -204 87 221 -139 -68 -31 -1 -56 138 -26 50 342 -163 -24 444 -148
8059 -148 5 -75 -17 49 67 123 117 126 55 -246 -141 126 101 -207 49 -28 -213 -123 -9 -67 -48 24 -43 -95 25 73
8085 73 -309 4 96 -63 -74 169 310 -59 -124 29 -123 58 198 122 -38 -36 21 -14 -11 -131 -16 188 -164 139
8109 139 112 -121 352 -60 99 -50 -284 -179 143 135 -99 86 79 -68 118 92 44 142 121 -82 130 182 -8
8132hJ48k43K9qJ14o8Q9K5l2p7j37J89l0j27K5K43k21K41j21J00l95K43p5J26
8156C0k52M1K29j8P9j99Q2p1K08j19J3K0j48K24j27m30O78l83N2M61m35J53k06
8179a18K46jj59M4j40K70p5l5k6J65k15j01
$$ plain form
8132 -8 140 -103 -74 -82 32 -36 53 78 46 -31 -168 21 -9 -136 -111 132 -89 152 31 131 -264 -21 -96 30
8156 30 -222 -181 48 30 109 -90 -8 -79 129 10 23 43 -105 119 -8 -438 240 -143 -91 370 -65 88 -118
8179 -118 128 127 -32 12 -128 142 67 32 6 171 -44 -145
8191a45
$$ Imaginary data points
##PAGE= N=2
##DATA TABLE= (X++(I..I)), XYDATA
0@%%%%%%%%%%%%%%%%%Mj2J6j6J6j6K0k8L2l3M1m8N6o4P2q2R0j04J19j33J48j66
39h8J86k06K30k55K81l12L44l80M21m62N09n62O18o80P52q32R18j018J133j268
59f71J422j605J832k113K475k963L658m727O616j0952M0967M621n5645M432j5642
74b8295p249R658L1366K4096J499O375M955l4429j9876l140j0631m668J5206K1589
88F456J2701M618J1702m395k4604j6172q989j7089J18K0320J9156J4763J0878
101B9463L750j2777k6374j2354j0116j0272J2661J7139J2160J3544N148J306j2498
114A0780j7405p733j3282o880J0653J1536J5746J5575P564r85j5838j6079j2427
127a8775j2856J006J4210J4446J5146J1821J896o746j2969j2925j0066p960K699
$$ plain form
0 0 0 0 0 0 0 0 0 0 0 0 0 0 0 0 0 0 0 4 -8 8 -8 8 -8 12 -16 16 -17 24 -24 32 -32 40 -42 48 -56 63 -70 78 -88
39 -88 98 -108 122 -133 148 -164 180 -200 221 -241 268 -294 324 -356 396 -436 482 -536 597 -671
59 -671 751 -854 978 -1135 1340 -1623 2035 -2692 3924 -7028 33939 38560 -17085 -12653 -28295
74 -28295 -35544 -25886 5480 29576 31075 37450 42405 7976 -11900 -15040 -25671 -30339 -15133 6456
88 6456 19157 23775 35477 31082 6478 -9694 -18683 -35772 -35654 -15334 3822 18585 29463
101 29463 33213 20436 -5938 -18292 -28408 -38680 -26019 -8880 3280 16824 21972 23278 10780
114 10780 -6625 -14358 -27640 -34520 -23867 -12331 3415 18990 26554 25569 9731 -6348 -18775
127 -18775 -31631 -30625 -16415 -1969 13177 24998 26894 20148 7179 -5746 -15812 -23772 -21073
140b1073J0808J0302J4419J1312J629l984j3087j4789j1688q613N326J2019J2510
153E091J6765P307k614p888j5522j2093r416l675P949R187J1055J2961L774r24
167B1957o930j3366j2026j0807l747O564R980J4262J3065L626l027j0405j5677
180f531j1855p360R09R582J0497J2314R248N6l421r280j2238q647p184N83P883
195a5444J0017J4040R891J343l316j2173j3798r888o059M890J0794J2210J3182
208A5689N338j520n945j1999j0645o417l216N071Q632J0065J1035N359j42n505
222A5800j2050j1507q193l706O510J0487J2816J1434K739l757q961j3623r530
235a1541n357j89Q068Q930J0112P788P35k224q503j1387q188p185j78P216R148
$$ plain form
140 -21073 -10265 37 14456 25768 27397 23413 10326 -4463 -16151 -24764 -19438 -7419 5091
153 5091 21856 29163 26549 18661 3139 -8954 -18370 -22045 -14096 -4909 6146 19107 22881 21957
167 21957 15027 1661 -10365 -21172 -24919 -18355 -8375 5887 18952 22578 19551 9146 -6531
180 -6531 -18386 -25746 -24837 -15255 -4758 7556 16804 16860 13439 4159 -8079 -16726 -23910 -23327 -15444
195 -15444 -5427 8613 18504 19847 16531 4358 -9440 -19328 -25387 -20497 -9703 2507 15689
208 15689 21027 19507 13562 1563 -9082 -15499 -18715 -13644 -5012 5053 16088 21447 21305 15800
222 15800 3750 -7757 -15950 -19656 -13146 -2659 10157 21591 24330 20573 11612 -2011 -11541
235 -11541 -16898 -17087 -9019 -89 10023 17811 18546 16322 7819 -3568 -11756 -18941 -19119 -11903 -2755
250b755J1862Q229R39m503j0654j2879q652l968L582R496R678J0263M345j562
264A3421m541j0100r090o035l697L048Q031Q716J0447N689m8n086j0992j0656
278a0893p198k448O192R697J0936R603K149k937o862j0785p752l987m41O022P820
293h84Q899P823K357j293o724j0270q193o567m30O980Q897J0971Q174J7m103r415
309F239j1408o768l427K534P821Q076Q223M409q18l780q467q737o153m259J717
324a4798P223Q238R609N654j038n331j0421j0120o650j883M739R104R288Q014
338A1628K249k836o233r185p205m124j254N140P001P986P927K515j549n471j0046
353c457q268n025j4O743Q962R668P246N89m236p666r631o139k683K243O941P456
$$ plain form
250 -2755 9107 17336 18275 13772 3118 -9761 -18413 -22381 -18799 -9303 375 10638 14983 13421
264 13421 8880 -1220 -10310 -16345 -20042 -16994 -8963 -247 10200 15889 15841 10755 -237 -10893
278 -10893 -18091 -20539 -14347 -4650 6286 15889 18038 15101 8239 -2546 -10298 -14285 -14726 -8704 -884
293 -884 8015 15838 18195 16902 10178 -92 -8285 -14852 -15282 -8302 595 11566 19740 19757 15654 6239
309 6239 -5169 -11937 -15364 -12830 -5009 3067 11290 15699 14881 11101 2634 -6103 -12256 -16515 -14798
324 -14798 -7575 663 10272 15926 14888 9557 -864 -10984 -17634 -19517 -14778 -5674 3614 11628
338 11628 13877 11041 4808 -4377 -11582 -15706 -16960 -11820 -4819 3167 11094 13609 12060 6589 -3457
353 -3457 -11725 -16750 -16764 -10021 -1059 8609 15855 16444 12208 4542 -5089 -11228 -13911 -11668 -4727 2729
369B729P724N230j15l468o991q658n913l619J984O543Q438Q591N127j151n448
384A1003q796r350n187j405M252P597P708O388K303k366m735q520p089m395j777
399a4369L666O988P301P247K635k470n731r439p700m312K12N816Q189P496N692
414A1221N8l617o554q018n086k530J163N334O672O964N380O81k649o517q374n788
430a1660l112J950O649Q022P990M525j198m447p750p437m262p45L382O201O684
445D792N817L163j246l862o747o584m844j705K893O834P326O813L045k208n725
460G762q580p310l681K08N004P279O120N360K01l130n290p325n741k804L91M200
476g336O088O638N410L05k573o063q317o328k729J560O530P279O663M070j236
$$ plain form
369 2729 10453 15683 15568 12100 5109 -3549 -9462 -13081 -11097 -4554 3884 12475 17602 16451 11003
384 11003 2207 -7143 -12330 -13735 -9483 -1886 5822 12210 14513 12147 7412 -1108 -8197 -12592 -14369
399 -14369 -10703 -3715 3586 10833 13468 10998 5267 -4172 -11872 -16184 -15972 -10156 -1967 5529 11221
414 11221 11279 7662 1108 -6910 -11996 -14526 -13363 -8029 -1357 5607 10987 11668 9019 2502 -5872 -11660
430 -11660 -14772 -12822 -6173 1849 9839 14364 13166 8719 969 -6468 -10730 -11475 -8093 -1892 4792
445 4792 10609 13772 12526 8664 1917 -4667 -9511 -11216 -8323 -1489 5837 12650 15695 13487 7762
460 7762 -818 -8128 -11809 -11601 -6597 682 6802 12162 12363 9233 3943 -3382 -9123 -11927 -11536 -7336
476 -7336 -1248 5390 10800 11105 8532 2469 -5848 -12176 -14905 -13345 -6815 464 7127 11197 9961
491I961m407o622p026m117j060K467N870O074N875L443p04l432o522o718m164
506a1082k003L397O305P572O545K538k238n204p516o216k907O47M879O127N695
521F539N414P03k487m307o668n427k987k56M034O301O474N338O68k687n922q142
537c412n430k202J521N759O546N396L278r29m017n656o308l880j677J729M421
552d861N828N155L712m50l636n954p391l789k016K798O685O212N870K049k326
567G886m599o765n332k786M38L621N560N275M376J643k057l868n924m954k720
582a0206k07L838N998O132M979J083k852n312o696m882j693J636N214N663N078
597G773L349l02l266m471o136l876j085R71M435N573N004L528l16l854n548o676
$$ plain form
491 9961 5554 -1068 -8094 -12211 -13271 -10804 -4934 1140 7015 10458 9754 6322 -200 -6918 -11082
506 -11082 -13085 -9688 -3383 4189 10734 13272 11034 5830 -1686 -7902 -10809 -10162 -5283 844 6539
521 6539 11953 12656 10169 5862 -806 -6233 -9220 -9476 -5442 859 7333 12671 13339 10652 4730 -3412
537 -3412 -8842 -11044 -9523 -3764 2782 8178 11456 10527 6510 854 -5454 -9334 -11011 -9282 -4861
552 -4861 967 6122 9834 9384 5748 -206 -7597 -11386 -13402 -10604 -3919 2293 8163 10212 7886
567 7886 3287 -3478 -8810 -11596 -11158 -7537 -1977 3298 7674 9317 7260 3392 -2532 -7486 -10206
582 -10206 -10413 -6575 -577 5555 10534 11617 8765 3453 -3243 -8125 -9818 -8182 -2968 2695 7773
597 7773 11122 10820 7554 3083 -3053 -6929 -8014 -7043 -2608 2965 7969 11497 11181 7327 1779 -4897
613d897l756j421K491N978N713M728J915k170m235n642n424k631m17K656M976
628b136M856M604J527j501l672o215n442k930k73L486O088N548M229Q34k975m711
644A317o192m363j480J205M147N337M788L310K24k385m034n765l989j836J000
659h716M452N678N446L704k73l465n505o087l435o69K700N147N124M435J853j469
675H920l352m895m696k759o36J904M812M989M313K382j654l977n506n361l440
690h956R5L264N842N004L784O29l046l993n940m128j483M97L586M648M300K968
706G071M68k459l829n193m513j940J065M130N246M897L118o40l277m656n739l129
722i380k87K263M164M805L770K340q83k890m048m517k934p20J863M390N152M078
$$ plain form
613 -4897 -8653 -10074 -7583 -1605 4108 8836 10751 8581 4346 -1296 -6720 -9351 -9768 -7112 -2136
628 -2136 2720 7324 8851 7350 3678 -2537 -7979 -10909 -11182 -7696 -1608 3940 8169 9003 6028 1317
644 1317 -4875 -9238 -10718 -9513 -5366 -29 4759 8069 8293 5908 1874 -3891 -7880 -9716 -8716
659 -8716 -4264 1414 6860 10564 10291 6826 1321 -4766 -8201 -8870 -6170 -1023 4101 8536 10389 8920
675 8920 5568 673 -4023 -6782 -7418 -5514 -702 4287 8600 10982 9328 5351 -155 -5516 -8956
690 -8956 -8861 -5597 245 5249 9033 9662 6616 2623 -3317 -7445 -8928 -8431 -4845 -197 4103 7071
706 7071 7539 5080 1251 -3942 -8455 -10395 -9330 -5200 46 4943 8061 7421 4144 -512 -6251 -9380
722 -9380 -9667 -7404 -3240 1565 5335 7675 6792 3902 -146 -4663 -7597 -8317 -6454 -2064 3088 7166
738G166K387j439l625n251m673k208J67L516M776M775L164O58k297l455m733l688
754d760j706J58L125M036M299L187Q66k046l876n105m393j942R82L554M903M681
770E963K384m57l134m300n314k759q82J788L607M273L447K318l65k980m149m784
786e344l124q51J568M542M637L829K419j434l334m752m665k597O07K645N048L667
802B861L380J099j863l144m297l754j541J80K540M241M392L525R75k057l536m680
818a679m208j385R06L603M995L961K323Q9k883l734m554k879o16J137L189M143
834B408L224K350k87k507l976m390l456n82J585L713M466L682J443j127l295m587
850a336m063k154L8K073L911L874K796R77j322k844l832m195j995J74K356L680
$$ plain form
738 7166 9553 8114 4489 -762 -5435 -7643 -7476 -3960 816 5591 8755 9413 7116 3661 -1072 -4760
754 -4760 -6466 -6308 -3183 853 5152 8339 9205 7159 3283 -1822 -6215 -8157 -7175 -3621 1282 5963
770 5963 8347 7890 4756 456 -4858 -7617 -8499 -6711 -3104 1169 4616 6934 6569 3589 -560 -5344
786 -5344 -8468 -9319 -7751 -3209 1428 5257 7676 6242 2908 -1844 -6509 -9106 -8499 -5854 -806 2861
802 2861 6241 7340 5477 2333 -1964 -5718 -7259 -7079 -4539 -298 4094 7619 8594 6537 3001 -1679
818 -1679 -5887 -7272 -6366 -2763 2232 6193 8516 8605 5722 1988 -2566 -5445 -6061 -4924 -1735 2408
834 2408 5632 7982 7695 5188 1212 -3178 -6634 -7216 -5631 -1918 2548 6230 7673 6546 3251 -1336
850 -1336 -5399 -7553 -7515 -5442 -1531 2343 5139 6116 4794 1950 -1882 -6077 -8072 -7898 -5542 -1862
866a862M460K977J088k037l750m126l630j119R48L164M445L469K147J40k084l452
882G78l401l120q58Q79K937L961L767K574j17k510l669m180k725q46J721M106
898g03M004L373J549j377k861l946l517j891J0J961L134L607K876R19n42l167
914C429l550l968k418j02K145L989M318K664N86j846l619m029l735j056O13L055
930c524L884K988J887M92k220l063l591l084j191P97K503L707M000K508k49k139
946C705l941m072k665l51J554L381M025L315J321j043k525l238l314k088K24J551
962d161L093L526K964J341n45k700l509l785j813L17J707M177L469K848Q02j923
978E808l171l634l080j020M63K442L252L000K084L51j433l004l709k830j329L95
$$ plain form
866 -1862 2598 5575 6663 4626 876 -3250 -6880 -7999 -7051 -3887 558 4027 6174 6314 4230 778
882 778 -2623 -5743 -6601 -5722 -2785 1176 4943 7517 7400 4890 1221 -2959 -5684 -6530 -4809 -703
898 -703 3301 6674 8223 6846 3985 39 -3478 -5369 -5359 -3398 -264 3343 6219 7138 6596 3429
914 3429 -121 -4089 -6507 -6609 -4464 -475 3843 6507 7093 5247 1628 -2401 -6136 -7192 -6579 -3524
930 -3524 360 3348 5235 5727 3507 444 -3147 -6231 -7422 -6625 -4122 -415 3585 6093 5844 3705
946 3705 -236 -4308 -6973 -7324 -5770 -2389 1636 4951 6272 5229 2704 -534 -3848 -5936 -5712 -4161
962 -4161 -1068 2458 5422 6763 6218 3518 9 -3776 -5589 -5272 -3565 612 4081 6929 7731 5808
978 5808 2637 -997 -4077 -5097 -4634 -2192 1060 4060 6144 6495 5062 2058 -1651 -4481 -5810 -5415
994e415K471L749L601J668p3k333l746l491k582o82J629L039L537K461J262m60
1010D635k553k795l170k402l37J400K715L407L044J326p27k257l535l446j801
1025f496J93K143L482L264K536O27j478k871l041k676r06M50K154L006K824K398
1041E609M46j090k624l252l229j238R18K268L766L154J857K35k309l084l396k305
1057d274p06J263K876K911K540J374m40k253k657l151k310l55Q45K619L481K623
1073D386J243o60k546l413l145k091K0K146K823L251K267O34j336k442l120k703
1089d686j223J07J814K786L182K158P84j048k953k929l173r84P31K293L479L216
1105C554J596j70j438k700k778k594p17R35K643K949K707J491L07j860k748l036
$$ plain form
994 -5415 -2944 805 4406 6074 6001 3668 -78 -3569 -6151 -6833 -5204 -2165 1372 3833 5095 4635
1010 4635 2082 -713 -3883 -6285 -6622 -5222 -2507 900 3944 5270 4543 2286 -1249 -4695 -6496
1025 -6496 -6303 -4160 -678 2586 5122 5749 4271 1400 -1641 -4317 -5223 -4773 -2619 387 3211 5609
1041 5609 6055 4965 2341 -911 -4140 -5378 -4460 -2192 1574 4728 6585 6820 4511 1427 -1969 -4274
1057 -4274 -4980 -3717 -841 2070 4610 5984 5544 3291 634 -2517 -4827 -5182 -4337 -1718 1763 4386
1073 4386 5629 4969 2423 -990 -4135 -6226 -6206 -4060 -1237 2014 4281 4915 3579 1137 -1983 -4686
1089 -4686 -5909 -5802 -3988 -1202 1980 4138 4922 3874 921 -2008 -5181 -6165 -5434 -3141 338 3554
1105 3554 5150 4980 3542 842 -1936 -4530 -5247 -4312 -1669 1280 3987 5478 5785 3925 1177 -1859
1121a859k262n61Q14K872L320K585J603p79k478l064k930j721l8J587K851K811
1137B751J673J078r96k099k979k687j412k62J624K864K865J962Q50j274k675l101
1153a818k898j238O83K048L309K710J423J08j738k710k529k317o03R93J437K905
1169b35K759J773K9j654k492l234k283j54Q44K624L302K655J144p26k018k764
1185d30k583j642K06J304K597K711J979J175l86k335k623k672j491m7J621K806
1201A90K723K078Q49r29k740k671k739j142M67J904K641K470J355M53j206k193
1217A510k610k427r69L91J547K897K334J861Q5j971k213l097k358k11O32K374
1233b225K826K332J162o73j705k604k556j437l63R18K315K927K012J087p28j499
$$ plain form
1121 -1859 -4121 -4682 -3868 -996 2324 4909 6512 5733 3255 191 -2739 -4460 -4498 -2911 -60 2751
1137 2751 4424 5502 4506 2407 -572 -3259 -4671 -4933 -3309 -445 2420 4382 5232 3958 1283 -1818
1153 -1818 -4716 -5954 -5271 -3223 86 2796 4219 4327 2589 -121 -2650 -4967 -5570 -4577 -3140 -235
1169 -235 2524 4297 4326 2672 180 -3054 -5337 -5491 -4647 -2023 1279 3934 5078 4352 2334 -430
1185 -430 -3013 -4655 -4449 -3145 -548 2163 4142 5317 4931 2596 -27 -2699 -4190 -4237 -2616 190
1201 190 2913 4991 5840 4911 2171 -500 -3239 -4381 -3914 -2010 631 3101 4456 4909 3703 1510
1217 1510 -1100 -3527 -4496 -4105 -2558 339 2673 4534 4619 2648 435 -2662 -5020 -5231 -4599 -2225
1233 -2225 601 2933 4095 3422 1717 -887 -3443 -4880 -5243 -4325 -2010 917 2929 4016 3288 1789
1249A789k664k648j696J18J585K673K893K119N33q69k604k128k423j049N27J760
1265b084K600K455J865L2j159j903k654j886j122M66J530K895K564J595M6j519
1281C721k256k918j932p02J059J868K616K112Q29l3j634k526k187j774j60P07
1297c210J854K396J986J354n27j988k454k540j598l93J380K464K792J723O45p69
1313C115k373k213k296o95J80J035K255K449J766O08j057j875k420k214r09M62
1329d182J781K528K538J612J08j278k566k340j464p62Q91J982K400K194J148j30
1345D460j544j784k328k004n07R81J952K367K305J242m57j635k787k513j059m46
1361c757J300K199K449J576N99o71j995k093k433j062J53J202J980J941K008O87
$$ plain form
1249 1789 -875 -3523 -5219 -5101 -3516 -843 2050 4169 4702 3833 1229 -899 -3322 -4371 -3844 -2084
1265 -2084 516 2971 4836 4868 3709 1806 -848 -2734 -3856 -3390 -1860 1035 3599 5194 5240 3721
1281 3721 1465 -1453 -3385 -4087 -3028 -1160 1456 3568 4397 4364 2730 204 -1983 -3757 -3917 -3210
1297 -3210 -1356 1040 3026 4380 3853 1865 -589 -3129 -4727 -5120 -3740 -1276 1516 3239 3884 3115
1313 3115 742 -1471 -3767 -4462 -4282 -3247 -992 1457 3223 3831 2774 899 -1521 -3735 -4644 -4182
1329 -4182 -2401 127 2665 4277 4385 3107 541 -1799 -3263 -4025 -3134 -1152 1248 3442 4590 4460
1345 4460 2916 1132 -1196 -3200 -3707 -2726 -774 1593 3898 5140 4683 3048 261 -2252 -3311 -3757
1361 -3757 -2457 -258 2191 3767 4366 3695 1700 -393 -2826 -3888 -3735 -2533 -553 1388 3396 4083
1377D083r97j933k635k078j051K53J377K757K381J148O7j295k016k287j900l69
1393d495O09K069J925K120J254j33j177j856k268k081k64O95J892K657K084J126
1409D157l42j548k302k255j229l08J445J984K245J652P23n17j546k052k244j161
1425c298J69R24K360K100J819L64n54j947k423j988j128K83J460K454K058R79
1441C632L48j157k153k189j479p08N63J566J909J775J164j6j011j871k437j913
1457c977m64P87J595K452J836J090l66j765j992j944j432L6J080J604K281J658
1473B479P85l22j684j769j869j383j82J236J857K427J715O03q39j683k045j913
1489b587j074N65J600K274J699J341L49r35j796k167j646r59L92J863J670K065
$$ plain form
1377 4083 3086 1153 -1482 -3560 -4611 -4358 -2981 -224 2157 3305 3372 2077 61 -2226 -4126 -4495
1393 -4495 -3886 -1817 108 2228 3482 3349 2172 316 -1952 -4033 -4297 -3602 -1710 947 3031 4157
1409 4157 3815 2267 -35 -2290 -3519 -3827 -2382 -398 1847 3499 4222 3705 2159 107 -2137 -3298
1425 -3298 -3129 -2205 155 2255 4074 4438 3884 1937 -486 -2474 -3602 -3319 -1859 595 2653 3632
1441 3632 3980 2823 670 -1519 -2998 -3706 -3143 -1577 332 2107 3271 3255 2244 373 -2064 -3977
1457 -3977 -4441 -3654 -2059 393 2229 3319 2953 1188 -804 -2748 -4180 -4144 -3064 -1460 821 2479
1473 2479 3264 2942 1258 -511 -2380 -3763 -3945 -2709 -852 1575 3290 3893 3054 1371 -674 -2587
1489 -2587 -3661 -3096 -1496 778 2477 3818 4167 3232 1436 -731 -2377 -3336 -2944 -1081 589 2654
1505B654J310K18j051k002k109j838l79K68J840K148J934P22q8j484k032k050
1521a939j404j67P86J596K106J538O90l7j563k246j667j881J47R50J843K291J693
1538B736N53p58j643k210j542j159K45J335J886J951J073M85n12j714j970j859
1554c103p31M33J326K244J992J366L91j100k012j980j541m47M82J656K020J843
1570B839Q78l44q59j607k384j147k09O07J347K048K053O25k09j412j711k207j159
1587b851j46P63K170J882J263O38q43j566j876j813r75L0J245J603J640J274M83
1604B921n83j616j805j844q05K41R58J803K427Q06L41r63j968j758j625m84Q19
1621c135J374J862J635R43J05j062j697j693j358k12L85J546K136J856O94j62
$$ plain form
1505 2654 3964 4182 3131 1129 -980 -2818 -3197 -2929 -1089 1059 2993 3715 3627 2143 111 -1939
1521 -1939 -3343 -3510 -2724 -1128 978 2516 3206 3169 1606 -640 -2307 -4188 -4041 -3091 -1248 1043 2736
1538 2736 3289 2531 888 -1322 -2864 -4023 -3778 -2443 -557 1394 2467 2952 2440 726 -1244 -3103
1554 -3103 -3834 -3401 -2075 169 2161 3527 3918 2818 806 -1174 -2715 -3162 -2680 -1024 996 2839
1570 2839 3717 3373 2514 907 -1477 -2624 -2833 -2226 -879 1169 3222 3847 3638 2226 515 -1692 -2851
1587 -2851 -2997 -2234 -64 1818 3081 3719 2876 1310 -566 -2379 -3354 -3324 -2079 -476 1164 2438 2921
1604 2921 2338 722 -1083 -2927 -3732 -3491 -2533 -730 1697 2503 2844 1881 -87 -1845 -3470 -3954 -3135
1621 -3135 -1761 101 1736 2679 2784 1722 25 -1668 -3026 -3238 -2853 -1307 829 2685 3379 3217
1637C217j201k010j779j239n4J153J800J825J575J59l66j320j733j657j175K39
1653b566R23J640J867J395M36p55j369j937j688r34J95J285J575K000J413o0r96
1670B424j745j996j063p11K77J211J864J504R59m0q98j854j563j539o51O18J596
1687a607J733J924N97k25j090j802j696j161j46R09J362K201J185N11j62j305
1703A228j540j559j074q8R24J636J924J102O59m62j240j897j641r95M89J111J646
1720B23J916J039L73j029j509j506j504m06L79R93J673J764R63o2o86j748j441
1737e68j928l21L95J252J729J993P54l49j314j587k090n54o54P67J494J636J326
1754A981N75l19j292j555j375r99m18Q90J182K031J164P78l57j403j812j558q67
$$ plain form
1637 3217 2016 6 -1773 -3012 -3066 -1913 -113 1712 3287 3446 3080 1760 27 -1630 -2805 -2566
1653 -2566 -1643 -3 1864 3259 3695 2940 1571 -366 -2054 -2988 -2793 -1508 67 2067 3480 3420 2424
1670 2424 679 -1317 -2380 -3091 -2814 -1603 261 1765 2724 2684 1786 -68 -1631 -3170 -3821 -3203 -1607
1687 -1607 126 2050 2647 2422 1332 -470 -2166 -3327 -3473 -2564 -1202 999 2184 2695 2533 1228
1703 1228 -312 -1871 -2945 -3033 -2109 -473 1451 2553 3212 2750 1510 -387 -2028 -3023 -2534 -1423 223
1720 223 2139 3178 3551 2522 1013 -493 -1997 -2403 -2024 -1031 642 2406 3369 3307 2621 873 -568
1737 -568 -2496 -2817 -2422 -1170 559 2552 3306 2957 1643 56 -2034 -2588 -3242 -2475 -981 655 1981
1754 1981 2556 2237 945 -610 -1985 -2984 -3402 -2512 -1330 701 1865 2643 2286 883 -929 -2487 -3354
1771c354L78J097J460J784R91J84l83j314j878j010j099M39J053J756J668J073
1787B845L6o56j569j630j305m69P74J241J603J357J206m66p28j493j655j141j44
1804b194O07J194J664J416O01m11j179j332j826j036j41R32J391J602J238N51
1820C077p77j130j665j580o84m3R46J215J748R69R0k72j382j462j368r65K08J175
1838a900J369J582J256Q6o21j637j278j387q41O54J246J557J454Q77q5q90j570
1855a28j125j124l75N72J377J271J426Q65p3q11j559j733r92j92P82J454J638
1872A273J396N50j84j398j531j170j022j61J015J361J484J050N18p53j205j446
1888b23j614m56J27R30J224J769P27K67m57j533j948j030m79L64J122J315J526
$$ plain form
1771 -3354 -2976 -1879 -419 1365 2356 2540 2157 843 -1035 -2045 -3144 -2705 -1652 104 1772 2845
1787 2845 2881 2225 656 -974 -2279 -2748 -1974 -733 870 2227 3433 2967 2239 746 -909 -2050 -2194
1804 -2194 -1587 -393 1271 2687 3288 2877 1698 366 -1460 -2496 -2637 -1705 -314 1288 2526 3077
1820 3077 2300 1170 -495 -2075 -2759 -2802 -1856 -641 1107 2076 2166 1894 512 -950 -2318 -3283 -3075 -1900
1838 -1900 -531 1051 2307 2393 1772 135 -1143 -2530 -3371 -2717 -1471 86 1540 2417 2332 1442 -128
1855 -128 -1253 -2377 -2752 -2180 -803 468 1894 2759 2686 1875 316 -1417 -2409 -2601 -1819 -365 1273
1872 1273 2669 3219 3035 1637 106 -1064 -2086 -2247 -1232 129 1613 2663 3181 2428 1223 -223
1888 -223 -1837 -2293 -2166 -1236 -12 1757 2484 2751 2294 761 -1187 -2217 -2696 -2332 -1210 105 1631
1905A631M50l0o45j478j343j210k54M65Q28J620J310Q38j92o95j682j440r25p7
1923b829O49J275J520J168M09r2p58j741j117q18j38Q99J345J226J015O32j50
1940B495j302j569j279q71L80J234J036J489J167J52o94j293j414j024p13L23
1956a883J082J332J357O94no95j117j405j121p08L95J012J440J452P84J7j204
1973A427j165j571j189k66N47J170J777R49L96k09q45j389j522q03K6N84J335
1990g48J452J163K15k71j003j442j255q75L34O32J689J215J059K50o10j191j307
2007f93j403l97N87R32J118J363R56L7o23j369q58j404m04M83J003J307J350Q81
2025B866n2r65j256j308j261k36O23J428R16J141Q80o04p85j234j046j369j36
$$ plain form
1905 1631 2081 2051 1406 -72 -1415 -2625 -2879 -2414 -1586 34 1344 2182 1990 1295 -387 -1827 -2752 -2829
1923 -2829 -2180 -905 615 1783 2192 2100 1342 -399 -1516 -2334 -2472 -1573 -228 998 2013 2645 2495
1940 2495 1193 -376 -1655 -2526 -2146 -912 124 1613 2780 2932 2238 945 -469 -1493 -2206 -1883
1956 -1883 -801 531 1888 2582 2577 1882 765 -640 -1761 -2469 -2074 -1062 378 1830 2614 2631 1427
1973 1427 262 -1309 -2498 -2764 -2217 -1047 730 1679 2075 1866 1021 -368 -1890 -2693 -2667 -2083 -748
1990 -748 704 1867 2082 1811 808 -634 -1889 -2764 -2430 -1798 -109 1106 2165 2415 1805 614 -693
2007 -693 -2096 -2493 -1906 -974 144 1507 2463 2500 1877 508 -350 -1754 -2158 -1675 -672 635 1985 2866
2025 2866 2814 1849 593 -715 -1976 -2212 -1589 -161 755 1896 2776 2172 1387 153 -893 -2262 -2398
2042b398Q73J106J502Q06L21j54r62j559j316m96O6N16R48J634Q72K29l91j200
2060C97j195j195n92J26P89J458R19J104K21p16j264j188j017l23n8J188J558
2077B12R42Q07J10p86j040j446q78j62O08J169R48J435N41q5r07q92j598o95k97
2096b014L84J453J316J084O23n98p71j235j447l73k05P73R84J203J067mk66j031
2114I43r15j404q95K68O00J360J206Q14M25o88j192j335j258l98J8J003J393J399
2132A344N20Q0q87j106j225j032p9J27J368R53J157N48Lo91j500o79j080k56N42
2151a893J165J340J390n4J40q18j438j082o34l3O32R95J167R27M08r7r49j181
2169a5j147p69Q0N88J382J265R01K75n80q60j423j032o00J86J139R86J030J036
$$ plain form
2042 -2398 -1525 -419 1083 1889 2210 2056 1094 -465 -1781 -2277 -2211 -1695 -747 887 1759 1988 1597 397
2060 397 -798 -1993 -2585 -2459 -1670 -212 707 1811 2032 1316 52 -1136 -2153 -2476 -2534 -1346 212
2077 212 1154 1961 2071 1285 245 -1201 -2079 -2241 -1633 -464 484 1919 2460 2375 1468 576 -1022 -1717 -2014
2096 -2014 -1630 -177 1139 2223 2846 2248 1477 242 -1205 -1578 -1783 -1010 -26 1177 2244 2240 1974 943
2114 943 28 -1376 -2271 -2003 -1403 -43 1163 1977 2402 1714 522 -813 -2071 -2469 -2451 -1448 -55 1344
2132 1344 1864 1944 1057 -49 -1274 -2306 -2385 -2258 -890 63 1220 1768 1771 1080 -420 -1099 -2179 -2435 -1893
2151 -1893 -728 612 2002 1948 2088 1270 -168 -1250 -1884 -1917 -1285 -290 877 1804 2212 2115 1166 -15
2169 -15 -1162 -1931 -1851 -1263 119 1384 2285 2560 1980 1120 -303 -1335 -1935 -1749 -610 376 1406 2442
2187B442r5n59j161j385p02p02M84Q42J179O33Q51L6n21j167j505n70l77O47P87
2206h43J351R89K57l25m72j453r59q60l2N14R92J307Q82L65j38q71j324p75r42
2225b337J70N59J077J122J116K23k85q21j458o16o72J16R66J189R05P84L1l85
2243A684q38j333q34m94L74Q85J127J139K64M65o40j317r46j118n71P16J221J026
2261H10R07M21l09o85j029r99r22P6L80R92J001J022M4r7n69j469j144n41j5Q38
2281a288R31J002R28L19n90r42j276o86p37L36O59R76J043Q44K7k35j115r10j066
2300a780n45M84R08J075J073O63n0p37q16j081o51k33J64J152J050R44M49j31
2318A938o14j142q38r39J04L36Q43J253Q14M46k97r70o92r54r61n2O50J149R39
$$ plain form
2187 2442 2347 1788 627 -758 -1460 -2162 -1678 -836 343 976 1827 1863 1342 175 -1330 -1900 -2277 -1630 -843
2206 -843 508 1497 1754 1429 957 -496 -1455 -2315 -2347 -1833 -841 466 1348 1713 1575 704 -620 -1395 -2337
2225 -2337 -2167 -1608 -531 591 1707 1930 1645 824 -634 -1250 -1922 -1806 -840 349 1254 2038 2069 1684
2243 1684 846 -487 -1321 -1815 -1441 -556 571 1710 1974 2439 1799 482 -464 -1582 -2153 -1437 -216 810
2261 810 1717 2138 1829 1144 115 -884 -1806 -1730 -1350 -358 643 1665 1709 1612 1043 -426 -1570 -2111 -2126 -1288
2281 -1288 -357 645 1573 1892 1302 360 -916 -1602 -2339 -2003 -1344 -368 675 1519 1546 1311 196 -714 -1780
2300 -1780 -2325 -1841 -933 142 1215 1878 1828 1091 275 -806 -1457 -1690 -1526 -374 676 1620 2069 1938
2318 1938 1324 182 -656 -1595 -1491 -1155 -312 941 1755 2201 1904 934 242 -712 -1673 -1725 -1075 74 1013
2337A013P77J50p8j285r00o45p10O4M65J148R30O19L56n02r99r19j218o2j22P17
2357a201R81J148P39k77l56j143j034n52l79K25R71P12J086N21N6n27j246q05
2375a081o43j47P11N51J008J143M46j86p14j305r16k75k03M80J067Q12R43L31
2393B022m31m38j243r05m54J92L39J066P46J239P9n22j099q11r56l71K54Q46N62
2412A15J237P21j74n23r76j161m29n68P0R11Q59J148K26L38p08j151r74n44o24
2431b207N24P75J090Q90N69l76q05p90j213j96k80M85Q61R40Q62L54M3p75r73
2450b22j082n43J22N50Q36J197N95K53j22r43r47j167k12M08L78J273O42N41L74
2469A931m75r30q37o32m69K61O29J140P48O49n3o88p41q09j006k86L86O43Q97
$$ plain form
2337 1013 1790 1940 1862 577 -323 -968 -1678 -1614 -1149 -1 929 1548 1904 1402 403 -516 -1734 -1796 -1918 -1201
2357 -1201 -220 928 1667 1390 1034 -109 -1143 -1695 -2074 -1849 -878 -166 920 1441 1497 970 -276 -1081
2375 -1081 -1724 -1871 -1160 -609 399 1542 1988 1802 1088 -217 -1133 -1408 -1611 -1131 -64 748 1691 2022
2393 2022 1591 1153 -90 -995 -1449 -1257 -918 148 894 2133 2212 1690 591 -220 -1176 -1547 -1293 -447 115
2412 115 1352 2073 1899 1376 400 -761 -1190 -1758 -1688 -777 82 1230 1456 1794 1086 -65 -1039 -1583 -2207
2431 -2207 -1683 -908 182 1072 1641 1265 460 -330 -1543 -1739 -2019 -1534 -673 267 1129 1483 1526 751 -222
2450 -222 -1304 -1847 -1725 -1175 -339 858 1453 1706 1584 641 -306 -1473 -1685 -1277 -899 374 1016 1557 1931
2469 1931 1456 526 -311 -943 -1412 -1151 -522 618 1366 2015 1962 1274 533 -276 -1282 -1568 -1182 -539 358
2488C58J160K99k48o12p56j200l74n18P86O67Q95P28M73k46p35q11j270k53j93
2507a850N32Q43Q59Q08J91k07q86r52r48l03J17P39R60P75R02j34n19m88r01p49
2527a211l46L4P19Q88J151M06J60p78o54j097n22k88L33P59J079P72N22j52r44
2546H31n35r98n10j62M57O36R48R36L43k49n47r94q52m33m87O58O58R69Q30L62
2566A861n06o38j046o81l58m9K08J146R18O21J26k96j043p08q18n98J36P67P77
2585a81O71J002Q9n51j027r46o44m39N17Q68N22J022O48l24m32q76q53p32K5L57
2605a284P44R19Q18P69m08o11q46q47r05K07O44M03J158N44K49k5o59o70r28n61
2625a289K3M45Q65Q77O32J78k85n02q82j034m93K98M79R77Q33L89Q9o33n23q15
$$ plain form
2488 358 1518 1817 1569 957 201 -999 -1373 -1891 -1105 -438 457 1185 1658 1412 677 -134 -1404 -1657 -1850
2507 -1850 -1318 -475 384 1192 1383 1176 290 -662 -1610 -1913 -1796 -1057 -97 678 1580 1446 927 439 -462 -1211
2527 -1211 -1557 -1523 -804 84 1235 1641 1801 1023 369 -728 -1250 -1538 -1205 -446 633 1405 1927 1775 831
2546 831 296 -702 -1212 -1374 -917 -281 667 1603 1946 1697 1150 156 -696 -1129 -1616 -958 -300 669 1499 1861
2566 1861 1355 717 -329 -1010 -1368 -1417 -1209 -63 855 1476 1602 1306 263 -445 -1263 -1861 -1725 -958 -181
2585 -181 490 1492 1581 1030 3 -943 -1587 -2026 -1509 -641 -119 903 1551 1227 795 -81 -934 -1666 -1641 -1284
2605 -1284 -540 379 1197 1966 1558 947 101 -746 -1651 -1444 -800 -397 761 1305 1554 1529 870 200 -728 -1289
2625 -1289 -1266 -821 44 921 1553 1731 1446 944 62 -972 -1465 -1167 -688 289 1122 1511 1600 967 444 -371
2645c71j109k09K54N67P70J208K37k71m34p49o04p77l40L97N07J321N16L57n9
2664A211m98q21j020m04r3N54M54Q72R74O1p7n48j043p50n41J79N28P31P21P10
2684A200L72l80o03p54q29n23L10N74L92J226M30L79n22q02p60p66k81N74L55
2703d08P49N12M63N52o89p68r61m46l49M10O35N29R94M71k27n74r17q18m15k73
2723a530M13N69Q73N87L88j15o75r40n67m33K9K30P26N89O95L04p7p66o85q48
2743a233l32K31M05N84P82P60l2k08p65o29p17k11J54N14N69Q26Q44l06l35k36
2763F65r69o47k92L32O63P58N79O69k98o20n66r47k57P3N3O52L03P65P94k91l92
2784A027j013n78n25oJ86M54J089Q49K8l09m23j165o12l59%K93R49L41Q82P1k97
$$ plain form
2645 -371 -1480 -1689 -1435 -868 -98 1110 1347 1076 642 -107 -711 -1488 -1828 -1431 -924 397 913 1270 1211
2664 1211 713 -108 -1128 -1532 -1625 -1071 -617 255 1229 1290 1213 665 -378 -1128 -1669 -1490 -962 -231 490 1200
2684 1200 1572 1192 589 -165 -994 -1517 -1207 -633 -241 985 1415 1794 1272 470 -290 -1056 -1337 -763 -408
2703 -408 341 853 1316 1868 1179 411 -550 -996 -1345 -935 -300 229 1223 1694 1467 893 -24 -842 -1257 -1530
2723 -1530 -1117 -548 325 912 1300 1185 510 -430 -997 -1430 -1401 -1171 -445 144 839 1143 1066 300 -385 -1233
2743 -1233 -1565 -1334 -929 -345 437 1197 1165 957 192 -437 -1154 -1365 -1211 -697 -128 698 1542 1236 901 665
2763 665 -304 -951 -1243 -911 -248 510 1089 1758 1460 840 274 -673 -930 -857 -804 -152 151 916 1710 1419 1027
2784 1027 14 -564 -1089 -1095 -909 -455 634 1483 1511 1202 779 -386 -998 -1357 -1357 -1064 -115 226 1108 1179 882
2805H82n18q43m73o60K49M85Q83M24O94q0l40o43q35m91l25L28O43P68O78L59
2825A185j76n26nj208n30m00O19O97N16Q50K36p5l25o90r11n49J39M06M96P79
2845E28P09O2j33j72q52p95m87r0N08R28O46O76m8k31p23q73m44o08J66M19P62
2866e2P36O44kk66p55p78p69k6N5M91O80M69P76q4n05o25m98o14j96j4O50R34
2888B51K35P02j60m22p92n66m92k40K90O40P23O58N60l93m80p12n92k01l66P14
2908f43N93N92M96J97j0p30m91q49m54L36M19P41O42O29Q2l94n08p84o33l07L7
2929a039N29Q51L99R48l16l84n03q34o11r7j59R54M77O45K72N2k93o91o60p92
2949a252J14L04K99P14N87K71L9p03n19q38k42k05M06R14M73L46M90k39n08m89
$$ plain form
2805 882 364 -479 -952 -1612 -1363 -878 5 429 1123 1043 703 60 -775 -1266 -1591 -1263 -620 148 826 1185
2825 1185 1009 483 478 -730 -1260 -1660 -1041 -344 172 1022 1258 1183 858 168 -743 -1292 -1153 -747 -251 528
2845 528 1237 1299 1166 994 142 -653 -1140 -1230 -722 206 852 1528 1480 1249 526 -347 -791 -1399 -1233 -814 -52
2866 -52 684 1328 1326 1060 305 -473 -1242 -1268 -1213 -722 -42 427 1203 1119 614 -11 -509 -1123 -1319 -1333 -683 251
2888 251 486 1188 1028 606 -186 -752 -1244 -1484 -1194 -554 169 827 1387 994 514 -198 -790 -991 -1357 -643
2908 -643 -50 542 1038 1235 1225 495 4 -845 -1299 -963 -544 197 839 1468 1550 1156 648 -136 -769 -1076 -1039
2929 -1039 -510 341 740 1688 1372 988 485 -349 -960 -1057 -1216 -262 215 860 1132 1184 891 200 -460 -1252
2949 -1252 -1138 -834 -535 179 766 1037 1076 373 -146 -984 -1226 -1431 -1025 -111 362 708 1198 959 451 -38
2969c8r50n37M04J97M79P19Q03K24k95n31q87m56k44J07P9J185N97J96J99j72
2989A079o57q00n72k76L55O07K87J005M83l06k59o81p57l97k58M92N95O27M20
3008I87J71J00m46r20k65m90j22J24M76J114K84M94o24m34o17m71o91J70M65M29
3028b66N28O27k8q7n40n90o89j82K62oQ72O28N65j34o4p54q31m87l18K37L49P06
3050b02Q46L94m1k88n79o13m11j72K84L52P40N96L12l3l27r29l09o48L31j44O92
3071a49O42N20J31l2m82p12n58l13j4M17M35Q48L67j0r5p45l56n04m72m0N48M14
3093a60N65M40M10m48n61l58j065j93K61Q39K76O85k7L87l61p85o01m22k50M24
3113i44K52N41O91K66M2l44o56n13l96k58N9Q73Q66L93J09l0j30j020m68m46j85
$$ plain form
2969 -38 -988 -1525 -1121 -924 -445 274 1077 1301 1006 475 -412 -868 -1112 -1005 -926 259 856 1052 1251 1079
2989 1079 422 -378 -950 -1226 -871 -264 23 1028 1511 1205 946 265 -492 -889 -1147 -655 -60 567 987
3008 987 1158 1258 812 -108 -373 -863 -985 -861 -385 729 1013 1507 883 449 -168 -639 -1330 -1160 -695 -266
3028 -266 262 889 861 774 234 -356 -1045 -1227 -965 -971 -99 529 1094 960 896 142 -689 -1176 -1494 -1257 -908 -202
3050 -202 644 1038 997 709 130 -483 -894 -1066 -782 -430 310 906 1218 1185 858 -71 -380 -1028 -697 -841 -149
3071 -149 493 1013 1144 1112 630 -82 -640 -953 -967 -550 -115 733 1100 1090 995 250 -106 -610 -1082 -1122 -574 -160
3093 -160 405 845 1255 807 246 -112 -1177 -1370 -1109 -270 6 691 664 1051 690 -95 -696 -1118 -1368 -944
3113 -944 -692 -151 540 806 848 504 -152 -665 -1061 -1319 -1260 -387 479 872 981 951 821 -199 -667 -1113 -1298
3134a298O71L70P04L58M76l40m86l19m92m31k06J70R96N19K76J61m6m46j003k62
3154f28o28N37M62M57J69R70p6n96p2j017k69n08M51J19O07P73Q4M32p55l43m24
3175b55q30m0L31J70Q05N68L8m1l90n34m76l45l53K41O13N40N39J52j46k46p59
3196d18m60k68q2K31O94O94O34K5j56m75o88m28k24j0L03Q45M57J99L60m23m69
3217C41l32p64j80j04P25P99L70K31m0l98k43p68l05j85K65P01M81J38Q2J35k25
3238G24n15r29j76m2K70M78P98J93K82M3q01o56k59n34J15J08M46Q86m2M82M0
3259I11n85r42l77k36K51K44L94O98M06J82k79m78l30o50l7k61M05M96R17P7K91
3280A097m30m02o27n44j12J06P57K82O64L69j53k59n73m55o00j63O56K69N56M58
$$ plain form
3134 -1298 -627 -257 447 805 1281 941 455 136 -356 -787 -993 -823 173 692 968 1129 1083 637 -366 -628
3154 -628 -1256 -719 -257 200 369 1339 1263 667 595 -422 -691 -1199 -748 -629 -22 751 835 1267 512 169 -255
3175 -255 -1085 -1125 -794 -624 181 749 787 746 356 -178 -654 -999 -1352 -1111 -498 42 581 733 587 341 -418
3196 -418 -878 -1146 -1228 -997 -303 391 1025 1050 894 419 -269 -697 -921 -931 -628 217 674 873 1233 810 341
3217 341 9 -755 -935 -1039 -314 485 855 1086 1046 648 405 -363 -668 -853 -588 113 594 732 814 949 724
3238 724 209 -720 -896 -938 -668 -190 608 801 1083 1126 325 -331 -590 -1124 -1009 -901 -455 431 389 871 911
3259 911 326 -616 -993 -1229 -978 -734 -340 358 764 946 667 189 -141 -791 -828 -1089 -684 -188 729 806 1097
3280 1097 667 265 -362 -906 -1018 -912 -155 127 791 1160 1007 748 175 -280 -880 -1043 -387 -118 438 896
3300H96J49j65j44n55p03l33r1M49L81O24K32L12%m80p03m25n65K06L46K91O32
3321C54K05M60j84p26n47l40k16L6L62J42P52M95o0k36l67p03l85l09M04K95M59
3342a09N39l9M44n63j89p49k03k07J26O06O87M08J92j6l74o44m40l51M5L01L64
3363a72O04L63K44j19m52m79m36l70j05K86O78O95M45j50J13n96m69n30l52p5
3383h77N63M57L14K78K30k35m36o59k01m34K10L52M12M26Q9O03o34n34m93m58
3403a027j95J53N55O16N55K05j81l87m44n39O5m45J02L89N81L85M18Pl60p15m92
3424g54j96l0L29M16O21K64R9L66r53n16k10j22OJ49O49L13N56k9m41j14o13k05
3446d15k43p3L19O51M29K74K57m32n06m65k56p6l12M57O30M21K70n0j46o56o14
$$ plain form
3300 896 1045 880 736 181 -522 -855 -946 -497 -116 508 740 1052 1052 572 -131 -556 -1121 -915 -569 -278 354
3321 354 559 1019 835 109 -438 -778 -994 -958 -596 -454 298 793 733 497 130 -573 -958 -1267 -863 -568 -109
3342 -109 430 391 835 272 83 -666 -869 -1076 -950 -344 343 751 943 927 553 -91 -531 -882 -837 -536 -172
3363 -172 432 795 1039 920 468 -11 -447 -817 -922 -636 42 737 1182 1032 1145 549 80 -450 -802 -877
3383 -877 -314 143 457 735 965 730 294 -365 -566 -1000 -790 -438 -26 400 489 1092 458 -76 -569 -1027
3403 -1027 -1222 -1069 -514 102 657 862 681 294 -150 -689 -624 -1069 -967 -578 3 388 806 813 453 -262 -754
3424 -754 -950 -980 -651 -235 386 650 749 1115 162 -354 -564 -686 -680 -531 118 431 987 958 517 403 -210 -415
3446 -415 -658 -731 -412 239 668 942 1199 767 261 -204 -460 -536 -848 -391 239 660 930 880 734 78 -536
3467e36L4m16M51L54J33N43M31j87j96q21l48l75J1K65M74M00L50J25l64K9p67
3488d10n67O8j1L1N25N69M71p3J11n39m72m32k53o1P42M16K54M69J26k95m38o33
3510d02k18j35J04L82N25O66L9j08k37l39o85k5l04N5M75M02N52J68L28r92j55
3531I6o48j35l1K26J28P22N82l50J51k88p13l60M7k42L29M51L36M42L7j30o5o23
3553c8l71l99k5K37M74M38L88j59m8n03l63k42m00J81M74L79L86K9R4q3n08l10
3575c69m71j6N1M59M53M26M68l14j36q17j74k50r0K89N97J53N71J53j58k95n89
3596e9m22j19J55J75K53O42L06j4l97J93p26m29k24l04N84N71K60L27J99k97l81
3617B93m13n08r0j94M63M58L84K91q2j67m74m70l03j06j2N18O00K92J66k6m11
$$ plain form
3467 -536 -502 -918 -467 -113 20 563 994 807 611 -210 -558 -933 -922 -657 -183 217 567 692 328 357 -410
3488 -410 -977 -909 -920 -889 -364 205 676 603 714 175 -297 -729 -982 -1043 -301 115 369 838 964 669 231 -402
3510 -402 -620 -755 -651 -269 256 922 961 853 616 277 -408 -433 -737 -682 -207 195 747 915 1243 251 96
3531 96 -552 -687 -718 -492 -364 358 940 590 741 453 -260 -620 -573 -815 -486 -35 301 743 780 650 585 -38
3553 -38 -409 -808 -833 -596 -122 316 704 545 497 -6 -369 -611 -1011 -830 -356 23 409 438 532 449 -59 -369
3575 -369 -840 -856 -805 -346 107 533 1001 687 551 -266 -440 -690 -780 -491 106 259 830 983 825 530 -59
3596 -59 -481 -600 -445 -270 -17 625 931 917 520 713 -13 -442 -666 -970 -386 185 445 772 971 674 293
3617 293 -120 -628 -718 -912 -449 9 393 684 602 435 -39 -509 -812 -918 -930 -412 188 480 646 620 209
3638B09k96m35k51k28L64K98M35M97J05j78j07n64k76m88J09K62L01O40J1M60
3658H68k00n51k18l86j8j83m1Q55L03L66j57K71m05n32m65q2J66J32M25L99L68
3679I15q8j35k65o36m78J13l26Q49L80J91L07O2m19o44j67k61l13L80J87N36J73
3700C61M07j54l44k44o30k60l3K47O69K97M66k56j56K4o68n02j20K27j67O81N15
3721C60N1L64k04m85m98p3k19j22J74O61M96K75P5l38k32o38j52k31J96K56M86
3742B02L30J63J32l01m01n63r3q8J42N09K38L82R9J08l53n70m14k08o5L58L13
3763h0K38M33K96m92r0l66n31l32L8N01L79K43J53L96j06n24k53p99j0KM45L83
3785g6L60L42J58l97n94N9l70j86QK35M87L91K28kj87k67m80m53lK43K82O44J64
$$ plain form
3638 209 -87 -522 -773 -1001 -637 -339 96 593 698 520 413 -151 -427 -915 -806 -544 -243 397 408 868
3658 868 668 117 -101 -487 -505 -688 -729 126 429 795 638 909 504 -28 -493 -575 -409 -277 148 547 915
3679 915 827 692 427 -209 -687 -574 -900 -51 329 520 827 889 470 -174 -341 -602 -915 -535 -348 188 361
3700 361 768 614 270 26 -604 -864 -897 -650 19 316 782 526 370 394 -274 -776 -896 -669 -836 -155 360
3721 360 411 775 571 86 -412 -485 -704 -826 -652 9 505 780 855 517 285 -353 -505 -736 -540 -284 202
3742 202 532 695 827 526 125 -438 -531 -619 -477 32 270 652 751 859 506 -64 -478 -686 -751 -393 -80
3763 -80 158 591 887 395 305 -61 -592 -924 -886 -385 -6 237 390 786 680 156 -97 -896 -906 -904 -459 -76
3785 -76 284 626 784 387 -207 -148 -518 -704 -696 -461 26 417 645 643 456 189 -291 -744 -747 -504 -222 422 586
3808E86L17j57k53o26l00l88L18J37K38M39O0K22P8j57m96j99m63R9K48M69q0
3829I2N75J2R9n12l10l44q8j45L65J73K80M14N8m2l93l78n82J4M3K70M28J78K57
3852D64K04k43l66m16m20j42K26R7O48N34lp9k54m44j04l54K7J81L93J6M37l9
3874C63J12j07k38p77j64J21O1O55J88M39NN9n51m08o5l53K49K50K74J21K69K23
3896G26j72n28j99j80k48K44O2L92M68j55J03J04l77j94o46j4o6K60N87L57K23
3917G47l43k6l12l65l59k00K11L85N49K32j69J17k36k50o73O3j60J86M03J44M04
3938C48J75Ok96m11l58k23k58N76L52K78M59L9m32n4m59k47q0k3L85K88L77K50
3960F92J25k96k18o64l2l33M83j16N07N43k28J82R7p24l16j10l16M69R9N43M6
$$ plain form
3808 586 903 746 493 -133 -433 -821 -503 -366 -128 311 371 593 671 514 18 -181 -644 -545 -297 172 92
3829 92 667 679 778 266 -44 -388 -476 -621 -256 -83 197 611 669 627 234 -144 -726 -712 -669 -399 29 207 464
3852 464 668 425 59 -357 -777 -919 -693 -596 52 586 583 504 250 -194 -298 -652 -625 -444 -51 -35 402 363
3874 363 475 368 130 -647 -811 -690 -629 26 214 653 658 717 166 -242 -307 -660 -411 -161 113 234 503 726
3896 726 554 26 -173 -353 -601 -357 -295 97 565 410 513 617 240 46 -600 -614 -680 -420 167 524 747
3917 747 404 378 66 -299 -658 -858 -647 -262 287 519 350 467 231 -19 -692 -629 -789 -603 -200 -56 348
3938 348 523 529 233 -178 -536 -759 -1017 -441 -89 189 648 687 255 201 -258 -505 -585 -608 -223 65 442 692
3960 692 817 521 303 -361 -393 -726 -243 -359 148 691 463 645 742 18 -298 -408 -724 -255 -156 387 433
3981D33K09O1j03l25n34j94j10M48O2L88J77J02L0n59q9n40K6p3J99O7M27L65
4003D67J60p5m19p24J12k06k98O17K44K32N67k27O1n11m53l00J70j04L62K83L68
4024C26L41j80L4m24m28j71j3lK74N79j15L03q8j05k60m10M7j18K6K92J31M67
4046E05L56j63k79n39j97l48K43j09M71N88M5L0n2j86l89m69m5R9l7N46K13J35
4068D18L68k64k56m84M6l63j42M95r4P92j17J66l20k09r2n93j33J22Q7M46L92
4089B65L31l44j47j8n06o2j58J47P2L66M35k2q9M6l80l89j22J27N8L03N31R7N9
4112F00j17j09m71n3k4m59L19M69J94J77K75k09m63k11m25k67K43P4N42K54K70
4133F09k1j56l87l56p1k41K22J62L40M69M2K63o95k68l03l35j28L36J03N26RK16
$$ plain form
3981 433 642 703 600 275 -259 -453 -563 -115 -53 335 512 614 644 85 -4 -544 -518 -591 -392 -325 102 467
4003 467 627 552 133 -591 -479 -685 -983 -366 -122 110 677 450 511 0 -453 -753 -583 -687 -325 -42 326
4024 326 667 487 521 97 -331 -502 -515 -518 -244 335 220 523 435 330 70 -340 -293 -411 -385 -93 38 505
4046 505 861 698 419 -120 -317 -665 -422 -531 -60 528 573 603 551 365 -24 -493 -538 -439 -476 70 283 418
4068 418 786 522 266 -218 -172 -535 -677 -182 -276 516 399 565 245 36 -56 -649 -782 -660 -573 -127 265
4089 265 596 252 105 87 -419 -481 -639 -492 -420 -54 381 359 270 316 -64 -453 -575 -448 -390 -87 444 541 600
4112 600 483 374 -97 -150 -174 -633 -314 155 349 526 801 592 129 -82 -507 -774 -531 -457 85 339 609
4133 609 588 432 45 -311 -382 -623 -401 -239 101 570 612 875 180 -88 -391 -726 -854 -518 -415 111 120 336
4155C36J53k54k31m36j91k13K02J88M64J94L32j98k42l54j08l01n8M61j42P24
4175C26K91o4l06j10j25n24p4j23M65K82K49K4J43R9m58m11k13J29j91L83J73
4196c5L90N22j88j69j63n89j00k12J83K92J58M03J86K13o31J41p27J68j78K58
4216g8j3K51L43r5m8l27R7m79k81J2K02J78L41K25L12j72m02j19m58p0J72j16
4238e25M67K46M82k28p3l82k65n15O6L17m5K46M37L28L9k03m41j54m29J00J77
4259c55K30K97Q7J52K09k52j91j63j62k80J50J28L53K14K83J1l47j35j80o62L20
4280b93O3P7O96j52K32J53l79l28o73l2j99N92L04K61R2r5K01n59Q0n00k97O1
4302f95J48K62O40J83J83j93n70k29m44M21k08L33L83R4J30n6j62l22J4m55M3
$$ plain form
4155 336 489 235 4 -432 -623 -836 -634 -446 18 212 544 346 104 -250 -358 -659 -717 -256 -398 326
4175 326 617 553 247 137 12 -512 -586 -709 -244 38 287 311 454 553 95 -316 -529 -400 -591 -208 -35
4196 -35 355 877 689 520 357 -232 -332 -544 -361 -69 89 492 678 891 260 401 -326 -158 -336 -78
4216 -78 -91 160 503 408 360 33 130 -349 -630 -618 -416 -238 103 328 640 468 66 -53 -511 -581 -409 -525
4238 -525 -58 188 670 442 369 -13 -278 -793 -727 -410 -455 -209 228 556 595 392 -49 -203 -632 -532 -355
4259 -355 -125 172 259 411 620 368 177 14 -148 -428 -278 -150 203 417 700 711 364 229 49 -613 -293
4280 -293 -230 -153 543 391 623 776 397 69 -604 -636 -835 -243 61 322 414 319 520 -39 41 -459 -756 -695
4302 -695 -547 -285 355 538 721 528 -42 -271 -715 -294 -502 -169 214 308 438 382 220 -102 -88 -543 -500
4323e00N7L74K64l0L54k0k35k14l52j92J7J41K18M33K10m5K52k27n49m31K44j59
4345c90pK90J36P58j85M8k25o84O7j59r7N82k74K03O99l45O4l34l07l46m2J48
4367d00J78K50K23K07K4j79j50l88j55l82K60M56Q5L75K9k11J14k89l95j80J89
4388c39j05L68J52M64k32jj37k49l54l3QJ96K07R2L12J05j38K5m01m14K84k15
4410d05J67K94J75L53r3K08p39o8k80p6J5L28K35K91J72o0j53j70k67l80J67j11
4432c97K98L67J20m7mn3j57n25J34j25Q2J79K44R6M24k65j51l91J53k60j37R0
4454c25J59K11J43K65n7j98k34m11r1J33j27M47J21N01Ok65k51m00J09J65o14
4475g13P03r3M63n1j15R4j32j49n09P8p1L55K50L62J02K5m48j43k8j68j10J97
$$ plain form
4323 -500 -443 -69 195 165 519 499 264 50 -302 -494 -477 -336 -118 315 525 480 732 505 -44 -475 -231 -390
4345 -390 -397 -107 29 787 602 650 425 -259 -192 -351 -448 134 -140 63 762 417 481 147 -160 -506 -548 -400
4367 -400 -222 28 251 458 482 303 153 -235 -390 -772 -512 -56 29 404 433 222 336 47 -348 -528 -339
4388 -339 -444 -76 76 540 308 307 170 -79 -433 -466 -458 -262 -55 37 349 454 316 341 -60 -474 -190 -405
4410 -405 -238 56 231 584 491 699 -40 -108 -388 -464 -449 -121 114 405 577 517 364 194 -73 -453 -286 -397
4432 -397 -99 268 388 341 337 284 127 -398 -264 -389 -307 -128 116 212 636 371 220 -171 -18 -278 -415 -325
4454 -325 -166 45 188 453 396 198 -36 -447 -538 -405 -532 -85 36 537 543 278 27 -373 -264 -99 -713
4475 -713 -10 -103 360 309 194 288 156 7 -502 -424 -495 -140 110 472 574 599 151 8 -20 -188 -298 -101
4497a01m3L28O1K75K35l24n88P0k24j13P2L97NK65L18j56k45m26mk32j6O9J87
4520a90J56K89J24Q4j95k69n45J26j27K14K04M45p8p9mr0m04k22J6K62M7K81K75
4543C20j6J19Lm33j18l21KL1J6M74K21K20m6k71j4n49Ro7J92J95p8N00j81K07
4567D15L2m74j61j01jK8K75L09J88o8k25J47m05k27k45J01J78MM15M73l03l48
4589GK86n07o9qk83L47J43N5L41k39M0p9j00m92J3J27J59M54O4l3J97j45j81n80
4613d83J07m3K73n8L52K66J84k18l68o1j71j77L3j2L54J50J47P9K8l16K18o87
4635d03j9rL62J86J71J61k4o0J04o34j0j6P5K36j69K83K20j26j91J47m86n4j46
4658d02K80j06L04L66Q8J27l26m15j54k05j25M31K50q1K18J9K29l93k75k10r6
$$ plain form
4497 -101 -144 184 245 520 755 431 -157 -87 -311 -424 -352 45 50 315 633 477 232 -194 -198 -430 -446 -377 -190
4520 -190 -34 255 379 463 268 -1 -546 -420 -547 -333 -129 316 238 159 155 65 -339 -561 -545 -283 -236 45 320
4543 320 304 423 426 -7 -125 -446 -444 -413 -397 77 298 518 472 201 187 -362 -353 -420 -228 -33 -111 389 208 415
4567 415 447 -27 -188 -289 -290 -262 13 322 510 442 217 364 -41 -268 -513 -412 -234 -230 185 658 355 7
4589 7 293 -214 -283 -291 -574 -227 -84 -29 312 73 113 34 -66 -558 -545 -418 -259 195 259 226 423 278 97 -483
4613 -483 -376 -419 -146 -204 148 414 598 380 12 -49 -220 -397 -364 -376 -22 128 275 354 382 66 284 -403
4635 -403 -422 -431 -69 117 288 449 425 365 469 -165 -175 -191 -116 120 -49 234 454 328 137 284 -202 -256 -402
4658 -402 -122 -228 76 442 530 657 331 -84 -238 -443 -568 -137 113 32 250 269 498 105 -170 -380 -476
4679d76j5j63N65J39L96j99j07J4m81J39k79O4M4K15K13K26N0k75K83l35l71J1
4701c42n5R6L14K11J88J9m1k65k34k52J62r5L16j7L08J09j71k16r9J64m67P5P6
4724b16Q4K40K55K71j01o7o06K88m38J13j29K55K19J89L23l58k19k09n15K72o4
4745d13K57oM33M2k29J83R7m18m92J86j87K50L35K23p8p0Q7J1l74k73l7O6K79
4768a28K58j51K10L08l99j09l97n4J15P5L70N2l2L90j30M4l72k26k08J33K45j57
4790a63L81J76k47M01q3l63k38l54K94p9J23M34K0J53j18j51k94m6n2j90Q6L84
4812G4J70K31JM0l32k42l52L8pL20j38N64q3K17k71k88l0k41q4n6N95j95N19q5
4836C65j21l32p9q0o0j52J03N8J52N08M6k21R5l02k82O1l14N21r4N0J99M75l27
$$ plain form
4679 -476 -491 -654 -89 50 446 247 140 154 -327 -188 -467 -403 -359 -144 69 295 345 70 353 18 -353 -342
4701 -342 -397 -301 13 224 412 431 390 125 -109 -361 -199 -294 22 5 313 422 251 35 -64 100 -367 -292 -216
4724 -216 -132 108 363 634 533 466 -140 148 -290 -177 -306 -51 168 357 680 322 103 -106 -621 -349 -413
4745 -413 -156 -162 271 313 84 267 364 -54 -546 -360 -547 -297 38 261 183 113 200 211 -163 -436 -473 -407 -128
4768 -128 130 -21 189 497 98 -11 -408 -462 -347 -272 98 150 118 508 378 422 50 -176 -384 -251 -6 -163
4790 -163 218 394 147 548 465 102 -136 -490 -196 -275 -152 282 302 455 337 186 -108 -154 -206 -396 -310 74
4812 74 244 475 476 516 184 -58 -410 -372 -379 -59 -197 367 284 501 230 -58 -88 -329 -413 -469 126 -69 450 365
4836 365 244 -88 -167 -247 -307 -459 -356 -298 -146 362 408 187 282 -20 -302 -241 -555 -34 -128 -78 121 596 269
4859B69k41P1j43l20M9K05K51J83K82l0m68J42k33l67K94k47R3L25O7K22j84j14
4881A06k0n9j78l82L47m9L98J19j16q1M9k18k77o8J14j33K98L92j43K37j30r7
4903A09k02j23m28L94k82L50L18p9M02k06j42l04o7k58J92J85K06p3K42j00L5
4924A69k15r1k77O2J69j44K10K90L30L6l38J12m00j60O3p8J63K18K10k4J55l64
4946I6l2j63Q8j29k73K03L68J63L02j18k63l80J0j88J14J42j4L51j50K23k03k5
4968A22l71k6k54J32j7M15l4K20R2O1k27k26R1qj44m2o4K78J24J83p3k72l48P1
4992c17j3K66k52J78K26K40J26l00k15j41p3N5j75J39K83J12J36J09l31r5k35
5013b77L6L4L8K44J37K76m40M66k04j24k04k91J88r1J05K03R3K16Ok76k02k84
$$ plain form
4859 269 28 99 -44 -364 -315 -110 141 324 606 576 108 250 17 -350 -56 -303 -210 115 182 404 220 106
4881 106 86 27 -151 -533 -186 -235 163 282 166 85 134 -84 -361 -429 -315 -448 -150 242 99 336 206 109
4903 109 -93 -216 -644 -250 -532 -182 136 57 459 253 111 -193 -260 -518 -326 -141 65 -8 234 134 169
4924 169 -46 -137 -414 -352 -183 -327 -117 173 503 539 201 313 -87 -247 -184 -262 -99 119 329 305 460 96
4946 96 64 -99 -11 -140 -413 -210 158 321 623 505 242 -138 -128 -316 -202 -60 -74 277 127 350 147 122
4968 122 -249 -275 -529 -397 -414 1 -33 187 279 340 113 -113 -22 -30 -174 -216 -280 -2 122 305 232 -40 -388 -317
4992 -317 -330 -64 -316 -138 88 328 454 154 -61 -202 -275 -220 -395 -256 27 139 275 384 53 -42 -277
5013 -277 -241 -207 -169 75 212 488 48 514 310 186 -18 -309 -121 -212 -107 96 189 405 411 135 -67 -351
5035c51n0J38pK43L61j7J30j78Ml77k02k34J9K31K75NM02k42k85L37k72l24k61
5058f55M71n4K90J71K2J08k13j46n2k3j66J9J61L14j18M22j96k26l27K77q1l46
5080c48K39M1L98L8r6n2J0l31n7J6k93L69K51Q0j0N6l9K0k64l08Q4Q0k09M24J36
5105B35K1J43j07l71l2k14N5K79k40J20K41MQ7o9n16M69m65m0O8J79K54Q2P0L5
5129B88m5n84N5m17N14L8k03L59J53J59P0l53k53L5m8m46K41K02M33N9J07j4k56
5152I4j05k23q2P1L63PO7K73k91j04n0q8j89J58k53J61K45L16o3J3O7l00m91K43
5176a61j02n4L47J64J42J89j58n5j41k31k67K28k49J20L04L42J70o00m8P7k66
5197b49J94j21M9R8K63MJ5J77l73k20l37L55P5j74M02L1L10l92J64l29r8j20j17
$$ plain form
5035 -351 -401 -263 -270 -27 334 317 447 269 273 -104 -306 -540 -521 -290 -15 -10 392 150 -135 202 -70 -394 -655
5058 -655 -184 -238 52 223 245 353 140 -6 -58 -81 -247 -228 -67 247 129 551 355 129 -198 79 -2 -348
5080 -348 -109 -68 330 368 272 220 230 -101 -158 -142 -435 -66 185 265 255 311 272 292 28 -280 -196 -116 -325 99 235
5105 235 256 399 292 -79 -111 -325 -270 9 -231 -111 130 134 221 152 -364 105 -360 -400 -332 -153 101 183 253 288
5129 288 243 -341 -286 -703 -189 -151 -354 5 158 317 387 34 -219 -184 -232 -678 -437 -235 198 257 364 350 94
5152 94 -11 -234 -316 -245 118 125 192 465 174 70 20 -68 -257 -99 -352 -191 54 370 307 320 387 87 -404 -161
5176 -161 -263 -317 30 194 336 525 367 312 171 -60 -327 -99 -348 -228 76 418 588 -12 -60 17 -249
5197 -249 -55 -176 -127 -29 234 238 253 430 57 -163 -500 -145 -70 -244 158 189 499 107 271 -58 -156 -276 -393
5220c93K37r8j26L36L51j15k51J27l93O4r0L16J45J19j8p0K14Rk64m53K73M4r4
5243a30k4M47l0J72j75q7j09l15J48m72O12KQ2q8M38l21J60l02k58j2o0K68M8
5266fK53J88k76j1J0j31m08L9r1L43K40j29K43N4l09j04J05k60j39j56N35Q0J64
$$ plain form
5220 -393 -156 -254 -380 -44 307 192 -59 68 -325 -261 -351 -35 110 229 211 141 355 364 100 -353 -80 -36 -130
5243 -130 -154 293 263 435 260 173 64 -251 -103 -575 37 39 121 33 471 150 310 8 -250 -262 -322 -54 -6
5266 -6 247 435 159 148 158 27 -381 -342 -433 -90 150 21 264 318 9 -95 10 -250 -389 -545 -10 70 234
$$ [...]
8191A64
##END NTUPLES=NMR FID
##END=
