##TITLE=1H_LY-BrBenz.acid1
 DMSO-d6
 8 sc, 
 6.3.2024
##JCAMPDX= 6.0         $$ Bruker NMR JCAMP-DX V2.0
##DATA TYPE= NMR FID
##DATA CLASS= NTUPLES
##ORIGIN= UXNMR, Bruker Analytische Messtechnik GmbH
##OWNER= root
$$ XWIN-NMR		Version 3.5
$$ Wed Mar  6 14:09:49 2024 Russian Standard Time (UT+4h)  she@DPX200
##.OBSERVE FREQUENCY= 200.1313
##.OBSERVE NUCLEUS= ^1H
##.DELAY= (6, 6)
##.ACQUISITION MODE= SIMULTANEOUS
##.ACQUISITION SCHEME= undefined
##.AVERAGES= 8
##.DIGITISER RES= 18
##SPECTROMETER/DATA SYSTEM= spect
##.PULSE SEQUENCE= zg30
##.SOLVENT NAME= DMSO
##.SHIFT REFERENCE= (INTERNAL, DMSO, 0, 15.7039)
##AUDIT TRAIL= $$ (NUMBER, WHEN, WHO, WHERE, WHAT)
$$ ##TITLE= Audit trail, XWIN-NMR		Version 3.5
$$ ##JCAMPDX= 5.01
$$ ##ORIGIN= Bruker BioSpin GmbH
$$ ##OWNER= she
$$ F:/spectra/data/she/nmr/H-F/1/audita.txt
$$ ##AUDIT TRAIL=  $$ (NUMBER, WHEN, WHO, WHERE, WHAT)
(   1,<2024-03-06 14:08:49.04 +0400>,<she>,<DPX200>,
      <created by zg, POWCHK disabled, PULCHK disabled
       configuration hash MD5:
       00 E9 B6 7A A2 85 ED C7 34 08 36 98 17 FE 4E 26
       data hash MD5: 16K
       51 AE 0A 26 D5 3B 06 92 F3 38 30 52 11 E7 53 68>)
$$ ##END=
$$ 
$$ hash MD5
$$ 66 9C 50 15 71 E9 13 D5 4D 95 56 62 02 7C F6 67
##$RELAX= 
##$RELAX= 
##$RELAX= 
##$RELAX= 
##$RELAX= 
##$RELAX= 
$$ Bruker specific parameters
$$ --------------------------
##$DU= <F:/spectra>
##$EXPNO= 1
##$NAME= <H-F>
##$PROCNO= 1
##$TYPE= <nmr>
##$USER= <she>
##$AMP= (0..31)
100 100 100 100 100 100 100 100 100 100 100 100 100 100 100 100 100 100 
100 100 100 100 100 100 100 100 100 100 100 100 100 100 
##$AQSEQ= 0
##$AQ_mod= 1
##$AUNM= <au_zg>
##$AUTOPOS= <>
##$BF1= 200.13
##$BF2= 200.13
##$BF3= 200.13
##$BF4= 200.13
##$BF5= 200.13
##$BF6= 200.13
##$BF7= 200.13
##$BF8= 200.13
##$BYTORDA= 1
##$CFDGTYP= 0
##$CFRGTYP= 5
##$CHEMSTR= <none>
##$CNST= (0..31)
1 1 145 1 1 1 1 1 1 1 1 1 1 1 1 1 1 1 1 1 1 1 1 1 1 1 1 1 1 1 1 1 
##$CPDPRG= <>
##$CPDPRG1= <>
##$CPDPRG2= <>
##$CPDPRG3= <>
##$CPDPRG4= <mlev>
##$CPDPRG5= <mlev>
##$CPDPRG6= <mlev>
##$CPDPRG7= <mlev>
##$CPDPRG8= <mlev>
##$CPDPRGB= <>
##$CPDPRGT= <>
##$D= (0..31)
0 1.2 0 0 0 0 0 0 0 0.06 0 0.03 0 0 0 0 0.0002 0 0 0 0 0 0 0 0 0 0 0 0 
0 0 0 
##$DATE= 1709719728
##$DBL= (0..7)
120 120 120 120 120 120 120 120 
##$DBP= (0..7)
150 150 150 150 150 150 150 150 
##$DBP07= 0
##$DBPNAM0= <>
##$DBPNAM1= <>
##$DBPNAM2= <>
##$DBPNAM3= <>
##$DBPNAM4= <>
##$DBPNAM5= <>
##$DBPNAM6= <>
##$DBPNAM7= <>
##$DBPOAL= (0..7)
0.5 0.5 0.5 0.5 0.5 0.5 0.5 0.5 
##$DBPOFFS= (0..7)
0 0 0 0 0 0 0 0 
##$DE= 6
##$DECBNUC= <off>
##$DECIM= 32
##$DECNUC= <off>
##$DECSTAT= 4
##$DIGMOD= 1
##$DIGTYP= 9
##$DL= (0..7)
0 120 120 120 120 120 120 120 
##$DP= (0..7)
150 150 150 150 150 150 150 150 
##$DP07= 0
##$DPNAME0= <>
##$DPNAME1= <>
##$DPNAME2= <>
##$DPNAME3= <>
##$DPNAME4= <>
##$DPNAME5= <>
##$DPNAME6= <>
##$DPNAME7= <>
##$DPOAL= (0..7)
0.5 0.5 0.5 0.5 0.5 0.5 0.5 0.5 
##$DPOFFS= (0..7)
0 0 0 0 0 0 0 0 
##$DQDMODE= 0
##$DR= 18
##$DS= 0
##$DSLIST= <SSSSSSSSSSSSSSS>
$$ [...]
##$SUBNAM2= <"">
##$SUBNAM3= <"">
##$SUBNAM4= <"">
##$SUBNAM5= <"">
##$SUBNAM6= <"">
##$SUBNAM7= <"">
##$SUBNAM8= <"">
##$SUBNAM9= <"">
##$SW= 18.0517328524113
##$SWIBOX= (0..15)
0 0 2 0 0 0 0 0 0 0 0 0 0 0 0 0 
##$SW_h= 3612.71676300578
##$TD= 16384
##$TD0= 1
##$TE= 0
##$TE2= 300
##$TE3= 300
##$TEG= 300
##$TL= (0..7)
0 120 120 120 120 120 120 120 
##$TP= (0..7)
150 150 150 150 150 150 150 150 
##$TP07= 0
##$TPNAME0= <>
##$TPNAME1= <>
##$TPNAME2= <>
##$TPNAME3= <>
##$TPNAME4= <>
##$TPNAME5= <>
##$TPNAME6= <>
##$TPNAME7= <>
##$TPOAL= (0..7)
0.5 0.5 0.5 0.5 0.5 0.5 0.5 0.5 
##$TPOFFS= (0..7)
0 0 0 0 0 0 0 0 
##$TUNHIN= 0
##$TUNHOUT= 0
##$TUNXOUT= 0
##$USERA1= <user>
##$USERA2= <user>
##$USERA3= <user>
##$USERA4= <user>
##$USERA5= <user>
##$V9= 5
##$VALIST= <valist>
##$VCLIST= <CCCCCCCCCCCCCCC>
##$VD= 0
##$VDLIST= <DDDDDDDDDDDDDDD>
##$VPLIST= <PPPPPPPPPPPPPPP>
##$VTLIST= <TTTTTTTTTTTTTTT>
##$WBST= 1024
##$WBSW= 4
##$XGAIN= (0..3)
0 0 0 0 
##$XL= 0
##$YL= 0
##$YMAX_a= 12466
##$YMIN_a= -12698
##$ZGOPTNS= <>
##$ZL1= 120
##$ZL2= 120
##$ZL3= 120
##$ZL4= 120
##$ABSF1= 10
##$ABSF2= 0
##$ABSG= 5
##$ABSL= 3
##$ALPHA= 0
##$AQORDER= 0
##$ASSFAC= 0
##$ASSFACI= 0
##$ASSFACX= 0
##$ASSWID= 0
##$AUNMP= <proc_1d>
##$AZFE= 0.1
##$AZFW= 0.1
##$BCFW= 1
##$BC_mod= 2
##$BYTORDP= 1
##$COROFFS= 0
##$CY= 11.3945322036743
##$DATMOD= 1
##$DC= 2
##$DFILT= <>
##$DTYPP= 0
##$F1P= 15.7292609196834
##$F2P= 12.9074282941183
##$FCOR= 0.5
##$FTSIZE= 0
##$FT_mod= 4
##$GAMMA= 1
##$GB= 0.15
##$INTBC= 1
##$INTSCL= 1
##$ISEN= 128
##$LB= 0.24
##$LEV0= 0
##$LPBIN= 0
##$MAXI= 10000
##$MC2= 0
##$MEAN= 0
##$ME_mod= 0
##$MI= 1.114404
##$NCOEF= 0
##$NC_proc= 0
##$NLEV= 6
##$NOISF1= 3.799351
##$NOISF2= 2.8
##$NSP= 1
##$NTH_PI= 0
##$NZP= 0
##$OFFSET= 15.70392
##$PC= 1
##$PHC0= -24857.02
##$PHC1= 12.38731
##$PH_mod= 1
##$PKNL= yes
##$PPARMOD= 0
##$PSCAL= 0
##$PSIGN= 0
##$REVERSE= no
##$SF= 200.130013532006
##$SI= 16384
##$SIGF1= 3
##$SIGF2= 2
##$SINO= 400
##$SIOLD= 16384
##$SREGLST= <1H.CDCl3>
##$SSB= 0
##$STSI= 0
##$STSR= 0
##$SW_p= 3612.71676300578
##$SYMM= 0
##$S_DEV= 0
##$TDeff= 0
##$TDoff= 0
##$TI= <>
##$TILT= no
##$TM1= 0
##$TM2= 0
##$TOPLEV= 0
##$USERP1= <user>
##$USERP2= <user>
##$USERP3= <user>
##$USERP4= <user>
##$USERP5= <user>
##$WDW= 1
##$XDIM= 8192
##$YMAX_p= 0
##$YMIN_p= 0
$$ End of Bruker specific parameters
$$ ---------------------------------
##NTUPLES= NMR FID
##VAR_NAME=  TIME,          FID/REAL,        FID/IMAG
##SYMBOL=    X,             R,               I
##VAR_TYPE=  INDEPENDENT,   DEPENDENT,       DEPENDENT
##VAR_FORM=  AFFN,          ASDF,            ASDF
##VAR_DIM=   8192,          8192,            8192
##UNITS=     SECONDS,       ARBITRARY UNITS, ARBITRARY UNITS
##FACTOR=    0.0002768,     1,               1
##FIRST=     0,             0,               0
##LAST=      2.2672688,     0,               0
##MIN=       0,             -12698,          0
##MAX=       2.2672688,     12466,           0
$$ Real data points
##PAGE= N=1
##DATA TABLE= (X++(R..R)), XYDATA
0@%%%%%%%%%%%%%%%%%%%%%%%%%Oj4J6j6J6j6J6j6K1k9L2l2L3m1M8m9N7o4O9p7
45d0Q5r3J04j16J25j38J54j70J86k05K27k52K81l14L50l94M51n19O06p25Q92j148
67f53J600k625R752K377p028J627p489r3o431l735O214J70K377O804N53O783p01
84I502m628J971n086l857j158o725K590J741J72O619j84K086N351k823N77k886
100C262m914K144m621k954L130p18L993P14j650O704K14k407l9l690K338p82n530
117d806K544L43L47K245k849L218K160l584J607j210l35K465l640R07J695k089
133i82K734j416j947K088k296J041O87k991L408R81p24K077j903J794Q95m939
149a493K59k71j095J019l089K065M480j082J614L88K09K181m200k166P93k915
$$ y = [0, 0, 0, 0, 0, 0, 0, 0, 0, 0, 0, 0, 0, 0, 0, 0, 0, 0, 0, 0, 0, 0, 0, 0, 0, 0, 6, -8, 8, -8, 8, -8, 8, -8, 13, -16, 16, -16, 17, -24, 24, -25, 32, -32, 37, -40, 45, -48, 56, -60, 65, -73, 81, -89, 97, -108, 119, -133, 148, -166, 184, -210, 241, -278, 328, -397, 495, -653, 947, -1678, 8074, 10451, 3423, 5050, -2439, -2532, -8963, -12698, -6484, -6314, -3937, 2867, 3420, 10203, 9502, 4874, 6845, 1759, -2098, -3256, -9981, -7391, -5650, -5478, 1141, 957, 3043, 8394, 5571, 6148, 3262, -1652, 492, -4129, -7083, -3953, -4671, -678, 36, -1614, 5090, 5304, 2897, 2858, -832, 1506, 724, -4806, -2262, -1919, -1572, 673, -2176, 1042, 3202, -382, 1225, 15, -320, 2145, -1495, -588, 1107, -982, 1752, 336, -1611, 477, -1819, -778, -91, -3082, 326, 1307, 583, 2660, 757, 2551, 3446, -1493, -1234, -1505, -2600, -1581, -4670, -2605, 1875, 793, 2407, 2795, 3004, 5185, 985, -1181, -388, -3303]
165c303J33j082l80M540J34J020K818q67J701r17l333J07l145j208J046k198J777
182c157K108R52L541o59K24K270k670j587j985k254J635k318j293L281J090K366
198A544O71p25L269q10k752m34k305K20q67k578K400J195M61K185n78J765J010
215C671k315L70j520j751Q01j846J69J043n95K720M37q02J871n71P7n16k736J277
233b16L1j878O03l27J771J328k107J360J232p16J20j971M29J332k300Q3N48NJ488
252H15j316J14J819j139L72k15j048J215r88l71J015j322R26O72r95R81o62K05
270G8J277j901Q9Q44n72O46j391K4K056j160m64M25n3J417j398j053J817m68k49
289c6k90p14J818m59j191J131k69M53R7j300J189j26q46R03q45J96N74q01R57
$$ y = [-3303, -3170, -4252, -4632, -92, 42, 1062, 3880, 3013, 4714, 3797, 464, 571, -2574, -3782, -2736, -4934, -3157, -1049, -97, 3444, 2785, 3009, 5279, 2609, 1022, -963, -3217, -1582, -3900, -5193, -1912, -822, 1544, 2215, 1490, 4759, 3949, 1197, 763, -1542, -1322, -2189, -4767, -2367, -1172, -711, 1474, 896, 2661, 3671, 1356, 1726, 206, -1545, -744, -2590, -2421, -1378, -1973, 747, 1184, 382, 2253, 1682, 1759, 1243, -1493, -216, -185, -2063, -1460, -1787, -16, 1312, -795, 565, 1797, 1081, 1201, -770, -341, 991, -1309, -1226, -678, -673, 815, -501, -387, 1432, 293, 665, 450, -598, 617, -371, -742, 273, -1049, -123, 549, -446, 535, -127, 78, 1355, -546, -457, 387, -185, 461, -930, -906, 1150, -10, -474, -49, -102, 1315, -83, -1136, 681, 213, -36, -326, -1040, 778, 319, -872, 259, -10, 443, 540, -760, 429, 303, -543, 360, -485, -289, 285, -516, 441]
308D41l39p04J393o18k78K10o72J244m42j328J217Q3k0j19j057J514L01j456M27
327b03M4N54K19j560R29Q15r18J91o41L86P90j484M21O16m22Q00m48J01Q51j015
347B6K67Q7j123M35l99p4O53q15R28J098o07L96j91J12M01j908l80O07o66R6l95
368a452P02J894n31Q6R44k15J43j426j107O24j080n91M17J48J511M07J97J515
386B186k78k89j97j406l68j049r74P65l03M00J478O88J256J19l66Q32j155j606
404b67o76r61J88m70n18J941J105N97P79M1R44n14j955l37p65q27l38o74J260
423a447J159R2J275O70K50J68j210l21n72j513J2k35lP59J78J206Q78m87N45L4
443A438n49m55j263J02L12r67K79N37N33O61o77M85P86p50l01l43J9N01r16j1
$$ y = [441, 102, -602, 791, 173, -105, 105, -567, 677, 235, -1093, 124, 207, 187, 68, -989, 525, 826, -630, -203, -159, 395, 614, -946, -17, 798, -120, 71, -570, -184, 606, -878, -457, 159, -263, 537, 89, 190, 1041, 26, 293, 380, -743, -308, -707, -781, -128, -943, -15, 1083, 476, 872, 681, 793, 1194, -714, -1094, -487, -1153, -1057, -1452, -750, 1144, 613, 699, 1643, 1428, 1571, 145, -962, -338, -1418, -2009, -1592, -1444, 67, 474, 671, 2186, 1908, 1619, 1422, 16, -352, -1401, -2375, -1610, -1913, -1513, -35, 653, 1909, 2028, 1662, 2494, 1339, -267, -943, -1904, -1716, -2186, -2704, -763, 342, 939, 1718, 1759, 2703, 2189, 234, -103, -868, -1695, -2033, -2707, -1447, -288, -196, 1079, 1749, 1999, 2167, 957, 636, 64, -1449, -1437, -1672, -1675, -916, -738, 468, 1346, 859, 1404, 1438, 889, 434, -829, -727, -415, -1382, -1103, -566, -33, 628, -49, 436, 1222, 472, 171, -172, -153, 348, -568, -579]
463e79Q06k41P0k77j07O14o86j40O60j96M13R0MO69o63l95J98p49l18l71n7R29
485c26j88K54J298K90K31l39n04K59j193j253m7j79L34P9L32J792O67M9M15k28
505A743k08j072j590j42n46n45M49M97J383R57K86J147R8o98n78j175p14q93j049
524b650N33N41L78J149Q70J219M36p86K5n12j339r95r68J62L17k91J029J309P28
543A155O18k13K43n9j445p67n04m98J0l46O73J145J74O10N52N4J4r03m18l4r41
564h80l05J55J81N72r5M58Q63k41j84k4j54j9p66k31N90k33r8J45K06N28m58k78
586b68N28j29j52j39K4N63k37l09M37o7k25k80l06M10k38k93N66K67K49J02o3
607D40M87k82p36l2k57k62k59k14P74L69o8N75M06K14k59o82O6l29q34j89o8L96
$$ y = [-579, 227, -14, 56, -221, -328, 286, -400, -540, 120, -76, 337, 427, 431, 1100, 437, 42, 240, -509, -827, -1198, -1255, -326, -514, -260, 1038, 1328, 1559, 1220, 716, 975, -218, -1471, -1518, -1697, -1363, -1284, -952, 840, 1507, 1556, 1971, 1743, 1535, 463, -1127, -1269, -1815, -2360, -1911, -1414, -31, 926, 1212, 2359, 2457, 1759, 1181, 6, -708, -1601, -2650, -2117, -1576, -1198, -49, 821, 2040, 2476, 1690, 1715, 1203, -136, -1131, -2099, -1937, -1620, -1911, -882, 427, 1155, 1773, 1560, 1803, 1744, 299, -468, -972, -1470, -1460, -1806, -1133, 12, 186, 796, 1348, 1402, 1416, 513, 95, 61, -880, -1185, -1030, -849, -277, -372, 86, 949, 708, 524, 500, 346, 327, -439, -670, -80, -313, -411, -266, -60, 468, 10, -268, 260, 131, -21, -160, -136, 427, 190, -119, 318, 251, 26, -254, -560, -150, -388, -681, -115, 152, 401, 503, 440, 927, 645, -91, -123, -380, -642, -901, -1115, -341, 28, -40, 535, 941, 1155, 896, 214, 280, -49, -883, -1072, -1140, -744]
629g44L05p4Q98O60j00M3j91j14m12j011j24O2k64J82K69P08O33k01M19K76m29
650G91m36o15j64p9o44R6N40K56L74J43M42M62n51k50k2l54l76n38N1N17j89J38
672d08N85L18K41k63p0K71n35m82p8n3J21k51Q3P19M9p3K01R1J47m94l69L06k02
695a46l33J5J51M13j34j31N22J05k19j23r2J74k86m35L03J08p9PRN08ql80K37
718A86J10j54k52k17L32k3l86K18K16J32m2j75L62J20m60n4P4Lj42l12L06K83
740A25k56L4K33K19l0l98J66J84m01j84J0J92Q8l46K34M32j25p8MJ49L9m81n8
763b48K66j74j03n0K42L34k81j4L46p3j23k36O1K43l60j82L05P4j5j46J04L59
785C29k50k24J75P6lk60n2M36j33k66J34Q2Q9l12j34L85l7j92R2K00K02k02j93
$$ y = [-744, -439, -513, 385, 1045, 945, 988, 797, 683, 271, -740, -864, -802, -1066, -884, -615, 93, 726, 525, 944, 1220, 791, 355, -260, -424, -503, -1147, -1051, -511, -255, 119, 262, 704, 1166, 615, 365, 343, -11, -387, -925, -874, -357, -546, -408, 177, 495, 736, 473, 403, 674, 139, -343, -421, -474, -353, -604, -521, 198, 247, 174, 375, 466, 613, 119, -250, 56, -146, -479, -464, -313, 100, -34, -165, 357, 462, 243, 120, 28, 202, -84, -519, -216, -108, -187, -180, -171, 337, 329, -51, 186, 296, 142, -110, -327, 5, -18, -404, -186, 30, 162, 120, -55, 307, 427, -33, -87, -13, -10, -152, -464, -158, 125, -131, -97, 136, 355, 325, -73, 93, 277, -124, -308, -298, -106, -18, -364, -130, 302, 177, 99, 103, 252, 291, -190, -248, 18, -156, -259, -309, -67, 267, -14, -28, 318, 245, 122, -114, -53, 190, -170, -352, -47, 27, 12, -134, -30, 329, 79, -145, 30, 106, 103, -157, -209, 227, 94, -172, -38, 44, 133, -179, -313, 72, 35, -157, -65, 135, 337, 135, -58]
808e8K72j6l66j29J7J87j38j55M36K53n9jQ1J87k36n01jkk49j35P3M74K25q0L55
833D34K89o0k71l44j2k29n80n0K23J68J63J67N76M14k07r0rk54m68n48q1J34j76
856h11J19N18M93L19l5J65J84m10n25l12k09k00l44K03N65K59J98L38L17J58m48
877E42l08n5l92m62k33J22L80PK12N81L09m0j53m6Km83m89M9l5k4J8K31N15P8
901C26r0K17P4j83l09k32J61j53k77J38K23J54n7k5L08J3l10n5J34O5j75j61K75
924F1J44k35r5O7R2j29l10K36K29p7PJ70K66K8l51J9M0l03k58j21J95Q5j16K95
948f1M47J09k0l9N8j06n52k85J3j27j05K7M24M73M0J60K94K5k45m87k08r7m17
971f79k62K21L27K97J15L93M55j6k91j36j96l46n16k28K25N3Q3L21M72L94k4r0
$$ y = [-58, 214, 198, -168, -297, -280, -93, -231, -386, 50, 303, 244, 243, 324, 511, 275, -226, -227, -229, -478, -613, -540, -66, 159, 79, 434, 723, 663, 392, 48, 36, -193, -773, -823, -600, -432, -269, -102, 474, 888, 681, 591, 582, 328, -140, -688, -769, -635, -811, -692, -174, 319, 638, 603, 768, 952, 542, 17, -295, -504, -704, -1048, -845, -280, -21, 177, 515, 832, 990, 542, 234, 179, -213, -675, -908, -786, -406, -399, -187, 394, 703, 663, 510, 464, 466, -17, -506, -457, -492, -516, -498, -267, 248, 326, 236, 453, 527, 344, 35, -197, -36, -189, -466, -328, -105, 49, -8, -33, 275, 288, -22, -77, 57, 122, -53, -214, 61, 205, -30, -125, -58, 34, -95, -405, -169, 60, -17, -10, 160, 426, 454, 103, 122, 162, -141, -399, -520, -325, -240, -356, -61, 386, 495, 475, 436, 494, 388, -164, -449, -436, -563, -668, -641, -217, 256, 296, 456, 750, 775, 530, 43, -165, -262, -679, -941, -720, -393, -96, 19, 412, 867, 851, 560, 424, 228, -118, -634, -862, -637, -584, -501, -180, 292, 686, 662, 572]
993E72J66k72m90l46j18ok06k1M51L78J47P5K15J90k64m21q6r1k59k51N6L48J52
1016h1l3K80L10K7j98j47M0j08l78p0R0P4j8rL44J42j19k3R4Rj88k52J30J30k16
1041a70o6J63J82p4j61J41J62j53j57Q0J61rk15R3J79q9j79qJ26L0k87M4K38N7
1065H8o8j9J76J18k11j31R8m8j55j43J47J31q2nK27J49o7j42M3J18k44k37M1R7
1089a19k8j36J35L20M2j61O8J53n8k93j49J63l2k00j9K24J81l2p0K55R9k23j27
1112gJ5N0j99j70J21J68o7k0J44K39l8k02Q8P5j62k11p7J52j6j67J26K40Q5j14
1136E3JK07j2k49j24Q0k3j79r8K27K08j15K8J89J11o5k17M2J8k36j72M0J42N4
1160i0p2J96K61j8q6j1O8j26l50p8J07o6j08J06K98J85l8J7J98m6k15k25l6m3
$$ y = [572, 738, 466, -24, -370, -488, -494, -700, -721, -270, 108, 255, 330, 545, 735, 471, 50, -36, -127, -386, -637, -581, -233, -81, -114, 166, 476, 503, 305, 158, 198, 90, -288, -358, -268, -194, -212, -221, 123, 265, 146, 123, 217, 226, 38, -214, -84, 46, -170, -236, -73, 109, 35, -126, 15, 177, 24, -133, -53, 108, 99, -116, -23, 156, 67, -112, -120, 6, 36, -251, -207, 31, 88, 20, 1, 177, 295, 84, -47, 51, 3, -152, -295, -148, -17, -99, -104, 123, 272, 205, 63, 106, 224, -20, -257, -216, -119, -147, -283, -148, 172, 214, 53, 121, 274, 216, -77, -226, -63, -95, -295, -314, -90, 91, 59, -11, 244, 343, 120, -7, 8, 58, -141, -311, -190, -22, -89, -109, 35, 274, 236, 34, 122, 197, 35, -176, -253, -101, -117, -284, -158, 82, 167, 53, 54, 261, 249, 0, -124, -44, -67, -246, -344, -117, 91, -24, 4, 193, 304, 239, 22, 64, 82, -154, -326, -286, -144, -90, -162, 34, 295, 277, 191, 180, 248, 122, -228, -306, -199, -265, -373, -267, 31, 216, 178, 195, 393, 347, 132, -93, -129, -172]
1184a72k54p0K27K09M2R8K20K00j10k11j6j01k33k64k8K02KL0K53K85J18j14j1
1207C02M7j93l37j24Rl7p9P0L25K03mL6J74K9k47k77M8o7k28j01J76K04N3j1K36
1232B07J75j05j26p8M4j62k20lJ77l1l6J11J96M3j60j0J15m8j49q8J77N1j58k7
1256a05J61L3j55j34J40R2j67l5J83J73m7n2R2J00k06k33j1J3j17j03J05L16Q2
1279A25M0J41J76l3k71j93j9j97l20j6J96J88M9K34L44J63p1j65p7j61m02l52
1301f21%R7J0R4L82M29J57j2J08m1k92m35k75n1j96q7J93L72L22J23K50K43m7
1324G23l15k87j79k45l27j11K02K16J41K39L73K48p3j94o1j47l95k83n2O2K5P3
1346c67K64L49J46o2P6K2j56l49j33Lq8j13O2L09J19l7J08J50J4j85j41K7l8j44
$$ y = [-172, -426, -496, -269, -60, -18, 80, 300, 500, 390, 179, 163, 62, -171, -435, -463, -261, -259, -229, 24, 309, 427, 313, 302, 349, 156, -181, -305, -296, -333, -412, -342, -17, 186, 182, 218, 392, 421, 174, -103, -55, -122, -350, -451, -275, -71, -18, -29, 207, 382, 277, 151, 73, 117, -45, -265, -268, -91, -122, -158, -47, 149, 192, 32, 22, 137, 89, -60, -148, 29, 80, -78, -105, 56, 89, -66, -200, -60, 32, -135, -170, 13, 186, 139, 87, 179, 279, 73, -160, -171, -158, -275, -378, -273, 43, 125, 165, 306, 482, 449, 178, -15, -34, -231, -551, -567, -371, -183, -134, 100, 444, 607, 536, 371, 294, 133, -269, -621, -621, -524, -514, -420, -38, 391, 548, 536, 644, 603, 311, -124, -399, -450, -646, -733, -540, -168, 154, 277, 527, 770, 723, 408, 121, -58, -303, -630, -741, -539, -323, -182, 57, 430, 678, 605, 411, 350, 203, -192, -475, -527, -465, -440, -367, -103, 246, 392, 330, 406, 428, 272, -77, -210, -207, -295, -408, -346, -37, 82, 45, 153, 303, 317, 132, -9, 18, -20, -164]
1370a64q2J81P2m2l1J15R4j17j34P7R3n7j15J06J71m3j38O5J1j19j90k3J63kl7
1395a46J05K28R1q2m6R3q3k88j41L8j5p0MK78K54K2N5Q9O7k26k84o1j07j67j02
1420d94J13K51J42N7K54K04r0j83j29m7k59k69p6J46O4J04J23L54K00q0m4kj18
1443B21l27k34k4J5p3P3K33K74J09J5J23N5k10k67q9o1j24j60J17K55O5L7J25
1466A48K34k9j71r4J9j52k26p5J25N2k6P3K42J39q0k2PJ7k20j60N8J2m2n4J53
1491g2J71J4n3R0O1q2j55l3N0o6j26Q0J11L3o1O6J22k4j01l9N6k1j57o0J35M5
1517a6q1K8J28N9p6n2Q3L4p9j55N6R0j12o2J41R5l9o4N7J06n5j46K5O0l4j42P0
1544h1R7Np0L3J23k5o7m1O5Qj58k4J27L0q7l5J11J04j03n5N9R6j21j23Q9J20p4
$$ y = [-164, -246, -65, 7, -35, -66, 49, 143, 26, -108, -31, 62, 5, -110, -4, 167, 124, -14, 51, 62, -57, -247, -270, -107, -109, -146, -41, 187, 278, 196, 150, 243, 160, -128, -269, -231, -246, -316, -312, -34, 220, 242, 297, 386, 453, 227, -57, -118, -225, -392, -494, -381, -130, 12, 69, 323, 527, 437, 254, 125, 78, -181, -450, -526, -380, -316, -212, -89, 265, 465, 385, 341, 339, 221, -106, -340, -364, -349, -422, -349, -116, 158, 267, 282, 405, 460, 250, -17, -106, -167, -291, -451, -334, -79, -14, 23, 148, 382, 353, 182, 88, 107, -45, -271, -346, -221, -169, -195, -122, 120, 259, 179, 157, 164, 181, -39, -199, -141, -129, -171, -225, -72, 99, 113, 60, 150, 211, 129, -26, -59, -9, -75, -201, -121, -10, 23, -38, 28, 150, 126, 25, -14, 42, 21, -136, -196, -61, -16, -97, -69, 59, 118, 42, -10, 73, 107, 28, -127, -71, 19, -93, -155, -14, 81, 42, -22, 35, 141, 86, -60, -35, 25, -9, -151, -81, 16, 21, -49, -16, 107, 82, 15, -26, 39, 47, -111, -135, -8, 22, -65, -100, 11, 115, 12, -43, 16, 112, -9, -132, -43, 77, 3]
1571Co8K0J14j9j30K3R7l0q3K1R9L0p7OR2Pj47l0O6Jj32m1J49P2o4J7J26J00j10
1600A12j24M9j1j98j05Q1J20j9j5J87J67L1r4k7Rj02k42j14M2L0n5J15K35J75
1624B47j8R3N2o3k23j60j20j10j40KJ99J91R5J44K15J15j55j86j06j26k37k25
1646e16N6J37Q7P5K46K91J19j00o3k9k18k91j88KrLJ40L01K14O5Q3L8o3k46k18
1671h4j12j08j29l0J98J83Q7J50J60J17r1j82n6j23j72j62j2J72N6pJ72K27J0
1694B64q3n7L3q5j92q0Q0M4n4OJ30Q8n8m1N5M5j03m4M3M7j0j0N0M1q3j26K6K0
1722e4q0j05J40J51ONJ11J24n6j79r7k6j43j59J7J67J11P9Q6K29J39r8j57o1j09
1747D1k58j94m3R8R1J09K20K63Q5LK2j06k04l04j40q6j20J2J87K95J83J24J62
$$ y = [3, -65, -45, 69, 50, -80, -57, 40, 10, -73, -52, 47, 77, 0, 6, 98, 105, -42, -72, -6, -5, -137, -178, -29, 43, -21, -4, 122, 222, 112, -12, 37, 26, -172, -277, -196, -76, -95, -110, 77, 244, 275, 181, 154, 163, 61, -181, -295, -253, -223, -278, -163, 72, 247, 229, 322, 374, 311, 88, -72, -192, -302, -442, -440, -241, -50, 45, 189, 404, 519, 364, 178, 72, -54, -291, -516, -460, -323, -236, -161, 85, 376, 495, 395, 332, 303, 85, -206, -394, -392, -401, -398, -258, 43, 257, 322, 405, 443, 380, 134, -84, -196, -304, -433, -463, -265, -82, 5, 155, 315, 432, 341, 159, 103, -20, -192, -354, -366, -194, -138, -145, 27, 254, 264, 181, 124, 157, 72, -120, -200, -120, -76, -130, -124, 6, 94, 36, -5, 50, 95, -8, -52, -9, 38, 28, 18, 68, 109, 26, -100, -74, -54, -134, -239, -99, 52, 58, 63, 174, 298, 242, 63, -34, -60, -203, -362, -345, -178, -67, 12, 98, 327, 466, 368, 211, 150, 41, -217, -411, -454, -356, -265, -156, 64, 327, 412, 415, 437, 331, 127, -177, -317, -403, -523, -511, -324, -29, 154, 278, 440]
1770D40J46j23k97j87j14j70k48m0K24K13J28J38K69J87q3k05r7j32k35k07o8
1791d61Q7P7R8K11K49J00j1J2o5k20j61j32l8m8m7J31K06Q4M2Q2R1l3j77p2j4
1816io4j68j2J36J22m7LJ35R6q3j11j8N7m4r9J7J19k7l0L9M9l2j10M2J3j6l5P1
1844fQ8Nl3J4K9o9j17m5O7l9p8L5J82R5o1M5Q7Lj62j42k2L1j18q7J15J70O7K5
1872G9Q6J07mj33q7n0q0j55m2R8O9K8J40R9R9n4j8l4j03j77q0L5l5rM0J76J17
1899A12J2QR0K1j48j85j1J4q6r1P1J72P0lL8J39K0j40r8lm9r0l7K6O6K8P6P3L7
1928A32j1l7K8o8j31j6K3k5n4J0J47O1j7l7J00N8q3j67L8O8o9j32M1J55J2l9J9
1955FJ33j3p3q2L8Pj08k9L6N6PkM4Q8l7l6K6j2q5m7K9J4q7K8Q6N6l3k8Q7P6j03
$$ y = [440, 586, 463, 166, -21, -135, -305, -553, -593, -369, -156, -28, 110, 379, 566, 483, 278, 181, 49, -186, -393, -461, -374, -297, -199, 12, 261, 361, 350, 362, 297, 77, -84, -216, -254, -302, -349, -218, -12, 72, 114, 196, 287, 254, 77, 5, -9, -73, -241, -253, -117, 5, -42, -39, 96, 192, 109, -2, -20, 37, -7, -106, -89, 30, 3, -27, 12, 61, 29, -81, -39, -26, -42, -77, -6, 82, 87, 54, 68, 97, 28, -89, -134, -67, -106, -184, -149, 33, 128, 67, 112, 199, 202, 40, -102, -124, -93, -211, -298, -183, -13, 54, 79, 165, 272, 268, 135, 48, -2, -82, -237, -279, -181, -112, -84, 56, 155, 254, 200, 182, 148, 45, -132, -212, -177, -212, -221, -181, -5, 112, 124, 132, 222, 243, 95, -90, -101, -87, -173, -264, -193, -21, 49, 46, 84, 223, 243, 103, 5, 2, -47, -137, -174, -148, -82, -54, 22, 95, 132, 121, 84, 112, 44, -87, -103, -80, -105, -159, -149, -2, 59, 42, 5, 105, 163, 80, -87, -49, 19, -50, -182, -141, 14, 26, -13, 6, 139, 126, 53, -29, 9, 16, -92, -121, -85, -29, -22, -24, 20, 108, 71, 35, 61, 49, -36, -83, -54, -40, -127, -99, -13, 43, 10, -18, 69, 145, 42]
1986D2j26L8O1n6j00K5J15J6n1K0R9P0r5p4K9Qo9q5N4N8k7J3M8O2J3l7JLp5p5
2016i5N1K3n2j5N9Q5p7lO1N0n4r3J6R1n6q7K6J17k1l7m5J11J9r8n5O4N3l2k7K3
2046BP4n1m6J5Ql7m5J2J7K3rP8N5k4m2M8j9j15p0J8K7l1n1R9J36L1l5K9N5j4j49
2077a1j01K9k9p6m0J18J47J9L0R3O2n9j23m4n9j16p2qJ00M6O5J22J01Oj3k9n9
2104I9j19j36p9J5j9K4P8K08Q8j2K6O0n4j44j19m5l1p5m8J64J37N2L0O4P8l9j31
2131G2n5k7j29m4%P1K5N1P9O8L4l0jl8p3r4k5j1L6l8L4J25O1o3NQ2n3o1j05R4
2161a0nl7n0J10O8n3n2K9N1l5m4j8P0L9o6L8M4pr2j2Rk1p1mN8K9mO5Q4L1o0l7
2193D7mn2j19o9P1K6m4O2J05J50j4o9M3K9j05j67l8Ml9PP9J21R4j6N6M5j1j16
$$ y = [42, -84, -46, 15, -41, -141, -116, -1, 15, -36, -16, 83, 153, 58, -16, 13, 21, -48, -133, -79, -21, -48, -35, 13, 75, 88, 51, 52, 55, -20, -95, -44, -21, -73, -88, -29, 56, -21, -24, 37, 87, 33, -60, -44, 47, -9, -96, -70, 47, 26, -11, -56, 55, 74, -24, -79, -15, 38, 6, -21, 2, 76, 25, -21, -6, 2, -35, -80, -68, -51, -28, -37, 41, 96, 72, 30, 78, 59, -56, -126, -108, -81, -112, -163, -64, 72, 103, 68, 97, 152, 138, -11, -112, -83, -112, -188, -228, -110, 37, 56, 86, 179, 241, 182, 59, 15, -44, -160, -232, -240, -140, -94, -29, 93, 194, 200, 187, 158, 99, -20, -156, -235, -220, -239, -215, -137, 71, 159, 147, 173, 233, 179, 35, -84, -129, -160, -235, -283, -119, 18, 70, 100, 164, 242, 203, 72, 17, -10, -139, -183, -183, -112, -87, -36, 43, 111, 145, 115, 114, 76, 3, -91, -116, -127, -91, -129, -95, 30, 91, 28, 33, 115, 62, 1, -104, -10, -15, -52, -102, 8, 76, 23, -29, 0, 51, 16, -28, -46, 24, 63, -3, 35, 79, 72, -20, -32, -23, -44, -115, -119, -61, -32, -36, 29, 113, 144, 84, 47, 43, -9, -128, -197, -126, -100, -144, -82, 23, 173, 159, 90, 133, 162, 57, -110, -148, -144, -183, -176, -97, 24, 118, 102, 158, 203, 192, 76]
2221G6j00n0n4p2lO2P4P4O2J20N2o9p1k6j07j10n8K9J9J4J3J67J34k5p1L7L1q7
2249F1j50n3N4l8l5M1J20R6k5%Q2m2o7n7k3ql5p6P7L6M9J3L7L3n3j5kop7j0O2
2280a1qj3m2P0P2l5o5oP1j0q7L7P6J4o1kO4j8q5jK9J2m8nO3L1knJ2Jk8k9k0ll0
2315f2k3O7PLnQ9J0l8n6RJ8p4p0J5P9Ll6J6J19N4o7l6N8o6p1l8J9K1j3M3K3N5
2347E3L0l3K7om5p1qLj0n7L9Q1J0l9M9M8%m9l2K4l1r1K8N8rl5N4R1%o0oK5Mo1
2381a9n7L4L1l3lK7Q5j3n2J5P1o5m7J6J6l0n0K3O9Nn2M1L4l6k2j6N6m0l9K5K8
2412Bj3l2jJ01J5m4k7L3K3p8mJ7K3j7m8N8K8j2l7J6N5o4j9J0J4lm2nQ6k0m9M2
2444HJ0J2n3%M2j0p1k1O6J8n3OP2Lj5m0M7L0n1m8K7K5k4n0M7O7k4k2M7Nl5n3L4
$$ y = [76, -24, -74, -128, -200, -203, -141, -67, 7, 69, 189, 241, 172, 101, 75, -32, -142, -200, -171, -152, -138, -125, 42, 176, 151, 80, 117, 148, 61, -89, -142, -88, -126, -161, -120, 0, 96, 71, 71, 153, 111, 44, -13, -36, -44, -79, -155, -78, -42, 7, 20, 57, 90, 37, 22, 20, 14, -63, -73, -11, -19, -32, -74, -4, 68, 33, -32, -38, 33, 23, -64, -27, 49, 63, 2, 0, 64, 46, -39, -40, -11, 1, -47, -52, 11, 42, 40, 35, 47, 48, 20, -9, -29, -32, -62, -85, -18, -11, -8, -13, 76, 86, 48, -8, 1, 19, -55, -125, -110, -31, -28, -64, -48, 71, 125, 58, 22, 80, 14, -57, -95, -76, -55, -68, -25, -2, 53, 83, 50, 77, 71, 26, -45, -53, -50, -60, -117, -78, 3, 13, -26, 23, 71, 71, 22, -10, 14, -17, -108, -80, -22, -31, -66, -12, 79, 79, 19, 13, 38, 42, -19, -76, -42, -11, -44, -47, -20, 65, 52, 0, 15, 86, 21, -26, -10, 6, -24, -74, -51, 18, 23, -29, 12, 46, 10, -12, -28, 28, -12, -51, -26, 2, -11, -43, -44, 57, 72, 28, 1, 34, 57, -21, -25, -8, 15, -2, -50, 8, 36, 24, -13, 3, 58, -6, -25, -15, -1, -4, -46, -51, 35, 15, -34, 8, 18, 30, -23, -23, 19, 9, -62, -83, -17, 1, -52, -46, 26, 29, 14, -26, 21, 51, 0, -48, -21, 4, -20, -70, -23, 44, 20, -2, 45, 50, 15, -38, -4]
2477dL0k7k2pM3jl1L1M3l5n2K5K1Nl7m0N8J8n4J0N6ml2j6J6L6o0j2M9O2n4j4J3
2510A4RLl1k8M2j7l0RR2rl8ORj5m6KMK9p9RN1J5J2m1O1L5l8k0Ok6o1l4M0P9l5
2545b1j4P3M0J0p6jL2j2q1j3L4Ol8O2O0J4m6L6L7k8p1m4MNm3rL9L8K1j5O9L2n9
2578D1l5j7Rn8n4J7P9nOP1O8m4l4lRl9n5NJ9%k3JP2QopM3qo3m0K8M4o0k5N6J8
2614A8jj9K2j4rm3M1Lqk7L1L4k3k5JO1m1k8nN1k3MJ4L2Ll2j5J9Km0n4M1L1rk6
2649c4N9L3l5kL7Lr3l9K7K3k4k4J3Q3k5J7PM0m4m3J3j5m3j8J0M4L0JQO6Qn1j5
2682A7J4k5p2l6N3K7J3j7P2L4k4m7L9K0n5q9K2Jnl1OJ01%j6K4N4l7l3o8O8l1l6
2714e7QL1RQpL1M9k7k8rJ2o7pM1L0m8KO1RJ2m5lL0m8k3L4J3m6rL2J5qPj1J8kn5
$$ y = [-4, 26, -1, -23, -30, 13, 12, -19, 12, 55, 20, -32, -7, 14, 19, -18, -58, 0, 18, -36, -26, 30, 26, -6, -22, -6, 30, -30, -42, 7, 69, 15, 1, 14, 23, 26, -5, -33, 9, -8, -38, -29, 63, 54, 16, 22, 31, 16, -30, -28, -24, 5, -74, -65, -14, 1, 13, -28, 33, 68, 30, 10, 16, -10, -71, -105, -65, 14, -21, -35, 38, 78, 88, 12, 11, 43, 31, -50, -63, -29, -23, -61, 1, 61, 75, 29, 65, 102, 74, 3, -41, -37, -32, -75, -84, -45, -7, 14, -1, 68, 100, 41, 6, -11, -2, -60, -114, -97, -18, -23, -17, 54, 122, 78, 44, 41, 50, 11, -44, -39, -20, -20, -43, -42, 30, 38, 32, 25, 68, 60, -3, -43, -15, 29, -31, -56, 0, 18, 17, -2, 20, 6, -3, -46, -5, -2, -10, -37, -6, 28, 5, -20, -19, 42, 1, -27, -32, 19, -4, 0, 14, 46, 49, 17, 2, 21, 23, -17, -71, -30, 1, -8, -34, 25, 58, 23, 21, 58, 61, -32, -71, -44, -21, -45, -69, -56, 27, 2, 19, 26, 66, 22, -21, -8, -23, -66, -84, -74, -30, 0, 1, 9, 75, 83, 32, 17, 31, 6, -66, -102, -49, -22, -9, -26, 46, 80, 56, 9, 48, 68, 13, -76, -54, -53, -58, -89, -83, 18, 18, 2, 26, 80, 43, 10, -58, 10, -21, -57, -49, -18, -9, -1, -8, 23, 72, 45, 17, 8, 20, -47, -54, -13, 17, -31, -29, 32, 41, 53, 8, 5, 35, -13, -36, -2, 11, -35, -44, -12, 3, -5, 2, -9, 9, 7, -48]
2751d8J9MN1m0k5M7M8p0j3K6J9lm7K6J4j7POM5l9k6kM3j4o6N1j6J2j8J2L4J8n3
2784a5KJ2Mm4MK5k7NLL4K8j6n1P4rj4n0K9J6k1k5J3M7k2j4M1L4j1m9pJ8pn0L0
2818a3K7j8m7M7M5Lo0K2J9mn7j0N8k3l8rL3L1j2qN0kl6Jl1J6k8kL2K6kl9M5M4
2852F0k6n8K8Oj7m2KJ7J4k6M8K8J2n1PL3l4k4k3J2Pk4%N6J8Jk3L1J8k2m6J4lk1
2886b8l5J0O9oNJ2O1k5m5j2Qol4RQL1m7K9N5j7Pm0J4k5k5l5K1K5k2k6M4N0j0j3
2920GL2K0m4l8kM2n0J3pK6KMK1OOj7l9M9k7p1OQ0Nl7nJ7J6J0l0poJ3k2QM6l8k
2957a3oK5j6k8J7L3k5j1lN4j8jj4N0j5k3j4j4J9k3j9K4L8QJ0KJ0o8L1pql1lOK3
2992a0j0K4K0K6kk1nrn6j0j4L3K0l3K5M5OnK6Mj6n6j3j5J0j4J1J7OM0L4J9j3k2
$$ y = [-48, -29, -25, 26, -14, -39, 8, 56, -14, -27, -1, 18, 15, -32, -6, 8, -9, -2, 4, 49, 10, -16, -18, 25, 11, -55, -4, -20, -8, -26, -14, 20, 38, -15, -13, -1, 3, -41, -37, -12, -39, -34, -31, 3, 31, 15, -36, 38, 29, 15, -35, -6, 10, -11, -36, -23, 24, 2, -12, 29, 63, 52, 3, -4, 14, 7, -43, -13, 14, -4, -51, -4, 41, 44, -16, 6, 25, 21, -36, -46, 12, -11, -49, -58, -25, 6, -6, -14, 36, 34, -2, -1, -32, -16, -44, -46, -14, 12, 10, -29, 16, 60, 34, -24, 4, 10, -7, -49, -47, -30, -16, -42, 6, 34, 46, -5, 2, 35, 1, -23, -46, -34, -27, -51, -51, 5, 23, 24, 1, 32, 50, 28, -18, -4, -7, -28, -63, -53, 16, 10, 15, 27, 88, 63, 18, 6, 14, 8, -26, -17, -9, 22, -25, 4, 59, 42, 49, 9, 23, -2, -27, -62, -41, -16, -38, -64, -20, 30, 20, 7, 39, 59, 15, -23, -25, 17, -33, -20, -27, -1, 1, 5, 26, 32, 38, 21, -18, 31, 4, -67, -61, 19, 24, -13, -18, -1, 15, 25, -5, -12, -18, -5, -27, -19, 27, -11, -13, -19, 6, -10, -38, -21, 12, -13, -24, -27, 27, 9, 8, -6, 44, 29, 6, -8, -22, -3, -26, -45, -21, 17, 25, 35, 37, 47, -21, 10, 3, -5, -36, -39, -33, -10, -20, 4, 24, 50, 48, 27, 22, 13, -43, -53, -67, -34, -14, -47, -22, 23, 29, 24, 50, 54, 38, -18, -31, -46, -36, -50, -39, -22, -16, 24, 58, 77, 64, 42]
3026D2k4l7Rk7l2L7RJ4l6P5J1oj4Lk0k3m6J8K3k8K3J7K3K0j3k9N0j0k8k4J7k0
3058b6R%ML4%j2K2Pj6n4L5J1k5j8K4K7n8J6jN6j6l9kJ9Pl6L6lJ7l9%M0nn2K1J6
3094aJ0k5LJ0K0k2K1jL5l7k1J6k6J5j4J0J3KJJ3J0nj8o1M6Lk6KJ8Nj1%L2rk8j0
3130c0j2N4m1k1J5J2oNL4K6mj3J3lj7l5kK2pk0K4K5k4LK9L0k6n6RJ8m0%Pk1N4
3165Bj3%L3Pk8QrJ1k9j5J3qQJ6QK5J8k3k5LL8m6j2K1j7j4J9J5K0l5K8%K1l0n4
3200d4M6Lm9pK9M3m2J7OL4j6l3KQk1l1K9M%jJ2L9j3j5K1L2l9j6k8L6k7qJ1L3K0
3235C5k0J2K3Rm4j8nJ2m2MK3J8n7K8K8L2j8j5l1Omk0K1J0J3m5N2kLk6M7om4nM6
3270B0jj6j8L5J1ok2j3J5NJl7K5Mk1J2J7Ppl0kNj9loK6JrN3J2ql8j6J5lm7N1j9
$$ y = [42, 18, -19, -10, -37, -69, -32, -23, -9, -45, 30, 41, 35, 21, 24, 4, -19, -65, -47, -24, -52, -29, -12, 11, 31, 18, -11, 39, 29, 1, -23, -6, -26, -17, -17, -13, 21, 21, 9, 31, 38, 22, -32, 3, 14, -11, -29, -5, 22, -36, -20, -21, 35, 19, -20, -22, -3, 4, -32, 4, 1, 18, -21, -21, 19, 14, -38, -17, -1, 9, -16, -13, -3, 17, -5, 16, 15, 50, 13, -8, 8, -18, -3, -17, -7, 6, 8, 9, 22, 32, 27, 9, -52, -6, -3, -29, -27, -9, -4, -15, -15, 17, 8, -20, -30, -42, 12, -29, -50, -35, -23, -29, -24, 10, 36, 32, 19, 32, 29, 12, -23, -25, -3, -10, -30, -6, 19, -5, -2, 27, 57, 31, -25, -16, 2, -38, -38, -31, -52, 2, -11, -11, 22, 29, 1, 9, 0, 11, -18, -33, -20, -28, -20, -4, 4, 29, 47, 24, -1, 2, 40, -6, -18, 3, -14, -28, -9, 6, 26, -9, 19, 19, 40, 10, -44, 2, 5, -44, -51, -22, 21, -21, -4, 2, 36, 20, -13, -11, -3, -24, -55, -26, -22, -22, -23, -11, 28, 15, 0, 21, 53, 14, -2, -30, 6, -21, -29, -18, 15, 35, 15, 27, 50, 59, 15, -3, -8, 4, -38, -34, -11, 7, -50, -22, 6, 38, 20, 5, -26, -20, -24, -44, -23, -13, 0, -45, 7, 5, 8, -18, 29, 23, -21, -26, 20, 19, 3, -15, 20, 31, 25, 3, -10, 5, 10, 11, -26, -1, 3, -18, -6, 11, 18, 11, -19, -21, -16, -35, -38, -44, -18, -17, -26, 27, 39, 31, -7, -23, -8, -11, -58, -7, -26]
3308b6Pk9M9K5K4j6j6nkl5qJ2lj2J1M1J2knQjl4k1Pj7rl2M0J8J9jM0MPj3l5ml9
3346d1m2PM8K6j4J5M8K1l3j2K4j7l1k1KLj5PK3L3k0j2L5K4n9j0k5j4L2k1LK7L4
3379B5m3K3J2J3k6k0J0Mo5L4K4j4J3NJ4J5j3pQj7%k1J1MK1j8L4Jj9k0L1ql3pK0
3414iLrJJ5oQj8k8M6m6K5mkK1KORmj3j3RJ0j8k8J0M9pnJ5J5k0K9m7K3k4j4kom
3453c1%J4L6KJ3j5K9j9m5l2LL7m3PO3k4lRK5J2mn1PMk2pk3N5j0MM5%k3j1J3k3
3489hk4K6k7J1J5jNL7j1%j2mJ4n8k3M6%j8PQK7nk3M5ol4j0J4J7k6MJ2K3j8JlK8
3526B9l0K0Lpk0k1L4j6K3j4k7L6Pm8nN6j4l0MJ6LMj1pJ9j8kkJ0J4j3LpJ2J6l6
3562a9L4Ml3NK8qj3Rj1M3o1L2JK1j5k4K0Qm0J3J5j6Mm5K8K2j6k7M0NPo9M4J8k2
$$ y = [-26, -19, -48, 1, 26, 50, 34, 18, 13, 11, -24, -32, -20, -23, -35, -24, 17, 29, 27, 22, 30, 29, -5, -26, -19, -36, -45, -77, -37, -19, 0, -1, 39, 43, 50, 37, 2, -2, -41, -83, -76, -28, -2, -16, -1, 47, 68, 35, 23, 47, 30, -1, -22, -20, -17, -32, -25, -2, 31, 11, -1, 34, 58, -1, -11, -36, -50, -18, -39, -36, -9, 25, -18, 5, 17, 30, 4, -16, -6, -2, -67, -33, -9, -23, -10, -5, 9, 24, 11, 4, 12, -5, -5, -26, -15, -11, 10, -8, 26, 27, 8, -12, 19, 11, -22, -29, -9, -6, -15, -14, 1, -5, 3, -15, -43, 3, -43, -18, -22, -24, -3, -1, 5, 14, 10, -3, -16, -7, 3, -15, -43, -33, 16, 9, 4, 19, 34, 14, 43, -4, 19, -5, -19, -21, -27, -31, -31, -17, 19, 21, 34, 19, 48, 29, -16, -48, -45, -8, -51, -44, 19, -5, -8, 1, 26, 38, 34, -17, -10, -6, -28, -35, -58, -3, -13, -9, 36, 36, 13, 2, 15, -8, -32, -6, -33, -22, -7, -8, -3, 34, 23, 23, 11, 7, 21, -37, -60, -14, -14, -32, -25, -17, 10, 5, -18, 27, 21, -13, -23, -9, 8, -18, -14, -2, 21, 3, 4, 1, 29, -1, 19, 22, 15, -5, -26, 8, -8, 15, 1, -26, 10, 17, -31, -36, 20, 6, -24, -20, -4, -1, 3, -8, -15, 4, -14, -16, -18, -8, 6, -7, -4, -11, 1, 17, -19, 15, 19, -14, -9, 19, 11, -2, 7, -4, 39, -22, 10, 11, 32, 17, -7, 13, 21, -19, -6, 9, -7, -3, -48, -20, 2, -14, -41, -1, 4, 11, -58, -14, 4, -18]
3597a8K3j1L2j2l9NK7ojNR%m0mL0QRl2L8j2M%k5K8l2jJ7KkJ7k3K6Mk5J7j0k1j6
3635b9K9m3K0j1j1N6j2j0K0OMrj9J5%j7l0K0J0QLL9l5L6mk3oj5nK0j2nKqM1J0
3671C5k0jjm0j0J8J5rm1L1J3j2ML9%Qj7k3J4j4j6mL1mRk0K8M2k1m5K6J1k2k8J9
3706eJ8k5K7j3RjKo0P1nl6OmL9n8J9JJ2k4L1qrM0n4L4m3K4j1M6qk3mlK7j4j6K0
3743BK8k6k8K8lnQ%j6j0J2Kj0K3l1J6L6j6M%pJ0l5qK2l1%K6oJ3%J5rN4m7n6K7
3780a8QRk0jM2J5rLK0k4j8J2k8J2l0j9J6L3m0M6J1Qk3j5J4pJ4m2J3RrqM2oj2P
3816E%K4m8QQqj4J5K9jK0k9OKJ0l8J0jK1l4K0J8j0k2OlNj8J2JK1j3m5K5J3j3j6
3853c4J4K9k8KL6omk9qK8L6l9mK3lJ0o4M5j5krL0lMQk4K4Rql3Qj6Joj1M9j7qK7
$$ y = [-18, 5, -6, 26, 14, -25, -20, 7, 1, 0, 5, 14, 14, -26, -30, 0, 8, 17, -15, 23, 11, 15, 15, -10, 18, -14, -15, 2, 4, 2, 19, -4, 22, 26, 1, 18, 8, -13, -29, 0, -43, -23, -34, -45, 11, -1, -11, 9, 15, 19, 10, -9, 6, 6, -11, -41, -21, -11, -3, 0, 39, 4, 40, 36, 13, 7, -8, -13, 7, -5, -10, -8, -16, 25, 35, 15, 14, 13, -27, -37, -19, -4, -13, -54, -23, -10, -22, -18, 21, 21, 29, 12, -11, 3, -11, -27, -31, 0, -4, 5, -15, 13, 55, 34, -11, 15, 26, 4, -24, -5, 13, -12, 15, 2, 11, 10, 12, -48, 23, 18, -18, -12, -16, 23, -35, -16, -15, -3, -27, 4, -4, -13, 27, -27, 7, -36, -12, -23, 23, 15, -8, -12, -15, 12, -2, -18, 2, 30, 4, -24, 4, 1, -4, 4, 4, -12, -22, -10, -8, -18, 5, -26, -10, 26, 10, 14, 14, 7, 17, -18, -26, -4, -35, -35, -9, -15, -2, -2, 13, 4, 58, 11, -45, -18, -10, -1, -21, -22, 20, 35, 26, 29, 49, 25, 7, 19, -9, 3, -27, -46, -30, 3, -37, 9, 20, 28, 5, -10, 4, -3, 11, -31, -18, -9, -18, -26, 16, 10, -2, 5, 5, 29, -19, -11, -3, -11, -25, -10, 19, 18, 38, 9, 15, 17, 27, -11, -1, -2, 19, -15, 5, 23, 13, -9, -3, -6, -1, -19, -7, -6, 15, 2, -43, -18, -5, -18, -34, -20, 9, -19, -17, 19, 13, 9, -20, -28, 0, 36, -3, -7, 16, 13, 23, -41, 4, -11, -13, -22, 8, 5, 9, 17, -7, 17, 26, 18, -15, -7, -23, -22, -28, -39, 10, -7, -15, 12]
3892A2%l9J7KK0k9%pK0mPj3jK7J9npl9K5%j6M%j3J5L5n1K8j1nLk7K3kjmONK3k1
3932dJ2j4J3Lj5Pl1kJ3L0l7J2NK6k2K1k4K7k5l5L7K5k5RL8pm1J8Rk9Oj2K1j5O
3967@j4jK1nj5j3K7k7j6K9K2j1l7K3N7n8J0PRk8J8JKK1j0j3pORmJ7l3lK5R%m1
4004b3J2J6J8k9J1jJ0j2j4J4l5K0lOlqKK0j8M1m7L9J5j6j6j1M1l4KKJ4j5Rl4M5
4039A8j2J1j1j4L3k8k0L0Qmm3L6Klj4J3JmMj9J6kpjKNonJJ5Mj1J9Jk0J3Mj3J4
4078A3Kk4K1qoJ3k0L3pl2K9k7pJK2Lk1J3j7Nk0K3J9nJKk9QK7j6nK3j5k5K4mJ8
4115A2k0oMN0k9Nj6J3pkk9K5K0o%rqJ3MLJ5k9j1J1k7K6kj2J8rj2J9j5KJ4nj2J7
4153El3M5k0JpJ1j3K6k5J5j8K1mj5K6l5J0L9j1j9KjQmj0J3K1l1qNkLJ0k3J1Mj9
$$ y = [12, 12, -27, -10, -8, 12, -17, -17, -24, -4, -8, -1, -14, -15, 12, 31, 26, 19, -20, 5, 5, -11, -7, -7, -20, -5, 30, -21, 7, -4, -9, -6, -33, -10, -12, -13, -17, -11, -6, 17, -4, 8, -6, 7, 10, -5, 2, -29, -31, -18, 12, -25, -13, -8, 18, -4, 17, -7, 20, -5, -40, -3, 22, -3, 6, 44, 37, -4, 14, 23, -6, 0, -12, 9, -6, 0, -14, -15, 6, 1, -14, -27, 0, -27, -43, -14, 8, -3, -40, -17, 40, -18, -8, -1, 8, -20, -2, -1, 1, 22, 12, -1, -8, -2, 7, 3, 20, -13, -16, 9, 18, 18, -23, -11, 5, 23, -6, 5, 4, 14, 2, -12, 2, -33, -13, -16, -10, -13, -21, -19, 1, -17, 24, -23, 16, 31, 15, -1, -12, 29, -5, -3, -1, 13, -2, 7, -27, 18, 6, 17, 6, -8, 25, -3, -23, 7, 15, 11, -32, 4, 6, 3, -11, 2, 3, -1, 3, -16, 0, -2, -9, -10, -8, -3, -9, -14, -13, 2, 6, -5, 14, 15, -5, 8, 12, -1, 13, 15, -9, 12, 4, -2, 11, -9, 24, 17, -15, 14, -13, -20, -19, 3, 6, -15, -2, -19, -14, -34, -11, 8, 3, 4, 6, -23, -15, 12, -4, -9, 14, -1, -26, -2, -6, 12, -8, -14, -10, 40, 11, 16, 0, 13, 6, 4, -25, 0, 20, 14, 14, 5, -3, 10, 14, 17, 32, 3, -8, 3, -24, 2, 0, -12, 6, -3, -15, 4, -11, -9, 5, 0, -12, 5, -28, 17, -3, -2, -9, 2, -11, 15, -10, 5, -13, 8, 4, -11, 15, -20, -10, 29, 18, -1, 1, 0, 8, 4, -6, 7, 28, -3, -11, -6, -8, -5, 5, -18, -7, -3, -22]
4190b2J0LK6j1k0Kj0M2J1ll9pL1j1K6k7OPOl3L9Nl9lNROk4lK2J4rj3qJ4Rk2j0
4228b1PrmnK3J4Rl6K3oj2J1j9K8j9J3kJ2k1K4oRj7J8pL0j8k1MnqMJ1Lk2rJ9L0
4266B5j4k0%Ok2j1L4koO%J2k9Pj3J4J7Olrj0K7k8n%J3K6j0j0K0%j6J3j8l7L6m
4303ejm%j7OJ0K4j8J5kMj0j0Mj5K1%j8k8O7m3J4LJ4oJ4k8J2nJ9j5%J6J8j8j9K3
4340B2k0k9L2kk0KJ6j1mJL0j8k3J7J3qk8K0J0k5K1mOjj0K8qj6K0ok8K7oj1MJ0
4376AJj7J1L4k6j4J4%LMj3MJ4j6J6j1Mmj7j3j5K9lj2M5k3L0m5PMj9NkJ4oJ4MJ1
4414A3nQk7L0k5Ol2L9K2k6LK1j7j2K0l0J7l0J4J3K5l5j8K0Poj8J3j0Mk8K8MJ3
4448Ak6rK1pNK4oj0nK9kj4rOJ9J2k1M9n1%j7LJ7k1LrK5pj6J0j3J4Lk6QJ8j6j4
$$ y = [-22, -12, -9, 17, 6, -14, -12, -22, 20, 31, 28, -11, -18, 13, 2, 28, 1, 7, 14, 20, -13, 26, 31, -8, -11, -6, 3, 9, -15, -18, 4, 18, 9, -4, -12, 2, 11, -11, -21, -14, -23, -27, -32, -9, 5, 14, -22, 1, -5, -17, -6, -25, 3, -16, -3, -5, 7, -14, 10, 4, 13, -4, 14, 7, 37, 19, -2, 2, -3, -11, -7, 4, 7, -15, -24, -5, 25, 11, -9, -9, -3, -25, -36, -2, -4, -10, -4, -4, 8, -21, -14, -27, -13, 4, 10, 7, -2, -12, 15, -13, -18, -18, -5, 21, 11, 1, 21, 21, 5, 18, 0, -37, -1, -5, -6, -10, -10, -27, -21, -11, 13, -5, 10, 8, 12, 2, -8, -4, -19, 2, 2, -16, -44, 23, -20, -6, -3, 11, 5, 19, -9, 3, -2, 17, 2, 2, 18, 36, 18, -1, 22, 2, -27, 5, 3, -17, -15, 1, -10, -14, -13, 17, -1, -24, -7, 6, -2, -30, -10, 0, -25, -4, -8, -2, -3, -13, 15, 7, -9, 11, 5, -23, 4, -2, -13, -9, 1, 2, -15, -4, 30, 4, -10, 4, 4, 7, 11, -2, 2, 16, 0, 16, 5, 9, 5, -12, -25, -40, -11, -14, -26, 19, -4, 26, -19, -12, -8, -27, -22, -24, -10, -16, -2, 2, 13, 8, 16, -11, 19, -6, 0, -32, 7, 29, 3, 6, 27, 10, -2, 18, -12, 5, -25, -11, 2, 27, -8, -26, -6, 1, -5, -23, -10, -20, -16, -44, -16, -12, 1, -25, -34, -13, -20, -15, 9, 3, -7, -12, 17, 15, 1, -8, -2, 17, 29, 8, 57, 6, 6, -11, -8, 9, -12, -9, -18, 7, 0, -16, -6, -19, -5, -2, -28, -20, -2, -18, -32]
4486c2RK3j4jJ5k6QL9l4J7olj0LL3n%jK5n7J8J8j4jmj7OK5lj2jMj5k2L7K1k9%
4524fo%%J2Qj4l0L5k1J3kJ2K7j9nj2LK5k7K0l6M9mk6L6j1j4k3K6Qj3j4J9j7J1
4559Dk4K0mNk5KJ6J1kj0P%j1M1k9j9KL6kl2L0j6PL1k0rJ2mk6k1M4Pnk0J5j8Rj3
4597a1LK6j5oK4k5J9l3NjJ0k2M1l9j8J9K0j0rMLJ0j3J1J4nJ0j9RpLL0k9NJ5k5
4633fJ6k2J4jkj7j5N0k7K0J5l5J8npk6J7lJ5qMPl3K8J2m3J2K6rJ1K2k1Qj4L2r
4669B4l2J1J3m%%j5OJ7k7J2rJ2J3j7Nl2M7k5lJkk1J6rK0j2LJ1j0rJLKJ0J3j0k
4707APK3l0Oj0M4n8J3RNJ3k1J4kj1%JLj5jPQQqj5L1k2Kk7J6rLK7l5K4j4K8k9J8
4746DLnj9J9%k6N7j7omJ2j6pPrK5jk4L5k2K6l5k1J4j1J7J0j4L0m3NL3%k8MJ0k4
$$ y = [-32, -23, 0, -14, -15, 0, -26, -18, 21, -13, 4, -2, -5, -15, -12, 21, 16, 16, 15, 40, -17, 1, 19, 5, 4, 0, -17, -11, 14, 11, -1, -2, 2, -13, -35, 2, 23, -6, -6, -12, -12, -12, 0, 8, -6, -36, -1, -22, -9, -11, 1, 28, 9, 4, -8, -5, 20, -7, 13, -23, 26, 22, -4, 32, 21, 7, -16, 10, 18, 5, -9, 10, -7, 4, -20, 0, -4, 1, -24, -22, -6, 5, 3, -7, 0, 0, -11, 30, 1, -18, -16, 20, 18, -14, 16, 0, 7, 38, 18, 9, 21, 17, -9, -30, 14, 21, 16, -4, 11, -7, 2, -11, -8, 18, 3, -3, 21, -4, 15, -18, -13, -14, -4, -26, 15, -24, -42, -23, -3, -13, -22, -18, -15, -5, -18, -7, 7, 2, 12, -7, 2, -5, -2, 28, -1, 4, 19, -6, 10, -12, 2, 1, -1, -18, -33, 17, -10, 10, 25, -10, 8, 3, -4, -30, -13, -16, -1, -9, -5, 2, -31, -3, 9, -34, -22, 4, -5, 6, 28, 7, 15, 1, 33, 24, -8, 3, 16, 12, 12, 12, -3, 3, 20, -7, 5, -4, 8, 21, 4, 9, -23, 24, -1, -4, -3, -5, -26, -10, -19, 1, -11, -8, 3, -7, -16, -15, -12, -10, 0, 13, 3, 1, 8, 31, 1, 7, -3, 41, -17, -4, 5, 10, 23, 2, 16, 14, 3, 3, 4, 7, -8, -9, -2, 6, 14, 6, -9, 22, 0, 2, -25, -9, -18, -15, 12, -23, 1, -13, 15, -14, 4, 7, 2, -17, 2, 2, -24, 33, 16, 10, 6, 18, 2, -5, 2, -7, 18, 17, -7, 28, 6, 32, -3, -24, -10, -21, -4, 6, -8, 22, -21, -16, 17, 17, -11, -7, 3, -21]
4783b1QMJ8j3j2Lkm1O3rJ2QKj7%J2J1j5Rl2J1JMK0k9J4k9J9J8j2kOj6QQj8K0j1
4821@NK2l6PJ2pLmk2N4m7J9JJ0J2k2rj8L9klj4J7jl1K3JJ7Jj6mj4J9Kk1K0k5N
4859gJj7K8oLk8K9j9JK1kj0ML3n8K8RJ2j6j4K1k4K9rj4J8nJ8J9j6j0j5j0j5j1
4894c2M5j5OoK6j8ONk5Rj4j2rL3QRj5lOj3J9j6j9L3lj7M8j7kmk4L7k2j1K1k1J8
4931A1nL0k2j1j0J5k8M5j0Jk0K1k1Rj8j3L3Jj9Opj4J2K1Mk1J6mj0K4k4K8k0K7
4965B7j7j7QML2l7L2l5PPj1KK7l7OPj1J8pMoj4K8j9mJ2k8L0k4K7j4j2OL2k5k1
5001b3M7k8K3k8J7k8J9l7O6k4QrJ2Pl5K7PJ0k5Kpj3J1nK8l5K4k5Oj1LoJ4L2k1
5036Cl9K8j1K5nKj4K0j4mk5K8J3l4K4rL0qL4m3j%KJ2Lj2rJ1nj0J4J6k5j2Rj0J
$$ y = [-21, -13, -9, 9, -4, -16, -13, -15, -56, 7, -2, 10, 18, 20, 3, 3, 15, 26, 11, 20, -12, -1, 0, 4, 24, -5, 9, -20, -1, 17, 5, 3, 9, -7, 1, 9, -9, 11, 0, 5, 27, -9, -2, 10, 3, 6, 2, -20, 34, -13, 6, 7, 17, 29, 7, -2, -20, 19, 17, 14, 0, 17, 16, -15, 8, 9, 26, 27, 11, 7, -7, 12, 14, -7, 13, -12, -7, -6, -23, 5, -1, 2, -26, 3, -16, -15, 6, 4, -6, -2, 31, -27, 1, 10, 22, 6, -8, 13, -11, 18, 9, -5, 13, 8, 26, 45, 29, 19, 4, -6, -21, -32, 13, -2, 4, -2, 24, 6, 12, 17, -8, 1, -13, -25, -34, -1, 7, 16, 1, -2, 4, -9, 10, -6, -25, 8, 5, -12, 36, 19, 17, 13, -11, 26, 4, -7, 14, -7, 11, 6, 36, 14, 3, -7, 8, -20, 25, 15, 16, -4, 17, -4, 5, -13, -26, 7, 8, -11, -5, -12, -26, -14, 7, 11, -10, 6, 2, -8, 16, -8, 20, 0, 27, 10, -7, 1, 5, 37, 0, 32, -3, 4, 11, 0, 2, 29, -8, -2, 5, -6, 12, 5, 9, 3, -11, 17, -2, -6, 6, -22, 8, -16, 11, -3, -15, -9, 23, -2, -23, 24, -4, 19, -9, 8, -20, -1, -38, 28, 4, 12, 3, 15, 22, -13, 14, 21, 31, 6, 8, 1, -12, -1, -6, 22, -13, 11, -14, -8, -19, -16, -22, -8, 24, 3, -36, -8, -19, 6, 1, 3, -11, 9, -5, -9, -34, -6, 7, -27, -3, -12, 18, 10, 44, 1, 0, 0, 2, 14, 17, 5, -4, 7, 2, -8, 6, 22, -3, -15, -6, -16, -15]
5073a5K2qj6J5%kJ2k9J5Jj2Qj7K2j2K2j0JJ2k1J8k3J1rK7k1M1k3qk1K2nJ3nk4
5108a9K6j9J9k4RMLj3L3k6mJ0j1K1j1k3K1K6l7K1pLk6LK3QpKqmM%K1j7J3Lk1J2
5146HrL2m0J5jqJ5mJ0j4Nl1J3pJ1nL8n2K0Lj3NoK1jkK2j9mLm%KKj9L3kl3kKO1
5187D5m5J1Pk2J6j4M%jj2rJ8lK1l1J2J0kok0J6j4KJ3J7rk3JPK8l4M9Nm5Ok4M4
5224A8k7K2Roj1Kj7K2Kjj0jj2J9lj9J6j3K3mlj6J7j0j4MJ9kj6JrL6rjJ6j3Rl5
5262a7K3j2J3KNj4J1MqNj0J0k2J5ll4M7k6L3m0J6K4k7lmK7k5K2Ml0Mj0M0j6j8
5297a4K5l9L4m8L9L7l2j9J0M0k7J3l1J5QjJ0j6j8L7j6QpOrJ2n3K2K6MmmjjRk3
5333hJ5oj4J1nj0J2kJ0NKoJ7jKnk4QJ0J5k1oj1K7l6J9jj2K9j3nrK4Rj4j4J8l2
$$ y = [-15, 7, -1, -17, -2, -2, -4, 8, -21, -6, -5, -17, -9, -26, -4, -16, 6, -4, -3, 9, -12, 6, -17, -6, -15, 12, -9, 32, 9, 1, -20, 2, -3, 10, 5, -19, 7, -12, 7, -17, -8, -4, -1, -14, 19, -7, -11, -1, -12, 9, -2, -25, -4, 22, -15, 6, -1, 2, -24, -21, 2, 10, 3, 5, -3, -7, -3, -3, 18, 1, 14, 17, -4, 8, -1, 31, -9, 6, 5, -3, 12, 8, 18, 4, 9, -22, -9, -16, -5, -10, 28, -24, -4, -1, -14, -9, -15, 6, 5, 3, 25, 6, 2, 5, 1, 1, 3, 5, -14, 19, 17, -16, -18, -16, 45, 0, 11, 18, -4, 12, -2, 2, 2, 1, -11, -20, -2, -5, 16, -15, -3, 7, 5, -1, -21, -5, -19, -17, -4, 13, 4, -19, -18, -11, 17, -17, 32, 37, -8, -2, -26, 18, -9, 13, 22, 16, 5, 7, -10, 12, 14, 13, 3, 2, -10, 9, 6, -13, 3, -10, 13, 9, 6, -10, 7, -3, -17, -13, 6, 4, -12, -11, -20, 16, 7, 6, 22, 9, 18, -17, 6, -6, 7, 9, 14, 0, 11, 15, 7, 12, 2, 12, -10, 5, 2, -32, 15, -11, 22, -18, -2, 22, -5, -8, -12, 15, -10, 12, 16, -14, -10, -20, 20, 4, -14, 11, -28, 6, -42, -3, 34, 2, -17, -7, 33, 6, 19, -12, 3, 11, 10, 20, 4, -14, 23, 7, 15, 8, 14, 5, 17, -36, -14, 12, 16, 12, 8, 7, 6, 15, -8, 7, 1, -13, -2, -7, -17, -5, -7, 3, 8, 10, 4, 21, 20, 22, 17, -7, 1, 11, 26, 5, -1, -12, 15, -21, -2, -3, -15, 14, 1, -4, -13, 11, 20, 6, -8, 10, -22]
5371b2%K3nrJ3k5J0K8pnrJ4rJ1onK2rkmj1KMNOj5j7M8l6J2J2k4K2J4k2j1R%Kp
5411ckKJ7l1K5j3lJ1j2Rk5K5nRj3j2L6k3M2j6j5QJ9k3J0k0PJ4Nl1K0Km1J9L1j3
5447A0pJ5rpJ6j3%J2l0K0Ml7J9qONJ3K2l0ll%qK5npK6mj3j5QpK7j9Oj3L9j4m5
5486b4QK6rnK2m1kJ3MmJ1Qj4RNMm9K9rJ5KJ1l7K9kk2K0j6K6oj0J1jK0plRqOj8
5526AJ9k6J5j3lLlJ2Ol0OL3l4J0k9lJ1JKJ6k1K9rJ2jmnK5l5%PNmJQmlJ5K6l9j0
5567a3K0j8RJ9k5L6oj5j9J3%j6L2m2RnK8j3J2lk3K9pk2K8Pk8jK1J7k9J9k5M0j7
5602A2jJ3k1J3k6J3J7Kj6Rk2LLJ5nk7J0J3LQnOl0Lk2K9j0QJ1p%j7J0k1L0k4MK4
5640Ej7K1j5j4J9J2M4o3K2j1K0k2KJ3k2QlJ0lkj8J3j9J0qPJ7MJ9l5nJ7nrj7L6
$$ y = [-22, -22, 1, -4, -13, 0, -25, -15, 13, 6, 1, -8, 6, -3, 8, 2, -3, 19, 10, 8, 4, -7, -5, -1, 4, 10, -5, -22, 26, -10, 2, 14, -10, 12, 26, 4, -7, 2, 2, 4, -3, -5, -3, 14, -17, 8, -5, -8, 3, -9, 0, -25, 0, -5, 4, -9, -21, 15, -8, 34, 18, 3, 11, 30, 7, 17, -3, 4, 18, 23, -8, 12, 14, -27, -8, 23, 10, 3, 18, 9, 2, 18, 5, 5, 17, -13, 7, 11, -26, -7, -15, -9, -4, 9, 31, 1, -2, -5, -5, -13, 12, 7, 0, 26, 22, 9, -6, 2, -5, 22, 3, 9, -4, 35, 21, -24, -16, 10, 1, -4, 18, -23, -25, -12, -8, -12, -1, 7, -7, 2, 7, 11, -38, -9, -18, -3, -1, 10, -27, 2, 0, -22, -2, -18, 8, 2, -8, 3, 2, 22, 15, 12, 21, 13, 19, 1, 20, -6, 9, -4, -7, -4, -7, 5, 11, -19, -13, 20, -14, -4, -33, -36, -25, -24, -22, -6, -27, 2, -7, 5, 4, 0, -5, 20, -15, -15, -8, -3, -7, -6, 2, -2, -5, 10, 36, -3, -13, 7, -11, -2, 17, -8, 28, 22, 7, -12, 1, 1, -15, 17, -25, -16, -21, 7, -6, 6, 3, -20, 9, 2, -20, 8, 15, -13, -14, 7, 24, -5, 14, -11, 29, 12, 11, 24, 3, 16, -10, 3, 20, 22, 6, 15, -7, -4, -1, 14, 9, -18, -8, 5, 8, 16, 11, 17, -13, -10, -32, -3, -13, -5, 6, -1, -1, -18, -8, -29, 1, -23, -19, 5, -12, 9, -6, -20, -1, 11, 55, -8, 14, 3, 23, 1, 3, 16, -6, 2, -1, 9, 6, 4, -14, -1, -20, -10, -18, -11, 6, 10, 29, -6, -11, 6, 1, -8, -25, 11]
5676A1oj0J9l6K2oj1K6Okj2J2j3K0Lj9L8k7j2oL3l8j9L6Kj6j0J4k8L8J5n2K0J
5710gj4J3mM8k7k0QJ5j0JNQLj8J3l8M1k1J7j1QoqJ9k4jJ4J1j2J3k7K0k9J1PKj8
5747a8J8Lj3RnoJ1j1j7O2n1J1j2K2Mk3L2j7L1lk6K0Jl5M8m3J0J6mK8k8lJ6k6Q
5782Ij5M6m8nJK2j9QJ8rk3JNoL1j7j3J0K9ll1J2K0k6oJ7Ok1j2K7OJk6J8j7NpL0
5820A8j1K3Kj0l9K9nJ7k4oOJ5qK5m2mK2mloj3pRL7j9kj8J4j2JK1k1J5J9lk2J1
5857Em2K0J7moL8m3K7Noj3j0KJ1j2J3qJ3qjOj8mJ4J9l4Nj3K9J2Nl3mjK1QNmPj1
5897Gj7L7k0Kj5j7L4jj1j6K7K0k0J8j4k6L1k9J2pj5RnMj1J9J4l2J8J0j0Jj2J9
5931Dk9L9Qnm3QK7jOK6n1OJ2%J3l3j9M2j9L3l2J1J7j6Pj1Lj9Oj4J3Nj2Mk4K3K0
$$ y = [11, 5, -5, 14, -22, 0, -6, -17, 9, 15, 13, 1, 13, 0, 20, 23, 4, 42, 15, 3, -3, 30, -8, -27, 9, 11, -5, -15, -1, -29, 9, 24, -28, -8, -7, -21, -8, -12, 36, 9, -11, -3, 12, 2, 3, 8, 16, 19, 1, 14, -24, 17, -4, 13, 2, 10, 4, -4, 15, -9, -10, 4, 15, 3, 16, -11, 9, -20, -9, -2, 0, -18, 0, 3, -10, -1, -6, -12, -1, -12, -29, 33, -18, -7, -19, 3, 7, -16, 16, -1, 30, 27, 1, 21, 22, -13, 35, -8, 2, 18, 14, 42, 14, 11, 27, 1, 9, -6, 40, -8, -13, -12, 10, -9, -1, 17, 8, -15, -14, -9, -15, 16, -1, -14, -4, 25, 22, -9, 3, 23, -3, -9, 8, 14, -7, -19, 8, 14, 15, -11, 7, -10, -5, -12, 18, 7, 30, 32, 22, -17, 12, 7, 24, 0, -6, 0, 15, 7, 32, -10, -14, 8, 4, 1, -5, -18, -25, -16, 21, 2, 0, -18, -4, -16, -15, 6, -15, 0, 19, 16, -6, 5, -37, -17, 0, -4, -10, 28, -15, 12, 17, 11, -2, -12, -10, 1, -11, 2, -6, 7, -1, -2, 4, -14, -18, -4, 15, -19, -14, -27, 2, 14, 19, -14, -18, -19, 2, 10, 15, 11, 18, 7, -10, 27, 7, 9, -6, -23, 11, 10, -1, -17, 10, 30, 10, 28, 14, -12, 19, -10, 2, -5, -20, -11, -16, -12, -23, -4, 10, -22, -4, 6, -4, -3, -15, 4, -25, 14, 22, 17, -26, -18, 9, 8, 14, 40, -11, -5, 7, 7, 20, -13, -32, 10, -9, 24, -8, 3, 20, 4, 11, 0, 3, -16, -10, -24, -11, -6, -18, -14, -38, -15, 5]
5968Ej2nj4%J8NMoomJ6jKj5j6L5%Pj5LLmJj0K9j6j4K0kJJ5l1RqjmK1j3lL6n5P
6010a8L5k2K5j1j0Kk0M2m1J7J2nj0NRj5J2j3L3l0%oMK5jk7K9mPoqj2J7k9RL3l9
6047a1mJ3pL5l1Pk2J2J3j4J1MRl4K0oj2MJ4jJJ6j4k2J3pj3QJ7lJ0j8mK4nQj3j
6085cj8J0J0Rj7j7RJ6jj0Nl2K8lJ2Jj9K3kJ4l4RJ0j5L4j9jj5J9K6l5omJ6%Kl1
6122b9L2jJ4k9j0K1Prj2k3M9k0K7m6J6J3k4K6MNkJ5k2J0LoLrOPmPk0oPQNl3J1
6161iJ4Orj4M7k0MRk8Pj3rj0M7m0L1j8K2j0m%j7pNLRLk0%J3KJ6j4nK3k1J5K0q
6200B0Ml4K6nj5J4k6K2Lk7K3nkj0kJ4J1n0M1j9j2K9J0l5j9J4K4k7L4QpJ7m6L6
6234Ij8j0j6L0j9N1k6K5l9M7j6j1kPj1nJ3j6J5j9J5Kl2K1NQm6K7L1j4k7L8m8N
$$ y = [5, -7, -12, -26, -26, -8, -3, 1, -5, -11, -15, 1, 0, 2, -13, -29, 6, 6, 13, -2, 1, 4, 0, 1, -9, 20, 4, -10, 10, 8, 9, 24, -7, 2, -6, -7, -11, 10, -3, -6, 30, -25, -18, 17, -5, 20, 9, -1, 1, -19, 23, -18, -1, 11, 6, -4, 1, 10, -5, 7, -6, 27, -3, -3, -9, -5, 20, 19, -8, 21, 17, 24, 18, 10, -2, 15, -14, -5, 28, -11, -15, -2, -9, 26, -5, 2, -20, -8, 5, -9, 2, 6, 15, -19, 1, -5, -17, -13, 1, 0, 1, 17, 3, -19, -6, -13, -26, -18, -1, -4, 6, -12, -16, 8, 3, 11, -2, -3, -21, -11, -1, 8, -9, -26, -17, -1, -2, -12, -7, -39, -11, -14, -2, -1, -20, 3, 1, 15, -19, -10, 0, -15, 19, 0, -1, -16, 3, 29, -6, -12, -16, 0, 0, 2, -29, 3, 2, 16, -13, -23, -2, 5, -4, -16, -39, 10, -10, 17, -29, -13, 0, -24, 2, 6, 11, 9, 24, 2, 12, 15, 9, 12, 3, 9, 16, 12, 19, -1, -7, 0, 8, 13, -20, -9, 5, 11, 2, -12, 35, 15, 19, 28, 0, 7, -6, -15, -25, 22, -18, 13, -5, 17, 7, 3, 3, -14, -21, -16, -13, -4, -1, -21, -21, -8, -6, 10, -4, -9, 14, -7, 8, 28, 20, 24, -10, 16, 11, -4, 10, -16, 6, 9, -18, 5, 0, -2, -12, -14, 0, 11, -39, 2, -17, -29, 0, 10, -25, -44, -30, -6, -33, 1, 9, 2, 19, -27, 9, -9, -19, -35, -5, -24, 27, 1, 26, -13, 34, 18, 7, 5, 12, 1, -4, 9, -7, 8, -11, 4, 6, -26, -5, 0, 8, -38, -11, 20, 6, -21, 17, -31, -26]
6268b6K6j9J4lRj0NK0k0J2Jj6K2j0j7nK8mj8K4j4k4NK8j2J5NJ1j0k5kK4Pj9J7
6303A9rk2rJ5oLlJ2j8K3qK1j1k3JJ8L6m5nL5ll2MM1m3lL8k2rJ6j4j4LMJ4kJ0%
6341A2k2J7k3PnoK9l3J0QPLk0J4qJ3mrONj4J6Kl0K4NK2l0K0k8mM8m8J8k8J7mL
6379a0NJ6pk3L2pjk4J3j3J2j6K8J4k9J9Kj5J3j5j8K1j7M9l0Pj0MJ1j1J7l9M0j1
6413Gj4NKJ8Kj3npoJ7%JQn0J0N8n7J2j8L0MJk3nPJ1kOmj5J1OOj9K1nNj9M2j8K
6454A2krJ8J3k9qpNjK8j5jJ0Mm2M6l1J0nj3K9k2lM4j1n1K6pJ5K2k4mJ3k5J2J1
6490Hl1M1oj6J9j2j0J7JjqMJ0j7J0j8K1k2KrL1Kj5rj5kRKK1j3n%Pk5K0J6j4K2
6528A5j0Qk1j6J9oNK4Mj9mpJ9k5J4j3K0pk6L3J1l7RkJ8l3K5j8QRrJ9Ml8J5J1k6
$$ y = [-26, 0, -19, -5, -8, 1, -9, -4, 16, -4, 8, 9, -7, 15, 5, -12, -17, 11, 7, -11, 13, -1, -25, -20, 8, -4, 11, 16, 27, 17, -8, -10, 14, 21, 2, 19, 10, -12, -21, -6, -12, -9, -12, 0, -18, 5, -3, 18, 7, -16, -15, 3, 39, -6, -11, 24, 21, -11, -7, 34, -9, -12, 26, 4, -5, 11, -3, -17, -14, -10, 4, 2, 12, 12, -10, 7, -16, -9, -14, -20, 9, -24, -14, -6, 1, 4, -16, -2, -10, 3, -1, -10, -4, 1, -13, 3, 5, -25, -1, 4, 26, -4, 16, -12, -16, 32, -16, 2, -26, -9, -13, -10, -5, 11, 4, -19, 13, 6, 5, -19, -6, -19, -7, -23, 5, 19, -10, 9, 11, -4, 9, -6, -24, -3, -20, 29, -1, 6, -4, 0, 11, 0, 17, -22, 18, 7, -7, -2, 0, 18, 20, 7, 2, -5, -11, 6, 6, 7, 15, -35, -25, 33, -24, -12, -30, 0, 4, 5, -18, -23, -16, -5, -7, -1, -5, -20, -9, -3, 3, -16, 5, 0, 5, -14, 28, 10, 12, 10, 1, 19, 32, 3, -5, -12, -7, -8, 20, 5, 4, 14, 18, -24, 22, -9, 1, -4, -17, 12, -10, -13, 31, 20, -31, -5, -12, 3, 25, 1, -3, 10, -15, -3, 8, -23, 18, 12, -4, 15, 3, -7, 10, 11, 10, 2, 6, 16, -1, 9, -9, 12, -10, -8, -17, 14, 16, 1, -8, -23, -25, -16, -14, 7, -6, -11, -11, -4, -29, -9, 7, -7, 15, 5, 13, -8, -24, -5, -11, -6, 18, 22, 3, -1, -8, 11, -14, 0, -13, 7, 0, -26, 7, 18, -19, -10, -12, 6, -27, -2, -20, -12, -3, -12, 7, 11, -27, -12, -1, -27]
6565b7J3j4M1k6K6k6L2k4Qj4OK0pj4J2Rj6lPqjj0L2k0NJ2l7J5kKk8L4qK9k3jJ2
6602FqmRMk1pOmJ2K5no%K0j1rj6mJ4J4l1J4PrK6k1oL3j2k1Pk0K0%Lk2J5k5K0M
6642cj7J5oJ5lk0Kj2K1oRNrJ5klpoL0jl6K4l0M2l4j7L4J2jj1%K9k2J4Kk9J0j7
6680a3%JOk3M1l4KK9kj6j7L4oqjj9qK6J1J8j8j9J9%Nk2J0mJ7j3J7k4MJ5Nl5NL3
6718A6k0J1kJJ2k4J6k2lJ0j1oK6j3l3L2L0k0oJ2k6K0q%rM3k8kqJ1j9J8jPKmnJ1
6756HkJ2l6J0j5K7J8l5LJ4j7mK2qpPMk2J9j2K0PkMk0rK4qJ7j2ooRl1K7kPqK7m8
6796b4J7J6j5rj3M3Jrj0Oj1OJj7pJ1j5J0J6Nlj9L5Nj7%pl2K0K0rJ1k9L2j0l7K3
6833a5K4MRk8K9l3rJ5J6oOqj1RJ3j9K0Rk0l6JpL0Pj7QJ7qlnqlJ3J6lj6k2K1nK1
$$ y = [-27, -14, -28, 13, -13, 13, -13, 19, -5, 3, -11, -5, 15, 8, -6, 6, 15, -1, -4, 3, -5, -6, -16, 16, -4, 1, 13, -24, -9, -11, -9, -37, -3, -11, 18, -5, -6, 6, -2, -6, 3, 7, -14, -21, -15, -19, -7, 18, 13, 7, 7, 27, 16, 7, -9, -13, 1, 15, -16, -2, 5, -4, 22, 1, -5, 28, 16, -5, 2, -18, 2, 2, 5, -17, -2, -27, -7, -3, -20, -5, -11, 4, 1, -19, -17, -29, -8, -14, -5, 0, -9, 6, 4, 1, -6, -12, 18, 17, -19, 5, -25, 17, -17, -34, 0, 12, 11, 0, 0, 29, 7, 21, 23, -6, 4, -13, -13, -12, -6, -29, 12, -22, -20, 9, 7, -9, -26, 8, 2, -6, -7, -26, -34, -8, 3, 21, 3, -16, 3, 3, 8, -14, -4, -8, 9, -4, 13, -11, -7, 8, 13, -22, -17, 16, -4, 7, 5, 6, 18, -6, 10, -12, -15, -5, -16, -22, 4, -9, -42, -10, 20, 0, -6, 6, -20, 0, -8, -8, -17, 26, -2, -4, -12, -1, -20, -2, -3, 4, 6, 2, -3, 8, 6, 18, -18, -8, -23, 4, 22, -13, -10, 4, -13, -17, 5, -3, -10, -3, 1, -21, -2, -14, 6, 13, 11, 15, -5, -14, 10, 2, 19, 7, 1, -5, 4, -27, 0, -2, 5, -3, 24, -24, -7, 9, -6, -15, -28, 15, 16, 7, -3, 3, -8, -2, -1, -18, -25, -14, -29, -19, -3, 2, -1, -20, 15, 20, 3, 3, -4, -36, -16, 4, -5, 6, -23, 9, -1, -38, -15, 9, 13, 22, -6, 23, -10, -19, -4, 12, 6, 12, 4, -7, 2, 15, -4, 16, 25, 5, -31, -30, -37, -7, 0, -17, -9, 8, 0, -3, -8, -16, -19, -6, 10, 7, -9, -31, -10, -15, 6]
6873FLnkj0LK6k5R%j3K1r%j0lJ8LLlPl8K2pj2M1l5LOPrk0M1k2qqMMOJ6ojj1j3
6916b1M2j7pK3j5J7j1j1kNk8K1J0j2OJk8QJ3J6k4PK2k0Qj0j2J3j1L0l3QK6l7J0
6951a3m%L5l9J6PpJ5j4j8K3J3mk7J9K6j6j3pK2k7J9j3%J2KKRl1K2j2j9J5J9jk1
6987a0j3M6l0Kj5MJ7K0m8K3JrL9l1j2J2Oj6lL5j8pj9L8j3rJj8K6k9K9Rj1K0k0
7022cj2Kk1K3J7k8K5J3l5pJ8J4qj1J3j3MRKmj6KjkK6k6J2K3rMKl7L1qNK3k7j5
7060a5K1RNj4k4J5j5J9Lj7NJ1j3Rj3L2j1ql0RK3%mjpJ5NJ0Mj2j6J0l2K0JK1j1
7097DORj9jMk0o%J1LqL5k7LJ1pnnLQk0J0k7J2K1J1j5oM6m1j9L5MQl9L2j3lK1k3
7137gJ7k0L0rn8L3J0kmJ0ROj9Pj6J6nk3L0Kk4OK8l2J2Lk7J4J0mkJ0OPj3qm0L5
$$ y = [6, 9, 4, 2, -8, -5, 21, -4, 5, 5, -8, 13, 4, 4, -6, -9, 9, 12, 15, 12, 19, -19, 3, -4, -16, 25, -10, -7, -1, 6, -3, -23, 18, -4, -12, -20, -16, -12, -6, 10, 4, 3, -8, -21, 21, 4, -3, 20, 5, 22, 11, 0, -2, 3, -25, -4, 6, -6, 0, 1, -27, -19, -6, 10, -14, -7, 15, -5, 3, -7, -19, -6, -17, 13, -20, -12, 14, -23, -13, -17, -17, 18, -21, -5, 2, -5, 10, -4, -22, 1, 14, 10, -17, 2, 28, 12, -1, -8, 14, -13, 6, -7, -7, 5, 7, 9, 18, -13, 9, -3, -22, -7, 12, 11, -10, -23, 23, -7, -5, -20, -16, 1, 21, -27, -4, -3, -12, 27, -4, -16, -4, 2, -14, -17, 18, 0, -7, -26, 12, -1, -10, -9, -27, -1, -30, -1, 8, -3, 17, -3, -15, -13, -34, -11, 6, -22, 3, 16, -19, -26, -8, 6, -2, -13, 0, -13, -9, 0, 2, -2, -18, -16, -17, -19, 7, -19, -7, 16, 7, 11, 13, -24, 7, -1, 4, 27, 0, -15, 6, 15, 20, 6, -18, -3, -18, 1, 4, -13, -8, 3, -10, -1, -14, 18, 7, -1, -31, -22, 1, 1, -3, -4, -11, 4, 9, 19, 23, 11, -5, 5, -27, -7, -6, 15, 4, 10, 19, 0, -1, 3, -17, -23, -23, -12, -9, -17, 18, -9, -6, 5, -2, -7, -12, -9, -1, -21, -11, -38, -26, -5, 6, -9, -15, 31, -10, -29, 6, 10, 18, -21, 11, -2, -5, 16, -7, 10, -10, 20, 11, -47, -14, -4, -6, -10, 0, 9, 15, -4, 3, -13, 3, -2, -25, 5, 7, -17, -11, 17, -15, -3, 0, -27, -13, -3, -7, -9, 1, 7, 14, 1, -7, -47, -12]
7175a2JlK7j3M0j0l3K0Ol6NK0j4PJ5l9J7J0jQk6KJ0Kl6L1j5J4mQPRj0j1m%J0j6
7213a4L8k7J7%pj3pJK0oRjJ4mk2J9j3OnkjLK%j9J1Jk1J3j3NK5l1K0rM6n2RRj0
7253il9L1J1K1j0kOj0P%mj4M0j3J9m4j2M3j5j8K0pqjnLL1ok2K7m3J0J4pj2J1p
7290a4J4K%Lj2Mk3M8jQj4l0JJ4j7L5j0K0j4k8M2k9J4j9J9j5j8J8jnJ9oKPKk1k8
7327c3L8oJ8j6j1k2nL3j6L3j1k9K2K6kQrj2j4l2L3lJ9Oj5kj6K1J4nj8k2L6J5k1
7362Bj2jL1l9J2J0m2M5kNk2Pk1K6J5j9qJ4lJ0km6M1loNMJ0rKNl0K8l2K0MJ4j0
7400Cjj6k0K5MJ6Lk7RkmJ3pk0J5j6K4J7l4Npl%K3KqJ5jOj8k4K9kpJ6j9OKJ1M%
7441A2J1k8L3k0j0J7ol4nJ3J2Ol9J0L4j1PMqJ2pLj8J8joPj3jK5k1K3n6J3NL3j2
$$ y = [-12, -11, -14, 13, 0, 40, 30, -3, 17, 23, -13, -8, 12, -2, 5, 20, -19, -2, 8, 7, 15, -11, -9, 1, 3, -33, -2, -17, -3, -7, 1, 8, 17, 7, -4, -8, -8, 2, -14, 24, -3, 14, 14, 7, -6, -13, -12, 8, 2, 11, 10, 24, 20, -2, 17, 4, 10, 5, 3, 2, 5, 7, 7, -12, -1, 0, -21, -8, -21, -16, 9, -22, -2, -11, 35, -17, -8, 1, -9, -48, -17, -6, 15, 5, 3, 9, -1, 6, 6, 2, -12, 28, 15, 34, -10, -22, 21, 6, -12, 8, 1, -7, -8, -13, -10, 21, 15, -7, 20, -23, -13, 1, -6, -18, -7, -14, 0, 2, 2, 5, -7, -3, -26, 22, 21, 29, 15, -15, -14, 0, -17, 18, 8, 28, 14, -14, 28, -1, 13, -6, 13, -2, -20, -2, -3, -8, 11, 5, 7, 14, 16, -5, -33, 5, -1, 17, 1, -10, -32, -37, -4, -20, 13, 2, -27, -5, 21, 19, 27, 18, 6, -8, -40, -7, -10, 9, 15, 0, -2, -18, 3, 17, 12, -6, -28, 8, 23, 2, -10, -11, 20, -19, -7, 3, -39, 6, 4, 9, -13, -6, -27, -1, 14, -5, -13, 1, -2, 8, 6, -40, 1, -2, -8, -3, 1, 11, 2, 4, 9, -21, 7, -25, -5, -1, 13, 3, 2, -14, -34, -9, -5, 11, 14, -13, -4, -6, -10, 3, -4, -24, -9, -25, -1, 16, -18, -13, -20, -23, -23, 0, 2, -6, 9, 8, 14, -4, -28, 1, -1, -8, 8, -11, -5, -3, 8, 12, 12, 23, -5, 28, 8, -2, 15, 9, -25, -30, -17, -5, 1, -38, -28, 6, -5, 2, 6, -2, 10, 3, 6, -12, 6, 5, -1, 6, -7, -8, 17, -4, 19, -37, -24, -19, 14, 2]
7478Bj0rJ3K2qj0Oj0JJ4nqJ5l0lJ5pJ8pk7K6Kk3M3k0mK3j2j8K0mk7K6pjMRJ1k2
7517bpK9k9K9j7Mk6J2J3j3RMjRk6K7j5j7j1L2qRj5kL6m2NK3lk9K4pj8J9QqkRk4
7556b1PK2j4kQJ9l0J7pkoP%K9qk7k0J9L5j2k2J1j4K0K3l8n%Nj1%J9qRnRmJ0j6
7595cj6K7K0j9j0MoLl4J2L1oolJ3mNNj3%L0k4k4NpK6nJ5l9K0j1j5K6J6lj3m2N1
7633Fqnj2L4jKj9K2j1jojkj5M1k1k9K7J1qNk4J5Nk5K5j5joL3l2J0J0j6K4qj5j1
7671b2J8J6jl6L7j1J3j5j5J3J6Pqm1O5n8J7K2j1J3k7K0k1J3J5k6K6j1rJ0qoJ3
7704Hqj3J5k2K0qqPkj1oL0mj5mQJ2oJ0K2mm9K2Kj0M0k9K2j0k5OK9k1j3K8j7J2
7741HqPj1oRK1j7k1J2j1J8k2PqJ7K0k4J7J1l9L5k2K7J1m1NqJK0j1kjNK1k0%j8
$$ y = [2, -8, -17, -4, 18, 10, 0, 6, -4, -3, 11, 6, -2, 13, -17, -20, -5, -12, 6, -1, -28, -2, 0, -23, 20, 0, -4, 19, 7, -11, 9, 5, -22, 4, -3, -4, 0, 9, 20, -2, -9, 20, -9, 20, 3, 7, -19, -7, 6, -7, 2, 6, 5, 14, -12, 15, 0, -17, -28, 4, -4, 5, -10, -12, 24, -18, -13, 10, 7, -22, 2, -5, -23, -4, 4, -4, -6, 3, -21, -14, 8, -6, -8, 0, 19, -11, 6, -1, -3, -9, -2, -2, 27, 19, -8, -28, -9, 26, 14, -8, 3, -11, 9, 32, -6, -11, -11, -6, -17, -17, 2, -6, 3, -2, 7, 3, 13, -3, -19, 8, 28, 9, -1, 3, -3, 0, -34, -22, 9, 3, -3, -6, 7, 3, 8, 13, 0, 0, 30, 6, -18, -13, -20, 6, 1, 16, -23, -3, -14, -29, -3, 13, 10, -3, -45, 6, -2, -7, -19, 15, 14, 16, -3, 19, 8, 7, 1, 0, -2, -17, 24, 3, -26, 1, 12, 4, 9, -15, 0, 5, -20, 5, -10, -11, -17, 16, -16, -6, 4, -12, 12, 4, -11, -22, -4, 12, 11, -25, 12, 1, 14, -1, -16, -3, 13, 20, 12, -29, 36, -22, -5, 17, 6, 19, -8, 12, -9, 4, 19, -7, 19, 8, -1, 9, 1, -5, 8, 0, -13, 2, -20, 0, -8, -16, -9, -11, -22, -28, 2, -2, -17, -21, -13, -1, -7, 3, 25, 21, -28, -6, -4, -14, 26, -3, 19, 9, -16, -10, 19, -2, -15, 13, -4, 8, 0, 7, -4, -10, -1, 20, 3, -18, -6, -17, 1, -21, -14, -22, -5, 15, -9, 8, 19, -20, 15, -7, 20, 31, -10, -5, -13, -12, 8, -3, -5, -6, -1, 20, 0, 0, -18]
7778a8nNK3k0J5j2K4nNk9J8lj2qJ6qJN%KLPlJ8ok5K6Jk5mJ7lMK4k0K1j9kj%K1
7819B8l1%Qk1QnJ8OMk0QKk3J1KNLpnNRj2J3qNLK1k3klKL0j0l0pJ0J1lMj6J5%L
7862Hj7K4l2K3j0KLl0M8l2J6qNrOQlj3j0OK7l2KNJ8l5J8PRMK2n5J1%K1J0k2jL
7901cK8kjj0l0K4J3l6K3mj0mJ5jkJ1J7k7l9J3K4On%J9nj6%j7L7Ol3K7k6lj9L0
7938@nj9K8k5J5J8j2J2pqJ6k1%J1J7j5RK2l3nJ2k0JqRj4j2pK3J4Lj1K8Pl9jK3
7975FmNjk6K6Ok7L6j0pJ9k0QJ5k0qJ5k4LK7%l1K3j4QRj7J4l0JJ6pK0j9j7J7J8
8012A0j7J4j2pJ5j5pK7lpJ2jMj4j0OJ5Qj7M%k9M0Nm2LL3j7l0JK4J4j1kLK5k0r
8050gj5L0qLlPj2lKkK6k8J2rK5k5mK8j6j3K5J1j4lj9QKPJ6j7k3K8k4J3j8NJ0l4
$$ y = [-18, -23, -18, 5, -15, 0, -12, 12, 7, 12, -17, 1, -2, -14, -22, -6, -14, -13, -8, -8, -6, -3, 4, 1, 19, 13, -12, 14, 15, -10, -14, 3, 0, 4, 28, 8, 29, 10, 8, 7, 7, 28, -3, -3, 5, -16, -8, -13, 5, 11, 15, -5, 3, 5, -18, -7, -5, 0, 3, -4, -9, -4, 5, -7, 6, -2, 3, 6, 27, 4, 2, -1, 1, 31, 21, -9, -16, -6, 5, 2, 6, -10, 5, 5, 8, -9, 15, -17, 6, -4, -2, 1, -29, 19, -13, 3, -5, 0, -9, -3, 5, 2, -11, -21, -15, 12, -20, -18, -13, 5, -30, -12, -5, 4, 8, 30, -25, -14, -14, 7, 17, -5, -6, -3, 25, 23, 22, 12, -18, 6, 19, -17, 6, 2, -8, -12, 3, 2, 0, 11, 28, 1, -38, -25, -1, 5, 0, 0, 19, 14, -2, -2, -19, 18, 24, -9, 18, -8, -11, -30, 0, -5, -24, 4, -21, -6, 12, 0, 12, 5, -3, 13, -8, -8, 3, 20, 5, 14, 36, 3, -2, 10, -10, -9, -17, -8, -22, -34, -41, -18, -4, -1, -12, 16, 23, -16, -17, 6, 2, 7, 6, -20, 6, 12, -15, 21, 11, 4, 23, 3, 11, 26, 6, -2, 13, -11, -8, 19, 19, -12, 11, -3, 5, 14, -3, 11, -19, -18, -2, -9, 11, -8, -25, -8, 10, -7, 7, -5, -12, 3, -12, -19, 8, 5, -2, 10, 9, 13, -1, -11, -5, 10, 18, 1, 5, 5, -24, 16, 21, -21, -18, 15, -2, -32, -31, -7, 7, -4, -6, -3, 22, 2, -7, -22, 8, 0, 3, 0, 7, -5, -8, -6, -8, 18, -10, 2, -7, 18, -7, -11, 17, 1, -12, 13, 24, 10, 7, -12, -4, -2, 5, 21, 4, -19, 9, -15, -2, -20, -15, -5, -39]
8088c9J7L0j3k1QMK1l8M2l6J0pK0J1KoJ3j3l4L2k5K3j1J2J1j0K1m2J2J9k7K8j0
8121DK0l9M2l5LOKJJ2Mk2K7l0jnL3%m0Qj1K6j9LK3Ql1J3Mj5J1J2j9J1nKQpJ1j5
8160@J3Nnk2J0l1K9jpK1m2L2k1K0krkJ0KpK5k3kJmJ2%nrkK3
$$ y = [-39, -22, 8, -5, -26, -18, -14, 7, -31, 11, -25, -15, -22, -2, 9, 11, 5, 18, 5, -29, 3, -22, 1, -10, 2, 13, 3, 24, -18, -6, 13, -14, 14, 4, 24, -15, 27, -8, -5, 1, 3, 4, 16, 20, -2, 25, -5, -6, -11, 22, 22, -18, -10, -21, 5, -14, -11, 12, 20, -11, 2, 6, -9, 2, 14, -5, 6, 1, 3, 11, 4, 15, 0, 13, 18, 13, -9, 1, -30, -1, -2, -9, 12, -30, 2, -19, 1, -1, -10, -12, -2, 0, -7, 18, -5, -7, -6, -10, 2, 2, -3, -12, -14, 9]
8191I
$$ Imaginary data points
##PAGE= N=2
##DATA TABLE= (X++(I..I)), XYDATA
0@%%%%%%%%%%%%%%%%%%%%%%%%%%%%%%%%%%%%%%%%JlNqJ3j6J6j6J6j6J6j7J9k1
54a1K4k9L3l5L7m1M8n4N9o7P6q7J03j24J54q8K150J987Q331n53o910J156n887
77B72l406k334o689M385K226q33P215J711M344M001n322O32k378n684P57n602
93f705j959L255j071N717K394j034O147n10j430j1n453J264j631n947K626N77
109c771J809K758l223M449L581l244N85k693j91K055n279M88K242j542K510j709
125a175J05M006l042R9O83k249L059j057j300K642k271J457J208l702J223r17
141a231q95K064l012J524L497j395J691m12N5K793m376k257R96j902R03j881o06
158d444N245J54M28K098o85K214j984l988R92k335j335K20j836L343J976K3L455
$$ y = [0, 0, 0, 0, 0, 0, 0, 0, 0, 0, 0, 0, 0, 0, 0, 0, 0, 0, 0, 0, 0, 0, 0, 0, 0, 0, 0, 0, 0, 0, 0, 0, 0, 0, 0, 0, 0, 0, 0, 0, 0, 1, -2, 3, -5, 8, -8, 8, -8, 8, -8, 8, -9, 10, -11, 13, -16, 17, -18, 19, -22, 26, -28, 31, -36, 40, -47, 56, -68, 86, -2, 2148, 4135, 12466, 11913, 5003, 6159, 272, -3134, -5468, -12157, -7772, -5546, -6379, 836, 2547, 6891, 10892, 5570, 6202, 3824, -1860, -1103, -6705, -8664, -5409, -6480, -763, 1631, 597, 6744, 6234, 4804, 4793, -660, 604, -1027, -6974, -4348, -3771, -1962, 796, -2427, 2022, 5603, 2359, 2944, 251, 60, 2115, -3164, -2676, -434, -1976, 534, -1175, -1070, 2936, -106, -7, 676, -1573, 1486, 429, -871, 1771, -500, 957, 2165, -1537, -314, -1231, -2126, -62, -3074, -1550, 1947, 552, 2243, 1831, 1886, 4679, 303, -1954, -958, -2860, -1957, -3838, -4444, 801, 955, 1383, 3481, 2796, 5010, 3026, -962, 30, -2305, -3640, -3420, -5256, -1913, 63, 86, 3541]
175C541k88L60J249l227p75j991k879J539j676l85L000P59L052Q52j105L008j019
192D015k723j150k809Q49o50k935K524J786J334J948j015K363J171l145l84j636
208d57j109L59k786P88K062l11K304L51J90K089j630k56l00k756P04o44j228J278
226a352o87J757J812j555J337P27n34K66k698J16J452k136j30J48O40K169j675
243c43l3K132p42N3j033q67J862j504r95J117n32J201j26r79J821n79l05Q39j461
262d74N28J73j029J149j014j95J659r72K08P4m33J663j182j166J427l53K18o21
280c40j051K181j75j341P45j91J029j95j849J444L47q68K50r06J019O42j542Q66
298F5J84l49Q27j056K93N80j156Q64j89p84R64m81L39L37j254J197L66j042L62
$$ y = [3541, 3253, 3613, 4862, 1635, 860, -1131, -4010, -2471, -4147, -4532, -1532, -773, 2279, 3131, 2026, 5034, 4015, 1292, 142, -2667, -1818, -2468, -5403, -2879, -1093, 241, 2189, 1174, 3537, 4708, 1563, 1179, -457, -1566, -1207, -3993, -3205, -1143, -1454, 850, 1201, 1391, 3480, 1850, 1594, 1294, -1462, -758, -1402, -2630, -1352, -2039, -282, 1530, -25, 1312, 2039, 1505, 1771, -927, -811, 641, -1495, -1625, -1477, -837, 1332, -343, -376, 1756, 1014, 1067, 34, -833, 1029, -475, -1470, -353, -885, 316, 190, -789, 1032, 453, 148, 987, -474, 54, 227, -802, 347, -667, -862, 797, -175, 33, 107, -326, 1337, 155, -1011, 416, 63, 281, -340, -1391, 790, 615, -726, 19, -172, 857, 662, -1187, 257, 604, -264, -14, -920, 99, 741, -801, 65, 249, -100, 727, -329, -36, 544, -612, 252, 63, -721, 243, -238, 101, 438, -816, 381, 747, -295, 67]
317F7m64P08M72j783O34Q90m55J40r95O33J245j558RN01j7P51j232M4J375q55
337A10j18j15m27R34r14l24J059n88N22M20m39Q27n51k37O42j328k04K64m84O14
357c37n82K40J797l98o5L39j79O06j446j261Q27n56l47m3Q3J979K37m55J204N8
377A701r0p13j589K53o02j190N53L1R04J150L1J423L42o44K72j086r89o84j339
396b266M71j9l23J556J046R48P09m73P99l22j964p44r20k73j23r71J361J626L10
415D28R92L21O26K47j811p09l77j222l31n91M72J370R2J018J134j8M05o51o63
434G32k03j546l36J50m88N63K93P59J251m54K06O14n66l93r85l19O53r04k37P22
454d88L24O10m05r7J056m92n35M2j95N35m38m28Q90j78k67M8m27M05l26n13Q31
$$ y = [67, -397, 311, 783, -1000, -366, 524, 69, 209, -786, -153, 1092, -466, -457, 44, 27, 778, -454, -410, 965, 110, -8, -123, -550, 384, -530, -854, 205, -383, 139, 559, 120, 947, 396, 159, 801, -527, -731, -467, -951, -337, -919, -679, 1118, 720, 655, 994, 815, 1421, -25, -1286, -459, -1015, -1362, -1405, -1322, 657, 894, 439, 1643, 1701, 1611, 898, -691, -438, -1040, -2230, -1677, -1646, -742, 408, 439, 1862, 2204, 1560, 1832, 746, -243, -927, -2266, -1795, -1814, -2137, -581, 465, 1413, 2122, 1649, 2448, 2126, 162, -582, -1502, -1775, -1898, -2869, -1508, 118, 428, 1420, 1741, 2367, 2614, 803, 94, -283, -1505, -1836, -2427, -1955, -585, -493, 525, 1659, 1641, 2046, 1395, 732, 529, -1017, -1353, -1203, -1691, -1128, -835, -76, 1175, 721, 927, 1541, 975, 582, -403, -722, -69, -973, -1210, -488, -164, 446, 41, -56, 1000, 508, -27, 15, -180, 355, -83, -511, 379, 201, -66, -18, -445, -40, -366, -879, -48]
475d8l3J22N82j0N78l36p81L83o58q43j85k72P76J60r4J371P31J01j7n15J38p75
497C75j650k23j80m7K55J41J517J204j6O27P8l77o70j662n07l76r87L14N95R03
517f86J245L95J032O96p68m59q46j009p82j266R3P41P2R22J107J073Q39n58j51
536A690l4j335j074r02l18M10l64N61J447O82O58J76M1K40j136r78l11o65k05
555a417k16K77J097K33L70Q48J06Ln46n82J08p85o28L20M4L51P5J15R56o3l84
576B82K08j56J8m69m83O07k2l66K21P1L72j85n33M97Q7l42N8L3M91L4m49M10P2
599D56m40j92l45J62mm82N23M73J07K53j4M27Qq52j39j39m46k56k74N40N95j50
621a89N00O44J48l5o07j07p0r63m23O7J24L37n6O87Q69n3P0K1k02k94r10l69J77
$$ y = [-48, -81, 41, 623, 613, 1191, 855, 74, 457, -201, -1044, -1229, -1501, -725, -565, -659, 712, 1443, 1544, 1527, 1012, 1150, 375, -1275, -1498, -1678, -1725, -1470, -1329, 188, 1392, 1376, 2003, 2081, 1704, 1034, -628, -1135, -1511, -2498, -2184, -1589, -686, 559, 954, 1986, 2682, 1914, 1455, 609, -400, -1182, -2448, -2355, -1614, -1542, -620, 487, 1560, 2399, 1841, 1690, 1656, 321, -753, -1655, -1973, -1563, -1927, -1366, 81, 763, 1421, 1597, 1638, 1878, 742, -236, -547, -1212, -1417, -1633, -1356, -259, -26, 344, 1192, 1298, 1301, 755, 173, 281, -504, -1132, -812, -768, -417, -342, -227, 729, 666, 282, 490, 334, 352, -117, -600, 7, -15, -381, -160, -89, 283, 98, -435, 62, 149, -193, -135, -102, 389, 423, -26, 384, 456, 16, -176, -521, -359, -363, -845, -322, 151, 258, 511, 497, 924, 932, 80, -59, -198, -644, -900, -1174, -634, -39, -189, 311, 955, 1103, 1068, 461, 354, 284, -679, -1102, -1035, -911, -574, -630, 57, 926, 873, 943, 964, 762, 468, -442, -811, -634]
644f34m29JL51N67O57l8K26N74l66m62m08l43o6o20j70O39J72K42K80L40O03l06
666H10m54J24l09m45m22j38M87j32r3N99L63K05q7j69L61l54o28l4l1j2j68q9
688f16O39K27k01K53J46R7k76m60K91q8m86N8J43K62J4k15M42K83l02q5l0J17
710B13j34n20J69K72k37J0O0L71J55l97J63K35k28j86k07J91J03m21P0L57M2P
732H8j17K75K28m34j26J58n1j60k85J58L93k27l5K96J35M5l26M0K68l36k76P6
754b13Q8P0k35P6M72m9j65J02J24N4m03k10L19q5k33rJ83L18j88j09L95j0j97
777I5j64J7K25k35l12K84J61p4j07M1L40j17l37J77J59p4j66o9L32K1l61J26J28
800I0n0j39k32L30Q3k73Q7K44J65l4k57J99R3m24j77J9O0m9k13L82M11m4rJ55
$$ y = [-634, -1063, -1062, -711, -144, 513, 475, 701, 1275, 909, 447, 39, -304, -370, -990, -1160, -521, -349, -107, 173, 513, 1116, 810, 356, 480, 171, -274, -696, -834, -347, -479, -572, 27, 390, 595, 508, 339, 700, 346, -282, -316, -347, -359, -527, -616, 23, 250, 49, 302, 448, 545, 269, -191, 100, 12, -474, -416, -273, -11, 3, -212, 230, 513, 211, 126, 96, 213, 79, -441, -272, 0, -237, -227, -167, 204, 359, -38, 125, 360, 132, -54, -261, -70, 33, -388, -318, 39, 81, 88, -29, 246, 474, 40, -86, 72, 21, -139, -424, -266, 127, -100, -135, 161, 296, 341, 15, 55, 323, -13, -289, -213, -125, -55, -290, -214, 258, 209, 44, 146, 270, 324, -79, -289, 30, -55, -288, -297, -114, 204, 16, -93, 302, 292, 95, -69, -52, 173, -62, -374, -90, 71, -3, -110, -69, 271, 154, -183, -6, 153, 79, -87, -156, 176, 197, -164, -38, 90, 40, -99, -331, -1, 82, -191, -104, 140, 305, 271, 14, 213, 306, -118, -295, -276, -216, -265, -478, -96, 315, 271, 262, 417]
824D17J26j07n56j05P5l25j90M3L82L35m5K62M64l6k37k72j08j80n96k35K50J07
846e31J16K35M81N25p9j18R4k21m92n31k04J05k09pM99N38L05N8J64K97l42n56
868A27k19k65k55l64J2N66K48J42M07L88J56k59l71ql11n48k30P1K23N1Q7N88
890B36L94m8k5q9L0l55n14k2M3j07p0J87M45J66j54K03J82j46k42k48J21m8l09
913c70P0K49Q8q2n9K36J16l00l8J80L1j13j54K36K15k41j40L7K5j05k69P3L07
936hp9J1K04K70Q3k53p4R6k87l54j32Q3J06j07K23N22J70J5K8Q9r0n17l76nj64
961e46j74k4L85M64J48J62L32J36k39m03k89r1m14m05J58L05K50J43L41N49P5
982H63k76q5j15l24n00l37J09O1k1L20M42L88P2m1J76j09n02l63j30q1j78j53
$$ y = [417, 543, 436, -120, -225, -150, -475, -665, -622, -240, 95, 50, 312, 776, 740, 503, 231, 123, -57, -653, -888, -638, -531, -415, -180, 301, 826, 747, 629, 723, 502, 10, -521, -725, -620, -829, -836, -337, 201, 506, 564, 728, 1025, 683, 127, -92, -357, -612, -976, -964, -398, -150, -8, 399, 787, 943, 684, 313, 305, -6, -554, -784, -713, -490, -439, -352, 236, 630, 582, 557, 468, 498, 143, -371, -393, -350, -457, -527, -340, 105, 271, 117, 320, 502, 356, 114, -134, -13, -61, -370, -300, -51, 37, -45, -104, 132, 248, -52, -90, 90, 121, 8, -146, 90, 305, 64, -76, -39, -14, -119, -388, -315, -8, -87, -76, 128, 398, 481, 228, 154, 250, -37, -391, -523, -440, -334, -441, -218, 304, 474, 489, 517, 606, 516, -1, -377, -382, -546, -720, -744, -359, 105, 253, 415, 747, 883, 644, 241, -48, -139, -553, -958, -800, -495, -245, -102, 239, 788, 863, 587, 502, 387, 63, -437, -774, -665, -604, -625, -305, 137, 525, 597, 556, 732, 623, 121, -242, -372, -453, -631, -784]
1004g84M06L88J07J10K63K10j53l90j19l5l01k48lK55J54k8K16L56K2j36j10L5
1026B15o1l62j01J26L5r2KK71K05j65k8J85j8j50k00R0J59j81j43J71J48o5j63
1049a22P2K24j54j53O0J76L5j89PK36o3j99o9J19L0k27n2K57R5q1PJ69J40j75
1073A43j70R3rj99j28O0J86q9n3K78J58m0j40K1J30j88k89K6J12l0j44R3L05R4
1097B20j36N0J46k9k31j49N8K4k37j0J96J37m3k7K25J41j64j63O9Kj54k23Q4J49
1121f5q1PJ45K30Kj65N4J11j50k53n5J34j5j79P9K58Q5r4M5J45P6k68j34P2n9
1146g5j55j31J75K15n0mK14J36q4j64k5Q0k45k02M6J06J1m1J51L24K3j07M7P0
1170C15j21l23j43J07o8j66R3K61J99PL0K27L7k75k20j5o1k31j72J87K18O8M5
$$ y = [-784, -378, 10, 117, 227, 490, 700, 547, 157, 38, 3, -298, -546, -549, -294, -140, -168, 48, 404, 426, 290, 180, 215, 154, -208, -309, -183, -148, -240, -238, 33, 238, 73, 45, 230, 212, 62, -138, -48, 111, -70, -213, -42, 106, 41, -122, -50, 174, 20, -133, -73, 103, 138, -51, -44, 192, 129, -70, -139, -20, 10, -217, -269, -12, 83, 2, 9, 178, 318, 143, -27, 66, 57, -142, -270, -210, -24, -113, -166, 112, 270, 230, 90, 111, 241, 53, -236, -210, -98, -128, -272, -179, 126, 220, 84, 134, 280, 251, 20, -129, -71, -47, -284, -294, -98, 39, -4, -31, 194, 335, 171, 8, 77, 79, -75, -298, -214, -65, -146, -139, 6, 236, 238, 73, 127, 238, 88, -165, -220, -86, -101, -280, -201, 57, 142, 48, 93, 238, 314, 46, -88, -16, -75, -230, -361, -186, 29, -21, -25, 189, 325, 241, 77, 52, 132, -113, -315, -269, -163, -152, -193, -42, 282, 305, 198, 245, 315, 194, -129, -272, -165, -233, -399, -306, -45, 154, 161, 191, 418, 455, 180, -40, -55, -116, -347, -519, -332, -114, -46, -1]
1193aK42K44m5k28j2l0k66k85o5J54J1l7K15L52J47p8RO2j33l36j84nk7j19qL21
1219a02K21NR1J61O3k01k53qj5k40j47J27K09M6k0J97J71n1j72K9K8j37k38LJ69
1244f4k2q0J02J66N3j62l3J54l4j67LJ25J09j29r6J66L4j73j47O6J05j45p6K38
1268gJ99mo2Q3J27j42k87o9k4j12j41P6L05J35M3J71J85N4k62j84n5k22l39p5
1292f07J13J99R2J91L77K80q5j06m0j51l82l93q4M5n0J00L38M32K09L2J57M1k71
1315D37m32k67j28j91j89J23L59L03J62K41K91O8l20k27j86k37l52j51J24K04
1335c68O7K23L80K72J7j47l8j19l28l56o4O6l5J9K22L40J39j4J07O3j13l11j50
1358a28Qj04j40L6K30J46k2K7J87N2k06j13O0K2j78q0J64R5p2o4Q9J00j18r7K3
$$ y = [-1, 241, 485, 440, 212, 200, 170, -96, -381, -446, -292, -281, -318, -103, 249, 396, 318, 327, 389, 256, -80, -264, -269, -296, -415, -423, -102, 119, 124, 215, 376, 439, 238, -15, -23, -38, -278, -425, -298, -89, -43, -63, 134, 305, 254, 82, 111, 139, 2, -236, -233, -64, -86, -166, -64, 102, 155, -7, -40, 114, 80, -87, -84, 41, 150, 21, -75, 91, 125, -48, -195, -129, -24, -169, -245, -7, 192, 188, 126, 209, 336, 194, -93, -162, -186, -298, -439, -363, -58, 77, 120, 291, 476, 530, 268, 84, 29, -193, -532, -607, -494, -295, -203, -12, 365, 645, 560, 454, 414, 263, -119, -512, -596, -551, -601, -501, -163, 269, 478, 510, 667, 708, 437, 5, -262, -390, -581, -770, -647, -288, 15, 177, 418, 709, 777, 457, 230, 44, -193, -545, -696, -572, -368, -301, -78, 302, 574, 591, 444, 406, 287, -41, -397, -461, -395, -430, -411, -189, 151, 290, 276, 383, 446, 333, 22, -128, -120, -224, -364, -328, -98, 48, 26, 53, 240, 292, 86, -27, 33, 55, -123, -203, -39, 56, -16, -80, 9, 109, -9, -106, -83]
1383h3J12%r0Q6J68j8j54J2O2r4k10q5J48Mm9J12K60J18l9n4J06r9k65j81n0K6
1409b57j24J3K63K25O5O8J32O7j45k83j12o4k47j34Q5K36J41J13J93K62Qj93q1
1432B31o3k36l20j15P4J17K3J61L16J74Qk0N3q8k97k55n8pj15j2K83K28Q3N0J47
1457C62R5j43k54o6r6j43j92P8K01Q6MJ89J98L6j53o1Lj22k56n3R7N4o4M9K47
1482I6R5m1j9O8K0j99j60J8N4j17m7J41J48J8m2R7P8k0j92n0O2p5j24OJ58Nm5
1509f7O1J43L3j16m8O9j6j34p8J10N1j17RJ45R7p7q7Q6P1r8j42M1R0m6r1O4J01
1536E4J9j04O0J06j8j48j2O0j6r5rJ02L3r7LJ82lo9o1N5K7j44m6P9J16r8j00J51
1564B7Q6p1q9P3O5p4j13N5R7l3r2L8Q9pj04l2J15j8j03J3J37k6j7pJ11j0j34k4
$$ y = [-83, 29, 29, -61, 25, 193, 175, 21, 33, 95, 1, -209, -294, -146, -142, -191, -79, 181, 299, 260, 206, 312, 213, -52, -233, -283, -257, -381, -368, -105, 120, 185, 253, 385, 452, 307, 24, -88, -152, -399, -533, -448, -212, -71, 42, 235, 497, 505, 312, 231, 168, -68, -388, -503, -429, -312, -289, -128, 188, 362, 370, 350, 403, 315, 18, -237, -295, -302, -417, -429, -146, 82, 165, 215, 362, 457, 314, 60, -6, -102, -245, -437, -359, -158, -72, -68, 121, 319, 355, 202, 141, 144, 22, -234, -287, -190, -136, -200, -151, 96, 191, 150, 131, 199, 219, 20, -140, -122, -68, -185, -232, -91, 57, 75, 33, 130, 208, 188, -4, -54, 8, -67, -191, -185, -27, -22, -67, -6, 137, 170, 54, 6, 75, 59, -75, -153, -43, 8, -109, -100, 45, 142, 65, -22, 64, 135, 37, -105, -64, 26, -20, -111, -47, 54, 73, -31, 29, 135, 117, -31, -43, 17, 1, -94, -103, -1, 32, -65, -62, 120, 117, 48, -13, 42, 69, -75, -121, -42, 74, -24, -124, 27, 113, 42, -47, 26, 91, 17, -96, -41, 56, 23, -69, -31, 58, 51, -53, -85, 30, 12, -91, -78, 59, 33, 16, 9, 120, 110, -24, -48]
1592d8M0pj22n8J37P7k7J0J53R3j20q8L5j5j74j35oJ37J3m0J62K10O6p4l0K4r9
1619A14k40j81L1Nk4M6K30K02M0P5R6j7k20j65j38r6j97m2J88J67R7J38K46J57
1643E12q2k04n5j02k78k42m3J34P5O2K44L12J20m9m0j3j87k50k46m7j5l3P1K85
1667g1K49J11P1R2l2k03k37j13j11j82l2J75J48R7J05K02J51r8j59l9n6j63k27
1690c22K9J17M2j8R9K43M9r6m7O5q7j17q2M6L2m0l0J10Q6l8r4M6O2j02l0P6M9
1717D8J1l8Q5N7j24j09j2K2r0j14Q6J85O4J4R9J40K3k08j15l8j16j89j12J45J47
1742a39M7J57K08J87n5j01q6j21k45k70k8N9J0J04K39K92J26N0N6l5k35k82j48
1765b10j12j91o4J56L14J86J15J98J51k5k20k06j28j82k37j26J45K16J08J35K38
$$ y = [-48, -8, -15, -137, -195, -58, 19, -8, 2, 155, 248, 128, 40, 75, 60, -114, -249, -255, -118, -105, -145, 17, 227, 293, 219, 189, 213, 114, -126, -307, -276, -271, -295, -249, -19, 183, 223, 298, 394, 377, 157, -8, -146, -242, -439, -481, -293, -126, -29, 109, 355, 512, 430, 226, 171, 69, -209, -451, -494, -360, -285, -223, 21, 333, 453, 404, 364, 351, 164, -86, -332, -379, -394, -427, -356, -71, 178, 289, 360, 452, 420, 217, -20, -133, -244, -426, -458, -283, -135, -38, 67, 269, 420, 322, 163, 124, 68, -95, -322, -293, -176, -134, -152, -53, 190, 239, 143, 96, 161, 74, -43, -125, -79, -47, -87, -117, -7, 79, 41, -53, -7, 55, -47, -77, -1, 48, 59, 21, 106, 163, 39, -70, -82, -60, -150, -264, -178, 7, 71, 85, 184, 324, 347, 139, 24, -14, -130, -319, -431, -286, -139, -92, 65, 273, 460, 405, 304, 218, 97, -148, -418, -446, -387, -377, -273, -34, 258, 384, 434, 490, 455, 220, -62, -210, -322, -513, -577, -421, -107, 79, 194, 392, 543, 518, 298, 92, -36, -218, -455, -581, -436, -220, -112, 23, 261]
1786B61K27j4j36j03r9k18k57q6N2M0P0K09J91J10M2M0j0j45k00j23l3q9p8J11
1810b38J92P9MJ10J45m0j54r2lnj42q4J03J19j9l1R9J00n2q2RL6l9q9J6Q0Rl3
1838bj4M9k3o8j6K5Rm3M4J36J6o9K9R4j05j48n2M6pr2pK10R7NpJ09K1j12j86k5
1868h6j5q1r5M4J66R2PR8P9P3j27p4n8q0j70m3P3L3L9J01J77R7l7k6K1q5j77r4
1896a48J7m3o4pK08J31K7j5J21N8j20j98j4k5o3j22L9J62M3K7N5J33mq6p6Rr3
1923d8p3l6NL5J0O6J03P2l3J0M5m6j34o7L6j4p7j9J23J39o2l1R8Q7p7j49j2N4
1951En0j09qJ20O0l4j6J13O5q3o9j8L4o7n7M3MJ2K0O0L7rJ6L4mj06o0K5K4j07
1981a25j3J07Q7k5k5L2J36o6j43MN8j7j47%J20O2o2mQ0R0p3p0QL2j09m5L0J5L0
$$ y = [261, 488, 474, 338, 235, 136, -82, -339, -425, -373, -333, -263, -54, 137, 247, 289, 329, 319, 174, -26, -149, -182, -271, -349, -238, -46, 33, 37, 147, 292, 252, 98, 6, 3, -2, -144, -228, -125, -6, -25, -56, 43, 143, 91, 9, 18, 54, 15, -74, -58, 22, 31, -2, -16, 33, 10, -58, -74, -49, -40, -83, -39, 97, 113, 44, 73, 167, 62, -86, -138, -92, -99, -191, -198, 12, 109, 114, 107, 216, 237, 125, -61, -86, -101, -182, -277, -233, -67, 25, 32, 130, 209, 282, 155, 81, 23, -57, -227, -270, -197, -164, -125, -24, 153, 250, 213, 187, 208, 123, -54, -148, -131, -174, -238, -245, -37, 94, 121, 106, 227, 285, 165, -33, -47, -72, -135, -257, -218, -56, -13, 14, 69, 202, 198, 112, 36, 45, -48, -121, -157, -152, -117, -107, -41, 62, 134, 101, 111, 156, 110, -24, -91, -55, -69, -146, -165, -42, 97, 35, 4, 102, 189, 112, -37, -49, 5, -45, -154, -162, -42, 18, -16, -32, 81, 146, 63, -6, -24, 10, -57, -114, -71, -67, -55, -35, 25, 62, 53, 69, 103, 99, -7, -67, -42, -18, -125, -138, -31, 56, 31, 6, 38, 174, 108, -35, -31, 27, 10, -137, -137, -17, 45, -17, -21, 59, 149, 76, 6, 14, 46, -63, -108, -78, -63, -33]
2010c3j1N9M5J0j8K8l9m3l8J4%l1n6P4R7k1p9O6R3q1p0J2P5k2j12J4J06M1r4n9
2040g3Q2M0n8n9N5L7rm2L2O8j6o2J2Lo4k3LL9lJN8Q8nn6K7N3q7j44PJ0j5p5Q8
2073h8J38Q6m0K7O8J6j67j21j0k4m4r6J16J19P5J4Q9L5M2j45o2l3j24q5j4M6P0
2100a12L5J48J05N5m6Lj6j14j64q6M4m4m2R3J51J16KM3P8j2j55j62j2l7p6m2P7
2127a70J42M2M7P4R3l5j18j5n0n2j38J1M4K6M0M3J18J4k5K9l0m2r3n2M1K1o8M8
2155e5J09M0n2k8N9M4r6q9M0O3n5n9P8N8j2q2NM3j6o6kQ9kK5J5L2j1o1Jl0m0n6
2187a11k1P9QL5K4J24M6n1p6N4p5j31r3N1N0k6j9J59J11J9k1LL2p3j51q8J3l5
2215a63n1N6J41Q0M1N1O8m1n5j16o1o8r5j6P0O2O1Q4J18N9m3n8km6j65q8nN9j0
$$ y = [-33, -44, 15, 60, 70, 52, 80, 41, -2, -40, -26, -26, -57, -113, -39, 58, 37, -42, 24, 117, 36, -34, -22, 53, 31, -81, -67, 39, 80, -14, -73, 9, 49, -9, -68, -13, 24, 15, -27, 5, 73, 57, -5, 7, 10, -54, -77, -74, -35, -38, -37, 21, 109, 104, 48, 75, 128, 41, -103, -96, -86, -101, -176, -88, 50, 136, 96, 123, 191, 207, 40, -81, -91, -115, -159, -255, -139, -20, 55, 69, 158, 193, 235, 90, 28, -5, -129, -214, -228, -182, -112, -77, 71, 176, 231, 185, 188, 172, 58, -106, -192, -148, -192, -234, -141, 10, 126, 128, 171, 249, 237, 82, -80, -92, -129, -205, -247, -170, -28, 14, 61, 135, 228, 193, 75, 60, 10, -42, -180, -169, -125, -99, -59, -16, 102, 116, 91, 120, 90, 48, -45, -97, -56, -35, -103, -55, 54, 94, 42, 14, 73, 117, 21, -68, -28, 35, -20, -79, -1, 57, 45, -37, -32, 11, -5, -71, -73, 16, 14, 39, 54, 86, 75, 14, 15, -15, -55, -111, -132, -53, -45, -10, 14, 138, 184, 133, 57, 111, 36, -95, -188, -137, -87, -113, -132, 27, 138, 157, 136, 139, 171, 98, -53, -141, -128, -163, -214, -158, -17, 63, 104, 155, 223, 182, 127, 11, -50, -118, -213, -229, -159, -97, -36, 48, 166, 225, 182, 124, 122, 76, -89, -177, -182, -123, -133]
2244a33J3J18J45J9m5K4L5p2j44m6J6m4l8K4R2Q4j8N2L6Np9k2l3j8p4J1L3K7J
2273c1J4R0M0p6mjK0m4j05N2O0j3n9N8O3m4m8QO5k6o0k0P7K8l1m9R3k5o3j7M9
2304Ak4k8QM4M4l7L7M7j9n3j5Nk0o4n3P9M6lj1P7Q3p5n8j5M1n4q6j8P5J0j8J8
2336c6J07M0n4JRk9o2n1QKnk5J04M3L1n2L6L7n1o0%j3n9j7J4R4j1k9P8M7op4j4
2369CM5m5o7k1N3J5n1J9Q5O9n8k7J4K6n4q5L0L8m3mL5M7mNK6L7k9p6J3J9o1pK9
2402b4N6k9k5K1Q0l7m6j2N6J1j03K5N3l3m0K5N4K4m8k0K0M8l3p3M6J6l2k9N0K1
2432B2k6k6M2L2k8m7QN8k3l0j9L8K2j5k4P6j0n6kN3qn6j8L7Ron2O8K6k3m5M7L8
2465F2n6o0N2J8l0k1RN3l9J5RO0o3n9J7J1L7o4K1N5mn1J5M7J4p8NL4K5m8k0N6
$$ y = [-133, -120, -2, 143, 162, 117, 141, 176, 104, -40, -86, -70, -114, -152, -128, -36, 48, 30, 82, 118, 123, 44, 22, -11, -29, -103, -92, -59, -32, -31, -17, 73, 113, 37, 33, 32, 52, 8, -97, -45, 15, 2, -57, 1, 64, 20, -28, -20, 45, 19, -41, -61, 16, 44, 13, -36, 57, 32, -31, -48, 1, -23, -51, -43, 1, 45, 8, 45, 92, 73, 20, 5, 10, -10, -74, -127, -48, -2, -5, -16, 61, 144, 69, 11, -4, 37, -17, -103, -121, -46, -36, -54, -36, 71, 111, 57, 58, 67, 38, -24, -75, -67, -65, -70, -95, 9, 52, 83, 31, 67, 104, 53, -7, -7, -20, -79, -96, -82, 12, 1, -28, 50, 97, 91, 17, 3, 48, 3, -64, -85, -32, -17, -68, -49, 36, 105, 47, 20, 34, 60, 6, -79, -49, -11, -54, -58, -23, 24, 20, 25, 51, 88, 59, -17, -4, 15, -46, -53, -24, 32, 3, -22, -1, 79, 42, -4, -16, 40, 51, -52, -27, 26, -7, -47, -22, 32, 56, 8, -12, 8, 56, 23, -50, -4, 12, -20, -49, 1, 22, -4, -30, 12, 44, 16, -31, -23, 35, 12, -18, -37, 1, 23, 8, -16, 60, 50, -6, -8, 45, 37, -19, -37, 0, 9, 3, -49, 19, 45, 22, -23, 24, 62, 6, -54, -2, 16, -14, -35, -26, 27, -12, 3, 12, 72, 9, -50, -33, -22, 15, -49, -28, 27, 23, -28, -13, 34, 48, -30, -25, 9, 34, -14, -34, 22]
2497B2jj1l6L3Jpl3K8L7n5pQO9pm3J2J5j5k3l8M0Rm6J4O9L2p4O1J2j5o7k8L4K
2531hq3J9M6K2RJO5J3n0k8K5J2p2q4L9M8j3QL6O3Jk4j5L9m4r5pK8j0k6K2P5M8
2564F0k3L0K5rp5m4K7l8m2J0L5P2k4J5N7L7m1o4J8Mm8n3KL3K1lJ9P1jn3J9J0l6
2597A1p2j9K9L0l0jN9N1n1L5j8%nm2ML6l7j7LN5k7oK6K3m0k1K3LJ8l4J7K0j9j
2631Cj8Rj1k4j4N2J9n7N9L1k0JrMJ8n7o8L8kMrN1N9m4J5M0Mn7m9oJRk9pR1J2k6
2668A3RO2Jo5l2Nl0n4J6L6L5MrQ6%j1m9MLo9m1L8k5J2MM1M9RJJ9K0o5j9k7j5k9
2704g3j3M9M3%J3J0N7rp1k9PPk8kK2J1NQK5Pj5j3j4NOo2K3K9j1k8M7J0J7o1L3
2739EK6k0k4kN2k3m2LM6j1l7J0K8K8m2k5M2K4o0PK9K3l4j0J2kj7m5O5LQk2KK6
$$ y = [22, 21, 10, -26, 7, 8, 1, -32, -4, 33, -22, -29, -21, 48, 41, -2, 10, 25, 10, -13, -51, -11, -2, -48, -34, 35, 67, -7, 54, 66, 51, -16, -44, -10, -8, -91, -72, -26, -4, 5, 6, 71, 84, 34, 6, 31, 43, -29, -113, -74, -26, -39, -31, 5, 68, 69, 45, 30, 69, 25, -70, -77, -49, -59, -85, -63, 12, 60, 37, 67, 92, 83, 8, -36, -9, -47, -89, -79, -44, 28, 4, 19, 76, 113, 72, 8, 26, 30, -18, -71, -69, -36, -15, -18, 1, 72, 71, 18, 37, 47, 11, -61, -80, -51, -21, -51, -52, 7, 58, 7, 42, 24, 24, 19, -23, -19, 17, -20, -37, -34, 21, -6, -12, 14, 37, -3, -24, -1, 2, 20, -14, 3, 23, 4, 3, -15, -6, -17, -41, -55, -3, 16, -41, 18, 49, 29, 30, 21, 25, 43, -14, -82, -44, -46, -42, -51, 0, 59, 15, 30, 70, 74, 17, -32, -38, -37, -28, -57, -64, 27, 39, 13, 22, 84, 85, 20, -12, -7, -37, -91, -75, -39, -4, 0, -9, 77, 77, 66, 17, 21, 24, -45, -86, -48, -73, -61, -57, -16, 33, 42, 43, 62, 82, 17, -2, -29, -44, -73, -86, -37, 6, 6, 19, 29, 86, 77, 6, -23, -16, -9, -37, -39, -17, -6, -1, 7, 32, 39, 24, 11, -3, 2, 8, -54, -31, -2, -13, -41, 6, 16, 33, -28, 5, 31, 11, -13, -15, 37, 14, -28, -25, 21, 10, -27, -17, 11, 39, -3, -28, 14, 38, -22, -15, 14, 37, 3, -7, 5, 3, -14, -59, 6, 9, 17, -5, -3, 23]
2773B3rk5NJ4Po2K8L2nm9L3L0K0n4J8L4k3l7RK5j6l3J1K0L1j4LkL8k6m9J6K7m4
2807b4k0J6L8pk8M5rMm2J3K3qk8KJ6Ql9K8M4oj0NrQl0j0J2nQl2N1L7k9mJ7Jj8
2844A8l5NK0k8m2OO3L2n3K7L7j3l7k2M1l3j7k8N9pk6jR0%k2LOMo3l8K9Kj8l7O4
2879a4L4j1KJM9no7K2mm5m5J9M4J7j4L2J3L4m5l5M4m3j5l5M2J1%OJ5K6Mk0N5l7
2913C5l2j1m0L4j4j1L2L2Jl5L2J0k8J1l5K6po2N7NJ2m2J0L0J1j3k4K9l2pJL5N
2946A5j1k1L7Nn1pL5K2j8n0O5L1m3J0J2j6k1l5L1K9l2j3J4L4j5qQP0j5p5JjPn0
2980e6jO4kj2kL8Mj3k1k0pj6l6M4PLJ4O2pJl4OK8l9l6m5N8qj6rP6jj7L3L2k8n3
3017ij7Ok6k1nP1PlK9QL1l9k8oQn1m1L2J6L7lj3O0j0k5K6J3l8m1k2N0J0m1L0N3
$$ y = [23, 14, -11, -6, 8, 15, -47, -19, 13, 8, -41, -8, 22, 42, -12, 6, 40, 17, -20, -11, 14, -2, -35, -24, -4, 27, 13, 16, 14, 52, 26, -23, -7, 20, -24, -44, -28, 10, 3, -25, 20, 11, 15, -27, -14, 9, 1, -27, -25, -9, -1, -40, -12, 32, 26, 16, 21, 12, 20, -10, -20, -8, -13, -5, -37, 14, 51, 22, 18, 35, 36, 18, -17, -12, 8, -20, -62, -56, 7, 39, -14, 13, 50, 37, 0, -22, 19, -14, -31, -59, 0, -7, -33, -34, 56, 56, 34, 37, 43, 47, -16, -54, -25, -23, -41, -78, -14, 20, 9, 11, 12, 61, 56, -11, 11, 7, -38, -83, -64, -20, -3, -17, 15, 28, 62, 17, -18, 26, -17, -32, -67, -25, -14, -14, -8, 7, 33, 37, 17, 72, 35, 3, -8, -48, -14, -28, -39, -7, 25, 26, -9, 23, 33, 5, 16, -19, 7, 0, -62, -5, 0, 12, -30, -20, 10, 21, 8, -16, 13, -19, -26, -25, 10, 15, 4, -17, 20, 25, -26, -33, 2, 24, 6, -44, 21, 52, 9, 19, 31, 15, -6, -41, -10, 19, -13, -26, -12, 22, 7, -1, 7, 77, 62, -13, -12, -13, -6, -56, -57, 7, 5, -7, -9, 29, 33, 20, -1, -21, -28, -44, -80, -36, -29, -26, -12, 50, 43, 44, 10, 16, 44, 5, -31, -76, -18, -26, -42, -51, 25, 24, 7, 40, 72, 44, -9, -26, -20, -46, -67, -72, -1, 6, 3, 32, 40, 71, 32, 4, -2, 6, -45, -86, -54, -38, -1, -4, -17, 43, 33, 8, 34, 47, 9, -32, -54, -4, 6, -35, -5, 48]
3052D8j4j0l4O2jm6l9OK4j6rK0LJ0j4%K6l1j3J5J1k6pK5K6l5jL2k7K4j9k2M5N
3086A8l5k6N2J2l2j1K2M0m3j1KK0k6rK2K4j0j8J0M0o4j2J2J2Nm4K7J6K9l0J9L3
3118D4j9n3J2K8K3o5m0L4L3J0l1K3L3rj6J7J1k3m8RM6l5k4L4M7k1%l3O0k7l8j0
3150b8J4rj7rN1J3J0k6M9j0n0lL4l4k2k0N4k6%L8nM3m6j5J4Rk1j8NLlNJ5M5l2
3185HpJ8Ql8j2PJ3l3k5M5mJ3k9M8j5Qlj5J0ml4jL7J5j6%L8Lj3k5M3j7l7j5J1j4
3221c2K0QqN6j5qJ8lro7Pk4L9l2J1L8J6m7K3M6k4j7Qk1J2l1k1N2J5j7RK4K8l0
3255B4k1QMol2qK2%J1k1N0j6l0nK0Ml0QL4l2K0j5JK4k3OJ%jk4J9pK8kJj2J7k5
3293hRk3K0l0J1L2j9QL4nK5l0l3J8k2k1JJ9kk8RP6Lj1j3Lk5j7j4j7J8%j3K0J7
$$ y = [48, 34, 24, -10, 52, 51, 5, -34, -28, -4, -20, -29, -9, -6, 4, -10, -10, 16, -15, -28, -13, -2, -28, -35, -10, 16, -19, -20, 12, -15, 9, -10, -32, 13, 18, -17, -43, 9, 21, -11, -22, 0, 40, -3, -14, -12, 8, -18, -27, -5, 19, 9, -9, 1, 41, -23, -35, -23, -11, -6, -50, -23, -7, 22, -8, 11, 44, 25, -28, -16, 12, 35, -30, -70, -36, -3, 7, -24, -1, 32, 23, 7, 24, 35, 12, -36, -27, 19, -16, -40, -6, 41, 20, 20, -13, 47, 20, -18, -28, -14, -23, -40, -49, 2, 15, 25, -1, 48, 38, -12, -15, 19, -15, -37, -57, -3, -29, -29, 9, 4, 47, 1, -14, 0, 9, -12, -30, -25, -22, -25, -20, -5, 40, 8, 1, 19, 27, -11, -23, -16, -3, -36, -61, -16, -20, -7, -36, 12, -3, 5, 2, -13, -3, -7, -41, -42, -5, 10, -6, -6, 32, 35, 22, -3, 40, 23, -14, -29, -18, -32, -12, -4, -12, 44, 29, 21, 39, 36, 27, -40, -33, -57, -18, -50, -39, -1, 15, -32, -9, 37, 13, -4, 4, -17, -5, -36, -57, -5, 10, -7, 2, 26, 54, 24, 3, 11, 15, 9, -23, -31, -9, -9, 2, -19, 31, 15, -15, -20, 0, 4, -26, -18, 16, -16, 4, -11, -10, 14, -9, -3, -2, -2, -3, -27, -8, -15, 13, 11, 12, 0, 17, -8, 1, -22, -2, -32, -21, 11, -8, 0, 34, 29, 54, 24, -9, 9, -13, -34, -33, -14, -16, -44, -35, 41, 44, 33, 20, 23, -2, -19, -33, -50, -32, -32, -45, -25, -8]
3328hJ2J2K7Lnm6j4%Lm9jM0K0L6pM2Nl7k6Qj9m2k3L9jqkO9MRk3J9j7j4k0k8J8
3365b4qk0J5L8K5LqJ2kk9l0L6m5j8J3L4Jk2N4J2Oj6j5rJ7l7k9L1OJ2j1K8K3k9
3399A4j9J3Lj2k5J0L8l1j8N4j5j8j5lJ8mkpO2n3PK7J5%n1J5Jj4l9M0PM0l0J0L5
3434E3j1l2mJ7m1j1k0MM0l3lL6L2j0nJ8k3j1j8j9J3k0J0K2L6J4rOL2k6m3k4K1
3467ik3RlPJ7kL6J3Pm6K0j2k3j9OOKJj8L8L1qj0k1K9j5n7K3J9k0J0j7M0L0k2R
3503B8k1J5m0K7k7Oj0l4M4QkjJ5K0k2j0Oj1k7M4j6%J3j1%Kj2RqJ6j7j7J3K7Pl1
3539a7JL6ll7QjJ1MJ2m0K8J8k4K0Lnqj1nMj4L7rmJlJ1j6k2K7J8j9l3K3lK2j1k2
3577b3K1jj6J4RQk1PKK2l9j7L9qJ7mkJ2lj3j0K3j1l3L0L4k7nj7L5om8N0m2L9m4
$$ y = [-8, 4, 16, 43, 46, 41, -5, -19, -19, -16, -65, -66, -26, -6, 30, 23, 65, 70, 33, 7, 15, -4, -46, -69, -30, -31, -39, -41, 28, 32, 41, 18, 37, 20, 6, -14, -42, -24, -32, -52, -37, 1, 26, 29, 21, 33, 31, 2, -28, 8, -37, -55, -42, -8, -7, -29, 25, 37, 43, 27, 12, 3, 20, -17, -46, -15, -9, 3, -8, 20, 43, 14, -5, 8, 11, -1, -26, -16, 22, -9, -27, 27, 12, -6, -21, -24, -6, -10, -12, -19, 43, -10, -3, 24, 39, 39, -12, 3, 4, -10, -49, -9, -2, 38, 8, 18, 53, 42, 10, 6, 23, -18, -29, -49, -45, -5, -38, -41, -5, 27, 17, 12, 30, 7, -4, -22, -41, -28, -48, -38, -16, 20, 34, 25, 31, 63, 37, -6, -30, -9, -32, -23, -26, -19, -2, -4, 32, 45, 52, 6, 26, 14, -9, -28, -22, -16, -14, -13, -31, 7, 38, 30, 20, -1, 28, 13, -44, -21, -2, -22, -12, -29, 11, 41, 19, 28, 7, 22, -18, 9, -18, -12, -22, -56, -12, -4, -6, -7, 8, 28, 6, -4, 2, -9, -36, 8, -8, -8, 5, -6, -6, -4, -16, -7, -15, 1, -16, -33, -20, 7, 14, -17, -16, 20, 17, -20, -12, -13, -2, 2, 14, -26, 2, 20, -4, 16, 19, 14, 6, -5, -10, -6, -20, 17, 8, 4, 5, 2, 13, -3, -25, 2, 20, 1, -32, -9, -12, 10, -1, -23, -2, -3, -19, -5, 4, 12, -9, -2, 0, 22, -17, -34, 5, -3, 14, 10, 8, 20, 17, 4, -6, 17, 6, -27, 3, 37, 10, 5, -12, 23, 17, -31, 19, -23, 16, -28]
3613b8K4j9J8j2QJ3J1k1j8N3m3J2k9K0j1M0n8K1M4J4m5LM1l7Qk0L2rrj6L5Mmj4
3647H%Nj1j0J3Jk1oJ0j0KK7L1j3j6j1J0m%j2pJ7l5K1J5K8j6qJ4J9l2kj5J5k7M
3683a6JJ2J0nK5K7ok8l6K1k3Lj0K3Mnk4L5K7l7kL6Ln0k7lJ0J2J9OMj0kJ5PoJk6
3721a5KK3j8K8j0qL9j7Kqj5qqM7k1j4J4poJNj5K7m6OL0k0J3k3K4J9j5lj1Nj7K1
3758AKJ1l6J7K9Ol7K0OK0l9j0n%K3k4K7QPm7N6J6o7mrK5Ml0K0j8MOL7K5k1j8p
3795bmj6k0L5k1J8L1l5J7L8l1j7J2KJj1mLk0J3QK4Kj6K7k2Qk2nK6m2KJ8J1J4m5
3831b3L0jk3J0J%k9j8K0K0LOJ4K8l3O%L0m5K0j0R%k0l0N8j9Lj0pQM%l0N0k8Oj4
3869a4J3J4l5l3L7Nj0J0kjk7M2L5m1OJ4mLj6J2J1k2J8k6K2J4Km9L6jj7pKJ4j3
$$ y = [-28, -4, -23, -5, -17, -9, 4, 15, -6, -24, 29, -14, -2, -31, -11, -22, 18, -40, -19, 25, 39, -6, -3, 38, 1, 9, -11, 21, 12, 3, -13, 22, 26, 22, 8, 8, 13, 2, -8, 5, 6, -15, -21, -11, -21, -19, 8, 39, 26, 10, -1, 9, 5, 5, -7, -14, 3, -32, -11, 4, 32, 16, 8, 22, 41, 9, 7, -8, 7, -20, -16, -15, -3, 7, 2, 27, 54, 48, 20, -16, 5, -18, -15, -25, -2, 2, -3, -27, 8, 35, -2, -4, 32, 35, -15, -42, -45, -35, -23, -4, 2, 6, -4, -6, 9, 16, 10, 11, -15, -13, 10, -8, 20, 10, 2, 41, 24, 26, 18, 3, -5, -13, 34, 13, -1, 13, 6, 0, 1, 6, -9, 18, -28, -22, 8, -12, 1, -22, 2, 21, 6, 3, -8, -3, -20, 1, 3, 14, -22, -5, 24, 30, -7, 13, 19, 39, 0, -10, -15, -15, 8, -16, 11, 19, 26, -21, 35, 51, -16, -20, -29, -4, 0, -30, -10, -28, -24, -18, 19, 44, 23, 5, -2, -6, -22, -42, -7, -28, -10, 21, -14, 3, 41, 10, -7, 5, 7, 8, -3, -7, -4, -24, -11, -3, 21, 23, 7, 34, 12, 20, -2, -7, 19, -23, -21, -3, 8, 22, -23, 7, 6, -17, -7, -6, -6, -35, -53, -33, -13, -10, -4, 10, 38, 5, 11, 11, 41, -4, 16, 6, 15, 15, -5, -35, 23, 4, 7, -3, -10, -2, 2, 2, -28, 22, -6, 0, -14, -1, 13, -22, -55, -18, -13, -23, -13, -15, -16, -43, -1, 34, -7, -1, 13, 9, 12, -4, 8, 19, -3, 15, -11, 11, 25, 27, -22, 14, 13, -4, -11, -9, 5, -8]
3904hk0J8L5j8j7jJ6oj5k1J5J3Lm3M6JlnJ0M5o6pL8Jj3k0L0j1RPj5j6L8k4RK2
3940B7k4JOqj2j6L4Jl4J0K1J1k7Ok1J1J8mm5J6M2j2k8J7N%LLrj1QKPONrL2m2K4
3979A4k4L2mk8QL5k9J6nlnQk8rQPj4K4jk9j1L5Qj8OLJ6l1oK2oqj2J9K3j5%J6l5
4018b1K5Pj9J6oJ1j9J9Mj5K6Oj8j4l7PM0l9J4oK0J1k2k2N1l1Nj1mlPJKkK3qj0
4055a2J0kL0rqk3RQj6J0rMJ1kRj2J5J7l8K8k7j2K4k3MJ4MJ3lj8nOLOj6j0J4J0
4093Dl0L6k1%JJ0L8l3OoJ2j7m2M1jK5j1m3O8l6K5l4Nj2J0%j7J3K9m7K4pj7kRL1
4129A1Pl6J5kJ3J7j8j6Pj4RJJ7k9QOKqJL2j9K2o%j0j5J1JpJ0rMKl0jK2K3ml6l
4169b2J0JJ3j8K7Lj4j7L7jk2MrLJ0KJrjJJ1j5%j2L2k3K3pnJ2j4L0k1J2pl7K5l9
$$ y = [-8, -28, -10, 25, 7, -10, -11, 5, -1, -16, -37, -22, -9, -6, -49, -3, -2, -5, -10, 0, 45, -21, -28, 10, 11, -2, -22, 8, -3, 6, 13, -2, -18, 20, -4, 5, 27, 3, 4, 10, 2, -10, -26, 8, 9, -25, -15, 6, 17, -10, -4, -25, -14, 4, 0, -45, -29, 13, 1, -27, -10, -5, -5, -2, 1, -8, -19, -11, -9, -2, 4, 9, 0, 32, -10, 14, -10, 22, 18, -10, -2, 33, 4, 20, 15, 12, 7, 15, -13, -22, -14, -7, -21, 3, 2, -27, -38, -3, 5, -13, -7, -4, 12, -19, -25, -3, -9, -17, -29, -10, 13, -2, -2, 14, -21, 4, 11, -8, 8, 2, 13, -6, 13, 17, 2, 28, 34, 16, 2, -35, -28, 12, -27, -13, -19, 1, 12, -10, -32, 19, -12, -7, -18, -22, -25, -18, -17, -15, -17, 6, -2, -12, -2, -4, 26, 17, 9, -14, -5, 3, -13, -3, -12, -8, 3, 1, 10, -2, 13, 30, -8, 20, -7, -19, 5, -18, -14, 0, 4, 17, 14, -4, -9, -3, 0, 6, -10, -20, -6, 4, -26, 10, -11, -11, -10, 0, 38, 5, 11, 5, 17, 0, -42, -1, -2, 23, 12, -31, 37, 1, 26, -8, -3, -15, -5, -5, -22, -9, 20, -27, -3, -10, -27, -29, -20, 11, 18, -18, -3, -5, 8, 25, 7, -9, -2, -16, -7, -6, 11, -18, -10, -4, -2, -10, -9, 23, 4, 26, 20, 20, 10, -5, 6, 7, 0, 10, 1, 5, 7, -23, -24, -2, 21, 17, -19, -22, -12, -11, 2, -16, 11, 14, 0, -17, 20, 19, -3, 1, -8, -5, 5, 7, 8, -1, -2, -1, 10, -5, -5, -17, 15, -8, 15, 8, 3, 15, 1, 31, 10, 22, 15, -22, 3, -36]
4207c6M2lk4KL0j2nk3K2j2KJMRkL7j8qpOJQj8m3P5l7nmJ6J5k3K7Kj4mQj5J5j9
4246a0Rk4rJ4J0K2j0jkj4mJ3j1j1J3K3Mj6j7K8nj3Lj1K1lJ9l4QJ4K5l8K0J2j1
4281A4mqj4k0M0l5K4RnLj3J0j1L3l3L0k1l2J8K1J9m0j0J2L0j5j7L9j3j7rK3mM
4315HL%J4j5l%K1l2jKJ9Lk1JPJ0j9nJ4j7NJJ2k3rJ5oK3rqj3L8k1Ppj6J9j6LM6
4355C0k3j2Nj5J7K2k0lj6J1qK0%l2rJ9L2l4PJ4Pj0m3K5KMj7J2jj9L6K7l9Pl1K9
4391fK8k0MQl7K7j0K4mj5L5l8J6L8l5KJ6k1j6oK7jqk2J7pJ5Lj2j5L1k5Pj0K3j4
4427aj1J5j4kj5K7j4k2O3pj3qnJ4jJKLj2K2k4Rmk5J2K5j3Ljj6JJ0l7L8j2J9Rr
4465Gj0j7J1QJ2l6K9j9J2J8k0MJ3kmk6L2Qk5nJ1J3k6J4K9k8K1nkQl4kPJ2nOk6
$$ y = [-36, 6, 3, -21, -19, 11, -1, -6, -29, -7, -19, -17, -16, -12, -3, -5, 32, 14, 6, -1, 5, 6, 14, -4, -47, 28, -9, -14, -18, -2, 13, -10, 17, 19, 5, 1, 9, -6, 9, -10, -1, -25, -34, -20, -10, 12, 2, 1, -1, -15, -19, -6, -17, -28, -15, 8, 12, -4, -21, 7, 2, -11, -8, -19, 2, -1, 18, -16, -8, 6, 31, -7, 13, 25, 14, 10, 2, -12, -32, 8, -27, -3, 6, 1, 4, -9, 1, -10, 23, -10, 20, -1, -33, -15, 6, 25, -15, -25, -13, 17, 2, -15, 24, 11, -6, -15, 8, 4, 8, 11, 11, 25, 10, 7, 7, 28, -4, -5, -3, 16, 19, -2, -1, 6, 16, -3, -8, 6, -11, -6, -5, 7, -16, -25, -10, -16, 7, -2, -10, -23, 15, -6, 1, -6, -22, -3, -19, -16, 30, 7, -5, 0, -15, 2, 24, 4, 1, -15, -4, -12, 8, 8, -24, -33, -14, 18, -16, -9, 5, 12, 2, -41, -16, -14, -10, -27, -15, -16, -35, 1, 28, -11, -4, -35, -6, 22, 2, 6, 14, -23, 4, -6, 18, 14, -1, 34, -4, 12, 50, 15, 17, 33, 12, -4, -10, 17, 16, 8, -14, 3, -4, 11, 14, 2, -13, 18, -7, 0, -10, 13, -1, -12, 3, -11, -13, -28, -1, -15, -37, 26, 19, 6, -2, -7, 7, 6, 7, 9, 12, 0, 22, -2, 7, 3, -22, -10, 15, 2, 5, 4, -12, -11, -1, -38, 0, -12, 7, 16, 7, -3, -20, -9, -1, 11, -25, 4, -15, -3, 15, -5, -1, 12, 10, 6, -20, 12, 20, -5, -10, 1, 14, -12, 2, 31, 3, 24, 19, 17, 25, -9, -11, -4, 8, 3, 9, -17]
4502a7J3LJj0J4Lj4jnK0qoOojj3L5%mM2l5k0J7k3J4K4m1K9j5M3l3ppK0kRl8J3
4540@K8l6J7q%lJ1j8K0k6nL7k7lj1M5k5OlJ5Pj9mOmnJ4J0NrJK1ll1pJ1K7k4n%
4580EmLJ4k0J8l6ORQjj0K6m4K1kpmK6k8J4lj0lj4P0j8k8L8Jk7Lkk7J4J2nOjLN
4620HMj9Qj5K2j3Ok2K9j3K5k3JK0k1j5mL2j2jPj9k0K3rJ6J1k8L4l0L1j8J0j3M
4655dK2k2J0k0L0k2L2j8J1j6JKk6L1j8J7j0J0olQk3OJ1NJpj3OK2k1l7O7k7mPj4
4692a2L8l9J3LJ8j0j9J7rPOnj5jL0k8KnK0j8J4k8K0oj1J7j8J4lJ1rrqlJ1K6l0
4729a9L4j4k7lJ9j5K1mJ2Ok2QK2J2kk9K7k0ll4L6k7K0L2rk7J1Ok1J4Ql1K7l6K0
4764hj3J4MjJ5j2rNj0J4MqK1j0l2L9k2L5l1J3K6j4Nnmj9J7qJ7j8Lk6J7NJ9k1J7
$$ y = [-17, -4, -1, 0, -10, 4, 7, -7, -8, -13, 7, -1, -7, -1, -7, -8, -21, 14, 14, 10, 52, 17, -3, 14, -9, 5, 29, -12, 17, 2, 45, 12, 5, -2, 18, 16, 25, -13, 0, 28, -8, 9, 1, 1, -2, 9, -9, 11, -15, -20, 17, -10, -13, -24, 21, -4, 2, -1, 14, 21, 2, -2, 4, 0, -5, 9, 19, 24, 15, 16, 37, 34, 3, -4, 7, 34, 10, 5, 5, 1, 4, 18, -2, 16, -20, -14, -5, 3, 2, -8, 18, -26, -5, -7, -14, -18, 8, -20, -6, -9, -19, -22, -36, 34, 16, -12, 26, 27, 0, 3, 1, -26, -12, 0, -5, 1, 0, 3, 8, 12, -7, 1, -14, 8, -5, 1, -21, 8, -5, 20, -3, -2, 18, -3, -18, -22, 10, -2, -3, 4, -15, -35, -12, -21, -5, 6, -22, 12, -18, 13, -5, 5, -8, -4, 18, -4, 6, -14, 16, -6, 26, 8, 19, 3, 4, 6, -20, 11, -7, 10, 0, 10, 4, 1, 9, -14, -8, 3, 8, 9, 2, -11, -5, 17, -4, -41, 26, -1, -5, 2, -12, 26, -13, 0, 3, 21, 11, -8, 9, 0, 7, 13, 8, -7, -8, 22, -6, -4, -9, 11, -7, 7, -21, -1, -7, -18, -1, -19, -5, -8, 3, -6, -15, -23, -26, -15, 11, -19, 15, 1, -26, -29, -10, -25, -4, -8, 4, 10, -12, -4, 18, 30, 28, -1, 26, 6, 3, -31, 5, -22, -2, 30, 21, -6, 5, 11, -10, 4, 12, -19, 8, -28, -8, -21, -7, -3, -4, 11, -1, -10, -5, -15, -1, 3, -5, 16, 6, -26, 13, -9, 26, -5, 8, 34, 20, 25, 20, 16, -3, 14, 6, 23, 5, 8, -18, -1, 4, 23, 2, 19]
4801A9j7j3lj9LJ4J0rOQNrK2j9J1l6K3K5m5L5J2j9L0k3kJ4rj4Pj4MK8ok4NJ0k2
4838a2j2LJ7Nj6nmJ0oJ4mNlL5l0oj5J2k5L6j8K5j2rK5Qj2K0ml5N2l1J3ok0J7M
4875A6j4K1k3J0J0k5J4k0J3j9K7k0MK2m7L6j0JNK5m0Qj4J1mJ4rJ6m4P2j5j6Nk6
4909a6J8k3K6%kJ6k0Jj5K2jkJjrK8j7ojj9L4j1rj7K6k6rJ2K7j5j9M1rmk2K6k4
4946a9J3KKJrJ2OJ8l9K0lJ5l4K5k2K1NJ0j5j6Nj2K1lj2j2K6Kk4%Qj7J8Lj1J3k0
4983b2J0RNOJ7m1NK5j7NQJ3k1lJ0J2n5M0J2pLk0J2kQm%l9K1mmJ9k2%L3l2NKK7
5022A4m0%L4j7lJ7k5L2oJ2lj3rJ1j6K0Qk5K1j4J1j4K7j5J4j1Prj0K7j5%rj8KJ2
5058cj8K5l5KK7k6L3k1J2j5K2j6jK5lj8jQqJ4j3PKK3l8J3mK0r%Mk0K0Mj4mOnK2
$$ y = [19, 2, -11, -14, -33, -30, -16, -6, -15, -9, -1, 4, -5, 17, -2, 9, -27, -4, 21, -24, 11, 23, 4, 34, 11, 9, 23, 14, 0, 7, -7, -3, 25, 19, -5, 0, 10, -12, -24, -21, -4, 1, -15, -20, -24, -14, -20, -6, -10, -5, -8, 27, -3, -9, -24, -12, -37, -1, -19, 6, -6, -15, 10, 18, 6, 26, 22, -13, 39, 8, 21, 15, -5, 12, 16, 2, 23, 0, 10, 20, -5, 9, -11, 2, -17, 10, -10, -6, 16, -31, 5, -5, -4, 1, 26, -14, -6, -20, -9, -13, 1, -8, 8, -36, 36, 21, 5, 10, -16, 2, -21, 5, 5, 3, 19, -1, 0, -15, 7, 6, 4, 5, 4, -5, 23, 6, 0, -1, -20, 14, 3, -6, -23, 3, -23, -32, -20, 7, -8, -27, 14, 5, 1, -21, 5, -19, -6, -4, -2, -1, -10, 2, 8, 26, -13, 7, 4, 19, -15, 10, -12, 9, 14, 24, 9, -7, -2, -14, 7, 4, -8, -20, 6, 8, -16, -16, -8, -25, -7, -4, -15, -2, -22, -12, -3, 2, 8, 25, -16, -11, 14, -3, 2, 10, 23, 2, -1, 9, 21, -34, 6, 18, 11, 14, -6, 6, 4, 12, 8, 8, -31, -10, -14, -18, 1, -21, -21, 12, -20, -15, -13, 14, -26, -26, 8, -9, -12, 5, -20, 12, 6, 18, 15, 2, -7, 4, -12, 8, 16, -9, 12, -2, 9, -5, 22, 7, 21, 10, 17, 8, -2, 25, 10, 10, 1, -17, -15, -3, -21, 4, -31, -29, -2, -28, 5, -16, -4, -19, 3, -13, -14, 11, 8, -10, -11, -3, -11, 3, -10, -3, -1, 22, -16, -3, -7, 13, 4, 4, 8, -12, 8, 12, -2, -6, 0, -5, 17]
5097A7lk2MK0k5jQpQlj1MPKolL1j2j0j5L1%k7J1J0J9l6K1j1QrQJj%Rl1L2j4Nj9
5138a0J5K8m2Mj6J9k2M4Pn5K7k3KPkK4pLnrJL0k5kJ6j8K7j5J3jlKPqj8j8K5or
5177a3L8l3J1KqJ3jk7OK9Nj1k9jNrMJ8pk1J5K7k1K0JrJJ4k0L4k7J1j7PJ2j6J4
5214A7nj2j0M0l3M9n0nJ1j8Lj7J5j6J3j3M4k3plK6Nlk7k1L9j4MK2mnjJ0J6oj8
5250CL6k7k2K5j7N3m6oKjQj2J1l6K2J2j3j2K3k6J3J3j3J4Pkj4j3j5L7k5mPKK1
5285Ekl5O2jj8pj6pL6J0j1j5jNK1J4m4J0j8%k8LN8k2j8K4j9koJ3%Kj9J8LJ3j2
5322doj6J4NJ8l0j0K6J6J5m5K1J2Mk3J6J5l6NK5nqj5M1ok5K%J1Nn6L5qk4LOK9
5359Gk5K5k8J1J1j1oLJ4j6J1rM1l2k1N4k5Rj2L4k4Nj2LJ2lqMKj8Oj3M7n3j0LJ3
$$ y = [17, 14, -8, -4, 16, -9, -10, -2, -9, -1, -4, -15, -11, -4, -2, -8, -11, 20, 8, -2, -17, 14, 14, -13, -2, 8, 27, -9, 12, 1, 9, 0, 8, 9, 8, 8, 17, -14, 18, 4, 9, -10, 5, 33, -9, -5, -21, -2, -24, 20, 27, -28, -1, -24, -22, -15, -17, 7, 0, 3, -2, -11, -10, 20, -5, -7, 9, -9, 18, 3, 16, 15, 12, 14, 21, 13, -5, -23, 2, -4, -13, 25, -8, 3, 5, -3, 10, 9, -18, -12, 17, 22, 11, -18, -19, -14, -23, -19, -1, -8, -29, -14, 13, -8, 12, 13, 4, 5, 19, -1, 33, 6, 17, 0, 7, 19, 3, 17, 12, 0, -10, 30, -3, 46, -4, -9, 2, -16, -13, -30, -15, -31, -18, -31, 13, -10, -17, -20, 6, 11, 8, -19, -40, -1, -15, -11, 11, 7, 2, 1, 11, 27, 21, 3, 39, 12, -10, 15, -2, 51, 5, -1, 1, 0, 8, -4, 7, -29, -7, 5, -8, -20, 3, -23, -10, 3, -10, 4, 11, 9, -5, -18, -33, 4, -21, -25, -18, -16, 5, 3, -32, 30, 29, 11, 4, -12, -19, 17, 27, 16, 1, 0, 5, 26, 40, -4, 6, -12, -12, -40, -37, 21, -1, -19, 5, -14, -16, -22, -9, -9, -7, -26, -8, -5, 8, -4, -10, -26, -12, -7, 11, -19, -29, -3, 13, 28, -17, 4, 16, 20, -3, 13, 28, -8, -3, 22, 17, 9, -6, 35, 29, 4, 6, 6, 17, 22, -34, 1, -7, -31, -28, -22, 7, -18, 7, -21, -10, 1, -10, -16, -13, 1, -15, -4, -13, 28, -4, -25, 29, 4, 13, 1, 35, 11, 16, 4, 7, 19, 16, 8, 12, 14, -4, 2, -11, 36, -17, -27, -24, -11]
5396a1KnL8l9J0qj9K9mk1QK2k7J6K9k1PNj1l6N5j4JmJ6njJ9l8K3rJ7j0K6m7L7
5432C0j8pK0l0J1l3K9j6j1L1k7QL5l4NQj5J%qKK0%j1J3j1J6LKk7OJ1NKn%j3KL0
5471B4j8j4L1k7J6jj9rK6qK6m4PK1km1J9J1j6KK5%j6j9JK8MJ1n8N6j3NjRJ0j0
5507A6oj9K0njJ3k6J8QJ0l7%J8kNk1j8K0J1j9OoJ3oj1K5qJ2Kj7J5k9M5k5j2lJ8
5544DJ2j9J0NRj6j2K6l8L3k4J7J3J5j9l0Rj5J3PJ8j8pJ4rpj1MpK1j9PJ7j3J5p
5580bLKjj9J6JJ5m4L1J1QrnK0j2mkj9KJK3j5lPMj9J2k6L6j3k8J0J2J7j6j1J6k7
5618b8oPQJ3pJ7rOl0L3j7J5Nk5J8J1QJ8k7rK7k5PPrj3Mj1K1j2k7J5NrJ8J3k6J2
5656bmj4KJ3Rj4J2j3nj9M2Jk4K7j4PK1j6lQj5K6Nm4J5Kj8K3Oj8J2k0K5l3JJ7l
$$ y = [-11, -9, -14, 24, -15, -5, -13, -32, -3, -7, -28, -20, 2, -25, -9, 20, -1, 6, 11, 0, -36, 19, 5, 6, 2, 18, 13, 12, 31, -7, 16, 7, 24, 14, 40, -7, 30, 12, 5, 25, -5, 6, -27, 2, -14, -25, 6, -21, -13, 22, -12, -7, 1, -14, -13, -13, -21, -19, 1, 1, -10, 3, -8, 8, 11, 13, -14, -8, 3, 8, 10, 5, 5, -8, -6, 24, 6, -8, 23, -4, 12, 11, -8, -17, 9, 1, 27, -17, -10, 11, 9, -32, -13, -2, -18, -16, 9, 9, -7, -26, -25, 3, 7, 18, -40, 16, 3, 8, 7, 16, 26, 16, 10, -9, 11, 6, 5, 18, -8, 10, 18, 28, -9, -9, 9, 7, 12, -9, -27, -7, 4, -15, -9, -15, -2, -8, -19, 6, -2, 10, 12, -5, 10, -19, 26, 1, -11, -14, 4, 16, -3, 7, 12, 21, 5, -7, 19, -19, 14, -10, 7, 20, 35, 16, -14, -5, -20, -7, 0, 18, 0, -7, 7, -2, -9, -20, -16, -23, -2, -21, -14, 3, -10, 5, -2, 1, 3, 2, -17, -1, 0, 15, -29, 2, 13, 21, 12, 7, 27, 15, 11, 9, -10, -8, -7, 16, 1, -2, 5, 9, -10, 2, -24, 12, -1, -29, -19, -7, 10, -6, -17, -1, -28, -34, -27, -19, -6, -13, 4, -5, 1, -29, 4, -13, 2, 7, -18, 0, 11, 19, 37, 10, 1, 28, 3, 10, 17, 8, -5, -1, -12, 9, -3, -30, -15, -10, -19, -1, 12, -14, -2, -6, -20, -18, -5, 4, -10, 2, -11, -16, -35, 7, 8, -16, 11, -3, 4, 25, 9, 6, 14, -1, 25, 30, -14, 1, 3, -15, 8, 14, -4, 8, -12, 13, -20, -19, -2, -5]
5693emk9%KJ1J9oJ8j1jNjm1N4k9K5k4OPJ7l0J7joK0nNqQJ8nl1K6k4J3k5J2Ql1
5732b6J6mJ6j6Oj5NQl0RQK1Nk5L9j5Lj2Oj8j5K7j5J0K3J0m0J3LQLJ1j4J5l1L0
5768A9j8%nj7K2mjj6OJ1%J2k9L5k4NK4m5nOnK5pK3j4KLJ4k4J9LJ0m5k0L3K0k1
5805hQmJ4l0J3lJ8k3J5nnJ1j1j0J1K8k0j7J0qKK3k2nJ0J3j0qK1k2RPoJ9k0nPP
5843DmJ5pPj2oLKrK3l1J8j4J7j8rJ8j9K0oqNqoJ0OnPK6m3K2Onj8K9rJ0k7J6J4
5883A4J4k4j9N2l9kJ4J5L%l0j4K0j5L2k9RpKnoJRrJ4j3om5N3qJ5Pjqk2J9oK4k
5922GOnKl1J2J8j6J1J6rkJ6k4K1k8k0L0J5qj9J4J4J8n1K2k3J0J0j9JJ4lm5K8J7
5957aNk0K3k5KL3j1Nk1K3qmqMRkOj5NK8m3K1K2k5J7llKrk0J2K0k1j7jJ2l3L4p
$$ y = [-5, -9, -38, -38, -36, -25, -6, -12, 6, -5, -6, -1, -2, -43, 11, -18, 7, -17, -11, -4, 13, -17, 0, -1, -7, 13, 8, 13, 5, 13, 31, 26, -5, 21, -3, 10, -15, -3, 5, -26, -10, -14, 2, -14, -8, -23, -18, -10, -40, -31, -23, -2, 3, -22, 17, 2, 5, -7, -1, -19, -34, -7, -22, -12, 11, 21, -19, -6, -3, 5, 8, 19, 5, 20, -11, 19, 1, 1, -4, -21, 1, -3, -4, -20, -14, -3, -3, 9, -20, 15, -9, -4, 20, -25, -30, -24, -29, -4, -11, 12, -2, 0, 3, 17, -7, 12, 15, 25, -20, -40, -7, 13, -8, 0, -4, 10, -20, -7, -10, 8, -15, 0, -5, -10, 1, -10, -20, -9, 19, -1, -18, -8, -16, -14, 9, -13, -18, -8, 5, -5, -13, 8, -14, -5, 2, -4, 15, -5, -10, -3, 4, 0, 15, 8, 15, 3, -3, 0, 2, -7, 16, -15, 3, -11, 6, -12, -21, -3, -22, -2, -8, -16, -11, -19, -25, -15, -9, -14, -7, 19, -24, -2, 4, -1, -19, 10, 1, 11, -16, 0, 14, 28, 4, -15, 37, -2, -4, 10, 25, 28, 28, -2, -16, 4, -11, 21, -8, 1, -6, -4, -9, -15, -14, -5, -14, 0, -13, -19, -64, -11, -19, -4, 3, 2, -6, -28, -9, -15, 9, 7, 13, 8, 10, -21, -9, 9, -7, 4, 20, 11, 9, 25, 1, 22, -6, -26, 4, 19, 11, -8, 6, 20, 38, -13, 9, -14, -4, 6, -13, -12, 2, -1, -46, -18, -1, 4, -16, 7, -18, -16, 17, 6, 11, -10, 13, 5, 1, -7, -3, 6, 4, 10, -5, 0, 28, -15, 6, 28, 3, 20, 17, 14, 16, 7, -13, -1, 19, -2, -19, -20, -8, -41, -7, -14]
5996a4j5lJ3kpK7Kj9J3k6O2k9oL3l2JJ1jj3LmL0k8K4j5%j4K0j1J6Jl2oKOlPj7
6034b6J2J0Jprj3J0KPk2M1nj5j2J9J2k3J3J3OJ0Lj3%k2mM3qk9J5J4j7j9J8J3l8
6070b0K3nPk8Jj1MJ3lj2Mj0K6j3J0Kj4j2L2OK2Kn6M6l6J2KK1Om0J3KJ5J2k0J1
6106A2l0L4j4J5j3nJ8k4%K8k7Mk7j4L6l6K3Ok6M4rqolMj2K0oJ4j1L6j1kk4N0m8
6142a2J7l1M1j5J3k3J8Rk9K9j6J0Nj7Lkok7L0kj5pL6j8J2MnJ6k0j1Rjj6L6j4l3
6178c2%M1j6oK8kKk2LK3j4jjKrK7j5m0MJ5pK0j5J5j5k6J6J6k9L8l3J3lJ5k8L8
6214Bnj8NJM4l9lJ7rL0k3K5l0oNJ6orJ2rr%LONkLpknK2k3Ok2rK5nJR%j3PJ9rJ
6259AJ3Jn0L4j2RK0k6K5K6l9K0k3L0kl0oK9j6j4J8k8PK4l6M6rk9J4j0j9J8kJ3
$$ y = [-14, -29, -32, -19, -21, -28, -1, 1, -18, -5, -31, 31, 2, -4, 29, -3, -2, 9, 8, -5, -2, -6, 24, -4, 20, 5, 5, -9, 11, 0, 16, 17, -15, -21, -19, -13, -16, -9, -26, -14, -4, -3, -10, -19, -32, -22, -20, -13, -35, 6, 1, -14, -26, -7, 5, -18, -5, 8, 14, 24, 27, 14, 14, -8, -12, 31, 23, -6, 9, 23, 6, -13, 5, 18, -20, 3, -2, 5, -23, -22, -33, -29, -16, -19, -31, -27, -37, -11, -24, -14, -12, -26, -38, -6, 0, 22, 24, -32, 14, -22, -10, -8, 13, 19, -21, -8, -6, 9, 21, 1, 12, -18, 16, 2, 17, 4, -1, 17, -7, -7, 21, -6, -2, -29, -43, -7, -43, -20, -14, -40, 4, -5, -13, -19, -22, -18, -30, -10, -16, -2, -13, 23, 12, 10, -14, 36, -12, 5, -26, 15, 0, 13, -10, 8, 17, -12, 17, 1, 11, 16, -1, 2, 0, -6, -33, -3, -5, -20, -27, 9, -9, 3, 7, 2, 18, -2, -13, -4, -5, -21, 15, 1, -32, -32, 9, -7, -13, 15, 13, 15, -7, -4, 19, 5, 4, 3, 5, -4, 23, 8, -32, -28, -13, -20, 0, -15, 0, -15, -41, -25, -9, -38, 0, -33, -20, -23, -8, -36, 2, -3, -21, -16, -15, 29, -10, -13, 4, -5, 25, 2, 27, -3, -9, -4, 12, 6, -3, 9, 0, -9, -9, -6, 0, 5, 3, 6, -1, -3, -8, 14, -9, -3, -25, -34, -9, -14, -13, -4, -4, -17, -10, 9, 0, 1, 14, 15, -35, -1, -13, -4, 16, -10, 15, 41, 2, 22, -1, 29, 27, -3, -9, 20, 4, -10, 8, -20, -13, 11, -25, 21, 12, -17, -3, -13, -32, -14, -16, -3]
6293ck1j5K8j6K7l4M1K7m8lJ4kOj2lJ2K2j2K2m0QRK5J4l9J7l0K0j5j9K8mK4n8
6327c0J0Qj4nJ4j9J2J5j2nJ3Kj7K4jJ4k9L8j5j1K3J0k6K2k4J3j4M0l6J4J5j6k2
6360iPrK3Ok2NmK6%k1Jm9N2km5L2j1oK6m8M6qmK0Jk8kJ4j1J5J0Ok2J4J0j3J0j0
6398@J1oJ9k0J6J1l3Lj5MoJ3NjJ4j7L2m7%JJ5k2J5qJ1OLQl4K0rmL1k3MkL1mjk4
6438cj1L2j4J9Nk2J6j3J5Jrj4j5Oj3JjJlOlJ5ll0K5j3nJ7Jk4J0J9LPj5K5k4Pj
6477eNnL5k0nJ9K5k6l4M6qk7j1K1kj0Rj0qJ4oJ5kl5J4on%Pjk4L6k1K0j1PkJ3l
6516aJ1jj3J4lK8k9J3j9QK7m0N6n0lK%j7J0K3l1K6k2k6J3K1j0lj7L5joqL2m2K0
6552ck4K7j1J5j6RKoK3pMJ1j8mJ5k3PjJ7j2J8J0j7J%k7Lj6K6pPj6mK2k9J2K9j1
$$ y = [-3, -24, -39, -11, -27, 0, -34, 7, 34, -14, -17, -3, -5, 1, -11, -14, -2, 20, 8, 30, -10, -2, 7, 32, 46, 7, 24, -6, 14, -1, -20, 8, 4, 28, -30, -20, -12, -26, -31, -17, -36, -24, -9, -21, -26, -13, -11, -28, -4, -5, 9, -20, 18, 3, -8, 15, 25, -1, 21, -3, 10, -4, 36, 0, 14, 29, 13, -9, -2, -11, 12, 18, -4, 1, -3, 23, 23, 2, 3, -46, 6, 4, -41, -9, -20, -26, 0, -48, -2, -10, -14, 6, 7, -21, -23, -9, -20, -5, 5, 11, -11, 3, 13, 0, 10, 0, 11, 5, 24, 4, 20, 31, -2, 1, -14, -10, -16, -3, 2, 1, 15, -2, 30, -17, -17, -16, -1, -23, -8, -16, -5, 1, 4, 12, -22, -2, -11, -15, 16, -7, -3, -5, 26, 22, 21, -3, -14, 18, 4, 23, 28, 6, 22, 9, 24, 25, 16, 2, -13, -7, -20, -19, -20, -19, -22, -16, -19, -4, -7, -37, -12, -25, -30, -13, -12, -36, -26, -7, -4, 3, -12, 13, -11, -4, -5, 0, -5, 30, 10, 5, 24, 49, 23, -11, 35, 27, 0, -11, 10, 8, -2, 7, -3, -11, 3, -3, 12, 10, -25, -11, -17, -22, -22, -15, -16, -40, -4, -25, -5, -16, -9, -11, 2, -1, 10, 9, -4, 10, 7, 35, 6, 19, 0, 8, 35, -5, 51, 1, -2, 0, 0, -17, -7, 16, -15, 11, -11, -37, -24, -3, -13, -16, -33, 2, 1, -5, -13, 19, -23, -3, -27, 0, -11, 4, -12, -3, -1, -7, 16, 9, 13, 24, 6, 2, 17, -6, 1, 0, 17, 5, 23, 33, 16, 17, 17, -10, -7, -23, 3, -4, 3, -13, -17, 5, -24, -12, 17, 6]
6590Fl1Qk6K9LK7l6KJ1JNPMk4J9j9j3L2j0J8Mj0K3j6j0pJ5lnrK2j5kjMl4J9pl
6629b2K8k7K7k1nj2K9k1K8j4J4JKoLk1J6k2J8JJ5rj6K8J7j4oJ3lj1k7QK1Nm0K5
6665BJQjk1Jj2K8qJ0l5K6mj3J8olj7KK4mOk4J6OPKk3K8JQnK6k7rk0J3J5k3M0k7
6705F%JqqKj2lMk9L6Nj3mOOJ6oj5LJ6j3J3Oj1lJ9Qj3J9pRm0J9j0PJ7K0l1k6K9
6745A5j0LJ5j4k9K4k2qJ6Roj1MJrK5k4K9l1J3Qlj8J4J1%j9J9qrK0Kj6J6K0k1L
6782Ij1LJ7j6Oj1JL3m4J8j6J1pNKm0O7k4rj1j1K1Pl1J1Q%J6qk7K5Pj3J8qK1k1
6819bJ8kkkJ5k8noK2nJ1Lj6j9K7j5K6m4K6k5MNoJ3l7N6n7K1Qpj0J7KRJ5lj5OK5
6858B3j1j9M2k5Lk3J6rK6j1j5k3N6k5Pj8pmJ4Nj2L1J2n8L1k2J1k5lJ4pjK7nj6
$$ y = [6, -25, -17, -43, -14, -11, 16, -20, -18, -7, -6, -1, 6, 10, -14, 5, -14, -27, 5, -5, 13, 17, 7, 30, 14, 4, -3, 12, 9, 4, -5, 17, 2, 0, -1, 3, -31, -12, -19, -22, 6, -21, 6, -15, -20, -32, -3, -24, 4, -10, 4, 5, 7, 1, 4, -17, -1, -23, -5, -4, 11, 2, -14, 14, 31, 17, 11, 24, 21, 10, -17, -9, 12, 17, -23, 2, 3, 11, 10, -11, -10, -22, 6, -2, 8, -27, -1, -5, -18, 0, -6, -9, -26, -24, 0, -4, 2, -22, -6, 0, 7, 9, -14, 14, 15, 23, 18, 44, 17, 8, -12, 1, 16, -7, 33, 6, 6, 7, -1, -9, -7, -19, -22, -18, -47, -11, -6, -19, -23, -17, -11, 5, -1, -16, -13, 3, -10, 3, 9, -2, -5, 14, 22, 9, 28, 21, 30, -10, 9, -1, 6, 23, 43, 12, -14, 15, 5, 8, 23, 9, -20, 4, -18, -26, -10, -1, -7, -18, -14, -13, -22, 3, -21, 8, -23, -10, -2, -5, -23, -9, 2, 2, -17, 2, -6, -15, 5, 7, -9, 7, 27, 6, 9, -2, 1, 18, 2, 8, -3, -2, 31, -13, 5, -11, 0, -7, -2, 0, -40, 27, 3, -6, -17, -28, -7, 0, -31, -20, -12, -12, 4, -4, -31, -6, 1, -12, 6, -2, 19, -2, 16, 14, 12, 10, 25, -3, -8, -14, 8, 3, 14, 17, 1, -18, 9, -6, 20, -24, 2, -23, -19, -14, -20, -7, -44, 12, -45, -24, -16, -23, -33, -16, -14, -5, 10, 7, -8, -2, 23, 12, -7, 35, 10, 13, -10, 6, -3, 23, 12, -3, -26, 30, 5, 12, -6, -13, -17, -3, 2, -10, 21, 33, -25, 6, -16, -5, -30, -33, -19, -26, -27, 0, -5, -21]
6893b1Llj1RK3Ql2L0J8j6mJ1%pq%Oj4J0K3m2J4RJ1J3k8rQj4K4l2j5K1J0nj0l2
6930e2M2j4K1k3L4m3L9J5j4%j7jj7K3J3K1j2pK0j0j9KK0Mj4J2Nl9J9j1kmRj5J
6965a4j8MmN0m4J4J1k9K5j5jJ9Pn3NK6L0j9Oj3J8NKj5RJ6m0M1ol5K4lJ8k1j6K1
7001Enj2LpqL5m6L5Nk3L2k5j8J4Jj4PJ1lMj0K8j9PKk5L0J1pj3J6J2mKm2L9Kj6
7039DL4o0MM7k4k7K4ojJ3j8Rjk9NJRkj2L5l3J8mMqJ6J4k6jJ8QnmRMnKj3J2l0K9
7080A0J6n2M2k6j1K6jnJ7kn0JJ3j1J2PnmK2mKj9j2M4l2oL3j7j2J6pJK2lPJnK5
7118C3j8J0nl3L6J0l0l2J6J7Rj8K0j4K0k5Lk0J3OmJ9n4L5Qj1j7ROJ2qLmk7J3L2
7154A0%l7K9J6mk1QK4J5k4j0LL0k8ok0Mj2Qj3Pk6K7j6L5j7rK1rqNOK1j0k0QJ4
$$ y = [-21, -18, -21, -32, -23, 0, 8, -24, 6, 24, 8, 4, 15, 15, 8, 0, 0, 6, -8, 2, 25, -17, -3, 6, 17, 30, 2, -7, 1, -13, 11, -21, -36, -15, -5, -10, -20, -52, -10, -24, -3, -26, 8, -35, 4, 19, 5, 5, -12, -13, -30, -7, 6, 27, 15, 8, 28, 18, -1, 1, 21, 25, 11, 23, 28, -11, 8, -3, -5, -9, 0, -15, -14, -32, -28, -32, 18, -26, -12, -1, -30, -5, -20, -21, -2, 5, -48, -43, -17, 13, -6, 0, -13, 5, 10, 12, -3, 6, 22, -18, 23, 17, -18, 6, 3, 21, 0, -16, 5, 0, -12, -9, -16, -24, 11, -35, 0, 5, -18, 14, -11, -29, -15, -14, -28, -21, -10, -13, -9, -19, 9, -10, -3, -1, -26, 4, 15, 8, -5, 11, 23, 19, 21, -21, 18, 20, 4, 38, -22, -18, 29, 5, -22, 2, -4, -5, 8, -10, -1, -2, -31, -26, -25, -16, -18, -30, 5, -28, -10, -14, -10, -18, -2, 12, -14, -15, 3, 11, 6, 2, 11, 15, 10, 12, -1, 11, -19, 10, 26, -26, 16, -10, -21, 5, 4, -1, 16, 14, -36, -35, -22, -33, -21, -14, -19, -23, -1, -5, -3, -22, -34, 10, -22, -28, 5, -12, -24, -8, -15, -14, 8, 5, 12, 13, 8, 33, 15, 25, 20, -13, 23, 33, 3, -29, -13, 4, 13, -5, 15, 1, 21, -4, -1, -21, -8, -2, -6, 13, -41, -6, 2, -9, -26, -17, -11, 1, -7, -4, -8, -35, -22, 10, 10, -27, 2, 18, 14, -7, 1, 25, 40, 16, 6, 9, 39, 11, 5, -15, -11, -23, -15, -28, -21, -47, -20, -36, -1, -18, -27, -6, -15, -23, -18, -12, 9, -1, -21, -13, 1]
7191AJ0j3oj7J6KNJ7j1KNJ2opk2J2L2k7j3LJ5j6Loj7K3Pj3lJ6k0j9J6K9l0qlJ
7229c0oK7mk7M0j0k4J5J7J1NRm7L5nlmL0k1J3J0j7jj4Jj6J7kpJ6j9lj1J6Jpkj1
7267b8L0k8M0l2%K9j9mj7J3KRooL3k3NJ1lrJ1j0J5lj7JlJ5j9M4n6PPNJ5k8ORr
7306a3j4J4k0PK2Pl4Rj0KK4j9QK2Ol1J8J7lK5Jm3RJpj1N1l3K4k1Jj4J4J1pk7Q
7343frJ5Lm5L2j8J0qJ0ok4L7Lj1J0J2Ok8MRj4j7M3rk5L5j0J1QJ2k7J8qPJ4k5R
7380A8qJ5m6K6J1j9qJjk6J0mN0l9K0m0QN1m7J1RJ9k8J0oNLKj0LJ4oJ4J2l6K5l
7417A0j3J0MmPk6M6l0mK5m2J6kk2K%J9j7K4j7pmJ3mk0J3J6%Oj6L6njl9J6J4pJ5
7455A2j1K6l2LJPj0J4J7l0KJ8lk9jPj5K3lkonlj6M2k8M%K6m0L3j9K8jj4lJ2k6
$$ y = [1, 11, -2, -8, -25, -9, -7, -2, 15, 4, 6, 11, 23, 17, 10, -12, 0, 32, 5, -8, -5, 10, -6, -3, -9, -26, -3, 4, -9, -12, 4, -16, -35, -19, 10, -20, -28, -31, -30, -36, -9, -13, -40, 0, -10, -34, -19, -2, 9, 14, 23, -24, 11, 6, 3, -1, 29, 8, 21, 31, 14, 13, -1, 0, -16, 1, -1, -8, 8, -11, -14, -25, -9, -8, -15, -17, -28, 2, -26, 14, -18, -18, 11, -8, -12, -29, -16, -14, -5, -11, -17, 16, -7, -2, 9, 6, -3, 8, -2, 13, 10, -7, -6, -9, 6, -13, 31, -25, -18, -11, -6, 9, -19, -13, -4, -13, -27, -13, -33, -26, -4, 3, -31, -22, -32, -30, -6, -25, -17, 5, 11, -20, -2, 15, 12, 37, 38, -5, 4, 5, -2, -13, 38, 5, 29, 8, 9, -5, 9, 20, 13, -14, -6, -15, 0, 3, -42, -10, -28, -18, -26, -16, -22, -46, -9, -6, -17, -7, 5, 11, -17, -13, -4, -18, -35, 8, -1, -26, 9, -1, 10, 18, 30, 3, 21, 13, 20, 34, 9, 18, 10, 25, -21, 5, 16, -3, -11, -10, -11, -37, -27, -31, 19, -20, 0, -40, -32, 19, -28, -17, -8, 11, -17, -7, -13, -8, -5, -3, -13, -10, 4, -2, 12, 24, -12, 13, 10, -3, 7, 11, 7, 14, -12, 34, 4, 0, 25, -17, -1, -3, -25, -23, -23, -4, -21, 3, -14, -21, -25, -12, -16, -36, -23, -7, -7, -1, -17, 19, 14, 13, -26, -10, 4, -3, 12, 1, 27, -5, -2, -1, 6, -4, 10, 27, -3, -1, 17, 14, -15, -16, -9, -24, -1, -4, -6, -12, -17, -20, -36, 6, -22, -18, -18, 8, -32, 1, -18, 10, 9, -5, -8, 4, -22]
7493b2J5J0kk4L1Qj4K0k6J3K8j1k7K0j6K5k8j2LM1k7k0j6L3l2K0Pj9Po%J7olO
7528gj8qM3k2NJ0k5J3J6j4lK1nNJkJ1l5L3m1M5j6j1K5nj4oJ3k4qJRrOj6K5J5l7
7566b9j4PK8l5O7k5LlJ1j3nQNJ2j1K5k8jk1L1qKoK6rnk0K4j5j6OK8j5l1M5m1l
7603b6%M%lpJ1K2j9J3Kj3J3oKj7J3J6kNMj6Qj0M7n5L9j8Pjj9RJ8k1K5j4jJ8k6
7641BrqJ8j7Qj9kPL7l1J5k3J8j7J7K1l3QNJ3k1J1j1J7MQj4K6k1oK2k0k9L0J9q
7677A7j1Mj5k3L1J5l1lJ2%mj6QJ8j3k3M1l6K5l9O3m4J4J8k2K4j0j9J7RlJ0rjN
7712ILK5m7qL8J0j5j7QjJ5j0j6J5K0j8j1J7k8QKj5jnK0j5L2n2K0kL5jj2J6k2J8
7748A5l1J9K4m6K7J5j9j0K4k1J7pNJj8kJ5rqKJ2Lj2QJ1k8J3Qjj1J5l7J7J0j6J8
$$ y = [-22, -7, 3, 1, -23, 8, 16, 2, 22, -4, 9, 37, 26, -1, 19, 3, 28, 0, -12, -9, 32, 5, -15, -31, 2, -30, -10, -3, -22, -15, -21, -21, -4, -10, -13, -7, -25, -33, 10, -12, -7, 3, -22, -9, 7, -7, -10, 11, 6, 11, 12, 10, 21, -14, 19, -22, 23, 7, -4, 21, 16, 2, -4, 9, -15, -23, -22, -13, -22, -16, -32, -7, 8, -29, -43, -36, -8, -43, 24, -1, 2, -1, 10, -3, -8, 0, 5, 17, 6, 31, 3, 2, -19, 12, 4, 6, 0, 26, 17, 12, -8, 16, 1, -15, -9, 19, 4, -27, 18, -23, -26, -26, -22, -22, -25, -32, -21, 1, -18, -5, -3, -16, -3, -9, -7, -24, -11, 5, 3, 8, 12, -4, 4, -6, 41, -14, 25, 7, 14, 13, -6, 3, 21, 0, 25, 11, 10, 28, 2, -7, -15, 3, -14, -6, -25, -27, -20, 17, -14, 1, -22, -4, -21, -4, 17, -16, -8, -3, 10, -11, 0, -11, 6, 10, 18, 4, 30, 9, 3, 25, 5, -24, 6, 25, 17, 6, 10, -5, -28, 3, 18, -13, -16, -4, -4, -8, -24, -16, 2, -11, -34, 7, -29, -4, -43, 20, -24, -10, 8, -14, 10, 0, -19, -2, 7, 4, 14, 5, 4, 9, 12, 37, -10, -18, 20, 30, 15, -2, 6, 5, 20, 10, -6, 9, 29, 11, 0, 17, -11, -3, -1, -16, -17, -22, -2, -17, 15, -37, -17, -19, 16, 15, 3, 19, -3, 15, -16, 3, 27, -19, 8, 23, 4, -6, 18, -3, 14, 7, 12, 13, -5, -7, 8, -1, -9, -7, 5, 8, -4, 4, 15, -13, 0, 8, 7, -4, 11, -26, -9, 1, -15, 3]
7784Cl7L5%J7mj9L9j5rQjRk9PJ1kPj4MnKj0K3qk2J4j4J2Pk6J9j4%Mj7N0m3oK4
7823@Pnl4L6pm%OLj5J4jlJ3k9J6L5l8K0%j2QK4l2pQQk8K5k2L3j7Mnk9L6nj8K4
7862Ij8j4ML4l6Rj5J5lJ7oQKJ5j1nnKLJ0j3pJ5k5K2j2L6k7Pj9L3k3k7L2j1j6L
7899a7j7J9j0K1j5j0J8k1K6K3l3J4%l0L0K2j3j6J9pJ3j3Mj2K2k8L2K6p4N9j8J6
$$ y = [3, -34, 1, 1, 18, 14, -5, 34, 19, 10, 18, 17, 26, -3, 4, 15, 13, 20, 6, 10, 5, 7, -3, 20, 12, -10, 4, -10, 2, 9, -17, 2, -12, -12, -8, -25, 25, -18, -24, 0, 7, 2, -32, 4, -3, -7, -7, -1, 2, -13, 1, 0, -3, 10, -19, -3, 32, -6, 14, 14, 2, 10, 34, 2, -5, 3, 11, -17, 8, -14, 19, 2, 6, 1, -28, 8, 3, -15, 9, -9, -23, -19, 15, -21, -12, -27, -12, -15, 2, -4, 4, 6, 21, 10, 5, 0, 2, 5, 15, 2, -5, 10, -15, 7, -5, 31, 4, 11, -8, 25, 2, -25, 7, -4, -20, -17, -34, -15, -25, -4, -19, -29, -11, -32, -6, 17, -16, -2, -2, -32, -2, 20, 7, -9, 10, 3, 16, 3, 7, -5, 17, -11, 21, 47, -27, 32, 14, 30]
$$ [...]
8191A2
##END NTUPLES=NMR FID
##END=
