##TITLE=1H_LY-Br-Benz.acid
 CDCl3
 64 sc, 
 5.3.2024
##JCAMPDX= 6.0         $$ Bruker NMR JCAMP-DX V2.0
##DATA TYPE= NMR FID
##DATA CLASS= NTUPLES
##ORIGIN= UXNMR, Bruker Analytische Messtechnik GmbH
##OWNER= root
$$ XWIN-NMR		Version 3.5
$$ Tue Mar  5 14:36:10 2024 Russian Standard Time (UT+4h)  she@DPX200
##.OBSERVE FREQUENCY= 200.1313
##.OBSERVE NUCLEUS= ^1H
##.DELAY= (6, 6)
##.ACQUISITION MODE= SIMULTANEOUS
##.ACQUISITION SCHEME= undefined
##.AVERAGES= 64
##.DIGITISER RES= 18
##SPECTROMETER/DATA SYSTEM= spect
##.PULSE SEQUENCE= zg30
##.SOLVENT NAME= CDCl3
##.SHIFT REFERENCE= (INTERNAL, CDCl3, 0, 15.7039)
##AUDIT TRAIL= $$ (NUMBER, WHEN, WHO, WHERE, WHAT)
$$ ##TITLE= Audit trail, XWIN-NMR		Version 3.5
$$ ##JCAMPDX= 5.01
$$ ##ORIGIN= Bruker BioSpin GmbH
$$ ##OWNER= she
$$ F:/spectra/data/she/nmr/H-F/1/audita.txt
$$ ##AUDIT TRAIL=  $$ (NUMBER, WHEN, WHO, WHERE, WHAT)
(   1,<2024-03-05 14:34:59.43 +0400>,<she>,<DPX200>,
      <continue with go, POWCHK disabled, PULCHK disabled
       configuration hash MD5:
       00 E9 B6 7A A2 85 ED C7 34 08 36 98 17 FE 4E 26
       data hash MD5: 16K
       A9 B5 A5 34 B5 2A F4 03 38 6C 66 8E EC FC EF 5E>)
$$ ##END=
$$ 
$$ hash MD5
$$ 26 63 14 7B AF 96 AA FC 12 9D F8 54 2A 05 3A B8
##$RELAX= 
##$RELAX= 
##$RELAX= 
##$RELAX= 
##$RELAX= 
##$RELAX= 
$$ Bruker specific parameters
$$ --------------------------
##$DU= <F:/spectra>
##$EXPNO= 1
##$NAME= <H-F>
##$PROCNO= 1
##$TYPE= <nmr>
##$USER= <she>
##$AMP= (0..31)
100 100 100 100 100 100 100 100 100 100 100 100 100 100 100 100 100 100 
100 100 100 100 100 100 100 100 100 100 100 100 100 100 
##$AQSEQ= 0
##$AQ_mod= 1
##$AUNM= <au_zg>
##$AUTOPOS= <>
##$BF1= 200.13
##$BF2= 200.13
##$BF3= 200.13
##$BF4= 200.13
##$BF5= 200.13
##$BF6= 200.13
##$BF7= 200.13
##$BF8= 200.13
##$BYTORDA= 1
##$CFDGTYP= 0
##$CFRGTYP= 5
##$CHEMSTR= <none>
##$CNST= (0..31)
1 1 145 1 1 1 1 1 1 1 1 1 1 1 1 1 1 1 1 1 1 1 1 1 1 1 1 1 1 1 1 1 
##$CPDPRG= <>
##$CPDPRG1= <>
##$CPDPRG2= <>
##$CPDPRG3= <>
##$CPDPRG4= <mlev>
##$CPDPRG5= <mlev>
##$CPDPRG6= <mlev>
##$CPDPRG7= <mlev>
##$CPDPRG8= <mlev>
##$CPDPRGB= <>
##$CPDPRGT= <>
##$D= (0..31)
0 1.2 0 0 0 0 0 0 0 0.06 0 0.03 0 0 0 0 0.0002 0 0 0 0 0 0 0 0 0 0 0 0 
0 0 0 
##$DATE= 1709634657
##$DBL= (0..7)
120 120 120 120 120 120 120 120 
##$DBP= (0..7)
150 150 150 150 150 150 150 150 
##$DBP07= 0
##$DBPNAM0= <>
##$DBPNAM1= <>
##$DBPNAM2= <>
##$DBPNAM3= <>
##$DBPNAM4= <>
##$DBPNAM5= <>
##$DBPNAM6= <>
##$DBPNAM7= <>
##$DBPOAL= (0..7)
0.5 0.5 0.5 0.5 0.5 0.5 0.5 0.5 
##$DBPOFFS= (0..7)
0 0 0 0 0 0 0 0 
##$DE= 6
##$DECBNUC= <off>
##$DECIM= 32
##$DECNUC= <off>
##$DECSTAT= 4
##$DIGMOD= 1
##$DIGTYP= 9
##$DL= (0..7)
0 120 120 120 120 120 120 120 
##$DP= (0..7)
150 150 150 150 150 150 150 150 
##$DP07= 0
##$DPNAME0= <>
##$DPNAME1= <>
##$DPNAME2= <>
##$DPNAME3= <>
##$DPNAME4= <>
##$DPNAME5= <>
##$DPNAME6= <>
##$DPNAME7= <>
##$DPOAL= (0..7)
0.5 0.5 0.5 0.5 0.5 0.5 0.5 0.5 
##$DPOFFS= (0..7)
0 0 0 0 0 0 0 0 
##$DQDMODE= 0
##$DR= 18
##$DS= 0
$$ [...]
##$SUBNAM2= <"">
##$SUBNAM3= <"">
##$SUBNAM4= <"">
##$SUBNAM5= <"">
##$SUBNAM6= <"">
##$SUBNAM7= <"">
##$SUBNAM8= <"">
##$SUBNAM9= <"">
##$SW= 18.0517328524113
##$SWIBOX= (0..15)
0 0 2 0 0 0 0 0 0 0 0 0 0 0 0 0 
##$SW_h= 3612.71676300578
##$TD= 16384
##$TD0= 1
##$TE= 0
##$TE2= 300
##$TE3= 300
##$TEG= 300
##$TL= (0..7)
0 120 120 120 120 120 120 120 
##$TP= (0..7)
150 150 150 150 150 150 150 150 
##$TP07= 0
##$TPNAME0= <>
##$TPNAME1= <>
##$TPNAME2= <>
##$TPNAME3= <>
##$TPNAME4= <>
##$TPNAME5= <>
##$TPNAME6= <>
##$TPNAME7= <>
##$TPOAL= (0..7)
0.5 0.5 0.5 0.5 0.5 0.5 0.5 0.5 
##$TPOFFS= (0..7)
0 0 0 0 0 0 0 0 
##$TUNHIN= 0
##$TUNHOUT= 0
##$TUNXOUT= 0
##$USERA1= <user>
##$USERA2= <user>
##$USERA3= <user>
##$USERA4= <user>
##$USERA5= <user>
##$V9= 5
##$VALIST= <valist>
##$VCLIST= <CCCCCCCCCCCCCCC>
##$VD= 0
##$VDLIST= <DDDDDDDDDDDDDDD>
##$VPLIST= <PPPPPPPPPPPPPPP>
##$VTLIST= <TTTTTTTTTTTTTTT>
##$WBST= 1024
##$WBSW= 4
##$XGAIN= (0..3)
0 0 0 0 
##$XL= 0
##$YL= 0
##$YMAX_a= 138087
##$YMIN_a= -174823
##$ZGOPTNS= <>
##$ZL1= 120
##$ZL2= 120
##$ZL3= 120
##$ZL4= 120
##$ABSF1= 10
##$ABSF2= 0
##$ABSG= 5
##$ABSL= 3
##$ALPHA= 0
##$AQORDER= 0
##$ASSFAC= 0
##$ASSFACI= 0
##$ASSFACX= 0
##$ASSWID= 0
##$AUNMP= <proc_1d>
##$AZFE= 0.1
##$AZFW= 0.1
##$BCFW= 1
##$BC_mod= 2
##$BYTORDP= 1
##$COROFFS= 0
##$CY= 11.3945322036743
##$DATMOD= 1
##$DC= 2
##$DFILT= <>
##$DTYPP= 0
##$F1P= 15.7292609196834
##$F2P= 12.9074282941183
##$FCOR= 0.5
##$FTSIZE= 0
##$FT_mod= 4
##$GAMMA= 1
##$GB= 0.15
##$INTBC= 1
##$INTSCL= 1
##$ISEN= 128
##$LB= 0.24
##$LEV0= 0
##$LPBIN= 0
##$MAXI= 10000
##$MC2= 0
##$MEAN= 0
##$ME_mod= 0
##$MI= 1.114404
##$NCOEF= 0
##$NC_proc= 0
##$NLEV= 6
##$NOISF1= 3.799351
##$NOISF2= 2.8
##$NSP= 1
##$NTH_PI= 0
##$NZP= 0
##$OFFSET= 15.70392
##$PC= 1
##$PHC0= -24946.93
##$PHC1= 21.65264
##$PH_mod= 1
##$PKNL= yes
##$PPARMOD= 0
##$PSCAL= 0
##$PSIGN= 0
##$REVERSE= no
##$SF= 200.130013532006
##$SI= 16384
##$SIGF1= 3
##$SIGF2= 2
##$SINO= 400
##$SIOLD= 16384
##$SREGLST= <1H.CDCl3>
##$SSB= 0
##$STSI= 0
##$STSR= 0
##$SW_p= 3612.71676300578
##$SYMM= 0
##$S_DEV= 0
##$TDeff= 0
##$TDoff= 0
##$TI= <>
##$TILT= no
##$TM1= 0
##$TM2= 0
##$TOPLEV= 0
##$USERP1= <user>
##$USERP2= <user>
##$USERP3= <user>
##$USERP4= <user>
##$USERP5= <user>
##$WDW= 1
##$XDIM= 8192
##$YMAX_p= 0
##$YMIN_p= 0
$$ End of Bruker specific parameters
$$ ---------------------------------
##NTUPLES= NMR FID
##VAR_NAME=  TIME,          FID/REAL,        FID/IMAG
##SYMBOL=    X,             R,               I
##VAR_TYPE=  INDEPENDENT,   DEPENDENT,       DEPENDENT
##VAR_FORM=  AFFN,          ASDF,            ASDF
##VAR_DIM=   8192,          8192,            8192
##UNITS=     SECONDS,       ARBITRARY UNITS, ARBITRARY UNITS
##FACTOR=    0.0002768,     1,               1
##FIRST=     0,             0,               0
##LAST=      2.2672688,     0,               0
##MIN=       0,             -174823,         0
##MAX=       2.2672688,     138087,          0
$$ Real data points
##PAGE= N=1
##DATA TABLE= (X++(R..R)), XYDATA
$$ [...]
2551B75N45P26j206J193n91M38n04L08q22n4k29k80q79l06o4k63J297l50l55P14
2571d07r80K298k79k21k99J223N03j252P68j146K65q80o65O43P5p72O07p92m32
2590a743R65o95N96R57L34K68L72N13k01p93O38p34r9o04J18k98N04n10j4l76
2610h02m63M88Q88q71L75Q5Q56j13J33L89M10M43p00o2n02L55k49n07m12n98k20
2631a077q1O47n29n44P84j66K85O27j13N32m35P24J200j034n61N17j77m5o77N2
2651g1q56O08j226J3Q90j011M91M31O07J86j01q0J215p9J33k75J096j336k85K89
2671F39l26k65m97j00l61j74Q27n58m31P96j008J692k43j81J046J85Q4j01k81
2690G43L40j02n00j49j94j52n6o21n65L32O87p94q8M27J79J40M16N81j89O01N59
$$ plain form
2551 275 820 1546 340 1533 942 1380 876 1184 362 308 79 -201 -1080 -1386 -1450 -1713 -416 -766 -1121 -407
2571 -407 -1387 911 632 411 112 1335 1838 586 1354 208 473 -407 -1072 -429 -354 -1126 -519 -1311 -1743
2590 -1743 -778 -1473 -877 80 414 682 1054 1567 1366 573 1211 477 378 -226 -108 -406 98 -412 -426 -802
2610 -802 -1265 -777 111 -760 -385 -300 556 443 576 965 1375 1818 1118 1056 554 909 660 153 -259 -857 -1077
2631 -1077 -1158 -511 -1040 -1584 -800 -966 -681 -54 -167 365 -70 654 1854 820 259 776 599 554 -123 -71
2651 -71 -927 -319 -1545 -1532 -642 -1653 -1162 -731 -124 62 -39 -119 1096 1017 1150 875 1971 635 350 639
2671 639 313 48 -449 -549 -910 -1084 -257 -815 -1246 -450 -1458 234 -9 -190 856 1041 1125 1024 743
2690 743 1083 981 481 332 138 -14 -70 -691 -1256 -924 -237 -1031 -1119 -692 -513 -373 43 624 435 1036 1595
2711A595m77o7M35l80r53Q8k02k95k50m27r8L58m47j45N19N36j92M95N88k52R25
2732A354m35J44L29r77J75r07N86l85j82n91L11O0n45R14o70J97N31M65o45M91
2752B20N31m83M64j21M95m1k49j54k10m67J37k83j59m90O5k42M91J43q15J028
2772a40r2K82K64L58M10q47N13O65o02Q3p83k31o44L17j6n74j0L31j25m3O83m20
2794f21R62o51M94O59P62p50k51n4P07j258M28m71P0k33p35K88p1M42j106Q68
2814e21n13Q56N31r50Q26J08L93j29l3Q9m85M94n0o62N21n85L87o18n46j93l96
2835a476P50J90m37r7J274k58O53M71m13l34P53j190J461j245J6m27M26p56r7
2854g36K26n3o79K18Q54l21k12K80O21o34R16N5j29J32M72l33j80j31j63j64o73
$$ plain form
2711 1595 1118 1051 1486 1106 153 241 39 -256 -506 -933 -1031 -673 -1120 -1265 -746 -210 -402 93 681 429 1354
2732 1354 919 1063 1392 415 590 -317 269 -116 -298 -889 -578 -518 -1063 -149 -819 -622 -91 374 -271 220
2752 220 751 268 732 611 1106 1065 816 662 452 -15 122 -161 -320 -810 -745 -987 -496 -353 -1168 -140
2772 -140 -232 50 314 672 1082 235 748 1413 811 894 111 -120 -764 -447 -463 -1037 -1047 -716 -841 -884 -201 -621
2794 -621 341 -310 184 843 1605 855 604 550 1257 -1 427 -44 26 -207 -942 -654 -725 -283 -1389 -521
2814 -521 -1034 -178 353 -597 229 337 730 601 568 657 172 666 616 -46 475 -110 277 -341 -887 -1080 -1476
2835 -1476 -726 -536 -973 -1070 204 -54 599 1070 657 323 1076 -114 1347 102 118 -309 117 -639 -736
2854 -736 -510 -563 -1242 -1024 -170 -491 -703 -423 198 -436 480 535 406 538 1010 677 497 366 203 39 -634
2875f34J028j149q23L93L41L02N54o7K77j77P01L09q73O14l32N08k87l52P72q59
2895B46O01j316N10K66j140k72P45k3J21o6m33J154m63k89J366p03M76k11J60
2914G29L2p97P14K03n87q36P4l59j10J70L41j23o16J320k28J96k50Q66L05m72
2934E72p7M35M18J36q66r0J36j413M63k08o84p5j1M6J399m95k67J162m3J48j82
2955E04K53K01l23j05K25p8n70j82J82p31O52j100L39m94J037j316N38O19M86
2974A37O5k09N31l9K35K09k75o11J246j167L56p10R52j066n20M45p86N50K6j47
2994g78P3J020O9J76j49l38J074p48P77k67j5q99Q83j132l64O01j198L91l65K74
3014i15O85l24r3Q98l23M34l39N73L49j97j48n23M62pk93m97J89l71j5m44jK67
$$ plain form
2875 -634 394 -755 -1578 -1185 -844 -542 12 -55 222 45 746 1055 182 796 464 972 685 333 1105 246
2895 246 847 -469 41 307 -833 -1105 -360 -383 -262 -328 -761 393 -70 -359 1007 304 780 569 729
2914 729 761 -36 678 881 294 -542 -468 -827 -937 -767 -426 -549 -1165 155 -73 123 -127 739 1044 572
2934 572 495 930 1348 1484 618 528 664 -749 -286 -494 -1178 -1253 -1264 -1218 181 -314 -581 581 538 686 504
2955 504 757 958 635 530 755 677 107 -75 107 -624 28 -1072 -733 -1227 -190 -1506 -968 -349 137
2974 137 202 -7 524 485 720 929 654 43 1289 122 478 -232 720 -346 -866 -421 -1207 -657 -631 -778
2994 -778 -705 315 384 560 411 73 1147 399 1176 909 894 -5 878 -254 -618 -17 -1215 -824 -1189 -915
3014 -915 -230 -554 -647 251 -72 362 23 596 945 748 600 77 539 532 239 -258 -69 -440 -455 -899 -900 -633
3036f33M71k58r54J527n34L27P81p17L65M36k93K55M19m95j045j3L40j32j76j04
3056d33L93r30L72K3j3M97q2J70l06K48P2K22P44l99L3r36K70Q12j146K65K59
3077A35m41n3L2L16n28L40J0K2o5O52j35m6J009p82R35o91L04m75r07Q94m87p21
3099f82N88m68J18l18J26k84L53k76N89N76M38M48p50n9N57o17Q36q27K59j80
3119D27j38o57j95R34p33j84k32J82N49k50N71j7k24k80J232q56M39N4j100J196
3139G18j194K34M52p57M51J09J32n74o66P45p7O42p44J52K96j64P17j49L21r59
3159c15L86L50l51K87l10n7L26j039n08O90j06j46J23k39J445q54j68O97M34k45
3179D00K78K01p58J8P25p71K64n21p42J008m81j42Qo67J084J47K03n79k98R83
$$ plain form
3036 -633 -162 -420 -1374 153 -381 -54 727 10 375 811 518 773 1192 697 -348 -361 -21 -153 -329 -433
3056 -433 -40 -970 -598 -575 -588 -91 -173 -3 -309 -61 11 233 977 578 611 -325 -55 757 -389 -124 135
3077 135 -306 -359 -327 -11 -539 -199 -189 -167 -232 420 285 239 1248 466 1401 710 1014 539 -368 526 39 -682
3099 -682 -94 -562 -444 -762 -636 -920 -567 -843 -254 322 760 1208 458 399 956 339 1175 348 607 427
3119 427 289 -368 -563 371 -362 -546 -778 -596 -47 -297 274 257 33 -247 985 129 568 622 -478 718
3139 718 -476 -242 210 -547 -96 13 145 -429 -1095 -350 -427 215 -529 -377 -81 -245 472 323 644 -315
3159 -315 71 421 70 357 47 -10 316 -723 -1231 -541 -647 -793 -670 -909 536 -318 -486 211 645 400
3179 400 678 879 121 139 864 93 357 -164 -906 102 -379 -521 -513 -1180 -96 51 254 -325 -623 360
3199C60MN84m06L36r28R35n67L54q35j95P22j62o95J11r74J378p55O35p87Q99
3219A4K77r71Q48J63m20M29L55qj11j18j58q17J11P38l26j073J27O40K5n89k6
3240h90J305J03n11R09j53J7o48L98o0M78j214N73j35K27r86N37o90J04O2q0M73
3261a81n29k48L61O60kJ066p36N53j57r54J181n04p84K10l4l21K85o91J66J27
3281e32j45k06k45J52M98K15N87k39M94n21J04K03N71M77q65K0k97o61N57k3o81
3302e37L90k76P7M62q47M32Q87k96r0m40L98M96n09O54m88l26M53o40P66q68k73
3323e75N43n99M96o73P20r4k93P74o2L2L89m75l2J64L41p85M60o9N4k33M58p09
3345a68k37P7J5oj76M20o05K43J04O07O8J43O0l80j42N23m19N83q66L32p6j21
$$ plain form
3199 360 364 948 542 878 -50 885 318 672 -163 -358 364 202 -493 -382 -1356 22 -733 -98 -885 14
3219 14 291 -680 168 331 -89 340 695 687 576 458 300 -517 -406 332 6 -1067 -940 -300 -275 -864 -890
3240 -890 415 518 7 916 763 780 132 530 470 948 -266 307 172 399 -587 -50 -740 -636 -574 -654 -181
3261 -181 -710 -958 -597 63 61 1127 391 944 787 -167 1014 510 -274 -64 -98 -419 -134 -825 -659 -532
3281 -532 -677 -883 -1128 -976 -478 -263 324 85 579 58 162 365 936 1413 548 568 271 -390 167 144 -537
3302 -537 -147 -423 -346 116 -731 -299 588 292 202 -238 160 656 147 801 313 -13 440 -200 566 -302 -575
3323 -575 -32 -631 -135 -808 -88 -182 -475 299 237 269 658 183 151 315 656 -129 331 262 316 83 541 -168
3345 -168 -405 -328 -313 -319 -495 -75 -680 -437 -333 274 342 485 545 165 23 546 127 710 -156 176 100 -21
3367b1n79k01R06m50N16j108Q88l65J061q0k64n13J40N08P6p49O09k13K03J4n49
3388a71M85o48o31R15n91m54J067l3q16J086j145L17J155l92O96o01M7R83j173
3407I6R1l03k42L89k0l64K99L69q96K92k43K5O50l75R62k07j78L23n35K76R5J23
3429F27k03k90O0m97k36O45n04j82K7K62o00P65K40n16J51J64J63K15L03K17l36
3450D75o84Q01J0q77R04j119J193j015k0m3k83J36L90J71n33m8J23P92K05q66
3470b88N58k5j23M35L2j358J038j53j08q16L64J10K41m19K76K5j92N44j91P28
3490F78j6n43N98o8l5o44J163j105pk93l4M77q74M57j38j20k12M77J30K22M0O19
3512G72p15L03N26j065J255j056N59n28L7j13n48m2Q84j321N59O37p09L87n61
$$ plain form
3367 -21 -600 -801 105 -345 171 -937 -49 -414 647 567 303 -210 -70 438 514 -235 374 161 364 378 -171
3388 -171 314 -334 -965 -50 -641 -1095 -28 -61 -877 209 -936 -619 536 144 840 239 286 1269 96
3407 96 187 -116 -358 31 11 -353 -54 315 -581 -289 -532 -507 143 -232 730 523 345 668 133 409 504 627
3429 627 424 134 194 -303 -539 106 -398 -580 -553 -291 -891 -126 114 -402 -251 -87 76 291 594 811 475
3450 475 -209 592 602 -275 629 -490 703 -312 -332 -375 -658 -522 -132 39 -494 -542 -419 373 578 -288
3470 -288 270 245 122 557 589 -769 269 116 8 -808 -444 -334 -93 -512 -236 -211 -403 141 -50 678
3490 678 662 119 717 649 614 -30 1133 28 21 -272 -306 171 -703 -246 -384 -504 -716 -239 -109 113 153 772
3512 772 57 360 886 -179 1076 20 579 51 88 -25 -573 -615 269 -1052 -493 144 -565 -178 -739
3531g39K61K73R2N66o1K24q75j51J364J4l23l90j74K20N2r24P1o78Q18l79l0K08
3553e61N72Q7Mj84Q47j487O29N74J40K99j190O20k93K56l31k4q38K46K32q45Q16
3574d31K38J32Q3k33K95j53m46L12J93Q52N76j572N44n0o18O30N65j913J16M41
3594d39k06K59L03J0K60NJ72k30J48M26R7q48K50j31K14n4K83m60p04J54p99Q03
3616d87j60N10n96O35k32lO36J39M78j285O25p1r6Q92n97L86j23j53q51mq1N2
3638c86J82Q2k03L16J1p7O9k51P5M47O4J95P7l08J5L91q4p30m96M60J22o34P12
3661D9q64K44K98m30P37k77Q43n15M06m11O02m9L4o7l74K93o70K14l10J83l58
3682d22k60n32J279p24K15P84J43j110j26N1J097m70L56j57j91J47n43P28p37
$$ plain form
3531 -739 -478 -205 -113 453 392 616 -259 -410 954 968 645 255 81 301 353 -571 -500 -1178 -360 -739 -769 -561
3553 -561 11 98 102 -82 765 -722 -93 481 621 920 -270 350 57 313 -18 -42 -880 -634 -402 -1247 -431
3574 -431 -193 -61 22 -211 84 -69 -515 -203 -10 842 1418 -154 390 340 -278 352 917 -996 -880 -439
3594 -439 -645 -386 -83 -73 187 192 364 134 282 708 805 -43 207 76 290 236 519 59 -645 -491 -1290 -487
3616 -487 -647 -137 -733 -98 -330 -333 303 442 920 -365 260 189 93 985 388 774 651 498 -353 -357 -438 -386
3638 -386 -204 -122 -325 -9 2 -75 -6 -257 -182 265 329 524 601 293 308 699 615 -115 -611 -151 -29 -663 49
3661 49 -815 -571 -273 -703 34 -243 600 85 491 80 682 633 667 600 226 519 -151 63 -247 -64 -422
3682 -422 -682 -1214 65 -659 -444 340 483 -627 -753 -702 395 -75 281 124 -67 80 -463 265 -472
3701d72N56m31K19j49l48N31k86l8Q0J027r03m8J192o86j43J07n47O76P7j77o39
3722d02M41O02j223L89J91Q33j588M19p32Q68P46k82N75n81l50K94K10l27K42
3741C25k94R0j11K70k30L17M12q55j27n66R41q71L09j70O99k54M8J299q98r46
3761f12L87O54j34K36m07j20l83Q0J48J92J72r99P20o59K64k28J219r75Q99q8
3781C66m65P49k22J0L73j023N70k39k23n20M85j99k24O38l30r1M14j54m19J131
3801F27m75o93L81J92O30p12L98m19m4M69r32Q66m82K03j70j48n78O12NR0NL63
3823A88K27j050R26m31K88K74j62P4j27j045R11p7Q9o04L98lp03R62r36M46m74
3844h29M36L65P8M62n33RJ219j76l20o74n70O22j92N22j146K34J23q1K59k1N14
$$ plain form
3701 -472 84 -347 -128 -277 -625 -94 -380 -418 -338 689 -214 -262 930 244 101 208 -339 337 414 237 -402
3722 -402 39 641 -582 -193 -2 831 -757 -338 -1070 -202 544 262 837 256 -94 200 410 83 325
3741 325 31 121 10 280 50 367 779 -76 -203 -769 172 -699 -390 -560 139 -115 -67 1232 334 -612
3761 -612 -225 429 295 531 124 4 -379 -299 -151 41 213 -786 -66 -725 -461 -689 530 -445 454 366
3781 366 -99 650 428 438 811 -212 358 119 -104 -624 -139 -338 -562 76 -254 -345 69 -85 -504 627
3801 627 152 -541 -160 32 662 -50 348 -71 -115 354 -578 288 -194 9 -161 -309 -887 -275 -270 -180 -175 188
3823 188 415 -635 291 -140 148 422 260 334 207 -838 73 -4 85 -519 -121 -124 -827 135 -801 -355 -829
3844 -829 -393 -28 50 512 -21 -12 1207 1031 711 37 -533 89 -103 419 -727 -493 -370 -451 -192 -213 301
3865C01P9N4k46j67N40k77L02j45l86k43l43Q81k2m67m98R49m63Q42j389Q31M73
3886F06P4n15j06m65n8N91J95K85o70K33k03o5j16J97m40K22Q20N2q34m09k7J116
3908D83j167M31K47j24N78n55m6L27P44k87j36N70j281j92J05L0J32n13j24R33
3928A55o10N43l17j76L78J48P13j031P40o63P58q80R74l86o18M36k93M13J63n66
3948a19j96m79O25J83k9p8k85M56l56K58m00L68L17n88R43n68k84O20l78l05K87
3969hN4o46L79L51p20mQ16n62J01M28m68j58P62Q7n28l14J728j063O15n45K55
3990E60m06mJ52q98M29M36p04K37o43J240j234R88K84j63k68O44k75q93O38n6
4010F4n69K55o68J186m18m82K19L36j20L23j319J114kK5K4K66L66q46J2O62o2
$$ plain form
3865 301 380 434 188 21 561 284 586 441 55 -188 -531 350 328 -139 -637 312 -151 691 -698 133 606
3886 606 680 165 59 -406 -464 127 322 607 -63 170 -33 -98 -214 -17 -457 -235 585 637 -197 -606 -633 483
3908 483 -684 -253 -6 -130 448 -107 -153 174 918 631 495 1065 -216 -408 -303 -273 -141 -654 -778 155
3928 155 -455 88 -229 -405 -27 121 834 -197 543 -120 638 -242 732 346 -272 164 -129 284 447 -119
3948 -119 -315 -794 -169 14 -15 -93 -378 78 -278 -20 -420 -52 265 -323 620 52 -232 388 10 -295 -8
3969 -8 46 -600 -221 130 -590 -594 222 -340 -239 189 -279 -437 325 412 -116 -430 1298 235 850 305 560
3990 560 154 150 302 -596 -167 269 -435 -198 -841 399 -835 153 437 274 6 650 375 -518 120 64
4010 64 -505 -250 -918 268 -150 -632 -413 -77 -197 126 -1193 -79 -81 -56 -32 234 600 -246 -234 428 366
4031C66j99k23L51m77o6M65J34m01m49N44k18m87L61O22o94N61q3K77j11P79j268
4052b16N60p25R07l20m96J50l91Q5K72L34l62L43q24q3N38N2K06j48M57j62j5
4073A62J39L95j5n72J64k52L61j79l89O74n67r9J80k23L0L21n94j59J83Q97o29
4094a72O04K66M40m76j94j58k2r82R34L31p87M2M6p71Q09l25M96q05L64L37K67
4115B44m42J96j52n33Q58oK28j88l73O97o76J30q02P08jK88J40m38q72J019K09
4136B34p58N28j70Q60j025O75O71p07m23O0L92L7o05j52M06n99Q27l47o00o9K22
4157e43M22J081j512R71o13J390k81o48K70l61l0J49n40O51r17P05k29k4j04J65
4177Bl3o61M85L93n43J95l4P41p73M37Q43j017J54q80N94M69r84K83N65l71k49
$$ plain form
4031 366 167 -56 295 -182 -248 217 351 -50 -499 45 -173 -660 -299 323 -371 190 107 384 273 1052 -216
4052 -216 344 -381 526 206 -290 -140 -531 -446 -174 160 -202 141 -683 -766 -228 -176 30 -118 339 177 162
4073 162 301 696 681 109 273 21 382 203 -186 488 -79 -178 2 -221 -191 130 -464 -623 -440 457 -172
4094 -172 432 698 1138 662 468 310 288 -694 240 571 -216 -174 -128 -899 -90 -415 81 -724 -360 -23 244
4115 244 -198 -2 -154 -687 171 165 393 205 -168 529 -147 -17 -819 -111 -112 176 316 -122 -994 25 234
4136 234 -524 4 -166 694 -331 344 1015 308 -115 -55 337 374 -231 -383 23 -576 251 -96 -696 -765 -543
4157 -543 -121 960 -552 419 -194 1196 915 267 537 176 146 295 -245 406 -511 194 -35 -59 -163 2
4177 2 -31 -692 -207 186 -357 -162 -196 545 -228 209 1052 35 189 -691 -97 372 -612 -329 236 -135 -384
4198c84N65o99P12n0r75J363j54K67j39o76L63K12j17l77J053n96J4r2q42Q38
4218B86n19K04O2%L64j032O74l71k87J177k39K58j92p69O12o49M90M35j193R18
4238B29l47n5J89p18M15L0J57L8j37K11l06O12j55Q6n21K52K74k44L95k44n2L83
4260D92l17J94n40m4q58J180k69k55J70N31n57O3P29k55L87r40O67p99Q76n88
4280a33L51J12m97r8K22k58M0K16O27o14J40j8l96J96l0L69K74n47M41m76j85
4301b64L01r2N02l58J28r72R51o55K97n00O57K88J12R6l62k67P14p12l20m7R19
4322D16r4j56m82J38L32k96k57N74n77J155m73p75k98q0J176n77J045n31k82L46
4342C04J8m92J01N34l58J85n98M67k27k66r4K82j12l25K71m49O57m12M31K62p21
$$ plain form
4198 -384 181 -518 194 144 -831 532 378 645 506 -170 193 405 288 -89 964 368 382 290 -552 286
4218 286 -233 -29 33 33 397 -635 39 -332 -619 558 319 577 385 -384 228 -421 69 504 -689 229
4238 229 -118 -173 16 -702 -287 -257 -100 -62 -199 12 -294 318 163 249 -272 -20 254 10 405 161 109 492
4260 492 175 369 -171 -215 -1073 107 -162 -417 -247 284 -273 -210 519 264 651 -289 378 -421 455 -133
4280 -133 218 330 -167 -265 -43 -301 -261 -45 582 -32 108 90 -306 -110 -140 229 503 -44 397 -79 -264
4301 -264 37 -55 447 89 217 -755 196 -459 -162 -662 -5 283 395 491 129 -138 576 -136 -456 -503 416
4322 416 322 166 -316 -178 154 -142 -399 175 -402 753 280 -495 -793 -873 303 -274 771 240 -42 304
4342 304 322 -170 -69 465 107 292 -306 161 -66 -332 -426 -144 -256 -581 -310 -759 -102 -514 -83 179 -542
4363e42J653j013J69j70Q7J27n4k59L00m83M51P9m48J26m8j7L37q2k85j42M38
4384B24Q2p7j97P44p37M4J32P7p33Q8P66R7j95Ko78M38J97m49K80L77q35O95J4
4407C56k30q8Q4K20k83L96j61k20l54N54n11k78R9O58r19J220k87j9j10J7K76
4428D20o33K05K42m6k75M5j06J26q1j36R02j199M26l63k10R45r77O01r4Om12L59
4450b55P11n53K06N22p96O78O70j651N68m91j11M26R3J41k02K1M17p65Q5M35o
4471A43l33K31P4j99L19l61k97K03L54k18k79k21M98o4j9j86Q55q54J47J255j501
4492d53J97N7K48O48q48n1K54K64o20J62J84l72N73q68J016p73M41J028j417l10
4512f40j45Q59M73n58k06k81R61L7m14j73L39m55P72o03n09k12Q32J67o55Q74
$$ plain form
4363 -542 1111 98 267 97 184 311 257 -2 298 -185 266 345 -103 23 -25 -42 295 213 -72 -214 224
4384 224 306 229 32 776 39 83 215 292 -441 -353 413 510 315 317 -361 77 274 -175 105 482 -353 342 356
4407 356 126 38 122 342 59 455 294 74 -280 274 -237 -515 -416 242 -677 543 256 237 127 144 420
4428 420 -213 -8 234 188 -87 -42 -148 -22 -103 -239 663 -536 -110 -473 -683 262 -715 -114 -208 -202 -614 -255
4450 -255 456 -97 109 631 -165 513 1183 -468 100 -391 -502 -76 17 158 -44 -23 394 -371 -286 149 143
4471 143 -190 41 115 -84 235 -126 -423 -220 134 -84 -363 -584 -86 -150 -169 -355 500 -354 -207 1048 -453
4492 -453 -256 -199 49 697 -151 -202 52 316 -304 -142 42 -330 243 -625 391 -382 59 1087 -330 -640
4512 -640 -785 74 547 -11 -217 -498 463 500 86 -87 252 -203 569 -34 -543 -755 77 244 -411 463
4532D63q03J83Q9JN37K19l37l65m19P32O09k48p91K15j01o6j7K58L17r77j27L89
4554b39k75Q55m61J33k10l01O53j36J85N58o14q2Q1j1j16j59P73q07J19M19q83
4575e18M93p9M09j28J6k51p24O19l53Q88J05J52n44L13n4N2q66J9O24Q62j145
4596a10l04K14L29j67J30n81P25k14k63J79M5K01J48k01k9M08n48O94q82N29l28
4617b5n61J166n54j91L8j22M47m35Q76m42n66J52L83j45J20M3j41K78n68J70J69
4638I2j94m52K93K11j86K23m79m09Q21p85Q17m56M15J40P00n97j16L57k63l07
4658a75J86M99p71O3mM47n17L71k21j41m80K94J8J5R53n91R3O62n39m75K48M48
4680C83p68P03p98J82N68p2m30k4j61J57O27l65n23L79M15L86r20j71Q98o89l04
$$ plain form
4532 463 -340 -157 -68 -67 470 689 352 -13 -432 300 909 661 -130 85 -16 -82 -99 159 476 -501 -628 -239
4554 -239 -514 341 -120 13 -197 -498 155 19 204 762 148 66 147 136 20 -139 634 -173 -54 365 -518
4575 -518 -25 -104 305 177 193 -58 -782 -163 -516 372 477 629 85 398 344 396 -470 -451 173 1035 -110
4596 -110 -414 -200 129 -38 92 -489 236 22 -241 -62 -17 184 332 131 102 510 -38 656 -226 303 -25
4617 -25 -586 580 26 -165 -127 -249 198 -237 639 197 -369 -217 166 21 141 184 43 321 -247 -77 92
4638 92 -102 -554 -261 -50 -236 -13 -492 -901 -80 -865 -48 -504 -89 51 751 154 38 395 132 -175
4658 -175 11 510 -261 -198 -202 245 -272 99 -122 -263 -743 -449 -431 -416 537 -54 39 701 162 -313 -65 383
4680 383 -385 318 -480 -298 270 198 -232 -256 -417 -260 367 2 -521 -142 273 659 -261 -432 466 -223 -527
4701e27M18N51n09O2m07J06K08k25j15J90l18M4j0M68O23o08m34P13J97K52j65
4722E14l87l55L42l24L96Q1o70K93m2O77p08P67r08N98p26k24J050P8N1q70J129
4743G62n52K06k34m24k99M14m1j58R25n78p1j57J3k22K86K13m09M31j60n17P42
4764A70M84p1q00k03O50k95J28o00R33p20L69k96K64q69P00N00j85p8N4L64k64
4785B35N95j337O04j23K11m98L7L26p0j13O88r52j87L15K83l4j63O75q48j63J3
4806e06O78k61J117r07p10O76N16m19R87j721N94j06o3R33n31n76J32q2j47K73
4826a23l69N69O11l88l43K47L48l87p03L63R3M45J32R3o75k20q3j36M87J66n99
4847d72J84J76P35m31k04L47n13N15k98j60J90N2O74o28j94K09o39K00L22J13
$$ plain form
4701 -527 -109 442 -67 -5 -412 -306 -98 -323 -438 -248 -566 -522 -532 -64 559 -49 -483 230 427 679 514
4722 514 127 -228 114 -210 186 267 -403 -110 -152 525 -183 584 -324 274 -452 -676 374 452 503 -367 762
4743 762 210 416 182 -242 -541 -127 -168 -326 599 21 -50 -207 -194 -416 -130 83 -326 105 -55 -572 170
4764 170 654 583 -217 -420 230 -65 63 -537 396 -324 45 -251 13 -856 -156 344 159 81 135 499 235
4785 235 830 -507 97 -26 185 -313 -276 50 -20 -133 555 -397 -584 -269 14 -20 -183 492 -356 -519 -506
4806 -506 172 -89 1028 121 -589 87 603 184 1171 -550 44 -62 -125 808 277 -299 -167 -249 -396 -123
4826 -123 -492 77 688 300 -43 204 552 165 -538 -175 -82 363 495 588 -87 -307 -390 -526 -39 127 -472
4847 -472 -288 -112 623 192 -12 335 -178 337 39 -121 69 121 795 167 -27 182 -457 -257 65 178
4867A78L61l36j09k90M45q66P84j70O88m91O2j47M41j02k06j9j91K14k22l94l29
4888f99O48M30q36N70j9n10K23K09l25K72O98p15M33L36j255J574j016k8M47q89
4908d52n4J18L18r3N91l82q8k94K36M57j13k26J42J74m4K2j52j41j41L41m12J1
4930a82j77K35J59j53j62j34j38J445m07o36l12J118j008j55O07j41K44J08m58
4949a47J86Q1O76j122N34l11K87k19k64j73ON14j63K69n5n96L96K59L24n55L69
4970B96q7L0o3j17M24o29L89o18j72R18k10o19Q94j057P82n24K91O25n87P8j06
4991f2m44O87L94l08L29k22m07L23o56L43m21Q05k4p50L94n5M44j067N79N93k90
5012A85L4k94j76N90j042Q82j55k20l4J55K53n64N70m40L26M1m4Jj46n46Q32j21
$$ plain form
4867 178 539 203 94 -196 249 -617 167 -3 685 194 256 109 550 448 242 223 32 246 24 -370 -699
4888 -699 -51 379 -457 113 94 -416 -193 16 -309 -37 661 -54 379 715 -540 1034 18 -10 437 -452
4908 -452 -506 -388 -70 -163 428 46 -42 -336 -100 357 244 18 160 334 290 312 160 19 -122 219 -193 -182
4930 -182 -359 -124 35 -118 -280 -414 -552 893 486 -150 -462 656 -352 -507 100 -41 203 311 -147
4949 -147 39 120 796 -326 208 -103 184 -35 -299 -472 -466 48 -115 154 99 -497 -101 158 482 -73 296
4970 296 209 239 176 59 483 -146 243 -375 -547 371 161 -458 436 -621 161 -363 -72 553 -34 44 -62
4991 -62 -506 181 575 267 596 374 -33 290 -366 -23 -444 361 337 -413 -19 -74 370 -697 -118 475 185
5012 185 219 -75 -251 339 -703 179 24 -196 -230 -75 178 -386 184 -256 70 111 67 68 -78 -624 208 87
5034H7k01k5K05O1o11N18l20o05J097L65o00k33M56J7o87J137j077N76k57L98
5054C01l13q76N34M81P7J64m9K82k31p02J5l53k78O45J87N88l77j42N80j098J018
5075D53l93l7j76P37K9r04K19P01j152N35l48j97K94k37M07M77q11O36K10p37
5095b94j48J070p54J31k01N16m29p0K85k70K64K8L5n99M45l59R0L76L68m12j062
5116i90P63L49m06L79o05R49m15n47J207j357J262l54k29K66n03L06k97R00m99
5135A79J11j37r25J829k74q55K11l72J13L10K36q2l88r9p11Q94r7j05j20M00m89
5156c71N33n57K18K99q7n3L3j80J58m9P87j91j018O47k63K31n34k64J011r03Q42
5177B89L65k10k30K59r40O00j45k91Q21j239P21Q6k29O28n65M05N01o29k94K77
$$ plain form
5034 87 -114 -139 66 127 -484 34 -286 -891 206 571 -29 -262 194 211 -476 661 -416 160 -97 301
5054 301 -12 -888 -354 127 204 368 319 601 370 -332 -317 -670 -948 -303 -116 472 95 -47 533 -565 453
5075 453 60 23 -153 584 613 -291 -72 629 -523 12 -336 -533 -239 -476 -69 408 -403 233 443 -294
5095 -294 -442 628 -126 5 -196 320 -109 -179 106 -164 100 128 163 -436 9 -350 -260 116 484 72 -990
5116 -990 -227 122 -284 95 -510 439 24 -523 684 -673 589 235 6 272 -231 75 -222 678 179
5135 179 290 153 -772 1057 783 -72 139 -233 -120 190 426 344 -44 -143 -854 40 -57 -162 -282 118 -371
5156 -371 162 -395 -177 122 35 -18 15 -165 -7 -56 731 540 -478 169 -94 137 -397 -661 350 -553 289
5177 289 654 444 214 473 -467 133 -12 -303 518 -721 0 86 -143 485 -80 325 826 197 -97 180
5197A80n99N63L11j00j010R51m56k17N18j40J1J22K21J62r59O30n05O17p9j44
5217G7m63P74o1n00J08M92n43n43R05k13o0r6o34M05P47Nj015J52L72M30R4n81
5239a48O07o51L87J73m88O79l23j37j20O9m30K26j19k23R61p68O01L38p52l91
5259e09P51K32k50L43M0l04m87j65k1P34l1p07R06J82p75o45R36n79O51m80J4
5280a64K7L55j178P89j76N46l84M31m95k31N91o33J276j367Q17p84Q39K11m20
5299E0o12J36M25m34R26k19m4j026L85P44P9j330Q30J32m15L10L95j20P2p20R0
5320c46P75L7j44k38l7j16j26M4j23L81j39j7k15J179o43M6j16L06l99J69k90
5341a2J62o98K8L64P44l35n27L62l50L9P25r71R43m49q73O74K62J63j36k84O88
$$ plain form
5197 180 -419 144 455 355 -655 296 -160 -377 141 1 12 134 355 517 -442 188 -317 300 221 77
5217 77 -386 388 327 -173 -65 427 -116 -659 246 33 -27 -123 -757 -352 395 400 -615 -463 -91 339 433 -148
5239 -148 459 -192 195 368 -120 559 236 99 -21 48 -382 -156 -275 -498 463 -305 296 634 -118 -509
5259 -509 242 474 224 567 607 303 -184 -349 -370 364 333 -374 532 714 -61 -706 230 -349 302 -178 -164
5280 -164 -137 218 -960 -171 -347 199 -185 246 -249 -480 111 -522 754 -613 204 -580 259 470 50
5299 50 -562 -426 -1 -435 491 272 228 -798 -413 331 410 -920 -90 42 -373 -63 332 212 284 -436 -346
5320 -346 429 466 322 84 47 -69 -195 -151 -274 107 -32 -49 -264 915 272 318 202 508 109 278 -12
5341 -12 150 -548 -520 -156 588 253 -274 88 -262 -223 502 -469 474 25 -848 -174 88 251 115 -169 519
5362E19j000J32jJ008n92p0Q45j036N27n69L40J33p01R75o50M00n91O05l76m31
5382e33L23l79L29j82M64k79n5O31J77n00M19k45j36N05q36O97l68l87K33L17
5402A95n11M51K89J64l81K62m66k95R23j232P96n16q5Q64n24P24o22K01K38j87
5422B88p54L89M82O6q59PQ1L02J85n10M37l66l06R10qk9L17r17M2M00kK79J8j4
5446D38j23j41M30m05M21q23m43M42p17J042O6K81O3p28J75j37m0Q9L21p4K99
5467D36m09j56j94P84k17Q6p51P07m42l91J223q39k30J136o45p76N78QR89p94
5487A03m89N3L0n67J571n70n00K87j73L91k5K96n79j33Q58r56Q56j47R2p18k98
5508f18O72p18J293m01q69Q18o35Q17p7l24K83q26O32m48P43n57O72k56m94K20
$$ plain form
5362 519 -481 -349 -350 658 66 -4 841 -195 332 -237 103 236 -465 510 -140 260 -331 274 -102 -533
5382 -533 -210 -589 -260 -442 22 -257 -312 319 496 -4 415 170 34 539 -297 400 32 -355 -122 195
5402 195 -316 135 424 588 207 469 3 -292 631 -601 195 -321 -406 458 -66 658 36 237 475 288
5422 288 -466 -77 405 471 -388 -381 -300 2 187 -323 114 -252 -558 352 344 315 632 -285 -243 157 155 434 452 438
5446 438 315 174 604 199 620 -203 -646 -204 -921 121 187 468 531 -197 -22 -159 -199 -110 211 137 436
5467 436 27 -129 -323 461 244 330 -421 286 -156 -547 676 -163 -393 743 98 -678 -100 -92 897 103
5487 103 -386 -333 -303 -870 701 131 -369 -82 -255 136 111 407 -172 -305 553 -403 453 306 398 -320 -618
5508 -618 54 -664 629 228 -641 177 -458 359 282 -42 241 -585 47 -401 342 -215 457 201 -293 -73
5528g3l79P35n7q26M13L31K19p22L37k12N96o15K3j09J56O27l96k39L8N97o02
5549a58P27l53p26M57l23P59q97O20j75P12r0r97P71K25J06p39K54p24R18q2j51
5570A34M03r19O66Q30p10p05n1R1K87M3j179P02r8J74N08m72J102p84K14o29R28
5591E35J36r90K50j49P61l76kJ94k37J90n17N44n21l3J013q73k28M89p25L97L38
5612A96K08Q9r26L29k7M92o79J113q61K59j54o59K45l9o8N23J10l84k19J153j141
5633d40k16Q60o04R3M42J07m48N81k22l99K8L99P93j091M02R5n85j86J22P20n19
5654f8l22N50n54J82N66l34m71N8R44j014J44J61k38Q4p6K58J00m42L92l20Q82
5675D82j060J203o66P8q53N97R87o32J79j88K72l05l20M14q02R86l73m18j72K57
$$ plain form
5528 -73 -452 283 226 -600 -187 144 363 -359 -22 -234 362 -253 -230 -339 -183 444 48 -191 -153 444 -158
5549 -158 569 216 -510 -53 -376 383 -514 106 -69 643 553 -444 327 552 658 -81 173 -551 367 285 134
5570 134 537 -382 284 1114 404 -301 -352 -261 26 69 -1110 -408 -506 -332 176 -296 806 22 236 -393 535
5591 535 671 -319 -69 -218 543 167 165 359 122 312 -205 339 -182 -215 798 -75 -303 186 -539 -142 196
5612 196 404 493 -433 -104 -131 361 -318 795 -66 193 39 -620 -375 -414 -482 41 151 -233 -452 701 -440
5633 -440 -656 204 -400 -307 135 242 -206 375 153 -246 -218 181 974 -117 285 380 -205 -391 -269 451 -68
5654 -68 -390 160 -394 -212 354 20 -451 -393 551 -463 -319 -158 -396 -312 -388 -130 -30 -472 -80 -400 482
5675 482 -578 625 -41 37 -816 -219 768 136 315 127 399 94 -226 188 -614 372 -1 -419 -591 -334
5695c34L97J29m87M22j32k34j71J10K09k31Q21o02k57K45M58K30m94m41L77q9
5715g4k3M30n66J84m9K33m38L76J97o68O24m02lM32J76m09j99K03L60k20k00Q6
5737E0j09N72j63k15m55l6J01j96n4K27M46P4N69k99q05N36p61N53k39L7o6N77
5759C44q25P55K38L63n34j238P85M42r69L38m81M54P05l82Q17j040O63l59LJ87
5779B66J11n50M59p18K61J90j07O6m72O6Q05n52K64o37Q13q63L63O46n15j34K72
5800C4m1j07O93m17n58P92k82nm65l00P78m8K00q19Q42M9o20J50J95q1L66k07
5822A49K42m57L92j39k28k26k56R26k35k54k51o74R41p06R16k08m30J206K43r22
5842B9n82R1J663j185j02k35P10M65n99Rj122Q88K50n42P63j148J157k74r4J58
$$ plain form
5695 -334 63 192 -295 127 -5 -239 -410 -300 -91 -322 499 -103 -360 -115 343 573 79 -362 15 -74
5715 -74 -97 333 -233 -49 -98 135 -303 73 270 -398 226 -176 -179 253 429 20 -179 24 384 164 -36 50
5737 50 -59 513 350 135 -320 -356 -255 -451 -505 -278 168 242 811 512 -293 243 -518 35 -204 -167 -233 344
5759 344 -481 274 512 875 341 -897 -112 330 -639 -301 -782 -328 377 -5 812 -228 435 76 79 266
5779 266 377 -173 286 -432 -171 19 -88 -22 -494 -428 377 -175 89 -548 265 -598 -235 411 -104 -238 34
5800 34 -7 -114 579 162 -396 396 114 109 -356 -656 122 74 274 -545 297 346 -274 -124 71 -10 356 149
5822 149 391 -66 326 187 -41 -267 -523 403 168 -86 -337 -1011 -70 -776 140 -68 -498 708 951 29
5842 29 -553 -462 1201 16 -86 -321 389 854 255 264 -858 30 280 -262 501 -647 510 236 142 300
5862C00J53l72k60M8P60q52M03J2r6J12k62l86L33j5M6k35k53P85k04O10o99J72
5884A00K65o30O54k06M54j532M30K96j1K32J31o17K28m81k55R35q61J056m39K37
5904a4l50P05m22k66K32N4J53L13o86R02j173R11r42R4m74Q53J01K43j73J22k54
5925g1m05l53P36J93o7n90J033j77l4m25J06n1j65R47n25k70P02j133N39m05L84
5946c1O74j093Q59l67J2K53j77p34K45N4N82j26j98J45j1n94M15J04q07J368o75
5967a02P6o55K7O69L4m61m8J340k60l31J6j57L29q80O63Pk57M54p93K48l50L42
5989h9oN77k66k83j71L23Q0p96J83k15L09l41O83n0M6n04P03n76L94m20P88r00
6011e31P03j10K86L0m16o89M10J82r7L26O7M89q70Q5L68l51N00n81L68k06k00
$$ plain form
5862 300 453 81 -179 -131 629 -223 180 192 96 208 -54 -440 -107 -122 -76 -311 -564 221 17 627 -72 100
5884 100 365 -265 389 183 637 -895 -465 -169 -180 52 183 -434 -206 -687 -942 -7 -868 188 -251 -14
5904 -14 -364 341 -81 -347 -115 -61 92 405 -281 621 -552 359 -583 -489 -963 -110 -9 234 61 183 -71
5925 -71 -476 -829 -93 100 33 -557 476 299 265 -160 -54 -105 -270 677 152 -118 584 -549 -10 -415 -31
5946 -31 643 -450 409 42 54 307 130 -604 -359 -305 277 151 -47 98 87 -507 -92 12 -795 573 -102
5967 -102 -26 -681 -654 15 49 -412 -460 880 620 289 305 148 477 -403 260 267 10 464 -329 -81 -431 -89
5989 -89 -95 482 216 -67 -238 85 165 -631 -448 -663 -354 -695 -12 -62 -16 -520 183 -393 1 -419 369 -531
6011 -531 172 62 348 378 -38 -727 -317 -135 -232 94 161 650 -220 -135 233 -118 382 -199 169 -37 -237
6032b37O03p36N15p61R60l77l56l58J213j021J127l63k19N75k85r5m14O36p10
6051c03M31J55j123R66m69j24Q54n02l37K47l1O2J0J4O58J48j153J33l4J076o17
6072F1m9J00j01q1K66r5m8j95L76o07J082j55o63J079j094M0m44J56J34j12M29
6093G9J0j38l0N73j311N98P69r98J134j208Q26l04q9K92M21j252O87k43J35m01
6113d50J21K97J7L06J92r68P40j25N2p63m1Q19l02L57p14K38L82n32J369m01j421
6134h27R21J61j1k36K15o27O81L81p00o45K73R45p78N14p7q8J84j25O89o59K47
6155D38n90K55o89N70p82M94R1j57N53j006J118k78j69M79q14P61J67j000N90
6174C1M4P41j131p3P37j201Q29N58m23p00J133o44k21N7P21p24N96j83M9N56j303
$$ plain form
6032 -237 366 -370 145 -616 344 -33 -389 -747 466 -555 572 209 -10 565 280 185 -229 407 -303
6051 -303 128 283 -840 126 -343 -467 387 -115 -452 -205 -236 -174 -164 -150 508 656 -497 -364 -398 678 61
6072 61 12 112 11 -70 196 101 53 -142 234 -373 709 554 -109 970 -124 -84 -528 -372 -238 -350 79
6093 79 89 -49 -79 494 -817 -219 550 -448 686 -522 304 0 -89 203 624 -628 59 -184 -49 -450
6113 -450 -329 -32 -15 291 483 -485 255 130 182 -581 -622 197 -105 252 -462 -224 158 -374 995 594 -827
6134 -827 94 255 244 8 223 -404 277 658 -42 -687 -414 531 -247 267 190 102 286 161 850 191 438
6155 438 -152 103 -586 -16 -798 -304 -213 -370 183 -823 295 17 -152 327 -487 274 441 -559 31
6174 31 75 816 -315 -388 349 -852 -23 535 112 -588 545 -99 -320 -263 458 -266 330 147 196 752 -551
6195e51P21R8q3J3l79J12j07l3O72J87r33L20n03O62l45K5L48m98P47l56k04P6
6217a1k87R63m61p1R0p2L53m42O07K0o35n69M20p06N17Q84j20j119Q36l84N3J14
6239b0j4N78l17n78L5O71q27J271q31M31q12R91r66j95M01K11J05o50L04O0L83
6260B31o06k68Q94M26l06n0m22n9r0P95n49j44N06j28k36j84K14k74J55j7j09
6281b21l9J77N88j62L23q99K03l94K12M80j03J63q20J186o49j32m89J066l42K95
6301D43m23j54k51J190n02m60R5K79k21K04KL1q97O3L09J370j271q3K40j47Q3
6322a00j3J83o32R28l01M88j329Q92j202J542r07M6N97j32L10k84R3m92L30M19
6342D36J76j371M00j05O86p22J177l73k31K30m30M17m99L93l48J48M67p91M08
$$ plain form
6195 -551 170 268 185 198 -181 -69 -176 -209 463 650 -283 37 -466 196 -149 -124 224 -274 473 117 -87 -11
6217 -11 -298 665 204 133 223 151 504 62 669 689 54 -515 -95 -801 -284 600 480 -639 197 -187 -134 -20
6239 -20 -34 544 227 -351 -316 355 -472 799 -32 399 -413 578 -388 -583 -182 29 134 -516 -212 -152 231
6260 231 -375 -643 251 677 371 321 -101 -160 -250 545 -4 -148 358 230 -6 -190 24 -250 -95 -112 -221
6281 -221 -260 -83 505 343 666 -233 -30 -424 -212 268 165 328 -492 694 45 -87 -576 490 148 443
6301 443 20 -134 -385 805 303 -157 -62 217 -4 200 202 233 -664 -601 -292 1078 -193 -276 -36 -183 -100
6322 -100 -113 70 -562 366 65 553 -776 116 -1086 456 -451 -405 192 60 370 86 179 -313 17 436
6342 436 612 -759 -359 -464 222 -500 677 304 73 303 -127 290 -209 184 -164 -16 451 -340 68
6361F8j63K78L14N3j81q18M86R8L01j27m87L53k97n5R5O76j35k50K27k13n12K46
6383d3N3N54n85l14N18l04P25j177L05M93K52Q2r79L23k6J016r42J29L93q05N57
6404B25K45n92N04n22N70n70r8L9o18J183p28j34R24j079K19M67O01n67N01j000
6424d30L73J2K13k12Q9m60L15K50k16M4J84m10k46K15K35J38k84J68N96j62j55
6445B57M58m20n9Q7l04K85M6o36o3L66K57j9j49m28P54m65j069R66P38q52k72
6466e22J082m42L1q09Q82K93j20N13j211N65j78m13L95j22L22L47m37n38J55k82
6486d89J12J84K42j29J02Q80j416P27m49R34l61j007Q70j12N8m71j57J17M27J
6506F3n19K30L89q70J082L73j642J021j43o7J73K68l43J66l10j06M21k66j50R1
$$ plain form
6361 68 -95 183 497 550 369 -449 37 135 436 309 -178 175 -122 -177 -82 594 459 209 436 223 -289 -43
6383 -43 10 564 -21 -335 183 -121 604 -573 -268 225 477 559 -420 -97 -123 893 -49 80 473 -332 225
6404 225 470 -122 382 -140 430 -140 -238 -199 -817 366 -362 -496 428 -651 -432 35 636 69 570 -430
6424 -430 -57 -45 168 -44 45 -415 -100 150 -66 -22 162 -248 -494 -279 -44 94 -190 -22 574 412 257
6445 257 715 295 236 323 19 304 350 -286 -349 17 274 255 106 -322 432 -33 -1102 -136 602 -250 -522
6466 -522 560 118 149 -660 222 515 395 908 -303 262 84 -329 66 -56 266 613 176 -362 -207 -489
6486 -489 -377 -193 49 -80 22 902 -514 213 -236 698 337 -670 200 88 146 -325 -482 -365 62 63
6506 63 -456 -226 163 -707 375 748 -894 127 -16 -83 90 358 15 181 -129 -235 186 -80 -230 -139
6526a39N56L20o56p22l83Q43K76M16n64O43k47L06n51r61R25o19N00j47j66j18
6546d88J20O08q24N20k39k1O65J8n06Q6K81K8o72Q34l00Kj68o11P34l38N54q83
6568f00K05L21O71p18L47K83l77m6O90k35qq94O17k70o29N46j82L32n87O63q28
6589f99N69l46k58P83k81N59k04j64K77K62k10J59p66P87j038Q4O76m63P11k94
6609A44L43l73o09P83o53O40P12j382P50L22p58j34O1N3J01o3N44l30j72J86o66
6630e01Q86o59k3L00j46l04L86l64M47j18Q4l7M8j21J36O78j001J266j338J41
6650b40O29L5q21K26Q06m51k41LK69J00j119J177m25J41m65N74n06L4L36K69n43
6671b12J41J017j779J019J49K33j076N40O81j481J078p81m2K54P5J12M9j31J84
$$ plain form
6526 -139 417 737 81 -641 -1024 -181 95 511 -53 590 343 649 98 -863 62 -557 -57 -204 -370 -488
6546 -488 -368 240 -584 -64 -303 -324 341 359 -147 -61 220 248 -424 410 110 112 -56 -667 67 -271 283 -600
6568 -600 -395 -74 597 -121 226 509 132 86 776 541 533 -361 256 -14 -643 -97 -279 53 -534 129 -699
6589 -699 -130 -476 -734 49 -232 327 123 -41 236 498 288 447 -319 468 -570 -486 190 -273 438 144
6609 144 487 114 -495 288 -365 275 987 -395 355 677 -81 -215 -154 -101 0 -63 481 151 -21 165 -501
6630 -501 385 -274 -297 3 -143 -447 -61 -425 22 -96 -12 -49 -1 -122 14 692 -309 957 -381 -240
6650 -240 389 424 -397 -171 635 184 -57 -54 215 315 -804 373 -52 89 -376 198 -308 -274 62 331 -212
6671 -212 -71 946 -833 186 335 568 -508 32 713 -768 310 -471 -513 -259 -184 -72 -23 -154 30
6690C0O09r59R19j64j3l8q47j50N77K86J18q4l55J15M31n27P68r65N7L26k92m33
6712e91J255j07n46O9k55O26L27o80j94N1O03n54n29J12K63n68Q64k7l39O09j64
6733B25L20p1K25j195P07l50l3J02q25O80N22j11k55O40q76J53L31M98m70kp4
6754A41p17J059o15M70k69o12O53N99l90R5k09l49n19O44K0o4Q20r90L47m21M
6775c03O13J80J97k90r27Q33l61jM71l9r19J201K26j582J065k96K92q79J83O71
6795C35J7p41K07M10p44O56k68j27M31R2lk81l08M80j55m68R1P64p84K70j12N54
6817C16j97J03l10l73O09l96j49Q68J57l35l49j17K41j43p36M13M99k53L50q04
6837f06o4J035j165N07O28p6k39K3m87J091p07M25L61m25o24L93O44j253J001
$$ plain form
6690 30 639 -320 599 435 422 384 -463 -613 -36 250 368 284 -71 44 475 -52 716 -249 -192 134 -158 -591
6712 -591 664 557 11 80 -175 451 778 98 -96 -45 558 4 -525 -413 -150 -718 146 119 -220 389 225
6733 225 545 474 699 -496 211 -139 -172 -70 -895 -215 307 196 -59 581 -295 -142 189 687 217 215 141
6754 141 -576 483 -132 338 69 -543 110 709 319 414 205 -144 -663 -19 1 -63 757 -233 114 -307 -303
6775 -303 310 490 687 397 -530 303 -58 -59 412 373 -546 655 881 -701 364 68 360 -519 -336 335
6795 335 352 -389 -182 228 -516 140 -128 -255 176 268 265 -16 -324 156 1 -467 -376 388 -396 -126 -238 316
6817 316 119 222 -88 -461 148 -248 -397 471 628 293 -56 -173 68 -75 -811 -398 101 -152 198 -606
6837 -606 -670 365 -800 -293 335 259 20 43 -444 647 -60 365 726 301 -323 70 714 -539 462
6856D62n61k87l73L72Q7L75j30l31O02M57m44k97J0j07qp73J010M01o69J158j355
6877d01J479j923p5N80J45n19K53P28p83m9k47l88J110K06k41M38m98N97K19r65
6897c34j83J357j055k0K39M00o93l6L2k35M49l72K40M22o75p5N67k14J61J60K47
6918C82q33p4j22R69k65j82l32J52K27K57k27rn2KR05j076M95M8l00n5N4Q24n40
6941B48n03M99l44j60M04p20P81N58j015k11q6N85j8Q0L54o40L83l84O12q84O13
6962A52J16l72l3M52j402J096k74n1K23j71O88l82P48j398Q35o75M8O02k17l8
6982e3n4J25l3J47q86L54R53n09o4p1l5N70j035J91M96L57j99k9K58m84P14o21
7004I2m82N40l27L9m08O58q02P86M98q69N16o80K16N29p18n25J64M54Q9M29n43
$$ plain form
6856 462 -99 -386 -759 -387 -300 75 -55 -386 216 673 229 -68 -58 -165 -173 -946 64 465 -204 954 -401
6877 -401 1078 -845 -920 -340 -195 -714 -461 267 -516 -565 -812 -1200 -90 116 -125 313 -185 412 631 -334
6897 -334 -517 840 -215 -235 4 404 -289 -325 -293 -528 -79 -451 -211 211 -464 -539 28 -186 -25 135 382
6918 382 -451 -525 -647 322 57 -125 -457 -305 -78 179 -48 -57 -109 -107 798 -278 217 265 -35 -90 -36 788 248
6941 248 -255 244 -100 -260 144 -576 205 763 -252 -463 -549 36 18 98 452 -188 195 -189 423 -461 152
6962 152 268 -104 -137 315 -1087 9 -265 -316 -93 -264 424 42 790 -608 227 -448 -400 202 -15 -53
6982 -53 -107 18 -15 132 -754 -400 553 44 -20 -91 -126 444 -591 -400 96 453 254 225 483 -1 713 92
7004 92 -390 150 -177 -138 -546 112 -690 96 594 -275 241 -439 -223 306 -412 -937 -773 -319 -230 199 -344
7025c44N45J02N82n71J96j99Jp57rN82j03m30J3J503p31j69l21j012J126p46M02
7046c40Q38l85N78j168j54O13L52M85r42K12j96o0J64rK41l23q6PJ32k00L88j51
7068dP3j08J12L62l30m89O09l64M21N68j745J013p00O87J58q59O68L50o77N03
7088B48k54p33P41q4L4j09L38n92J034m68O21j657J495j181N37P1j68L85l62j14
7108b18K99n77M97K04o90P88n87n0O73J45L69k49j107M60L8L23o84K42l93l9J282
7129G26n42m3M01q57M20q00L72L8J86J66M80l00k99K6R07n38K26k26j98J09o47
7150c93N97n49J31M25l92j39J53K86M93j133J37N00L22m43J53p05P78J25m21o50
7170g25R13o25P7K13m72N79J028j070k7l2M88N3Ql35P2O22o49L52m06K39p08L23
$$ plain form
7025 -344 201 303 885 314 510 311 312 -445 -454 128 25 -405 -392 1111 380 211 -110 -1122 4 -742 -340
7046 -340 498 113 691 -477 -631 -18 334 819 -123 89 -107 -167 -3 -12 229 -94 -180 -173 -41 -241 147 -4
7068 -4 69 -39 73 435 105 -384 225 -139 282 850 -895 118 -582 105 263 -596 72 422 -255 248
7088 248 -6 -739 2 -82 -48 -157 181 -411 623 155 776 -881 614 -567 -30 41 -127 258 -104 -218
7108 -218 81 -496 1 205 -485 303 -284 -334 339 484 853 604 -503 -43 -5 318 -366 -124 -517 -556 726
7129 726 184 141 542 -315 105 -695 -323 -285 -99 67 547 247 -52 -26 881 343 569 343 145 254 -393
7150 -393 204 -345 -214 211 -181 -320 -167 119 612 -521 -384 116 438 -5 148 -557 221 346 -75 -725
7170 -725 188 -437 -360 -147 -619 -40 988 -82 -109 -141 347 400 408 73 145 767 118 470 64 303 -405 -82
7192h2K96m3m33K6j48L56J038r83P7L91k45l49r8Q50J78j503N8J25L15l1R6K09
7214A00K0k68r2J25j50M72k57J0k49Q7k85m7R68k55J38m39K1N39j061P79n26K83
7236h7K90Q4k76q62P66M08J20O3p22K87J08P73q17j31L40q1K45n96r7N24j100
7257g61J205l61N06q19L34r5k89O0m97J91M90Q4J89n59K48N56k79k61J45N4l81
7278b40L28k90Q08p34P49r05K12kQ26j109J181r44k76P76p62O42r7j78j18K86
7298A53k38n14O9R14l4o34J07n9j68J86k87O10l06K86r4J66o95N32N16n86m81
7319e57J323l14J18m41j071J254j117P57o7J70k62M67k56q5k30L42K20L59m89
7338A21j55r8Q72p45K28N81p26j58j8l55J87N58m03m0k26K76P36k96k51J56n05
$$ plain form
7192 -82 214 171 -262 -236 -384 -28 1010 27 104 495 250 -99 -197 653 831 -672 -614 -489 -174 -205 -109 100
7214 100 120 -148 -240 -115 -265 207 -50 -40 -289 -202 -487 -534 434 179 317 -122 -101 438 -623 156 -370 -87
7236 -87 203 287 11 -851 -85 323 443 506 -216 71 179 952 135 4 344 263 508 -88 -185 339 -761
7257 -761 444 83 589 -230 104 9 -280 -220 -717 -526 -36 48 237 -322 -74 482 203 -58 87 141 -240
7278 -240 88 -202 606 -128 621 -284 -72 -74 752 -357 824 -120 -396 380 -382 260 163 -15 -133 153
7298 153 -85 -599 -530 384 350 -284 -177 -236 -404 -218 -505 105 -201 85 -9 157 -538 -6 510 -76 -557
7319 -557 766 452 570 129 -942 312 -805 -48 -115 55 -207 260 4 -81 -311 31 251 610 121
7338 121 -34 -132 740 -5 223 804 78 -80 -98 -453 -266 292 -111 -151 -377 -101 635 339 88 244 -261
7359b61N90M37o55R8m16Q24j47r16O59n88N9N79m13J8N9j37M0j04L13k80r2N18
7381A85l14o45J234k87J83j70m09J80M55j32P1j49r3m31N4N49m13J034m56o08
7401a62L74k35O2r0L58J1m77M58N1p38N21L80o29K39K53J5o59M95m15J83J96p07
7423e16P00l06R06q74M84m38rN44p17N57j83J50%n86J82j55L6k77q60J598p20
7444d84rO6j72J130o37k32k25P55Pl74J74O74n21L00o25m08N61l17M89j51j52
7465a51M17k16k59K02P89r27J06N98J71P6j073M86j55J65lp6n53k74Q73l53J18
7486c9j38O08j02r93n1J066l96J37l0R44j160Q47n40O63q64n39Q65j91J56O65
7506I08r32n29M23j28O93l84l79k59M94J88k59k10O85l68j49J106j404K60N15
$$ plain form
7359 -261 329 766 111 209 -207 617 470 -446 213 -375 -316 263 -150 -132 -73 -210 -170 -274 39 -241 -333 185
7381 185 -129 -774 460 173 356 186 -223 -43 412 280 351 202 109 -322 -268 281 -132 902 446 -162
7401 -162 212 -23 39 -51 307 318 -159 299 350 -388 133 513 -116 123 376 391 -268 227 -188 -5 191 -516
7423 -516 184 -122 784 -90 394 -44 -53 491 -226 331 148 298 298 -288 -106 -261 -225 -502 -1362 236 -484
7444 -484 -493 -427 -599 531 -106 -338 -563 192 199 -175 -1 673 152 452 -173 -581 -20 -337 152 1 -151
7465 -151 266 50 -209 -7 782 -145 -39 559 730 806 -267 219 64 229 226 150 -403 -677 196 -157 -39
7486 -39 -177 431 329 -664 -715 351 -45 92 62 1006 -154 693 153 816 -48 -587 278 87 243 908
7506 908 -24 -553 -130 -258 435 51 -328 -587 -93 95 -164 -374 311 -57 -206 900 -504 -244 271
7525B71r22K61P66l78k57N15r15J027m34o74J70P13j32J83K30l31m9j97l90J079
7545E36k98j0J62n76m8K16p72N96L41l92n09J662q73L10K75k31o07N86R4o75j64
7566c77J41R5Q51j39j551Q24K69L62q16j62O28o25N93r28J175k46L20j255R33
7585I2o2J49j15k67k99Q53n79R49o65j0q02R29o98L68k40J02K85L08n44k81R53
7606D26o49J45j77N53l3M17j119J037j097K91M55nn58J99O4L12m10O34p07q8j67
7627d77P63J04K41k90L56r21N80L09j385Q56l07L51rm58j06L13j99l0O62q19j26
7648e92M28J06P29p69J19J50k03Q53j361N32L53R4k45J37n20P4n46K60L4L11k58
7669c14M5j25K96J3L23K26j84j289J724j73m79M0K79l3L24n94Q9k11r75J511J73
$$ plain form
7525 271 -651 -390 376 -2 -259 256 -659 368 -66 -740 -570 143 11 194 424 93 44 -153 -543 536
7545 536 238 228 390 -186 -234 -18 -790 -194 147 -245 -754 908 35 345 620 389 -218 368 462 -213 -377
7566 -377 -236 -141 710 571 -980 -156 113 475 -341 -503 125 -500 93 -835 340 94 414 -841 92
7585 92 30 179 64 -203 -502 351 -228 721 56 46 -756 173 -525 -157 -397 -295 -10 298 -246 -527 426
7606 426 -223 -78 -255 298 265 682 -437 600 -497 -206 249 244 -314 -115 -51 261 -149 485 -222 -310 -477
7627 -477 286 390 631 341 697 -224 356 665 -720 136 -171 180 171 -287 -393 -80 -279 -309 353 -466 -592
7648 -592 -164 -58 671 -98 21 171 -32 821 -540 -8 345 439 194 331 -189 -115 -661 -401 -367 -56 -314
7669 -314 -269 -394 -98 -85 238 464 280 -1009 715 542 63 103 382 349 673 79 168 -43 -1018 493 666
7690F66j238P70m79L4P7K23o63J043l57j50O11j89R6l53m44K48j97O31N2n76o29
7711h24O83J70J39m71l52J036m87N50o4l54L19k87J85l44N34r29J099m67m10K08
7731f6K01k54J84p76Q14K28k91j15j41L86k75j94N12j16l57P70p08N89J57l01
7751B47R7n68o8j8j13O66m60M98m03O5K27l81l00J87L37N03l20m10K70O14k91
7772C79n24Q11j01q78j21j50M06M38k32k56J56l15N70Q7q2R18j160m8J45L31k49
7793A25m1j92l39J61L28N75l31o48J37j2O58l83k78L86L7J35N2m07N8o8j95L74
7815A32m04J54O4l64M89n21N85n4j41J08o91R27m5j23J6r9O50p63M68m6k31J23
7837B34J18K80m76m07m68J080o97Q79l28o51R77q05K5N07j88l19J090n89p32M45
$$ plain form
7690 666 -572 198 -281 -247 -170 53 -610 433 76 -74 537 348 444 91 -353 -105 -302 329 381 -195 -824
7711 -824 -141 29 168 -303 -655 381 -106 444 380 26 345 58 243 -101 433 -496 603 136 -274 -66
7731 -66 135 -119 65 -711 103 331 40 -75 -216 170 -105 -299 213 97 -260 510 -198 391 548 247
7751 247 344 -224 -292 -310 -423 243 -217 281 -122 -57 170 -211 -511 -324 13 516 196 -214 56 670 379
7772 379 -145 666 565 -313 -434 -584 -178 260 28 -228 -72 -387 183 270 188 1106 -54 -102 43 374 125
7793 125 84 -108 -447 -286 42 617 286 -362 -225 -237 421 38 -240 146 183 318 370 -37 21 -47 -242 132
7815 132 -272 -118 -54 -418 71 -450 135 81 -60 48 -643 284 239 116 132 33 683 -80 388 342 111 234
7837 234 352 632 156 -251 -719 361 -336 543 215 -436 541 -264 -239 268 80 -239 851 262 -470 -25
7857b5M57q23P15n59K10P69r24p4O46Lj325M14M21k86N02j3J15M57j43q06l18
7878e87J162n90K44M6L48r94j65J237o43m48J97nN8l12N62l64J44O00n26J23K77
7899C64m77J004l65n63K48n32J006j717J059J33N95p85K50p3L31q08j90O37m01
7918b84R5P79l18J85j227J027m37N00KK48o06J56q2l95M71q91J040k19K69k14
7938I9J66K43l01n55O04j30K88K76n20Jp87L11J59K06k84l22K96N09k99K08M4
7959B12j55k12N20j14m09l24J7O07J26k03q25P43Q09l15p74Q50r06O84o79N11
7979A63l70L47j077J276n98m29N85r7J207p95J31l72K33m76J001l90p11Q46p03
7998b29l53O92r03M28J096n04q54q6L9J548m42q50L75K89m88K03k35P01m55L94
$$ plain form
7857 -25 432 -391 324 -235 -25 744 -180 -254 392 395 -930 -516 -95 -381 121 108 223 680 537 -269 -587
7878 -587 575 -15 229 275 623 -371 -536 701 58 -390 -193 -198 -140 -452 110 -254 -110 490 -36 87 364
7899 364 -113 891 526 -37 211 -321 685 -1032 27 160 755 -30 220 147 478 -330 -520 117 -284
7918 -284 -189 590 272 457 -770 257 -180 320 322 570 -36 120 38 -357 114 -777 263 44 313 99
7938 99 265 508 207 -348 256 126 414 690 170 171 -616 -305 -146 60 -224 -546 -250 259 -40 168 212
7959 212 57 -155 365 251 -158 -482 -465 142 268 65 -760 -17 792 477 -297 553 -353 331 -348 163
7979 163 -207 140 -937 339 -259 -688 -103 -200 1007 212 343 -29 204 -272 729 339 -372 474 -229
7998 -229 -582 110 -793 -365 731 227 -627 -713 -674 874 432 -418 -43 246 -242 -39 -274 427 -28 366
8018C66j6J09l69m65O5P18o78L70n56P99n12J29M78p07Oo0R8J6J427j046j85M87
8040D74k67r2n8Q7Q96p21l40L41q05P1P27j53L32p60L97L48l67K94m75k5N68k82
8062A90m96P07l40j1L00J23p86O19O4m08K83O11p41m89K43l3M51p5J65k69rJ79
8084B78l46L30J25qj53n18k45J074o1j277M63M9M39M15k92o40N89k93l16N08p76
8105f55P34l46R3k04P58o20J31p3o10M22j15K98k03O02p53Q44l30L08l71o78J870
8126A102p89p43L36l13Q88j080K31M56q78O72P68p86q5P9L03J08N60m05j97l14
8146h7q3M51p35P36k25m29K96J24k89M21J02j83n20J041o20k76M59M44q84l7J88
8167a06k14J255j307P03o06j50k43J163o26K04o67N03n14R29r36O59J0J003r47
$$ plain form
8018 366 350 459 90 -375 -310 408 -270 100 -456 343 -169 -40 438 -269 -263 -323 -225 -209 1218 172 -13 474
8040 474 207 115 57 144 1040 319 -21 320 -485 -414 313 160 492 -268 129 477 110 404 -71 -96 472 190
8062 190 -306 401 61 50 350 473 -313 306 370 -38 245 856 115 -374 -131 -164 287 212 377 108 99 278
8084 278 -68 262 387 379 226 -292 -537 537 476 -801 -338 -289 150 565 273 -367 222 -71 -387 121 -655
8105 -655 79 -267 -174 -378 380 -240 -109 -182 -792 -370 -485 -187 -390 212 -541 303 -27 281 -90 -768 1102
8126 1102 313 -430 -94 -407 481 -599 -368 88 -790 -118 650 -136 -221 -142 161 269 829 424 227 -87
8146 -87 -170 281 -454 282 57 -372 -76 48 -241 180 282 99 -421 620 0 -276 183 627 -257 -294 -106
8167 -106 -320 935 -372 331 -275 -425 -668 495 -131 73 -594 -91 -605 324 -612 47 57 1060 113
8186A13j08J09J35j19m14
$$ plain form
8186 113 5 114 249 130 -284
8191b84
$$ Imaginary data points
##PAGE= N=2
##DATA TABLE= (X++(I..I)), XYDATA
0@%%%%%%%%%%%%%%%%%%%%N8j22J28j28J28j28J31j93K54k56K80l44L84m37N01
35B56n57O24p00P93q74R72j088J211j341J481j636J803j991K197k417K661k934
52a540L236l570L943m359M832n373O000o731P604q665R981j1669J3926j7131K2034
67A2518l0622N0133k06852R7810J94957j83505k0061J19956L1335q8936K9128
78E861L8862r482j9413J2981l3801R208L9757l8044n7168O1055K4239p0049k0931
91e6925N7577M546m9394r80N8804k443m0808L2348L8289l3980l4L1649k1377j3820
105C452K8317j1281l6194J9953K8070m8695k7510N3542q190o6915L4709M6467
117A5725n1062n074O2315n496k5466L3966K0715k8804m191K7133j9877l5416K5012
$$ plain form
0 0 0 0 0 0 0 0 0 0 0 0 0 0 0 0 0 0 0 0 0 0 58 -64 64 -64 64 -64 67 -126 128 -128 152 -192 192 -245 256
35 256 -301 323 -377 416 -458 514 -574 637 -704 777 -859 944 -1047 1150 -1267 1394 -1540
52 -1540 1696 -1874 2069 -2290 2542 -2831 3169 -3562 4042 -4623 5358 -6311 7615 -9516 12518
67 12518 -18104 32029 -174823 -77013 117944 -65561 -85622 34334 65669 -23267 5861
78 5861 44723 35241 15828 28809 -4992 4216 43973 5929 -51239 9816 34055 -35994 -56925
91 -56925 652 5198 -44196 -45176 13628 11185 -29623 2725 41014 7034 7000 38649 17272 3452
105 3452 31769 20488 -15706 4247 32317 -16378 -43888 9654 1464 -65451 -30742 15725
117 15725 -35337 -40411 21904 16408 -9058 24908 45623 16819 12628 39761 19884 -15532 9480
130I480O488m4485O515K9848k3692j8327K4592P183j9024j15K5354n17k0475K2594
144E419K2137k4131L884L0856k1537j8862K4151J187l3925p28K2405j7956k7246
157c4346K6765J0202l9199J2585L5092k6856j2339M0164n1k1707K3436K2529k2373
170A3902p754K6025m161l3539P021J5156l4051r829K5799j2290j9034J9094J1743
183a918j3046J657J9276R72j4423J5472J6648k1964j369K6848j1119j8199J6760
196A5595L178k4352k671J4113j2277k0293J4744Q976k4040N371K7502j4946j0786
209a9886L3145J718k0511J4773J8738j5236j0822J9580J542k6251K114J5512k1805
222g389j6485K0952o427j9932J4272J0935j1784J444J9352K897j1022R461J8231
$$ plain form
130 9480 15968 -28517 -22002 7846 -15846 -34173 -9581 -2398 -21422 -21537 3817 3300 -17175 5419
144 5419 27556 3425 7309 38165 16628 -2234 21917 23104 -10821 -11549 10856 -7100 -34346
157 -34346 -7581 2621 -36578 -23993 11099 -15757 -28096 12068 12017 -9690 13746 36275 13902
170 13902 6148 32173 28012 -5527 1494 16650 -17401 -27230 -1431 -13721 -32755 -13661 -1918
183 -1918 -14964 -13307 5969 6941 -7482 7990 24638 2674 1305 28153 17034 -1165 15595
196 15595 18773 -5579 -8250 5863 -6414 -26707 -11963 -2987 -27027 -21656 5846 -9100 -19886
209 -19886 13259 14977 -5534 9239 27977 12741 1919 21499 23041 -3210 -1096 14416 -7389
222 -7389 -23874 -2922 -9349 -29281 -15009 -4074 -15858 -14414 4938 7835 -3187 6274 24505
235B4505j5449p569K0795o768j7884J1365N073j9801l421J0724p431j3882P933
248a1810P845j6517M3K4006p810j3319K5792R283j8867Q657J7480j0913j0239
261C631J1512L191j9266n387J4536j2911j5763J6644j615j9959J0942J4464j1936
274a1917k333J7394M747j0699O473J8329q969j1492J8029k06j9469N102O589j7547
288e969m277R964p368j1962O783Q989j1671k300K0508j298j4394J8180J1196j4301
302B080L147J5519o168j0627P635L780j6028n771J1775r174j7409J3013M787j7829
316b1270M972J8352r161n884J6437O914j0042J684J5410m352j1595J1893M205
329A7563j7650L189Q410j5657o041J0144n803j2268M591Q651q513l243J6922K603
$$ plain form
235 24505 9056 1487 22282 15514 -2370 8995 14068 -5733 -9154 1570 -5861 -19743 -11810
248 -11810 -3965 -20482 -20439 3567 -4243 -17562 8230 17513 -1354 7303 24783 13870 3631
261 3631 15143 18334 -932 -6319 8217 -4694 -20457 -3813 -5428 -25387 -14445 19 -11917
274 -11917 -14250 3144 7891 -2808 3665 21994 13025 1533 19562 19356 -113 4989 11578 -5969
288 -5969 -10246 -282 -7650 -19612 -12829 -3840 -15511 -17811 2697 1399 -12995 5185 16381 2080
302 2080 5227 20746 14578 3951 11586 15366 -662 -6433 5342 -3832 -21241 -8228 -3441 -21270
316 -21270 -16298 2054 -7107 -12991 3446 10360 318 2002 17412 13060 1465 13358 17563
329 17563 -87 3102 11512 -4145 -10186 -42 -5845 -18113 -13522 -4871 -13384 -16627 295 2898
343B898j1333J1122J4554j0368j78J2946o142j0075N663L972j4782n566R602n224
357b911j5141Q019R274j6700J389J7851n329q081J2461Q629o521J627J1967l321
371A3213j0649R084N437j7486j067R305j1541p860R506j677j1747K418R695m647
385h016o890J1527N208p267P129J3897q601j547J3733l172j1977N315J343j2550
399a868p720Q569k436j6499P038J1444j1336k611J6456j481q312J1091P715o936
413C114l01J1934j607j0048O878O074j4649n578J1717r485j2461Q184K486r996
427a3738J137P794k96m588P428O425p663L748J3109o293m369J2402m73j0997M427
442H053M166j0294j0090M681l13j3596O48J1406o521l517J5571J361q015J1101
$$ plain form
343 2898 -8435 2687 17241 6873 6695 19641 13499 3424 9087 13059 -1723 -7289 2313 -2911
357 -2911 -18052 -10033 -759 -17459 -16070 1781 -3548 -11629 832 9461 2940 4567 16534 13213
371 13213 2564 11648 17085 -401 -1468 7837 -3704 -11564 -2058 -3735 -15482 -13064 -3369 -8016
385 -8016 -14906 -3379 1829 -5438 1691 15588 6987 5440 19173 16001 4024 9339 10682 -1868
399 -1868 -9588 -1019 -3455 -19954 -12916 -1472 -12808 -15419 1037 -444 -8756 2335 10050 3114
413 3114 2813 14747 13140 3092 9970 16044 1395 -4183 7534 -1951 -14412 -6228 -3742 -13738
427 -13738 -12601 -4807 -5103 -9691 -2263 4162 -3501 247 13356 7063 2694 15096 14623 3626 8053
442 8053 12219 1925 -8165 -3484 -3797 -17393 -16745 -5339 -11860 -15377 194 1555 -6460 4641
456D641R082p987j618R303j643j1281N110Q059j2288p752J1029l726j2732M984
470f819L495r594m71Q817n43l866P623O835m598J733J0851m964p102R672J855
485A2924r962O38M906p219p041K965O44j0277j835Q030m576n614J3262L653o855
500f357J1056J0376p372l488J0180K45j1864m14P480q826r873Q673n51j1111M760
515g086M982q158r39P427j192l470N853Q280m140l56J1267r61p580N665M275j0680
531C187k146L902o343n544K615J850p628j594P241k850o150J0222N480q490N698
546e50J2801l747l834Q663K382r418l019N624p208j1184O630J211j1758L436P422
561b549p559p54J0100M01n092L882P574k795k786Q150K134p904M843N095r096
$$ plain form
456 4641 13723 5736 4118 13421 11778 497 5607 13666 1378 -6374 4655 929 -11803 -6819
470 -6819 -3324 -12918 -13389 -4572 -5115 -8981 -1358 5477 879 2612 13463 8499 1397 11069 12924
485 12924 2962 3600 8506 1287 -5754 -2789 -2145 -12422 -14257 -6227 -10803 -16417 -3155 498 -6357
500 -6357 4699 15075 7703 4215 14395 14640 2776 2362 9842 1016 -8857 -184 -735 -11846 -7086
515 -7086 -2104 -10262 -11201 -3774 -4966 -8436 -2583 5697 1557 1201 12468 11507 3927 9592 13867 3187
531 3187 1041 4943 -1400 -6944 -4329 -2479 -10107 -11701 -4460 -7310 -13460 -3238 2242 -6248 -550
546 -550 12251 8504 4670 13333 15715 6297 3278 8902 1694 -9490 -2860 -1649 -13407 -9971 -2549
561 -2549 -10108 -10862 -762 -361 -5453 -1571 6003 3208 422 8572 10706 2802 7645 12740 3644
576C644l546K991l424o350J319l83n179r42P148l31n522P388O680o021K917R824
592A0213k484m488O574L042o278l754M700l711r735L554Q69j1889M44R462n255
607h736l526J0195L870n086M039O452n40m130N566K714p402J590M473p080l259
622h60N255n426n898K242K65m185k680M818K584m667M830P607l417M2J0096k008
638H598m531L764K525n548k573L315l432q989K759L847j0093j873Q970l965m916
653a2142Q405M323m458L039P741Q15l699M129K668o060l05M395p254n529N129
668A197k538n994O44J842k614k270M506L004l716J740P093p79n52P060o06m207
684C810L847L196o560k938L499l621q150J221N418r328l167R344m47n761O010
$$ plain form
576 3644 98 3089 -335 -6685 -5366 -5749 -10928 -11870 -4722 -5053 -10575 -3187 3493 -2528 389 10213
592 10213 7729 3241 9815 12857 6579 2825 7525 3814 -5921 -2367 -1498 -13387 -12943 -3481 -8736
607 -8736 -12262 -2067 1803 -3283 756 7208 6668 2538 8104 10818 3416 5006 9479 2399 -860
622 -860 4395 -1031 -6929 -4687 -4422 -8607 -11287 -6469 -3885 -8552 -3722 3885 468 510 10606 8598
638 8598 4067 7831 10356 4808 2235 5550 2118 -6871 -4112 -265 -10358 -12231 -3261 -7226 -12142
653 -12142 -3737 586 -3872 -833 6908 7723 4024 8153 10821 4761 4456 8851 1597 -3932 1197
668 1197 -1341 -7335 -6691 -4849 -7463 -9733 -5227 -2223 -5939 -4199 2894 2115 1563 8623 8017 3810
684 3810 7657 10853 4293 1355 4854 1233 -6917 -5696 -278 -9606 -12773 -3429 -3876 -9637 -3627
699c627M234k864K433O528M52l172L515L768o255k160N925o237o126L715j071
714i42p235j34L038j362k008K628L215n58J201N838j54k631P771r21m746M659
730G659J962n361k801J465k081n984j838N167m046n499O354J320n126N925N058
745B174l961K660N857j90l198K804M060m740m508N806l123q528K448K505p000
760f934q36K477j833p22K377K729j53M36O469L45k386N777J977n962K059M173
776I993n586n071P48j98m132j937L455l307l834N670K231n371M385O055l283p
792a89O983J44m247L301L980l852m647K608m78p990J424K610o177j655L647j694
808f232o17K701K971j237J055M797J368l372M389L465m108p86M052m302l715J41
$$ plain form
699 -3627 607 -2257 176 6704 7156 3984 7499 11267 5012 2852 8777 2540 -3586 129 -942
714 -942 -8177 -8311 -5273 -6635 -8643 -6015 -2800 -3358 -2157 3681 3527 896 8667 7746 3000 7659
730 7659 9621 4260 1459 2924 843 -5141 -6979 -1812 -5858 -11357 -5003 -3683 -8809 -2884 2174
745 2174 -1787 873 6730 6540 3342 6146 10206 5466 958 6764 3641 -4887 -2439 66 -6934
760 -6934 -7770 -5293 -7126 -7848 -5471 -2742 -2895 -2459 4010 4355 1969 7746 9723 3761 5820 9993
776 9993 4407 -664 84 -114 -4246 -6183 -2728 -6035 -9869 -4199 -1968 -7339 -2954 3101 -182 -189
792 -189 6794 6938 2691 5992 9972 6120 1473 4081 3603 -4387 -2963 -353 -6530 -8185 -4538 -6232
808 -6232 -6849 -4148 -1177 -2414 -1359 3438 4806 1434 5823 9288 5180 4394 8446 4144 429 570
824E70j969m027j053J225o38m349M783M021m557L535O954l174o22O363n09l035
840C518P54K978k739l460J789J62o666m84K991m379l468M850j007j617L326K896
856e56q60o88N380L542m190K021L636l059j079K005k854l809J392j493m284m02
872e298oj573k579L728L611k945Q64P485J069k731N447J050l997M08J587j531
888D589m921J406P03n736l4L475m993l155M578M68k704J100M407M73r93M717L283
905F663j727j63L101k379k798K506k464l736O04r78m074m25Q77r18j362J286L933
922b054j939o6O941P76j187M152J759k561K86O72l345l737N29J10n440j295M936
939a463l084l733M601K562m024J671L598Nk02K692L319j864R4L227j802k661J888
$$ plain form
824 570 -1399 -5426 -6479 -5254 -5892 -10241 -5458 -1437 -5994 -2459 4495 1321 699 7062 6553 3518
840 3518 4272 7250 4511 1051 2840 3002 -3664 -4148 -1157 -5536 -9004 -4154 -5161 -6778 -3452 -556
856 -556 -1416 -2104 3276 6818 2628 4649 8285 5226 4147 6152 3298 -511 881 -612 -4896 -5298
872 -5298 -5304 -6877 -9456 -5728 -2117 -5062 -4198 3287 4356 1625 7072 8122 4125 4533 6120 4589
888 4589 -332 1074 1777 -3959 -3993 -518 -5511 -8666 -4088 -3620 -6324 -5224 -817 -344 -1337 3380 6663
905 6663 4936 4773 7874 5495 2697 5203 2739 -997 -393 -1371 -5445 -5870 -4993 -5911 -7273 -5987 -2054
922 -2054 -3993 -4059 2882 3658 2471 6623 8382 5821 6107 6779 3434 -303 226 336 -5104 -6399 -1463
939 -1463 -4547 -8280 -3679 -1117 -5141 -3470 128 133 -69 2623 5942 4078 4172 7399 5597 2936 4824
956D824j800m743M22O55l880j457O02J049j207K80M096r61o29M913J195j246L393
973E506J804k878J220J606l551l581J69L88m458l247L604j349l756L936K721k638
989d504J789M239j01M23J257K134j506o6L481k033l348J497p3n143L60Q43l609
1006d360k293J981m59m33J042K510M51Q79L643J142k098L562J268k911k43K203
1022E884k559l431K56P99m055l731K596O19m090K097L547k375J543N369q15L56
1038B010K544J976k171j645L509j570m518J470L46m422m47J301j672k599Q89R15
1054d084m37R49J414R44j4M527J470k422K169L345l966q23K027j648l411j558
1070a518N70j494k989J346M99l228J727M084k132K53N297K17j398K209K178j095
$$ plain form
956 4824 3024 -1719 -1297 -642 -4522 -5979 -5377 -4328 -5535 -5255 -1159 -2120 -2749 2164 3359 2113 5506
973 5506 7310 4432 5652 7258 3707 126 295 683 -3775 -7022 -3418 -4767 -8523 -4587 -1866 -4504
989 -4504 -2715 1524 1423 1846 3103 5237 3731 3665 7146 5113 1765 3262 3189 -1954 -1594 -751 -4360
1006 -4360 -6653 -4672 -5131 -5564 -4522 -2012 -1561 -682 2961 4103 2005 5567 6835 3924 3681 5884
1022 5884 3325 -106 150 949 -3106 -6837 -4241 -3622 -7712 -5615 -2068 -4443 -2900 2469 1654 2010
1038 2010 4554 6530 4359 2714 6223 4653 135 1605 1951 -2471 -2918 -1617 -3289 -5888 -4999 -4084
1054 -4084 -4521 -3572 -2158 -1214 -1228 3299 4769 2347 4516 7861 3895 3072 5099 3451 40 -1518
1070 -1518 -948 -2442 -5431 -4085 -3586 -6814 -5087 -1003 -3135 -2882 2415 2632 1234 3443 5621 4526
1086D526n95J459k88m404n02J905l643k398J644j804j580J275P44q12J688K309
1102d76J190j137K313K344p88k31L185l45l339P13p45k961j110Lj682j342j61
1119d569J030k029M47M249j196l29M864J215k539K606K083j159j897J862j6l746
1135H76j102J684l033k791K321j913j914J454J411j038K61L267Q17k91K694K652
1151E355j188o06J387k62k002n2j280k339k8J1l109j241J090J177j151M74L080
1168f84r70o39M528R22l37P35K149j531j174O68L87l155j748J446k049l561K107
1185b906l61l231K019K528j019n11K605K476j194J572K539j55j050J408J04k977
1201A847R98r72l141o30n99j115j090m11J772o05J49L431Q28k326L840J199j464
$$ plain form
1086 4526 3931 5390 5102 698 196 2101 -1542 -3940 -2296 -4100 -5680 -4405 -3661 -4473 -2785 -476
1102 -476 714 -423 1890 4234 3446 3215 6400 6055 2716 3429 2684 -277 -1387 -1384 -3066 -4408 -4569
1119 -4569 -3539 -5568 -5121 -872 -2068 -2397 2467 3682 1143 3749 5832 4673 2776 4638 4622 876
1135 876 -226 1458 -1575 -4366 -2045 -3958 -5872 -4418 -3007 -4045 -3784 -517 300 9 2703 5355
1151 5355 4167 3561 4948 4686 2684 2632 1352 -987 -1015 -1004 -4113 -5354 -4264 -3087 -4238 -3764 -684
1168 -684 -1654 -2293 2235 3157 2820 3555 5704 4173 2999 3667 4054 899 -849 597 -1452 -5013 -2906
1185 -2906 -3267 -6498 -4479 -1951 -2970 -3481 -876 1600 406 1978 4517 4362 3312 4720 4824 1847
1201 1847 2845 1873 -1268 -1898 -2497 -3612 -4702 -5113 -3341 -3946 -3797 -366 462 -1864 1976 3175 1711
1218A711J460J529p82j789R86m92j620j479J087k130l876K823K77k988J036K320
1234a927p24Q35J999J554n74J093R41N89j527K204l91j931K95m63l387q92O27
1251a679j701j610k08J744m06N91J986J780o75K476K064j430P64J571k046j099
1267B122R81q69j772j907J612q84l990J589R34k727J148J349m2NK785J460o6R83
1285B711K008j29j590J399j91l704K70O44k635j415R07j132j108J55P9O38n38
1302c631J900J402j80L316J903j605J223J367k084j725M20p95k359j161J062j286
1318b233k062P05K192j861k77K663j217j10K571L66oJ569K045L65k708J199J274
1335D475k603k288P35j562j998J54k54o20J30R26M96N41Q92J68J31K867J243K75
$$ plain form
1218 1711 3171 4700 3918 2129 3115 2623 1003 -476 611 -1519 -5395 -2572 -2295 -5283 -4247 -1927
1234 -1927 -2651 -1816 183 1737 1163 2256 3197 3786 2259 4463 4072 2141 2436 1973 -1414 -2306 -1679
1251 -1679 -3380 -4990 -5198 -3454 -3860 -3269 -1283 497 -178 2298 4362 2932 3696 5267 3221 2122
1267 2122 3103 2234 462 -1445 167 -717 -4707 -3118 -2184 -4911 -3763 -2414 -2456 -2451 334 1794 1728 2711
1285 2711 4719 4590 3000 4399 4208 504 774 1418 -1217 -2632 -1725 -2857 -3965 -3810 -3731 -3093 -3631
1302 -3631 -1731 -329 -509 2807 4710 3105 4328 5695 3611 1886 2306 1511 -848 -2009 -947 -2233
1318 -2233 -4295 -3590 -1398 -3259 -3536 -873 -2090 -2200 371 737 731 2300 4345 4710 2002 3201 4475
1335 4475 1872 -416 319 -1243 -3241 -3087 -3341 -3961 -3831 -2905 -2409 -1868 -976 -808 -677 2190 3433 3708
1353C708m84K018r44k380N74j458k286j011m72K02k301Q91J349j247J105K221
1369e15q0j198L077J257j336N83J541P29j566N01J278l088j273O45q95k528J71
1386b697q76m38R22M44m10J055J022K420p42M99L141o25j337K127K50k756k74
1403A725q11j395j461J93j020j822O33P66m23K50K745O86j058J954J918q40Q73
1420B913K68O90j543j792K765j733j613L7l92l062N16L37j245Q49l34J160J4R61
1438a204L060q08M30J876P88j253O64R5k302M12j052k199M39j048k70j655l48
1455d375J884k80k55J622K019j503K608J817q15m05J716j016k25j304J497k248
1471G37j648R56j077k495Q80N34j738J72K289m73j59J363J805k0N03Q39J057q38
$$ plain form
1353 3708 3224 5242 4298 1918 2492 1034 -1252 -2263 -2735 -2533 -4834 -3943 -2594 -3841 -2736 -515
1369 -515 -595 -1793 1284 2541 1205 1788 3329 4058 2492 2993 4271 1183 -90 555 -340 -2868 -2697
1386 -2697 -3573 -4011 -3089 -2645 -3055 -2000 -978 1442 700 1199 4340 3715 2378 4505 4755 1999 1725
1403 1725 914 -481 -1942 -1749 -2769 -4591 -3958 -3192 -3615 -3365 -620 66 -992 962 2880 2040 2913
1420 2913 3181 3871 2328 536 3301 1568 -45 -8 -400 -3462 -2946 -2609 -3854 -3005 -3339 -2179 -2165 -1204
1438 -1204 1856 1048 1478 3354 4142 2889 3553 3648 1346 1758 706 -1493 -1054 -2102 -2372 -4027 -4375
1455 -4375 -2491 -2771 -3026 -1404 615 -888 1720 3537 2722 2317 4033 3017 2792 1488 2985 737
1471 737 -911 45 -1032 -3527 -2647 -2113 -3851 -3679 -1390 -1863 -2022 -659 1146 1126 1629 2468 3525 2687
1489B687N84j08k373l9m2p93j925m37L7k27r29J576j02j81J733Q36o67K541N24
1508B695q2k2R33N4j270L13n83j685k003J228p80k087K6J529j511p72K157O18
1526a242Q15O42J321J073o07Q94O59j236O3R07k917L57l62j750k73l13q64o71
1544c504J50O45J116j040K348O50j032J451J998l4m61J471r13k171Q62j04j260
1561A72k247J383j06k667j84K393j691m97K038N05L3J792M66K38J71P59J122j085
1579B595K56M91k568o38m5r97j673p9L30K97n41L68J183o83J215J192r7L12K183
1598C101n09j107J892J91j835K79r05o63j696q90J890k778p56J699m81m99J455
1615a612J406l12P13J889q89N85Q91P91r82k86N55j455j363m24k88j520r08oj020
$$ plain form
1489 2687 3271 3163 790 751 709 -84 -2009 -2446 -2409 -2636 -3565 -1989 -2091 -2272 -539 297 -370 2171 2695
1508 2695 2613 2591 3524 3578 2308 2621 2038 353 -1650 -422 -1202 -3289 -3263 -1734 -3245 -4017 -1860 -1242
1526 -1242 -427 215 1536 2609 2002 2896 3555 2319 2382 3289 372 729 367 -1383 -1656 -1969 -2833 -3504
1544 -3504 -3354 -2709 -1593 -2633 -285 365 -667 784 2782 2748 2287 3758 2845 674 1536 1432 172
1561 172 -2075 -692 -798 -3465 -3649 -1256 -2947 -3444 -1406 -901 -868 924 1390 1628 1799 2558 3680 2595
1579 2595 2851 3342 774 136 91 -906 -2579 -2658 -2328 -2031 -2572 -2204 -1021 -1704 -489 703 606 918 3101
1598 3101 2592 1485 3377 3568 1733 2012 1107 444 -1252 -2142 -252 -3030 -3786 -2087 -2568 -3067 -1612
1615 -1612 -206 -518 195 2084 1195 1780 2671 3462 2480 2194 2749 1294 -69 -493 -781 -2301 -3209 -3215 -4235
1634d235J785M97M68P00N74J164P56o76J491L14j450Q32M47j516r50O76n56j569
1652a248j104M49o96k62J15M64n55K062O30l64L45K478K65q66N03J228p90j167
1670A487l14k77j472J46p09j640P70K2j294Q45L03J49M95N65K800K21M09P69l11
1689B964n77K55l45j682j118J75q31j11o19K89o7n21N05n26n20J453J037pP64
1708E18J184J481p20m57J113L33k533Q31q31j667n24Q76k406J03N27j190L37P06
1726b319J214p15K196R09P99k75L69P56k73M09j007o98n84r85j072j314J68Q48
1744a574q71KJ535N40j426J369J351p88M88J039k97K33J1P10k4p78l23k6j763
1763e92k48o20j577j43J766j563J397j82J016K28J059J52J416o4k16J172p53l65
$$ plain form
1634 -4235 -2450 -1953 -1485 -785 -211 953 1709 1033 2524 2838 1388 2220 2667 1151 201 877 321 -1248
1652 -1248 -2352 -1903 -2599 -2861 -2746 -2282 -2837 -775 -145 -509 -164 2314 2579 1713 2216 3444 2654 1487
1670 1487 1173 896 -576 -430 -1139 -2779 -2009 -1987 -3281 -2436 -2133 -1984 -1489 -924 1876 2097 2506 3275 2964
1689 2964 2387 2642 2297 615 -503 -328 -1159 -1270 -1889 -1600 -1667 -2188 -1683 -2209 -2729 -1276 -239 -246 518
1708 518 1702 3183 2463 2006 3119 3452 919 1750 919 -748 -1272 -396 -2802 -2699 -2172 -3362 -3025 -2319
1726 -2319 -1105 -1820 376 1285 2084 1809 2178 2934 2661 3070 2063 1365 781 -204 -1276 -2590 -2422 -1574
1744 -1574 -2445 -2443 -908 -368 -1794 -425 926 138 626 1665 1368 1601 1612 2322 2298 1520 1197 1171 -592
1763 -592 -840 -1460 -3037 -3180 -1414 -2977 -1580 -1762 -746 -518 541 693 2109 2045 1829 3001 2248 1883
1781A883J14j138k92m08j570o99j39K86o68p30J189J847j525J268J992k19j54
1798A037P60l79N80j19m35M03j224P24l37j478p06R01j238j344R32l64qk08J857
1817f46M23O90J37Q14M94L02O86j549M51M31j654l48n32p22q66j30J72k15r26
1836b988O79J014N1J088P22J47M11J476O95j330L62n16o20p72m36K69j890n44
1854b182Q56j024m42J098Q68j070N72N80K90J539m14J275m92K16J102r13l94P83
1872B248j491j243J40r11n6j173k62K21O76O60O51j80J392M31l80K60J217J19
1890B319j332J729p44r12r91m49M56j071j083N82m63p6L10L25m04J223k18J790
1908I91m47J056l37K35N49P56p62j384Q15n92o78o43p85j218K37K63k41m8N2M53
$$ plain form
1781 1883 1997 859 567 159 -1411 -2110 -2249 -1963 -2631 -3361 -2172 -325 -1850 -582 1410 1191 1037
1798 1037 1797 1418 1998 1879 1444 1847 623 1347 1010 -468 -1174 -273 -1511 -2855 -1923 -2287 -2295 -2503 -646
1817 -646 -223 467 604 1418 1912 2214 2900 1351 1802 2233 579 231 -301 -1023 -1889 -2019 -1847 -2062 -2988
1836 -2988 -2309 -1295 -1244 -156 566 713 1124 2600 3295 1965 2327 1811 1191 419 -17 252 -1638 -2182
1854 -2182 -1326 -2350 -2792 -1694 -826 -1896 -1324 -744 -454 1085 671 1946 1454 1670 2772 1859 1465 2248
1872 2248 757 -486 -346 -1257 -1313 -2486 -2748 -2527 -1851 -1191 -540 -720 672 1103 723 983 2200 2319
1890 2319 987 2716 1972 1060 69 -380 76 -995 -2078 -1496 -1959 -2035 -1725 -1400 -1804 -581 -799 991
1908 991 544 1600 1263 1498 2047 2803 2041 657 1472 880 202 -441 -1226 -2444 -2207 -1944 -2185 -2233 -2181 -1728
1928a728J237Q47M42n6N2J035M01k59j95M74j022j242L94o38j016l34k63j68o47
1947b686R36M93p50J341Q05k49Q95P01J016p79l05R48k54j765M55n74r35l48P9
1966i76m62n70m65N65L86K34J83Q92M90R43O27n35M32Q84j070M9O31j702o57R2
1986b9n12l80j202J51M81q13N35L20l13J347J254j60J93P24J50R7r03N61L04q87
2006I18q59L97m34j023p09k60n06J068j63q65R12J595P13J81O09O68j319j35J230
2025B018l79n18K59p90o96Q8q71m24j020Q17q6o26N05J331m84j5J488mm49J380
2045A524l95O48m24J186l08j336j000L65n39r50l68J64j210J199P08n77K55Q03
2063b55M22J182j83J000q19P89j1j107L42r4j055n35j26K00r29J1r7N79r61K76
$$ plain form
1928 -1728 -491 356 798 742 794 1829 2230 1971 1776 2250 1228 -14 380 -258 -1274 -1608 -1871 -2039 -2686
1947 -2686 -1750 -1257 -2007 -666 139 -110 785 1486 2502 1723 1418 2366 2112 347 802 228 -707 -1055 -976
1966 -976 -1438 -2008 -2473 -1908 -1522 -1288 -1105 -213 277 1220 1847 1312 1744 2628 1558 1607 2238 536 -121 -29
1986 -29 -541 -921 -2123 -1972 -1491 -2304 -1769 -1449 -1762 -415 839 679 872 1596 1746 1843 940 1501 1805 918
2006 918 59 456 22 -1001 -1710 -1970 -2476 -1408 -1571 -2436 -1524 71 784 965 1574 2242 923 788 2018
2025 2018 1639 1121 1380 590 -106 -18 -889 -1313 -2333 -1516 -1602 -2228 -1723 -392 -876 -891 597 593 144 1524
2045 1524 1129 1777 1353 2539 2231 895 -105 260 -279 -1229 -1597 -1433 -2643 -1444 -736 -1313 -1058 -255
2063 -255 167 1349 1166 2166 1347 2136 2125 1018 1360 1266 211 -324 -450 -250 -1179 -1168 -1265 -686 -1647 -1371
2083a371O82j90L3J073N74j64Q22L55Q73j439J38n41k61l43o9L02j888N84J43
2102f87j324L83O17J10m34N1N00P52J235J37O40MN41r41n85k67k29j222O23j368
2122a464j01R7N58o03l36N13R94l9j274K947r3j015J001Q04j95O88j187N6q22
2141E29p48M94j022r70M08N24j557J293p4O87L15J94j87J820r03J037J61l71K79
2160A909M41j625j14Nj087r2l35q78O5Q35l54O28m70J489o74J94P51O69m45N79
2180A491P52j594L69L53O08o53j801N70o87j100j10Q5J09m32M12P14M81M71N32
2199E70L43J34K22L57o14Q92j42l21j447O18p11m54l4o91o36J060r98L59M7J030
2219d16Q83p99K083p01N11qM77p65l63L42m45r14r25L11N87j463J37k22o67J723
$$ plain form
2083 -1371 -689 -879 -846 227 801 637 1459 1814 2687 1248 1386 845 584 241 172 474 -1414 -830 -687
2102 -687 -2011 -1628 -1011 -901 -1335 -1284 -784 -32 1203 1340 1980 1984 2525 1584 999 732 503 -719 -96 -1464
2122 -1464 -1565 -1468 -910 -1513 -1849 -1336 -342 -381 -1655 1292 1199 184 1185 1989 1794 2482 1295 1351 529
2141 529 -219 275 -747 -1717 -1309 -785 -2342 -1049 -1123 -436 -121 73 -114 1706 803 1840 2001 1630 1909
2160 1909 2350 725 611 616 -471 -563 -898 -1776 -1711 -876 -1230 -602 -1072 417 -257 -63 688 1357 912 1491
2180 1491 2243 649 1018 1371 1979 1326 -475 95 -592 -1692 -1802 -1717 -1608 -2040 -1628 -914 -433 38 570
2199 570 913 1047 1269 1626 1012 1904 1762 1441 -6 612 -99 -553 -587 -1278 -1914 -854 -1852 -1493 -1446 -416
2219 -416 467 -332 1751 1050 1561 1553 2030 1265 902 1244 799 -115 -1040 -729 -142 -1605 -1468 -1690 -2357 -634
2239f34ml05k20Q22P60L29o3J298l63j54n9%n1o40j229j76K07j120m49O07K45
2260a199n80Q1P99M10J047m93M90J454o75j42M30P2o12n90q40j04L57r58m63J25
2280a391J54k92j69P43L52K53n04J784p6R6j3M29n1O74p85r4m45o26L07o52o26
2301i32k87J41n29Q33l05L69L94K34L44K30j49P14k12J11L92k79K80m66p71J93
2321C05m49j164K59p83R60n97k56J29J716L6k68M07O91J61j20L1J81l66k50J054
2341A677j529L48o07l77r07L15k66K53m65O9K7N46J76J387L49k79J023r32J76
2360I84O95m31o12k71j52j623N28o8j20N31j017L72K1l01P29Q18l8P09M24j29
2380A049K96K67p04k70NL0n02j46l22j81j425J292n72M85r01Q54l09O53n23J685
$$ plain form
2239 -634 -638 -943 -1163 -341 419 748 685 1983 1620 1466 1407 1407 1356 716 -513 -689 -482 -1602 -2051 -1444 -1199
2260 -1199 -1779 -1698 -899 -489 558 65 555 2009 1334 1192 1622 1694 1082 492 -348 -452 -95 -1053 -1516 -1391
2280 -1391 -1237 -1529 -1698 -955 -603 -350 -854 930 854 950 937 1366 1315 1989 1204 1110 665 39 346 -306 -932
2301 -932 -1219 -1078 -1607 -774 -1079 -710 -316 -82 262 492 343 1057 845 956 1348 1069 1349 883 112 305
2321 305 -144 -1308 -1049 -1832 -872 -1469 -1725 -1596 120 156 -112 295 986 1147 1027 1058 1239 873 623 1677
2341 1677 148 496 -111 -488 -1395 -1080 -1346 -1093 -1558 -1489 -1462 -916 -740 647 996 717 1740 808 984
2360 984 1679 1248 636 365 213 -1410 -882 -950 -1070 -539 -1556 -1184 -1163 -1464 -735 83 45 754 1178 1049
2380 1049 1345 1612 908 638 643 673 171 25 -297 -478 -1903 -611 -1183 -698 -1599 -745 -1054 -401 -924 761
2400G61p29Q38m32N60O71k40o23q00J25L13q30k61L1m32k00j28K8k19J282K81
2420dl25J38O65k02O96M70m0l7m69P3J7j011n0l99l38m16l14K20K60K93q0Q72
2442A9k07j03L27J03P81M1m5j57J56J87q20P3l96J52p43m27R8o43N53j75k31O01
2464h56p3O88Q56k39K56j86P65p4L52m55j16q99N16r41m22J71k61n4L54n24L10
2485h32J6k2R49N72M8k78K03J125k94J80l02n05l84j08n70p68K12m51K15P07o80
2506i67J60k95P63L92l25K74K98J631p54j35Q95j56p07j17j83q35n11J43q01L47
2526h83o11L9N33o24J057R14n75M90J34O74m97P19J15k72l29M13j050l68l91j72
2546f84j92K76M7j145J562j68q65N25L69N67l02R16Pp87L45N80J43o26K64r95
$$ plain form
2400 761 32 870 438 998 1669 1429 806 6 131 444 -386 -647 -616 -1048 -1248 -1376 -1348 -1567 -285 -4
2420 -4 -329 -191 474 272 968 1438 1398 1361 892 965 982 -29 -79 -478 -816 -1232 -1546 -1326 -1066 -773 -853 19
2442 19 -188 -291 36 139 920 961 916 759 915 1102 282 355 -41 111 -632 -1059 -961 -1604 -1051 -1226 -1457 -856
2464 -856 -929 -241 615 376 632 446 1211 1137 1489 1034 918 19 535 -406 -828 -657 -918 -972 -618 -1142 -832
2485 -832 -816 -838 111 683 731 453 656 1781 1487 1667 1365 860 476 368 -202 -970 -758 -1209 -994 -287 -967
2506 -967 -807 -1102 -339 53 -272 2 300 1931 1177 1042 1937 1781 1074 957 774 -61 -572 -429 -1230 -883
2526 -883 -1494 -1455 -922 -1546 -489 425 -150 340 474 1148 651 1370 1485 1213 884 1297 247 -121 -512 -684
2546 -684 -876 -600 -553 -1698 -136 -304 -1169 -644 -275 292 -10 906 913 126 471 1051 1194 568 832 -163
2566a63L61n6j171n15K44m12J423k88q31J038l52L36L04K2J205j14N7L54o83k
2586G57m36L56o35L72p59n77q1j56k03K21P0Q63M34K58J35o19O11N66j67k89M7
2607G68n17j3L67j70j052j52j0P51r18p11O15N36J73K38j00N76r6Q01k15M38p23
2628E86J181j536O70l34l64p36J79l8N4r88J60M97l66J95L08j74J054M00o44Q17
2648I21m17JK66M80j048R2L8o90j28k4%k16n90L00P22q04N95k3K18J200q71k32
2670b10N74M10O35j11K01j092j71J3p19l71k04N58l07J18J35j13p75R58k93J535
2690G71r04M65M46k18P67p41O69m13j007M05j15k98n77ln8K07l40K38R6N12K71
2711A73r24L32M96R85m11R70p79m4j70k22j78K79j72r60j39j84j62P95o73J08
$$ plain form
2566 -163 198 142 -1029 -1544 -1300 -1712 -289 -577 -1408 -370 -722 -386 -82 -60 1145 1031 1088 1442 759 757
2586 757 321 677 42 414 -345 -922 -1003 -1159 -1362 -1141 -1071 -208 226 484 619 0 611 1177 1010 721 768
2607 768 251 238 605 435 -617 -769 -779 -28 -946 -1657 -1042 -506 -333 -95 -195 381 285 1086 871 1309 586
2628 586 1767 231 901 567 203 -533 -354 -392 -338 -1326 -1166 -669 -1035 -840 -532 -706 348 748 104 921
2648 921 504 505 771 1251 203 295 333 -357 -485 -509 -509 -725 -1315 -1015 -293 -1097 -502 -525 -307 893 22 -210
2670 -210 364 774 1409 1298 1499 407 236 249 -470 -841 -1045 -487 -794 -676 -541 -654 -1429 -471 -764 771
2690 771 -133 332 778 560 1327 586 1255 842 -165 240 125 -173 -750 -753 -811 -604 -944 -706 -610 -98 173
2711 173 -751 -419 77 1062 651 1621 842 798 628 406 228 507 335 -625 -764 -948 -1110 -315 -988 -880
2731h80J8L92J452r07K84j19J014J09r06Q20j048O09p37r12K24J74M30j213J07
2750a089P00m65j72J46K90K10K20rQ31O2n33L75J279o79pj306K71j24K25n17n36
2771h28M37q10J029q39P62j63J08M05N72k85K0K28l97J045r43K13ol18M23j028
2791c75q45N59M07o17l37L43J97J21J41N73L08j81l39j04N52O87l94M51o75n96
2811a24L10k93l06o30J88k76L61j65R41j233J217N38p53M66M07J13J357q83j44
2830A091j47p19J273j815n6k14O02j225J497p36o92M49M38m27m02M68M08J04J419
2849A316m43l6N29q86k38Q94j213J55m99j28K50q4l20k89K83l82p2L41M08O27
2869B13M34j73K99j87q2L43k21J50jj060K51n47P95j317K36L50n80L45M85K82
$$ plain form
2731 -880 -862 -470 982 75 359 240 1254 1363 457 1277 229 838 101 -811 -587 -413 17 -1196 -1089
2750 -1089 -389 -854 -1026 -880 -590 -380 -160 -169 662 724 191 566 1845 1166 1159 -147 124 0 225 -292 -828
2771 -828 -391 -1201 -172 -1011 -249 -412 -304 101 673 388 408 636 239 1284 341 554 548 230 653 -375
2791 -375 -1220 -661 -254 -871 -1208 -865 -668 -547 -406 167 475 294 -45 -149 403 1090 696 1147 472 -124
2811 -124 186 -107 -413 -1043 -855 -1131 -770 -935 6 -1227 -10 528 -225 241 648 761 2118 1235 1091
2830 1091 944 225 1498 -317 -373 -587 15 -1210 287 -449 -1141 -692 -254 -681 -1083 -615 -207 -103 1316
2849 1316 873 837 1366 480 242 1136 -77 78 -421 -549 -299 -383 -703 -992 -709 -1091 -1163 -822 -414 213
2869 213 647 474 773 586 504 847 626 776 775 -285 -34 -581 214 -1103 -867 -517 -1097 -752 -267 15
2889A5k40K5N35M5Q27o46k04M91m26K16m16q2o30M82q73L86K40J96j185j52M30
2910i66o5Q98M91k83QQ3J86M51r4L82p9m38l50j8q7j20m17J19j082M86k0KP90
2933a23q46R77m03L73M0Q88j60j29L7k19m22m28O34r84P98l23p44J73m92L84J68
2954h01O79l44O23K53J19M4l90N40K14l58p84J37k47J94k64o78O43P13r07o36
2974a250Q52k42K33L70k77N32k51j40R57k0m4M41k73m70J98n57J00J9n95j59M79
2995i7r92L37J06k11J008j081O18O84M92l3K47p79L88p34O59m67k85K52o02J82
3015c08R9P7k73J72j25q2N59j91l61O16j80M19M36M07q45N2J19m47l5j11q29K67
3037e64P7N80m98j37N8J62J51J49p04P37P29m48m1j03R15m42L1J62o3o15j56l49
$$ plain form
2889 15 -225 -200 335 380 1207 561 357 848 422 638 222 140 -490 -8 -881 -495 -255 -59 -1244 -1396 -966
2910 -966 -1031 -133 358 75 83 166 352 803 709 1091 1012 574 224 206 119 -1 -418 -299 -1381 -895 -915 -913 -123
2933 -123 -969 8 -395 -22 18 906 746 617 654 435 13 -415 219 -765 33 -290 -1034 -861 -1353 -969 -801
2954 -801 -122 -466 157 410 529 573 183 723 937 579 -205 -68 -315 -121 -385 -1063 -420 293 -614 -1250
2974 -1250 -398 -640 -407 -37 -314 218 -33 -173 784 764 720 1161 888 418 616 59 159 178 -417 -576 -97
2995 -97 -1089 -752 -646 -857 151 -930 -312 372 864 831 1078 299 687 -47 612 145 -140 112 -490 -308
3015 -308 -209 -132 -405 -233 -358 -440 119 -72 -433 183 3 422 858 1265 420 472 591 144 109 -2 -831 -564
3037 -564 -487 93 -405 -542 -484 -322 -171 -22 -726 11 740 292 251 148 1063 621 652 814 751 136 -20 -369
3059c69K54o82P64J7l37m6J13l02K94J811j737M47k41M13J39O9M3j032J405r28
3079I5M0m53k55j19j49M79m51J25m6O54j92L80k28M82o00J74O19Q40o21l4j053
3100c13Q05J50M4q81j1r05J004m60l24L93J38O42l3j08L38K12M2j43L26q2j69
3121F65q6K0J18j255mR30m97r66J223o1l37L73l91k39M05l84J131p30J23J080
3141A118l06J44l14m98P3n22K61r3M5k81o46J169j288R8R18j60K61J88K02n60
3161a91L31p5P38j78mk07J43m87o20R72p32O11j373P49q34J256K1r14N06j40Q57
3182D29J31l31R4M02r04R72r09P32M26j090n31O03p09n79J427q10N03J06l61m5
3202d44K57m04R82O3J26K6k6k84O68j042q9L12l29l18k83j75j80M72J13j19N09
$$ plain form
3059 -369 -115 -797 -33 -16 -353 -399 -286 -588 -294 1517 -220 227 -14 399 538 607 650 -382 1023 95
3079 95 135 -318 -573 -692 -841 -362 -813 -688 -734 -80 -272 108 -120 362 -238 -64 555 1395 774 740 -313
3100 -313 492 642 686 -195 -206 -1111 -107 -567 -891 -498 -360 282 249 141 479 691 733 590 916 834 665
3121 665 579 599 717 -538 -542 388 -109 -1075 148 87 -250 123 -268 -507 -102 -486 645 -85 38 1118
3141 1118 812 956 642 144 217 -305 -44 -137 -92 -373 -1019 150 -1138 -1040 -122 -282 -21 167 369 -191
3161 -191 140 65 803 625 621 414 557 70 -550 422 -310 301 -1072 -323 -1157 99 120 -794 -288 -428 429
3182 429 560 229 323 725 -179 793 -116 616 1042 -48 -579 24 -685 -1264 163 -647 -144 -38 -399 -444
3202 -444 -187 -591 391 454 580 606 580 296 964 -78 -167 145 -184 -502 -785 -960 -1140 -668 -555 -674 -165
3223a65m14L16P89O58n64j74K5P9L25r09Q97r6o34p10K48j50p52Q04pO52p31M18
3245i5j32K76p35J075L29r7M05q68K10j54M53l86l44q1L96N0j177O30K24Mo83
3266g00K0O61K87q26M94K17m49J087j72nn37n5l8O9%k40k18p07Q59n89l01M68
3288f75O20o45K03N33K40J54M37m97l13M36L01J31n67l47m50M27J40l29l98J78
3308d21p9N37m25r28Q73N58p1q66R39J75L90k47J13jk15r2LM86r46j95m3l42j57
3331i54N70m63Q4M8P60PN6k29Q4L97k24J46J86Q85j135j13J39m64j71N22m37l8
3353c44J8N24m49m37l69N21J594o02K66j35n57J01O43K85j4n99l5O1m23o20N23
3374d8j71n6q0p2M59o32P47m14N42R0l89M49q9L78K02q50L86k44n91L08L33o10
$$ plain form
3223 -165 -579 -263 526 1184 620 446 471 550 875 -34 863 767 133 -577 -329 -479 -1231 -427 -434 218 -513 -95
3245 -95 -227 49 -686 389 718 621 1026 158 368 214 667 281 -63 -144 252 302 -875 -245 -21 -17 -700
3266 -700 -680 -19 268 -558 -64 153 -296 791 619 614 77 22 -16 53 53 -187 -405 -1112 -253 -842 -1143 -675
3288 -675 -55 -700 -497 36 276 430 867 370 57 493 794 925 358 11 -439 -12 128 -201 -599 -421
3308 -421 -500 37 -388 -1316 -443 115 44 -822 117 292 682 435 548 547 332 240 243 729 -217 -412 -455 -797 -954
3331 -954 -384 -847 -763 -715 45 52 108 -121 -37 360 136 282 468 1353 218 105 244 -220 -391 131 -306 -344
3353 -344 -326 198 -251 -688 -1057 -536 1058 456 722 587 30 131 774 1059 1045 446 411 472 49 -571 -48
3374 -48 -219 -275 -355 -427 32 -600 147 -267 275 365 -24 425 336 714 916 66 452 208 -383 -75 258 -352
3396c52K9p0k73J35j5P56j169Q11M70q38N57P85K02n65m07P3j30m4L35j40q5o30
3418e65Q8l10o4L17k6L11p96P03L91j5j47K62P97o41K85N3m4l87l44M70q43l28
3440h33M06n19M0n5O59r2n71R68M55J4k77l21M73k61J036k79q81L61k59k77nL85
3462A67o81J94k83K63l41N73N87j194m81J683K11o33L02n11P29j0p6o63O27o32
3482a69P1l33N35n15M66K95q48M81m70L61O6L36l7j98k34O47l14L4k87N50j20
3503C17r34O25r7n13P09n50J71l45K66k2P81m53n1O16n44N87k19M96l32j05n28
3524a25M97n5l28R18r10j11N1J6r09P36J145j171m2N37J39o67O78j5N50n78l70
3545a4N15J16L53j313K93j92N1N8n25P1L32J51n15R44K30m60k68R79r69P58j4
$$ plain form
3396 -352 -323 -393 -666 -531 -546 210 -959 -148 322 -516 41 826 1028 463 56 129 -1 -45 290 150 65 -565
3418 -565 -477 -787 -851 -534 -560 -249 -1045 -342 49 34 -113 149 946 305 590 643 599 212 -132 338 -505 -833
3440 -833 -427 -946 -906 -961 -302 -394 -965 3 458 472 195 -126 347 86 1122 843 -38 323 64 -213 -218 167
3462 167 -514 -320 -603 -340 -681 -108 479 -715 -1196 487 698 65 367 -144 585 575 499 -164 463 -169
3482 -169 -98 -431 104 -411 55 350 -498 -17 -487 -126 -60 276 239 41 -193 454 140 174 -113 437 317
3503 317 -617 8 -89 -602 107 -443 -272 -617 -351 -373 408 -45 -96 520 -24 563 344 840 508 403 -125
3524 -125 372 317 -11 907 -3 -114 -63 -47 -956 -220 925 -246 -288 249 388 -279 399 384 934 356 -14
3545 -14 501 617 970 -343 -50 -242 -191 -133 -658 -587 -255 -104 -619 325 555 95 -173 806 -163 595 581
3566E81J70l43k00n74L97L89l78l84j60o36O10k91R01m51J074q69N6O92j17P40
3586A207j436L41j97O57p82K62l31L02N84o00p37L87m89O58L79p26K18k45N07
3605d1J63J98m66K36P17m02L2m0m72L6j83m37L56o8j6Q19m32r5r94J30N35J368
3627I44j161P82m00j0N55k32q32Q74m96Q11r17j41L16K87k68l36n8l8j73k63P2
3648f84j59J006p5p9Q9O96j75l12L6p75J346p40l40K77l29k7m87J74N49n9o20
3669f88J033q18J65J43L9K45J23N85m06O1q28M07K14m91L53l19L32M8o01J01J93
3690a09j7J58p6n62P58r70N56K48J59k52Q91l06p45O38p25M94q45J38L80n50N56
3711a81m01o1L62o95Q23j20J17O10j029j16J868P0n95n73L69R9j191J32J33M07
$$ plain form
3566 581 751 408 208 -366 31 420 42 -342 -502 -1138 -528 -819 82 -369 705 -164 -108 584 467 1207
3586 1207 -229 112 -85 572 -210 52 -279 23 607 7 -730 -343 -832 -174 205 -521 -303 -548 -41
3605 -41 122 320 -146 90 807 405 437 397 -75 -39 -222 -659 -303 -371 -387 432 0 -95 -1089 -959 -424 944
3627 944 -217 565 165 155 710 478 -354 520 24 835 -82 -223 93 380 112 -224 -282 -320 -493 -756 -684
3648 -684 -843 163 88 9 98 794 619 307 343 -432 914 174 -166 111 -218 -245 -732 -558 -9 -68 -688
3669 -688 345 -473 -308 -165 -126 119 242 827 421 482 -346 61 275 -216 137 -182 150 198 -403 -302 -109
3690 -109 -126 32 -44 -606 152 -818 -262 -14 145 -107 784 478 -267 371 -354 140 -705 -567 -187 -737 -181
3711 -181 -582 -643 -281 -976 -153 -273 -156 454 -575 -691 1177 1247 652 79 448 547 -644 -512 -379 28
3731B8p70k06J62P3J398j006l14J606j226L89K79m9J32Q1k66n97J059o27J93k58
3751H1q9l99L9J01J5K41L67j116O19O79j06L1q41Q18K03n33j63m7K10J99rk38
3773F2l95O59r7o43K88p31Q43n00N33j22k36J63j64Q99o53O33j7n32J90L03m55
3794B8k89M09l15j40j72J89n30k45P78r8l99R40K83q02N87j97J39J76m37O48p8
3815D75l55n92J049m13j42n69M85q41J007p3J71o01J43O1l05N58p65J351o39J41
3835A46N1N78j242N11l29M70K79q07m36j28O20P16m00m81k03J290l84l13J60K84
3855C82O9m5M22n17j93k91j04O36m55o68L86k37J86L19J2j45K11o9L83k04Q6n29
3877c65J074r32O5K84J77o3r4m29n05O1K63M69L2K1j91J26K15j078J350l57j043
$$ plain form
3731 28 -742 -948 -786 -713 685 -321 -635 971 -255 134 413 364 496 577 311 -286 773 146 339 81
3751 81 -8 -407 -368 -267 -252 -11 356 -760 -141 538 432 463 -378 440 643 110 -53 -100 110 309 300 62
3773 62 -333 326 229 -414 -126 -857 -14 -514 19 -103 -339 -176 -340 559 -94 539 522 -10 180 483 28
3794 28 -261 148 -167 -307 -479 -290 -820 -1065 -287 -385 -784 156 439 -363 224 27 166 342 -95 553 475
3815 475 120 -472 577 164 22 -547 -62 -903 104 31 202 -399 -256 -195 -500 58 -707 644 5 146
3835 146 197 775 -467 44 -285 185 464 -343 -779 -907 -287 429 29 -452 -655 635 251 -62 98 382
3855 382 451 406 828 311 118 -173 -277 359 -96 -764 -378 -615 -429 -110 -98 -243 -32 -101 282 78 164 -365
3877 -365 709 -223 -158 126 303 240 146 -283 -788 -727 -464 5 37 58 -133 -7 208 -870 480 123 -920
3898i20J481l81n10J191p41J42o46Q76R2m77R6n47K97j122R74M36m26l08N96K6
3918A29J16k20l54J154q39nO10N2j096N63k75l34P57l91j26j3J74q17J241m85
3938a59O73m4k58J50o8L62J18j20l66n20J25Q00o64K52j181P31k87M12J43l73
3958b74J85K62k69l47j98L70j76K11Q7L09l41k43R12p71O92n95K13r6Q6O45j147
3979d85o67Q25P51K46n86K64l91K08K5J03M71m01l64q6l0J14m31j96r4L12L67
4000d5l53M27O98p76L20p55M82k57R05k35m86M65R0n79N41j47M5q61O87J49l68
4021e3m08P53n74J58L97l93k46o82J340j44m18K85L7Q64p28K11Q5%k71o7l8m98
4043c90P3NNM37j40j197J241J77N2k46j12J90J91k76k52P12kk98k88N14J5r78
$$ plain form
3898 -920 561 180 -330 861 120 262 -384 492 584 107 203 -344 -47 -1169 -195 241 -185 -493 103 129
3918 129 245 25 -329 825 -14 -19 591 643 -453 110 -165 -499 258 -133 -259 -272 -98 -915 326 -159
3938 -159 514 470 212 362 294 656 774 654 288 -232 -107 693 29 281 -900 -169 -456 -44 99 -274
3958 -274 -89 173 -96 -443 -641 -271 -447 -236 -149 160 -181 -424 488 -283 409 -186 27 -69 17 662 -485
3979 -485 -1152 -327 424 670 84 348 -43 165 190 293 764 363 -1 -87 -117 -3 -434 -630 -724 -412 -45
4000 -45 -398 29 727 -49 271 -484 -2 -259 646 411 -75 390 480 -99 442 295 340 -521 166 315 -53
4021 -53 -461 292 -282 -124 273 -120 -366 -1048 292 148 -270 15 52 916 188 399 484 484 213 146 108 -390
4043 -390 -317 -312 -307 130 -10 -1207 34 211 263 17 -95 95 286 10 -242 470 468 170 -118 396 411 -567
4065e67J66n14J307r05P93l38lnM0j47K76j27K23k05L57j86L57j25J21l62n88
4086d32R26p25l16M36j9p20L75K86j80O16l88N54m36l88R06J86m29o77J159m66
4106B68q6l25n35L91K52p02K32%R49n38K89R9m73k18R54q07j04Q81k44J98n38
4127e7mN41m78n69K95m21M02K35k66j29q0K62l63J133j163J08O21M24r4K02k63
4148C36o65P77n35l40P1L64j18M67j686J143j11K96n95O96K34q36R33j224J155
4167C62k08m64L64m8j40K62M03m74l05O9J1k75R1K06J61K9l22M33M99n74J5J04
4189A99M96K37j468Q06P28l44o39J43m95J52j25k70P65o06J169o80p69R83n73
4208b91J22N62j80K78O94p12j25O9L8K11p24J22j84l95K24J56J15q68M48O22q16
$$ plain form
4065 -567 -401 -915 392 -513 280 -58 -61 -66 -26 -173 103 -24 199 -6 351 165 522 397 518 156 -432
4086 -432 494 -231 -547 -111 -130 -850 -475 -189 -369 247 -141 413 -23 -411 495 681 252 -425 734 268
4106 268 182 -143 -678 -287 -35 -737 -505 -505 444 -94 195 294 -179 -397 557 -250 -354 527 283 481 -57
4127 -57 -61 480 2 -567 -272 -693 -291 -56 -322 -451 -531 -269 -632 501 -662 -554 67 491 397 599 336
4148 336 -329 448 -87 -427 -356 8 -110 357 -1329 -186 -297 -1 -596 100 334 -502 431 -793 362
4167 362 154 -310 54 6 -134 128 531 57 -248 -179 -168 -443 -352 -146 15 44 -278 155 654 80 95 199
4189 199 695 932 -536 270 998 654 15 158 -337 -185 -310 -580 185 -421 748 68 -701 282 -291
4208 -291 -169 393 213 491 1185 473 348 417 455 666 -58 64 -120 -515 -291 -135 -20 -888 -440 182 -634
4229f34N22j05M97L46q16R03n11L1J22q36M72j14O52n22L01l11m76N10L96o94
4249b67k12N31K23j4j183O59M4k80M39J060n03m76j90J073m49j35m65J30o19R31
4269B97rr42n57N46J121o14O72l64J43n57Q39o31n71J90o9O31M79n38ql83M30
4290A05r79N10P23r96M66J44k30O45q91L67O2J12k98L03L28o47M45p12M00l9j97
4311c79P07ol12L99o6j078P36j65N69K26p58J67K54l65N6m19O25k79k42j18O66
4332B18n47L62N62n32j47P08m66p9L62l45J4j92L08j15m08O19k28R5P1K97k30
4353C27n54M19k49K21j085J025n87j87J94R82o54J159j193N06l50J39o86M92O29
4372E48J00r30P70n65k54K62o97N73L36m66P91p17O66k69j60K98o41J95L88K19
$$ plain form
4229 -634 -112 -217 280 626 -190 713 202 233 355 -481 -9 -123 529 7 308 -3 -479 31 427 -267
4249 -267 -479 52 275 261 -922 -263 -219 -499 -60 1000 497 21 -169 904 455 320 -145 -15 -634 297
4269 297 288 -654 -1211 -665 456 -158 514 150 293 -264 575 -56 -627 -437 -506 125 604 66 58 -325 105
4290 105 -874 -364 359 -637 -171 -27 -257 388 -503 -136 -74 38 -260 43 371 -276 169 -543 -143 -182 -379
4311 -379 328 322 10 409 343 -735 1 -164 405 631 -127 40 294 -71 -15 -434 191 -88 -330 -448 218
4332 218 -329 33 595 63 -84 624 158 79 441 96 110 -82 226 111 -297 322 94 189 260 557 327
4353 327 -227 192 -57 164 -921 104 -483 -670 -476 506 -148 1011 -182 324 -26 113 -573 -81 548
4372 548 648 -282 488 -77 -331 -69 -766 -193 143 -323 468 -249 417 148 -12 286 -355 -160 228 447
4392D47r39J348n82m17k02R6N57j99k0K70K28o50l94K29j72J56J36K21j20p1J44
4413F6M65q32O03M03l57o11J22L23n5l64j03N50m51P4Q3p0q6j18J055l97K40q69
4435c29K51k86M15K30o1n4l72O83q23N63J31o32L95j086J075M17k68L18n16K67
4455C18O95p98l90P50l59k85K11k19k8m55N67j16O39o16J42o76l80J416j113N0
4475f47O22M10J81l89j25l96N99k88J44K74j95l05N60k02K35r02o2l29R91K71
4495D47n47n7M67m25n5K63k56P92q28L75l13O32J45r33L17n21R59q0o12r1j24
4516d45J22k5M50N28p64R04p80K89n33L0L27j91k40K36P32j680J239J33k58n2
4536B2k18M88m52M57j91o62J128k89m70K96M96q78Q2J376j464M14O03r26m91L60
$$ plain form
4392 447 -492 856 274 -143 -345 -249 308 109 89 359 587 -63 -457 -228 -400 -244 -108 113 -7 -78 66
4413 66 531 -301 302 705 348 -263 -141 182 127 -237 -340 210 -241 -167 -84 -154 -240 -358 697 300 540 -329
4435 -329 -78 -364 51 281 220 166 -206 477 -346 217 348 -284 111 -975 100 517 249 567 51 318
4455 318 1013 215 -175 575 216 -69 142 -77 -105 -560 7 -109 530 -86 56 -620 -1000 416 -697 -647
4475 -647 -25 385 566 177 52 -344 255 -33 111 385 190 -115 445 243 478 -424 -486 -815 176 447
4495 447 -100 -157 310 -115 -170 93 -163 629 -199 176 -137 495 640 -293 24 -497 462 382 -230 -321 -445
4516 -445 -323 -348 102 630 -134 770 -10 279 -254 -224 103 -88 -328 -92 640 -1040 199 332 74 22
4536 22 -196 292 -160 297 106 -556 572 283 -187 109 605 -273 -191 1185 -279 135 738 -188 -679 -319
4556c19N73p01O22n61K43o96P86l37R32l73k80P2Q7k07K42%L97k42n10o2P56p34
4578c12N86j1J18l04p79K34j08L35j32N80m80L36K08L74m28j14M47r80p9N01k0
4599b8M56J10n19l0l17K86j87k63M67L27j19q64l63J715r82M18p03J044p4k00
4619A74l52n73J416q64R90q55M37r20j07J045r3p66N29K25j71k95M31k38L19q2
4639B50K88j73k53Q3j5k58M9L91n10j7M00l4m30m51J088l77J2l6mm15O17K09j361
4662i47J657j169L17o6M19J86n40m66j12O79k16J2N71j181J079l81J22K71m50
4681b15Q93p64J146r49l91J61l81Q47K06n39L25p91jj02Q2j34Q55m55R33q68M72
4702C30N37j258N80m77j72L65j28K28R7K33k55m89O92k62l2l07K44L4m76L78J90
$$ plain form
4556 -319 254 -447 175 -386 -143 -839 -53 -390 542 169 -111 -39 48 -159 83 83 480 238 -272 -334 422 -312
4578 -312 274 263 381 77 -702 -468 -576 -241 -373 207 -273 63 271 645 217 103 550 -430 -509 -8 -28
4599 -28 428 538 19 -11 -328 -42 -229 -492 -25 302 183 -681 -1044 671 -311 107 -596 448 374 174
4619 174 -178 -751 665 -199 791 -64 373 -547 -654 391 298 -468 61 286 115 -180 251 13 332 250
4639 250 538 365 112 195 180 -78 -29 362 -148 -165 235 201 -229 -680 408 31 43 7 3 -412 205 414 -947
4662 -947 710 -459 -142 -208 211 397 -143 -609 -721 -42 -258 -246 325 -856 223 -158 -36 235 -215
4681 -215 678 -86 1060 111 -280 -119 -500 347 553 14 339 -452 -453 -555 -473 -607 248 -207 726 -142 330
4702 330 867 -391 189 -288 -460 -95 -223 5 102 335 80 -409 283 21 -11 -318 -74 -40 -516 -138 52
4723E2P8j47J53N15o78l18J81N1K02m78J29j01p73Q51K30R15j664J107o92j25
4743e12L85K30k30P22o08m80q2R83k56j78M04K23l98N97q06P21r98m3N32p9o9
4764E8L05l07r29L21Q64n75L9P13m46n3r06R43m74J637j056j79n89O96K9k39J5
4785a33k31O28qK1o28k36J16j42P42P4L89q88O45m57p53J125l28j48l7k12O2k41
4807f40O31m61M90O7n55K18L55j32Q30j174K49Q16j205k99O36k25J41N64o73M42
4827G5J78k70n9J28O1p76N52O79n15J82m30L46J66O7M6M79r63k34Q6J03n97Q09
4849A13p98P93L13l04O1K87n00j47P86j045P76l55j31N27k4k59O7n68R84j245
4869f69R41j079P24J60j003P29N22n3K72r04M49l32J077n03j72l22M45n35N55
$$ plain form
4723 52 130 -17 136 651 -27 -345 -164 -113 89 -389 -260 -361 -1134 -283 -53 862 -802 305 -387 -512
4743 -512 -127 103 -127 595 -13 -493 -575 408 152 -26 378 601 203 800 -6 715 -283 -326 206 127 58
4764 58 363 56 -873 -552 312 -263 -224 489 43 -10 -916 27 -447 1190 134 -45 -634 62 91 -148 -133
4785 -133 -364 264 256 277 -351 -587 -471 -613 129 203 592 -296 349 -108 -861 264 -64 -212 -249 -461 -399 -640
4807 -640 -9 -470 20 87 -468 -250 105 -27 803 -371 -122 694 -511 -810 -174 -399 -258 306 -367 75
4827 75 253 -17 -76 52 113 -663 -111 568 53 235 -195 151 317 384 430 909 -54 -288 -202 -99 -696 113
4849 113 -685 108 421 117 178 465 -35 -182 604 -441 335 -20 -151 376 352 93 160 -408 576 -669
4869 -669 272 -807 -83 77 -926 -197 325 272 544 -360 89 -243 834 331 159 -163 282 -253 302
4888C02J97r33L17P13q63J9L37K59m73O42j229N63J47j26M02o02j93R55l02n15
4908c83P49m52L6J15L17k07j52J75l74j8L1l40P70n31N65m56o3k92L38n59J432
4929G01j244O26m4p5K97j33k57L52j80J64J23m83M21J00m26K24K00k0j74L12q2
4950D02o23pl51R52J6J40m22j65q8K56L3l90o70J258j05R1K8j79k19m46R59p81
4972c11L0Q3M16l42O01q34L60o31O45Q8j188k16J530j20P7k79k58Q1L21M21n28
4993e4J70R7J53qp85L47N49q55J132j247N73k00L01l15K93k54K25r6K1o81M21
5014b13n15M98N00j138Q88N25j124J184o44n07M40K80n16j97R06o76O30K13K26
5033G60j612N27P64n44k09L85j56L51J47k45l05J3l19O70q78ON52qj6j32L85p77
$$ plain form
4888 302 499 -434 -117 596 -267 -248 89 348 -125 517 -712 -149 -2 -128 274 -328 -521 434 132 -383
4908 -383 366 -86 -50 65 382 175 23 198 -176 -194 -163 -503 267 -264 301 -155 -218 -510 -172 -731 701
4929 701 -543 83 39 -36 261 128 -129 223 43 207 330 -153 268 368 -58 166 366 346 172 484 402
4950 402 -221 -228 -579 373 389 529 107 -58 -146 110 143 -247 -917 341 236 327 355 176 -43 -489 470 -311
4972 -311 -281 -198 218 -124 477 -357 3 -628 17 105 -1083 -1299 231 111 188 -91 -349 -268 53 474 -54
4993 -54 116 213 366 358 -427 -80 469 -386 746 -501 72 -128 173 -142 151 -103 122 26 47 -634 -213
5014 -213 -728 -230 270 -868 20 545 -579 605 -39 -546 -106 174 -342 -539 367 -309 321 534 760
5033 760 -852 -325 439 -105 -314 71 -85 266 413 168 -137 -124 -443 227 -651 -645 -93 -101 -117 -249 136 -641
5055f41N29M90p44J072j279P39o17J28Q02o92Q1J77L04k57j25l23K19J79k5k56
5075b39L93k75j0K74L24q02O33n89O73r96K34P52o70J94Q20m68m52l58J196o85
5095e1m19k03L45J54M61k65p01M4K24N19k74P84q25J25N77m02o90J047m91j35
5115a76J03P2L44J89O3l95o88R72j001K81Q20j070J067k5p90N51R9m67J88j04
5135C3K35K52l84K82Q9p78Q89j341K18N94p1K34l70M3P43k45J05j348J403J57
5155G40j014N40k93p22O57N14j80j61p21O49N05K93j105L69mK03l06O74j014J46
5175b30O49j114N15J59K75l71j95L26j67k91J105l21p23N83J35K80r65M28o94
5194f16N3M25RJ161p57m46K0J69l27n3p5J41l96J171J29m68l04j65P43K1j056
$$ plain form
5055 -641 -112 378 -366 706 -573 166 -451 -323 479 -213 -132 45 349 92 -33 -356 -137 42 17 -239
5075 -239 154 -121 -131 143 467 -335 298 -291 382 -614 -380 372 -298 -104 716 248 -204 -562 634 -51
5095 -51 -470 -673 -328 -174 287 22 -679 -635 -411 108 -166 618 -207 -82 495 93 -597 450 -41 -176
5115 -176 -73 -1 343 532 595 200 -488 484 -517 -236 584 -486 581 556 -234 317 416 -51 137 33
5135 33 268 520 136 418 507 -271 618 -723 -505 89 18 252 -118 -75 668 423 528 -820 583 740
5155 740 -274 266 -27 -749 -92 422 242 81 -640 9 514 807 -298 71 67 270 -36 638 -376 -230
5175 -230 419 -695 -180 -21 254 -117 -312 14 -153 -444 661 340 -383 200 335 615 -350 78 -616
5194 -616 -563 -138 -129 1032 275 -171 -151 18 -309 -362 -437 -296 -692 479 608 140 -164 -329 414 435 -621
5215f21Q05o04R09l37o7j14K11l52m5j11L42j21k85N07m96L16LJ68P01m35L94
5236G68p70J52K07n66O69p90M95k97K67K41m52N8L76n16n21P01j53R9M1n34O96
5257A71k8r47Q15J55R8J24q00M40K45n05M83j25o36Q51k40l71N7L60j73K53m32
5278b05K79M04k54j03L6Om53K66k57O71k14Qr03Q35l99N81j21l30n86Q62j05R54
5300I72o98q1K19p04R32o26L29p31J196m20k26n21K84k01P90n60k78M86j31l26
5320b95k3J043j533Q72r2n02R38L95q49K75K7M57l41l85k31p3L21o9K16j46L08
5341C13j39o86J088m29j69L8N10o6n01n45M26N26m2K95n25m15Q20j000K4l4Q41
5362C30j02l98Q73n21j99Q9l5r21Q23k17K44o37O62k46p4N92N89k75o32m60M53
$$ plain form
5215 -621 184 -420 489 152 85 -29 182 -170 -215 -326 16 -105 -390 117 -379 -63 -60 108 809 374 768
5236 768 -2 150 357 -209 460 -330 165 -132 135 376 -76 -18 358 -158 -679 22 -131 -32 9 -525 171
5257 171 143 -804 11 166 264 388 -412 28 273 -232 251 126 -510 341 101 -270 -213 147 -26 227 -205
5278 -205 74 478 224 121 157 163 -290 -24 -281 390 176 184 -719 116 -283 298 177 -153 -739 123 18 972
5300 972 274 193 412 -292 640 14 343 -388 808 388 162 -359 -75 -276 514 -46 -324 162 31 -295
5320 -295 -318 725 -808 64 -28 -530 408 803 -46 229 256 713 372 -13 -244 -317 4 -65 151 5 313
5341 313 174 -512 576 147 -22 16 526 460 -41 -586 -160 366 324 619 94 -321 499 -501 -477 -511 330
5362 330 228 -170 703 182 -17 72 37 -884 -61 -278 -34 -671 -9 -255 -329 263 852 577 -55 -515 -62
$$ [...]
8191b98
##END NTUPLES=NMR FID
##END=
