##TITLE=1H_LY-Benza/dehyde
 CDCl3, 8 sc, 
 5.7.2019
##JCAMPDX= 6.0         $$ Bruker NMR JCAMP-DX V2.0
##DATA TYPE= NMR FID
##DATA CLASS= NTUPLES
##ORIGIN= UXNMR, Bruker Analytische Messtechnik GmbH
##OWNER= root
$$ XWIN-NMR		Version 3.5
$$ Fri Jul  5 13:47:49 2019 Russian Standard Time (UT+4h)  she@DPX200
##.OBSERVE FREQUENCY= 200.13155
##.OBSERVE NUCLEUS= ^1H
##.DELAY= (6, 6)
##.ACQUISITION MODE= SIMULTANEOUS
##.ACQUISITION SCHEME= undefined
##.AVERAGES= 8
##.DIGITISER RES= 18
##SPECTROMETER/DATA SYSTEM= spect
##.PULSE SEQUENCE= zg30
##.SOLVENT NAME= CDCl3
##.SHIFT REFERENCE= (INTERNAL, CDCl3, 0, 15.7039)
##AUDIT TRAIL= $$ (NUMBER, WHEN, WHO, WHERE, WHAT)
$$ ##TITLE= Audit trail, XWIN-NMR		Version 3.5
$$ ##JCAMPDX= 5.01
$$ ##ORIGIN= Bruker BioSpin GmbH
$$ ##OWNER= she
$$ F:/spectra/data/she/nmr/H-F/1/audita.txt
$$ ##AUDIT TRAIL=  $$ (NUMBER, WHEN, WHO, WHERE, WHAT)
(   1,<2019-07-05 13:46:39.68 +0400>,<she>,<DPX200>,
      <created by zg, POWCHK disabled, PULCHK disabled
       configuration hash MD5:
       00 E9 B6 7A A2 85 ED C7 34 08 36 98 17 FE 4E 26
       data hash MD5: 16K
       6F 6F 41 70 FD 28 AD 78 6E 36 DB 11 85 FB 4D 02>)
$$ ##END=
$$ 
$$ hash MD5
$$ DD 66 8E 67 D3 D5 50 2A C1 7A 33 91 56 2A 60 BB
##$RELAX= 
##$RELAX= 
##$RELAX= 
##$RELAX= 
##$RELAX= 
##$RELAX= 
$$ Bruker specific parameters
$$ --------------------------
##$DU= <F:/spectra>
##$EXPNO= 1
##$NAME= <H-F>
##$PROCNO= 1
##$TYPE= <nmr>
##$USER= <she>
##$AMP= (0..31)
100 100 100 100 100 100 100 100 100 100 100 100 100 100 100 100 100 100 
100 100 100 100 100 100 100 100 100 100 100 100 100 100 
##$AQSEQ= 0
##$AQ_mod= 1
##$AUNM= <au_zg>
##$AUTOPOS= <>
##$BF1= 200.13
##$BF2= 200.13
##$BF3= 200.13
##$BF4= 200.13
##$BF5= 200.13
##$BF6= 200.13
##$BF7= 200.13
##$BF8= 200.13
##$BYTORDA= 1
##$CFDGTYP= 0
##$CFRGTYP= 5
##$CHEMSTR= <none>
##$CNST= (0..31)
1 1 145 1 1 1 1 1 1 1 1 1 1 1 1 1 1 1 1 1 1 1 1 1 1 1 1 1 1 1 1 1 
##$CPDPRG= <>
##$CPDPRG1= <>
##$CPDPRG2= <>
##$CPDPRG3= <>
##$CPDPRG4= <mlev>
##$CPDPRG5= <mlev>
##$CPDPRG6= <mlev>
##$CPDPRG7= <mlev>
##$CPDPRG8= <mlev>
##$CPDPRGB= <>
##$CPDPRGT= <>
##$D= (0..31)
0 1.2 0 0 0 0 0 0 0 0 0 0.03 0 0 0 0 0 0 0 0 0 0 0 0 0 0 0 0 0 0 0 0 
##$DATE= 1562319999
##$DBL= (0..7)
120 120 120 120 120 120 120 120 
##$DBP= (0..7)
150 150 150 150 150 150 150 150 
##$DBP07= 0
##$DBPNAM0= <>
##$DBPNAM1= <>
##$DBPNAM2= <>
##$DBPNAM3= <>
##$DBPNAM4= <>
##$DBPNAM5= <>
##$DBPNAM6= <>
##$DBPNAM7= <>
##$DBPOAL= (0..7)
0.5 0.5 0.5 0.5 0.5 0.5 0.5 0.5 
##$DBPOFFS= (0..7)
0 0 0 0 0 0 0 0 
##$DE= 6
##$DECBNUC= <off>
##$DECIM= 24
##$DECNUC= <off>
##$DECSTAT= 4
##$DIGMOD= 1
##$DIGTYP= 9
##$DL= (0..7)
0 120 120 120 120 120 120 120 
##$DP= (0..7)
150 150 150 150 150 150 150 150 
##$DP07= 0
##$DPNAME0= <>
##$DPNAME1= <>
##$DPNAME2= <>
##$DPNAME3= <>
##$DPNAME4= <>
##$DPNAME5= <>
##$DPNAME6= <>
##$DPNAME7= <>
##$DPOAL= (0..7)
0.5 0.5 0.5 0.5 0.5 0.5 0.5 0.5 
##$DPOFFS= (0..7)
0 0 0 0 0 0 0 0 
##$DQDMODE= 0
##$DR= 18
##$DS= 0
##$DSLIST= <SSSSSSSSSSSSSSS>
$$ [...]
##$SUBNAM2= <"">
##$SUBNAM3= <"">
##$SUBNAM4= <"">
##$SUBNAM5= <"">
##$SUBNAM6= <"">
##$SUBNAM7= <"">
##$SUBNAM8= <"">
##$SUBNAM9= <"">
##$SW= 24.9336996594482
##$SWIBOX= (0..15)
0 0 2 0 0 0 0 0 0 0 0 0 0 0 0 0 
##$SW_h= 4990.01996007984
##$TD= 16384
##$TD0= 1
##$TE= 0
##$TE2= 300
##$TE3= 300
##$TEG= 300
##$TL= (0..7)
0 120 120 120 120 120 120 120 
##$TP= (0..7)
150 150 150 150 150 150 150 150 
##$TP07= 0
##$TPNAME0= <>
##$TPNAME1= <>
##$TPNAME2= <>
##$TPNAME3= <>
##$TPNAME4= <>
##$TPNAME5= <>
##$TPNAME6= <>
##$TPNAME7= <>
##$TPOAL= (0..7)
0.5 0.5 0.5 0.5 0.5 0.5 0.5 0.5 
##$TPOFFS= (0..7)
0 0 0 0 0 0 0 0 
##$TUNHIN= 0
##$TUNHOUT= 0
##$TUNXOUT= 0
##$USERA1= <user>
##$USERA2= <user>
##$USERA3= <user>
##$USERA4= <user>
##$USERA5= <user>
##$V9= 5
##$VALIST= <valist>
##$VCLIST= <CCCCCCCCCCCCCCC>
##$VD= 0
##$VDLIST= <DDDDDDDDDDDDDDD>
##$VPLIST= <PPPPPPPPPPPPPPP>
##$VTLIST= <TTTTTTTTTTTTTTT>
##$WBST= 1024
##$WBSW= 4
##$XGAIN= (0..3)
0 0 0 0 
##$XL= 0
##$YL= 0
##$YMAX_a= 165610
##$YMIN_a= -287638
##$ZGOPTNS= <>
##$ZL1= 120
##$ZL2= 120
##$ZL3= 120
##$ZL4= 120
##$ABSF1= 10
##$ABSF2= 0
##$ABSG= 5
##$ABSL= 3
##$ALPHA= 0
##$AQORDER= 0
##$ASSFAC= 0
##$ASSFACI= 0
##$ASSFACX= 0
##$ASSWID= 0
##$AUNMP= <proc_1d>
##$AZFE= 0.1
##$AZFW= 0.1
##$BCFW= 1
##$BC_mod= 2
##$BYTORDP= 1
##$COROFFS= 0
##$CY= 11.3945322036743
##$DATMOD= 1
##$DC= 2
##$DFILT= <>
##$DTYPP= 0
##$F1P= 18.9103706918063
##$F2P= -1.10871071338519
##$FCOR= 0.5
##$FTSIZE= 0
##$FT_mod= 4
##$GAMMA= 1
##$GB= 0.15
##$INTBC= 1
##$INTSCL= 1
##$ISEN= 128
##$LB= 0.24
##$LEV0= 0
##$LPBIN= 0
##$MAXI= 10000
##$MC2= 0
##$MEAN= 0
##$ME_mod= 0
##$MI= 1.114404
##$NCOEF= 0
##$NC_proc= 0
##$NLEV= 6
##$NOISF1= 3.799351
##$NOISF2= 2.8
##$NSP= 1
##$NTH_PI= 0
##$NZP= 0
##$OFFSET= 15.70392
##$PC= 1
##$PHC0= -8655.638
##$PHC1= 13.20096
##$PH_mod= 1
##$PKNL= yes
##$PPARMOD= 0
##$PSCAL= 0
##$PSIGN= 0
##$REVERSE= no
##$SF= 200.130013532006
##$SI= 16384
##$SIGF1= 3
##$SIGF2= 2
##$SINO= 400
##$SIOLD= 16384
##$SREGLST= <1H.CDCl3>
##$SSB= 0
##$STSI= 0
##$STSR= 0
##$SW_p= 3612.71676300578
##$SYMM= 0
##$S_DEV= 0
##$TDeff= 0
##$TDoff= 0
##$TI= <>
##$TILT= no
##$TM1= 0
##$TM2= 0
##$TOPLEV= 0
##$USERP1= <user>
##$USERP2= <user>
##$USERP3= <user>
##$USERP4= <user>
##$USERP5= <user>
##$WDW= 1
##$XDIM= 8192
##$YMAX_p= 0
##$YMIN_p= 0
$$ End of Bruker specific parameters
$$ ---------------------------------
##NTUPLES= NMR FID
##VAR_NAME=  TIME,          FID/REAL,        FID/IMAG
##SYMBOL=    X,             R,               I
##VAR_TYPE=  INDEPENDENT,   DEPENDENT,       DEPENDENT
##VAR_FORM=  AFFN,          ASDF,            ASDF
##VAR_DIM=   8192,          8192,            8192
##UNITS=     SECONDS,       ARBITRARY UNITS, ARBITRARY UNITS
##FACTOR=    0.0002004,     1,               1
##FIRST=     0,             0,               0
##LAST=      1.6414764,     0,               0
##MIN=       0,             -287638,         0
##MAX=       1.6414764,     165610,          0
$$ Real data points
##PAGE= N=1
##DATA TABLE= (X++(R..R)), XYDATA
$$ plain form
0 0 0 0 0 0 0 0 -7 6 -8 8 -11 15 -18 20 -27 30 -38 44 -55 63 -75 86 -100 114 -133 151 -173 197 -224 252
30 252 -285 319 -357 399 -445 497 -553 615 -682 755 -838 927 -1025 1137 -1258 1396 -1552
47 -1552 1729 -1932 2168 -2448 2783 -3195 3716 -4400 5340 -6717 8951 -13204 24303 -118548
61 -118548 -287638 -226949 -226295 -188481 -181617 -165463 -182404 -191366 -212770 -219943 -228631 -213654 -193301
74 -193301 -162169 -139490 -117470 -112144 -116044 -131760 -143001 -151856 -149383 -137071 -110336 -81451 -54724
87 -54724 -38093 -31115 -37128 -49561 -63808 -70086 -66579 -50820 -26776 1740 26135 41488 44362
100 44362 36974 22872 8418 1219 6090 21719 44792 71033 93773 106007 105064 94563 79823
113 79823 64793 56189 60174 76205 98164 121185 140318 149370 145036 131010 113940 98298 88927
$$ packed form
0@%%%%%%pJ3j4J6j9K6l3L8m7N7o8Q2r9J18j38J61j86K14k47K84l24L70m21M76
30B52n37O04o76P56q44R42j050J168j297J437j593J765j952K162k395K654k948
47a552L281l661M100m616N231n978O911q116R740j2057J5668k2155L7507j42851
61a18548j69090O0689O54L7814O864J6154j6941q962k1404p173q688J4977K0353
74a93301L1132K2679K2020N326l900j5716j1241q855K473J2312K6735K8885K6727
87e4724J6631O978o013j2433j4247o278L507J5759K4044K8516K4395J5353K874
100D4362p388j4102j4454p199M871J5629K3073K6241K2740J2234r43j0501j4740
113G9823j5030q604L985J6031K1959K3021J9133R052m334j4026j7070j5642r371
$$ plain form
126 88927 91671 106520 126348 145549 160261 165610 157799 140447 120755 104553 94930 96235 108370
139 108370 126349 142739 153021 153980 143422 124060 102410 85026 75504 75942 86669 102468 116917
152 116917 123822 120904 108151 87526 64424 45958 36812 38102 47861 62005 74964 80312 75047
165 75047 59712 38200 15376 -2708 -10977 -8328 2157 16071 28462 33110 26529 10625 -10109
178 -10109 -30865 -46984 -52948 -47467 -34365 -19546 -7692 -2424 -7809 -23038 -41965 -59672 -71864
191 -71864 -74622 -66534 -51406 -35031 -22469 -17043 -21658 -35476 -53062 -68060 -76891 -76999 -67241 -50763
205 -50763 -33489 -21038 -16824 -21530 -34414 -51216 -65452 -72446 -70221 -59477 -42557 -25415 -13633
218 -13633 -10344 -16132 -29163 -45427 -58777 -64467 -60467 -48596 -31883 -14586 -3010 -770 -7947
$$ packed form
126H8927K744J4849J9828J9201J4712N349p811j7352j9692j6202r623J305J2135
139A08370J7979J6390J0282R59j0558j9362k1650j7384r522M38J0727J5799J4449
152A16917O905k918j2753k0625k3102j8466r146J290R759J4144J2959N348n265
165G5047j5335k1512k2824j8084q269K649J0485J3914J2391M648o581j5904k0734
178a0109k0756j6119n964N481J3102J4819J1854N268n385j5229j8927j7707j2192
191g1864k758Q088J5128J6375J2562N426m615j3818j7586j4998q831j08R758J6478
205e0763J7274J2451M214m706j2884j6802j4236o994K225J0744J6920J7142J1782
218a3633L289n788j3031j6264j3350n690M000J1871J6713J7297J1576K240p177
$$ plain form
231 -7947 -21021 -36002 -48110 -52650 -47088 -33572 -16345 -14 10659 12092 4486 -8840 -22848
244 -22848 -33483 -36655 -29811 -15513 1226 16196 25516 26190 17611 3731 -9724 -19013 -20999 -14150
258 -14150 98 16516 30179 37434 36339 27076 12873 -1003 -9588 -10613 -3454 10337 26418
271 26418 38868 44208 41503 31266 16525 2274 -5809 -5925 1825 15215 30370 42015 46110
284 46110 41588 30185 15010 1143 -6748 -6090 2375 15479 29796 40276 43076 36787 24395
297 24395 9617 -3519 -10912 -9518 -271 13063 26116 34957 36549 29704 16673 2145 -9813
310 -9813 -15842 -13708 -3919 9396 21824 29654 30432 22821 9568 -4730 -15357 -19983 -16971 -6773
324 -6773 6937 18995 25816 25089 17311 4040 -10016 -20127 -23524 -19362 -8647 4899 16857
$$ packed form
231g947j3074j4981j2108m540N562J3516J7227J6331J0673J433p606j3326j4008
244b2848j0635l172O844J4298J6739J4970R320O74q579j3880j3455r289j986O849
258a4150J4248J6418J3663P255j095r263j4203j3876q585j025P159J3791J6081
271B6418J2450N340k705j0237j4741j4251q083j16P750J3390J5155J1645M095
284D6110m522j1403j5175j3867p891O58Q465J3104J4317J0480K800o289j2392
297B4395j4778j3136p393J394R247J3334J3053Q841J592o845j3031j4528j1958
310i813o029K134R789J3315J2428P830P78p611j3253j4298j0627m626L012J0198
324f773J3710J2058O821p27p778j3271j4056j0111l397M162J0715J3546J1958
$$ plain form
337 16857 22734 20998 12484 -861 -14694 -24288 -26296 -20856 -9890 3677 15339 20625 17898 8407
351 8407 -4780 -17668 -26346 -27346 -20609 -8771 4386 15109 19589 16107 6198 -6634 -18630
364 -18630 -25770 -25961 -18391 -6148 6576 16221 19856 15776 5320 -7580 -18826 -24853 -24006 -16071
378 -16071 -3702 8780 17444 19793 14757 4093 -8953 -19685 -24873 -23099 -14600 -1929 10132
391 10132 18052 19233 13314 2395 -10564 -21029 -25328 -22335 -13215 -610 11365 18734 18827 12063
405 12063 780 -11895 -21689 -24801 -20643 -11019 1361 12923 19255 18427 10754 -1040 -13026 -21968
419 -21968 -24373 -19631 -9137 2612 12941 18308 16447 8067 -4009 -15674 -23722 -25466 -20107 -9535
433 -9535 2105 11228 15561 12844 3760 -8506 -19824 -26948 -27777 -21911 -11135 808 9526 12513
$$ packed form
337A6857N877j736q514j3345j3833r594k008N440J0966J3567J1662N286k727r491
351H407j3187j2888q678j000O737J1838J3157J0723M480l482r909j2832j1996
364a8630p140j91P570J2243J2724R645L635m080j0456j2900j1246o027Q47P935
378a6071J2369J2482Q664K349n036j0664j3046j0732n188J774Q499J2671J2061
391A0132P920J181n919j0919j2959j0465m299K993R120J2605J1975P369R3o764
405A2063j1283j2675r794l112M158R624J2380J1562O332q28p673j1794j1986q942
419b1968k405M742J0494J1749J0329N367j861q380j2076j1665q048j744N359J0572
433i535J1640R123M333k717r084j2266j1318p124q29N866J0776J1943Q718K987
$$ plain form
447 12513 9132 -62 -12231 -23275 -29591 -29021 -22230 -11056 1011 9526 12057 8017 -1374 -13467
461 -13467 -23678 -28691 -26664 -18961 -7412 4688 13014 14975 10134 615 -10356 -19732 -23655 -20659
475 -20659 -11614 355 11840 19524 20756 15224 5696 -5002 -13019 -15836 -11844 -2449 9467 20202
489 20202 26790 27326 21161 10999 734 -6713 -8755 -4505 5231 17082 27137 32503 31670 24906
503 24906 14147 3392 -3701 -5003 -293 9381 20969 30393 34494 32434 24801 13783 3028 -3827
517 -3827 -4517 815 10526 21627 30293 33673 30403 21985 10745 286 -5980 -5853 156 9934 20369
532 20369 28213 30508 26107 16941 5965 -3756 -9353 -8744 -2128 7543 17319 23974 25257 20106 10386
547 10386 -694 -9842 -14702 -13423 -6635 3008 12256 17761 18101 12300 2096 -9031 -17767 -21688
$$ packed form
447A2513l381r194j2169j1044o316N70O791J1174J2067Q515K531m040r391j2093
461a3467j0211n013K027P703J1549J2100Q326J961m841r519j0971r376l923K996
475b0659R045J1969J1485P684J232n532r528j0698q017k817L992R395J1916J0735
489B0202O588N36o165j0162j0265p447k042M250R736J1851J0055N366q33o764
503B4906j0759j0755p093j302M710R674J1588R424M101k060p633j1018j0755o855
517c827o90N332R711J1101Q666L380l270q418j1240j0459o266J27O009R778J0435
532B0369P844K295m401r166j0976r721n597O09O616R671R776O655J283n151r720
547A0386j1080r148m860J279O788R643R248N505L40n801j0204j1127q736l921
$$ plain form
561 -21688 -20003 -12835 -2885 6017 11189 10273 4083 -6200 -17464 -25555 -28441 -25675 -17821 -7689
575 -7689 1176 5739 4485 -2201 -12088 -22709 -30026 -31733 -27423 -19012 -8821 -40 4149 2411 -4517
590 -4517 -14096 -23566 -29784 -30261 -25118 -15855 -5572 2641 6317 4255 -2832 -12219 -20893 -25800 -25642
605 -25642 -19370 -9788 168 7774 10774 8086 731 -8739 -17197 -21292 -20271 -14152 -4465 5519 12429
620 12429 14518 10906 2964 -6943 -14882 -18769 -17286 -10785 -1208 8524 14503 15255 11013 2614 -7511
635 -7511 -15338 -18756 -16371 -9599 -147 8771 14141 14109 8847 48 -9556 -16923 -19564 -16613 -9291 36
651 36 8285 12988 12148 6200 -2587 -11558 -18244 -20170 -16414 -8651 441 8261 12304 10875 4486 -4361
667 -4361 -12884 -18833 -19983 -15556 -7299 1816 9177 12340 10569 3881 -5333 -13846 -18909 -19086 -14330
$$ packed form
561b1688J685P168R950Q902N172r16o190j0283j1264q091k886K766P854J0132
575g689Q865M563j254o686r887j0621p317j707M310Q411J0191Q781M189j738o928
590d517r579r470o218m77N143R263J0283Q213L676k062p087r387q674m907J58
605b5642O272R582R956P606L000k688p355r470q458m095J021O119R687R984O910
620A2429K089l612p942r907p939l887J483O501R577R732N979P52m242q399j0125
635g511p827l418K385O772R452Q918N370l2n262q799r604p367k641K951P322R327
651C6Q249M703q40n948q787q971o686j926L756P763R092P820M043j429o389q847
667d361q523n949j150M427Q257R115P361L163j771o688r214q513n063j77M756
$$ plain form
682 -14330 -5818 3431 10431 12877 10289 3220 -5833 -14226 -18715 -18187 -12904 -4136 4931 11653 13243
697 13243 9914 2704 -6185 -13818 -17835 -16336 -10003 -1431 7354 13606 15008 11212 3490 -4990 -11943
712 -11943 -14791 -12504 -5779 3217 11913 17483 18196 14040 6457 -1750 -7916 -10061 -7093 254 9499
727 9499 17662 22749 22746 18067 10212 1989 -3729 -5363 -1753 5737 14901 22497 26561 25897 20254 11768
743 11768 3401 -2086 -3181 325 7757 16570 23733 26827 24955 18663 9895 1479 -3920 -4655 -459
758 -459 6885 15269 21746 23891 20989 14080 5344 -2879 -7578 -7677 -3037 4500 12535 18209 19876 16159
774 16159 8834 268 -7236 -11543 -10810 -5631 2213 9845 15100 16051 12085 4543 -4127 -11257 -14698
789 -14698 -13401 -7633 295 8047 12701 13162 8737 872 -7773 -14295 -17151 -15222 -9033 -823 6753
$$ packed form
682a4330Q512R249P000K446k588p069r053q393m489N28N283Q768R067O722J590
697A3243l329p210q889p633m017J499O333Q572Q785O252J402l796p722q480o953
712a1943k848K287O725Q996Q696N570P13m156p583q207o166k145K968P347R245
727I499Q163N087lm679p855q223n718j634L610P490R164P596M064o64n643q486
743A1768q367n487j095L506P432Q813P163L094j872o292q768q416n399p35M196
758d59P344Q384O477K145k902o909q736q223m699r9M640P537Q035N674J667l717
774A6159p325q566p504m307P33N179P844P632N255R51l966p542q670p130l441
789a4698J297N768P928P752M654M61m425p865q645o522k856J929O189Q210P576
$$ plain form
804 6753 11092 10671 5906 -1984 -10512 -16757 -18725 -15977 -9331 -1046 6286 10022 9044 3813 -3961 -11938
820 -11938 -17645 -18808 -15172 -7999 171 7168 10389 8980 3437 -4401 -11783 -16615 -16954 -12479 -5077
835 -5077 3131 9825 12742 10767 5065 -2609 -9508 -13552 -13127 -8298 -389 7982 14203 16650 14333
850 14333 8378 393 -6217 -9709 -8571 -3318 4845 13049 18704 20297 17471 10827 2686 -3875 -6894
865 -6894 -5463 137 7980 15790 20602 21249 17328 10220 1954 -4490 -7319 -5362 164 7784 14719
880 14719 18824 18312 13817 6114 -2013 -8115 -10502 -8266 -2382 4911 11341 14586 13531 8288 506
895 506 -7514 -13030 -14777 -12087 -6010 1414 7580 10466 8974 3404 -4530 -12295 -17258 -18439 -15210
910 -15210 -8464 -919 5088 7448 5533 -278 -8201 -15730 -20176 -20499 -16727 -9723 -2222 3513 5320
$$ packed form
804F753M339m21m765p890q528o245j968K748O646Q285P332L736r78n231p774p977
820a1938n707j163L636P173Q170O997L221j409n543p838p382m832l39M475P402
835e077Q208O694K917j975n702p674o899m044M25M829P909Q371O221K447k317
850A4333n955p985o610l492J138N253Q163Q204N655J593k826o644q141o561l019
865f894J431N600P843P810M812O47l921p108q266o444k829J957N526P620O935
880A4719M105n12m495p703q127o102k387K236N884P293O430L245j055n243p782
895E06q020n516j747K690O077P424O166K886j492n570p934p765m963j181L229
910a5210O746P545O007K360j915n811p923p529m446l23L772P004P501N735J807
$$ plain form
925 5320 2974 -3143 -10918 -18070 -21884 -21493 -17084 -9855 -2498 2656 3986 1022 -5063 -12758 -19280
940 -19280 -22430 -21171 -16211 -8944 -1586 3328 4133 688 -5547 -12887 -18404 -20926 -18970 -13403 -5888
955 -5888 1217 5599 6169 2596 -3766 -10780 -15948 -17873 -15360 -9053 -1293 5570 9699 9677 5837 -808
971 -808 -7751 -12573 -13604 -10614 -4298 3465 10178 13700 13092 8614 1732 -5155 -9610 -10099 -6664 -372
987 -372 7157 13453 16198 14831 9729 2827 -3771 -7826 -7900 -4100 2333 9471 15061 16966 14752 9411
1003 9411 2431 -3951 -7474 -7070 -2806 3668 10444 15403 16705 14098 8411 1363 -4700 -7773 -6980
1018 -6980 -2431 4274 10905 15483 16240 13166 7189 116 -5390 -8114 -6727 -1954 5200 11631 15602
1033 15602 16187 12532 6290 -682 -6077 -8066 -6225 -920 5856 12028 15710 15401 11466 4931 -1782
$$ packed form
925E320k346o117p775p152l814L91M409P229P357N154J330k964o085p695o522
940a9280l150J259M960P267P358M914Q05l445o235p340n517k522J956N567P515
955e888P105M382N70l573o362p014n168j925K513O307P760O863M129k2l840o645
971h08o943m822j031K990O316P763O713L522o08m478o882o887m455m89L435O292
987c72P529O296K745j367n102o902o598m055p4L800O433P138N590J905k214n341
1003I411o980o382l523M04M264O474O776M959J302k607n687p048o063l073P93
1018f980M549O705O631M578P57l074n977p073n506k724J387M773P154O431L971
1033A5602N85l655o242o972n395j989J841N305O776O172L682l09l935o535o713
$$ plain form
1048 -1782 -6805 -8122 -5870 -441 6168 12065 14994 14114 9628 3256 -3396 -7974 -8911 -5998 -450
1063 -450 6209 11666 14023 12596 7706 1345 -5008 -8882 -9380 -5852 -40 6541 11644 13650 11831
1078 11831 6943 319 -5731 -9145 -9074 -5322 852 7412 12284 13799 11575 6316 -520 -6345 -9429
1093 -9429 -8916 -4875 1495 7728 12020 12862 9980 4477 -2311 -7978 -10559 -9412 -5285 955 6936
1108 6936 10461 10738 7395 1520 -5011 -10235 -12481 -10814 -6176 -112 5576 8802 8582 4779 -1154
1123 -1154 -7419 -12258 -13859 -11883 -6945 -660 4646 7588 6926 2841 -3131 -9497 -13787 -14999 -12582
1138 -12582 -7355 -1147 4132 6525 5448 1222 -5202 -11277 -15344 -15947 -12976 -7578 -1286 3370 5494
1153 5494 3929 -731 -7003 -12792 -16400 -16569 -13243 -7644 -1331 3221 4725 2811 -2104 -8312 -13798
$$ packed form
1048a782n023j317K252N429O609N897K929q80m486o372o652m578r37K913N548
1063d50O659N457K357j427m890o361o353l874m98L528N812O581N103K006j819
1078A1831m888o624o050l414P1L752O174O560M872J515k224n259o836n825l084
1093i429N13M041O370O233M292Q42k882n503o788n667k581J147M127O240N981
1108F936L525K77l343n875o531n224k246J667M638O064N688L226k20l803n933
1123a154o265m839j601J976M938O285N306K942o62m085n972o366m290j212K417
1138a2582N227O208N279K393j077m226o424o075m067o03K971N398O292M656K124
1153E494j565m660o272n789l608j69L326N599O313M552J504j914m915o208n486
$$ plain form
1168 -13798 -16858 -16230 -12410 -6534 -540 3725 4778 2462 -2527 -8560 -13632 -16074 -14888 -10691 -4652
1183 -4652 1407 5317 5997 3417 -1752 -7431 -12089 -14020 -12451 -7602 -1453 4365 8204 8637 5654
1198 5654 332 -5310 -9520 -10985 -8901 -3780 2464 8061 11630 11612 8341 2869 -2901 -6856 -7807 -5452
1214 -5452 -308 5975 11350 14158 13473 9652 4118 -1584 -5317 -5758 -3037 2158 8142 13069 15270
1229 15270 14011 9794 4092 -1384 -4617 -4674 -1601 3660 9584 14054 15798 14011 9747 3716 -1383
1244 -1383 -4500 -4180 -737 4621 10396 14557 15952 13787 8823 3247 -2075 -4704 -4152 -662 4823
1259 4823 10258 14014 14665 12215 6945 894 -4096 -6567 -5915 -2206 3214 8295 11530 11527 8295 2872
1275 2872 -3324 -8143 -10187 -9021 -5098 24 4921 7523 7166 3511 -2268 -8040 -12529 -13998 -12462
$$ packed form
1168a3798l060O28L820N876N994M265J053k316m989o033n072k442J186M197O039
1183d652O059L910O80k580n169n679m658j931J569M849O149N818L839M33k983
1198E654n322n642m210j465K084N121O244N597L569j8l271n472n770l955r51K355
1214e452N144O283N375K808o85l821n534n702l733m41K721N195N984M927K201
1229A5270j259m217n702n476l233n7L073N261N924M470J744j787m264o031n099
1244a383l117L20L443N358N775M161J395k165m964n576n322k629N52L490N485
1259D823N435L756O51k450n270o051m990k471O52L709N420N081L235ll232n423
1275B872o196m819k044J166L923N122M897K602l57l655n779n772m489j469J536
$$ plain form
1290 -12462 -8237 -2791 1815 4136 3375 -444 -5915 -11556 -15512 -16397 -14347 -9594 -4065 588 2666
1305 2666 1698 -2161 -7423 -12789 -16183 -16568 -13892 -8773 -3147 1437 3347 2285 -1583 -6889 -11990
1320 -11990 -14902 -14797 -11671 -6219 -427 4057 5666 4276 69 -5175 -9695 -12123 -11531 -7976 -2387
1335 -2387 3363 7272 8629 6816 2638 -2594 -6824 -8713 -7647 -3685 1945 7349 10969 11867 9630
1350 9630 5264 343 -3822 -5137 -3462 676 6219 11544 14884 15432 12694 8220 3463 -478 -1567
1365 -1567 230 4797 10440 15282 18335 18266 15324 10667 5502 1991 1179 3072 7503 13030 17461 19810
1381 19810 19298 15768 10614 5484 1912 1077 3330 7465 12649 16624 18347 16978 13037 7565 2305
1396 2305 -1009 -1513 736 4917 9763 13293 14363 12363 7925 2730 -2396 -5563 -5371 -3121 1219
$$ packed form
1290a2462M225N446M606K321p61l819n471n641l956q85K050M753N529M653K078
1305B666r68l859n262n366l394l85K676N119N626M584J910j062l868n306n101
1320a1990k912J05L126N452N792M484J609j390m207n244m520k428N92L555N589
1335b387N750L909J357j813m178n232m230j889J066L962N630N404L620Q98k237
1350I630m366m921m165j315J675M138N543N325L340N48k738m474m757l941j089
1365a567J797M567N643M842L053o9k942m657n165l511q12J893M431N527M431K349
1381A9810n12l530n154n130l572q35K253M135N184L975J723j369l941n472n260
1396B305l314n04K249M181M846L530J070k000m438n195n126l167J92K250M340
$$ plain form
1411 1219 5915 9249 9779 7414 3186 -2338 -7206 -9719 -9380 -6251 -2067 2620 5675 6064 3523 -923
1427 -923 -6302 -10641 -12852 -12275 -8911 -4167 211 3029 3258 523 -4094 -9278 -13389 -15114 -14043 -10424
1443 -10424 -5509 -1314 1357 1088 -1909 -6417 -11501 -15041 -16358 -14648 -10732 -5791 -1618 577 272
1458 272 -2866 -7483 -12132 -15304 -15810 -13758 -9494 -4458 -232 1634 741 -2299 -6684 -11101 -13657 -13944
1474 -13944 -11361 -6960 -2085 1964 3837 2714 -476 -4907 -9051 -11504 -11217 -8394 -3681 1042 4910
1489 4910 6318 5045 1702 -2987 -6940 -9096 -8619 -5508 -889 3947 7338 8401 6659 2908 -1689
1504 -1689 -5602 -7301 -6483 -3310 1331 5868 8797 9272 7056 3071 -1711 -5331 -6754 -5695 -2126
1519 -2126 2301 6491 8927 8928 6414 2288 -2403 -5672 -6956 -5590 -1983 2388 6587 8700 8417 5529
$$ packed form
1411A219M696L334N30k365m228n524m868k513L39L129M184M687L055L89k541m446
1427i23n379m339k211N77L364M744M378K818K29k735m617n184m111j725J071L619
1443a0424M915M195K671k69k997m508n084l540j317J710L916M941M173K195l05
1458B72l138m617m649l172n06K052M264N036M226J866q93l040m385m417k556k87
1474a3944K583M401M875M049J873j123l190m431m144k453K87K823M713M723L868
1489D910J408j273l343m689l953k156M77L111M619M836L391J063j742l751m597
1504a689l913j699Q18L173M641M537K929M75k216l985m782l620j423J059L569
1519b126M427M190K436Jk514m126m691l269j284J366L607M371M199K113k83k888
$$ plain form
1535 5529 1318 -3252 -6321 -7232 -5677 -1897 2467 6416 8350 7524 4610 208 -4299 -7109 -7835 -5711
1551 -5711 -1937 2345 5934 7630 6508 3201 -1258 -5510 -8224 -8613 -6125 -2277 1934 5342 6446
1566 6446 5062 1685 -2811 -6917 -9143 -8841 -6359 -2277 2036 4992 5795 4233 575 -3725 -7309
1581 -7309 -9244 -8653 -5673 -1430 2961 5667 6327 4519 958 -3342 -6626 -8257 -7239 -3949 408
1596 408 4675 7255 7616 5498 1853 -2310 -5636 -6730 -5479 -2046 2337 6321 8762 8891 6521 2645
1612 2645 -1548 -4597 -5433 -4037 -263 3984 7908 9947 9530 6725 2838 -1181 -3794 -4275 -2343 1171
1628 1171 5526 9045 10776 10081 7137 3004 -883 -3252 -3570 -1207 2623 6658 10054 11314 10299
1643 10299 7151 3046 -884 -3103 -2822 -419 3329 7246 10510 11480 9845 6587 2578 -1134 -3170
$$ packed form
1535E529m211m570l069r11J555L780M364L949J934q26k914m402m507k810p26K124
1551e711L774M282L589J696j122l307m459m252k714l89K488L848M211L408J104
1566F446j384l377m496m106k226L02K482M082M313K956Q03j562l658m300l584
1581g309j935N91K980M243M391K706O60j808l561m300l284j631J018L290M357
1596D08M267K580L61k118l645m163l326j094J251L433M383L984K441J29k370l876
1612B645m193l049q36J396L774M247L924K039m17k805l887m019k613m81J932L514
1628A171M355L519J731o95k944m133l887k369l18K363L830M035L396J260j015
1643A0299l148m105l930k219K81K403L748L917L264R70j635l258m009l712k036
$$ plain form
1658 -3170 -2874 -336 3577 7544 10254 10735 9175 5485 1293 -2293 -4050 -3373 -640 3224 7026 9592
1674 9592 9704 7749 3881 -467 -3774 -5090 -4184 -1325 2717 6281 8323 8210 5836 1909 -2187 -5259
1690 -5259 -6136 -4870 -1671 2281 5685 7513 6952 4468 578 -3334 -6086 -6715 -5160 -1800 2103 5478
1706 5478 6916 6298 3712 -181 -4053 -6608 -6737 -4953 -1546 2381 5498 6826 5886 3027 -978 -4636
1722 -4636 -6879 -6996 -4951 -1368 2339 5384 6113 4911 1881 -2178 -5775 -7750 -7661 -5394 -1703 1825
1738 1825 4548 5107 3459 -44 -3999 -7285 -8969 -8439 -5829 -2237 1314 3643 3864 2094 -1504 -5345
1754 -5345 -8419 -9903 -8991 -6228 -2498 975 3037 2865 864 -2718 -6491 -9333 -10565 -9397 -6440
1769 -6440 -2850 622 2394 2093 -306 -3954 -7694 -10395 -11279 -9922 -6966 -3242 -82 1513 894 -1620
$$ packed form
1658c170K96K538L913L967K710M81j560l690m192l586j757O77K733L864L802K566
1674I592J12j955l868m348l307j316R06K859M042L564K042j13k374l927m096l072
1690e259q77J266L199L952L404J828n61k484l890l912k752o29J555L360L903L375
1706E478J438o18k586l893l872k555j29J784L407L927L117J328r40k859m005l658
1722d636k243j17K045L583L707L045P29j202l030m059l597j975Q9K267L691L528
1738A825K723N59j648l503l955l286j684N30K610L592L551K329K21j770l598l841
1754e345l074j484R12K763L730L473K062j72k001l582l773k842j232J168K957
1769f440L590L472J772l01k399l648l740k701q84J357K956L724L160J595o19k514
$$ plain form
1785 -1620 -5309 -8867 -11356 -11921 -10266 -7042 -3235 -305 1071 253 -2508 -6175 -9575 -11636 -11603 -9509
1801 -9509 -5968 -2323 642 1642 576 -2168 -5727 -8762 -10356 -9950 -7525 -3856 -97 2593 3493
1816 3493 2291 -639 -3855 -6607 -8081 -7247 -4704 -902 2651 5249 5991 4513 1618 -1815 -4466
1831 -4466 -5343 -4474 -1862 1981 5482 7842 8297 6601 3569 207 -2276 -3182 -2004 1150 4565 8030
1847 8030 10000 9923 7946 4793 1600 -809 -1321 -70 3003 6590 9627 11144 10759 8521 5261 1901
1863 1901 -323 -573 952 3989 7410 10269 11464 10697 8190 4634 1467 -444 -537 1098 4042 7383
1879 7383 9940 10774 9787 7009 3673 317 -1508 -1510 312 3339 6445 8814 9228 7798 5076 1372
1895 1372 -1776 -3504 -3305 -1433 1626 4584 6545 6799 5062 2226 -1567 -4388 -5961 -5533 -3387 -328
$$ packed form
1785a620l689l558k489n65J655L224L807K930J376q18k761l667l400k061L3K094
1801i509L541L645K965J000j066k744l559l035j594M06K425L669L759K690R00
1816C493j202k930l216k752j474Q34K543L802L553K598P42j478k895l433k651
1831d466q77Q69K612L843L501K360M55j696l032l362k483r06J178L154L415L465
1847H030J970p7j977l153l193k409n12J251L073L587L037J517l85k238l260l360
1863A901k224k50J525L037L421K859J195p67k507l556l167j911r3J635K944L341
1879G383K557Q34r87k778l336l356j825kJ822L027L106K369M14j430k722l704
1895A372l148j728J99J872L059K958J961K54j737k836l793k821j573M28K146L059
$$ plain form
1911 -328 2574 4235 4230 2419 -878 -4285 -7022 -8018 -7435 -4860 -1753 1032 2704 2570 614 -2599 -5870
1928 -5870 -8198 -8935 -7650 -5090 -1848 975 2520 2142 106 -2924 -6065 -8238 -8501 -7222 -4428 -903
1944 -903 1761 3028 2512 392 -2749 -5512 -7460 -7572 -5838 -2932 330 2935 4083 3458 1152 -1959
1960 -1959 -4734 -6185 -6059 -4084 -1162 2252 4582 5532 4525 2287 -864 -3427 -4694 -4229 -2146 1209
1976 1209 4257 6490 7219 6065 3512 369 -2054 -2936 -2348 -47 3118 6255 8233 8564 7194 4553
1992 4553 1407 -911 -1782 -867 1448 4733 7634 9290 9358 7723 4972 1984 -325 -1086 -77 2343
2008 2343 5447 8185 9552 9376 7511 4520 1421 -795 -1341 -148 2383 5273 7732 8883 8367 6087
2024 6087 3008 -112 -2108 -2532 -1309 1247 4256 6364 7198 6278 3759 464 -2360 -4038 -4373 -2867
$$ packed form
1911c28K902J661nj811l297l407k737r96N83K575L107K785J672j34j956l213l271
1928e870k328p37J285K560L242K823J545l78k036l030l141k173k63J279K794L525
1944i03K664J267n16k120l141k763j948j12J734K906L262K605J148o25k306l111
1960a959k775j451J26J975K922L414K330R50j007k238l151k563j267M65K083L355
1976A209L048K233P29j154k553l143k423q82N88K301L165L137J978L31j370k641
1992D553l146k318q71R15K315L285K901J656O8j635k751k988k309p61J009K420
2008B343L104K738J367j76j865k991l099k216n46J193K531K890K459J151n16k280
2024F087l079l120j996m24J223K556L009K108Q34r20k519l295k824j678l35J506
$$ plain form
2040 -2867 -303 2471 4454 4991 3941 1219 -2028 -4839 -6384 -6343 -4770 -2213 674 2552 2814 1552
2056 1552 -1197 -4375 -7146 -8416 -8275 -6501 -3855 -1144 535 730 -728 -3456 -6499 -9237 -10388
2071 -10388 -9790 -7840 -5114 -2328 -943 -800 -2486 -5262 -8252 -10670 -11459 -10742 -8461 -5600 -3057 -1521
2087 -1521 -1826 -3386 -6458 -9112 -11164 -11774 -10655 -8146 -5126 -2783 -1304 -1697 -3570 -6222 -8989 -10794
2103 -10794 -10913 -9534 -6817 -3819 -1303 -266 -654 -2548 -5139 -7715 -9141 -9387 -7513 -4759 -1676
2118 -1676 712 1836 1158 -869 -3378 -5852 -7016 -6755 -4799 -1998 1126 3326 4173 3510 1374 -1294
2134 -1294 -3457 -4475 -3901 -1891 1001 4122 6237 6749 5784 3537 959 -1095 -2077 -1251 967 3908
2150 3908 6602 8378 8740 7430 4993 2248 338 -420 368 2727 5566 8153 9583 9522 8029 5481
$$ packed form
2040b867K564K774J983N37j050k722l247k811j545M1J573K557K887J878K62j262
2056A552k749l178k771j270J41J774K646K711J679J95j458k728l043k738j151
2071a0388N98J950K726K786J385J43j686k776k990k418p89P17K281K861K543J536
2087a521l05j560l072k654k052o10J119K509L020K343J479l93j873k652k767j805
2103a0794j19J379K717K998K516J037l88j894k591k576j426k46J874K754L083
2118a676K388J124o78k027k509k474j164K61J956K801L124K200Q47o63k136k668
2134a294k163j018N74K010K892L121K115N12r65k247k578k054r82Q26K218K941
2150C908K694J776L62j310k437k745j910p58P88K359K839K587J430o1j493k548
$$ plain form
2166 5481 2871 689 281 1246 3481 6170 8537 9879 9575 7808 5158 2486 664 240 1201 3529
2182 3529 6303 8509 9584 9142 7170 4493 2005 206 -84 1204 3588 6109 8286 9075 8369 6288
2198 6288 3549 1044 -351 -359 1190 3648 6116 8037 8744 7692 5557 2856 433 -886 -602 978
2214 978 3581 5927 7654 8120 7009 4631 1917 -376 -1426 -940 633 3171 5538 7016 7156 5901
2230 5901 3430 661 -1529 -2523 -2023 -321 2176 4515 5875 5669 4170 1765 -955 -3051 -4031 -3395
2246 -3395 -1452 901 3186 4216 3895 2281 -256 -2963 -4879 -5413 -4513 -2626 -196 1805 2734 2263
2262 2263 431 -2238 -4810 -6423 -7018 -5791 -3760 -1399 355 1125 325 -1647 -4271 -6721 -8229 -8672
2278 -8672 -7339 -5349 -3021 -1377 -849 -1682 -3841 -6552 -8867 -10356 -10464 -8997 -6971 -4655 -3070 -2705
$$ packed form
2166E481k610k182m08R65K235K689K367J342l04j767k650k672j822m24R61K328
2182C529K774K206J075m42j972k677k488j799k90J288K384K521K177P89p06k081
2198F288k739k505j395qJ549K458K468J921P07j052k135k701k423j319K84J580
2214I78K603K346J727M66j111k378k714k293j050M86J573K538K367J478J40j255
2230E901k471k769k190r94N00J702K497K339J360k06j499k405k720k096r80O36
2246c395J943K353K285J030l21j614k537k707j916n34R00J887K430K001R29m71
2262B263j832k669k572j613n95J227K031K361J754P70q00j972k624k450j508m43
2278h672J333J990K328J644N28q33k159k711k315j489j08J467K026K316J585L65
$$ plain form
2294 -2705 -3780 -5837 -8419 -10647 -11766 -11523 -9889 -7613 -5441 -3843 -3586 -4474 -6563 -8940 -10862 -11684
2310 -11684 -11040 -9164 -6670 -4145 -2767 -2482 -3476 -5463 -7579 -9182 -9582 -8571 -6363 -3791 -1493 150
2326 150 420 -714 -2561 -4570 -5804 -5902 -4753 -2461 284 2717 4073 4076 2849 1047 -816 -2106 -2027
2343 -2027 -768 1639 4233 6531 7714 7605 6258 4166 2327 1107 1299 2694 4843 7496 9466
2358 9466 10322 9910 8359 6289 4329 3334 3441 4876 7138 9485 11229 11850 11092 9328 7102 5126
2374 5126 4042 4501 5812 8047 10278 11839 12078 11091 8984 6701 4646 3854 4100 5495 7729 9570
2390 9570 10727 10826 9468 7263 4936 2995 1830 2295 3820 5651 7422 8386 7952 6488 4159 1522
2406 1522 -236 -1268 -933 623 2300 3878 4546 4145 2559 71 -2602 -4345 -5063 -4608 -3022 -1191
$$ packed form
2294b705j075k057k582k228j119K43J634K276K172J598K57q88k089k377j922q22
2310a1684O44J876K494K525J378K85r94j987k116j603m00J011K208K572K298J643
2326A50K70j134j847k009j234r8J149K292K745K433J356Lj227j802j863j290P9
2343b027J259K407K594K298J183j09j347k092j839j220J92J395K149K653J970
2358I466Q56m12j551k070j960r95J07J435K262K347J744O21p58j764k226j976
2374E126j084M59J311K235K231J561K39r87k107k283k055p92K46J395K234J841
2390I570J157R9j358k205k327j941j165M65J525J831J771R64m34j464k329k637
2406A522j758j032L35J556J677J578O68m01j586k488k673j743p18M55J586J831
$$ plain form
2422 -1191 334 957 220 -1492 -3941 -6241 -7844 -8441 -7527 -5696 -3879 -2271 -1724 -2526 -4144 -6608
2438 -6608 -8665 -10033 -10022 -9111 -6967 -4994 -3355 -2907 -3539 -5275 -7432 -9412 -10354 -10153 -8815 -6652 -4521
2455 -4521 -3071 -2446 -3308 -4875 -6753 -8568 -9332 -8947 -7386 -5231 -3027 -1549 -1115 -1814 -3442 -5406
2471 -5406 -6902 -7570 -6816 -5034 -3038 -931 730 992 -43 -1713 -3572 -5068 -5377 -4576 -2928 -463
2487 -463 1567 2740 2937 1670 62 -1977 -3255 -3484 -2398 -460 1678 3621 4769 4541 3387 1515
2503 1515 -259 -1561 -1508 -491 1448 3597 5355 6232 5789 4592 2780 840 -292 -355 826 2658
2519 2658 4897 6440 6871 6514 5072 3105 1308 283 188 1459 3214 5275 6550 6990 6309 4699
2535 4699 2560 795 -175 8 1232 3034 4801 6099 6372 5357 3588 1611 -239 -985 -765 501
$$ packed form
2422a191J525O23p37j712k449k300j603n97R14J831J817J608N47q02j618k464
2438f608k057j368J1R11K144J973J639M48o32j736k157j980r42K01J338K163K131
2455d521J450O25q62j567j878j815p64L85J561K155K204J478M34o99j628j964
2471e406j496o68P54J782J996K107J661K62j035j670j859j496l09Q01J648K465
2487d63K030J173J97j267j608k039j278k29J086J938K138J943J148k28j154j872
2503A515j774j302N3J017J939K149J758Q77m43j197j812j940j132o3J181J832
2519B658K239J543M31l57j442j967j797j025r5J271J755K061J275M40o81j610
2535D699k139j765r70J83J224J802J767J298K73j015j769j977j850p46K20J266
$$ plain form
2551 501 2511 4250 5283 5302 4329 2273 178 -1360 -2032 -1648 -325 1723 3155 4125 4083 2905 930
2568 930 -1221 -2714 -3233 -2630 -1201 833 2274 3180 2759 1559 -302 -2154 -3501 -3907 -3257 -1784 174
2585 174 1790 2450 2270 942 -1252 -2904 -4187 -4307 -3382 -1733 279 1655 2383 1801 445 -1571 -3473
2602 -3473 -4258 -4232 -3233 -1556 359 1689 2171 1505 -49 -1970 -3685 -4525 -4417 -3419 -1623 262 1469
2619 1469 1664 878 -679 -2543 -4204 -5002 -4853 -3483 -1818 32 1133 1264 289 -1368 -3109 -4590
2635 -4590 -5214 -4800 -3427 -1693 15 907 1078 24 -1488 -3244 -4674 -5030 -4437 -2966 -1131 469
2651 469 1454 1236 345 -1373 -3113 -4209 -4325 -3814 -2287 -312 1236 2019 1735 469 -1201 -2885 -3908
2668 -3908 -3981 -3145 -1566 292 1705 2412 1665 508 -1097 -2745 -3690 -3811 -2906 -1317 350 1747 2136
$$ packed form
2551E01K010J739J033J9r73k056k095j538o72L84J323K048J432R70m2j178j975
2568I30k151j493n19O03J429K034J441R06m21j200j861j852j347m06O50J473J958
2585A74J616O60j80j328k194j652j283j20R25J649K012J376P28n82j356k016j902
2602c473p85K6R99J677J915J330M82o66j554j921j715q40J08R98J796J885J207
2619A469J95p86j557j864j661p98J49J370J665J850J101J31r75j657j741j481
2635d590o24M14J373J734J708Q92J71j054j512j756j430l56N93J471J835J600
2651D69R85k18q91j718j740j096j16N11J527J975J548P83k84j266j670j684j023
2668c908p3Q36J579J858J413P07p47j157j605j648r45j21R05J589J667J397L89
$$ plain form
2685 2136 1492 203 -1586 -3202 -3950 -3910 -2970 -1446 343 1534 1884 1114 -167 -1963 -3434 -4087 -3857
2702 -3857 -2739 -962 570 1693 1920 1145 35 -1847 -3179 -3556 -3099 -1840 -23 1597 2672 2827
2718 2827 2036 661 -944 -2129 -2365 -1665 -288 1535 3092 4043 4014 3198 1702 279 -722 -897 -213
2735 -213 1378 3050 4489 5292 5243 4146 2661 1207 365 140 1031 2491 4097 5455 6120 5941 4830
2752 4830 3442 1834 1076 1047 1902 3437 5030 6341 6835 6543 5186 3749 2553 1550 1719 2742 4174
2769 4174 5782 6973 7319 6772 5479 3964 2690 1857 2232 3098 4554 6177 7004 7320 6487 5084 3422
2786 3422 2096 1483 1638 2735 4049 5391 6064 5972 5059 3775 2013 542 -60 175 1282 2557 3669
2803 3669 4337 4134 2965 1377 -405 -1444 -2222 -1970 -826 480 1538 1962 1630 475 -1116 -2858
$$ packed form
2685B136o44j289j789j616p48M0R40J524J789J191L50p70j281j796j471o53K30
2702c857J118J777J532J123K27p75j110j882j332l77M57J259J817J620J075J55
2718B827p91j375j605j185k36P00J377J823J557R51k9q16j496j423j001j75O84
2735b13J591J672J439Q03m9j097j485j454q42k25Q91J460J606J358O65j79j111
2752D830j388j608p58k9Q55J535J593J311M94k92j357j437j196j003J69J023J432
2769D174J608J191L46n47j293j515j274q33L75Q66J456J623Q27L16q33j403j662
2786C422j326o13J55J097J314J342O73r2r13j284j762j471o02K35J107J275J112
2803C669O68k03j169j588j782j039p78K52J144J306J058M24l32j155j591j742
$$ plain form
2819 -2858 -4131 -4459 -4016 -3003 -1596 -580 -356 -545 -1748 -3473 -4930 -6037 -6217 -5607 -4439 -3065
2835 -3065 -1936 -1579 -2025 -3251 -4735 -6121 -6947 -7046 -6140 -4699 -3420 -2251 -1962 -2230 -3505 -4847 -6168
2852 -6168 -6782 -6583 -5664 -4156 -2812 -1716 -1363 -1799 -2898 -4315 -5415 -5937 -5607 -4522 -3153 -1598 -501
2869 -501 -279 -859 -1872 -3260 -4250 -4505 -4096 -2933 -1449 82 908 1160 529 -597 -1865 -2789 -3027 -2481
2887 -2481 -1186 526 1868 2641 2718 1990 897 -528 -1326 -1472 -831 647 2098 3411 4207 4035 3221
2904 3221 2023 630 -135 -115 571 1736 3245 4322 4916 4618 3623 2395 1047 349 223 872 2170
2921 2170 3478 4456 4837 4284 3463 2007 736 -106 -174 660 1814 2967 4025 4079 3500 2383 882 -409
2939 -409 -1143 -1148 -393 867 2009 2766 2721 2059 789 -745 -1998 -2651 -2521 -1795 -552 637 1395 1176 570
$$ packed form
2819b858j273l28M43J013J407J016K24j89j203j725j457j107j80O10J168J374
2835c065J129L57m46j226j484j386q26r9R06J441J279J169K89k68j275j342j321
2852f168o14J99R19J508J344J096L53m36j099j417j100n22L30J085J369J555J097
2869e01K22n80j013j388r90k55M09J163J484J531Q26K52o31j126j268r24k38N46
2887b481J295J712J342P73P7p28j093j425p98j46O41J478J451J313P96j72q14
2904C221j198j393p65K0O86J165J509J077N94k98r95j228j348o98j26O49J298
2921B170J308R78L81n53q21j456j271q42o8Q34J154J153J058N4n79j117j501j291
2939d09p34nP55J260J142P57m5o62j270j534j253o53J30P26J243J189P58k19o06
$$ plain form
2958 570 -967 -2486 -3670 -4056 -3704 -2918 -1566 -514 138 57 -678 -1976 -3413 -4356 -4636 -4241 -3214 -1978
2976 -1978 -704 -36 -312 -1009 -2219 -3294 -4195 -4348 -3851 -2638 -1306 -230 591 234 -576 -1684 -2844
2993 -2844 -3530 -3565 -3005 -1776 -437 735 1214 894 17 -1232 -2373 -2979 -2911 -2257 -993 454 1248 1574
3011 1574 1353 367 -948 -1953 -2577 -2213 -1528 -332 932 1848 1991 1543 577 -673 -1625 -2120 -1873 -902
3029 -902 220 1490 2281 2504 1839 900 -406 -1251 -1740 -1292 -366 843 1989 2679 2953 2028 1031 -120
3047 -120 -937 -1210 -796 143 1452 2523 3099 3027 2425 1280 23 -602 -881 -379 612 1851 2987 3424
3065 3424 3253 2377 1280 189 -627 -721 -23 893 2254 3157 3515 3195 2289 1144 61 -531 -530 94 1194
3084 1194 2293 3115 3523 3222 2254 961 -35 -587 -541 176 1283 2449 3296 3588 3097 2153 1028 -28
$$ packed form
2958E70j537j519j184l86L52P86J352J052O52q1p35j298j437r43k80L95J027J236
2976a978J274O68k76o97j210j075r01j53M97J213J332J076Q21l57q10j108j160
2993b844o86l5N60J229J339J172M79l20q77j249j141o06O8O54J264J447P94L26
3011A574k21r86j315j005o24L64O85J196J264R16J43m48r66j250r52m95K47R71
3029i02J122J270P91K23o65r39j306q45m89M48R26J209J146O90K74r25r97j151
3047a20q17k73M14R39J309J071N76p2o02j145j257o25k79N02R91J239J136M37
3065C424j71q76j097j091q16r4O98R16J361R03L58l20r06j145j083n92JO24J100
3084A194J099Q22M08l01r68j293r96n52M6P17J107J166Q47K92m91r44j125j056
$$ plain form
3102 -28 -408 -182 653 1547 2635 3310 3620 2973 1948 734 -252 -675 -581 232 1428 2240 2863 2747 2119
3121 2119 838 -252 -1379 -1774 -1522 -904 155 924 1276 1034 306 -1058 -2265 -3244 -3623 -3442 -2671 -1656
3139 -1656 -1006 -601 -901 -1674 -3033 -4140 -4852 -5203 -4867 -4137 -3052 -2252 -1927 -2269 -3197 -4246 -5173 -5961
3157 -5961 -5924 -5402 -4508 -3572 -2692 -2348 -2545 -3411 -4323 -5265 -5834 -5643 -4987 -3945 -2955 -2038 -1581 -1930 -2716 -3683
3177 -3683 -4446 -4791 -4521 -3747 -2561 -1385 -517 -313 -698 -1330 -2273 -2867 -3116 -2767 -1790 -644 531 1171
3195 1171 1590 1217 458 -440 -1022 -1115 -654 440 1619 2646 3396 3639 3387 2490 1709 1079 1131 1687 2547
3214 2547 3797 4827 5381 5474 4947 4156 3392 2860 2736 3498 4136 5440 6352 6730 6784 6037 5095 4203 3681
3233 3681 3626 4215 4966 5996 6684 7050 6761 5895 4798 3987 3312 3163 3559 4438 5280 5902 5874 5417 4531 3359
$$ packed form
3102b8l80K26Q35Q94J088O75L10o47j025j214r86m23R4Q13J196Q12O23j16o28
3121B119j281j090j127l95K52O18J059P69L52k42p28j364j207r79l79J81P71J015
3139a656O50M05l00p73j359j107p12l51L36P30J085Q00L25l42r28j049r27p88
3157e961L7N22Q94R36Q80L44j97q66r12r42n69J91O56J042R90R17M57l49p86r67
3177c683p63l45K70P74J186J176Q68K04l85o32r43n94k49L49R77J146J175O40
3195A171M19l73p59q98n82r3M61J094J179J027P50K43k52q97p81o30N2N56Q60
3214B547J250J030N54R3n27p91p64n32j24P62O38J304R12L78N4p47r42q92n22
3233C681n5N89P51J030O88L66k89q66j097q11o75j49L96Q79Q42O22k8m57q86j172
$$ plain form
3253 3359 2334 1785 1566 1956 2767 3376 3904 3865 3166 2153 1103 84 -629 -585 -158 682 1323 1599 1581
3272 1581 972 51 -974 -2015 -2565 -2504 -1989 -1227 -468 -91 -176 -843 -1831 -2980 -3751 -3995 -3977 -3329 -2554 -1811
3292 -1811 -1350 -1474 -2175 -3059 -4174 -5006 -5122 -4878 -3954 -3262 -2354 -2133 -2246 -2873 -3807 -4823 -5321 -5491 -4951
3311 -4951 -4187 -3305 -2556 -2056 -2248 -2884 -3751 -4569 -4929 -4792 -4208 -3441 -2570 -1623 -1422 -1460 -1926 -2714 -3486 -3728
3331 -3728 -3665 -2968 -2048 -1107 -235 -28 -97 -734 -1551 -2167 -2410 -2268 -1526 -386 447 1174 1597 1192 365 -351
3351 -351 -871 -1071 -826 -74 995 1788 2501 2739 2199 1558 672 219 -55 303 939 1840 2723 3485 3392 3036
3371 3036 2241 1412 745 737 1180 1758 2826 3567 3972 3861 3420 2693 1893 1346 1371 1727 2347 3285 4004 4379
3391 4379 4083 3558 2865 1981 1601 1542 1873 2640 3462 4132 4361 4047 3367 2588 1827 1245 1262 1598 2381 3046
$$ packed form
3253C359j025n49k19L90Q11O09N28l9o99j013j050j019p13M4M27Q40O41K76j8
3272A581o09r21j025j041n50O1N15P62P59L77q5o67r88j149p71k44J8O48P75P43
3292a811M61j24p01q84j115q32j16K44R24O92R08K21j13o27r34j016m98j70N40
3311d951P64Q82P49N00j92o36q67q18l60J37N84P67Q71R47K01l8m66p88p72k42
3331c728O3O97R20R41Q72K07o9o37q17o16k43J42P42J140Q33P27M23m05q27p16
3351c51n20k00K45P52J069P93P13K38n40o41q86m53k74L58O36R01Q83P62r3l56
3371C036p95q29o67qM43N78J068P41M05j11m41p27q00n47K5L56O20R38P19L75
3391D379k96n25o93q84l80n9L31P67Q22O70K29l14o80p79p61n82J7L36P83O65
$$ plain form
3411 3046 3740 3713 3466 2811 1884 1056 621 620 1104 1807 2549 2944 3006 2703 2032 1084 147 -125 -64 417 1033
3432 1033 1709 2093 2223 1794 1111 -48 -517 -965 -732 -253 411 1003 1427 1470 1101 192 -751 -1446 -1578 -1462
3452 -1462 -854 -218 349 761 617 108 -903 -1608 -2291 -2603 -2274 -1760 -1108 -454 -281 -443 -1015 -1831 -2646
3471 -2646 -3220 -3429 -3086 -2637 -1803 -1257 -1125 -1343 -2086 -2761 -3535 -3892 -4035 -3536 -2993 -2217 -1680 -1532 -1795 -2292
3491 -2292 -3178 -3732 -4119 -3955 -3517 -2838 -2136 -1495 -1409 -1536 -2231 -2820 -3365 -3671 -3464 -3066 -2277 -1301 -885 -736
3511 -736 -863 -1685 -2239 -2810 -3010 -2896 -2247 -1504 -761 -188 -182 -673 -1316 -1927 -2455 -2656 -2319 -1894 -1024 -551 -5
3532 -5 -77 -592 -1364 -2035 -2457 -2690 -2343 -1754 -1076 -544 -217 -410 -818 -1492 -2037 -2588 -2750 -2455 -1794 -1017 -500
3553 -500 -264 -345 -833 -1419 -2139 -2409 -2554 -2067 -1448 -743 -162 19 -79 -831 -1183 -1835 -2200 -2179 -1581 -972 -307
$$ packed form
3411C046O94k7k47o55r27q28m35jM84P03P42L95O2l03o71r48r37k72O1M81O16
3432A033O76L84J30m29o83j159m69m48K33M79O64N92M24M3l69r09r43o95j32J16
3452a462O08O36N67M12j44n09j011p05o83l12L29N14O52O54J73j62n72q16q15
3471b646n74k09L43M49Q34N46J32k18p43o75p74l57j43M99N43P76N37J48k63m97
3491b292q86n54l87J64M38O79P02O41Q6j27o95n89n45l06K07L98P89R76M16J49
3511g36j27q22n54n71k00J14O49P43P43N73Om91o43o11n28k01L37M25Q70M73N46
3532ep2n15p72o71m22k33L47N89O78N32L27j93m08o74n45n51j62K95O61P77N17
3553e00K36q1m88n86p20k70j45M87O19P05N81J81r8p52l52o52l65K1N98O09O65
$$ plain form
3574 -307 241 475 219 -321 -871 -1600 -1728 -1679 -1084 -524 348 754 865 638 76 -488 -983 -1081 -1019 -398 267
3595 267 821 1359 1534 1157 771 109 -324 -415 13 635 1193 1909 2529 2652 2259 1710 1263 954 870 1193 1906
3616 1906 2642 3338 3750 3666 3358 2906 2467 2084 2103 2595 3086 3792 4619 4792 4682 4362 3854 3370 2993 3037 3319
3637 3319 3825 4607 4995 5272 5000 4583 3911 3376 2986 2890 3116 3726 4228 4522 4621 4314 3680 3106 2420 1929
3657 1929 2009 2095 2715 3077 3391 3254 3012 2316 1444 983 650 438 769 1040 1634 1752 1676 1208 756 -203 -791
3678 -791 -1021 -923 -805 -333 142 261 245 -219 -1010 -1644 -2234 -2468 -2372 -2074 -1540 -1277 -978 -1202 -1600 -2301 -3079
3699 -3079 -3521 -3706 -3623 -3131 -2712 -2228 -1999 -2294 -2795 -3439 -3951 -4387 -4313 -4185 -3788 -3276 -2927 -2679 -2843 -3173
3719 -3173 -3833 -4221 -4599 -4568 -4309 -3868 -3147 -2700 -2365 -2654 -2932 -3484 -3867 -4084 -3899 -3526 -2936 -2264 -1789 -1554
$$ packed form
3574c07N48K34k56n40n50p29j28M9N95N60Q72M06J11k27n62n64m95r8O2O21O65
3595B67N54N38J75l77l86o62m33r1M28O22N58P16O20J23l93n49m47l09q4L23P13
3616A906P36O96M12q4l08m52m39l83J9M92M91P06Q27J73j10l20n08m84l77M4K82
3637C319N06P82L88K77k72m17o72n35l90r6K26O10N02K94R9l07o34n74o86m91
3657A929Q0Q6O20L62L14j37k42o96q72m61l33k12L31K71N94J18p6m68m52r59n88
3678g91k30R8J18M72M75J19j6m64p91o34n90k34R6K98N34K63K99k24l98p01p78
3699c079m42j85Q3M92M19M84K29k95n01o44n12m36P4J28L97N12L49K48j64l30
3719c173o60l88l78L1K59M41P21M47L35k89k78n52l83k17J85L73N90O72M75K35
$$ plain form
3739 -1554 -1653 -2094 -2591 -2842 -2812 -2709 -2176 -1636 -851 -399 -346 -249 -674 -986 -1439 -1418 -1232 -632 48 658 1097
3760 1097 1514 1168 732 460 -24 -54 350 878 1517 2148 2630 2627 2381 2050 1568 1349 1297 1481 2091 2668 3247
3781 3247 3544 3573 3428 2756 2393 2169 2130 2263 2793 3446 3780 4063 3982 3602 3172 2735 2412 2303 2619 3071 3578
3802 3578 3976 4167 4074 3565 2960 2578 2245 2045 2403 2807 3245 3501 3677 3425 2948 2308 1812 1487 1494 1704 2108
3823 2108 2483 2824 2767 2486 1908 1480 820 593 612 758 1170 1519 1638 1751 1258 879 138 -220 -503 -546 -236
3844 -236 148 500 577 544 267 -278 -857 -1223 -1459 -1422 -1133 -781 -409 -232 -361 -746 -1266 -1786 -2248 -2261 -2238 -1907
3866 -1907 -1422 -1182 -1041 -1199 -1535 -2056 -2425 -2796 -2905 -2777 -2346 -1943 -1723 -1416 -1478 -1815 -2408 -2861 -2985 -2965
3886 -2965 -2747 -2448 -1823 -1560 -1378 -1588 -1851 -2140 -2503 -2671 -2697 -2364 -1886 -1423 -1047 -950 -964 -1318 -1844 -2154 -2195
$$ packed form
3739a554r9m41m97k51L0J03N33N40P85M52N3R7m25l12m53K1J86O00O80O10M39
3760A097M17l46m36k72m84l0M04N28O39O31M82lk46l31m82k19n2J84O10N77N79
3781C247K97K9j45o72l63k24l9J33N30O53L34K83q1l80m30m37l23j09L16M52N07
3802C578L98J91r3n09o05l82l33k00L58M04M38K56J76k52m77o40m96l25PK10M04
3823B108L75L41n7k81n78m28o60k27J9J46M12L49J19J13m93l79p41l58k83m3L10
3844b36L84L52P7l3k77n45n79l66k36L7K89L52L72J77j29l85n20n20m62j3K3L31
3866a907M85K40J41j58l36n21l69l71j09J28M31M03K20L07o2l37n93m53j24K0
3886b965K18K99O25K63J82k10k63k89l63j68k6L33M78M63L76R7j4l54n26l10m1
$$ plain form
3907 -2195 -2045 -1731 -1222 -664 -371 -346 -523 -707 -1157 -1560 -1585 -1418 -1009 -578 -30 198 185 92 -177 -714 -891
3928 -891 -981 -885 -460 92 386 750 714 525 134 -89 -405 -442 -182 97 604 1120 1254 1292 1048 650 267 113
3950 113 41 335 834 1191 1683 1813 1738 1407 1117 645 416 549 519 1176 1479 1747 1977 1785 1519 1020 585
3971 585 501 504 739 994 1464 1831 1771 1582 1034 754 344 55 140 324 643 1076 1314 1361 1099 637 284 -347
3993 -347 -362 -337 -45 290 634 914 773 522 76 -370 -641 -854 -714 -518 -156 241 383 323 245 -308 -679
4014 -679 -945 -1107 -813 -559 -253 119 261 183 -165 -413 -926 -1140 -1213 -1021 -635 -311 11 104 118 -171 -580
4035 -580 -966 -1296 -1158 -1048 -737 -474 -108 -91 -281 -500 -917 -1226 -1489 -1472 -1290 -1022 -529 -309 -315 -448 -739
4056 -739 -1122 -1551 -1469 -1475 -1373 -986 -597 -499 -215 -264 -755 -1117 -1400 -1441 -1439 -1138 -786 -462 -258 -325 -427 -719 -1072
$$ packed form
3907b195J50L14N09N58K93K5j77j84m50m03k5J67M09M31N48K28j3r3k69n37j77
3928h91r0R6M25N52K94L64l6j89l91k23l16l7K60K79N07N16J34L8k44l98l83j54
3950A13p2K94M99L57M92J30p5l31k90m72k29J33l0O57L03K68K30j92k66m99m35
3971E85q4LK35K55M70L67o0j89n48k80m10k89Q5J84L19M33K38M7k62m62l53o31
3993c47j5K5K92L35L44K80j41k51m46m46k71k13J40J96L62L97J42o0p8n53l71
4014f79k66j62K94K54L06L72J42p8l48k48n13k14p3J92L86L24L22R3J4k89m09
4035e80l86l30J38J10L11K63L66J7j90k19m17l09k63J7J82K68M93K20oj33k91
4056g39l83m29Q2oJ02L87L89R8K84m9m91l62k83m1KL01L52L24K04o7j02k92l53
$$ plain form
4079 -1072 -1255 -1345 -1208 -968 -606 -390 -209 -100 -297 -574 -1002 -1228 -1201 -1134 -833 -525 -204 55 86 -231 -529
4100 -529 -777 -1053 -1086 -801 -636 -214 128 240 149 -17 -160 -439 -848 -822 -712 -227 88 345 654 564 330
4121 330 -4 -265 -394 -287 -85 243 718 954 1023 1063 621 343 107 95 207 325 778 1189 1372 1517 1274
4142 1274 1041 801 512 560 618 790 1197 1646 1674 1857 1674 1359 1135 978 855 998 1176 1547 1608 2002 2007 1836
4164 1836 1516 1169 1171 918 903 1188 1605 1785 1908 1970 1769 1368 1123 778 685 809 1216 1421 1577 1683 1718 1445
4186 1445 1115 581 561 267 436 710 868 1137 1037 1018 721 318 34 -161 -300 -180 199 328 522 518 400
4207 400 63 -325 -512 -550 -676 -648 -299 -145 -17 105 -23 -416 -742 -975 -1295 -1305 -1014 -751 -486 -254 -402
4228 -402 -408 -909 -1105 -1230 -1345 -1305 -1167 -990 -685 -499 -632 -744 -985 -1173 -1514 -1761 -1396 -1277 -894 -829 -526
$$ packed form
4079a072j83r0J37K40L62K16J81J09j97k77m28k26K7O7L01L08L21K59L1l17k98
4100e29k48k76l3K85J65M22L42J12r1j66j43k79m09K6J10M85L15K57L09r0k34
4121C30l34k61j29J07K02L28M75K36O9M0m42k78k36j2J12J18M53M11J83J45k43
4142A274k33k40k89M8N8J72M07M49K8J83j83l15k24j57j23J43J78L71O1L94Nj71
4164A836l20l47Kk53j5K85M17J80J23O2k01m01k45l45r3J24M07K05J56J06L5k73
4186A445l30n34k0k94J69K74J58K69j00j9k97m03k84j95j39J20L79J29J94mj18
4207D00l37l88j87l8j26K8L49J54J28J22j28l93l26k33l20j0K91K63K65K32j48
4228d02on01j96j25j15M0J38J77L05J86j33j12k41j88l41k47L65J19L83O5L03
$$ plain form
4249 -526 -609 -821 -1009 -1355 -1533 -1510 -1479 -1225 -938 -722 -504 -433 -691 -851 -1041 -1187 -1188 -1115 -862 -509 -219 -58
4271 -58 50 -189 -402 -757 -762 -724 -530 -234 165 309 505 564 479 318 122 -23 94 259 573 870 1138 1298
4293 1298 1224 1149 867 742 737 603 887 1193 1483 1664 1650 1626 1494 1160 1054 813 955 1040 1340 1509 1654 1559
4315 1559 1525 1326 1075 862 567 734 815 1027 1172 1455 1290 1092 887 644 363 203 221 406 616 703 838
4336 838 732 527 269 40 -220 -428 -251 -92 131 94 270 185 -44 -280 -549 -886 -801 -850 -739 -555 -414
4357 -414 -360 -576 -621 -988 -1229 -1441 -1608 -1382 -1177 -1031 -945 -993 -1079 -1277 -1556 -1779 -1903 -1984 -1720 -1601 -1410 -1316
4379 -1316 -1228 -1323 -1524 -1550 -1906 -1975 -1940 -1755 -1681 -1282 -1075 -1055 -1239 -1267 -1347 -1746 -1800 -1613 -1367 -1042 -712 -600 -462
4402 -462 -435 -678 -737 -936 -916 -727 -445 -135 132 348 283 446 337 54 12 59 227 431 768 1016 1175 1203
$$ packed form
4249e26q3k12j88l46j78K3L1K54K87K16K18P1k58j60j90j46jP3K53L53K90J61
4271e8J08k39k13l55nL8J94K96L99J44J96N9q5j61j96j45J17J65L14K97K68J60
4293A298p4p5k82j25nj34K84L06K90J81j4k4j32l34j06k41J42Q5L00J69J45r5
4315A559l4j99k51k13k95J67Q1K12J45K83j65j98k05k43k81j60J8J85K10Q7J35
4336H38j06k05k58k29k60k08J77J59K23l7J76q5k29k36k69l37Q5m9J11J84J41
4357d14N4k16m5l67k41k12j67K26K05J46Q6m8q6j98k79k23j24q1K64J19J91R4
4379a316Q8r5k01k6l56o9L5J85P4L99K07K0j84k8q0l99n4J87K46L25L30J12J38
4402d62K7k43n9j99K0J89K82L10K67K16o5J63j09k83m2M7J68K04L37K48J59K8
$$ plain form
4424 1203 1073 901 936 794 673 841 1144 1300 1616 1743 1769 1692 1502 1279 1145 1175 1442 1536 1701 1848 2086
4445 2086 2044 1937 1645 1389 1448 1290 1528 1763 1938 2143 2143 2162 1752 1661 1373 1291 1327 1406 1633 1601 1735 1727 1667 1310
4469 1310 1182 927 1000 860 949 958 949 1138 1223 938 673 484 180 77 20 98 166 225 293 166 24 -146 -498 -764
4493 -764 -724 -1049 -765 -522 -567 -509 -693 -864 -1037 -1252 -1487 -1421 -1502 -1315 -1276 -1097 -1071 -1114 -1311 -1473 -1588 -1856 -1757
4516 -1757 -1671 -1508 -1449 -1250 -1254 -1349 -1370 -1507 -1672 -1716 -1724 -1597 -1422 -1352 -1021 -1114 -1069 -1306 -1287 -1418 -1617 -1427 -1342 -1116
4540 -1116 -944 -768 -758 -657 -890 -837 -1075 -1128 -960 -851 -705 -372 -236 -127 -244 -256 -365 -494 -435 -444 -241 -5
4562 -5 183 242 407 334 296 216 -14 79 95 349 569 735 714 827 738 696 565 445 544 525 702 807 950 1089
4586 1089 1049 923 824 723 637 486 672 706 858 828 999 913 942 718 530 358 373 412 497 750 776 806 741 581
$$ packed form
4424A203j30j72L5j42j21J68L03J56L16J27K6p7j90k23j34L0K67R4J65J47K38
4445B086m2j07k92k56N9j58K38K35J75K05%J9m10r1k88q2L6P9K27l2J34qo0l57
4469A310j28k55P3j40Q9RrJ89Q5k85k65j89l04j03n7P8O8N9O8j27j42j70l52k66
4493g64M0l25K84K43m5N8j84j71j73k15k35O6q1J87L9J79K6m3j97j62j15k68R9
4516a757Q6J63N9J99mr5k1j37j65m4qJ27J75P0L31r3M5k37J9j31j99J90Q5K26
4540a116J72J76J0J01k33N3k38n3J68J09J46L33J36J09j17j2j09j29N9rK03K36
4562eJ88N9J65p3l8q0k30R3J6K54K20J66k1J13q9m2j31j20R9j9J77J05J43J39
4586A089m0j26r9j01q6j51J86L4J52l0J71q6K9k24j88j72J5L9Q5K53K6L0o5j60
$$ plain form
4610 581 379 159 86 -39 96 301 320 515 451 386 245 152 -212 -185 -190 -163 -108 96 61 217 42 -16 -287 -404
4634 -404 -365 -553 -321 -276 -147 42 -58 -92 -398 -476 -479 -552 -538 -607 -351 -353 -369 -346 -410 -511 -519 -625 -864 -765 -607 -496
4660 -496 -433 -309 -288 -343 -398 -607 -720 -704 -666 -684 -282 -260 -252 -202 -336 -386 -354 -574 -518 -383 -396 -167 -39 35 119 13
4686 13 -121 -170 -455 -380 -168 -89 146 341 340 200 323 163 18 -61 -89 57 52 260 400 457 360 231 11 -37
4710 -37 97 3 113 222 310 371 544 498 271 135 16 122 68 229 250 383 395 580 411 413 224 162 57 123
4734 123 229 327 441 536 525 404 291 204 196 45 228 275 186 374 485 515 485 281 188 -22 26 136 129 329 373
4759 373 303 307 68 229 -4 -229 -115 24 -61 253 91 216 210 54 -45 -132 -34 -187 -136 14 83 321 236 150
4783 150 126 2 3 -204 -29 -63 107 222 130 331 280 255 199 131 72 61 124 265 443 388 470 356 314 182 147
$$ packed form
4610E81k02k20p3j25J35K05J9J95o4o5j41r3l64K7nK7N5K04l5J56j75n8k71j17
4634d04L9j88K32M5J29J89j00l4l06p8lp3J4o9K56kj6K3o4j01qj06k39R9J58J11
4660d96O3J24K1n5n5k09j13J6L8j8M02K2QN0j34n0L2k20N6J35j3K29J28P4Q4j06
4686A3j34m9k85P5K12P9K35J95jj40J23j60j45p9k8J46nK08J40N7r7j29k20m8
4710c7J34r4J10J09Q8O1J73m6k27j36j19J06n4J61K1J33J2J85j69Kj89o2j05O6
4734A23J06R8J14R5j1j21j13q7qj51J83M7q9J88J11L0l0k04r3k10M8J10pK00M4
4759C73p0Mk39J61k33k25J14J39q5L14j62J25oj56r9q7R8j53N1J50O9K38q5q6
4783A50k4j24Jk07J75l4J70J15r2K01n1k5n6o8n9j1O3J41J78n5Q2j14m2j32l5
$$ plain form
4808 147 64 149 229 357 403 517 427 416 380 137 71 208 146 35 247 284 455 298 202 106 49 -16 -106 -93 -52 144
4834 144 180 94 125 14 144 -126 -303 -219 -159 -205 -47 55 -35 44 -238 -191 -221 -335 -361 -246 -300 -105 -67 -32 -70
4859 -70 -70 -183 -355 -477 -408 -438 -414 -326 -215 -270 -373 -340 -509 -530 -595 -717 -603 -550 -539 -499 -283 -499 -454 -569 -693
4884 -693 -779 -742 -750 -710 -639 -552 -385 -500 -585 -595 -648 -585 -688 -599 -492 -404 -329 -270 -216 -274 -348 -426 -392 -364 -286 -151 -72 105
4912 105 130 72 54 122 -56 -43 225 222 249 443 461 425 342 439 409 192 274 505 575 634 763 585 651 602 553 462 334
4939 334 579 531 664 694 721 684 634 620 615 432 428 395 503 524 583 639 661 693 613 749 466 350 563 499 464 581
4965 581 728 706 713 545 373 388 251 414 316 372 512 488 468 475 432 254 86 -17 67 189 -17 34 183 109 89
4990 89 -97 -123 -31 -334 -294 -234 -256 -275 -219 -253 -399 -388 -545 -741 -750 -709 -577 -662 -632 -636 -624 -749 -783 -878 -982 -1057 -1026
$$ packed form
4808A47q3Q5Q0J28M6J14r0j1l6k43o6J37o2j11K12L7J71j57r6r6n7o5r0J3M1J96
4834A44L6q6L1j11J30k70j77Q4O0m6J58J02r0P9k82M7l0j14k6J15n4J95L8L5l8
4859g0%j13j72j22O9l0K4Q8J11n5j03L3j69k1o5j22J14N3J1M0K16k16M5j15j24
4884f93q6L7qM0P1Q7J67j15q5j0n3O3j03Q9J07Q8P5N9N4n8p4p8L4K8P8J35P9J77
4912A05K5n8j8O8j78J3K68lK7J94J8l6q3R7l0k17Q2K31P0N9J29j78O6m9m9r1j28
4939C34K45m8J33L0K7l7n0j4nj83ml3J08K1N9N6K2L2q0J36k83j16K13o4l5J17
4965E81J47k2Pj68j72J5j37J63r8N6J40k4k0Pm3j78j68j03Q4J22k06N1J49p4k0
4990H9j86k6R2l03M0O0k2j9N6l4j46J1j57j96rM1J32q5L0mJ2j25l4r5j04p5L1
$$ plain form
5017 -1026 -964 -876 -761 -745 -691 -802 -824 -842 -938 -1033 -984 -849 -715 -697 -684 -717 -794 -768 -708 -736 -845 -676 -592 -668 -548 -542
5043 -542 -552 -542 -595 -677 -632 -543 -531 -541 -359 -277 -322 -235 -337 -315 -358 -339 -298 -202 -154 -46 -65 -9 31 -105 26 -131 -65
5070 -65 7 189 78 246 281 301 321 383 299 301 332 515 500 580 658 611 808 816 748 645 549 602 745 756 757 892 901 925
5098 925 988 728 803 722 599 806 877 768 951 919 880 913 859 774 615 713 687 648 735 820 879 577 668 680 649 443
5124 443 513 525 469 497 654 611 541 732 508 364 346 278 530 348 440 482 378 317 352 340 149 69 -19 177 150
5149 150 228 169 214 194 100 84 -153 -116 -139 -116 -246 -220 -82 -2 -208 -270 -451 -427 -352 -295 -374 -317 -407 -318 -356 -300 -445
5176 -445 -568 -566 -558 -514 -591 -437 -540 -481 -442 -412 -630 -748 -678 -597 -526 -570 -471 -485 -455 -492 -547 -632 -736 -471 -412 -497 -455
5203 -455 -456 -495 -431 -420 -419 -432 -461 -347 -447 -424 -366 -269 -318 -235 -299 -284 -361 -297 -294 -320 -339 -218 -195 -67 -121 -298 -126 -158
$$ packed form
5017a026O2Q8J15J6N4j11k2j8r6r5M9J35J34J8J3l3p7K6O0k8j09J69Q4p6J20O
5043e42j0J0n3q2M5Q9J2j0J82Q2m5Q7j02K2m3J9M1R6M8J08j9N6M0j36J31j57O6
5070f5P2J82j11J68L5K0K0O2q4KL1J83j5Q0P8m7J97Qo8j03r6N3J43J1JJ35RK4
5098I25O3k60P5q1j23K07P1j09J83l2l9L3n4q5j59R8k6l9Q7Q5N9l02R1J2l1k06
5124D43P0J2n6K8J57m3p0J91k24j44j8o8K52j82R2M2j04o1L5j2j91q0q8J96k7
5149A50P8n9M5k0r4j6k37L7k3K3j30K6J38Q0k06o2j81K4P5N7p9N7r0Q9l8N6j45
5176d45j23KQM4p7J54j03N9L9L0k18j18P0Q1P1m4R9j4L0l7n5q5j04K65N9q5M2
5203d55jl9O4J1Jj3k9J14j00K3N8R7m9Q3o4J5p7O4Lk6j9J21K3J28n4j77J72l2
$$ plain form
5231 -158 -181 -207 -104 -28 -68 -62 -98 21 119 98 50 153 -67 152 39 131 245 429 345 406 256 274 320 250 262 301
5257 301 513 505 359 420 527 424 374 484 472 377 534 360 439 599 529 403 374 322 229 376 449 394 325 329 397 333
5283 333 360 357 202 233 279 123 108 81 262 164 186 214 134 119 168 0 140 191 71 128 196 61 -10 -109 -61 -13 -38
5310 -38 -43 -5 -123 -138 16 -6 -168 -65 -86 -192 -133 -185 -301 -164 -57 -105 -212 -180 -319 -327 -312 -299 -367 -386 -377 -379 -396
5337 -396 -388 -493 -368 -266 -388 -554 -444 -462 -438 -508 -428 -501 -508 -435 -462 -558 -424 -470 -516 -358 -470 -537 -427 -370 -508
5362 -508 -564 -399 -280 -422 -403 -415 -335 -278 -179 -277 -231 -92 -285 -272 -142 -118 -71 -133 -161 -108 -122 -145 -120 -84 -67 -27 -81
5389 -81 -46 50 57 32 -7 16 83 65 93 -82 63 133 227 123 166 195 173 201 183 229 158 290 346 271 397 387 351 285
5417 285 245 527 409 400 495 558 516 416 469 559 406 452 412 568 518 542 597 629 622 608 561 630 588 597 521 583 709 624
$$ packed form
5231a58k3k6J03P6m0Ol6J19R8k1m8J03k20K19j13R2J14J84q4O1j50J8M6p0J2L9
5257C01K12qj46O1J07j03n0J10j2r5J57j74P9J60p0j26k9n2r3J47P3n5o9MO8o4
5283C33K7lj55L1M6j56j5k7J81r8K2K8q0j5M9j68J40N1j20N7O8j35p1r9M8M8k5
5310c8nL8j18j5J54k2j62J03k1j06N9n2j16J37J07m8j07L2j39qJ5J3o8j9Rkj7
5337c96Qj05J25J02j22j66J10j8K4p0Q0p3pP3k7r6J34m6m6J58j12o7J10N7j38
5362e08n6J65J19j42J9j2Q0N7R9r8M6J39j93J3J30K4M7o2k8N3j4k3K5L6J7M0n4
5389h1L5R6Pk5l9K3O7j8K8j75J45P0R4j04M3K9k2K8j8M6p1J32N6p5J26j0l6o6
5417B85m0K82j18rR5O3m2j00N3R0j53M6m0J56n0K4N5L2pj4m7O9m2Rp6O2J26q5
$$ plain form
5445 624 600 590 641 565 588 545 441 607 644 561 523 492 638 436 508 553 372 508 422 441 380 338 454 510 261 509
5471 509 349 288 390 400 211 308 318 367 324 307 267 207 243 284 219 150 175 204 190 249 140 23 74 29 -45 -26 -138
5498 -138 -7 55 -223 -373 -365 -239 -418 -429 -456 -411 -324 -270 -416 -443 -480 -519 -473 -531 -445 -605 -693 -717 -467 -634 -729 -592
5524 -592 -730 -733 -834 -762 -741 -755 -766 -723 -664 -772 -744 -775 -945 -888 -964 -852 -899 -768 -917 -816 -779 -849 -821 -800 -837 -860
5550 -860 -884 -815 -779 -778 -817 -717 -865 -810 -805 -754 -734 -713 -797 -722 -627 -651 -457 -680 -571 -526 -668 -545 -463 -642 -403 -310
5576 -310 -390 -261 -431 -148 -178 -171 -182 -208 -86 -95 113 68 -12 135 -8 61 145 261 80 233 162 277 372 336 471
5601 471 373 384 412 498 477 571 605 566 533 597 667 545 659 707 732 681 787 890 768 796 838 808 838 814 841 852 743
5628 743 762 912 942 968 941 860 911 800 853 909 817 963 983 923 944 881 867 991 891 776 893 894 758 776 818 804
$$ packed form
5445F24k4j0N1p6K3m3j04J66L7q3l8l1J46k02P2M5j81J36q6J9o1m2J16N6k49K48
5471E09j60o1J02J0j89R7J0M9m3j7m0o0L6M1o5o9K5K9j4N9j09j17N1m5p4J9j12
5498a38J31O2k78j50QJ26j79j1k7M5Q7N4j46k7l7l9M6n8Q6j60q8k4K50j67r5J37
5524e92j38lj01P2K1j4j1M3N9j08K8l1j70N7p6J12m7J31j49J01L7p0K8K1l7k3
5550h60k4O9L6Jl9J00j48N5NN1K0K1q4P5R5k4J94k23J09M5j42J23Q2j79K39R3
5576c10q0J29j70K83l0Pj1k6J22rK08m5q0J47j43O9Q4J16j81J53p1J15R5l6J35
5601D71r8J1K8Q6k1R4L4l9l3O4P0j22J14M8K5n1J06J03j22K8M2l0L0k4K7J1j09
5628G43J9J50L0K6k7q1N1j11N3N6r2J46K0o0K1o3j4J24j00j15J17Jj36J8M2j4
$$ plain form
5654 804 824 711 695 728 623 686 731 577 538 673 567 591 690 551 435 517 351 373 411 325 255 330 216 193 207
5679 207 174 191 163 41 53 164 -48 114 24 -21 -49 -90 -154 -79 -126 -150 -69 -195 -246 -108 -322 -306 -444 -414 -472 -431
5705 -431 -388 -404 -510 -500 -599 -544 -581 -582 -651 -662 -646 -653 -706 -638 -753 -753 -785 -737 -784 -912 -954 -920 -822 -842 -885 -848 -921 -920 -1007 -920
5735 -920 -795 -1059 -920 -902 -911 -904 -873 -960 -866 -894 -853 -829 -812 -853 -861 -834 -615 -627 -692 -564 -716 -593 -588 -688 -444 -531 -494
5762 -494 -637 -543 -533 -413 -353 -495 -332 -359 -250 -247 -321 -224 -77 -210 -150 -189 -207 -130 -154 -92 -56 19 8 -15 120 122 155
5789 155 69 64 68 184 196 224 306 277 197 358 286 261 444 414 388 496 630 535 580 495 656 729 627 804 771 724 850
5816 850 734 833 886 765 798 909 928 902 913 890 1025 1058 919 929 1023 961 885 917 881 839 779 859 776 841 846 871 865 787
5844 787 824 785 769 780 774 744 768 691 692 594 663 678 727 593 574 564 670 577 592 498 561 476 505 503 518 452 468 355 406 313
$$ packed form
5654H04K0j13j6L3j05O3M5j54l9J35j06K4R9j39j16Q2j66K2L8q6p0P5j14k3J4
5679B07l3J7k8j22J2J11k12J62r0m5k8m1o4P5m7k4Q1j26n1J38k14J6j38L0n8M1
5705d31M3j6j06J0r9N5l7jo9j1J6pn3O8j15%l2M8m7j28m2L4R8k0m3L7p3Jq7Q7
5735i20J25k64J39J8rPL1q7R4k8M1K4J7m1qK7K19j2o5J28j52J23Nj00K44q7L7
5762d94j43R4J0J20O0j42J63k7J09Lp4R7J47j33O0l9j8P7k4O2L6P5j1k3J35KL3
5789A55q6nMJ16J2K8Q2k9q0J61p2k5J83l0k6J08J34r5M5q5J61P3j02J77l3m7J26
5816H50j16R9N3j21L3J11J9k6J1k3J35L3j39J0R4o2p6L2l6m2o0Q0q3O5NK5op8
5844G87L7l9j6J1ol0K4p7Jr8O9J5M9j34j9j0J06r3J5r4O3q5K9kJ5o6J6j13N1r3
$$ plain form
5874 313 447 216 309 341 85 310 43 232 49 7 0 7 -187 -141 -100 -136 -260 -156 -131 -329 -236 -263 -394 -582
5898 -582 -563 -390 -533 -598 -571 -523 -597 -699 -822 -677 -770 -808 -714 -795 -863 -746 -904 -921 -930 -891 -928 -906 -959 -909 -1091 -956
5924 -956 -916 -919 -884 -959 -1135 -1023 -875 -993 -930 -844 -1021 -977 -953 -846 -971 -913 -1026 -838 -844 -797 -887 -947 -843 -697 -686
5949 -686 -753 -800 -738 -941 -768 -740 -670 -677 -759 -593 -611 -451 -649 -537 -456 -502 -546 -455 -366 -279 -292 -203 -223 -187 -252 -133 -207
5976 -207 -129 74 11 110 171 207 185 200 175 236 246 451 447 467 500 459 467 585 532 433 540 594 728 704 621 700 782 721
6004 721 907 784 777 722 767 820 866 779 895 841 976 821 770 808 856 763 872 872 850 886 909 1010 797 779 790 824 819
6031 819 823 759 674 737 847 685 669 654 563 464 507 633 610 609 516 388 434 403 491 376 272 279 244 124 127 194 92 226
6059 226 -70 -92 -51 -190 -180 -98 -179 -192 -307 -273 -270 -265 -488 -353 -415 -331 -510 -456 -494 -568 -615 -626 -563 -589 -676 -711 -653 -660
$$ packed form
5874C13J34k31R3L2k56K25k67J89j83m2pPj94M6M1l6j24J04K5j98R3k7j31j88
5898e82J9J73j43o5K7M8p4j02j23J45r3l8R4q1o8J17j58j7rL9l7K2n3N0j82J35
5924i56M0lL5p5j76J12J48j18O3Q6j77M4K4J07j25N8j13J88oM7r0o0J04J46J1
5949f86o7m7O2k03J73K8P0pq2J66j8J60j98J12Q1m6m4R1Q9Q7j3Q9k0L6o5J19p4
5976b07P8K03o3R9O1L6k2J5k5O1J0K05mK0L3m1QJ18n3r9J07N4J34k4q3P9Q2o1
6004G21J86j23pn5M5N3M6q7J16n4J35j55n1L8M8r3J09%k2L6K3J01k13j8J1L4n
6031H19Mo4q5O3J10j62j6j5r1r9M3J26k3jr3j28M6l1Q8j15j04Pl5j20LO7j02J34
6059B26k96k2M1j39J0Q2q1j3j15L4LNk23J35o2Q4j79N4l8p4m7j1O3k6q7l5N8p
$$ plain form
6087 -660 -633 -641 -608 -750 -725 -746 -818 -848 -807 -819 -950 -734 -793 -776 -793 -884 -929 -956 -912 -925 -925 -945 -819 -889 -907 -832 -752 -776 -830
6116 -830 -805 -807 -862 -721 -655 -492 -688 -640 -579 -704 -525 -626 -587 -467 -362 -350 -360 -431 -310 -242 -387 -329 -230 -244 -190
6141 -190 -36 -38 -133 77 -33 -111 18 44 46 7 155 409 142 405 331 249 313 354 372 438 432 585 488 511 621 574
6167 574 610 643 707 500 611 688 619 648 534 719 742 766 795 680 693 702 805 679 740 795 844 893 893 830 762 688 826
6194 826 712 760 855 767 701 772 652 739 668 672 688 658 713 770 701 704 642 559 519 588 457 584 674 453 509 472 498 516
6222 516 355 295 229 334 238 224 332 262 318 77 56 142 25 135 -158 4 51 16 -71 -24 -46 -41 -75 -100 -104 -177 -86
6249 -86 -92 -292 -115 -90 -289 -164 -137 -362 -268 -64 -215 -233 -116 -216 -159 -69 -238 -66 -72 -81 -93 -216 -73 -59 -113
6274 -113 -149 -128 9 -168 -97 -201 -222 -201 -103 -77 -34 -47 -60 10 -144 2 -84 -109 -32 -33 -30 -66 11 33 30 -57 -77 -61 -109
$$ packed form
6087f60K7qL3j42K5k1p2l0M1j2j31K16n9J7j7r1m5k7M4j3%k0J26p0j8P5Q0k4n4
6116h30K5kn5J41O6J63j96M8O1j25J79j01L9J20J05J2j0p1J21O8j45N8R9j4N4
6141a90J54kr5K10j10p8J29K6Kl9J48K54k67K63p4q2O4M1J8O6oJ53r7K3J10m7
6167E74L6L3O4k07J11P7o9K9j14J85K3K4K9j15J3RJ03j26O1N5M9M9%o3o8p4J38
6194H26j14M8R5q8o6P1j20Q7p1MJ6l0N5N7o9Lo2q3m0O9j31J27R0k21N6l7K6J8
6222E16j61o0o6J05r6j4J08p0N6k41k1Q6j17J10k93J62M7l5q7M7k2Nl4k5mp3R1
6249h6ok00J77K5j99J25K7k25R4K04j51j8J17j00N7R0j69J72orj2j23J43J4n4
6274a13l6K1J37j77P1j04k1K1R8K6M3j3j3P0j54J46q6k5P7jLl6P7K2lq7k0J6m8
$$ plain form
6303 -109 -45 4 -14 -162 -31 -19 -10 -122 14 15 109 -128 -2 -41 -71 -62 -34 -51 66 -10 -92 -101 -27 11 -36 33 9 -13
6331 -13 -6 -150 -49 -86 -90 -89 -75 -9 -197 -43 -67 -169 -154 -307 -225 -200 -101 -195 -261 -135 -263 -190 -202 -189 -268 -248 -335 -326
6359 -326 -276 -258 -244 -437 -342 -303 -349 -203 -381 -355 -406 -322 -322 -367 -156 -285 -205 -356 -447 -392 -431 -262 -194 -292 -327 -357 -362
6386 -362 -265 -402 -259 -310 -290 -239 -286 -233 -197 -242 -255 -285 -213 -275 -191 -311 -202 -185 -60 -300 -151 -131 -72 -200 -139 -115
6412 -115 -66 -63 -79 -132 -145 -115 127 19 -15 19 39 103 90 27 80 46 147 78 15 146 132 140 114 158 218 116 202 290
6440 290 179 194 256 255 273 281 267 351 272 187 240 174 190 259 238 239 89 190 234 243 188 254 205 231 222 279 200 294 235 268 253
6471 253 203 174 185 141 37 105 215 179 95 206 111 110 16 96 87 127 14 54 -26 -120 27 53 -55 -100 -111 -194 -117 -154
6499 -154 -212 -25 -271 -150 -81 -216 -137 -241 -134 -319 -164 -282 -169 -147 -285 -180 -204 -105 -220 -369 -244 -228
$$ packed form
6303a09O4M9j8j48J31J2Rj12J36JR4k37J26l9l0RK8j7J17p6q2rP4L8m7O9k4k2
6331a3Pj44J01l7mJJ4O6j88J54k4j02J5j53Q2K5R9r4o6J26j28P3j2J3p9K0q7R
6359c26N0J8J4j93R5L9m6J46j78K6n1Q4%m5K11j29Q0j51r1N5l9J69O8r8l5l0n
6386c62R7j37J43n1K0N1m7N3L6m5j3l0P2o2Q4j20J09J7J25k40J49K0N9j28O1K4
6412a15M9Lj6n3j3L0K42j08l4L4K0O4j3o3N3l4J01o9o3J31j4Qk6M4O0j02Q6Q8
6440B90j11J5O2jJ8Qj4Q4p9q5N3o6J6O9k1Jj50J01M4Rn5O6m9K6rN7p9R4n9L3j5
6471B53n0k9J1m4j04O8J10l6q4J11r5jr4Q0rM0j13M0q0r4J47K6j08m5j1q3P7l7
6499a54n8J87k46J21O9j35P9j04J07j85J55j18J13K2j38J05k4R9j15j49J25J6
$$ plain form
6521 -228 -432 -342 -147 -257 -261 -368 -209 -339 -209 -233 -261 -167 -280 -124 -104 -195 -138 -67 -152 -68 -34 -66 -96 -128 -6
6546 -6 -152 -38 -204 -87 -20 -31 -61 35 87 -169 36 -4 11 -147 -49 -46 -48 67 29 6 -34 -42 101 -46 88 -52
6572 -52 35 34 -2 -10 5 139 147 112 4 81 53 -76 99 72 103 65 15 10 132 158 205 58 182 58 233 171 168 325
6600 325 173 141 205 216 277 73 66 76 197 314 235 208 194 186 184 104 199 164 182 75 32 69 136 69 116 104 6 -4 77
6629 77 103 -76 110 -82 36 -78 67 39 -105 -57 74 11 12 -72 60 -17 -6 -71 9 -70 -30 92 23 0 39 8
6655 8 41 56 141 -53 28 2 -9 145 149 105 38 40 36 194 194 187 117 253 252 215 253 245 156 25 75 179 255 164 281 229 310
6686 310 284 223 243 211 184 320 242 267 99 275 356 178 338 317 250 235 269 317 400 328 314 279 321 466 357 322
6712 322 443 434 327 258 390 421 266 332 256 288 437 269 306 351 300 305 353 292 276 47 270 226 103 77 174 1
$$ packed form
6521b28k04R0J95j10mj07J59j30J30k4k8R4j13J56K0r1N7P1q5Q4L4l2l0l2J22
6546fj46J14j66J17O7j1l0R6N2k56K05m0J5j58R8LkJ15l8k3m0qJ43j47J34j40
6572e2Q7jl6qJ5J34Ql5j08P7k8j29J75k7L1l8n0nJ22K6M7j47J24j24J75o2lJ57
6600C25j52l2O4J1O1k04pJ0J21J17p9k7j4qkq0R5l5J8j07m3L7O7o7M7j2r8j0Q1
6629G7K6j79J86j92J18j14J45k8j44M8J31o3Jq4J32p7J1o5Q0p9M0J22o9k3L9l1
6655HL3J5Q5j94Q1k6j1J54Mm4o7KmJ58%pp0J36jl7L8qq9j31N0J04P6r1J17n2Q1
6686C10k6o1K0l2k7J36p8K5j68J76Q1j78J60k1o7j5L4M8Q3p2j4l5M2J45j09l5
6712C22J21rj07o9J32L1j55O6p6L2J49j68L7M5n1NM8o1j6k29K23m4j23k6R7j73
$$ plain form
6738 1 118 162 46 206 55 -68 -114 -105 -178 -54 -129 -213 -196 -223 -302 -402 -256 -320 -498 -275 -317 -454 -289 -494 -387
6763 -387 -517 -425 -455 -476 -466 -453 -512 -580 -505 -657 -490 -570 -397 -539 -551 -608 -623 -701 -677 -514 -613 -512 -529 -509 -576 -578 -561
6790 -561 -652 -624 -581 -699 -673 -550 -488 -512 -612 -470 -584 -631 -670 -465 -446 -537 -409 -429 -356 -426 -302 -338 -311 -140 -170
6815 -170 -192 -74 -28 -15 -173 -106 -78 72 164 89 38 197 251 261 262 432 250 325 406 427 410 541 443 488 672 537
6841 537 641 742 758 653 718 763 842 746 908 730 737 828 908 767 827 936 906 924 985 879 894 998 692 920 907
6866 907 883 797 835 921 864 804 884 757 756 937 761 846 896 828 682 868 648 813 709 615 724 636 657 550 527
6891 527 501 466 439 372 358 343 228 231 182 221 88 161 110 -110 20 -134 -193 -125 -156 -398 -244 -394 -340 -364 -435 -427 -449
6918 -449 -498 -672 -521 -639 -555 -759 -591 -598 -727 -780 -854 -829 -827 -823 -800 -1039 -980 -971 -829 -832 -933 -1117 -1076 -850 -1007 -1153
$$ packed form
6738AJ17M4j16J60j51j23m6Rp3J24p5q4J7k7p9j00J46o4j78K23m2j37J65k05J07
6763c87j30R2l0k1J0J3n9o8P5j52J67q0J73j42j2n7j5p8K4J63r9J01j7K0o7kJ7
6790e61r1K8M3j18K6J23O2k4j00J42j14m7l9K05J9r1J28k0P3p0J24l6K7J71l0
6815a70k2J18M6J3j58O7K8J50R2p5n1J59N4J0JJ70j82P5Q1K1j7J31r8M5J84j35
6841E37J04J01J6j05O5M5P9r6J62j78PR1Q0j41O0J09l0J8O1j06J5J04l06K28j3
6866I07k4q6L8Q6n7o0Q0j27jJ81j76Q5N0o8j46J86k20J65j04r4J09q8K1j07k3
6891E27k6l5k7o7j4j5j15Lm9L9j33P3n1k20J30j54n9O8l1k42J54j50N4k4p1Qk2
6918d49m9j74J51j18Q4k04J68pj29n3p4K5KMK3k39N9RJ42lj01j84M1K26j57j46
$$ plain form
6944 -1153 -969 -924 -959 -946 -859 -961 -1011 -856 -916 -991 -877 -1062 -817 -829 -855 -1075 -877 -933 -729 -747 -944 -774 -774 -661
6968 -661 -766 -829 -718 -775 -718 -621 -644 -529 -531 -485 -672 -639 -445 -312 -348 -369 -278 -263 -193 -314 -267 -38 -104 -34 -139 9
6994 9 64 -14 15 61 173 182 314 255 339 196 196 371 323 247 338 486 376 438 342 453 482 532 510 397 484 578 557 471
7022 471 494 572 416 556 419 430 475 561 588 509 434 476 522 438 420 519 454 473 519 411 433 456 400 417 416 511 324 339
7050 339 412 401 349 333 453 356 443 263 185 226 408 152 241 270 242 106 170 139 91 99 144 26 -12 63 6 8 -70 -13
7078 -13 -82 -114 -218 -104 -145 -202 -97 -198 -135 -151 -259 -182 -178 -265 -187 -222 -310 -200 -274 -154 -165 -268 -163 -341 -167
7103 -167 -154 -239 -229 -93 -68 -202 -223 -59 -179 -165 -179 44 -28 70 -89 -163 82 -233 -1 8 9 -21 48 63 76 72 88
7130 88 -35 144 69 106 143 151 91 234 91 46 219 178 116 189 148 182 185 202 148 208 272 218 171 123 260 446 339
$$ packed form
6944a153J84M5l5J3Q7j02n0J55o0p5J14j85K45j2k6k20J98n6K04j8j97J70%J13
6968f61j05o3J11n7N7R7k3J15kM6j87L3J94J33l6k1R1J5P0j21M7K29o6P0j05J48
6994IN5p8K9M6J12RJ32n9Q4j43%J75m8p6R1J48j10O2r6J11K9N0k2j13Q7R4k1q6
7022D71K3P8j56J40j37J1M5Q6K7p9p5M2M6q4j8R9o5J9M6j08K2K3n6J7jR5j87J5
7050C39P3j1n2j6J20r7Q7j80p8M1J82k56Q9K9k8j36O4l1m8QM5j18l8P5n7Kp8N7
7078a3o9l2j04J14m1n7J05j01O3j6j08P7Mq7P8l5q8J10p4J20j1j03J05j78J74
7103a67J3q5J0J36K5j34k1J64j20J4j4K23p2R8j59p4K45l15K32RJl0O9J5J3mJ6
7130H8j23J79p5L7L7Qo0J43j43m5J73m1o2P3m1L4LJ7n4O0O4n4m7m8J37J86j07
$$ plain form
7157 339 206 334 308 351 170 292 229 299 259 281 233 173 292 221 284 260 386 179 201 263 324 197 264 210 118 195
7183 195 50 312 155 208 216 131 239 43 37 -29 79 -5 47 -9 30 75 -25 -124 -161 -135 -20 -87 -97 -173 -51 -74
7209 -74 -108 -55 -92 -96 -142 -107 -67 -268 -135 -272 -294 -114 -65 -170 -131 -140 -132 -51 -279 -68 -108 -236 -120 -26 -93 -98 -150 -68
7237 -68 -92 29 -144 -74 -97 -93 -106 -145 -60 83 -35 -5 126 -2 25 -184 52 -117 -35 -81 -151 27 33 -49 -121 22
7263 22 80 37 -145 -57 -70 -7 -87 17 -21 41 51 -74 -108 -72 -44 7 -32 -30 -62 0 106 -11 -2 -45 -109 -29 -95 -4 -27
7292 -27 -113 3 22 -110 -72 -47 -57 -15 -142 -28 32 3 14 78 -138 -163 -89 52 34 -35 -93 -121 -29 -48 -92 -87 -114 -69
7320 -69 -69 -176 -89 -91 7 -62 -130 -94 -69 -206 -13 -20 40 59 81 -28 23 -227 68 -55 -57 -91 36 9 129 58 71 168
7348 168 99 194 155 146 21 153 120 88 44 54 151 147 -50 73 139 203 190 200 30 225 10 354 205 214 197 211 191
$$ packed form
7157C39j33J28k6M3j81J22o3P0m0K2m8o0J19p1O3k4J26k07K2O2O1j27O7n4r2P7
7183A95j45K62j57N3Qq5J08j96oo6J08q4N2n6L9M5j00r9l7K6J15o7j0p6J22k3
7209g4l4N3l7mm6L5M0k01J33j37k2J80M9j05L9rQQ1k28K11m0j28J16R4o7nn2Q2
7237f8k4J21j73P0k3Mj3l9Q5J43j18L0J31j28K7k09K36j69Q2m6p0J78Oq2p2J43
7263B2N8m3j82Q8j3O3q0J04l8O2J0j25l4L6K8N1l9Kl2O2J06j17Rm3o4Q0o6R1k3
7292b7q6J16J9j32L8K5j0M2j27J14O0k9J1O4k16k5P4J41j8o9n8k8R2j9m4Nk7M5
7320f9%j07Q7kR8o9o8L6K5j37J93pO0J9K2j09N1k50K95j23kl4J27k7J20p1J3R7
7348A68o9R5l9rj25J32l3l2m4J0R7mj97J23O6O4j3J0j70J95k15L44j49Rj7J4k0
$$ plain form
7375 191 186 167 114 256 347 175 157 266 -1 188 179 224 129 247 270 116 90 111 42 178 93 72 204 162 176 57
7401 57 -11 175 -52 26 2 -12 57 71 89 -37 140 -22 -56 -43 -153 1 -73 -25 -20 -17 -80 -15 -76 -105 -27 -101 -135 -116
7429 -116 -53 -23 -162 -79 -21 -159 -186 -197 -251 -244 -129 -305 -117 -27 -212 -190 -81 -198 -119 -159 -196 -226 -137 -302 -288 -310
7455 -310 -276 -176 -403 -257 -307 -227 -174 -200 -207 -299 -259 -277 -171 -119 -163 -233 -207 -258 -237 -223 -165 -51 -106 -219 -136 -53 -144
7482 -144 -143 -194 -57 -75 -112 -116 -47 -46 -175 -138 -148 -80 -1 63 7 143 -4 -32 -38 14 94 23 139 81 170 108 152 83 212
7511 212 99 109 74 93 76 32 153 289 198 206 131 92 129 -14 167 -18 -73 104 145 142 115 153 97 -5 59 176
7537 176 11 -133 -113 7 18 64 -7 79 -2 -30 22 -116 -123 0 -12 -1 -39 29 -106 -118 -115 -43 -97 5 -2 -5 -11 -123
7565 -123 -112 -68 -137 -81 -97 37 -133 8 18 -94 -52 -87 -66 -188 -76 -146 -19 -95 -193 -96 -80 -101 -149 -224 -142 -93
$$ packed form
7375A91nj9n3J42R1j72j8J09k67J89rM5r5J18K3j54k6K1o9J36q5k1J32m2J4j19
7401E7o8J86k27P8k4j4O9J4J8j26J77j62l4J3j10J54p4M8NLo3O5o1k9P8p4l4J9
7429a16O3L0j39Q3N8j38k7j1n4PJ15j76J88R0j85K2J09j17P9m0l7l0Q9j65J4k2
7455c10L4J00k27J46n0Q0N3k6pr2M0j8J06N2m4p0K6n1K1J4N8J14n5j13Q3Q3r1
7482a44Jn1J37j8l7mO9Jj29L7j0O8P9O4n6J36j47k8oN2Q0p1J16n8Q9o2M4o9J29
7511B12j13J0l5J9j7m4J21J36r1Qp5l9L7j43J81j85n5J77M1lk7L8n6j02O4J17
7537A76j65j44K0J20J1M6p1Q6q1k8N2j38pJ23j2J1l8O8j35j2LP2n4J02ploj12
7565a23J1M4o9N6j6J34j70J41J0j12M2l5K1j22J12p0J27p6r8R7J6k1m8p5Q2M9
$$ plain form
7591 -93 -132 -133 19 -109 -115 -33 -121 4 -133 -118 -155 -134 -151 -53 81 -2 -183 24 -76 -40 -37 -43 -68 28 93 114 25 93
7619 93 69 -30 -27 -60 66 94 70 46 80 136 119 161 37 198 123 230 250 154 50 291 160 195 241 139 97 198
7645 198 213 150 206 219 251 178 239 78 255 177 149 225 227 188 390 198 314 225 344 197 190 191 256 231 367 314 302
7672 302 168 161 75 249 252 232 242 312 367 153 194 219 284 146 172 253 188 269 83 208 217 155 238 45 158 101 308
7699 308 150 157 102 216 245 157 173 145 175 33 128 130 42 151 81 78 158 163 66 16 -89 9 33 -15 105 132 32 55
7727 55 7 -15 -119 25 -81 -79 -21 -17 -163 43 59 -66 -61 -75 -80 -146 -114 30 -86 167 -90 -22 -109 -133 -131 -112 -115 -122 -55
7756 -55 -275 -81 -89 -39 -116 -146 -150 -233 -129 -127 -145 -90 -135 -161 -366 -199 -168 -143 -232 -195 -230 -162 -219 -333 -354 -126 -242 -323
7784 -323 -109 -252 -314 -278 -179 -101 -340 -254 -162 -228 -262 -325 -334 -463 -299 -215 -202 -328 -275 -339 -285 -330 -206 -301 -286 -102
$$ packed form
7591i3l9jJ52j28oQ2q8J25j37J5l7K1j7R8J34q3j81K07j00L6Lok5R6O5K1q9O8
7619I3k4r9Ll3J26K8k4k4L4N6j7M2j24J61p5J07K0r6j04K41j31L5M6j02m2J01
7645A98J5o3N6J3L2p3O1j61J77p8k8P6Kl9K02j92J16q9J19j47pJO5k5J36n3j2
7672C02j34pq6J74Lk0J0P0N5k14M1K5O5j38K6Q1o5Q1j86J25Ro2Q3j93J13n7K07
7699C08j58Pn5J14K9q8J6k8L0j42R5Kq8J09p0lQ0Nr7n0j05R8K4m8J20K7j00K3
7727E5m8k2j04J44j06KN8Mj46K06J6j25Nj4no6L2J44j16K53k57O8q7k4KJ9lpO7
7756e5k20J94qN0p7l0mq3J04Kj8N5m5k6k05J67L1K5q9L7l5O8n7j14k1K28j16q1
7784c23K14j43o2L6R9P8k39Q6R2o6l4o3rj29J64Q4J3j26N3o4N4m5J24r5J5J84
$$ plain form
7810 -102 -305 -206 -159 -164 -160 -242 -234 -214 -325 -149 -13 -88 -170 -90 -49 -107 -102 -51 -200 -91 -135 -52 -101 -79 91 -51 -49 10
7838 10 -70 -7 18 81 -54 -16 187 227 50 153 52 23 74 103 188 175 133 190 238 155 105 235 83 65 209 101
7864 101 138 183 125 224 89 103 76 154 100 170 -19 177 279 253 224 76 190 133 17 -43 97 187 241 239 155 145
7890 145 92 58 91 294 165 60 133 188 144 -29 119 92 -53 11 39 159 80 24 175 78 -40 -37 68 -82 -53
7915 -53 135 -21 -79 -38 -84 136 39 -52 -81 -45 -115 -76 -219 -83 -85 -41 -68 25 -100 -157 -290 -183 -95 -200 -158 -61
7941 -61 -65 -29 -11 -28 32 15 -22 10 -61 -12 -38 43 104 94 -17 44 -42 -112 -97 -158 -123 -53 31 -48 67 43 -55 -68 -36 -12
7971 -12 -29 125 -41 53 113 56 -22 -58 -99 4 -22 10 26 75 91 67 218 150 132 60 -43 -119 49 57 186 125 192
7998 192 141 128 94 40 29 215 98 76 153 278 268 132 160 36 127 93 111 229 136 180 161 230 56 114 0 54
$$ packed form
7810a02k03R9M7nMq2QK0j11J76J36p5q2Q0M1n8NN1j49J09m4Q3m9K2J70j42KN9
7838A0q0O3K5O3j35L8K03M0j77J03j01k9N1K9Q5j3m2N7M8q3n0J30j52j8J44j08
7864A01L7M5n8R9j35J4k7P8n4P0j89J96J02k6k9j48J14n7j16o0J40R0N4kq4j0
7890A45n3l4L3K03j29j05P3N5m4j73J48k7j45O4K8J20p9n6J51r7j18LJ05j50K9
7915e3J88j56n8M1m6K20r7r1k9L6p0L9j43J36kM4k7R3j25n7j33J07Q8j05M2R7
7941f1mL6J8j7O0j7l7L2p1M9k6Q1O1j0j11O1q6p0J5o1L5P0Q4p9J15k4r8j3L2K4
7971a2j7J54j66R4O0n7p8l6m1J03k6L2J6M9J6k4J51o8j8p2j03p6J68QJ29o1O7
7998A92n1j3l4n4j1J86j17k2P7J25j0j36K8j24R1l4J8J18r3M4j9O9j74N8j14N4
$$ plain form
8024 54 81 -14 197 60 204 169 111 123 110 31 -48 77 -35 180 90 159 52 -1 -36 -111 -102 -49 -141 -67 28 71 112
8051 112 -139 117 -15 -90 -35 -53 -97 -207 -23 -56 -186 -91 35 -123 -47 -169 -157 -193 -67 -63 86 -49 -48 -156
8075 -156 -36 -175 -169 -147 -176 -53 -52 -51 -152 -158 -127 -145 -183 -185 -107 -175 -227 -118 -137 -106 9 -289 -214 -188 -242 -169 -213 -175 -148
8104 -148 -189 30 -217 -282 -74 -223 -239 -144 -167 -102 -63 -89 10 26 -120 -165 -146 -177 -127 -140 -130 58 -12 -65 -78 -109 -4
8131 -4 61 -99 -178 -102 -18 -116 41 -80 -78 -38 56 -158 -179 -206 -88 -181 33 11 -89 -55 -56 -180 -104 -96 -231 -79 -52
8158 -52 -81 -70 7 -14 -164 -131 -134 -72 -153 -70 14 14 -71 42 136 15 -111 -74 52 -85 25 -6 -6 188 76 -60 62
8185 62 -92 75 -9 34 -73 42
$$ packed form
8024E4K7r5K11j37J44l5n8J2j3p9p9J25j12K15r0O9j07n3l5p5RN3r2P4R5M3M1
8051A12k51K56j32p5N5j8m4j10J84l3j30R5J26j58P6j22J2l6J26MJ49j35Jj08
8075a56J20j39OK2k9J23JJj01oL1j8l8kP8o8n2J09j9L1J15k98P5K6n4P3m4L8K7
8104a48m1K19k47o5K08j49j6R5k3O5L9k6R9J6j46m5J9l1N0j3J0J88p0n3j3l1J05
8131dO5j60p9P6Q4r8J57j21KM0R4k14k1k7J18r3K14k2j00L4jj24P6Qj35J52K7
8158e2k9J1P7k1j50L3lO2q1Q3Q4%q5J13R4j21j26L7J26j37J10l1%J94j12j36J22
8185F2j54J67q4M3j07J15
8191D2
$$ Imaginary data points
##PAGE= N=2
##DATA TABLE= (X++(I..I)), XYDATA
$$ plain form
0 0 0 0 0 0 0 0 0 0 0 0 0 0 0 0 0 -1 4 -6 8 -8 8 -8 11 -12 14 -16 19 -21 24 -26 31 -33 38 -42 48 -52 59 -64 72
39 72 -80 90 -100 109 -121 133 -149 164 -184 205 -231 261 -297 339 -395 464 -563 706 -931 1354
59 1354 -2410 9928 13161 -10633 -15305 -6327 15613 36016 56564 69762 70206 55035 35320 15979
73 15979 1994 -2635 8081 28212 50190 67827 78234 75766 60399 38558 19457 7128 4687
86 4687 14101 33643 55333 71611 77832 72805 56873 35468 15051 2846 2331 12857 30798
99 30798 51060 65719 69460 61309 44103 21760 754 -11194 -10329 672 17408 35922 49322
112 49322 50902 39411 20453 -1600 -21505 -33297 -31817 -19636 -2513 14368 26010 26477 13962
125 13962 -5523 -26137 -44269 -53808 -50559 -36142 -17900 -1818 9145 9646 -1595 -20423 -39639
$$ packed form
0@%%%%%%%%%%%%%%%jNj0J4j6J6j6J9k3K6l0L5m0M5n0N7o4P1q0R0j00J11j23J36
39G2j52J70j90K09k30K54k82L13l48L89m36M92n58O36p34Q59j027J269j637K285
59A354l764J2338L233k3794m672Q978K1940K0403K0548J3198M44j5171j9715j9341
73A5979j3985m629J0716K0131K1978J7637J0407k468j5367k1841j9101j2329k441
86D687R414J9542K1690J6278O221n027j5932k1405k0417j2205n15J0526J7941
99C0798K0262J4659L741q151j7206k2343k1006j1948Q65J1001J6736J8514J3400
112D9322J580j1491j8958k2053j9905j1792J480J2181J7123J6881J1642M67j2515
125A3962j9485k0614j8132r539L249J4417J8242J6082J0963N01j1241j8828j9216
$$ plain form
138 -39639 -53915 -59496 -53991 -38169 -18171 -971 9317 9958 -295 -17381 -34749 -46019 -48498
151 -48498 -40641 -23302 -2456 15668 25448 25082 15202 -862 -17289 -27674 -27767 -17557 351 20930
165 20930 38499 47302 45223 34110 18000 2037 -7583 -6580 4761 22213 41589 57578 64945
178 64945 60245 47024 30572 15306 5958 6718 18133 35621 53119 66341 71136 64734 50117
191 50117 32614 17672 8892 10174 21366 37954 53833 64409 66988 59443 43551 25415 11171
204 11171 3858 5564 16119 32210 47330 56261 56345 47458 31450 13279 -996 -7455 -4752 6217
218 6217 21791 35905 43442 41885 31240 14817 -3599 -17914 -23388 -19233 -8265 6023 19357
231 19357 25789 22358 9992 -7024 -24758 -38124 -42951 -38218 -26428 -12472 -569 4462 54
$$ packed form
138c9639j4276n581N505J5822J9998J7200J0288O41j0253j7086j7368j1270k479
151d8498P857J7339K0846J8124R780l66r880j6064j6427j0385r3J0210J7908K0579
165B0930J7569Q803k079j1113j6110j5963r620J003J1341J7452J9376J5989P367
178F4945m700j3221j6452j5266r348P60J1415J7488J7498J3222M795o402j4617
191E0117j7503j4942q780J282J1192J6588J5879J0576K579p545j5892j8136j4244
204A1171p313J706J0555J6091J5120Q931Q4q887j6008j8171j4275o459K703J0969
218F217J5574J4114P537j557j0645j6423j8416j4315n474M155J0968J4288J3334
231A9357O432l431j2366j7016j7734j3366m827M733J1790J3956J1903N031m408
$$ plain form
244 54 -12950 -30012 -46301 -58010 -61471 -55274 -42365 -28266 -17363 -12875 -17118 -29589 -45937
257 -45937 -60455 -69501 -70496 -62573 -48705 -33516 -22404 -17910 -22120 -33791 -48757 -61793 -68139
270 -68139 -66898 -57585 -42279 -26008 -14743 -11173 -15444 -26354 -40419 -52374 -57531 -54023 -43151
283 -43151 -27376 -11408 -299 2663 -2651 -13888 -27448 -38675 -42727 -38017 -26160 -10608 4272
296 4272 14426 16335 9557 -2417 -15256 -25553 -29150 -23824 -11402 3516 17116 25537 26061 18515
310 18515 5934 -6981 -16312 -18829 -13235 -838 13824 26150 32995 32285 24099 10836 -1964
323 -1964 -10047 -11744 -5674 6423 20972 32895 38293 36300 27155 13971 983 -6848 -7361 -633
337 -633 11819 25869 36969 41013 37700 27729 14166 1220 -6148 -5968 1594 13666 27027 37032
$$ packed form
244E4j3004j7062j6289j1709l461O197J2909J4099J0903M488m243j2471j6348
257d5937j4518r046r95P923J3868J5189J1112M494m210j1671j4966j3036o346
270f8139J241R313J5306J6271J1265L570m271j0910j4065j1955n157L508J0872
283d3151J5775J5968J1109K962n314j1237j3560j1227m052M710J1857J5552J4880
296D272J0154J909o778j1974j2839j0297l597N326J2422J4918J3600Q421N24p546
310A8515j2581j2915r331k517N594J2397J4662J2326O845p10q186j3263j2800
323a964q083j697O070J2097J4549J1923N398j993r145j3184j2988p831n13O728
337f33J2452J4050J1100M044l313r971j3563j2946p368J80P562J2072J3361J0005
$$ plain form
351 37032 40041 35103 24005 10160 -2072 -8904 -8107 18 11926 24317 33092 34937 28815 17066
365 17066 3456 -7905 -13897 -12279 -3595 8618 20249 27817 28724 22163 10198 -3078 -13350
378 -13350 -18002 -15377 -6179 6357 17963 24786 24843 17927 5762 -7132 -16528 -19850 -16264 -6530
392 -6530 6457 17921 24147 23123 15555 3410 -9108 -18105 -20365 -15291 -4995 7930 18933
405 18933 24426 22310 13945 1836 -10264 -18527 -19706 -13781 -2981 9521 19831 24321 21210 12146
419 12146 50 -11233 -18458 -19012 -12467 -1071 10762 19976 23337 19575 9957 -2157 -12944 -19238
433 -19238 -18817 -11652 -418 11087 19272 21742 17365 7091 -5394 -15559 -20819 -19665 -12217 -602
447 -602 10908 18336 19537 14186 3642 -8729 -18930 -23381 -21142 -13009 -1554 9716 16274 16397
$$ packed form
351C7032L009m938j1098j3845j2232o832P97Q125J1908J2391Q775J845o122j1749
365A7066j3610j1361n992J618Q684J2213J1631P568R07o561j1965j3276j0272
378a3350m652K625R198J2536J1606O823N7o916j2165j2894r396l322L586R734
392f530J2987J1464O226j024p568j2145j2518q997k260N074J0296J2925J1003
405A8933N493k116q365j2109j2100q263j179N925J0800J2502J0310M490l111r064
419A2146j2096j1283p225n54O545J1396J1833R214L361l762r618j2114j0787o294
433a9238M21P165J1234J1505Q185K470m377j0274j2485j0165n260J154P448J1615
447f02J1510P428J201n351j0544j2371j0201m451K239Q133J1455J1270O558J23
$$ plain form
461 16397 10086 -676 -13044 -22957 -26680 -23600 -15032 -3845 6696 12638 11607 4357 -6955 -18684
475 -18684 -27782 -30863 -26989 -17876 -6757 2796 7534 5804 -2152 -13396 -24531 -32506 -34477 -29591
489 -29591 -19926 -8807 96 4271 2052 -6042 -17111 -27693 -34189 -34953 -29152 -19030 -7486 1149
503 1149 4620 2023 -6294 -17355 -27321 -32936 -32513 -25992 -15260 -3679 4689 7413 3899 -4740 -15634
518 -15634 -25329 -30104 -28410 -21225 -10323 1037 8776 10815 6496 -2239 -12779 -21598 -25368 -22706
532 -22706 -14347 -3313 7640 15087 16493 11838 2953 -6591 -13991 -16572 -12745 -3578 7857 18512
546 18512 25260 26435 21460 12628 3633 -2847 -4425 315 9939 21748 31856 37692 37981 32534 23031
561 23031 13756 7651 6808 11708 21162 32360 41742 46497 44979 38230 28270 18563 12152 11285 16290
$$ packed form
461A6397o311j0762j2368r913l723L080Q568J1187J0541N942j031p250j1312j1729
475a8684r098l081L874R113J1119R553M738j730p956j1244j1135p975j971M886
489b9591R665J1119Q903M175k219q094j1069j0582o496p64N801J0122J1544Q635
503A149L471k597q317j1061r966n615M23O521J0732J1581Q368K724l514q639j0894
518a5634r695m775J694P185J0902J1360P739K039m319q735j0540q819l770K662
532b2706Q359J1034J0953P447J406m655q885r544p400k581L827R167J1435J0655
546A8512O748J175m975q832q995o480j578M740R624J1809J0108N836K89n447r503
561B3031r275o105q43M900R454J1198R382M755j518o749r960r707o411q67N005
$$ plain form
576 16290 25408 35961 43953 46903 44034 35960 25385 15181 8681 8128 13376 21875 31105 37881
590 37881 39465 35043 26046 14983 5021 -941 -1254 3749 12032 20454 25974 26504 21029 11264 144
605 144 -9548 -14941 -14828 -9285 -929 6782 11443 11010 5039 -4956 -16285 -25332 -29859 -28853 -22982 -14336
621 -14336 -6649 -2407 -3458 -9662 -19895 -30983 -39165 -42846 -40994 -34377 -25423 -17582 -13727 -15462
635 -15462 -22053 -32050 -42429 -49972 -52395 -49319 -41895 -32913 -25025 -21577 -23702 -30316 -39752 -49072 -55462
650 -55462 -56480 -51773 -43518 -34077 -26119 -22526 -24331 -30959 -39409 -47213 -51701 -50900 -44946 -35304 -25054
665 -25054 -16968 -12858 -14267 -20095 -27650 -34086 -36939 -34662 -27158 -16291 -5401 2935 6728 5527
679 5527 57 -7221 -13052 -14670 -11496 -3371 7617 18673 26497 29516 27448 21427 13900 8143 6773
$$ packed form
576A6290R118J0553P992K950k869q074j0575j0204o500n53N248Q499R230O776
590C7881J584m422q997j1063r962n962l13N003Q283Q422N520N30n475r765j1120
605A44r692n393J13N543Q356P711M661m33n971r995j1329r047m527J006N871Q646
621a4336P687M242j051o204j0233j1088q182l681J852O617Q954P841L855j735
635a5462o591r997j0379p543k423L076P424Q982P888L448k125o614r436r320o390
650e5462j018M707Q255R441P958L593j805o628q450p804m488Q01N954R642J0250
665b5054Q086M110j409n828p555o436k853K277P504J0867J0890Q336L793j201
679E527n470p278n831j618L174Q125J0988J1056P824L019k068o021p527n757j370
$$ plain form
694 6773 10369 18431 28961 39151 45876 47517 43956 37170 29314 23347 21857 25569 33474 43211 52004
709 52004 57362 57372 52752 45088 36658 30873 29425 33049 40511 49507 56965 61205 59896 53879 45230
724 45230 36740 31008 29336 32741 40051 48318 54882 57339 54898 47807 38337 29383 23279 21719 25328
739 25328 32206 39911 45313 46636 42894 35076 24686 15278 9582 8182 11588 18208 25386 30146 30122
754 30122 25263 16693 6113 -3186 -8801 -9515 -5629 712 7081 11039 10368 4756 -4329 -14662 -23401
769 -23401 -28318 -28259 -23876 -17214 -11015 -7454 -8497 -14358 -23376 -33167 -40813 -44608 -43256 -37868 -30483
784 -30483 -23914 -20262 -21094 -26843 -35245 -44011 -50304 -52452 -49847 -43111 -34506 -27221 -23436 -24157 -29026
799 -29026 -36800 -44683 -49729 -50479 -46394 -38587 -29405 -21631 -17559 -18294 -23238 -30440 -37754 -41708 -41178 -36231
$$ packed form
694F773L596Q062J0530J0190O725J641l561o786p856n967j490L712P905R737Q793
709E2004N358J0m620p664q430n785j448L624P462Q996P458M240j309o017q649
724D5230q490n732j672L405P310Q267O564K457k441p091r470q954o104j560L609
739B5328O878P705N402J323l742p818j0390r408n696j400L406O620P178M760k4
754C0122m859q570j0580r299n615p14L886O341O369L958o71n612r085j0333q739
769b3401m917N9M383O662O199L561j043n861r018r791p646l795J352N388P385
784c0483O569L652q32n749q402q766o293k148K605O736Q605P285L785p21m869
799b9026p774p883n046p50M085P807R182P774M072p35m944p202p314l954N30M947
$$ plain form
815 -36231 -27679 -18350 -10838 -7206 -8490 -13566 -20787 -27196 -30481 -29316 -23589 -14923 -5723 1312 4234
830 4234 2520 -3071 -10095 -16118 -18823 -16955 -10654 -1888 6754 13192 15591 13252 7181 93 -5606
845 -5606 -7923 -5690 770 9560 18074 23680 25055 21870 15400 7767 2135 -36 2452 8797 17461
860 17461 25241 29897 30117 26268 18900 10929 5194 3324 6063 12237 20321 27375 31137 30240 25101
875 25101 17194 9184 3525 1860 4773 10992 18419 24825 27520 25585 19653 11543 3646 -1772 -3022
890 -3022 260 6492 13608 19126 21116 18750 12153 3828 -3950 -8771 -9416 -5714 836 7902 13087
905 13087 14445 11732 4945 -3198 -10593 -14956 -14858 -10647 -3519 3592 8532 9800 6628 -147 -8304
920 -8304 -15191 -18440 -17765 -12700 -5567 1959 6767 7557 3804 -2978 -10618 -17023 -19489 -17847 -12316 -4910
$$ packed form
815c6231Q552R329P512L632j284n076p221o409l285J165N727Q666R200P035K922
830D234j714n591p024o023k705J868O301Q766Q642O438K399k339o071p088n699
845e606k317K233O460Q790Q514N606J375l185o470p633n632k171K488O345Q664
860A7461P780M656K20l849p368p971n735j870K739O174Q084P054L762q97n139
875B5101p907q010n659j665K913O219P427O406K695j935n932q110p897n418j250
890c022L282O232P116N518J990k366o597q325p778m821o45L702O550P066N185
905A3087J358k713o787q143p395m363R8M211P128P111M940J268l172o775q157
920h304o887l249O75N065P133P526M808P90l753o782p640o405k466J642N531P406
$$ plain form
936 -4910 2173 6571 6604 2682 -4007 -11509 -17072 -18926 -16421 -10466 -3014 3741 7670 7207 3057 -3778
952 -3778 -10841 -15821 -17048 -13928 -7626 150 6573 10073 9279 4524 -2308 -9038 -13503 -14285 -10605 -3933
968 -3933 3678 9944 12897 11518 6590 -527 -7090 -11246 -11360 -7390 -591 6838 12640 14918 12910
983 12910 7504 176 -6380 -9919 -9405 -5109 1758 9004 14135 15584 12893 7062 -20 -6203 -9168
998 -9168 -8124 -3440 3435 10173 14671 15689 12279 6287 -676 -6355 -8987 -7506 -2387 4473 10918
1013 10918 15023 15266 11480 5232 -1780 -7080 -9265 -7186 -1997 4863 11058 14482 14329 10212 3454
1028 3454 -3527 -8600 -10287 -7983 -2594 4356 10275 13294 12219 7715 1033 -6026 -10795 -11881 -9072
1043 -9072 -3332 3403 8962 11386 9881 5003 -1892 -8410 -12555 -12974 -9581 -3827 2922 7999 9948
$$ packed form
936d910P083M398L3l922o689p502n563j854K505N955P452O755L929m63m150o835
952c778p063m980j227L120O302P776O423L500p94m755o832o730m465p82L680O672
968c933P611O266K953j379m928p117o563m156j14L970O799P429N802K278k008
983A2910n406p328o556l539N14M296O867P246N131J449k691n831p082o183k965
998i168J044M684O875O738M498J018l410n992o963n679k632J481N119O860O445
1013A0918M105K43l786o248p012n300k185K079N189O860O195L424j53m117o758
1028C454o981n073j687K304N389O950N919L019j075m504o682p059m769j086K809
1043i072N740O735N559K424j505m878o895o518m145m19L393N754O749N077J949
$$ plain form
1058 9948 7793 2776 -4000 -10000 -13565 -13250 -9404 -3234 3129 8042 9377 7127 1693 -4903 -10440
1073 -10440 -13572 -12829 -8376 -1934 4305 8671 9926 7194 1689 -5114 -10393 -12934 -11537 -7091 -503
1088 -503 5943 10014 10520 7398 1569 -4930 -9802 -12067 -10430 -5565 1073 7008 10587 10540 7056 947
1104 947 -5585 -10408 -11666 -9524 -4277 2022 7836 10725 9986 5888 -295 -6462 -10714 -11582 -8914 -3556
1120 -3556 2698 8109 10615 9372 4874 -1075 -7101 -11038 -11550 -8403 -2672 3700 8517 10666 9109
1135 9109 4525 -1872 -7521 -11156 -11138 -7591 -1668 4373 8933 10738 8754 3691 -2730 -8238 -11516
1150 -11516 -11036 -7184 -1502 4812 8965 9890 7495 2149 -4322 -9697 -12223 -11412 -7407 -1405 4314
1165 4314 8182 8733 5545 265 -5984 -11073 -13091 -11536 -7248 -1381 4325 7798 7753 4389 -1008 -7222
$$ packed form
1058I948k155n017o776o000l565L15L846O170O363M913J335k250n434o596n537
1073a0440l132P43M453O442O239M366J255k732n505o803n279k541J397M446O588
1088e03O446M071N06l122n829o499m872k265J637M865O638N935L579m7l484o109
1104I47o532m823j258K142N247O299N814K889p39m098o183o167m252q68K668N358
1120c556O254N411K506j243m498n949o026l937n12L147N731O372M817K149j557
1135I109m584o397n649l635J8L547N923O041M560J805j984n063o421n508l278
1150a1516M80L852N682O314M153R25k395n346o471n375k526Q11M005O002N719
1165D314L868N51l188n280o249n089k018J555M288N867N706L473m5l364n397o214
$$ plain form
1181 -7222 -11571 -13097 -11065 -6332 -269 5175 8222 7948 4342 -1290 -7040 -11317 -12252 -9973 -4656
1196 -4656 1566 6824 9440 8635 4822 -800 -6460 -10234 -10812 -7955 -2682 3563 8627 10861 9803
1211 9803 5601 -310 -5649 -9047 -9202 -5825 -275 5914 10333 12248 10506 6281 251 -4931 -7776
1226 -7776 -7538 -3835 1851 7594 11876 13240 11061 6187 436 -4676 -7094 -6256 -2355 3206 8896
1241 8896 12709 13528 10863 5784 12 -4744 -6842 -5824 -1575 4075 9439 13008 13256 10324 4979
1256 4979 -842 -5378 -7257 -5715 -1207 4518 9702 12784 12701 9096 3824 -2066 -6286 -7722 -5818
1271 -5818 -1415 4483 9423 11877 11303 7573 2099 -3758 -7514 -8347 -6048 -1359 4312 8924 10942
1286 10942 9949 5882 297 -5090 -8547 -8981 -6068 -1152 4526 8683 10429 8836 4799 -784 -5872
$$ packed form
1181g222m349j526K032M733O063N444L047k74l606n632n750m277r35K279N317
1196d656O222N258K616q05l813n622n660l774n78K857N273O245N064K234j058
1211I803m202n911n339l398j55L377N550O189M419J915j742m225o030n182k845
1226g776K38L703N686N743M282J364k179m874n751n112k418Q38L901N561N690
1241H896L813Q19k665n079n772m756k098J018M249N650N364L569K48k932n345
1256D979n821m536j879J542M508N725N184L082q3l605n272n890m220j436J904
1271e818M403N898M940K454n74l730n474n857l756q33K299M689N671M612K018
1286A0942r93m067n585n387l457m34K913M916N678M157J746j593m037n583n088
$$ plain form
1301 -5872 -8870 -8798 -5585 -577 4944 9183 10572 8694 4361 -1068 -6027 -8549 -8147 -4682 593 6132
1317 6132 9951 11087 8935 4399 -1301 -5856 -8026 -7371 -3604 2014 7152 10790 11434 8870 3983
1332 3983 -1551 -5804 -7709 -6245 -2431 3269 8118 11294 11420 8674 3581 -1960 -5930 -6998 -5517
1347 -5517 -1395 4021 8882 11431 10857 7735 2485 -2699 -6483 -7581 -5554 -1038 3937 8413 10657
1362 10657 9588 5924 682 -4604 -8331 -9118 -6778 -2361 2699 6829 8558 7208 3049 -2262 -7414
1377 -7414 -10684 -11103 -8603 -3945 1128 4792 6145 4554 276 -5173 -9944 -12885 -12963 -10018 -5096 -144
1393 -144 3369 4258 2273 -2045 -7359 -11790 -14204 -13701 -10175 -5391 -547 2667 3139 938 -3514 -8468
1409 -8468 -12812 -14775 -13411 -9945 -4892 -98 2828 3133 364 -4038 -8903 -12728 -14259 -12771 -8935
$$ packed form
1301e872k998P2L213N008N521M239J389j878m333n429m959k522M02L465N275N539
1317F132L819J136k152m536n700m555k170O55L767N618N138L638O44k564m887
1332C983n534m253j905J464L814N700M849L176J26k746n093n541l970j068J481
1347e517M122N416M861K549n74l122n250n184l784j098K027M516M975M476K244
1362A0657j069l664n242n286l727p87K340M417N060M130J729j350m159n311n152
1377g414l270m19K500M658N073L664J353j591m278n449m771k941p8K945M922M952
1393a44L513Q89j985m318n314m431k414N03L526M784M844L214M72k201m452m954
1409h468m344j963J364L466N053M794K926L05k769m402m865l825j531J488L836
$$ plain form
1424 -8935 -3775 887 3596 3602 794 -3857 -8669 -12067 -13262 -11400 -7141 -1963 2380 4862 4625 1524
1440 1524 -3062 -7815 -11023 -11539 -9399 -4972 55 4357 6426 5691 2563 -2204 -6664 -9449 -9530 -7018
1456 -7018 -2545 2366 6382 7910 7062 3318 -1375 -5674 -7732 -7633 -4758 -111 4745 8386 9590 8187
1472 8187 4284 -265 -4473 -6607 -6010 -3037 1631 6335 9478 10473 8504 4513 -251 -4173 -6078
1487 -6078 -5419 -2122 2485 6897 10021 10237 7972 3770 -865 -4726 -6341 -5243 -1798 2756 7132
1502 7132 9575 9832 7328 2826 -1627 -5247 -6241 -5025 -1259 3359 7499 9692 9308 6619 2326 -2248
1518 -2248 -5273 -5954 -4097 -298 4351 8212 10017 9206 6302 1882 -2505 -5347 -5801 -3603 240 4747
1534 4747 8568 10045 8734 5667 1139 -3221 -5834 -5981 -3590 334 4930 8458 9572 8249 4845
$$ packed form
1424h935N160M662K709Ok808m651m812l398j195J862M259N178M343K482k37l101
1440A524m586m753l208n16K140M427N027M302K069p35l128m767m460k785q1K512
1456g018M473M911M016J528q48l744m693m299k058R9K875M647M856L641J204j403
1472H187l903m549m208k134N97K973M668M704L143R95j969l991m764l922j905
1487f078O59L297M607M412L124K16k265m202m635l861j615J098L445M554M376
1502G132K443K57k504m502m453l620r94J216L766M618M140K193l84k689m293m574
1518b248l025o81J857L799M649L861J805q11k904m420m387k842m54K198L843M507
1534D747L821J477j311l067m528m360k613j47K391L924M596L528J114j323l404
$$ plain form
1549 4845 225 -3888 -6115 -5952 -3396 1064 5489 8484 9572 7861 4132 -145 -4096 -5921 -5314
1564 -5314 -2383 1920 6339 9112 9650 7628 3809 -521 -4120 -5557 -4574 -1362 2882 7155 9536
1579 9536 9530 7326 3520 -867 -4248 -5367 -4109 -1025 3382 7219 9524 9275 6821 2595 -1636 -4926
1595 -4926 -5766 -4335 -811 3548 7266 9092 8481 5785 1457 -2708 -5731 -6299 -4685 -968 3249 6672
1611 6672 8359 7494 4209 87 -3945 -6637 -6966 -4812 -1192 3050 6264 7304 6230 3069 -1273
1626 -1273 -5324 -7556 -7362 -4891 -1049 3101 6170 6973 5420 2156 -2245 -5744 -7728 -7138 -4649 -498
1642 -498 3485 6071 6592 4810 1274 -2987 -6488 -8019 -7206 -4416 -612 3361 5817 6064 3939 211
1658 211 -4090 -7331 -8773 -7778 -4680 -621 3190 5303 5295 2833 -947 -4978 -8092 -9091 -7745 -4457
$$ packed form
1549D845m620m113k227J63K556M460M425K995J088j711l729m277l951j825O07
1564e314K931M303M419K773N38k022l819m330l599j437R83L212M244M273K381
1579I536ok204l806m387l381j119J258L084M407L837K305k49k454m226m231l290
1595d926q40J431L524M359L718J826o11k696m328m165l023n68J614L717M217L423
1611F672J687q65l285m122m032k692l29K154L620M242L214J040j074l161m342
1626a273m051k232J94K471L842M150L069Q03j553l264m401l499j984N90K489M151
1642d98L983K586N21j782l536m261l501j531Q13K790L804L973K456K47k125l728
1658B11m301l241j442R95L098M059L811K113qk462l780m031l114r99J346L288
$$ plain form
1674 -4457 -297 3311 5297 5087 2440 -1371 -5188 -7991 -8612 -6828 -3309 899 4352 6013 5516 2699
1690 2699 -1234 -4956 -7326 -7450 -5582 -2036 2081 5237 6418 5410 2489 -1445 -5112 -7276 -7280 -5133
1706 -5133 -1421 2402 5281 6174 4847 1746 -2437 -5904 -7872 -7617 -5445 -1706 2068 4718 5451 3838
1722 3838 471 -3470 -6879 -8648 -8289 -5566 -1958 1774 4406 4549 2804 -707 -4957 -7915 -9249
1737 -9249 -8452 -5561 -1721 1754 3585 3693 1712 -1914 -5784 -8660 -9679 -8420 -5577 -1796 1756
1752 1756 3626 3392 973 -2819 -6371 -9045 -9685 -8225 -5062 -1080 2049 3688 3140 570 -3091 -6670
1768 -6670 -8991 -9298 -7508 -4148 -286 2842 4112 3405 874 -2790 -6266 -8526 -8352 -6447 -3052 788
1784 788 3988 4993 3991 1224 -2457 -5584 -7307 -6986 -4679 -858 2860 5564 6428 5210 2256 -1227
$$ packed form
1674d457M160L608J986k10k647l811l817k803o21J784L519M208L453J661m97k817
1690B699l933l722k370j24J868L546M117L156J181j008k921l934l667k164mK147
1706e133L712L823K879Q93j327l101m183l467j968K55K172L739L774K650P33j613
1722C838l367l941l409j769L59K723L608L732K632J43j745l511m250k958j334
1737i249P97K891L840L475J831J08j981l626l870k876j019J259K843L781L552
1752A756J870k34k419l792l552k674o40J460L163L982L129J639n48k570l661l579
1768f670k321l07J790L360L862L128J270p07k531l664l476k260J74J905L395L840
1784G88L200J005j002k767l681l127j723L21K307L821L718K704Q64j218k954l483
$$ plain form
1800 -1227 -4214 -5542 -4807 -2242 1527 5222 7730 8205 6765 3659 188 -2618 -3667 -2580 62
1815 62 3904 7303 9453 9705 7802 4756 1336 -1433 -2300 -1182 1588 5199 8625 10436 10156 8109
1831 8109 4798 1433 -1308 -1946 -624 2189 5832 8702 10382 9914 7634 4291 717 -1686 -1990 -567
1847 -567 2329 5977 8804 10065 9330 6631 3153 -90 -2213 -2511 -723 2456 5760 8338 9139 7992
1863 7992 5276 1579 -1634 -3468 -3271 -1419 1654 5077 7227 7783 6408 3395 -52 -3031 -4642
1878 -4642 -4389 -2250 767 4278 6319 6679 5035 2105 -1294 -4295 -5559 -5118 -2569 647 3897 5851
1894 5851 6002 4261 1348 -2020 -4757 -5653 -4701 -2118 1164 4217 6180 5977 4063 970 -2240 -4606
1910 -4606 -5264 -4037 -1470 1950 5106 6426 5969 3938 956 -2156 -4443 -4802 -3385 -502 2869 5433
$$ packed form
1800a227k987j328P35K565L769L695K508M75j440l106l471k806j049J087K642
1815F2L842L399K150K52j903l046l420k769q67J118K770L611L426J811k80k047
1831H109l311l365k741o38J322K813L643K870J680m68k280l343l574k403l04J423
1847e67K896L648K827J261p35k699l478l243k123k98J788L179L304K578Q01j147
1863G992k716l697l213j834J97J852L073L423K150N56j375l013l447k979j611
1878d642K53K139L017L511K041L60j644k930l399l001j264M41K549L216L250J954
1894E851J51j741k913l368k737q96R52K583L282L053J963k03j914l093l210k366
1910d606o58J227K567L420L156J320m57k031k982l112k287l59J417K883L371K564
$$ plain form
1926 5433 6570 5939 3678 484 -2719 -4626 -4853 -3234 -374 2933 5459 6555 5391 2770 -392
1941 -392 -3450 -5317 -5233 -3579 -524 2439 4759 5438 4311 1424 -1766 -4751 -6156 -5977 -4097 -1027
1957 -1027 1971 3954 4546 3054 259 -3035 -5798 -7109 -6568 -4610 -1521 1411 3408 3567 1707 -1217
1973 -1217 -4510 -7088 -8006 -7260 -5078 -1987 779 2268 2182 204 -2956 -6242 -8523 -9434 -8511 -6063
1989 -6063 -2962 -464 851 457 -1734 -4875 -7920 -10139 -10605 -9615 -6969 -3979 -1435 -160 -893 -2976
$$ packed form
1926E433J137o31k261l194l203j907k27J619K860L307K526J096j164k621l162
1941c92l058j867Q4J654L055K963K320O79j127k887l190k985j405J79J880L070
1957a027K998J983N92j492k795l294k763j311N41J958L089K932J997J59j860k924
1973a217l293k578r18P46K182L091K766J489q6j978l160l286k281r11R23K448
1989f063L101K498J315l94k191l141l045k219m66R90K646K990K544J275p33k083
$$ [...]
8191a13
##END NTUPLES=NMR FID
##END=
